##TITLE=1H_SR45_Et_k3
 CDCl3, 8 sc, 
 26.04.2021
##JCAMPDX= 6.0         $$ Bruker NMR JCAMP-DX V2.0
##DATA TYPE= NMR FID
##DATA CLASS= NTUPLES
##ORIGIN= UXNMR, Bruker Analytische Messtechnik GmbH
##OWNER= root
$$ XWIN-NMR		Version 3.5
$$ Mon Apr 26 15:31:31 2021 Russian Standard Time (UT+4h)  she@DPX200
##.OBSERVE FREQUENCY= 200.131506
##.OBSERVE NUCLEUS= ^1H
##.DELAY= (6, 6)
##.ACQUISITION MODE= SIMULTANEOUS
##.ACQUISITION SCHEME= undefined
##.AVERAGES= 8
##.DIGITISER RES= 18
##SPECTROMETER/DATA SYSTEM= spect
##.PULSE SEQUENCE= zg30
##.SOLVENT NAME= CDCl3
##.SHIFT REFERENCE= (INTERNAL, CDCl3, 0, 15.7039)
##AUDIT TRAIL= $$ (NUMBER, WHEN, WHO, WHERE, WHAT)
$$ ##TITLE= Audit trail, XWIN-NMR		Version 3.5
$$ ##JCAMPDX= 5.01
$$ ##ORIGIN= Bruker BioSpin GmbH
$$ ##OWNER= she
$$ F:/spectra/data/she/nmr/H-F/1/audita.txt
$$ ##AUDIT TRAIL=  $$ (NUMBER, WHEN, WHO, WHERE, WHAT)
(   1,<2021-04-26 15:30:25.20 +0400>,<she>,<DPX200>,
      <created by zg, POWCHK disabled, PULCHK disabled
       configuration hash MD5:
       00 E9 B6 7A A2 85 ED C7 34 08 36 98 17 FE 4E 26
       data hash MD5: 16K
       88 25 D9 A4 6C 29 30 17 98 60 0E 02 02 F7 6F 55>)
$$ ##END=
$$ 
$$ hash MD5
$$ 19 B5 60 8C 16 7E 60 86 5E D1 7F 8C C6 06 EA FD
##$RELAX= 
##$RELAX= 
##$RELAX= 
##$RELAX= 
##$RELAX= 
##$RELAX= 
$$ Bruker specific parameters
$$ --------------------------
##$DU= <F:/spectra>
##$EXPNO= 1
##$NAME= <H-F>
##$PROCNO= 1
##$TYPE= <nmr>
##$USER= <she>
##$AMP= (0..31)
100 100 100 100 100 100 100 100 100 100 100 100 100 100 100 100 100 100 
100 100 100 100 100 100 100 100 100 100 100 100 100 100 
##$AQSEQ= 0
##$AQ_mod= 1
##$AUNM= <au_zg>
##$AUTOPOS= <>
##$BF1= 200.13
##$BF2= 200.13
##$BF3= 200.13
##$BF4= 200.13
##$BF5= 200.13
##$BF6= 200.13
##$BF7= 200.13
##$BF8= 200.13
##$BYTORDA= 1
##$CFDGTYP= 0
##$CFRGTYP= 5
##$CHEMSTR= <none>
##$CNST= (0..31)
1 1 145 1 1 1 1 1 1 1 1 1 1 1 1 1 1 1 1 1 1 1 1 1 1 1 1 1 1 1 1 1 
##$CPDPRG= <>
##$CPDPRG1= <>
##$CPDPRG2= <>
##$CPDPRG3= <>
##$CPDPRG4= <mlev>
##$CPDPRG5= <mlev>
##$CPDPRG6= <mlev>
##$CPDPRG7= <mlev>
##$CPDPRG8= <mlev>
##$CPDPRGB= <>
##$CPDPRGT= <>
##$D= (0..31)
0 1.2 0 0 0 0 0 0 0 0.06 0 0.03 0 0 0 0 0.0002 0 0 0 0 0 0 0 0 0 0 0 0 
0 0 0 
##$DATE= 1619436624
##$DBL= (0..7)
120 120 120 120 120 120 120 120 
##$DBP= (0..7)
150 150 150 150 150 150 150 150 
##$DBP07= 0
##$DBPNAM0= <>
##$DBPNAM1= <>
##$DBPNAM2= <>
##$DBPNAM3= <>
##$DBPNAM4= <>
##$DBPNAM5= <>
##$DBPNAM6= <>
##$DBPNAM7= <>
##$DBPOAL= (0..7)
0.5 0.5 0.5 0.5 0.5 0.5 0.5 0.5 
##$DBPOFFS= (0..7)
0 0 0 0 0 0 0 0 
##$DE= 6
##$DECBNUC= <off>
##$DECIM= 32
##$DECNUC= <off>
##$DECSTAT= 4
##$DIGMOD= 1
##$DIGTYP= 9
##$DL= (0..7)
0 120 120 120 120 120 120 120 
##$DP= (0..7)
150 150 150 150 150 150 150 150 
##$DP07= 0
##$DPNAME0= <>
##$DPNAME1= <>
##$DPNAME2= <>
##$DPNAME3= <>
##$DPNAME4= <>
##$DPNAME5= <>
##$DPNAME6= <>
##$DPNAME7= <>
##$DPOAL= (0..7)
0.5 0.5 0.5 0.5 0.5 0.5 0.5 0.5 
##$DPOFFS= (0..7)
0 0 0 0 0 0 0 0 
##$DQDMODE= 0
##$DR= 18
##$DS= 0
##$DSLIST= <SSSSSSSSSSSSSSS>
$$ [...]
##$SUBNAM2= <"">
##$SUBNAM3= <"">
##$SUBNAM4= <"">
##$SUBNAM5= <"">
##$SUBNAM6= <"">
##$SUBNAM7= <"">
##$SUBNAM8= <"">
##$SUBNAM9= <"">
##$SW= 16.9725357007746
##$SWIBOX= (0..15)
0 0 2 0 0 0 0 0 0 0 0 0 0 0 0 0 
##$SW_h= 3396.73913043478
##$TD= 16384
##$TD0= 1
##$TE= 0
##$TE2= 300
##$TE3= 300
##$TEG= 300
##$TL= (0..7)
0 120 120 120 120 120 120 120 
##$TP= (0..7)
150 150 150 150 150 150 150 150 
##$TP07= 0
##$TPNAME0= <>
##$TPNAME1= <>
##$TPNAME2= <>
##$TPNAME3= <>
##$TPNAME4= <>
##$TPNAME5= <>
##$TPNAME6= <>
##$TPNAME7= <>
##$TPOAL= (0..7)
0.5 0.5 0.5 0.5 0.5 0.5 0.5 0.5 
##$TPOFFS= (0..7)
0 0 0 0 0 0 0 0 
##$TUNHIN= 0
##$TUNHOUT= 0
##$TUNXOUT= 0
##$USERA1= <user>
##$USERA2= <user>
##$USERA3= <user>
##$USERA4= <user>
##$USERA5= <user>
##$V9= 5
##$VALIST= <valist>
##$VCLIST= <CCCCCCCCCCCCCCC>
##$VD= 0
##$VDLIST= <DDDDDDDDDDDDDDD>
##$VPLIST= <PPPPPPPPPPPPPPP>
##$VTLIST= <TTTTTTTTTTTTTTT>
##$WBST= 1024
##$WBSW= 4
##$XGAIN= (0..3)
0 0 0 0 
##$XL= 0
##$YL= 0
##$YMAX_a= 232755
##$YMIN_a= -217658
##$ZGOPTNS= <>
##$ZL1= 120
##$ZL2= 120
##$ZL3= 120
##$ZL4= 120
##$ABSF1= 10
##$ABSF2= 0
##$ABSG= 5
##$ABSL= 3
##$ALPHA= 0
##$AQORDER= 0
##$ASSFAC= 0
##$ASSFACI= 0
##$ASSFACX= 0
##$ASSWID= 0
##$AUNMP= <proc_1d>
##$AZFE= 0.1
##$AZFW= 0.1
##$BCFW= 1
##$BC_mod= 2
##$BYTORDP= 1
##$COROFFS= 0
##$CY= 11.3945322036743
##$DATMOD= 1
##$DC= 2
##$DFILT= <>
##$DTYPP= 0
##$F1P= 15.9154993809931
##$F2P= -4.1035820241983
##$FCOR= 0.5
##$FTSIZE= 0
##$FT_mod= 4
##$GAMMA= 1
##$GB= 0.15
##$INTBC= 1
##$INTSCL= 1
##$ISEN= 128
##$LB= 0.24
##$LEV0= 0
##$LPBIN= 0
##$MAXI= 10000
##$MC2= 0
##$MEAN= 0
##$ME_mod= 0
##$MI= 1.114404
##$NCOEF= 0
##$NC_proc= 0
##$NLEV= 6
##$NOISF1= 3.799351
##$NOISF2= 2.8
##$NSP= 1
##$NTH_PI= 0
##$NZP= 0
##$OFFSET= 15.70392
##$PC= 1
##$PHC0= -11119.59
##$PHC1= 10.80095
##$PH_mod= 1
##$PKNL= yes
##$PPARMOD= 0
##$PSCAL= 0
##$PSIGN= 0
##$REVERSE= no
##$SF= 200.130013532006
##$SI= 16384
##$SIGF1= 3
##$SIGF2= 2
##$SINO= 400
##$SIOLD= 16384
##$SREGLST= <1H.CDCl3>
##$SSB= 0
##$STSI= 0
##$STSR= 0
##$SW_p= 3612.71676300578
##$SYMM= 0
##$S_DEV= 0
##$TDeff= 0
##$TDoff= 0
##$TI= <>
##$TILT= no
##$TM1= 0
##$TM2= 0
##$TOPLEV= 0
##$USERP1= <user>
##$USERP2= <user>
##$USERP3= <user>
##$USERP4= <user>
##$USERP5= <user>
##$WDW= 1
##$XDIM= 8192
##$YMAX_p= 0
##$YMIN_p= 0
$$ End of Bruker specific parameters
$$ ---------------------------------
##NTUPLES= NMR FID
##VAR_NAME=  TIME,          FID/REAL,        FID/IMAG
##SYMBOL=    X,             R,               I
##VAR_TYPE=  INDEPENDENT,   DEPENDENT,       DEPENDENT
##VAR_FORM=  AFFN,          ASDF,            ASDF
##VAR_DIM=   8192,          8192,            8192
##UNITS=     SECONDS,       ARBITRARY UNITS, ARBITRARY UNITS
##FACTOR=    0.0002944,     1,               1
##FIRST=     0,             0,               0
##LAST=      2.4114304,     0,               0
##MIN=       0,             -217658,         0
##MAX=       2.4114304,     232755,          0
$$ Real data points
##PAGE= N=1
##DATA TABLE= (X++(R..R)), XYDATA
$$ plain form
0 0 0 0 0 0 0 0 0 0 0 0 0 1 -8 8 -8 11 -16 16 -24 24 -32 36 -43 49 -59 68 -80 91 -105 121 -139 156 -178 202
34 202 -226 253 -284 318 -353 395 -439 487 -539 596 -658 727 -802 884 -973 1070 -1180 1302
52 1302 -1435 1585 -1750 1943 -2158 2409 -2703 3056 -3479 4006 -4678 5566 -6800 8632 -11613
67 -11613 17252 -31504 139496 222016 -74802 42850 -156116 -30137 206038 -100873 -72990
78 -72990 -14534 -86845 232755 72580 -112935 43213 -106536 23375 111819 -160394 27417
89 27417 51834 -39013 147682 -62296 -76957 120420 -80450 -3748 6961 -126595 136544
100 136544 66732 -73573 43849 -99067 30528 138401 -118927 -41073 -31076 -37279 194571
111 194571 -4239 -110624 17035 -70650 92956 82542 -160359 -15078 23 19118 153432
$$ packed form
0@%%%%%%%%%%%JrJ6j6J9k7L2m0M8n6O8p9R2j08J27j48J71j96K26k60K95l34L80
34B02m28M79n37O02o71P48q34R26j026J135j254J385j529J686j857K043k250K482
52A302k737L020l335L693m101M567n112N759o535P485q684J0244j2366J5432k0245
67a1613K8865m8756J71000Q2520k96818J17652j98966J25979K36175l06911K7883
78g2990N8456p2311L19600j60175j85515J56148j49749J29911Q8444k72213J87811
89B7417K4417r0847J86695k09978j4661J97377k00870P6702J0709j33556K63139
100A36544o9812j40305J17422j42916J29595J07873k57328P7854R997o203K31850
111A94571j98810j06385J27659q7685J63606j0414k42901J45281J5101J9095J34314
$$ plain form
122 153432 -78368 -84864 39852 -45980 78685 6877 -122666 55170 7244 9303 77674
133 77674 -93433 -3768 48604 -67541 43016 -15745 -41620 95878 -33451 -26703 42032
144 42032 -50717 54239 15242 -93506 32788 4673 22769 74549 -81745 -25756 42245
155 42245 -12222 62802 -33527 -83196 55301 15218 34500 31849 -93764 6152 41184 -11515
167 -11515 42457 -48076 -40779 63160 -4495 18446 6924 -63581 31380 11308 -23105 33057
179 33057 -33332 -1634 38679 -36094 15807 8349 -32479 28987 -22777 -21595 39724 -14760
191 -14760 7675 4408 -44450 25844 13718 -16890 11566 -37897 -3216 41610 -10772 4671
203 4671 -15191 -31406 34726 6372 -12175 4604 -31394 12599 29682 -14882 5737 -13782
$$ packed form
122A53432k31800o496J24716q5832J24665p1808j29543J77836m7926K059O8371
133G7674j71107Q9665N2372j16145J10557n8761k5875J37498j29329O748O8735
144D2032r2749J04956l8997j08748J26294k8115J8096N1780j56294N5989O8001
155D2245n4467P5024r6329m9669J38497m0083J9282k651j25613R9916L5032n2699
167a1515N3972r0533P297J03939o7655K2941j1522p0505R4961k0072l4413N6162
179C3057o6389L1698M0313p4773N1901p458m0828O1466n1764J182O1319n4484
191a4760K2435l267m8858P0294j2126l0608K8456m9463L4681M4826n2382J5443
203D671j9862j6215O6132k8354j8547J6779l5998M3993J7083m4564K0619j9519
$$ plain form
215 -13782 -15540 28431 -4398 -4631 7649 -19151 13878 11412 -12182 12990 -8658 -7068 15721
228 15721 -9409 7246 10333 -13363 8553 50 -4181 16951 -7062 -5585 6425 -6501 13050
241 13050 7321 -11382 3156 -3660 1695 13418 -7477 -3723 1113 -3803 11269 1371 -8257 1623
255 1623 -5019 2302 6811 -7129 -1263 -932 -3855 5966 -1659 -4460 340 -5222 683 2406 -3885
270 -3885 -72 -2692 -3570 2140 -1394 -1303 -634 -4350 -79 805 -1309 620 -2291 -2312 1128 -538 376
287 376 18 -1777 75 1042 544 793 -538 -202 931 1198 1278 742 337 1040 1156 1567 1072 1126 978 986
307 986 1341 1601 995 961 1263 904 1312 1431 917 1092 963 721 803 599 797 742 111 737 497 -620 641
328 641 -188 -542 799 -1316 -486 271 -1623 457 -910 -2156 753 -1480 -1279 686 -2955 -468 -84
$$ packed form
215a3782j758M3971l2829k33J2280k6800L3029k466k3594K5172k1648J590K2789
228A5721k5130J6655L087k3696K1916q503m231K1132k4013J477J2010j2926J9551
241A3050n729j8703J4538o816N355J1723k0895L754M836m916J5072r898r628R880
255A623o642P321M509j3940N866L31k923R821p625k801M800n562N905J723o291
270c885L813k620q78N710l534R1O69l716M271Q84k114J929k911k1L440j666R14
287C76l58j795J852R67m98K49j331L36J133K67Q0n36m05P03J16M11m95N4j48Q
307I86L55K60o06l4L02l59M08J19n14J75j29k42Q2k04J98n5o31O26k40j117J261
328F41q29l54J341k115Q30P57j894K080j367j246K909k233K01J965l641K487L84
$$ plain form
345 -84 -2993 757 -2006 -2452 1523 -3086 -587 912 -4083 2041 -518 -4669 2595 -2223 -812 3500
361 3500 -5215 251 2052 -2506 4917 -2350 -4401 5381 -1998 2016 3392 -7413 3875 2796 -2260
376 -2260 6662 -5016 -2011 8337 -3768 3972 2282 -7635 8629 603 -3625 8196 -5953 2186
390 2186 7492 -8940 5700 2409 -4786 10339 -7014 -3903 10785 -5637 4971 909 -13698
403 -13698 10692 2730 -3649 6946 -14871 407 13848 -7573 4419 -6395 -12862 16897 -785
416 -785 -5320 3051 -17019 7966 11404 -12541 5033 -8991 -6802 18459 -10488 -3869 5626 -14095
430 -14095 13072 1610 -15610 12945 -6625 -2341 11832 -19205 6689 11480 -12781 10025
442 10025 -10150 -8187 24948 -8315 -3671 2503 -17911 22604 10463 -17678 6009 -13726 5867
$$ packed form
345h4k909L750k763m46L975m609K499J499m995O124k559m151P264m818J411M312
361C500q715N466J801m558P423p267k051R782p379M014J376j0805J1288j079n056
376b260Q922j1678L005J0348j2105P740j690r917J6264q026m228J1821j4149Q139
390B186N306j6432J4640l291p195J5125j7353L111J4688j6422J0608m062j4607
403a3698K4390p962o379J0595k1817J5278J3441k1421J1992j0814o467K9759j7682
416g85m535Q371k0070K4985L438k3945J7574j4024K189K5261k8947O619R495j9721
430a4095K7167j1462j7220K8555j9570M284J4173l1037K5894M791k4261K2806
442A0025k0175J963L3135l3263M644O174k0414M0515j2141k8141K3687j9735J9593
$$ plain form
455 5867 28998 -17856 -4864 239 -9556 30512 -840 -20792 8688 -10594 15049 18427 -25889
468 -25889 3729 2653 -4936 24928 -15026 -11349 17591 -12392 11126 4069 -22305 20082 -662
481 -662 -12176 14001 -18162 8068 19393 -25161 3661 -1716 -6717 29860 -16476 -19321 11383
494 11383 -9973 22632 5780 -37009 7418 2054 5397 23790 -33240 -12932 17351 -4473
506 -4473 22981 -10535 -32749 20019 1463 5491 11957 -33886 5559 17387 -10739 15991 -15089
519 -15089 -13306 26617 -12045 275 8897 -19579 20592 1869 -21339 18004 -5523 4214 17158
532 17158 -29851 4423 16906 -6087 19406 -19466 -19919 29037 488 7694 -944 -35148 19836
545 19836 19487 -5399 9477 -29483 -4849 33932 -6144 3519 -9759 -24636 29547 7140 -11115
$$ packed form
455E867K3131m6854J2992N103r795M0068l1352j9952K9480j9282K5643L378m4316
468b5889K9618j076p589K9864l9954L677K8940k9983K3518p057k6374M2387k0744
481f62j1514K6177l2163K6230J1325m4554K8822n377n001L6577m6336k845L0704
494A1383k1356L2605j6852m2789M4427n364L343J8393n7030K0308L0283k1824
506d473K7454l3516k2214N2768j8556M028O466m5843L9445J1828k8126K6730l1080
519a5089J783L9923l8662J2320Q622k8476M0171j8723k3208L9343k3527R737J2944
532A7158m7009L4274J2483k2993K5493l8872m53M8956k8549P206q638l4204N4984
545A9836l49k4886J4876l8960K4634L8781m0076R663j3278j4877N4183k2407j8255
$$ plain form
558 -11115 6308 -24009 8814 21881 -18499 5917 -5677 -11631 23797 -12293 -7740 14372
570 14372 -15249 9102 1391 -21090 19467 661 -9421 8066 -22189 7380 21842 -15428
582 -15428 1495 -11375 -10037 30867 -3552 -12620 -883 -17776 21439 16540 -20714 -251 -11311
595 -11311 3025 29425 -13480 -9749 1136 -10178 23820 4098 -18580 7235 -7625 5897
607 5897 17305 -16867 2698 4451 -9444 15593 -4601 -6854 14846 -10338 977 6853 -10471
620 -10471 14810 1072 -14248 7902 -4625 6537 13922 -17801 -2560 4160 -1500 17638 -7969
633 -7969 -15776 6954 -1788 11139 5769 -20533 580 3219 1482 12895 -13292 -9863 7461
646 7461 -3162 9192 -328 -15177 5198 -802 -236 8476 -11031 -1534 4470 -7338 6874 -531
$$ packed form
558a1115J7423l0317L2823J3067m0380K4416j1594n954L5428l6090M553K2112
570A4372k9621K4351p711k2481M0557j8806j0082J7487l0255K9569J4462l7270
582a5428J6923j2870J338M0904l4419r068J1737j6893L9215m899l7254K0463j1060
595a1311J4336K6400m2905L731J0885j1314L3998j9722k2678K5815j4860J3522
607E897J1408l4172J9565J753j3895K5037k0194k253K1700k5184J1315N876j7324
620a0471K5281j3738j5320K2150j2527J1162P385l1723J5241O720n660J9138k5607
633g969p807K2730q742J2927n370k6302K1113K639j737J1413k6187L429J7324
646G461j0623J2354r520j4849K0375o000N66Q712j9507R497O004j1808J4212p405
$$ plain form
660 -531 -6512 6398 -6932 -1669 7628 -4767 3390 -1459 -9046 7764 2185 -942 3375 -10105
674 -10105 984 8372 -1113 3907 -5185 -6573 9068 2272 1386 555 -8937 3772 6572 -646 3204
689 3204 -5403 -3204 7279 393 2244 385 -5940 3844 2692 -269 4095 -3963 -1554 3612 -1426
704 -1426 3291 738 -4599 1390 -1218 383 4203 -3233 -1519 -96 -2141 3781 565 -3760 -247
719 -247 -2612 882 3228 -2918 -1540 -1947 -1329 3081 -183 -2725 -1231 -2558 1370 2199 -1763 -941
735 -941 -2125 -963 2264 9 -953 -998 -2108 1121 1545 -284 -282 -1563 -677 1529 583 723 -374 -1022
753 -1022 670 1215 1004 838 -749 -465 1190 1073 1457 405 -759 593 915 1235 732 -127 -24 529
771 529 997 986 322 -341 141 563 741 394 -38 -254 -107 315 635 9 -657 -562 -268 -184 -3 -416 -683
$$ packed form
660e31n981J2910j3330N263R297j2395Q157m849p587J6810n579l127M317j3480
674a0105J1089P388r485N020r092j388J5641o796q86q31r492J2709K800p218L850
689C204q607K199J0483o886J851j859o325R784j152k961M364q058K409N166n038
704a426M717k553n337N989k608J601L820p436J714J423k045N922l216m325L513
719b47k365L494K346o146J378m07O18M410l264k542J494j327L928Q29l962Q22
735i41j184J162L227k255r62m5j110L229M24j829Kj281Q86K206r46J40j097o48
753a022J692N45k11j66j587K84J655j17L84j052j164J352L22L20n03q59J03N53
771E29M68j1o64o63M82M22J78l47m32k16J47M22L20o26o66R5K94Q4J81m13k67
$$ plain form
792 -683 -1025 -298 -49 -603 -283 -904 -848 -155 -399 -873 -594 -1047 -443 75 -781 -602 -513 -812 -78 -467 -532
813 -532 100 -689 -318 329 -514 380 53 -304 610 -483 -156 951 -411 643 365 -444 1391 330
831 330 -72 1314 -341 817 1239 -739 1262 551 -208 2179 -194 -71 1595 -635 1333 997 -1166
848 -1166 1661 357 -294 2007 -1499 327 1560 -1630 1332 -300 -1655 2402 -673 -578 1175 -2463
864 -2463 1248 898 -2521 1515 -1180 -964 2500 -2668 -742 803 -2575 1996 -431 -3390 1972 -1139
880 -1139 -674 1961 -4522 87 1628 -2211 2113 -2588 -2710 3834 -1498 374 676 -4543 3079 1622
896 1622 -2394 2370 -3234 -164 4693 -2889 804 248 -3010 4915 -95 -2508 3260 -2358 2083
911 2083 3298 -4657 3075 1389 -1774 4500 -3453 -1074 5546 -2558 2378 100 -4725 6007 925
$$ packed form
792f83l42P27K49n54L20o21N6O93k44m74K79m53O04N18q56J79Q9k99P34l89o5
813e32O32p89L71O47q43Q94l27l57R14j093L27J107j362J054k78q09J835j061
831C30m02J386j655J158M22j978K001p11p59K387k373J23J666k230J968l36k163
848a166K827j304o51K301l506J826J233l190K962j632j355M057l075R5J753l638
864b463L711l50l419M036k695K16L464n168J926J545l378M571k427k959N362l111
880a139M65K635o483M609J541l839M324m701j22O544n332J872L02n219P622j457
896A622m016M764n604L070M857p582L693n56l258P925n010k413N768n618M441
911B083J215p955P732j686l163O274p953K379O620q104M936k278m825J0732n082
$$ plain form
926 925 -2145 2484 -5126 2256 6002 -4141 972 -2124 -2867 7966 -2009 -3206 1292 -4836 5109
941 5109 3062 -6583 1573 -2459 -504 6388 -5802 -1811 2325 -4062 4681 -1225 -5957 4621 -2538
956 -2538 -900 3200 -6851 2889 3389 -5074 2793 -3547 -1643 7558 -4829 -1938 1103 -4237 7511
971 7511 679 -7291 2738 -2372 3399 6703 -8280 -661 1659 -942 8568 -3502 -6301 4945
985 4945 -1252 4932 3061 -8767 2989 2415 -894 6243 -5861 -1844 6271 -3331 3569 381 -5376
1000 -5376 6628 -1056 -2819 4560 -4247 2856 3738 -7354 2763 1105 -1086 6297 -6304 -3703
1014 -3703 5252 -1855 4693 -1662 -8976 5056 1776 324 3161 -9806 -263 6324 -1841 3161
1028 3161 -5495 -6739 7236 -301 58 513 -8376 3349 3939 -3576 2999 -4566 -2198 6322 -3904
$$ packed form
926I25l070M629p610P382L746j0143N113l096p43J0833r975j197M498o128R945
941E109k047r645Q156m032J955O892j2190L991M136o387Q743n906m732J0578p159
956b538J638M100j0051R740N00q463P867o340J904R201j2387K891L041n340J1748
971G511o832p970J0029n110N771L304j4983P619K320k601R510j2070k799J1246
985D945o197O184j871j1828J1756n74l309P137j2104M017Q115r602O900l188n757
1000e376J2004p684j763P379q807P103Q82j1092J0117j658k191P383j2601K601
1014c703Q955p107O548o355p314J4032l280j452K837j2967R543O587q165N002
1028C161q656j244J3975p537L59M55q889J1725N90p515O575p565K368Q520j0226
$$ plain form
1043 -3904 595 2049 -4943 4449 -795 -3871 5545 -2321 76 2376 -6267 3981 3845 -3097 2637
1058 2637 -4478 -965 8059 -1691 -187 -981 -4849 7531 3161 -3171 913 -5084 2251 7763 -3269
1073 -3269 -405 -1861 -2857 7985 313 -2873 1209 -4156 3540 4300 -4221 1456 -1501 -1728 5179
1088 5179 -2377 -492 2326 -4177 1974 284 -2769 3727 -2046 -2949 2049 -2671 2629 2258 -5367
1103 -5367 -19 -1178 -230 4679 -3616 -3507 592 -1477 4208 533 -5556 288 -636 1933 3918 -4547
1119 -4547 -2086 799 -783 4437 -635 -3607 1453 -1153 1981 2661 -3110 488 180 -1124 3416
1134 3416 -540 -886 1688 -2306 1388 2117 -1257 1680 -1149 -1484 2965 217 824 695 -3232 1409
1150 1409 1964 356 1280 -2559 -1401 2487 384 1266 -828 -3161 1230 1342 375 843 -2709 -1082
$$ packed form
1043c904M499J454o992R392n244l076R416p866K397K300q643J0248j36o942N734
1058B637p115L513R024r750J504p94l868J2380m370o332M084n997P335N512j1032
1073c269K864j456r96J0842p672l186M082n365P696P60q521N677k957k27O907
1088E179p556J885K818o503O151j690l053O496n773r03M998m720N300l71p625
1103e367N348j159R48M909q295J09M099k069N685l675o089N844r24K569J985q465
1119d547K461K885j582N220n072k972N060k606L134O80n771L598l08j304M540
1134C416l956l46K574l994L694P29l374K937k829l35M449k748O07j29l927M641
1150A409N55j608R24l839J158L888k103Q82k094k333M391J12r67M68l552J627
$$ plain form
1166 -1082 1684 8 1408 -1027 -2393 667 53 481 612 -2397 -609 120 -739 1202 -561 -1725
1182 -1725 119 -894 624 1025 -1624 -813 -779 -257 1616 -159 -978 -473 -1119 988 1361 -630 -650 -869
1200 -869 -116 1587 377 -409 -503 -648 1216 1207 -27 -18 -698 83 1658 540 403 -442 -519 672 1107 763
1220 763 140 -288 90 967 609 672 -145 -495 337 796 485 346 -578 -52 460 755 784 -239 -998 -203
1240 -203 187 399 -81 -859 -408 -237 286 -41 -449 -772 -406 -271 103 32 -515 -740 -386 -174 93 -494
1260 -494 -525 -628 -340 157 -75 -356 -593 -679 -102 79 -227 -187 -443 -467 254 188 -346 -108 -331 171 295 357
1282 357 139 -13 414 438 314 442 300 101 365 532 227 469 -18 236 534 307 324 467 -155 407 364
1303 364 96 566 -68 208 167 -23 278 397 -427 169 -62 14 392 -441 -110 -80 -413 100 36 -501 140
$$ packed form
1166a082K766j676J400k435j366L060o14M28J31l009J788P29q59J941j763j164
1182a725J844j013J518M01k649Q11L4N22J873j775q19N05o46K107L73j991k0k19
1200h69P53J703j210p86r4j45J864rj234Ro80P81J575j118j37q45p7J191M35l44
1220G63o23m28L78Q77l58O3q17l50Q32M59l11j39r24N26N12K95K9j023p59P95
1240b03L90K12m80p78M51J71N23l27m08l23L66J35L74p1n47k25L54K12K67n87
1260d94l1j03K88M97k32k81k37q6N77J81l06M0k56k4P21o6n34K38k23N02J24O2
1282C57k18j52M27K4j24J28j42j99K64J67l05K42m87K54K98k27J7J43o22N62m3
1303C64k68M70o34K76m1j90L01J19q24N96k31P6L78q33L31L0l33N13o4n37O41
$$ plain form
1324 140 -709 -191 199 -897 -169 -35 -631 445 -751 -498 199 -905 -167 -135 -808 427 -116 -723 78
1343 78 -884 -184 566 -802 109 -93 -519 806 -566 -349 445 -548 289 444 -988 720 131 9 1264
1362 1264 -418 187 1052 -461 875 172 -703 1189 191 189 1041 -954 652 1085 -764 940 8 -443
1380 -443 1787 -592 -238 576 -780 1207 519 -1280 832 -488 -248 1207 -1672 144 748 -1202
1396 -1202 926 -749 -1169 1490 -426 -126 219 -1778 887 687 -1121 532 -1363 -351 1563 -1255
1412 -1255 -280 -195 -1650 1510 71 -1305 499 -1358 417 1224 -1812 191 27 -634 1861 -588
1428 -588 -1021 1221 -923 895 662 -1591 1503 222 -420 1442 -1345 661 1953 -1011 638 -44
1444 -44 -847 2467 -119 -868 1066 -1206 1912 1452 -1892 580 -287 203 2713 -1284 -757 986 -915
$$ packed form
1324A40q49N18L90j096P28J34n96J076j196K53O97j104P38L2o73J235n43o07Q01
1343G8r62P00P50j368R11k02m26J325j372K17P94r93Q37J55j432J708n89j22J255
1362A264j682O05Q65j513J336p03q75J892r98kQ52j995J606M33j849J704r32m51
1380d43K230k379L54Q14j356J987o88j799K112j320K40J455k879J816O04j950
1396a202K128j675m20K659j916L00L45j997K665k00j808J653j895J012J914k818
1412a255R75Q5j455L160j439j376J804j857J775Q07l036K003j64o61K495k449
1428e88m33K242k144J818k33k253L094j281o42J862k787K006J292k964J649o82
1444d4q03L314k586p49J934k272L118m60l344K472q67M90K510l997N27J743j901
$$ plain form
1461 -915 1833 120 -2184 830 -393 542 1255 -2220 24 793 -1126 1360 -905 -1407 1269 -1259
1477 -1259 -220 302 -2100 1068 3 -1773 943 -977 110 1598 -2196 -233 125 -681 1598 -1307
1493 -1307 -1852 1324 -452 1095 636 -2610 454 843 63 1198 -1993 -965 2031 -389 1179 -450
1509 -450 -2238 1651 645 -63 1350 -1662 453 1568 -952 1084 -209 -854 1727 -541 271 1449
1525 1449 -1176 797 567 -1376 1406 291 112 932 -1648 191 1912 -737 542 -1005 -1218 1952
1541 1952 362 -487 -250 -2053 690 1449 -731 -249 -1337 -762 2046 -647 -436 -778 -1649 1108 360
1558 360 -1228 132 -1626 -236 1136 -1257 289 -241 -1417 667 -408 -488 933 -1173 -210 370
1574 370 -834 1206 145 -1057 314 -630 314 1157 -950 -507 126 -227 1762 -296 -955 236 -360
$$ packed form
1461i15K748j713k304L014j223R35P13l475K244P69j919K486k265n02K676k528
1477a259J039N22k402L168j065j776K716j920J087J488l794J963L58q06K279k905
1493a307n45L176j776J547m59l246L064L89p80J135l191J028K996k420J568j629
1509d50j788L889j006p08J413l012K115J115k520K036j293o45K581k268Q12J178
1525A449k625J973k30j943K782j115j79Q20k580J839J721k649J279j547k13L170
1541A952j590q49K37j803K743P59k180M82j088N75K808k693K11l42q71K757p48
1558C60j588J360j758J390J372k393J546n30j176K084j075q0J421k106R63N80
1574C70j204K040j061j202J371r44R44Q43k107M43O33l53J989k058o59J191n96
$$ plain form
1591 -360 1388 1271 -931 -64 -294 226 1781 -161 -480 415 -323 1170 951 -709 373 -95 146 877
1609 877 -353 -19 323 -691 774 364 -302 49 -961 -12 631 6 441 -431 -887 342 -68 133
1627 133 275 -1089 -365 192 -82 307 -932 -1114 264 -179 12 178 -1498 -372 320 95 349 -508
1645 -508 -675 -32 73 268 312 -815 -105 231 83 459 -282 -115 -80 -201 575 123 -207 -129 -270 406 904
1666 904 -68 83 -213 -51 582 587 412 20 -111 351 654 195 95 -283 149 754 581 -85 128 -248 453
1687 453 465 176 214 -655 -447 47 231 7 -211 -433 47 179 168 -121 -403 -187 -12 146 -51 -280 -188
1708 -188 -188 -317 -138 -21 -480 -502 -166 -106 174 -280 -440 -361 -37 30 65 -203 -476 -102 165 332 44 -373
1730 -373 -341 -321 99 323 134 43 -6 278 378 371 14 -103 130 550 501 119 34 -66 140 390 341 141 135 -170
$$ packed form
1591c60J748j17k202Q67k30N20J555j942l19Q95p38J493k19j660J082m68K41P31
1609H77j230L34L42j014J465m10o66L51j010R49O43o25M35q72m56J229m10K01
1627A33J42j364P24N57k74L89j239j82J378m43J91J66j676J126O92k25K54q57
1645e08j67O43J05J95M4j127P10L36j48L76p41J67L5j21P76m52l30P8j41O76M98
1666I04r72J51k96J62O33Nj75l92j31M62L03m59j00l78M32O05j73o66K13l76P01
1687D53J2k89L8q69K08M94J84k24k18k22M80J32j1k89k82K16J75J58j97k29R2
1708a88%j29J79J17m59k2L36O0K80m54j60P9L24O7L5k68k73L74K67J67k88m17
1730c73L2K0M20K24j89r1m9K84J00pl57j17K33M20m9l82q5j00K06K50m9k00ol05
$$ plain form
1754 -170 211 155 384 147 -17 -33 210 241 144 -97 -241 66 19 122 -164 -132 47 -111 -299 -150 24 -245
1776 -245 -220 -136 -21 -131 -350 -168 -212 -308 212 -287 -427 -409 -298 -138 -148 -109 -201 -284 -62 78 -199 -226 -87
1799 -87 14 194 89 -333 113 -201 37 205 -57 230 60 56 87 50 114 328 136 -113 170 186 289 348 -98
1822 -98 293 237 332 296 -199 26 222 113 255 4 -6 334 62 256 362 -299 288 166 -49 325 -330 -159
1844 -159 151 -124 7 181 -137 86 -76 75 341 -473 -203 326 -333 -76 -176 -491 118 -188 -332 82
1864 82 -388 -132 -35 -372 -191 -335 -59 175 -209 -334 202 -272 280 -284 -537 401 0 280 548 -194 412
1885 412 208 -360 315 -179 -116 395 -163 57 312 -289 700 399 -146 274 3 79 628 -176 154 407 -330
1906 -330 491 -51 -533 562 100 353 273 -501 95 128 -147 224 -482 -153 463 -563 -125 -35 -660 448
$$ packed form
1754a70L81n6K29k37j64j6K43L1r7k41j44L07m7J03k86L2J79j58j88J49J74k69
1776b45K5Q4J15j10k19J82m4r6N20m99j40J8J11J60j0L9r2q3K22J40k77k7J39
1799h7J01J80j05m22M46l14K38J68k62K87j70mL1l7O4K14j92k49K83J6J03N9m46
1822i8L91n6R5l6m95K25J96j09J42k51j0L40k72J94J06o61N87j22k15L74o55J71
1844a59L10k75J31J74l18K23j62J51K66q14K70N29o59K57j00l15O09l06j44M14
1864H2m70K56R7l37J81j44K76K34l84j25N36m74N52n64k53R38m01K80K68p42O06
1885D12k04n68O75m94O3N11n58K20K55o01R89l01n45M20k71P6N49q04L30K53p37
1906c30Q21n42m82J095m62K53q0p74N96L3k75L71p06L29O16j026M38R0o25J108
$$ plain form
1926 448 -136 -403 -47 -305 137 370 -602 22 -279 -316 505 -502 -389 -107 -535 423 65 -825 70 -143
1946 -143 -86 358 -601 -128 437 -520 253 -150 -576 476 -461 -65 393 -286 75 217 -307 329 -129 -13
1966 -13 851 -311 -179 437 -191 685 -2 -709 354 291 302 629 -626 -4 217 -125 457 -145 -193 468
1986 468 -137 390 226 -281 360 228 -227 385 -437 -154 509 -362 12 81 -196 314 -220 -594 410 -462
2006 -462 -359 11 -638 -20 263 -406 -6 -636 -264 94 -180 254 -390 -437 382 299 -130 -35 -464 2 535
2027 535 -344 74 -255 -94 525 19 -429 87 -286 336 114 -252 413 184 60 551 -141 162 159 -275 451
2048 451 10 7 458 158 -134 185 -265 355 316 -399 -36 -109 137 472 -114 11 233 -156 217 195 -201 161
2070 161 -231 -41 342 -323 -287 -66 -250 465 -135 -348 -69 -593 251 153 -277 8 -74 -78 4 -296 -265 -49
$$ packed form
1926D48n84k67L56k58M42K33r72O24l01l7Q21j007J13K82m28R58l58q90Q95k13
1946a43N7M44r59M73N65r57P73m03m26J052r37L96M58o79L61J42n24O36m58J16
1966a3Q64j162J32O16o28Q76o87p07J063o3J1L27j255O22K21l42N82o02m8O61
1986D68o05N27j64n07O41j32m55O12q22K83O63q71L74O9k77N10n34l74J004q72
2006d62J03L70o49O18K83o69M00o30L72L58k74M34o44m7Q19q3m29R5m29M66N33
2027E35q79M18l29J61O19n06m48N16l73O22k22l66O65k29j24M91o92L03lm34P26
2048D51m41lM51l00k92L19m50O20l9p15L63p3K46L35n86J25K22l89L73k2l96L62
2070A61l92J90L83o65L6K21j84P15o00k13K79n24Q44r8m30K85q2mQ2l00L1K16
$$ plain form
2092 -49 -595 -164 -134 -296 90 -346 -196 90 -9 255 134 -362 60 56 -90 237 -405 5 0 149 395 5
2114 5 -137 -13 240 280 372 -237 93 138 104 421 -50 144 170 180 299 325 58 71 44 246 506 64 336 174
2138 174 220 96 166 29 150 57 -92 291 -24 -80 28 -395 -195 -15 -51 -170 -132 -225 273 -309 -134 -71 -438
2161 -438 -36 114 -199 -288 -227 -248 -3 36 -246 -204 -28 -418 91 -59 113 -64 -122 46 116 153 -324 -70 -49
2184 -49 76 237 152 -182 135 235 155 195 -161 -33 167 497 196 320 339 94 -142 223 131 167 228 12 294
2207 294 206 4 -194 -30 45 218 15 112 239 -108 -167 266 75 157 -75 -195 -65 -197 15 -316 43 -181
2229 -181 -222 54 130 95 -341 -380 -203 51 -197 -69 -183 -68 -197 176 107 -58 -114 -181 -172 -249 -80 3 -227 44
2253 44 -159 -82 -29 -151 140 130 229 92 -268 80 240 69 29 46 98 -54 -125 180 98 159 -110 83 85 18 380
$$ packed form
2092d9n46M31L0j62L86m36J50K86r9K64j21m96M22mj46L27o42M10nJ49K46l90
2114Ej42J24K53M0R2o09L30M5l4L17m71J94K6J0J19K6k67J3k7K02K60m42K72j62
2138A74M6j24P0j37J21r3j49L83l15n6J08m23K00J80l6j19L8r3M98n82J75O3l67
2161d38M02J50l13q9O1k1K45L9k82M2J76l90N09j50J72j77n8J68P0L7m77K54K1
2184d9J25J61q5l34L17J00q0M0l56J28K00L30l01J24J9k45k36L65r2L6O1k16K82
2207B94q8k02j98J64P5J73k03R7J27l47n9M33j91Q2k32j20J30j32K12l31L59k24
2229a81m1K76P6l5m36l9J77K54k48J28j14J15j29L73o9j65n6o7Rp7J69Q3k30K71
2253D4k03P7N3j22K91j0R9j37l60L48J60j71m0J7N2j52p1L05q2O1k69J93Ko7L62
$$ plain form
2278 380 -124 182 165 95 -46 275 -66 105 23 -98 71 81 -188 -125 120 34 -294 -87 -219 32 -7 98
2300 98 36 -149 -149 -112 -74 -52 -251 -40 -390 -236 -91 -229 -511 -26 -249 51 -220 -127 -161 14 -112 -113 -28 -371
2324 -371 -73 -215 -45 70 -37 183 -124 115 -40 39 -81 351 0 91 42 -53 104 116 1 145 89 224
2346 224 273 6 353 -80 -35 229 -16 80 180 80 351 -59 -15 204 24 -91 -130 -48 -172 271 -122 17
2368 17 -122 -158 191 -110 89 -18 -151 16 74 -137 -180 -266 -104 46 -219 -117 -20 -324 -1 -152 38 47 -213
2391 -213 -8 28 -106 -232 -130 -38 31 -105 -170 172 -143 -55 -76 -424 108 -46 -78 111 193 -52 219 7 304
2414 304 316 149 385 247 24 74 106 413 168 -59 73 189 170 222 -45 -29 312 237 163 54 149 62 -11 205
2438 205 314 85 143 283 -31 -53 115 -10 132 -155 118 -272 118 -201 118 -123 154 -99 -184 -166 -401
$$ packed form
2278C80n04L06j7p0j41L21l41J71q2j21J69J0k69O3K45q6l28K07j32K51l9J05
2300I8o2j85%L7L8K2j99K11l50J54J45j38k82M85k23L00k71R3l4J75j26jQ5l43
2324c71K98j42J70J15j07K20l07K39j55P9j20M32l51R1m9r5J57J2j15J44n6J35
2346B24M9k67L47m33M5K64k45R6J00j00K71m10M4K19j80j15l9Q2j24M43l93J39
2368A7j39l6L49l01J99j07j33J67N8k11m3q6J62J50k65J02R7l04L23j51J90Rk60
2391b13K05L6j34j26J02R2O9j36o5L42l15Q8k1l48N32j54l2J89Q2k45K71k12K97
2414C04J2j67K36j38k23N0L2L07k45k27J32J16j9N2k67J6L41p5p4j09R5q7p3K16
2438B05J09k29N8J40l14k2J68j25J42k87K73l90L90l19L19k41K77k53q5J8k35
$$ plain form
2459 -401 -120 -183 -22 -58 -240 -249 -174 -163 -59 9 -62 92 101 -86 -118 53 -260 40 70 -65 -125 -174 46 -175 -257
2484 -257 132 -21 142 -10 -56 218 48 -78 278 -117 5 205 111 42 -291 312 486 303 -10 262 -309
2505 -309 117 455 155 278 163 -87 251 277 -5 216 -171 178 27 -25 101 -146 -143 -147 -52 69 -28 -52 -13
2528 -13 58 -201 -106 -50 -59 -193 -199 101 -120 -52 -196 -383 -176 93 44 -268 97 -215 170 -199 -246 14 -60 -238
2552 -238 179 -73 -85 13 -102 93 12 -209 105 -61 -52 102 18 22 35 67 166 13 -2 25 -134 -8 252 198 210
2577 210 249 183 51 205 285 -14 116 -26 21 321 154 249 -3 56 -83 271 -191 27 -106 -20 -92 -34 158
2600 158 -25 -244 94 -12 65 -189 -55 179 212 -165 -135 -192 -248 123 190 -252 -154 28 -136 -109 -157 -37 -202
2623 -202 -135 -94 -37 -32 19 -198 -5 -135 -202 -5 61 -147 25 -84 142 227 -110 3 -49 5 -75 -112 197 -125
$$ packed form
2459d01K81o3J61l6j82rP5J1J04O8p1J54Rj87l2J71l13L00L0j35o0m9K20k21q2
2484b57L89j53J63j52m6K74j70j26L56l95J22K00r4o9l33O03J74j83l13K72n71
2505c09M26L38l00J23j15k50L38K6k82K21l87L49j51n2J26k47LmR5J21r7k4L9
2528a3P1k59R5N6rj34oL00k21O8j44j87K07K69m9l12L65l12L85l69m7K60p4j78
2552b38M17k52j2R8j15J95q1k21L14j66RJ54q4MJ3L2R9j53j5K7j59J26K60n4J2
2577B10L9o6j32J54Q0k99J30j42M7L00j67R5k52N9j39L54m62K18j33Q6p2N8J92
2600A58j83k19L38j06P7k54J34K34L3l77L0n7n6L71O7m42R8J82j64K7m8J20j65
2623b02O7M1N7NN1k17J93j30o7J97O6k08J72j09K26Q5l37J13n2N4q0l7L09l22
$$ plain form
2647 -125 126 272 384 -87 -31 176 278 62 -5 106 -242 -8 230 117 122 -151 125 192 86 121 -207 -85
2669 -85 72 -164 279 -195 -238 -23 -225 175 -144 -167 122 -20 19 -227 -223 -186 -233 -63 -257 -328 -60 -163 -1
2692 -1 73 -106 -81 170 121 -69 -112 -175 208 -167 -137 -79 148 -195 -94 144 -5 -145 41 -178 7 13 253 110
2716 110 -29 8 139 180 17 206 -82 185 225 -158 20 323 179 137 -105 369 158 106 162 179 42 176
2738 176 4 240 61 65 165 -35 -50 40 139 115 -190 120 -34 -60 -137 58 -234 -14 -33 -51 193 38 -131
2761 -131 -78 -164 -321 -10 255 -215 -171 9 -189 177 -139 -288 -240 5 51 -8 46 161 173 -12 -14 -11 -27 140
2785 140 55 -66 50 -151 -111 -146 112 85 107 -50 137 -35 -43 159 90 13 -187 86 48 379 395 -284 -37 91
2809 91 -103 -20 -25 101 89 170 4 3 204 18 69 -190 -168 -78 304 -103 114 -227 23 164 70 -113 -196 -33
$$ packed form
2647a25K51J46J12m71N6K07J02k16o7J11l48K34K38j13Nk73K76O7j06L5l28J22
2669h5J57k36M43m74m3K15k02M00l19k3K89j42L9k46ML7m7J70j94p1K68j03J62
2692aP4j79K5K51m9j90m3o3L83l75L0N8K27l43J01K38j49j40J86k19J85OK40j43
2716A10j39L7J31M1j63J89k88K67M0l83J78L03j44m2k42M74k11n2N6J7j37J34
2738A76j72K36j79MJ00k00j5R0R9k4l05L10j54k6p7J95k92K20j9j8K44j55j69
2761a31N3q6j57L11K65m70M4J80j98L66l16j49M8K45M6n9N4J15J2j85kLj6J67
2785A40q5j21J16k01M0l5K58k7K2j57J87j72qK02o9p7k00K73l8L31J6o79K47J28
2809I1j94Q3nJ26j2Q1j66jK01j86N1k59K2R0L82m07K17l41K50J41r4j83q3J63
$$ plain form
2833 -33 -256 111 -221 -108 -137 -87 128 223 -269 -265 62 -34 152 -48 -241 -371 -225 -49 -21 115 26 -94 185
2856 185 -67 144 -39 -36 54 239 99 -40 -73 208 24 7 90 187 361 59 -25 196 33 113 -268 3 -87
2879 -87 -25 225 199 17 -198 226 226 15 176 155 -208 -83 173 53 34 -4 -131 -43 184 39 -188 60 150
2902 150 51 -97 -238 75 -78 -322 121 -25 -41 -165 -205 6 -143 32 -13 -185 -102 66 -75 -464 -3 -301
2924 -301 -284 -229 -182 -1 170 -45 266 131 -15 -145 -159 72 -105 50 198 42 195 -61 199 -116 -8
2945 -8 159 109 274 139 -73 -5 87 -295 45 -233 -14 148 -1 -60 -172 5 105 69 85 110 -47 125 -133
2968 -133 -246 21 -166 -132 55 158 -27 -94 -40 124 -194 -89 24 -38 -166 -48 7 -82 -347 -34 91 14
2990 14 -99 -152 100 -56 -84 -211 -217 -151 62 -264 -223 -19 -83 215 29 141 153 -61 -125 -28 -67 -30 -100 -78 -100
$$ packed form
2833c3k23L67l32J13k9N0K15R5m92ML27r6J86k00j93j30J46J76K8J36q9j20K79
2856A85k52K11j83LR0J85j40j39l3K81j84j7Q3R7J74l02q4K21j63Q0l81K71r0
2879h7O2K50k6j82k15M24%k11J61k1l63J25K56j20j9l8j27Q8K27j45k27K48R0
2902A50r9j48j41L13j53k44M43j46j6j24m0K11j49J75m5j72Q3J68j41l89M61k98
2924c01J7N5M7J81J71k15L11j35j46j30j4K31j77J55J48j56J53k56K60l15J08
2945hJ67n0J65j35k12O8R2l82L40k78K19J62j49n9j12J77J00l6J6K5j57J72k58
2968a33j13K67j87L4J87J03j85o7N4J64l18J05J13o2j28J18N5q9k65L13J25p7
2990A4j13n3K52j56k8j27oO6K13l26M1K04o4K98j86J12J2k14o4R7l9L7p0K2k2
$$ plain form
3015 -100 -68 54 -95 212 5 -78 34 107 131 -230 324 419 98 -47 76 14 -91 118 -65 62 -63 104
3037 104 125 29 200 109 -137 -115 -14 57 165 -6 233 74 -65 0 43 -35 -70 177 -42 -50 -174 -129 -305 -137
3061 -137 -162 0 -146 -123 -42 -101 63 -111 -141 -13 234 -70 -36 -66 -76 -1 -285 -10 -303 -191 91 75 -66
3084 -66 180 26 235 84 -186 -82 42 -73 13 36 265 -47 106 237 171 -158 149 36 289 133 206 408
3106 408 -161 140 -159 130 150 -36 -33 25 51 131 -125 -111 -13 48 85 -193 -105 9 -161 -268 -322 -46 -278 -31
3130 -31 14 -7 -75 -70 184 -119 104 -322 -22 45 -17 -145 -57 97 -60 -162 -105 -142 -251 -151 -62 36 -57 -5 -114
3155 -114 144 -214 8 -107 -19 -165 -96 -2 -67 181 -24 210 1 -138 362 -172 -19 -67 8 295 -42 -239
3177 -239 -167 136 6 -259 -59 122 -39 283 -19 14 242 -62 -13 131 -95 -40 129 59 55 228 105 227
$$ packed form
3015a00L2J22j49L07k07q3J12P3K4l61N54R5l21j45J23o2j05K09j83J27j25J67
3037A04K1r6J71r1k46K2J01P1J08j71K39j59j39O5M3p8l5K47k19qj24M5j76J68
3061a37k5J62j46K3Q1n9J64j74l0J28K47l04L4l0j0P5k84K75k93J12K82j6j41
3084f6K46j54K09j51k70J04J24j15Q6K3K29l12J53J31o6l29L07j13K53j56P3K02
3106D08n69L01k99K89K0j86LN8K6Q0k56J4R8O1L7k78Q8J14j70j07n4K76k32K47
3130c1M5k1o8NK54l03K23m26L00O7o2j28Q8J54j57j02N7l7j09J00Q9R8r3N2j09
3155a14K58l58K22j15Q8j46O9R4o5K48k05K34k09j39N00n34J53m8P5K87l37j97
3177b39P2L03j30k65K00J81j61L22l02L3K28l04M9J44k26N5J69p0mJ73j23J22
$$ plain form
3199 227 -116 20 24 160 1 56 111 -76 -112 -192 -172 -112 94 -56 -79 -208 -256 -279 -33 -125 -48 68 -16 -62 -40
3224 -40 -61 -62 -113 20 -7 -51 -266 -58 72 140 -138 -132 27 -135 -7 67 114 177 -201 -11 -13 226 77 -45 -20
3249 -20 153 -135 -30 152 -141 137 -66 -8 -46 135 90 -31 72 230 108 107 17 196 -81 -223 258 149
3271 149 -39 -17 80 60 -86 -77 -115 -111 -104 17 4 -283 -76 5 94 -139 -47 -121 -121 16 -42 -31 116 11 -17 -5 86
3298 86 -305 -26 -163 8 -199 49 -233 41 17 130 -18 -63 -202 -96 -34 -53 71 191 61 49 54 78 -206
3321 -206 -193 287 99 38 -184 61 -46 146 58 141 -321 51 113 -64 79 -85 208 -163 233 -24 -78 132
3343 132 220 29 -291 76 -64 -16 14 90 -90 -147 -71 49 -215 -69 -191 108 34 -45 -66 107 47 -112 83
3366 83 -52 38 -66 18 123 -59 -52 48 -69 87 -192 71 -69 31 58 77 -169 -67 -61 -86 4 -9 150 151 123
$$ packed form
3199B27l43J36MJ36j59N5N5j87l6q0K0O0K06j50k3j29m8k3K46r2P7J16q4m6K2
3224d0k1jn1J33k7m4k15K08J30O8k78OJ59j62J28P4M7O3l78J90kK39j49j22K5
3249b0J73k88J05J82k93K78k03N8l8J81m5j21J03J58j22jr0J79k77j42M81j09
3271A49j88K2R7k0j46Rl8MPJ21j3k87K07Q1Q9k33R2p4%J37n8J1J47j05k8J2R1
3298H6l91K79j37J71k07K48k82K74k4J13j48m5j39J06O2j9J24J20j30j2NK4k84
3321b06J3M80j88o1k22K45j07J92q8Q3m62L72O2j77J43j64K93l71L96k57n4K10
3343A32Q8j91l20L67j40M8L0P6j80n7P6J20k64J46j22K99p4p9k1J73o0j59J95
3366H3j35R0j04Q4J05j82PJ00j17J56k79K63j40J00K7J9k46J02Ok5R0j3J59Jk8
$$ plain form
3391 123 102 243 292 148 -229 0 -16 -50 -105 -8 107 -64 187 59 308 104 184 229 172 94 55 -47 -63 297
3415 297 143 74 35 -4 55 123 60 198 132 -70 34 4 -102 -62 -12 -139 -23 -154 9 -273 -87 -245 -113
3438 -113 -19 -204 -76 -168 12 -94 99 45 -153 -340 11 -133 -28 2 -96 99 19 -85 -293 -25 104 -130
3460 -130 9 51 27 -73 -140 -102 116 11 97 126 145 -140 -211 174 129 204 -90 -8 86 13 110 49 233 -38 232
3485 232 85 27 12 -172 -19 -27 157 212 139 0 524 223 -166 42 43 -78 75 -183 -28 131 119 73 -119
3508 -119 -17 -34 -100 23 -268 -89 26 83 -90 -216 -8 -142 -232 -121 -122 323 17 10 61 -266 -244 25 -61 -1
3532 -1 15 -345 4 144 134 86 -176 24 35 147 30 -191 -10 54 55 -16 42 268 148 131 114 76 123 55 158
3557 158 100 -27 200 255 92 -192 109 -33 95 -128 -155 48 -29 72 -61 -25 38 -129 -57 -7 -154 156 220
$$ packed form
3391A23k1J41M9j44l77K29j6l4n5R7J15j71K51j28K49k04Q0M5n7p8l9j02j6L60
3415B97j54o9l9l9N9O8o3J38o6k02J04l0j06M0N0j27J16j31J63k82J86j58J32
3438a13R4j85J28r2J80j06J93n4j98j87L51j44J05L0r8J95q0j04k08K68J29k34
3460a30J39M2k4j00o7L8K18j05Q6K9J9k85p1L85m5P5k94Q2R4p3R7o1J84k71K70
3485B32j47n8j5j84J53qJ84N5p3j39N24l01l89K08Jj21J53k58J55J59j2m6j92
3508a19J02j7o6J23k91J79J15N7j73j26K08j34r0J11jM45l06pN1l27K2K69q6O0
3532aJ6l60L49J40j0m8k62K00J1J12j17k21J81O4Jp1N8K26j20j7j7l8M7o8J03
3557A58n8j27K27N5j63k84L01j42J28k23k7K03p7J01j33L6O3j67P2N0j47L10O4
$$ plain form
3580 220 -36 -125 -45 -137 -147 -230 -178 -137 24 -249 -139 30 -132 -52 178 -41 183 -91 -8 200 -233 -78 -204
3603 -204 -127 93 175 29 88 90 134 -264 -94 -18 30 -325 168 -21 184 129 -40 -45 -132 113 20 -77 349 111 -166
3628 -166 -23 183 -21 38 -17 -188 54 29 163 265 119 90 59 19 -296 -130 83 264 -22 -134 -269 -54
3650 -54 -140 99 -218 -40 121 -16 36 -57 -310 68 -40 5 -200 189 -127 66 -108 21 -5 -136 -94 -218
3672 -218 3 -129 15 -19 -251 -161 -136 123 153 -227 10 -126 1 -30 -153 30 96 143 165 71 62 82 6 -104
3696 -104 146 31 -70 37 186 -38 33 175 -118 170 55 -154 138 4 2 0 166 5 -105 70 -8 -75
3718 -75 -142 2 184 91 -254 7 0 -15 140 23 -137 -63 229 -93 50 -109 -28 170 52 -54 135 -215 57
3741 57 -197 -194 -81 182 -171 -21 -127 -150 -202 58 -70 -32 -119 -17 -105 -304 -242 38 -122 -102 -119 -169 179 115
$$ packed form
3580B20k56q9Q0r2j0q3N2M1J61k73J10J69j62Q0K30k19K24k74Q3K08m33J55j26
3603b04P7K20Q2j46N9KM4l98J70P6M8l55M93j89K05n5j69nq7K45r3r7M26k38k77
3628a66J43K06k04N9n5j71K42k5J34J02j46k9l1m0l15J66K13J81k86j12j35K15
3650e4q6K39l17J78J61j37N2r3k53L78j08M5k05L89l16J93j74J29k6j31M2j24
3672b18K21j32J44l4k32R0K5K59L0l80K37j36J27l1j23J83O6M7K2r4rK0p6j10
3696a04K50j15j01J07J49k24P1J42k93K88j15k09K92j34kkJ66j61j10J75p8o7
3718g5o7J44J82r3l45K61pj5J55j17j60P4K92l22J43j59Q1J98j18j06J89l50K72
3741E7k54LJ13K63l53J50j06k3n2K60j28L8q7J02q8j99O2K80j60K0j7n0L48o4
$$ plain form
3765 115 253 94 -52 140 79 260 -85 74 102 -137 162 -107 79 64 180 98 144 -3 137 -111 57 314
3787 314 101 -162 293 -52 180 42 -18 -112 227 63 32 -59 -79 -41 53 -143 73 -53 8 -44 -64 -171 12
3810 12 -113 248 73 -45 -21 -162 110 173 -85 85 -31 -35 55 -62 -198 -48 13 -111 114 49 28 134 -82
3833 -82 90 74 19 -117 102 -1 -186 -81 -61 141 -64 90 248 305 98 -212 58 -160 -202 275 9 152
3855 152 -47 72 -168 396 24 51 24 155 -16 298 117 -10 106 -97 44 -111 -70 -27 39 -23 136 21
3877 21 -39 68 -218 -145 47 29 -89 130 88 6 -15 -186 -15 -227 -22 -154 202 41 -14 -94 -181 -92 292 183
3901 183 -110 -71 53 90 -105 123 81 144 -25 44 171 -146 -33 10 47 227 -109 43 -139 48 -126 17
3923 17 262 -66 41 -46 129 199 30 146 55 101 127 117 148 146 149 -81 53 2 -45 45 61 121 144 14 99 -81
$$ packed form
3765A15J38j59j46J92o1J81l45J59K8k39K99k69J86j5J16q2M6j47J40k48J68K57
3787C14k13k63M55l45K32j38o0r4L39j64l1r1k0L8R4j96K16j26O1n2k0j07J83
3810A2j25L61j75j18K4j41K72O3k58J70j16mR0j17j36J50O1j24K25o5k1J06k16
3833h2J72j6n5j36K19j03j85J05K0K02k05J54J58N7k07l10K70k18m2M77k66J43
3855A52j99J19k40N64l72K7k7J31j71L14j81j27J16k03J41j55M1M3O6o2J59j15
3877B1o0J07k86P3J92j8j18K19m2q2k1j71J71k12K05j32L56j61n5q0q7Q9L84j09
3901A83k93L9J24L7j95K28m2O3j69O9J27l17J13M3L7J80l36J52j82J87j74J43
3923A7K45l28J07q7J75P0j69J16r1M6K6j0L1kLk30J34n1m7R0J6O0K3j30Q5j80
$$ plain form
3949 -81 -270 218 197 -55 28 -120 -43 84 62 119 -46 -112 -263 3 -4 36 -187 -36 -54 -201 -364 -160 -136 243
3973 243 -107 -104 -9 105 208 -84 -78 120 152 161 -79 -186 -238 -48 22 146 -131 -173 73 16 307 121 155 208 45
3998 45 212 63 185 59 160 229 -28 -271 -99 125 184 -59 237 183 208 126 -142 3 -35 -31 -108 317 -40
4021 -40 -9 -179 162 182 -108 -147 145 194 -82 -6 81 -166 -57 77 -21 54 -292 317 -18 -353 144 65 2 -8
4045 -8 -149 -121 -183 -64 -67 -108 -163 -331 -48 -46 -125 -113 1 24 -2 10 110 -14 235 -124 -44 34 -175 72 251 -133
4071 -133 74 -89 -12 336 84 -115 -82 141 71 105 75 86 90 -74 2 375 340 -1 -177 47 47 223 -37 94
4095 94 -41 194 184 -160 88 224 -7 -123 68 167 46 -155 70 -4 117 -178 -70 171 -55 -112 -122 109
4117 109 -29 -56 -121 -128 -65 46 170 9 -138 -63 -81 -251 246 -103 -77 -63 -101 -118 155 136 16 18 90 -30 88
$$ packed form
3949h1j89M88k1k52Q3j48P7J27k2N7j65o6j51K66pM0k23J51j8j47j63K04K4L79
3973B43l50LR5J14J03k92OJ98L2Rk40j07n2J90P0J24k77m2K46n7K91j86L4N3j63
3998D5J67j49J22j26J01O9k57k43J72K24N9k43K96n4K5q2k68J45l8Mp7M25l57
4021d0L1j70L41K0k90l9K92M9k76P6Q7k47J09J34r8P5l46O09l35l35M97p9o3j0
4045hj41K8o2J19lm1n5j68K83Kp9J2J14K3k6J2J00j24K49l59Q0P8k09K47J79l84
4071a33K07j63P7L48k52j99L3K23p0L4l0J1Mj64P6L73l5l41j76K24%J76k60J31
4095I4j35K35j0l44K48J36k31j16J91R9j21k01K25p4J21k95J08K41k26n7j0K31
4117A09j38k7o5pO3J11J24j61j47P5j8j70M97l49K6J4l8j7K73j9j20KP2j20J18
$$ plain form
4142 88 118 -149 56 34 25 -6 -79 127 -115 100 47 -11 107 95 -113 118 -87 139 82 278 13 -50 -3 31 -191
4167 -191 -69 42 92 -25 116 221 -122 32 189 112 -30 123 -222 -183 -260 -124 82 -61 63 112 91 155
4189 155 -40 -2 12 -2 35 -265 -309 -144 51 -160 -132 89 21 53 -10 -85 -59 -113 15 -238 -75 -56 -26 -144 40
4214 40 -170 -106 -26 83 177 -75 159 142 11 -4 -174 -69 28 221 134 -11 150 -35 73 76 -91 -52 25 -117
4238 -117 12 65 -93 157 -9 -5 9 97 189 16 -23 -55 40 114 -161 -114 -191 -97 -300 -189 85 112 11 -284 -133
4263 -133 -32 -297 -128 -80 56 -111 -57 -110 92 -201 -179 -98 -12 106 -92 -71 -163 149 26 -109 103 29 -80
4286 -80 -235 100 -4 -77 148 -106 -227 -67 -139 256 -108 125 196 53 103 22 185 196 232 17 36 106 268
4309 268 26 -65 -99 79 228 229 131 -16 -124 80 -182 104 147 -195 242 120 -79 45 100 -224 100 -89
$$ packed form
4142H8L0k67K05k2rl1p3K06k42K15n3n8J18j2k08K31k05K26n7J96k65o3M7L4k22
4167a91J22J11N0j17J41J05l43J54J57p7j42J53l45L9p7J36K06j43J24M9k1O4
4189A55j95L8J4j4L7l00m4J65J95k11K8K21o8L2o3p5K6n4J28k53J63J9L0j18J84
4214D0k10O4Q0J09R4k52K34j7j31j5j70J05R7J93q7j45J61j85J08Lj67L9P7j42
4238a17J29N3j58K50j66MJ4Q8R2j73l9l2R5P4k75M7p7R4k03J11K74K7j01k95J51
4263a33J01k65J69M8J36j67N4n3K02k93K2Q1Q6J18j98K1r2L12j23j35K12p4j09
4286h0j55L35j04p3K25k54j21J60p2L95l64K33P1j43N0q1J63J1L6k15J9P0J62
4309B68k42r1l4J78J49Jr8j47j08K04k62K86M3l42M37j22j99J24N5l24L24j89
$$ plain form
4331 -89 124 88 -76 38 -155 143 -235 111 -16 45 110 98 63 104 -66 -337 41 10 118 53 -189 101 239
4354 239 -139 -141 -65 82 82 28 -37 -148 -133 -20 -24 182 119 -69 -19 -29 -73 313 -250 45 127 73 21 -391 30 -131
4380 -131 77 229 -65 71 175 30 74 -13 30 51 306 -6 -65 -96 91 8 -32 8 105 274 129 60 -258 -310
4404 -310 -65 93 -56 -20 -208 -103 -7 -96 -4 88 -44 -76 -278 -125 -147 -143 161 -60 -56 -56 180 -4 -27 55 109
4429 109 16 -104 17 10 79 147 280 73 -140 -57 -30 -82 23 82 -141 -4 -160 117 -87 162 210 -5 104
4452 104 -120 -62 -116 -68 5 208 191 29 20 104 54 84 330 137 160 -183 57 106 64 55 -130 -203 61 122 123 80 -85
4479 -85 306 -24 261 -120 -59 -191 -76 -79 -74 9 -256 -27 -114 -57 109 27 71 85 -214 -158 137 4 -26 165 -38
4504 -38 -152 -184 -208 12 -138 13 65 105 -112 57 38 -91 77 97 109 -76 -116 85 -136 145 227 37 88 167
$$ packed form
4331h9K13l6j64J14j93K98l78L46j27O1O5j2l5M1j70k71L78l1J08o5k42K90J38
4354B39l78kP6J47%n4o5j11J5J13mK06o3j88N0j0m4L86n63K95Q2n4n2m12M21j61
4380a31K08J52k94J36J04j45M4q7M3K1K55l12n9l1J87q3m0M0R7J69j45o9l18n2
4404c10K45J58j49L6j88J05R6q9R2R2j32l2k02J53k2ML04k21M%K36j84k3Q2N4
4429A09r3j20J21pO9O8J33k07k13Q3K7n2J05N9k23J37j56K77k04K49M8k15J09
4452A04k24N8n4M8P3K03j7j62rQ4n0L0K46j93K3l43K40M9m2rj85p3K64O1Jm3j65
4479h5L91l30K85l81O1j32J15lNQ3k65K29q7N7J66q2M4J4k99N6K95j33l0J91k03
4504c8j14l2k4K20j50J51N2M0k17J69j9j29J68K0J2j85m0K01k21K81Q2j90N1P9
$$ plain form
4528 167 -253 64 -20 -57 129 73 158 61 196 110 -40 -77 85 16 -195 95 153 66 -205 61 -59 92 99 -9
4552 -9 11 -9 -116 222 50 -69 29 -28 -104 -116 -237 65 41 -256 265 12 -187 -227 -43 76 38 -131 -64 -90
4576 -90 -132 159 76 -27 91 -76 -296 -31 53 28 -174 55 -64 99 -122 -1 210 20 56 229 102 57
4598 57 297 126 -51 -275 45 -111 -144 287 155 39 99 -252 -44 104 51 154 58 97 129 -143 98 -117
4620 -117 -108 363 106 51 -158 413 -36 -16 -133 -31 92 -65 2 -47 -139 63 21 -187 -125 -151 133 -230 -234 -102
4644 -102 -228 -135 18 -64 -306 34 -74 12 -47 -131 -327 -211 -141 193 86 -203 -231 -35 135 122 -89 -196 27
4667 27 16 159 -47 -9 245 -77 16 -54 19 15 83 -39 38 46 -104 91 231 172 -196 -77 24 1 -27 43 11 180
4693 180 41 114 137 -145 89 -24 154 -110 136 197 340 170 159 86 -10 115 149 98 9 103 -125 43 -76
$$ packed form
4528A67m20L17q4l7J86n6Q5r7J35q6j50l7J62o9k11K90N8q7k71K66j20J51Pj08
4552iK0k0j07L38j72j19R8n7p6j2j21L02k4k97N21k53j99m0J84J19l8j69O7k6
4576i0m2K91q3j03J18j67k20K65Q4k5k02K29j19J63k21J21K11j90L6J73j27m5
4598E7K40j71j77k24L20j56l3M31j32j16O0l51K08J48n3J03r6L9L2k72K41k15
4620a17RM71k57n5k09N71m49K0j17J02J23j57O7m9r2K02m2k08O2k6K84l63mJ32
4644a02j26R3J53q2k42L40j08Q6n9q4j96J16P0L34j07k89k8J96J70j3k11j07K23
4667B7j1J43k06L8K54l22R3p0P3mO8j22P7Qj50J95J40n9l68J19J01k3k8P0l2J69
4693A80j39P3K3k82K34j13J78k64K46O1J43j70j1p3r6J25L4n1q9R4k28J68j19
$$ plain form
4716 -76 -88 -191 -135 -268 -301 -175 -132 -179 -152 32 -63 206 -165 -41 -144 -63 244 -170 0 -25 -67 -73 -9 16 17 83
4742 83 -10 -18 -42 -189 -42 -23 -26 -55 -105 10 8 282 100 41 226 -6 90 46 -186 164 1 35 117 55 -59 5
4768 5 190 88 286 105 223 -211 81 75 39 -64 126 -18 77 -222 90 -185 88 -20 106 140 -118 186
4790 186 -18 165 -124 -211 75 -71 -251 -189 -35 -50 -12 131 -17 190 -76 223 -165 -30 -50 24 222 -71
4812 -71 51 60 -49 -22 -327 97 -43 131 -17 -19 195 80 -256 113 -36 -93 -92 29 91 -4 254 -202 -50 -156
4836 -156 31 74 -119 35 -54 -4 -253 23 115 -172 -66 -22 69 -62 -81 39 -5 107 76 -100 20 21 -76 -162
4860 -162 -32 32 -133 -82 -240 -59 -15 -28 -57 -199 52 -10 30 -35 221 -107 -3 -41 -61 17 77 129 69 -100 130
4885 130 -66 -304 -63 -99 -8 61 146 -70 221 204 195 -29 -16 -102 288 -133 104 -33 90 46 -1 166 -63 24
$$ packed form
4716g6j2j03N6j33l3J26M3m7K7J84r5K69l71J24j03Q1L07m14J70k5m2oO4K5JO6
4742H3r3qk4j47J47J9lk9n0J15kK74j82n9J85k32R6m4k32L50j63L4Q2o2j14O4
4768EJ85j02J98j81J18m34K92ol6j03J90j44R5k99L12k75K73j08J26L4k58L04
4790A86k04J83k89q7K86j46j80O2J54j5L8J43j48K07k66K99l88J35k0P4J98k93
4812g1J22Rj09K7l05M24j40J74j48kK14j15l36L69j49n7JJ21O2r5K58m56J52j06
4836a56J87M3j93J54q9N0k49K76R2k87J06M4R1j31j9J20m4J12l1j76J20Jr7q6
4860a62J30O4j65N1j58J81M4j3k9j42K51o2M0o5K56l28J04l8k0P8O0N2o0j69K30
4885A30j96k38K41l6R1O9Q5k16K91j7rk24J3q6L90m21K37j37J23m4m7J67k29Q7
$$ plain form
4909 24 68 -83 91 -83 49 90 158 -89 57 121 -12 -16 32 89 -91 67 162 -139 12 -13 82 199 -161 -101
4933 -101 45 239 146 -11 248 32 -294 32 139 -89 -71 -274 -118 106 -49 -242 39 -72 272 131 130
4954 130 -54 -19 -9 -107 -80 35 -74 -82 -151 -2 -107 -5 -232 -305 -40 -118 -110 20 -206 142 86 -30 97 -175
4978 -175 207 -10 346 274 177 -101 56 157 -108 37 -87 -172 62 15 64 161 194 -82 -40 188 147 -17 264
5001 264 67 126 98 184 -55 1 -20 -87 -101 -59 1 -122 -46 -483 -212 70 -66 -19 -368 -223 -44 0 -112 120
5025 120 -138 109 210 201 -146 30 64 -91 -57 55 -99 -155 -166 -3 75 7 -29 154 -22 8 21 120 -67 -43
5049 -43 39 -52 203 117 34 -86 198 -60 102 100 76 273 121 61 69 149 116 47 41 -26 159 171 -233 74 -5 -22 -165
5076 -165 -189 -4 0 37 27 123 46 63 -113 294 118 203 155 -18 6 -139 -48 173 60 -19 -104 -236 -16 -116 72
$$ packed form
4909B4M4j51J74j74J32M1O8k47J46O4j33mM8N7j80J58R5l01J51k5R5J17l60O0
4933a01J46J94r3j57K59k16l26L26J07k28J8k03J56K24j55j93K81j11L44j41j
4954A30j84L5J0r8K7J15j09qo9J49j05J02k27p3K65p8QJ30k26L48n6j16J27k72
4978a75L82k17L56p2r7k78J57J01k65J45j24q5K34m7M9R7L3k76M2K28m1j64K81
5001B64j97N9k8Q6k39N6k1o7j4M2O0j23P6m37K71K82j36M7l49J45J79M4j12K32
5025A20k58K47J01rl47J76L4j55L4J12j54n6j1J63P8o8l6J83j76L0J3R9j87K4
5049d3Q2r1K55q6q3j20K84k58J62kk4J97j52o0QQ0l3o9oo7J85J2m04L07p9j7j43
5076a65k4J85ML7j0R6p7J7j76M07j76Q5m8j73K4j45R1K21j13p9q5j32K20j00J88
$$ plain form
5101 72 -131 -170 65 116 -151 -249 -72 48 -102 -40 -39 -25 -72 -9 70 -50 150 60 -360 2 -69 -81 -35 136 -172
5126 -172 189 -49 -81 165 -15 70 146 213 241 -124 118 14 100 0 119 -72 -46 24 150 45 -130 -21 187
5149 187 141 -50 170 -173 -20 127 25 -130 -95 -274 -35 198 37 39 125 -46 -116 85 -207 103 -33 -244
5171 -244 -148 -87 32 239 -31 -186 -68 306 -84 -51 -103 32 177 -48 10 158 -66 -93 91 77 -131 -192 101
5194 101 90 -101 17 -110 -295 164 -17 112 -142 -180 42 22 -24 6 27 139 242 98 -506 123 -99 91
5216 91 -159 6 -62 17 112 -55 72 -25 -95 206 1 -216 47 8 7 -102 -18 81 1 -251 -82 57 -132 232
5240 232 456 -47 -176 -144 154 -86 169 -288 133 -177 -174 5 -118 -162 131 -62 -100 -17 123 31 14 -57 37
5263 37 -95 -142 -14 -7 -109 -180 23 -223 50 30 34 363 107 -98 -43 293 -16 -99 -227 34 199 6 -202
$$ packed form
5101G2k03l9K35N1k67r8J77J20j50O2JJ4m7O3P9j20K00r0m20L62p1j2M6J71l08
5126a72L61k38l2K46j80Q5P6O7K8l65K42j04Q6j00J19j91K6P0J26j05j75J09K08
5149A87m6j91K20l43J53J47j02j55L5j79K39K33j61KQ6j71p0K01k92L10j36k11
5171b44R6O1J19K07k70j55J18L74l90L3n2J35J45k25N8J48k24k7J84j4k08o1K93
5194A01j1j91J18j27j85M59j81J29k54l8K22k0m6L0K1J12J03j44o04O29k22J90
5216I1k50J65o8P9R5j67J27r7p0L01k05k17K63l9jj09Q4R9q0k52J69J39j89L64
5240B32K24n03j29L2K98k40K55m57M21l10LJ79j23m4K93j93l8Q3J40r2j7p1R4
5263C7j32m7J28Pj02p1K03k46K73k0ML29k56k05N5L36l09q3j28K61J65j93k08
$$ plain form
5286 -202 36 81 17 93 -51 180 -45 -211 51 82 171 -137 188 133 23 135 125 -93 67 -129 -3 54 89
5309 89 10 -106 4 119 -127 -123 -34 -53 -149 -159 -137 218 173 170 119 -7 -108 9 -58 7 -173 -189 -128 -175 25 195
5335 195 121 -132 177 -95 67 -89 -59 -115 119 -44 229 132 -88 233 65 -60 -5 199 -316 232 407 59
5357 59 -230 -16 157 -244 58 134 114 304 -115 273 185 -125 408 -106 52 180 -103 126 61 116 22 -123
5379 -123 -103 165 69 -190 -87 -226 29 -35 -29 164 15 -101 48 -47 149 95 -172 75 -94 81 -47 -39 -325
5402 -325 -131 -67 -63 -162 -78 -62 111 -257 60 18 -269 -116 -199 212 38 304 19 -70 124 -4 174 -98 -140
5425 -140 83 -186 39 -66 192 24 -21 56 154 71 14 38 51 249 -43 -204 27 73 340 -9 -82 -46 6 80
5449 80 186 -24 127 22 386 47 -23 -69 -274 249 -23 110 194 101 -26 106 139 -88 20 39 145 -119
$$ packed form
5286b02K38M5o4P6j44K31k25j66K62L1Q9l08L25n5j10J12j0k18J60j96J26N7L5
5309H9p9j16J10J15k46MQ9j9r6j0K2L55m5ln1j26j01J17o7O5j80j6O1m7K00J70
5335A95p4k53L09k72J62j56L0n6K34j63K73r7k20L21j68j25N5K04n15N48J75l48
5357E9k89K14J73m01L02P6k0J90m19L88q8l10N33n14J58J28k83K29o5N5r4j45
5379a23K0K68r6k59J03j39K55o4OJ93j49j16J49r5J96n4k67K47j69J75j28Qk86
5402c25J94O4Mr9Q4J6J73l68L17m2k87J53q3M11j74K66k85q9J94j28J78k72m2
5425a40K23k69K25j05K58j68m5P7R8q3n7K4J3J98k92j61K31M6K67l49p3L6N2P4
5449H0J06k10J51j05L64l39p0m6k05N23k72J33Q4r3j27J32L3k27J08J9J06k64
$$ plain form
5471 -119 -17 27 73 -15 4 48 -223 169 -52 -28 -42 -125 -299 -39 -213 20 167 -8 -192 134 18 -242 -210
5494 -210 -111 -47 -233 1 -193 -302 81 64 133 253 43 164 242 -28 26 230 7 172 149 -23 -51 -157 30
5517 30 129 -173 -219 226 27 164 -61 -24 34 29 25 81 249 128 254 273 -168 54 -147 206 -228 -78 -164 -307
5541 -307 228 -36 -71 -83 76 -6 -87 -80 -61 -36 46 -114 -161 -128 -179 -23 46 7 -36 94 358 -192 -107 -312 -45
5566 -45 -183 27 -110 -120 -81 150 25 -234 65 73 -43 46 8 -34 236 -67 -11 81 17 289 -116 -48 -20 76 70
5591 70 186 -50 -49 -133 78 87 49 225 45 61 -80 -155 -27 -95 165 118 186 133 67 -197 -87 256 -200 -259 74
5616 74 277 107 -115 -274 57 -29 -62 205 -82 -134 -168 -155 -68 -38 -159 76 155 -68 -113 -103 -244 256 111 104
5640 104 41 -48 92 -114 9 -96 119 -134 -123 -9 56 -14 64 -107 1 -75 -149 120 -10 -46 136 31 258
$$ packed form
5471a19J02M4M6q8J9M4k71L92k21K4j4q3j74K60j74K33J47j75j84L26j16k60L2
5494b10R9O4j86K34j94j09L83j7O9J20k10J21P8k70N4K04k23J65k3j72k8j06J87
5517C0R9l02m6M45j99J37k25L7N8nmN6J68j21J26J9m41K22k01L53m34J50q6j43
5541c07N35k64l5j2J59q2q1PJ9K5Q2j60m7L3n1J56O9l9m3J30K64n50Q5k05K67
5566d5j38K10j37j0L9K31j25k59K99Qj16Q9l8m2K70l03N6R2o4K72m05O8K8R6o
5591G0J16k36Jq4K11Rl8J76j80J6j41p5J28o8K60m7O8n3o6k64J10L43m56n9L33
5616G4K03j70k22j59L31q6l3K67k87n2l4J3Q7L0j21K35P9k23m5J0j41N00j45p
5640A04o3q9J40k06J23j05K15k53J1J14O5p0P8j71J08p6p4K69j30l6J82j05K27
$$ plain form
5663 258 -34 195 134 102 111 156 -110 182 76 66 -247 -116 272 34 71 331 243 141 63 -153 -23 -83 -77 148
5687 148 -42 -288 -127 126 48 -23 153 -12 83 -193 123 9 -117 -272 -11 18 -12 -98 -59 174 -43 -244
5709 -244 -46 127 -39 -20 140 -177 -153 -26 -110 -12 -28 -52 -147 -88 -241 29 235 36 116 113 152 294 109 79
5733 79 -171 210 -122 -81 151 8 150 134 204 136 19 45 -80 21 41 -72 -3 200 71 17 -45 -58 83 -62
5757 -62 -104 -213 144 -106 77 -134 -127 -52 -28 5 -32 32 -52 -233 81 -30 154 234 -136 209 321 -38 -259 -342
5781 -342 88 95 -51 59 76 -25 -74 74 -63 -304 179 136 107 42 2 120 -66 -233 -75 65 162 -73 -82 -53
5805 -53 -108 1 -85 133 -27 -335 204 137 143 -52 -27 37 -30 -69 53 -336 25 13 88 5 -44 140 239 -113 -88
5830 -88 178 -38 74 -10 -107 -52 -41 33 130 -10 -110 -41 -66 233 -52 -28 130 173 -6 -139 -258 -212 -29 303
$$ packed form
5663B58k92K29o1l2RM5k66K92j06j0l13J31L88k38L7K60q8j02p8k16J30o0OK25
5687A48j90k46J61K53p8p1J76j65R5k76L16j14j26j55K61K9l0q6L9K33k17k01
5709b44J98J73j66J9J60l17K4J27q4R8j6k4r5N9j53K70K06j99Q0lL9J42j85l0
5733G9k50L81l32M1K32j43J42j6P0o8j17K6j25J01K0j13O9K03j29n4o2j3J41j45
5757f2m2j09L57k50J83k11PP5K4L3l7O4q4j81L14j11J84Q0l70L45J12l59k21q3
5781c42M30Pj46J10J7j01m9J48j37k41M83m3k9o5m0J18j86j67J58J40R7k35rK9
5805e3n5J09q6K18j60l08N39o7Oj95K5O4o7l9J22l89L61j2P5q3m9J84R9l52K5
5830h8K66k16J12q4r7N5J1P4R7j40j00O9k5K99k85K4J58M3j79j33j19M6J83L32
$$ plain form
5854 303 -116 -31 -230 135 -97 -129 103 -125 -210 -163 71 -46 -4 192 47 158 48 27 19 -6 -37 108 221
5877 221 122 195 140 124 117 112 243 144 83 65 -165 -27 209 56 107 103 -178 72 237 40 -48 229 -89 -31 100
5902 100 24 160 -28 161 236 77 -188 213 -14 183 -124 -86 46 177 -107 257 -278 -49 -64 48 52 -212
5924 -212 -131 124 -44 332 137 -78 -62 -169 215 -89 -107 -67 -41 -272 -154 -117 -19 141 -61 234 -46 -97 -89
5947 -89 117 103 37 172 17 7 113 65 333 58 21 36 220 -10 -207 83 76 -47 31 -247 -48 285 -137
5970 -137 271 11 178 -56 90 3 70 64 -224 80 82 -114 130 80 31 222 -103 39 5 -185 -35 127 -217
5993 -217 26 -335 -95 40 88 -168 -127 1 -53 -101 61 -68 -173 -336 214 44 -85 -64 -219 48 -82 18
6015 18 -129 -90 -186 -96 43 126 334 117 -18 -22 -13 37 184 100 7 -103 -49 25 254 159 -48 50 180 -35 138
$$ packed form
5854C03m19Q5j99L65k32l2K32k28q5M7K34j17M2J96j45J11j10k1qk5l1J45J13
5877B21r9P3n5j6pnJ31r9o1j8k30J38K36j53N1mk81K50J65j97q8K77l18N8J31
5902A00p6J36j88J89P5j59k65M01k27J97l07L8J32J31k84L64n35K29j5J12Mk64
5924b12Q1K55j68L76j95k15J6j07L84l04j8M0K6k31J18L7R8J60k02K95k80n1Q
5947h9K06j4o6J35j55j0J06m8K68k75l7J5J84k30j97K90pj23P8k78J99L33m22
5970a37M08k60J67k34J46q7O7ok88L04Kj96K44n0m9J91l25J42l4j90J50J62l44
5993b17K43l61K40J35M8k56M1J28n4m8J62j29j05j63N50j70j29K1j55K67j30J00
6015A8j47L9r6R0J39Q3K08k17j35mRN0J47q4r3j10N4P4K29r5k07R8J30k15J73
$$ plain form
6040 138 40 -25 -21 102 -24 251 -87 -34 -59 33 210 -7 199 -18 52 16 -129 -195 -82 196 -58 -158 60
6063 60 -25 -102 -326 -99 -33 -297 22 -163 166 -65 -175 72 75 -168 -43 137 -11 -89 -171 -79 126 -182 -52
6086 -52 -63 -122 -79 -49 -259 -120 -27 -55 69 235 -226 -317 235 127 180 -105 -130 -264 -7 172 -38 -102 38 -125
6110 -125 121 -56 219 105 -299 -134 177 231 161 -81 -105 -35 171 -162 -21 55 -74 -122 -5 15 14 211 14
6133 14 -38 109 83 -57 -389 -46 -50 5 -47 109 -94 -187 153 217 117 -206 -170 38 -4 32 -86 25 106 195 -112
6158 -112 109 -137 -165 -226 -68 -42 -69 28 7 96 43 -29 23 140 -184 -273 -215 -148 -37 74 -187 -105 24 -116 -107
6183 -107 -59 45 -154 -69 -9 33 189 -225 -96 -65 78 31 239 261 99 -138 22 30 122 37 324 -70 -181 1
6207 1 -100 76 -30 -146 -194 44 75 -68 -43 -43 84 -70 96 117 -195 -35 -175 -289 115 17 137 36 -142
$$ packed form
6040A38r8o5MJ23j26K75l38N3k5R2J77k17K06k17P0l6j45o6J13K78k54j00K18
6063F0q5p7k24K27O6k64L19j85L29k31j10K47Lk43J25J80j48p8q2R2K05l08J30
6086e2j1n9M3L0k10J39R3k8J24J66m61r1N52j08N3k85k5j34K57J79k10o4J40j63
6110a25K46j77K75j14m04J65L11N4p0k42k4P0K06l33J41P6j29m8J17K0jJ97j97
6133A4n2J47k6j40l32L43mN5n2J56k03r3L40O4j00l23L6K08m2L6j18J11Q1Q9l07
6158a12K21k46k8o1J58K6k7R7k1Q9n3p2N2J17l24q9N8O7J11J11k61Q2J29j40R
6183a07M8J04j99Q5O0M2J56m14J29L1J43m7K08K2j62k37J60QR2q5K87l94j11J82
6207Aj01J76j06j16m8K38L1j43K5%J27j54J66K1l12J60j40j14M04r8J20j01j78
$$ plain form
6230 -142 102 -21 10 -123 -164 148 110 163 123 -225 -183 -34 -144 -136 -83 -87 92 57 -58 318 166 -38 -86 -86 163
6255 163 -53 20 158 -113 77 -8 96 78 34 -66 87 -108 65 -237 45 3 -132 -211 71 205 332 -76
6277 -76 283 178 190 91 231 25 -77 -54 -84 120 -136 -60 96 -36 -123 -173 10 -136 100 52 148 -317 108
6300 108 -83 -301 25 83 -352 -9 -211 -171 148 -118 -281 42 -61 58 -178 65 -162 -83 -127 -33 205 106
6322 106 -196 -60 132 105 35 150 -26 -130 -210 98 -241 -279 -116 -64 80 -64 -284 -95 341 -2 -79 64
6344 64 -106 56 57 177 157 147 -155 55 152 -71 31 1 -56 11 21 46 25 -52 35 -158 -33 -58 -137 185 312
6369 312 -13 -115 116 18 115 297 180 -353 196 -71 12 -202 -163 139 -175 91 -104 -163 41 186 162 70
6391 70 175 92 -249 -261 -40 44 -234 107 -131 -71 27 -6 289 -214 107 -284 116 13 151 -289 184 -18
$$ packed form
6230a42K44j23L1j33m1L12l8N3m0l48M2J49j10QN3mJ79l5j15L76j52k04m8%K49
6255A63k16P3J38k71J90q5J04j8m4j00J53j95J73l02K82m2j35p9K82J34J27m08
6277g6L59j05J2r9J40k06j02K3l0K04k56P6J56j32q7n0J83j46K36m8R6m65M25
6300A08j91k18L26N8m35L43k02M0L19k66j63L23j03J19k36K43k27P9m4R4K38r9
6322A06l02J36J92k7p0J15j76j04q0L08l39l8J63N2J44j44k20J89M36l43p7J43
6344F4j70J62JJ20k0j0l02K10R7k23J02l0n7O7J0K5k1p7Q7j93J25k5p9L22J27
6369C12l25j02K31r8R7J82j17n33N49k67Q3k14L9L02l14K66j95n9K04J45k4r2
6391G0J05q3l41j2K21Q4k78L41k38O0R8l3K95n03L21l91M00j03J38m40M73k02
$$ plain form
6413 -18 8 111 0 -26 -52 127 -59 176 3 75 157 -110 34 -42 281 -29 -131 -83 -168 207 129 91 -82 106
6437 106 60 -12 -246 1 -199 -38 26 34 -102 -202 -73 332 20 -13 66 2 -33 -213 -103 18 110 94 -13 84
6461 84 -39 -16 19 94 -106 -22 -81 49 -188 194 -128 159 66 -221 -18 124 149 72 88 104 -345 -56 -40 142
6485 142 -86 -153 -47 51 132 119 -202 121 147 178 -71 -145 32 -141 -105 -155 -173 105 146 26 70 280 138 -124
6509 -124 19 -100 -101 47 -285 52 101 66 -63 -3 69 111 -87 130 154 -114 -51 -37 -110 -108 -67 -285 -388 -129 -100
6534 -100 -72 173 12 -116 -122 133 -2 -113 -55 -64 141 -101 105 -97 -15 -16 73 -198 129 63 289 -200 72 251
6558 251 -25 -32 -7 141 9 -48 -15 60 37 67 -33 40 218 17 40 -67 184 96 -248 -108 32 -36 39 158
6582 158 -81 50 -137 116 176 169 273 85 -219 67 -28 -137 111 43 115 -201 -116 90 -130 160 -124 97
$$ packed form
6413a8K6J03j11k6k6J79j86K35j73P2Q2k67J44p6L23l10j02M8q5L75p8l8j73J88
6437A06m6p2k34K47k00J61O4Qj36j00J29M05l12l3P9o4l5j80J10J21R2j6j07R7
6461H4j23K3L5P5k00Q4n9J30k37L82l22K87r3k87K03J42K5p7J6J6m49K89J6J82
6485A42k28o7J06R8Q1j3l21L23K6L1k49p4J77j73L6n0j8K78M1j20M4K10j42k62
6509a24J43j19jJ48l32L37M9l5j29O0P2M2j98K17K4k68O3J4p3KM1k18j03K59K9
6534a00K8K45j61j28oK55j35j11N8rK05k42K06k02Q2jQ9k71L27o6K26m89K72J79
6558B51k76pK5J48j32n7L3P5k3L0j00P3J78k01K3j07K51q8l44J40J40o8P5J19
6582A58k39J31j87K53O0pJ04j88l04K86r5j09K48o8P2l16Q5K06k20K90k84K21
$$ plain form
6604 97 72 -136 -49 15 -36 -65 33 -69 -81 42 -105 100 -11 -20 330 -20 -121 -35 89 -51 -121 57 -106 240
6628 240 -48 20 17 -71 -28 175 93 -281 -141 9 219 23 62 54 -26 -90 -160 79 275 -208 243 133 36 50 -10
6653 -10 -112 58 256 151 272 -194 -106 71 -199 -98 -101 79 59 -4 162 146 -27 152 193 -168 -183 -61 -175
6676 -175 128 -88 -71 -44 -254 173 -176 -295 -26 -40 305 -70 -64 93 -114 233 -64 30 303 -15 -11 -159 -246
6699 -246 173 -197 -76 76 -63 166 317 -219 13 132 112 275 -38 27 -46 -69 -88 266 411 114 -1 -241
6721 -241 82 -8 75 -31 -131 -162 27 125 -38 -274 127 -72 -30 -67 169 75 -128 54 -127 43 -50 93 -110
6744 -110 111 -71 146 102 52 -6 50 32 107 -32 -77 116 -372 -45 393 31 160 109 -98 -226 -104 -31 -109
6767 -109 155 161 -142 62 162 128 142 -3 71 88 130 -300 -49 -260 -83 -113 -243 167 7 -76 72 6 155
$$ packed form
6604I7k5k08Q7O4n1k9R8j02j2J23j47K05j11rL50l50j01Q6J24j40p0J78j63L46
6628B40k88O8lq8M3K03q2l74J40J50K10j96L9qq0o4p0K39J96m83M51j10r7J4o0
6653a0j02J70J98j05J21m66Q8J77k70J01lJ80k0o3J66j6j73J79M1l61j5J22j14
6676a75L03k16J7K7k10M27l49j19K69j4L45l75OJ57k07L47k97R4K73l18Mj48q7
6699b46M19l70J21J52j39K29J51n36K32J19k0J63l13O5p3k3j9L54J45k97j15k40
6721b41L23r0Q3j06j00l1J89R8j63k36M01j99M2l7K36r4k03J82j81J70r3J43k03
6744a10K21j82K17m4n0n8N6j8P5j39m5J93m88L27M38l62J29n1k07j28J22P3p8
6767a09K64Ol03K04J00l4J4j45P4J7M2m30K51k11J77l0j30M10j60q3J48o6J49
$$ plain form
6790 155 66 114 52 -162 191 45 -20 -159 -72 -151 130 203 -111 19 -46 173 -29 -235 -139 64 297 -17 146
6813 146 -63 67 29 -143 -32 -201 -105 -256 -161 -35 -95 163 313 14 79 -78 247 -125 -92 -340 -117 -97
6835 -97 -104 -190 -61 181 84 -122 134 -208 -20 48 91 147 15 -85 -100 72 -293 -164 54 -186 120 46 146
6858 146 7 -101 -9 -19 -256 39 131 33 223 2 -27 135 188 -47 231 100 -26 249 -40 -160 4 -86
6880 -86 278 320 -237 -26 -79 189 444 -148 43 -74 171 9 -361 13 -116 -2 -38 77 -72 -40 39 -75
6902 -75 -98 49 -186 -55 -140 -13 -148 -272 258 138 -223 -64 -86 -64 -76 113 62 -111 -144 -261 -51 241 37
6925 37 -130 -58 -35 -140 259 24 -28 81 -104 16 183 -47 100 320 31 61 23 155 76 -190 -157 -181 -71
6948 -71 180 -141 69 185 223 30 173 133 -45 -180 -93 -124 94 127 172 152 39 -132 30 212 12 43 -91
$$ packed form
6790A55q9M8o2k14L53j46o5j39Q7p9K81P3l14J30o5K19k02k06R6K03K33l14J63
6813A46k09J30l8j72J11j69R6j51R5J26o0K58J50k99O5j57L25l72L3k48K23K0
6835i7pq6J29K42r7k06K56l42J88O8M3N6j32j00j5J72l65J29K18k40L06p4J00
6858A46j39j08R2j0k37K95R2r8J90k21k9J62N3k35K78j31j26K75k89j20J64r0
6880h6L64M2n57K11n3K68K55n92J91j17K45j62l70L74j29J14l6J15j49L2P9j14
6902g5k3J47k35J31q5J27j35j24N30j20l61J59k2K2j2J89n1j73l3j17K10K92k04
6925C7j67P2K3j05L99k35n2J09j85J20J67k30J47K20k89L0l8J32p9k66L3k4J10
6948g1K51l21K10J16L8j93J43m0j78j35Q7l1K18L3M5k0j13j71J62J82k00L1j34
$$ plain form
6971 -91 12 -19 -205 -8 -145 -150 -11 -344 185 41 -74 -231 -53 -23 -310 42 71 -194 192 -179 -166 56
6993 56 123 80 32 29 -227 66 23 160 145 -114 65 -86 240 195 -50 48 -129 -132 -157 -46 83 264 148 -14
7017 -14 -208 61 75 114 -79 24 -26 163 14 121 -216 -19 34 11 -107 -22 -118 -23 238 -354 245 -141 177
7040 177 120 83 -35 -17 -118 57 36 15 -124 173 -44 -65 -138 -52 105 -172 -11 -42 -159 -264 -222 201 7
7063 7 66 150 16 -7 -41 119 -146 -164 -56 -121 75 126 176 -215 -170 15 -92 -24 -147 -27 293 -53 118 -122
7087 -122 94 -11 -22 32 108 50 28 -9 -345 -68 86 172 -205 128 144 55 159 12 52 36 -36 26 -133 128
7111 128 -101 272 -51 -96 -106 -18 -189 94 -13 40 55 120 -129 -92 -86 202 -41 -152 -109 112 200 -12 94 194
7135 194 116 164 -194 -15 -163 -200 -117 8 105 -101 245 101 -86 150 -84 -65 48 59 -48 -11 394 96 62
$$ packed form
6971i1J03l1j86J97j37nJ39l33N29j44j15j57J78L0k87L52K9k65L86l71J3K22
6993E6O7m3m8lk56K93m3J37j5k59J79j51L26m5k45R8j77lk5J11J29J81j16j62
7017a4j94K69J4L9j93J03n0J89j49J07l37J97N3k3j18Q5r6R5K61n92N99l86L18
7040A77n7l7j18J8j01J75k1k1j39K97k17k1p3Q6J57k77J61l1j17j05M2M23j94
7063GN9Q4j34k3l4J60k65j8J08o5J96N1N0l91M5J85j07O8j23J20L20l46J71k40
7087a22K16j05j1N4P6n8k2l7l36K77J54Q6l77L33J6q9J04j47M0j6p2O2j59K61
7111A28k29L73l23m5j0Q8j71K83j07N3J5O5k49L7OK88k43j11M3K21Q8k12J06J00
7135A94p8M8l58J79j48l7Q3J25R7k06L46j44j87K36k34J9J13J1j07L7M05k98l4
$$ plain form
7158 62 22 -14 188 16 62 126 157 295 42 61 164 -204 45 -153 94 169 116 -106 29 -125 -74 -16 111 -115
7182 -115 78 184 35 53 240 -62 -35 -221 -125 108 -113 -184 54 -10 110 -166 -112 113 98 137 -139 378 336
7205 336 -25 139 199 -100 119 -33 166 -49 89 -85 67 -288 -100 -88 -174 -13 -69 67 -249 84 -27
7226 -27 -216 -66 163 -146 -119 193 -125 71 344 150 10 189 -37 -194 218 154 65 -169 31 -80 117
7247 117 159 19 153 163 57 202 50 -119 127 162 -54 -237 140 113 187 -91 249 -94 371 -269 -51 -115
7269 -115 6 50 83 -165 -210 103 -79 -189 242 -19 -188 112 168 -113 166 -174 12 -136 -79 52 101 139
7291 139 -116 -23 -188 -21 -68 -77 -82 -35 211 91 -208 6 20 48 -193 111 -109 -166 115 86 107 44 -135 -58 219
7316 219 81 10 -22 116 -39 149 197 -193 113 131 -59 163 -106 354 52 17 73 102 -62 38 -100 -110 215
$$ packed form
7158F2m0l6K02j72M6O4L1J38k53J9J03l68K49j98K47P5n3k22J35j54N1N8J27k26
7182a15J93J06j49J8J87l02K7j86R6K33k21p1K38o4J20k76N4K25j5L9k76N17m2
7205C36l61J64O0k99K19j52J99k15J38j74J52l55J88J2q6J61n6J36l16L33j11
7226b7j89J50K29l09K7L12l18J96K73j94j40J79k26j57M12o4q9k34K00j11J97
7247A17M2j40J34J0j06J45j52j69K46L5k16j83L77k7P4k78L40l43M65o40K18o4
7269a15J21M4L3k48m5L13j82j10M31k61j69L00N6k81K79l40J86j48N7J31M9L8
7291A39k55R3j65J67m7rnM7K46j20k99K14J4K8k41L04k20n7K81k9K1o3j79P7K77
7316B19j38p1l2J38j55J88M8l90L06J8j90K22k69M60l02l5N6K9j64J00j38j0L25
$$ plain form
7339 215 -39 28 -43 20 12 -99 253 154 -14 -253 -80 -122 28 151 -36 -90 189 -8 23 9 -181 -88 -97 -154 -38
7364 -38 -129 74 -300 -140 -282 13 23 10 -1 -360 -107 -45 129 126 -86 -13 106 4 133 8 -154 -127 -56 -306
7388 -306 3 -229 96 100 188 49 143 -32 -5 125 39 17 80 145 -181 -174 60 -99 -30 209 -4 -163 112 57
7412 57 -83 15 172 30 -3 40 -39 -186 -42 92 11 -57 -54 -20 48 91 -108 -90 -78 159 204 -110 269 -157 154
7437 154 -111 -36 -147 -29 -86 -190 -207 -50 -120 -40 -9 -9 128 18 -8 137 -26 41 -44 -43 -97 18 -64 -177 276
7462 276 148 -186 -74 -49 -64 92 60 186 -158 143 -230 163 -88 -25 -179 146 163 61 -154 -46 103 82
7484 82 130 186 98 168 77 166 11 -62 -158 -211 -223 63 136 -60 8 245 -22 -141 -17 -161 178 -144 -227 25 134
7509 134 47 -175 -32 26 26 -339 3 268 -32 117 -158 82 188 -24 -190 97 116 -24 -146 -37 85 -135
$$ packed form
7339B15k54O7p1O3qj11L52r9j68k39J73m2J50J23j87n4K79j97L1j4j90R3rn7J16
7364c8r1K03l74J60j42K95J0j3j1l59K53O2J74lk12P3J19j02J29j25j62K7P1k50
7388c06L09k32L25MQ8j39R4j75K7J30q6k2O3O5l26PK34j59O9K39k13j59K75n5
7412E7j40R8J57j42l3M3p9j47J44J34q1o8LL4O8M3j99J8J2K37M5l14L79m26L11
7437A54k65P5j11J18n7j04j7J57p0Q0L1%J37j10k6J45j63O7q5Jn4J15q2j13M53
7462B76j28l34J12K5j5J56l2J26l44L01l73L93k51O3j54L25J7j02k15J08J49k1
7484H2M8N6q8P0r1Q9j55p3r6n3j2K86P3j96O8K37k67j19J24j44L39l22q3K52J09
7509A34q7k22J43N8%l65L42K65l00J49k75K40J06k12j66K87J9j40j22J09J22k20
$$ plain form
7531 -135 -22 40 26 -143 -21 -134 -26 90 90 -33 75 -101 -205 82 -46 -215 45 4 -159 81 204 234
7553 234 48 32 -83 57 -186 162 -64 88 -160 -36 74 74 175 434 -40 -2 20 -213 162 57 46 1
7575 1 -19 57 -18 171 122 6 37 -10 -263 -19 -53 -109 48 -155 -29 -72 -181 -35 -169 27 245 193 8 -155
7599 -155 -13 -66 -38 -129 -107 225 137 -8 166 -84 -102 -79 -391 -14 252 -15 55 -385 157 43 -102 19 8
7622 8 66 -199 -54 -84 29 -28 82 35 140 179 61 -30 48 -90 -44 145 93 15 71 118 73 74 130 -109 -66 -23 79
7649 79 -30 24 197 -25 -66 50 263 -173 12 263 22 -217 -75 40 -277 271 -94 127 128 -26 -227 -156
7671 -156 166 258 178 17 82 -174 38 -39 -143 23 242 -23 186 -29 49 119 6 28 -112 -48 51 69 146 265
7695 265 -26 -60 -228 33 205 13 115 -40 -121 -236 -11 -45 -21 -70 -31 -33 -58 65 -161 178 66 -100 180
$$ packed form
7531a35J13O2j4j69J22j13J08J16%j23J08j76j04K87j28j69K60m1j63K40J23L0
7553B34j86j6j15J40k43L48k26J52k48J24J10%J01K59m74L8K2k33L75j05j1m5
7575Ak0P6p5J89m9j16L1m7k53K44l4n6J57k03J26m3j09J46j34J96K18n2j85j63
7599a55J42n3K8r1K2L32q8j45J74k50j8K3l12L77K66k67P0m40N42j14j45J21j1
7622HN8k65J45l0J13n7J10m7J05L9j18r1P8j38M6J89n2p8N6M7m5JN6k39M3M3J02
7649G9j09N4J73k22m1J16K13m36J85K51k41k39J42J15l17N48l65K21Jj54k01P1
7671a56L22R2q0j61O5k56K12p7j04J66K19k65K09k15P8P0j13K2j40O4R9J8P7J19
7695B65k91l4j68K61J72j92J02j55q1j15K25l4K4m9L9kk5J23k26L39j12j66K80
$$ plain form
7718 180 -37 -96 99 97 63 28 -205 -92 25 41 86 219 44 146 -72 26 -9 -56 -269 -34 -110 100 68 -3
7742 -3 -37 -204 -152 71 107 147 -207 8 -36 -106 120 105 47 17 34 -28 216 -386 -96 91 417 -184 225 -222
7766 -222 372 -35 60 177 205 182 84 64 -11 367 90 88 26 -29 -85 145 146 31 95 139 -29 97 100 -82 176 125
7792 125 142 188 -30 -151 -4 233 -175 -118 299 38 7 0 -110 -73 -59 30 -91 -35 -426 -150 131 -64 -6 44
7816 44 -50 27 -6 -200 -56 -19 -46 -50 9 84 -26 95 26 199 -105 -167 103 99 332 168 195 -9 -72 -77 201 56
7842 56 8 345 -36 50 179 40 100 -54 164 80 5 15 149 51 132 41 -82 186 123 -121 139 -120 235 132
7866 132 218 -200 -74 -104 35 122 72 73 11 -39 36 -99 81 9 -90 -30 60 4 -192 4 -36 310 76 -219 172
7891 172 278 74 190 -11 236 89 115 -138 -35 86 192 -63 15 -174 25 -80 101 283 34 -49 200
$$ packed form
7718A80k17n9J95kl4l5k33J13J17J6M5J33j75J02k18R8l5m7k13K35p6K10l2p1
7742cl4j67N2K23L6M0l54K15m4p0K26j5n8l0J7o2K44o02K90J87L26o01M09m47
7766b22N94m07R5J17K8k3r8k0p5L78k77ko2n5n6K30Jj15O4M4j68J26Lj82K58n1
7792A25J7M6k18j21J47K37m08N7M17k61l1pj10L7J4Q9j21N6l91K76K81j95N8N0
7816D4r4P7l3j94J44L7k7mN9P5j10J21o9J73l04o2K70mK33j64K7k04o3nK78j45
7842E6m8L37l81Q6J29j39O0j54K18q4p5J0J34r8Q1r1j23K68o3k44K60k59L55j03
7866A32Q6m18J26l0J39Q7n0Jo2n0P5j35J80p2r9O0R0n6j96J96m0L46k34k95L91
7891A72J06k04J16k01K47j47K6k53J03J21J06k55P8j89J99j05J81J82k49q3K49
$$ plain form
7912 200 220 -49 62 -4 60 -84 216 72 343 -44 -83 98 174 63 197 25 78 297 86 -398 163 104
7934 104 -294 -52 77 8 91 10 -293 91 86 133 12 -130 25 110 114 149 -31 -86 -32 83 105 4 -47 215 65
7959 65 -22 208 -29 -89 74 -79 -65 -15 -53 158 62 10 273 -63 112 0 72 -67 70 -228 171 -239 36
7982 36 -83 -301 30 116 110 250 -36 -65 -3 197 -96 -158 203 180 -116 159 -242 -28 19 248 129 -197 252
8005 252 -13 139 85 183 -202 -192 -14 312 -90 -47 -73 -170 -148 -13 100 55 -97 127 -110 233 156 7 -148
8028 -148 41 141 -55 176 -129 12 126 -35 -268 44 -148 345 -74 -22 113 32 10 36 87 71 -39 -30 218
8051 218 84 -58 -15 -173 -24 -151 161 -3 124 -6 -13 81 19 83 -25 -37 -73 110 -51 -128 64 -24 97
8074 97 230 128 89 35 -20 218 203 -139 -64 -43 -7 463 51 385 11 124 -80 -138 -35 131 -1 11 -7 -36
$$ packed form
7912B00K0k69J11o6O4j44L00j44K71l87l9J81P6j11J34j72N3K19k11m84N61n9
7934A04l98K42J29o9Q3q1l03L84nM7j21j42J55Q5ML5j80n5N4J15K2j01n1K62j50
7959F5q7K30k37o0J63j53J4N0l8K11r6n2K63l36J75j12P2j39J37k98L99m10K75
7982C6j19k18L31Q6oJ40k86k9O2K00k93o2L61k3k96K75m01K14M7K29j19l26M49
8005B52k65J52n4R8l85J0J78L26m02M3k6r7K2J35J13m5j52K24k37L43p7j49j55
8028a48J89J00j96K31l05J41J14j61k33L12j92M93m19N2J35q1k2K6N1j6j10RK48
8051B18j34j42M3j58J49j27L12j64J27j30pR4o2O4j08j2l6J83j61p7J92q8J21
8074I7J33j02l9n4n5K38j5l42P5K1L6M70m12L34l74J13k04n8J03J66j32J2j8k9
$$ plain form
8098 -36 26 -26 -118 212 -89 -125 -78 122 -121 -39 251 -162 122 -121 13 -144 168 -62 -16 -5 -213 35 -90
8121 -90 211 140 163 17 -87 -100 -8 -83 153 107 -131 96 46 31 47 -39 -77 145 10 -227 12 -64 -33 258 -124
8146 -124 -110 -11 31 16 51 104 51 235 70 -146 122 192 75 192 -50 -99 128 10 -145 33 71 -53 96
8169 96 -86 -218 176 -144 148 -51 -9 52 141 -59 -74 292 -79 -105 -241 87 -1 48 -188 89 -180 40
$$ packed form
8098c6O2n2r2L30l01l6M7K00k43Q2K90m13K84k43J34j57L12k30M6J1k08K48j25
8121i0L01p1K3j46j04j3R2p5K36m6k38K27n0j5J6q6l8K22j35k37K39p6L1K91l82
8146a24J4R9M2j5L5N3n3J84j65k16K68P0j17J17k42m9K27j18j55J78L8j24J49
8169I6j82j32L94l20K92j99M2O1Q9k00j5L66l71k6j36L28q8M9k36K77k69K20
8191D0
$$ Imaginary data points
##PAGE= N=2
##DATA TABLE= (X++(I..I)), XYDATA
$$ plain form
0 0 0 0 0 0 0 0 0 0 0 0 0 8 -8 8 -8 8 -16 16 -24 24 -32 40 -48 56 -64 75 -88 103 -117 135 -155 178 -202
33 -202 228 -259 291 -327 367 -411 460 -513 570 -633 700 -776 858 -947 1045 -1151 1268 -1396
51 -1396 1538 -1694 1868 -2062 2281 -2526 2807 -3130 3507 -3956 4496 -5164 6013 -7137 8699
66 8699 -11037 14989 -23469 85965 -122188 -102799 -34953 -88596 217957 -54887 -149913 79240
78 79240 -13803 144220 110026 -217658 -5042 -14513 -37884 139262 -107389 -42950 142044
89 142044 -57382 65880 -8075 -149736 107020 -20122 -83366 72607 -79994 78268
99 78268 119087 -135776 505 -18838 -32013 140368 -98803 -100127 68411 -13201 134012
110 134012 25263 -185632 24790 8970 25736 99155 -151389 -46521 102253 3557 99131
$$ packed form
0@%%%%%%%%%%%Qj6J6j6J6k4L2m0M8n6P2q8J04j20J39j63J91k20K52k90L33l80
33b02M30m87N50o18O94p78Q71r73J083j203J333j476J634j805J992k196K419k664
51a396K934l232L562l930M343m807N333n937O637p463Q452r660J1177j3150J5836
66H699j9736K6026l8458J09434k08153J9389O7846n3643L06553k72844r5026K29153
78G9240r3043J58023l4194l27684K12616r471k3371J77146k46651O4439J84994
89A42044j99426J23262p3955j41661K56756j27142o3244J55973j52601J58262
99G8268M0819k54863J36281j9343j3175J72381k39171j324J68538q1612J47213
110A34012j08749k10895K10422j5820J6766P3419k50544J04868J48774r8696R5574
$$ plain form
121 99131 -52152 -144988 76291 6985 18164 46965 -120142 37497 78971 -36335 55463
132 55463 -60683 -54851 88593 -46847 4037 43091 -56151 73644 6547 -74577 55271
143 55271 -22543 2352 46432 -89825 19830 61182 -14851 50005 -59719 -60867 77033
154 77033 -4038 12044 -3662 -88776 58046 54821 -19052 18915 -77880 -19039 78825 -20648
166 -20648 5517 -16402 -54491 68572 15771 -29553 12745 -55843 10973 44231 -37917 18142
178 18142 -6126 -26226 45705 -24630 -15371 28130 -35959 12742 7018 -33052 40901 1310
190 1310 -21165 15878 -34067 11874 34583 -29485 3395 -10248 -10392 49358 -6988 -20292 2243
203 2243 -24337 30158 23223 -28092 5009 -10532 3772 39062 -17241 -11129 3903 -15090 27218
$$ packed form
121I9131j51283r2836K21279o9306J1179K8801j67107J57639M1474j15306R1798
132E5463j16146N832J43444j35440N0884L9054r9242J29795o7097q1124J29848
143E5271p7814K4895M4080j36257J09655M1352p6033O4856j09724j148J37900
154G7033q1071J6082j5706q5114J46822l225p3873L7967r6795N8841R7864r9473
166b0648K6165k1919l8089J23063n2801m5324M2298o8588O6816L3258q2148N6059
178A8142k4268k0100P1931p0335R259M3501o4089M8701n724m0070P3953l9591
190A310k2475L7043m9945M5941K2709o4068L2880j3643j44N9750n6346j3304K2535
203B243k6580N4495o935n1315L3101j5541J4304L5290n6303O112J5032j8993M2308
$$ plain form
216 27218 7993 -18825 11587 -9131 4128 20492 -16345 3160 3002 -12954 17339 -1135
228 -1135 -5021 14115 -13717 -181 8895 -9594 10689 -2257 -14123 9431 -2543 2954 8778
241 8778 -16170 -2253 3585 -3448 9664 -6888 -10751 4975 -2628 4682 2306 -13407 -182
254 -182 248 -1672 6621 -6797 -5389 2816 -3367 3278 661 -6942 832 -1384 -157 4883 -3223
269 -3223 -1160 941 -2245 3225 1393 -1847 1417 -1377 1034 3710 -237 982 245 -1035 3279
284 3279 2108 378 1974 -293 1489 2795 1320 1365 719 592 1800 1684 1546 803 467 1072 1134 977
302 977 1145 274 79 434 510 286 54 -446 -63 -123 -526 -103 -386 -901 -643 -672 -883 -1008 -985 -583 -1090 -978
324 -978 -1063 -1812 -536 -620 -2112 -431 -1410 -1810 -169 -1558 -832 -72 -2330 194 -327 -2019 1007 -1513
$$ packed form
216B7218j9225k6818L0412k0718J3259J6364l6837J9505j58j5956L0293j8474
228a135l886J9136k7832J3536R076j8489K0283j2946j1866K3554j1974N497N824
241H778k4948J3917N838p033J3112j6552l863J5726p603P310k376j5713J3225
254a82M30j920Q293j3418J408Q205o183O645k617p603P774k216J227N040q106
269c223K063K101l186N470j832l240L264k794K411K676l947J219p37j280M314
284C279j171j730J596k267J782J306j475M5o46j27J208j16j38p43l36O05O2j57
302I77J68q71j95L55P6k24k32n00L83o0m03M23k83n15K58k9k11j25K3M02n07J12
324i78q5p49J276q4j492J681r79m00J641j389P26P60k258K524n21j692L026k520
$$ plain form
342 -1513 -1274 1764 -2030 196 1026 -2072 2206 -216 -1502 3030 -1512 952 2940 -3372 2821 2437
358 2437 -1644 4657 -1893 -1093 5874 -1405 2395 1816 -4882 6056 2326 -1751 4966 -5158 753
373 753 7345 -3846 3293 -548 -5365 9049 -1162 -2591 5137 -7172 3815 5042 -8018 5129
387 5129 -1377 -4613 8251 -7611 -1247 7102 -8087 4506 -1432 -10010 10548 -2570 -4515 4457
401 4457 -12970 5017 9217 -11366 3159 -7184 -5911 17149 -6698 -6045 1762 -12472 13741
414 13741 6621 -14667 4177 -8023 1234 17549 -13535 -2749 3277 -9335 17397 -2114 -13602
427 -13602 11835 -7453 4254 11549 -17855 8499 6229 -10231 13935 -9310 -3079 19992 -13046
440 -13046 1307 4735 -12357 22070 251 -16847 10376 -9017 11557 18694 -24720 547
$$ packed form
342a513K39L038l794K226Q30l098M278k422j286M532m542K464J988o312O193l84
358B437m081O301o550Q00O967p279L800n79o698J0938l730m077O717j0124N911
373G53O592j1191P139l841m817J4414j0211j429P728j2309J0987J227j3060J3147
387E129o506l236J2864j5862O364Q349j5189J2593n938q578K0558j3118j945Q972
401D457j7427J7987M200k0583J4525j0343J273K3060k3847O53P807j4234K6213
414A3741p120k1288J8844j2200R257J6315l1084J0786O026j2612K6732j9511j1488
427a3602K5437j9288J1707P295k9404K6354k270j6460K4166k3245O231K3071l3038
440a3046J4353L428j7092L4427k1819j7098K7223j9393K0574P137m3414K5267
$$ plain form
452 547 3329 -2774 26793 -14223 -18952 13274 -5449 17801 6264 -31282 8306 4368 525
465 525 19228 -25299 -8683 17676 -9235 13690 -5096 -23380 20271 -3479 -5380 12216 -22328
478 -22328 8797 12436 -22068 10948 -4485 -6939 23263 -21796 -8875 15354 -10594 18533
490 18533 -5423 -30288 19179 2769 4369 12103 -36362 2563 22937 -5125 15583 -21526
502 -21526 -22335 31910 1737 3280 416 -33861 19737 19788 -10247 10754 -23114 -4260 32165
515 32165 -11864 2054 246 -19871 26855 826 -15676 16702 -13468 6444 15299 -25848
527 -25848 12362 9317 -11061 16579 -19970 -7291 29267 -9842 2802 -5355 -25029 30161
539 30161 9813 -14189 3287 -26491 10976 32056 -18359 -3071 -13293 -11781 37746 -3526
$$ packed form
452E47K782o103K9567m1016m729L2226j8723K3250j1537l7546L9588l938l843
465E25J8703m4527J6616K6359k6911K2925j8786j8284M3651k3750j901J7596l4544
478b2328L1125L639l4504L3016j5433k454L0202m5059J2921K4229k5948K9127
490A8533k3956k4865M9467j6410J600P734m8465L8925K0374k8062K0708l7109
502b1526q09N4245l0173J543k864l4277N3598N1l0035K1001l3868J8854L6425
515C2165m4029J3918j808k0117M6726k6029j6502L2378l0170J9912Q855m1147
527b5848L8210l045k0378K7640l6549J2679L6558l9109J2644q157j9674N5190
539C0161k0348k4002J7476k9778L7467K1080n0415J5288j0222J512M9527m1272
$$ plain form
551 -3526 -18001 1382 -20226 21919 18132 -26510 2551 -9065 -1894 28363 -18159 -8736 8696
564 8696 -14547 17724 -50 -20013 17530 -6807 -4341 12630 -19791 10994 12839 -19361 7419
577 7419 -7022 -2124 27137 -14979 -10170 5329 -9169 25723 4262 -25873 5889 -3718 11875
590 11875 22311 -25287 -7422 6990 -799 25666 -8985 -22253 11427 -2550 13198 10412
602 10412 -25365 4097 6206 -2608 17587 -13448 -8421 13894 -9035 7721 3810 -14963 12836
615 12836 -3339 -9040 12363 -8738 4206 7157 -18469 5228 4716 -3435 11864 -14966 -9778
628 -9778 13320 -2068 7686 -3402 -20758 9564 6041 581 5721 -19487 -2962 13648 -2218
641 -2218 6386 -8435 -14305 12916 2148 401 3004 -15438 3845 8254 -4546 6890 -6278
$$ packed form
551c526j4475J9383k1608M2145l787m4642K9061j1616P171L0257m6522R423J7432
564H696k3243L2271j7774j9963L7543k4337K466J6971l2421L0785J845l2200K6780
577G419j4441M898K9261m2116M809J5499j4498L4892k1461l0135L1762r607J5593
590A1875J0436m7598J7865J4412p789K6465l4651j3268L3680j3977J5748k786
602A0412l5777K9462K109q814K0195l1035N027K2315k2929J6756l911j8773K7799
615A2836j6175n701K1403k1101J2944K951k5626K3697n12q151J5299k6830N188
628i778K3098j5388R754j1088j7356L0322l523n460N140k5208J6525J6610j5866
641b218Q604j4821n870K7221j0768j747K603j8442J9283M409j2800J1436j3168
$$ plain form
654 -6278 -6353 10204 -4220 2141 5381 -8629 5124 164 -4735 10115 -2372 -2200 3798 -7573
668 -7573 6628 7165 -5177 2486 -5177 -1419 11932 -1542 -1987 -1132 -6503 9185 5402 -4764
682 -4764 130 -6180 1769 9544 -3193 -1329 -2295 -4776 7828 1905 -3362 627 -5729 1790 5056
697 5056 -3107 928 -2695 -3951 4257 -911 -584 1106 -5404 395 1322 -1650 2851 -3221 -4030 1676
713 1676 -1424 1638 1195 -5148 -464 -7 126 3324 -2633 -2821 578 -290 3234 958 -3531 -359
729 -359 -210 1350 2956 -1619 -1093 262 196 3076 890 -1434 249 -183 1543 2715 -111 -126 -47 347
747 347 2327 1021 -241 101 -730 1170 1773 371 620 -647 -171 1346 983 135 -332 -961 -19 967
765 967 295 -41 -808 -494 414 350 166 -616 -1436 -689 218 -170 -343 -853 -947 -207 -190 -231 -924 -1182 -654 -432
$$ packed form
654f278p5J6557j4424O361L240j4010J3753m960m899J4850j2487J72N998j1371
668g573J4201N37j2342P663p663L758J3351j3474m45Q55n371J5688l783j0166
682d764M894o310P949P775j2737J864r66k481J2604n923n267L989o356P519L266
697E056q163M035l623j256Q208n168L27J690o510N799R27k972M501o072q09N706
713A676l100L062m43o343M684M57J33L198n957j88L399q68L524k276m489L172
729c59J49J560J606m575N26J355o6K880k186k324J683m32J726J172k826j5P9L94
747C47J980j306j262L42q31J900O03j402K49j267M76J517l63q48m67o29R42R86
765I67o72l36p67L14R08o4j84p82q20P47R07l88j73n10r4P40J7m1o93k58N28K22
$$ plain form
787 -432 -351 -322 -754 -645 -502 -511 -116 -628 -789 -304 -252 208 172 -331 -92 -103 194 489 213 321 201 113 679
810 679 503 -138 663 287 362 1041 198 531 998 211 1046 815 260 1113 240 426 971 -318 805 750
830 750 -517 961 25 -160 1409 -611 -85 916 -824 957 83 -1294 1178 -580 -563 799 -1853
847 -1853 152 633 -1532 725 -1197 -1496 1691 -1505 -791 319 -2438 1076 107 -2489 848 -1935
863 -1935 -811 1748 -2712 54 475 -2204 2056 -1245 -2099 2131 -1490 430 1318 -3451 1717 1318
879 1318 -1554 2434 -2393 -824 4036 -1841 1056 504 -2859 4206 957 -2022 2107 -2762 1737
894 1737 4032 -3048 1418 191 -1554 5441 -1214 -1835 2737 -2184 3234 2108 -4366 3113 383
909 383 -950 4294 -3779 -44 3895 -3217 2408 -878 -3921 5534 -1383 -2176 2167 -4942 3216 3141
$$ packed form
787d32Q1K9m32J09J43rL95n12j61M85N2M60l6n03K39j1K97K95k76J08j20q8N66
810F79j76o41Q01l76P5O79q43L33M67p87Q35k31n55Q53q73J86N45j289J123n5
830G50j267J478r36j85J569k020N26J001j740J781q74j377K472j758J7J362k652
847a853K005M81k165K257j922k99L187l196P14J110k757L514r69k596L337k783
863a935J124K559m460K766M21k679M260l301q54M230l621J920Q88m769N168l99
879A318k872L988m827J569M860n877K897n52l363P065l249k979M129m869M499
894A737K295p080M466j227j745O995o655o21M572m921N418j126o474P479k730
909C83j333N244q073L735L939p112N625l286l043R455o917p93M343p109Q158p5
$$ plain form
925 3141 -5637 1357 -2311 -1117 6283 -4618 -2995 1305 -3547 5770 287 -7341 2361 -1758 1208
940 1208 4886 -7553 -737 2397 -2710 5401 -2980 -5189 5186 -2287 1043 2489 -6707 3956
954 3956 1789 -3919 4120 -3775 -168 6277 -5276 496 2006 -3121 7161 -1885 -5323 4849
968 4849 -1726 3710 3664 -8764 2328 3461 -195 6508 -6435 -4066 6845 -702 4413 -739 -8888
983 -8888 5878 2440 -92 3738 -8276 -25 6834 -3270 3154 -2658 -5530 7585 -1690 -1860
997 -1860 2905 -6169 3689 2589 -6221 3801 -1425 -1877 5058 -6693 -720 4961 -4072 3149 -3289
1012 -3289 -6388 7526 -244 -1098 698 -8914 3895 5866 -3858 1251 -6204 -2619 9881 -1773
1026 -1773 -1616 -1195 -6713 7500 3506 -4537 1713 -5118 1311 7810 -4557 295 190 -3803 7216
$$ packed form
925C141q778O994l668J194P400j0901J623M300m852R317n483p628R702m119K966
940A208L678j2439O816L134n107Q111q381k209J0375p473L330J446r196J0663
954C956k167n708Q039p895L607O445j1553N772J510n127J0282r046l438J0172
968D849o575N436m6j2428J1092J133l656O703j2943K369J0911p547N115n152q149
983h888J4766l438k532L830j2014Q251O859j0104O424n812k872J3115r275j70
997a860M765r074R858j100q810J0022n226m52O935j1751N973N681r033P221o438
1012c289l099J3914p770q54J796r612J2809J971r724N109p455L585J2500j1654
1026a773J57M21n518J4213l994q043O250o831O429O499j2367M852j05l993J1019
$$ plain form
1041 7216 -1105 -3306 4325 -3445 2115 3195 -5051 4808 1492 -3400 3757 -3566 1087 6545 -4406
1056 -4406 176 -163 -2569 7900 -665 -4689 1409 -3173 4787 5259 -6520 -648 -1268 18 7540
1071 7540 -3872 -4716 1107 -2386 5518 1650 -6950 983 -1404 408 5043 -5208 -1696 1528 -3163
1086 -3163 4011 -713 -3771 2781 -2850 -419 2999 -3657 2072 369 -4788 2737 -462 -217 3005
1101 3005 -5176 -873 2727 -880 3816 -1992 -4759 3054 820 2171 1414 -6169 407 2941 513
1116 513 3493 -3163 -3412 3743 446 2532 406 -4407 1868 1850 417 2904 -2738 -1205 2729 -631
1132 -631 2355 674 -2527 1860 -577 178 3107 -1732 -162 -50 -2319 2606 957 -1579 391 -2479
1148 -2479 149 2995 -1105 -264 -1558 -2232 2773 530 -1243 -598 -3242 587 2305 -1057 -248 -2047
$$ packed form
1041G216q321k201P631p770N560J080q246R859l316m892P157p323M653N458j0951
1056d406M582l39k406J0469q565m024O098m582P960M72j1779N872o20J286P522
1071G540j1412q44N823l493P904l868q600P933k387J812M635j0251L512L224m691
1086c163P174m724l058O552n631K431L418o656N729j703n157P525l199K45L222
1101C005q181M303L600l607M696n808k767P813k234J351p57p583O576K534k428
1116E13K980o656k49P155l297K086k126m813O275j8j433K487n642J533L934l360
1132f31K986j681l201M387k437P55K929m839J570J12k269M925j649k536J970k870
1148b479K628K846m100Q41j294o74N005k243j773O45k644L829J718l362Q09j799
$$ plain form
1164 -2047 -1635 2261 146 -347 -759 -2323 826 1260 -441 176 -1808 -857 1376 -159 531 -228 -1820
1181 -1820 312 759 361 1489 -1249 -791 808 387 1599 445 -1132 219 191 1064 1395 -793 -385
1198 -385 334 632 1676 253 -880 -26 131 1521 1297 -279 -181 48 186 1493 16 -295 -365 -318 864
1217 864 965 47 -359 -728 -67 897 -139 -342 -673 -968 358 500 -185 -556 -983 -499 61 103 -214 -980
1237 -980 -972 -199 104 -209 -255 -850 -606 -34 330 -134 -683 -691 -246 -84 85 235 -525 -294 -53 509 179 -23
1259 -23 -393 -54 216 503 271 -30 -170 279 448 504 152 -5 -90 325 678 558 214 68 220 496 778
1280 778 172 122 119 -157 536 376 47 117 -328 374 286 -26 193 -216 28 129 70 -55 72 -396 -145 -368
1302 -368 -420 -185 -302 -647 -210 -216 -384 -90 -432 -235 -270 -469 255 -558 -517 -193 -602 -244 -273 -610 -228 23
$$ packed form
1164b047M12L896k115m93m12j564L149M34j701O17j984R51K233j535O90p59j592
1181a820K132M47l98J128k738M58J599m21J212j154j577J351k8Q73L31k188M08
1198c85P19K98J044j423j133Q54J57J390k24j576R8K29J38J307j477l11p0M7J182
1217H64J01r18m06l69O61R64j036k03l31k95J326J42o85l71m27M84N60M2l17p66
1237i80QP73L03l13m6n95K44N72L64m64n49qM45J62J69J50p60K31K41N62l30k02
1259b3l70L39K70K87k32l01j40M49J69N6l52j57q5M15L53j20l44j46J52K76K82
1280G78o06n0lk76O93j60l29P0m45P02q8l12K19m09K44J01n9j25J27m68K51k23
1302c68n2K35j17l45M37oj68K94l42J97l5j99P24q13M1L24m09L58k9l37L82K51
$$ plain form
1324 23 -305 440 -657 -560 505 -350 8 135 -539 479 23 -95 599 -488 272 630 -411 479 279
1343 279 -10 952 47 227 632 -163 817 352 -782 850 75 346 1116 -830 476 1015 -587 998
1361 998 -182 -489 1219 -306 169 608 -1003 781 679 -957 617 -808 -202 1360 -995 -338 217
1378 217 -1150 1068 -309 -1296 817 -1083 -166 791 -1620 -21 151 -770 966 -1229 -890 1064 -835
1395 -835 -111 -83 -1620 1215 212 -1408 683 -1502 128 1526 -1259 -110 -221 -922 2085 -9
1411 -9 -993 999 -659 1256 993 -1897 679 284 71 1986 -1042 -310 1066 -617 1354 185 -1445
1428 -1445 1656 245 57 1289 -1506 585 1555 -1293 1072 -356 -584 2190 -955 -677 1019 -998
1444 -998 1576 528 -2094 1094 -418 248 1799 -2468 -734 652 -607 1601 -1013 -2019 1467
$$ packed form
1324B3l28P45j097R7J065q55L58J27o74J018m56j18O94j087P60L58j041Q90k00
1343B79k89R62r05J80M05p95R80m65j134J632p75K71P70j946J306N39j602J585
1361I98j180l07J708j525M75M39j611J784j02j636J574j425O06J562k355O57N55
1378B17j367K218j377r87K113j900R17R57k411J599J72r21J736k195L39J954j899
1395h35P24K8j537K835j003j620K091k185J630J398k785J149j11p01L007k094
1411ir84J992j658J915k63k890K576l95k13J915l028P32J376j683J971j169j630
1428a445L101j411j88J232k795K091R70k848K365j428k28K774l145K78J696k017
1444i98K574j048k622L188j512O66J551m267J734J386j259K208k614j006L486
$$ plain form
1459 1467 -326 200 342 -2882 436 519 -810 1001 -1789 -918 1818 -925 213 140 -2075 1426 -3
1476 -3 -1183 932 -1423 54 1211 -1876 436 216 -822 1456 -1294 -835 1828 -202 1137 144
1492 144 -2184 1965 799 26 847 -2004 302 2324 -258 576 -759 -1544 2614 707 -138 443 -1722
1509 -1722 1463 1567 -1100 406 -974 -700 2231 -603 -382 771 -1293 1118 140 -1193 1224 -744
1525 -744 -335 843 -1540 635 696 -1247 544 -891 -585 1859 -854 -610 -271 -1383 1469 300 -1867
1542 -1867 232 -1155 429 1644 -1459 -625 -490 -785 1919 62 -1837 291 -756 701 1509 -1429
1558 -1429 267 -138 -506 1493 -377 -388 782 -884 707 693 -630 980 -249 -667 1181 -244 539
1575 539 838 -1371 357 618 245 1204 -838 -670 863 354 1152 203 -1434 616 265 570 885 -1556
$$ packed form
1459A467j793N26J42l224L318Q3j329J811k790Q71K736k743J138p3k215L501j429
1476cj180K115k355J477J157l087K312k20j038K278k750M59K663k030J339r93
1492A44k328M149j166p73Q21k851K306K022k582Q34j335p85M158j907q45N81k165
1509a722L185J04k667J506j380K74K931k834K21J153k064K411r78j333K417j968
1525g44M09J178k383K175O1j943J791j435L06K444k713K44L39j112K852j169k167
1542a867K099j387J584J215l103Q34J35k95K704j857j899K128j047J457Q08k938
1558a429J696m05l68J999j870j1J170j666J591j4j323J610j229m18J848j425P83
1575E39K99k209J728K61l73R59k042J68J533n09P98r49j637K050l51L05L15k441
$$ plain form
1593 -1556 -454 722 -61 1136 -25 -1412 547 -73 235 611 -1430 -150 234 -205 697 -663 -735
1610 -735 244 -551 46 254 -698 5 -267 -814 570 -66 -706 -81 -789 114 549 -561 -148 -767 -692 738
1630 738 -149 -247 -387 -850 461 640 130 85 -959 -172 1128 193 174 -166 -607 561 609 112 235 -377
1650 -377 129 632 226 428 -273 -241 400 588 397 564 -467 -40 222 396 664 -281 -289 70 -185 573 434
1671 434 -316 -400 -39 14 627 -51 -544 -291 -366 307 2 -582 -307 -323 -123 251 -277 -653 -573 -360 405 162
1693 162 -307 -587 -737 -95 25 -249 -184 -548 -469 148 109 36 -4 -293 142 209 292 11 -227 6 -82 238 255
1716 255 10 -143 57 338 288 160 64 20 263 402 439 191 33 120 276 220 154 369 -79 264 326 416 110
1739 110 24 -66 293 537 298 263 -18 -131 177 269 44 -185 -297 13 -36 49 -285 -221 -151 -114 56 -248 -21
$$ packed form
1593a556J102J176p83J197j161j387J959o20L08L76k041J280L84m39R02j360p2
1610g35R79p95N97K08r52P03k72n47J384o36o40O25p08R03M35j110M13o19P5J430
1630G38q87r8j40m63J311J79n10m5j044P87J300r35j9l40m41J168M8m97J23o12
1650c77N06N03m06K02p01L2O41J88j91J67j031M27K62J74K68r45qL59k55P58j39
1671D34p50q4L61N3O13o78m93K53p5O73l05n84K75j6K00L74n28l76Q0K13P65k43
1693A62m69k80j50O42J20k74O5l64P9O17l9p3m0k89M35O7Q3k81k38K33q8L20J7
1716B55k45j53K00K81n0j28r6m4K43J39L7k48j58Q7J56n6o6K15m48L43O2R0l06
1739A10q6r0L59K44k39l5k81j13L08R2k25k29j12L10m9Q5l34O4P0L7J70l04K27
$$ plain form
1762 -21 -118 -367 -93 -274 -73 -157 -469 -547 63 -88 -39 -233 -554 -19 -102 -179 -89 -207 -98 64 147 -29 65
1785 65 -292 -28 162 170 279 7 -111 -93 94 108 -54 -6 101 250 33 255 79 69 -94 130 331 168
1807 168 -81 243 66 -44 248 -223 245 -73 25 124 88 -66 267 -25 -23 -153 -233 469 -295 -288 162 -87 -191
1830 -191 114 -408 205 25 -172 1 -187 -348 -6 -465 -140 -309 -399 303 -152 -384 -140 -178 -124 285 -338
1851 -338 8 -123 -171 405 -300 -218 72 -114 164 2 -243 341 -18 -21 553 -595 191 30 69 247 -48
1872 -48 -199 528 331 317 345 -540 325 506 -54 352 39 -155 487 89 70 276 -230 440 210 -476 448
1893 448 -224 100 483 -619 37 284 -12 279 -468 -509 231 -271 -79 -74 -724 561 -39 -256 238 -649
1913 -649 -152 307 -386 -223 -287 -361 430 -374 -503 27 -493 304 98 -621 150 -153 -270 676 -396 -448 233
$$ packed form
1762b1r7k49K74j81K01q4l12p8O10j51M9j94l21N35q3p7R0j18J09J62Q3j76R4
1785F5l57K64J90QJ09k72j18J8J87J4j62M8J07J49k17K22j76j0j63K24K01j63
1807A68k49L24j77j10K92m71M68l18R8R9l6j54L33k92Kj30q0P02p64PM50k49j04
1830a91L05n22O13j80j97J73j88j61L42m59L25j69r0P02m55k32K44l8N4M09o23
1851c38L46j31m8N76p05Q2K90j86K78j62k45N84l59lN74j148P86j61L9J78k95
1872d8j51P27j97j4K8q85Q65J81n60M06l13j94O42l98j9K06n06O70k30o86R24
1893D48o72L24L83j102O56K47k96K91p47m1P40n02J92No50J285o00k17M94q87
1913f49M97M59o93J63o4p4P91q04j29N30n20P97k06p19P71l03j17R46j072n2O81
$$ plain form
1934 233 -250 434 10 -462 380 89 116 367 -470 9 571 -367 265 -138 -260 886 153 45 364 -361
1954 -361 473 330 -257 396 14 452 768 -434 81 470 -358 370 130 -281 338 -23 -78 246 -507 316
1974 316 258 -211 197 -343 -291 378 -155 -126 151 -481 358 36 -235 125 -474 -55 105 -453 -54 -278 -271 78
1996 78 -250 -220 196 -411 350 -149 -603 332 -182 -287 352 -570 -132 457 -98 -68 -99 -227 260 -109 -121 137
2018 137 -213 466 589 -399 28 -3 130 805 136 19 101 116 565 307 -218 469 -29 59 654 -229 -25
2039 -25 179 -64 163 22 -173 182 -312 -16 283 -120 366 -108 -47 204 -57 11 250 -372 -6 -117 -219
2060 -219 315 -146 -489 50 -244 225 244 -628 -42 -281 -59 271 -430 -380 56 -209 122 -72 -297 -83 -141
2081 -141 -47 449 -173 -91 -19 -292 219 127 -429 245 12 91 -13 200 334 -200 -122 177 299 285 151 -230
$$ packed form
1934B33m83O84m24m72Q42k91K7K51q37M79N62r38O32m03j22J146p33j08L19p25
1954c61Q34j43n87O53l82M38L16j202N15L89q28P28k40m11O19l61n5L24p53Q23
1974C16n8m69M08n40N2O69n33K9K77o32Q39l22k71L60n99M19J60n58L99k24PL49
1996G8l28L0M16o07P61m99m54R35n14j05O39r22M38N89n55L0l1j28M87l69j2K58
2018A37l50O79J23r88M27l1J33O75o69j17Q2J5M49k58n25O87m98Q8N95q83K04
2039b5K04k43K27j41j95L55m94K96K99m03M86m74O1K51k61O8K39o22L66j11j02
2060b19N34m61l43N39k94M69J9q72N86k39K22L30p01N0M36k65L31j94k25K14n8
2081a41R4M96o22Q2P2k73N11r2n56O74k33P9j04K13J34n34P8K99J22j4j34l81
$$ plain form
2103 -230 253 168 8 229 1 63 297 535 109 28 -75 235 472 173 368 -62 -398 389 159 28 -303
2124 -303 -143 127 -71 44 22 -280 -146 109 266 54 -4 -33 41 -151 -244 -80 -196 -290 -344 -135 132 -74
2146 -74 -400 -294 -66 -144 68 -1 -6 -41 40 333 1 -203 -82 23 59 241 -309 87 90 109 46 135 -14 -112 193
2171 193 261 546 86 -58 -259 255 425 314 -58 175 41 190 232 352 215 -43 242 193 279 256 12 -193
2193 -193 5 12 141 -28 -144 -104 80 152 -182 -119 222 70 -191 -231 115 -229 -122 -188 -196 54 -7 -10 -193 11
2217 11 -170 -172 -280 -226 -258 -296 -108 -77 -364 43 168 32 51 -115 265 -412 5 39 -8 -35 -233 156 50 -123
2241 -123 -26 -131 126 130 111 199 101 6 106 67 265 -172 -44 124 100 404 261 42 121 58 207 447 217 210
2265 210 83 177 168 4 191 77 -9 49 -173 -4 27 -123 -132 -62 211 -291 41 -260 -139 -323 -55 -131 -308
$$ packed form
2103b30M83q5j60K21k28O2K34K38m26q1j03L10K37k99J95m30l36P87k30j31l31
2124c03J60K70j98J15k2l02J34K55J57k12n8k9P4j92r3J64j16r4n4K09K67k06
2146g4l26J06K28p8K12o9nl5Q1K93l32k04J21J05L6J82n50L96LJ9o3Q9j49r8L05
2171A93O8K85m60j44k01N14J70j11l72K33j34J49M2J20j37k58K85m9Q6k3k44k05
2193a93J98PJ29j69j16M0J84P2l34O3L41j52k61m0L46l44J07o6qK50o1lj83K04
2217A1j81kj08N4l2l8J88L1k87M07J25j36J9j66L80o77M17L4m7k7j98L89j06j73
2241a23R7j05K57Mj9Q8r8r5J00l9J98m37J28J68k4L04j43k19P9o3J49K40k30p
2265B10j27R4rj64J87j14q6N8k22J69L1j50rP0K73n02L32l01J21j84K68p6j77
$$ plain form
2288 -308 -63 -253 47 1 -292 -48 -285 -207 -73 -67 -279 -336 57 -127 -242 71 -50 -39 13 192 -403 -26
2310 -26 -2 -43 35 35 -79 158 103 -170 65 228 -37 133 23 -65 305 73 291 -103 337 181 149 23 230
2333 230 339 287 72 -129 174 294 44 130 -285 231 54 31 440 118 124 -173 202 249 73 -211 195 -37
2355 -37 -210 200 -192 75 83 -156 -43 -85 -88 -164 -279 -109 -187 -255 -36 -228 -147 -118 19 227 -34 -293 32 -110
2379 -110 -223 83 7 -187 135 -137 175 37 -50 61 189 107 121 -246 228 275 -25 -7 339 6 207 212 -88
2402 -88 134 -179 450 327 -24 69 -16 69 346 100 -56 196 57 -114 -49 -183 57 189 -7 4 -42 294
2424 294 193 -198 -69 -43 -203 233 -109 -117 82 -46 113 -37 -163 114 -458 -241 -119 -439 -69 -372 -125
2445 -125 24 -153 -343 84 -57 -231 -147 -229 -325 32 -397 83 69 -140 173 64 110 -124 60 224 231 176 359
$$ packed form
2288c08K45j90L00m6k93K44k37P8J34Ok12n7L93j84j15L13j21J1N2J79n95L77
2310b6K4m1P8%j14K37n5k73K35J63k65J70j10q8L70k32K18l94M40j56l2j26K07
2333B30J09n2k15k01L03J20k50Q6m15N16j77k3M09l22Ok97L75M7j76k84M06k32
2355c7j73M10l92K67Qk39J13m2lp6j15J70p8o8K19j92Q1K9J37K08k61k59L25j42
2379a10j13L06p6j94L22k72L12j38q7J11J28q2J4l67M74M7l00J8L46l33K01Nl00
2402h8K22l13O29j23l51R3q5Q5K77k46j56K52j39j71O5j34K40J32j96J1m6L36
2424B94j01l91J29K6j60M36l42qJ99j28J59j50j26K77n72K17J22l20L70l03K47
2445a25J49j77j90M27j41j74Q4q2r6L57m29M80j4k09L13j09M6k34J84J64Pn5J83
$$ plain form
2468 359 -43 160 141 -19 41 -133 -16 112 -55 -69 155 -13 53 162 -216 7 -116 150 206 -77 159 -22
2490 -22 -90 90 16 135 167 145 215 171 122 289 453 -251 85 205 168 143 -364 -60 -241 -272 -114 -70 -219 -143
2514 -143 -108 55 106 -343 -125 -135 -264 51 -64 -147 -42 -180 116 68 -120 -138 -204 -181 178 -2 5 -119 -149 -128
2538 -128 26 2 -96 -168 -275 -149 89 20 234 -82 181 266 -45 275 208 71 224 215 274 267 77 193 130 -212
2562 -212 36 -140 -89 96 233 -269 135 -169 56 129 34 13 170 -51 -117 286 216 69 -148 11 -318 -30
2584 -30 -250 -86 -5 -194 -28 51 -98 -58 -45 -120 1 -202 144 115 -189 -217 -217 46 46 -206 -52 87 -106 -55
2608 -55 134 52 70 -64 81 -135 -4 21 30 118 50 182 146 -271 57 148 249 -57 -97 226 231 327 207 96 227
2633 227 110 282 7 -32 12 9 -11 154 103 47 224 41 60 -33 -96 69 -141 4 170 -158 -55 12 -203 55
$$ packed form
2468C59m02K03j9j60O0j74J17J28j67j4K24j68O6J09l78K23j23K66N6k83K36j81
2490b2o8J80p4J19L2k2P0m4m9J67J64p04L36J20l7k5n07L04j81l1J58M4j49P6
2514a43L5J63N1m49K18j0j29L15j15q3J05j38K96m8j88j8o6K3L59j80Pj24l0K1
2538a28J54k4r8p2j07J26K38o9K14l16K63Q5l11L20o7j37J53rN9pj90J16o3l42
2562b12K48j76N1J85J37n02M04l04K25P3r5k1J57k21o6M03p0j47k17J59l29K88
2584c0k20J64Q1j89J66P9j49M0J3p5J21k03L46k9l04k8%K63%k52J54J39j93N1
2608e5J89q2J8j34J45k16J31K5RQ8o8J32l6m17L28R1J01l06m0L23NR6j20j11J31
2633B27j17J72k75l9M4lk0J65n1n6J77j83J9r3o3J65k10J45J66l28J03O7k15K58
$$ plain form
2657 55 -23 -137 169 -35 -336 -469 -68 -25 8 -3 -222 -278 -18 -54 25 -174 -294 192 16 -226 -229 -169 28 83
2681 83 -23 -102 22 -81 67 -127 101 -187 -19 -115 133 -4 80 144 133 -119 398 409 -17 316 53 233
2703 233 305 57 227 -105 -35 554 130 192 -217 173 187 36 -273 115 272 -126 -45 45 103 74 -23 1 105
2726 105 -142 -152 -57 23 242 92 9 -107 113 140 -46 -89 -394 -272 -355 -168 29 66 -267 -186 65 153 -165
2749 -165 -310 179 -324 35 93 -231 54 -233 -152 -20 -68 -10 -106 122 13 120 45 -13 -242 -37 157 -212
2771 -212 106 132 26 41 228 219 320 252 161 79 159 144 72 276 132 236 45 222 -13 83 -7 27 -75 -203
2795 -203 58 -5 39 155 129 -198 -177 -88 -95 230 -57 144 101 -80 84 94 -261 11 -261 20 -226 -105 -55
2818 -55 11 -15 -299 -167 -21 -450 200 -137 42 -145 -337 -175 -30 -365 211 -114 44 -111 -174 -160 -25 209
$$ packed form
2657E5p8j14L06k04l01j33M01M3L3j1k19n6K60l6P9j99j20M86j76k42lO0J97N5
2681H3j06p9J24j03J48j94K28k88J68r6K48j37Q4O4j1k52N17J1m26L33k63J80
2703B33P2k48J70l32P0N89m24O2m09L90J4j51l09L88J57l98Q1R0N8k9r7K4J04
2726A05k47j0R5Q0K19j50q3j16K20K7j86m3l05J22q3J87J97L7l33Q1K51Q8l18
2749a65j45M89n03L59N8l24K85k87Q1J32m8N8r6K28j09J07p5n8k29K05J94l69
2771b12L18K6j06J5J87rJ01o8r1q2Q0j5p2K04j44J04j91J77k35R6r0L4j02j28
2795b03K61o3M4J16k6l27K1Q9pL25k87K01m3j81J64J0l55K72k72K81k46J21N0
2818e5O6k6k84J32J46m29O50l37J79j87j92J62J45l35N76l25J58j55o3J4J35K34
$$ plain form
2840 209 55 222 0 100 36 -60 -157 128 -38 102 233 -47 116 -32 250 133 187 90 76 170 148 -80 189
2863 189 108 -42 164 186 -251 225 166 171 180 -67 86 266 0 -94 -129 61 111 -75 5 28 -114 119 24 -87
2887 -87 -185 -162 -159 -124 -297 72 -280 -118 -121 -159 -223 -230 62 -102 -110 -47 94 -119 44 399 -11 -196 172 -160 -241
2912 -241 57 129 85 -132 -75 44 73 128 57 -11 -77 147 118 172 178 -91 -18 258 178 241 -43 180 -20 195 47
2937 47 73 -66 97 29 137 133 36 276 104 247 -40 156 189 83 -161 21 45 79 -67 -37 -62 -188 -127 20
2961 20 -172 -132 -52 20 -107 -24 -329 -221 -87 -240 113 -135 -234 -25 -32 -220 -36 -193 -166 -137 -447 7 -79 -165
2985 -165 76 -144 -54 -166 48 36 -64 105 -88 -220 120 85 48 129 33 266 382 -20 22 147 -62 160
3007 160 200 260 121 156 217 -36 181 121 6 133 126 362 51 -187 -55 -161 -328 -48 -127 189 -80 36 -67
$$ packed form
2840B09j54J67k22J00o4r6r7K85j66J40J31k80J63j48K82j17N4r7j4R4k2k28K69
2863A89q1j50K06K2m37M76n9NRk47J53J80k66r4l5J90N0j86Q0K3j42K33r5j11
2887h7r8K3LL5j73L69l52J62ll8o4pK92j64qO3J41k13J63L55m10j85L68l32q1
2912b41K98P2m4k17N7J19K9N5p1o8o6K24k9N4Ok69P3K76q0O3k84K23k00K15j48
2937D7K6j39J63o8J08mr7K40j72J43k87J96L3j06k44J82K4L4j46L0k5j26O1J47
2961B0j92M0Q0P2j27Q3l05J08J34j53L53k48r9K09pj88J84j57K7K9l10M54q6q6
2985a65K41k20R0j12K14j2j00J69j93j32L40l5l7Q1r6K33J16m02M2J25k09K22
3007A60M0O0j39L5O1k53K17o0j15J27pK36l11k38J32j06j67K80p9L16k69J16j03
$$ plain form
3030 -67 -67 240 -5 -54 -17 -114 -85 -85 -56 50 -201 -106 163 41 -166 -49 -115 -138 30 -163 -204 50 -127 45 -111
3055 -111 44 -132 -93 106 57 -103 83 -409 -4 -111 -154 -69 18 -137 141 44 155 -49 74 103 298 -143
3077 -143 -85 -43 194 42 76 -36 -45 -17 47 343 -186 126 190 93 -226 -201 117 113 93 -90 190 86 -94 -66 -218
3102 -218 186 61 191 -11 -232 -42 54 73 -52 -113 95 75 -76 -83 -164 165 -326 68 55 -140 91 -15 -207
3125 -207 187 -53 357 -87 -226 -254 -117 -27 -65 77 -119 51 -81 115 -60 108 -57 380 174 -103 -46
3146 -46 40 74 10 79 187 -78 -39 155 -96 201 123 -9 172 -25 71 111 -5 -83 -86 86 2 91 -82 248 3
3171 3 33 251 64 70 -73 -22 -280 42 -281 -90 31 -128 -26 -7 -190 49 64 -97 -152 -101 106 -358 -145
3194 -145 253 76 -12 -8 -209 -25 166 -216 -129 -105 -113 -4 -175 -140 -245 -82 -207 -289 -64 -32 -66 -60 -4 10 73
$$ packed form
3030f7%L07k45m9L7r7K9%K9J06k51R5K69j22k07J17o6k3J68j93m1K54j77J72j56
3055a11J55j76L9J99m9j60J86m92M05j07m3Q5Q7j55K78r7J11k04J23K9J95m41
3077a43N8M2K37j52L4j12rK8O4K96n29L12O4r7l19K5L18mk0j83K80j04j80K8j52
3102b18M04j25J30k02k21J90R6J9j25o1K08k0j51pq1L29m91L94j3j95K31j06j92
3125b07L94k40M10m44j39k8J37R0l8J42j96J70j32J96j75J68j65M37k06k77N7
3146d6Q6L4o4O9J08k65L9J94k51K97p8j32J81j97R6M0j16p8lJ72q4Q9j73L30k45
3171CL0K18j87Oj43N1k58L22l23J91J21j59J02J9j83K39J5j61n5N1K07m64K13
3194a45L98j77q8Mk01J84J91l82Q7K4qJ09j71L5j05J63j25q2K25L2l4ON6J4O3
$$ plain form
3219 73 -40 -89 25 -65 -85 27 282 10 99 -20 269 -81 169 -11 -48 112 125 205 28 180 -71 270 64
3242 64 68 -35 29 107 205 -85 -107 -174 -195 75 -14 -94 -140 113 -257 41 58 125 -202 155 11 -135 -29 -222 -209
3267 -209 94 44 149 -37 -113 -320 -251 -279 -37 -100 -9 -146 -79 -120 74 78 -114 -68 -26 7 79 130 -267 40 93
3292 93 -79 -86 158 209 -80 104 89 -29 122 -108 2 239 10 35 342 170 109 182 2 132 -371 39 -108
3315 -108 57 102 44 204 -71 -104 37 237 65 -25 26 79 140 60 -157 306 8 -269 95 81 -48 -59 -49 -261
$$ packed form
3219G3j13m9J14r0k0J12K55k72Q9j19K89l50K50j80l7J60J3Q0j77J52k51L41k06
3242F4Mj03O4P8R8k90k2o7k1K70q9q0m6K53l70K98J7O7l27L57j44j46J06j93J3
3267b09L03n0J05j86p6k07O9k8K42o3R1j37O7m1J94Mj92M6M2L3P2N1l97L07N3
3292I3j72pK44N1k89J84j5j18J51k30J10K37k29K5L07j72o1P3j80J30n03M10j47
3315a08J65M5n8J60k75l3J41K00j72r0N1N3O1q0k17M63k98k77L64j4j29j1J0k12
$$ [...]
8191g2
##END NTUPLES=NMR FID
##END=
