##TITLE=1H_SR45_Et_k2
 CDCl3, 8 sc, 
 26.04.2021
##JCAMPDX= 6.0         $$ Bruker NMR JCAMP-DX V2.0
##DATA TYPE= NMR FID
##DATA CLASS= NTUPLES
##ORIGIN= UXNMR, Bruker Analytische Messtechnik GmbH
##OWNER= root
$$ XWIN-NMR		Version 3.5
$$ Mon Apr 26 15:37:56 2021 Russian Standard Time (UT+4h)  she@DPX200
##.OBSERVE FREQUENCY= 200.131506
##.OBSERVE NUCLEUS= ^1H
##.DELAY= (6, 6)
##.ACQUISITION MODE= SIMULTANEOUS
##.ACQUISITION SCHEME= undefined
##.AVERAGES= 8
##.DIGITISER RES= 18
##SPECTROMETER/DATA SYSTEM= spect
##.PULSE SEQUENCE= zg30
##.SOLVENT NAME= CDCl3
##.SHIFT REFERENCE= (INTERNAL, CDCl3, 0, 15.7039)
##AUDIT TRAIL= $$ (NUMBER, WHEN, WHO, WHERE, WHAT)
$$ ##TITLE= Audit trail, XWIN-NMR		Version 3.5
$$ ##JCAMPDX= 5.01
$$ ##ORIGIN= Bruker BioSpin GmbH
$$ ##OWNER= she
$$ F:/spectra/data/she/nmr/H-F/1/audita.txt
$$ ##AUDIT TRAIL=  $$ (NUMBER, WHEN, WHO, WHERE, WHAT)
(   1,<2021-04-26 15:36:50.39 +0400>,<she>,<DPX200>,
      <created by zg, POWCHK disabled, PULCHK disabled
       configuration hash MD5:
       00 E9 B6 7A A2 85 ED C7 34 08 36 98 17 FE 4E 26
       data hash MD5: 16K
       24 11 2C F1 74 F6 16 A1 57 F3 44 34 36 67 DE 35>)
$$ ##END=
$$ 
$$ hash MD5
$$ 3A 19 2C 9F 16 07 FA FC B1 07 42 46 A3 2F 7E A4
##$RELAX= 
##$RELAX= 
##$RELAX= 
##$RELAX= 
##$RELAX= 
##$RELAX= 
$$ Bruker specific parameters
$$ --------------------------
##$DU= <F:/spectra>
##$EXPNO= 1
##$NAME= <H-F>
##$PROCNO= 1
##$TYPE= <nmr>
##$USER= <she>
##$AMP= (0..31)
100 100 100 100 100 100 100 100 100 100 100 100 100 100 100 100 100 100 
100 100 100 100 100 100 100 100 100 100 100 100 100 100 
##$AQSEQ= 0
##$AQ_mod= 1
##$AUNM= <au_zg>
##$AUTOPOS= <>
##$BF1= 200.13
##$BF2= 200.13
##$BF3= 200.13
##$BF4= 200.13
##$BF5= 200.13
##$BF6= 200.13
##$BF7= 200.13
##$BF8= 200.13
##$BYTORDA= 1
##$CFDGTYP= 0
##$CFRGTYP= 5
##$CHEMSTR= <none>
##$CNST= (0..31)
1 1 145 1 1 1 1 1 1 1 1 1 1 1 1 1 1 1 1 1 1 1 1 1 1 1 1 1 1 1 1 1 
##$CPDPRG= <>
##$CPDPRG1= <>
##$CPDPRG2= <>
##$CPDPRG3= <>
##$CPDPRG4= <mlev>
##$CPDPRG5= <mlev>
##$CPDPRG6= <mlev>
##$CPDPRG7= <mlev>
##$CPDPRG8= <mlev>
##$CPDPRGB= <>
##$CPDPRGT= <>
##$D= (0..31)
0 1.2 0 0 0 0 0 0 0 0.06 0 0.03 0 0 0 0 0.0002 0 0 0 0 0 0 0 0 0 0 0 0 
0 0 0 
##$DATE= 1619437009
##$DBL= (0..7)
120 120 120 120 120 120 120 120 
##$DBP= (0..7)
150 150 150 150 150 150 150 150 
##$DBP07= 0
##$DBPNAM0= <>
##$DBPNAM1= <>
##$DBPNAM2= <>
##$DBPNAM3= <>
##$DBPNAM4= <>
##$DBPNAM5= <>
##$DBPNAM6= <>
##$DBPNAM7= <>
##$DBPOAL= (0..7)
0.5 0.5 0.5 0.5 0.5 0.5 0.5 0.5 
##$DBPOFFS= (0..7)
0 0 0 0 0 0 0 0 
##$DE= 6
##$DECBNUC= <off>
##$DECIM= 32
##$DECNUC= <off>
##$DECSTAT= 4
##$DIGMOD= 1
##$DIGTYP= 9
##$DL= (0..7)
0 120 120 120 120 120 120 120 
##$DP= (0..7)
150 150 150 150 150 150 150 150 
##$DP07= 0
##$DPNAME0= <>
##$DPNAME1= <>
##$DPNAME2= <>
##$DPNAME3= <>
##$DPNAME4= <>
##$DPNAME5= <>
##$DPNAME6= <>
##$DPNAME7= <>
##$DPOAL= (0..7)
0.5 0.5 0.5 0.5 0.5 0.5 0.5 0.5 
##$DPOFFS= (0..7)
0 0 0 0 0 0 0 0 
##$DQDMODE= 0
##$DR= 18
##$DS= 0
##$DSLIST= <SSSSSSSSSSSSSSS>
$$ [...]
##$SUBNAM2= <"">
##$SUBNAM3= <"">
##$SUBNAM4= <"">
##$SUBNAM5= <"">
##$SUBNAM6= <"">
##$SUBNAM7= <"">
##$SUBNAM8= <"">
##$SUBNAM9= <"">
##$SW= 16.9725357007746
##$SWIBOX= (0..15)
0 0 2 0 0 0 0 0 0 0 0 0 0 0 0 0 
##$SW_h= 3396.73913043478
##$TD= 16384
##$TD0= 1
##$TE= 0
##$TE2= 300
##$TE3= 300
##$TEG= 300
##$TL= (0..7)
0 120 120 120 120 120 120 120 
##$TP= (0..7)
150 150 150 150 150 150 150 150 
##$TP07= 0
##$TPNAME0= <>
##$TPNAME1= <>
##$TPNAME2= <>
##$TPNAME3= <>
##$TPNAME4= <>
##$TPNAME5= <>
##$TPNAME6= <>
##$TPNAME7= <>
##$TPOAL= (0..7)
0.5 0.5 0.5 0.5 0.5 0.5 0.5 0.5 
##$TPOFFS= (0..7)
0 0 0 0 0 0 0 0 
##$TUNHIN= 0
##$TUNHOUT= 0
##$TUNXOUT= 0
##$USERA1= <user>
##$USERA2= <user>
##$USERA3= <user>
##$USERA4= <user>
##$USERA5= <user>
##$V9= 5
##$VALIST= <valist>
##$VCLIST= <CCCCCCCCCCCCCCC>
##$VD= 0
##$VDLIST= <DDDDDDDDDDDDDDD>
##$VPLIST= <PPPPPPPPPPPPPPP>
##$VTLIST= <TTTTTTTTTTTTTTT>
##$WBST= 1024
##$WBSW= 4
##$XGAIN= (0..3)
0 0 0 0 
##$XL= 0
##$YL= 0
##$YMAX_a= 284172
##$YMIN_a= -260721
##$ZGOPTNS= <>
##$ZL1= 120
##$ZL2= 120
##$ZL3= 120
##$ZL4= 120
##$ABSF1= 10
##$ABSF2= 0
##$ABSG= 5
##$ABSL= 3
##$ALPHA= 0
##$AQORDER= 0
##$ASSFAC= 0
##$ASSFACI= 0
##$ASSFACX= 0
##$ASSWID= 0
##$AUNMP= <proc_1d>
##$AZFE= 0.1
##$AZFW= 0.1
##$BCFW= 1
##$BC_mod= 2
##$BYTORDP= 1
##$COROFFS= 0
##$CY= 11.3945322036743
##$DATMOD= 1
##$DC= 2
##$DFILT= <>
##$DTYPP= 0
##$F1P= 15.9154993809931
##$F2P= -4.1035820241983
##$FCOR= 0.5
##$FTSIZE= 0
##$FT_mod= 4
##$GAMMA= 1
##$GB= 0.15
##$INTBC= 1
##$INTSCL= 1
##$ISEN= 128
##$LB= 0.24
##$LEV0= 0
##$LPBIN= 0
##$MAXI= 10000
##$MC2= 0
##$MEAN= 0
##$ME_mod= 0
##$MI= 1.114404
##$NCOEF= 0
##$NC_proc= 0
##$NLEV= 6
##$NOISF1= 3.799351
##$NOISF2= 2.8
##$NSP= 1
##$NTH_PI= 0
##$NZP= 0
##$OFFSET= 15.70392
##$PC= 1
##$PHC0= -11118.93
##$PHC1= 11.20095
##$PH_mod= 1
##$PKNL= yes
##$PPARMOD= 0
##$PSCAL= 0
##$PSIGN= 0
##$REVERSE= no
##$SF= 200.130013532006
##$SI= 16384
##$SIGF1= 3
##$SIGF2= 2
##$SINO= 400
##$SIOLD= 16384
##$SREGLST= <1H.CDCl3>
##$SSB= 0
##$STSI= 0
##$STSR= 0
##$SW_p= 3612.71676300578
##$SYMM= 0
##$S_DEV= 0
##$TDeff= 0
##$TDoff= 0
##$TI= <>
##$TILT= no
##$TM1= 0
##$TM2= 0
##$TOPLEV= 0
##$USERP1= <user>
##$USERP2= <user>
##$USERP3= <user>
##$USERP4= <user>
##$USERP5= <user>
##$WDW= 1
##$XDIM= 8192
##$YMAX_p= 0
##$YMIN_p= 0
$$ End of Bruker specific parameters
$$ ---------------------------------
##NTUPLES= NMR FID
##VAR_NAME=  TIME,          FID/REAL,        FID/IMAG
##SYMBOL=    X,             R,               I
##VAR_TYPE=  INDEPENDENT,   DEPENDENT,       DEPENDENT
##VAR_FORM=  AFFN,          ASDF,            ASDF
##VAR_DIM=   8192,          8192,            8192
##UNITS=     SECONDS,       ARBITRARY UNITS, ARBITRARY UNITS
##FACTOR=    0.0002944,     1,               1
##FIRST=     0,             0,               0
##LAST=      2.4114304,     0,               0
##MIN=       0,             -260721,         0
##MAX=       2.4114304,     284172,          0
$$ Real data points
##PAGE= N=1
##DATA TABLE= (X++(R..R)), XYDATA
0@%%%%%%%%%%jRj6J6j6K4l2M0m8N6p2Q5r9J18j36J53j77K08k40K73l13L59m07
33b16M59n15N81o53P31q18R11j014J124j244J379j526J685j861K051k257K486
50A303k738L018l327L671m056M490m986N555o220P004p945R101j0558J2457j5039
65h270J8766k4619L5104n9295K08243J00231l60963J43812k41782J57476K83090
76B51793l80688L5968O4712q4173L96560k00214k17027J96530j88281J59880R8684
87A33744l39850K31710K6500j04008K30420k53244m248K32588k47859R5115n579
98d711j53968L22499j00115j52415J47610j74509J74267J12372l21543J03059
108d7454J119o19K77180k50584j07252J57261j00461K00771m1144k86658J80743
$$ y = [0, 0, 0, 0, 0, 0, 0, 0, 0, 0, 0, -1, 8, -8, 8, -8, 16, -16, 24, -24, 32, -40, 45, -54, 64, -72, 81, -96, 112, -128, 145, -168, 191, -216, 243, -272, 309, -344, 387, -431, 480, -534, 590, -654, 725, -801, 884, -977, 1074, -1183, 1303, -1435, 1583, -1744, 1927, -2129, 2361, -2625, 2930, -3290, 3714, -4231, 4870, -5688, 6769, -8270, 10496, -14123, 20981, -38314, 169929, 270160, -90803, 53009, -188773, -31297, 251793, -128895, -92927, -28215, -112388, 284172, 83958, -133069, 63461, -124820, 35060, 133744, -206106, 25604, 52104, -51904, 178516, -74728, -78976, 153612, -94247, 868, -4711, -158679, 163820, 63705, -88710, 58900, -115609, 58658, 171030, -150513, -47454, -46335, -46954, 230226, -20358, -127610, 29651, -70810, 129961, 88817, -197841, -17098]
119a7098N132M0383J48132k83702K5212J39577j03854J51734j15025j41725K19341
130F8107p2888J9736P4925k01261J26494M3647j35901J30971q7712j2825J53818
141A07111j59846L3565O8861j02443J32024p5071j14206J52753n0033L6842M7827
152G7384j83802R3457O8435o3674Q4257j32665l8367J61084n6395L2679j7466
163B4927j32628J33744K1583n6310N4635j18535L2670J11759q4962M0878k6358
174A403o9960J18087m1341l2882N9576q2871N0939L6637q1850O8943j9372l7927
186c0618O6673o9719J5475O0307o5737L6108j4112m4362Q6546k8914k7495K7522
198A1674n9640N2311L9645o1455K4059k7706o283P3501m3557j4975J2833l7005
$$ y = [-17098, -11966, 28417, 176549, -107153, -81941, 57636, -46218, 105516, -9509, -151234, 68107, -4781, 14955, 89880, -111381, 15113, 58760, -77141, 53830, -33882, -46707, 107111, -52735, -19170, 49691, -52752, 79272, 4201, -110005, 42748, -7285, 29557, 77384, -106418, -12961, 55474, -8200, 76057, -56608, -94975, 66109, 9714, 42393, 24927, -107701, 26043, 47626, -8684, 45951, -72584, -39914, 71845, -13117, 27761, 1403, -68557, 49530, 8189, -24693, 34883, -47988, 2951, 39588, -42262, 26681, 7309, -30618, 36055, -33664, -18189, 42118, -23619, 12489, -1623, -45985, 40561, 11647, -15848, 11674, -47966, 4345, 43990, -17465, 6594, -21112, -27395, 46106, 2549, -12426, 407, -36598]
210c6598N7560P215m6442K6461k6662R091M3705m4761P547P209k6689M2597j2066
223H167k0485K8636k8589Q941J9827k9333K2916l602k1783K6700j3637J636J8868
236A8262k9837Q463Q075j2475K3701j3257j5541J7883r922J0267P330k4345Q503
249b893K975l014J5652j4603o488J0441p009J0144N00j4374Q150j820K6R666j0298
264b945p64M052n884P918m32o289M470l390P66N828n215J227j24l264N123l77
280G00j948J614l038J467K961k166J005j418j472K923M66m05n0j385P05R19K70
297A148J63p17o79J022P4J15k2l07K5K15J26P7m02qJ20r8L51k24k15j40mk36N98
320I82r42N21J53p46Q19o03m45J037j472M79N86j576J367k94j226J892j714m32
$$ y = [-36598, 20962, 28177, -18265, 8196, -18466, -9375, 34330, -10431, -2884, 4325, -22364, 20233, 8167, -12318, 16318, -12271, -3330, 16497, -12836, 10080, 6478, -15305, 11395, -2242, -606, 18262, -11575, -3112, 4963, -7512, 16189, 2932, -12609, 5274, -4648, 5619, 12949, -11396, -2893, 82, -2932, 12720, -1883, -8371, 2070, -4939, 5205, 5705, -8669, -519, -2339, -2313, 7353, -2945, -3709, 343, -5541, 2377, 1945, -4344, 126, -3264, -2498, 3330, -1885, -658, -782, -4046, 1077, 700, -1248, 366, -2672, -1205, 1756, -410, 595, -823, -2295, 628, 1094, 689, 639, -746, -41, 878, 1148, 1311, 594, -85, 937, 1011, 1126, 1104, 797, 822, 1037, 1163, 1240, 838, 830, 950, 852, 1203, 979, 764, 624, 620, 384, 982, 40, 561, 714, -32, 787, 184, -261, 776, -696, -217, 369, -1207, 160, -134, -1360, 532, -1182, -1614]
338a614K246k624J824L05l190L896j455j833L899m196J487L177n666M118o2l738
354c426O222m879j392O404n955M004J167q073Q292j433k817O805r758K617P910
369E688q439O508k804p908J3056n071j873O869j3100Q558N621j1735J0622p025
383a033m330J5446j2763J653P731j4260J3398k053j2503J7238r888o57J1135j9785
397a0671J1562Q009j5725J4398j1833n945K3860j5391P85M459j9479K3920K027
410I976j8558J4143j7161O094K4263k5457M731J146j4475L0801j1054j6347J8039
423F141j8843J4590J4189l1303J7258j508j1359K7712k3781l277K3684k4654J5615
436D464J258k4694L3500j0949j4333K1208k6007J8146J8782l6496J6544m687p919
$$ y = [-1614, 632, -1992, -168, 137, -3053, 843, -612, -2445, 1454, -2742, -1255, 1922, -3744, 374, 312, -3426, 2796, -2083, -3475, 2929, -3026, 978, 2145, -5928, 2364, 931, -1886, 4919, -4839, -2222, 5688, -2751, 3757, 953, -6955, 6101, 1030, -843, 6026, -7074, 1484, 7105, -4630, 5992, -1033, -5363, 10083, -2680, -1027, 6704, -7556, 5842, 3789, -8714, 8524, -1364, -2021, 9114, -10671, 891, 8900, -6825, 7573, -4260, -10205, 13655, -1736, -951, 3508, -15971, 7949, 9976, -8582, 5561, -11600, -5506, 18757, -6700, -1969, -823, -15298, 15503, 4449, -11898, 6141, -12702, 1888, 16077, -15226, 2032, 524, -10835, 16877, -6904, -10181, 13503, -11151, 4464, 5722, -18972, 14528, 3579, -10754, 10454, -15553, 2593, 21375, -15121, 1423, -3264, -11183]
449a1183L8984l0064j2405K0538k0107L1876Q07m2228K5362n769M751K9439m5496
462a5495J915K2145j7644L2464j9159l0332L7303j3919O345J5778m3566K4765
474F00J2062k4908K8520k3802o479L6847l3598P665J2078k7439L7345j3318k9267
487b3694L4174j7875J1996J7828n0475K1963J5605j5220L1611l8893j5687M5200
499A6533j8049J5200n037m6359M2619Q388j4267K0085m5419R344M1285k8201J5097
512A1219j4222k6909M9673j2750j3506J8734l5356K5863J7856l7420K5502r876
524a192j0905L5492l5277J941K7133k7638K2922j0094k8946M4162j0842q520J4264
537A2500m0598K8444K5602l1819J4745k3547o265N1475k4896r181L583k8620M4591
$$ y = [-11183, 27801, -2263, -14668, 5870, -14237, 17639, 18446, -23782, 1580, -4189, 562, 30001, -15495, -13580, 8565, -9079, 23385, 4226, -26106, 11197, -2722, 3623, 19401, -24165, 600, 12662, -12246, 16274, -7528, -14007, 22840, -10758, -3093, 8985, -18454, 18891, 5573, -23694, 10480, -7395, 4601, 22429, -28046, -6083, 9522, -5698, 25913, -12980, -28667, 16533, -1516, 13684, 8647, -37712, 4907, 13295, -972, 19113, -26306, -16962, 24323, -3878, 11219, -3003, -29912, 19761, 7011, -6495, 12239, -23117, 2746, 20602, -16818, 8684, -1192, -12097, 23395, -11882, -9941, 17192, -10446, 12476, 2382, -26564, 17598, 6756, -1764, 12500, -28098, 346, 25948, -5871, 8874, -14673, -20938, 30537, 5641, -3540, 43, -28577, 16014]
550A6014P179l5229J6005k2402J1961L7732l8584K047M409j7773M0404j4531k3856
563a6624K4897k0721J4255J5560l6075K2474J705j7529K5547k3269J359K8058
575A9637k9391Q258K319j7690L5991j2561k1647J8095j7077K0814J6233l8647
587a5666R883J318j586L2643k9174j4463J8937j1121K5795k096l4746J9320j223
600b179L479K0396l2871J333J6532j3399K0693j0312j9188K4290j1499J864J3027
613A2166k3416J4275M552j8548J8723q524k957J7324k2901M096J2257j1541J6003
626A1509j0885j6218K1286m855L883M761k5609J2095J1278p373J1015j7989o679
639a3781K1135o447M651k139j9354J7061M247o053Q473j6898K247J4348j0422
$$ y = [16014, 23193, -12036, 3969, -18433, -6472, 31260, -7324, -5277, -868, -18641, 21763, 7232, -16624, 8273, -12448, 1807, 17367, -18708, 3766, 5471, -12058, 13489, -9780, -8421, 19637, -9754, -1496, 823, -16867, 19124, 6563, -15084, 3011, -14066, 6748, 22981, -15666, -5783, -4465, -6051, 26592, -2582, -17045, 1892, -9229, 16566, 14470, -20276, -956, -2179, 1300, 21696, -11175, -9842, 6690, -6709, 13984, 3672, -15516, 8774, -2725, -861, 12166, -11250, 3025, 7577, -10971, 7752, -772, -3729, 13595, -9306, -5210, 7047, -4494, 11509, 624, -15594, 5692, 837, 4720, 9481, -16128, -4033, 7245, -128, 10887, -7102, -13781, 7354, 907, 5558, 3419, -15935, 1126, 5373, -680, 7793, -9105, -6858, 7490, -2932]
652b932O852l138j0922J4668m960k383R262j2210M957L802r846J1311k215o305
666d059P813r253L631R744r823L062k781n247J3675l254m846K644q334Q266O725
681G963q591J727m374r30J1494n266k530J012o249Q411K198o032L297n195Q70
696b195P187m941R03j32m713N739k56k225L528n402O34L592k838L295j491m383
712c698L898j251J299K460n188N54J710r05L722k300l215K394o34K012J316l998
728a824K89M00P15K376k276j551J109o21K158N71k301K53l66P21J835j066j065
745f43K41o67J856M14j066q5j063Q56J207n08j30n50m38J294K19k13j96j065M22
764a15Q23m2p1n37k92L79M90O1k13o87J45J91M02j94k35n92M17L86q0k7m82r3
$$ y = [-2932, 3920, 782, -10140, 4528, -432, -2815, 6447, -5763, -806, 2996, -6850, 4461, 2246, -4059, 3754, -5499, -1868, 7876, -1947, 1115, -1666, -6913, 6762, 3508, -1338, 1306, -7028, 1238, 7963, -628, 1099, -3275, -4205, 7289, 2023, -507, 505, -5744, 2667, 4865, -1167, 2130, -3065, -2195, 4992, 51, 954, 822, -3891, 1848, 1592, -633, 2895, -2507, -1873, 1719, -1119, 2176, 685, -3698, 200, -1051, 248, 2708, -2480, -1926, -216, -1121, 2601, 301, -2914, -520, -1154, 858, 2174, -1824, -1535, -1135, -420, 1956, -320, -1871, -762, -1383, 775, 1346, -955, -702, -1068, -347, 1488, 422, -643, -402, -1069, 787, 1201, 135, 50, -1013, -157, 1050, 542, 412, -138, -576, 718, 937, 724, 528, -537, -115, 708, 666, 595, 58, -234, 145, 635, 696, 483, -204, -59, 132, 534, 340, 105, -487, -70, 316, 236, 209, -273, -366]
786c66K9K01J38j47k51j19K15K86k8m41J7j55Q0J27M1k97K54j06M88l44k7K95
808a10o25L79L33m18N7J74l41O92m46j29N75m88R1N76n36O14j13m32Q44n76j6
829A05N26p46O10J82q01J133j034m6J058j142R21o0j449J430l05l94J150j360
847b22q1J343j694J391j61j512J967q43o59J466k055J426O26k010J632q96n65
864h47K366k425j50J791k357K255n19k117K798j296q0J940l578J835J495k439
880a328K598k234j264M140k279j99J259l547L806L96k996K732k352K13M161m490
896a384J148O56k472M520j597k688L187k509J531K357n154L167L83k094L950m148
912a147m30M540m153K462n6l791N253j746k345L269m104K792L047n805K656j135
$$ y = [-366, -337, -136, 2, -145, -396, -515, -300, -14, -42, -483, -466, -621, -541, -414, -373, -670, -416, -522, -34, -378, -405, -110, -735, -356, -23, -441, -384, -210, -551, 141, -305, -434, 141, -347, -256, 320, -216, 398, 285, -147, 697, 121, 105, 631, -115, 495, 677, -124, 1009, -25, -71, 987, -155, 766, 706, -743, 687, 382, -12, 1138, -222, -303, 1040, -654, 737, 576, -936, 1031, 188, -471, 995, -1060, 366, 992, -1018, 614, -282, -847, 1519, -906, -1056, 735, -1622, 633, 114, -2003, 795, -501, -581, 1359, -2219, -384, 1111, -1328, 1270, -964, -2228, 1912, -367, -566, 693, -2854, 952, 1348, -1648, 1084, -1268, -1055, 3106, -1384, -236, 420, -2052, 2468, 871, -1817, 1370, -1139, 392, 2749, -2405, 762, 1145, -949, 3001, -1147, -1577, 2963, -1190, 1272, 1216, -2575, 2678, 932, -1413, 1856, -2248, 544, 3591, -2214, 442, -693]
928f93j130O247m803j943L520l554M803L56o495M007j040J82M673o955L61L790
944A326l061M342k284m484N827k231K77K715o329L822K189m505M312l203j025
959b312N989n565P87K046l851N948j890n314N384k378J894K869p789K964L007
974A789k458M964n784k739P059k765K254k95p136O185J438k487L146o493J030
989b292O429m633K171j659m001P223k125k231L416n046L390K540o069M060o91
1004D82k173M819n297L03M631m023L181j921m543O921j281j562J863o011M158
1019d53M527m936J613l147j155P741l457j819P82m261O509J162m996K340l121
1034b671J181N535n371M27J056l230N652j470l538M069l176J509K321m885L524
$$ y = [-693, -1823, 4424, -379, -2322, 1198, -2356, 2447, 2803, -3692, 315, -725, -543, 4130, -2825, -2464, 1326, -1735, 2607, 323, -4161, 1666, -565, -288, 2427, -3902, -80, 2109, -2396, 1916, -1287, -2312, 3677, -1888, -1101, 945, -2906, 3042, 1152, -4162, 1222, -1156, 738, 3607, -4182, -1218, 1789, -669, 4295, -1489, -4228, 2831, 66, 2320, 2025, -5111, 1074, 2512, 25, 3171, -3322, -2292, 4137, -496, 1675, 16, -3985, 3238, 1113, -1118, 2298, -2748, 642, 3182, -2887, 1173, 482, -1691, 3128, -2169, -1866, 2765, -1258, 1923, 2, -4541, 2380, 1099, -463, 1400, -4611, -453, 4074, -862, 751, -2396, -3551, 4190, 733, -1086, -304, -4565, 1944, 3106, -1890, 450, -2671, -1490, 4045, -1326, -899, 157, -3073, 2579, 1109, -2429, 1640, -1536, -27, 2294, -2591, 933]
1049I33O03l582L564k510J22M368m522M69P71k046N171j403m072K831k566L169
1065A300K654n821J172J48l21N301m063k882K779j360L397K87n280K542l70K02
1081c15L460m338p3J873j780K739q84k760L300j956k08K593k938J558O31l119
1097b217K600l80m37K176l593M60K386j367J777j283k870L075k80M65R09l897
1113b476J340K116n77J279k479j462L253p21P76k53k895K259P18q10J406k441
1129i67k26K330j285J175q9k101J536l13j71J562j490k34P12j194J830j8j396
1146c39Q00j521J055J754j543p7l94q96J876J30r73J25j290J257J272j311k3o33
1164g31j60J727n55k90l01o88R53O44q32L70r44n3J025k92K23k74n28L63L47O9
$$ y = [933, 1536, -2046, 1518, -992, -870, 3498, -1024, -555, 216, -1830, 3341, 1938, -2134, 697, -1869, 1300, 3954, -1867, -695, -547, -868, 4433, 370, -2512, 267, -1093, 2304, 2591, -2689, -147, -517, -315, 3145, -1193, -1266, 607, -1173, 1566, 682, -2078, 1222, -734, -942, 1651, -1287, 271, 902, -2217, 383, 3, -434, 1742, -1851, -1391, 995, -372, 1405, 122, -2748, 327, 47, 512, 1421, -2476, -1136, 980, 403, 1682, -797, -2259, 994, 273, 1049, 796, -2099, 160, 878, 68, 1474, -967, -1193, 1137, -148, 1027, 938, -1163, 373, 60, -111, 1451, -39, -273, 439, -755, 1075, 1057, -339, 461, -1060, -5, 1749, 206, 129, -265, -1161, 715, 845, -128, -3, -1293, -36, 1236, -75, -98, -731, -891, 836, 281, -9, -310, -998, -45, 599, -233, 137, -807, -860, 165, -127, 96, -178, -706, -343, 4, 73]
1184G3K68r60PM97l6O66m83o58L42J59J52O52r12m51N60J70O11j79p46K00j25
1205a93N94J17m41l78J40L28N71m82l67K19r6N56N4n83K6j47K57K13k49P8Pl73
1227a49J79K37n8N4o49L86L53l4k03j62j37L41P0k01p9k50j3J44K97m76N3o4P9
1250b82K10L2q2j60R5j0K25k0p1n07K76K62J6j52l8L12m57L31L3q6j4k82M78j0
1274I9J14l63J12J91j67L79l25k9J11Q6J46j74R5k82K1M43k95j88M7K5M2J44K18
1297D50k50j97P6k3L2P7k24P8O2J34k05j72L56l41JK41j23L3Q8l27K39O3j59j39
1321b30k7M33k71J37q0k11k56L85j55L0K20k11J10J72k79J70k18J15M8l03L39
1342h2J68k64L55j33L6m1k5r0K65l28M65m4k70K51n09J61K73l43M15J8m04M13
$$ y = [73, 341, -619, -612, -115, -151, 515, 32, -626, -284, -125, 27, 679, -233, -684, -124, 46, 657, 478, -268, -68, -193, 401, 518, 77, -301, -161, 167, 738, 256, -111, 108, 12, 568, 622, 39, 65, -82, 175, 388, 139, 217, 224, -149, 30, 267, 209, 263, -386, 0, 353, 319, 116, -46, -183, 158, 228, 27, -52, -302, -315, -171, 126, -350, -297, -361, -282, -72, -40, -122, -282, -187, -197, 28, 8, -63, -570, -294, -32, -16, -168, -206, 106, -351, -20, 13, -73, -87, -369, 109, 99, 213, -150, -38, 153, -14, 365, 40, 11, 122, 208, 354, 180, 275, -7, 14, 457, 162, -26, 21, 46, 88, 232, 450, 200, 3, 79, 56, 88, 165, -59, 19, 81, 215, 10, -162, 194, -147, -146, 95, -28, 5, 93, -234, 5, 68, -91, -230, -257, 176, -95, 42, -38, -249, -505, -120, -275, -245, -25, -236, -126, 46, -233, -63, -281, -166, -118, -421, -82, 86, -178, 177, 44, 80, 39, 14, -76, 189, -139, 326, 282, 12, 263, -246, -85, 188, -155, 260, 278, -126, 287]
1364B87j53l33K08p0J33L34n88K13J42l40O70l61j18Q6k29N30j19k85N8p3J12
1385A04L01q45L46J11l13O98k24o22O41l58l93N01l12K78J92n00L20k93K95M2
1405c1l71j1M56o58P16p0n65N58n8N1O09j104K71M34m37M75m33k08P77l04Q7J63
1427C47q95P54K34l22L66n96j48P72o67K46Q8m31R76m74n41Q68n31L16L84j093
1447c47J45M27j56M30o61l46P90l15M46k91n69P29j15q4K75r62K16P84m69j60
1467b33K23l54N86o1l35N60p70M49K6n14L82k16j39M15o37J87N56k08K97j73o63
1488f22P35j47j46O0l93O06M42n56m1m61K51Q56q66L84J7m41N44K07p94N82m79
1509b62L19O33p32J10K58m31M58k89j51N01m31l7N48o55J58P8k44O21m85K5L74
$$ y = [287, 134, -199, 9, -61, 72, 406, -182, 31, 173, -167, 503, 142, 24, 110, -119, 411, 292, 7, 65, -8, 104, 405, -440, -94, 17, -296, 402, 178, -444, 197, -161, -554, -53, -365, -87, 105, -395, -75, -368, -73, -31, -402, -413, 43, -615, 101, 31, -534, 24, -34, 17, 626, -478, -207, 227, -210, 265, -168, -376, 401, 97, 184, 347, -548, 206, 440, 118, 484, -112, -260, 512, -155, 91, 179, -252, 724, 250, -291, 577, 46, 362, 746, -347, -202, 225, 69, 499, -162, -508, 282, -33, 413, 122, -447, 282, 167, 83, 358, -604, -388, 396, -73, -233, -10, -364, 222, 161, -174, 386, -384, 65, 91, -423, -41, -257, -396, 19, -618, -431, 125, -83, 214, 41, -622, 113, -34, -180, -120, -513, 93, 535, -21, -62, -523, -272, 584, -282, 102, 119, -322, 222, 429, -365, 217, -262, 57, 690, -42, 68, 326, -105, 353, 64, -87, 414, -17, -54, 494, -161, -3, 75, -169, 452, -33, -8, 366]
1530C66l11r6J11k65N06o4k59P2l14J44N63j080K76L09k01M18m72p8K71J06K9
1551C1N7l82K37K15k03L04o91J87R4p6L53k86j23N72l70k72O42m70Q8J43l60J71
1573a39K37n47N38k87K88J55p9Q9k92k59M72j31Q5J65j66j29L03J67l20mj04J90
1595B32j75k05L71k13M1K81l27L62j07n63M82p9q3J87LJ90m51k36L25j30j7J91
1617G9j37o7K42l42L40j45l01M65n54L46k20j39O01k52o7j49P9k4L47j29m9k3
1639i9M5Q2o5j25J10Q4L2K22l83P2K1M9N0j09J67L5j24J18J03j76J24k0j16J34
1663B31rj91K96l13P2m3K4K62j13k9J17o0m4o6j79M5Kp4L43k21j36K34o2M1J20
1688B47m97J66J4J50Kl04M18k96j51K15J42k80K39k40m2R6J35j45n3j50L54r3
$$ y = [366, 55, -41, 70, -195, 311, 247, -12, 60, -254, -110, 453, -627, -351, -42, -243, 175, -297, -375, -104, 2, 31, 88, -294, -57, 158, -45, 259, -432, -245, -151, -227, 126, -160, -283, 289, -81, -353, 289, -181, -93, 50, -310, -139, 98, -449, 89, -198, 90, 245, 166, 255, -37, -296, 176, 45, 130, 295, 129, 0, 303, 470, 150, 146, 42, 232, 57, -148, 223, 10, 51, 332, 5, 367, 260, -303, 179, 100, 17, 204, 207, 397, -54, -290, 35, -95, -112, 79, -58, -125, 117, -225, 115, -30, -331, 134, -420, -74, -294, -433, 168, -84, -151, -300, -221, -245, 102, -27, -76, -99, -54, 28, -37, -162, -52, 32, 64, 286, -97, -25, -4, 45, 95, -14, 153, 188, 64, 182, 285, 109, 233, 213, 97, 231, 222, 31, 327, 14, 86, 43, 67, 329, 216, 187, 304, 244, 200, 134, -45, 0, 2, -72, 271, 50, -86, 148, 86, 127, 247, -250, -84, -70, 80, 82, -222, 196, -100, -251, -36, 106, -174, 65, -175, -217, -121, 14, -131, -184, -334, 20, -73]
1710g3J25m2j79q6L49j06k49J68J51l3N8j26J33j67K20j77J6K54k44j09RK32N0
1733A74j58L0J15rr8N5J65k76L22l16j57L57r7K08l16J58q8J32j34k8p2j4K70
1756B23k37L01l70Q6J60k08K7JP2k55K48Q1k28J19p2R5j89L2J38j73k0K30k15
1779a54J84l38J95j27k09L31k3J03J32k24L19j98k61L66m2j26N1j22J99L5k30
1800a39Q1m6J84P5r2m3k7K02O5K17m86J59k83K32p7J4J20J22k16J40J1L6M8j76
1824A21k99L63L1j09N6j18j0j50L18l1k14O3J32j17j1j12J25Rj45j81K43j24P1
1847h9Q3j34J35n8J20k04r0J0J95k08J45K06l61K19j42k5K15j15P5j53o9M82n03
1870b66q8M93l02j12J47j07N83j62l65K72M8J3J75l91K77P5o60M62k3K7L9k04
$$ y = [-73, 52, 10, -169, -255, 94, -12, -261, -93, 58, 25, 83, -43, 90, -77, 143, -34, -18, 236, -8, -117, -108, 124, 174, 16, 46, 161, 152, 54, 109, 274, -2, 320, 4, -153, 204, 107, 315, -1, 157, 69, 201, 67, 39, -33, -47, 223, -14, 287, -83, 3, 163, -45, -18, -17, 55, -200, 48, 129, -99, 20, -52, 43, -146, -114, 24, -149, -169, 61, -154, 30, -308, -113, -240, -449, -118, -141, -38, 94, -130, 189, -9, -270, 96, 54, -72, -21, -143, 56, 91, -139, -58, -104, 80, 155, 63, 20, -7, 195, 260, 477, -9, 150, -133, 99, 22, 36, 156, 278, 62, 202, 213, 249, 297, 121, -178, 185, 216, 107, 163, 45, 35, -115, 203, 172, -42, 21, 153, 36, 25, -87, 38, 47, -98, -279, -36, -160, -89, -6, -140, -5, -63, 57, -147, -237, -227, -32, -240, -95, 111, -250, -31, -173, -198, 17, -98, -23, -176, -245, 237, -266, -354, 139, -163, -275, -128, -235, 348, 186, -179, 93, 141, 154, 329, -62, 215, 290, -370, 92, 69, 96, 135, -69]
1892f9k6N47n40L32r7n7J59l03J7J54l38M15n9j53L61k51j95K12m60K08L55l27
1914a15J71q4o5J1l70R2M68j61j02J10k27K7K62k87K75j60J2Q7j64K88p6j95M7
1937a56j12K21J76j89Q8O3k70L77m15J23QJ3K32O3k38J48n3j52N45m53M0L17m41
1960f5K89l64K92J26l84m9M68l15J63J54m14K20P2l01K17q1K33j51l3K94r2k74
1982EL67k72r0K19n13L53j04k88K50P4o1K95m60J91K12k28R2o9j24M15n41K49
2004b8J56n13M67j12k02L34o4j02J86o97L34M98o01L38k51MO13k58l8j7j94J88
2026D1L23m63J57j07Q0N9m2N9p9q5L6M76n85N56m88J58J5r6R6Kk28K95l53K84
2050A11R5o04N43j32l32N49l06j73L03j11M6O8k33J13KO3r5P9J12R9k85q1K99
$$ y = [-69, -95, 452, -88, 244, 147, 90, 249, -54, -37, 117, -221, 194, 135, -18, 343, 92, -103, 109, -351, -143, 212, -115, 56, -28, -93, -82, -452, -360, 108, -53, -155, -45, -272, -245, 17, -270, 5, -155, -143, -56, -220, 68, -8, -203, -156, -268, -47, 129, -60, 28, 91, -179, 198, -217, -94, -86, -73, 159, 222, -16, 132, 79, -73, 472, 19, 59, 376, -65, 224, -140, 152, 278, -106, -155, 313, -2, 161, 315, -99, 121, 193, -108, 109, 28, 261, 110, 77, 371, 279, 5, 372, 100, 10, 229, -284, 69, -35, -323, -73, 1, -60, 235, -225, -34, 178, -50, 42, -27, -151, 264, -277, -28, 128, -385, 82, -30, -232, 102, 38, -64, 122, -575, -241, 257, -344, -6, -257, -253, 360, 102, 64, 47, -147, 41, 364, -99, 58, -49, 31, 90, 48, 107, 28, -57, -21, 455, -130, 426, -62, 96, 111, 15, 111, 113, -115, 180, -173, 111, 206, -398, 145, 13, -319, 230, -76, -249, 54, -57, -11, 57, -176, -63, -61, 2, -93, -14, 98, 197, -88, -169, 130]
2073A30k33j43J94k05L81l64l8K58k21K28j07R6J0k07L16j25j72J33J92j96J16
2094D3j62L7K4n6pJ62j25o7J61k83M98k24j13O17n24J24q7l0L71j28j73M1J66
2117B65p9J08k22M2J0k20L56k16m9J90k44L50J9l98J37l23M24j38Nj56J25P4J91
2140B51n79M25j62J28j09r5J26N0k90L96k61J79j47L0o2q5R0K60k83Q0j15K10
2162C7N9l72J42J06K7K7J9k05J0r1L9K7J92J8J00k11R3k33L41k50J79J47l46J86
2186D1R2k75K55q6K7J43j86j29K96kK7P5j74R5M2k76K65l81M12k62k72L15O3n0
2210E5j54J02k03L78j56j63l0p1Q8J00o3L0K3j5q4J74o3j18J48p3P0o4o2j35K46
2235d0lo0K76k54J40R8q4l35L71l53L94k47K04j20kj90J80L4J30l8j95k2QLJ73
$$ y = [130, -103, -246, -52, -257, 124, -240, -278, -20, -241, -13, -120, -24, -14, -221, 95, -30, -202, -69, 123, -73, 43, -119, -82, -58, -114, -121, 41, -84, -151, 10, -273, 225, 1, -112, 505, -19, 105, 18, -12, 359, 231, 58, 99, 265, 186, 294, 72, 114, 124, -96, 260, 44, -5, 185, -59, 291, 310, -88, 49, -274, 150, 12, 17, -139, -14, 60, 251, -328, 97, -65, 63, -46, -141, -15, 35, -255, 141, -120, 59, -88, -58, -120, -205, -115, 145, -138, -58, -173, 37, 96, -276, -134, -28, -1, 26, 45, -160, -150, -241, -202, -175, 17, 35, 135, -76, 17, -216, 125, -125, 54, 201, -145, 41, 133, -142, 113, 27, 54, 197, 11, -118, 178, 176, 203, 278, 104, 199, 241, -35, 230, -151, 261, -1, -273, 42, 105, 55, -99, 3, -200, 178, 22, -141, -171, -242, -154, -54, -117, -87, -64, -79, -163, 11, -52, -170, -22, -95, -25, -89, -151, -286, -40, -43, -103, 173, -81, 59, 157, 73, -262, 109, -244, 150, -97, 107, -13, -15, -205, -25, 9, 139, 101, -94, -116, -108, -105, 68]
2260F8Jo5K71k03N0J05k42J8j76L04lJ22k45R7k90K74Q6k79L7J46q6K13j99rK1
2285A6q8J95m56J76P5Q1j29J59k35K99j53J53k13R0j36k0j8K62l19K3K61l49L76
2308E0n7n0K09j60k54L79m53J83P9o3m2Q4p8L47l7j10j47K61pk76K72J34l34K43
2332A73o0k05J41M5r0L0Q6l02J78j70M12l4k54j0J42k9rK03r5p8j20K20j26k03
2356a55K89k39K43J13q5m1k0k04K54k0k06L98m74Q7J52l34J78m9P7q9J59j40m4
2379a50j09K5M33l84P4L1l03L91j69J05J03l56J71K60k73M5K42l11L65l50O7K92
2401A99l37J95J34m10L12o1Q3j1l48L47J96m14L11l13J53R4k38K4K93j72k5K92
2423C04n92N06l36j2J83j43p9K53l50J49m6K28K53k17J16j87l09L29Q4k39J30
$$ y = [68, 69, 4, 275, 72, 122, 227, -15, 3, -173, 131, 128, 250, 5, 102, -188, 86, 172, -107, -70, 76, -10, 203, 4, -5, 16, -72, 123, -333, -157, -82, -1, -130, 29, -206, 93, -60, 93, -120, -30, -166, -186, -204, 58, -261, -238, 23, -326, 50, -7, -57, 152, -8, -262, 117, -336, -153, -74, -137, -179, -95, -173, 174, 137, 27, -120, 141, 134, -142, 130, 264, -70, 173, 113, -92, 49, 94, 4, 34, 120, -182, -4, -174, 238, 204, -50, -60, 82, 53, 44, 247, 152, 74, -46, 174, 48, -155, 134, -105, 138, 251, 166, 125, 105, -99, 155, 135, -71, 327, -147, -60, 92, -242, -64, -113, -36, -125, 34, -106, -150, -259, -234, 199, -185, -111, -80, -383, 8, -161, -56, 47, -309, -138, 122, -151, -106, 136, -175, 190, -160, -93, 199, -138, 57, 191, -219, 93, 32, 115, 104, -244, 103, 299, -115, 196, -117, 36, 130, -108, -84, 209, 37, 12, 304, -288, 218, -118, -130, 53, -90, -169, 84, -266, -117, -163, 65, 318, 101, 217, 30, -279, 50, 134, -105, 25]
2444B5L4l03K46j77J55q8P1n5J16l41K74k15k9M93l86K8M3Q5J87l61j20K56k31
2467b93J20Q9j33K04K00k70J83q6p2K42m98L96j28K55k3K4j17L08l14J06j77Q1
2489I7m6K67j57P3l12L04j54j9L98l52L1N4r5L9j18N4j56J83J27R5o23K09J70
2512F9j56K32j62O7j95J44L5n9k13J98N8M6J2r8n9j00N5O3J51k19K4N09q19M33
2536A6r2l12K16K48N3j55j74J65J88k34K43p9P6l13K14o8j98O2J53Q1j9J8m5M1
2560H5l3J15j50R4R7l19K59q0q9K46r3k57M3J02L3j7m2k18L40r0q1J42m1k16L76
2585B06P9k00M3j55J3J20k27R4M1N4p7j72N52n29P0K0J67k91M6J64j16m7r1J43
2609i3K18r1k7J05k14M9j28J81N0k32K09o4k42K62K7N1M1j95J14n9L23l38K20
$$ y = [25, 59, -244, 2, -175, -20, -108, -37, -92, 24, -317, -43, -258, -287, 206, -180, -152, -109, -24, 163, -198, -318, -62, -293, -173, -84, -217, -13, 187, -83, 100, 14, -58, 184, -314, 82, -46, 209, 186, 210, 93, 401, 87, 193, 16, 97, 51, 318, 161, 234, -78, 226, 72, 53, 451, 99, 130, 184, 89, 128, 10, 64, -92, 91, 218, 313, -310, -101, 69, -87, 145, -17, 50, -145, -1, 34, -25, -238, -40, 18, 64, 76, -22, -81, -181, -126, -63, 88, -131, -107, 402, -417, 16, -76, -388, -172, 76, 129, -26, -200, -35, 153, -81, 162, 83, 159, -154, 60, -8, -206, -144, 9, 90, 71, 89, 44, 85, 52, 167, 17, 111, 208, -111, 148, 68, -21, 225, 132, -125, -82, 20, 53, 36, -6, -224, 116, 26, -55, 87, 46, -170, 206, 285, 85, 128, -27, -14, 106, -121, -27, 14, 68, -9, -181, 371, -158, -88, -68, 99, -192, -146, 18, -98, -145, -236, -93, 125, 34, 7, 112, -102, -53, -181, 0, 50, -182, 27, -37, -279, -17, 10, 61, 102, -93, 21, -38, 285, -53, 167]
2632A67m0m7r0J63j71q2L78k8p0l5j72L31l29L7K16k45K06p5J10j73k29J19l1
2655i0L02j60j4p5Q2R5n3j35j1J08m5j8k65K54j6P0p4l3K35k32l31L59J8K7j18
2680a20P9K07m16J07J61M2k34L63k09k22J85r2J45J65j14k09P7O5j18L82k60K5
2702Ij96L05j64N3M5J59l07J61L0nPl07K37m8N8J47Q8m94K80o8J62m6L8J34k36
2727D2J38o4j65J72j31J72pkj09J34p0j81j22L83j96j6L09l99K26j80L06j84k9
2750B7m8Oj44O6j7j35J47p6J38j5q3L3ml0J00Q5q5j22N8Q3J05l7o0n6J50p9J25
2777A32n6J69k24P0L4K5k33J48j88L47Kj93J34j89K6q5K69m27K29J6l03L82p1
2800A4M5Ro6j71M73k80j01j1l3K54K53m06j16J07R3o1J26j11q9J47M0j97j01P2
$$ y = [167, 127, 80, -10, 153, -18, -100, 278, 250, 180, 145, -27, 304, -25, 12, 228, -17, 189, 114, 224, 51, -178, -59, -90, 212, 52, 38, -37, 45, 140, 87, -48, -59, 49, 4, -14, -279, -25, -41, 29, -45, -78, 157, -75, -406, -47, -29, -2, -120, -41, 166, -250, -143, 18, 60, -174, 189, -20, -242, -57, -149, -4, 161, 47, -162, -85, -20, -138, 244, -16, 9, -187, 118, -46, 7, 52, 211, -96, 65, 95, 90, 97, -210, 27, -21, 37, 184, 272, -222, 58, -10, 152, 106, 144, 278, 42, 180, 116, -49, 123, -8, 164, 157, 155, 46, 180, 110, -71, -193, 190, -6, -22, 287, -112, 114, -66, 240, 56, 27, -21, -15, -159, -93, -110, -245, -98, -174, -36, -51, -134, -101, -105, -135, -35, 50, -35, -157, -99, -16, 89, 52, -8, -64, 86, 7, 132, 76, 245, 21, 91, 125, 150, -83, 65, -123, 224, 226, 33, 167, -22, 4, -81, 188, -239, -10, 6, -297, 85, 14, 59, 68, 2, -169, 304, 24, -77, -88, -121, 133, 386, -20, -136, -29, 64, 3, 129, 18, -71, 76, 116, -81, -182, -110]
2824a10l0K09q7k43L13l5k23K17k72L96j62o5L3J15k22K94j32r9J3r0J37MP3j28
2848i4Q7k03K48l6Rj87K50R7j82J93k68J2nJ66j36L25k28O1O3j46J24j30P1J26
2872B17q4k20J42j5O9J21k53L1K36q2j15R4j38J24j69M15k87q5P2J0K09l94J66
2895F4N0l8j53k6K69o5j3k08N2K41j89O9q3j61O0J92j21j6k06L89k39J47J35k57
2919a07K48K3k99N7k53J42J71Q5k25N0m5K35pk29J19o3K43Oj35j24O0L63L1j05
2943B41k65L7j9q2J82l87L64n6L1Np7k2K37k00J15p9k1j25K90k74J93j1j79R1
2967a1j00K22j67lJ21M1j88P0m3j97J28j37K82m0l5K27k18Jj96k8J75n9j79K96
2991c8N2Q2K83o07J78K29l88O1K98k22K22J93l98M9J38l12N0m5K64ok79L12o7
$$ y = [-110, -140, 69, -18, -261, 52, 17, -206, 11, -261, 135, -27, -92, -59, 56, -166, 128, -4, -103, -90, -180, -43, -39, 34, -94, -7, -210, 38, 2, 11, -176, 74, 171, -11, 182, -86, -74, -79, 87, -49, 276, 48, 109, 172, 26, 150, 20, 91, 217, 133, -87, 55, 40, 109, 230, -23, 8, 244, 162, 47, 141, 3, 127, -42, 373, 86, 1, 73, 83, 292, -102, 64, 114, 76, -77, -103, 166, 101, 88, -120, -68, 173, -16, 53, -30, -191, -131, 61, -60, -76, -282, 107, -132, 15, 150, -107, 141, 164, -135, -78, -331, -189, -18, 67, -158, -108, -153, 82, 75, -154, -35, -98, 145, 151, 16, -108, -48, 315, 346, 241, -24, 13, -6, -88, 94, -293, 71, 15, 46, 51, -26, -48, 189, -11, 104, 25, 4, -121, 169, -105, 88, 77, -102, -11, -111, 111, -56, -59, 62, 103, -85, -15, -58, -255, -127, -264, 18, -22, -57, 170, -48, -47, -243, -271, -96, -155, -334, -38, 14, 96, 379, -228, -50, 179, -209, -148, 150, -72, 150, 343, -55, -6, 132, -180, -130, -175, 89, 83, -196, 116, 49]
3014D9q0R5m2R0j37j88K00o4n9K13j00P8j80J4J20O9k4j42J30J32j39J08k21R4
3038A6K40n44J92p2J58j09M0J20k39J76Q6O4J19m20p6K39o7o3Q3o3o3P5p8L24
3062A38k76J25j01j08J32K03r8J32p5j97r4J66p1j05J47P5p0J65j13m8N6K79k24
3085C8Q8j07K54j41j6j73J01k35K22L2l63K62O2Pj01N14m40j51J03j0J15k03M61
3108C19j76l47J52R3qr4J23j63K60N5j62j32L4L21j42k28J99j85N9q1J15L9n1
3131@p3Rq5P6J10j49L3r1L65k82M9R6l22J09M93n15J02J74q5p2j0m8J83m7l31
3156c11K69J37j1j22J62K6r0P5j01o7Mr3K1J60j29L26l86N34j80K7j29N3n6j71
3180e2P3j99J98J96n5l73M03l13J34J09J71n30J10N2j46K38J07k20L5R3L0r8n8
$$ y = [49, -31, 64, 22, 112, -25, -213, -13, -77, -136, 77, -23, 55, -125, -111, 9, 78, 54, -88, 42, 174, 35, 143, -78, 16, 256, -288, -96, -168, -10, -119, -79, 41, -198, -22, 64, 128, 247, -173, -249, -10, -77, -140, -57, -120, -183, -108, -186, 138, -138, -13, -114, -222, -90, 113, 15, 147, 72, -125, -219, -53, -124, -229, -82, -7, -77, 88, -25, -73, -17, 262, 38, 126, 19, 273, 132, 116, -57, 44, -191, 31, 63, -300, -38, 24, 31, -70, 444, 4, -147, -44, -54, 61, -142, 319, 143, -204, -52, 41, 33, -61, 62, -101, 159, 214, 52, -80, -46, 275, 133, -95, 104, -81, -22, -103, 12, 51, 0, -73, -64, -149, -73, 37, -112, -79, -170, 195, -87, -38, 58, -264, -155, 338, -177, -75, 99, 14, -58, -68, -116, 67, 20, -311, -42, 95, 84, -38, 124, 150, 60, 135, 34, -33, -29, -122, -101, 59, -70, 256, -130, 404, 224, 251, 122, 175, 119, -52, 21, -178, 20, 216, 161, -212, 191, -122, 12, 121, 292, -238, -128, -76, -222, 16, 123, -97, -62, 31, 61, -37, -95]
3203i5K4K34r0j42n8J01O6k5k53L23m5j28j73K10J8k48L24l00J09O5R2j19j56
3226b66J49K8L0J39J51j47j09l1J21P8j25N8J38p4l35J62N7J3J10j30j02J23o2
3249b4K35j49J52P3l35l08O02j06p6J00j05l00K41O0j00J83o0o0j10J26n5M1j31
3272a06L09j11L9J05k11n7j32K79j82N5J82k76J58j44L3P4p3l81L77J24j16j51
3294b05J12J16P4j28J14k49R5j00m1L58l35J5J86j13K6L53j74J11r2j64J53l7
3316G5J01j36j78J02J84k2q1k59K93j22J40k38J9M3n9L41l62Q8j34K49J52M8j83
3339F1J08m26K26O9K17l12M6k6K25j06Lj6m1n4R0l9j36J8J6L2k72L91k24K9J32
3364A1j69J14jm3M5j7m5L04k42r2N1K35q2k6m1M9k37L21o1k09R2j32J95OJ00p1
$$ y = [-95, -71, 163, 73, -69, -127, -26, 40, 15, -238, 85, 40, -88, -261, -51, -33, -281, 43, -257, -148, -83, 9, -110, -266, -117, -89, -59, 80, 231, 84, -25, -56, 65, 143, 18, 76, 214, 140, -195, -33, 24, 37, 147, 17, -85, 38, -24, 211, 62, 214, 287, -48, -356, 246, 140, 64, 164, 59, -241, 0, 60, -40, 143, 83, 23, -87, 39, -16, 25, -106, 203, 92, 131, 236, 25, -32, -164, 115, -67, -12, 170, -106, 52, -92, -59, 15, -58, -439, -62, 62, -54, -205, -93, 23, 97, -31, 83, -166, -71, -171, -212, 146, -189, -174, 12, -101, -75, 278, 104, 215, 123, -41, 112, 75, 176, 40, -138, -36, 148, 126, 45, -214, 79, -43, 97, -141, -122, -79, -138, 203, -159, -71, -205, 44, 196, 244, 61, 169, -257, -31, 38, 255, -57, -11, -37, 188, 82, 85, 69, 28, -26, 64, 25, -111, -93, -77, -45, -317, 74, -150, -121, 11, -158, -44, -45, -88, -43, -60, -105, 199, -43, -135, -84, 151, 69, 43, 2, 51, -186, 135, 74, -135, -43, -175, 20, 26, 126, 55]
3390E5p7J27l3j22J47QJ34j04k73K19j41j3M04j74p6p6L0K4l19M47k89K63j29
3413C2j05K02k10J89k06N1L04j0n20J29K44j24l1k7K06k07J08k09N3M0K3J00Q3
3436A15p2QM8j61k2k66J60n1K56j4o0K46k08j33K44k08K01mj99R2R0j59M7J25
3460G5jM2j98o3P4J47j05JJ66Q8l52K9M96m59P4J92j69j34K24m4k50J99p2oJ59
3485A13k08J11p9J4K8J15k20K32pk59J79J0R2j17M4j31K1m9J88Kl7q7j50J52M8
3510EP6l21J4K81q2j8j8Or7K5K39j15J6j87K72k1r8j4J11k9J45j31n2j9K05k22
3536b9k02l8L49q3kJ99j00R1o8j39j52J45J77k20K05j63nj5K40J77l73j29K11
3559G6K1o0k49K37j02Q5J24j51J85j73k25K12p1Q1Q5J03m50K37J25j34K13j33
$$ y = [55, -22, 105, 72, -50, 97, 105, 239, 135, -138, 81, -60, -73, 331, 157, 81, 5, 35, 59, -260, 187, -102, 161, 32, -73, 129, -81, 108, -98, -47, 257, 247, -273, -144, 100, -24, -55, -82, 124, -83, 25, -184, -131, -91, -68, 32, 115, 43, 51, 99, -62, -84, -350, -190, -241, 15, 1, -59, 187, -21, -154, 90, -118, 83, 79, -120, -28, 62, -97, -50, 75, 74, 116, -82, -145, -71, 76, -29, -28, 138, 226, -126, -97, 399, -60, 14, 206, 37, -97, 127, 83, -167, 32, -40, -46, 113, -95, 16, -63, -49, -21, 94, -126, 106, 99, -160, 19, 29, 121, 4, 48, -83, -62, -111, 77, 79, 42, -45, -195, -43, 5, 81, -240, -226, 55, -27, -45, -63, -57, -154, -129, 110, -5, 11, -176, 96, 75, -23, -37, 74, 45, 190, 59, 7, -12, 193, -29, -231, -269, 80, -3, -5, 194, 94, 185, 117, -22, -174, -29, 148, -72, 133, -30, -35, -50, 190, 367, -6, -135, 76, 97, 37, -212, 25, -77, 8, 132, -19, 166, -7, -232, -20, -91, -10, 75, 178, -272, -35, 90, -44, 169, 36]
3581C6k15P0Q5o1J09J00q4j10K47k26l8j66L80K5k60J45j42J56nJl06M84k56%
3605c1J19l3j65j41L78k07J39O9J7M3j51j41n5K14M3j20J53P6m0m9k10l4K73l15
3629a68L5K57j12J1K21j26J00j04j04o0r2R0L1p0M0L0K22k9k74J36j46k4l6K51
3653G9j99L11j15j8k28J54R2k23L8j34K02K97l79J46r2j58J67K4L6m5N0no4m3
3677a07K8j14L54k57Q3l1k45J55J50L59l18p6J81qn6k47J63l5nK52l77J02J51
3700A02j07mo5MK01K4m2m8j60J41J26m6p1P5m5J67k04M1M8j60J26J01l9p1j69
3725g5J51j63l6r7J43o9K98k79J19j49K99o2j93J45n1N1j09j34R6J35O2r3j13
3748a24J59j94J86K2j74J86j00J53R1l60J28Q4k04j9K16k64L99l46M10k50j62
$$ y = [36, -179, -109, -24, -85, 24, 124, 40, -70, 177, -49, -87, -253, 127, 152, -108, 37, -105, 51, 46, 47, -259, 225, -31, -31, 88, 55, -110, -251, 127, -80, 59, 128, 145, 188, 37, -104, -159, 55, 98, -22, 131, 207, 167, 118, -92, -126, 147, -168, -133, 124, 12, 23, 244, 118, 218, 114, 10, -50, -142, -52, -21, -91, -51, -21, 201, 172, -102, 34, -112, -136, -172, 79, -120, 191, 76, 58, -170, -16, 76, -147, -109, -243, -41, 256, -123, 23, -69, -227, -60, -36, 0, -45, 5, 0, -64, -107, -79, -193, 161, -96, -13, -44, -289, -134, 16, 375, 57, -19, 162, 154, 98, -149, 14, -21, -26, 226, -151, -49, 102, -5, -9, -74, -70, 131, 155, 113, 65, -95, 46, 172, 126, 55, 130, 85, 252, 48, 89, 137, -23, 103, 204, 165, 94, -75, 76, -87, -123, -220, -77, -146, 152, -127, -8, -157, 142, 80, -113, 32, -19, 32, -77, -211, -115, 20, 82, -11, -124, 35, -159, 27, 49, -125, 61, -39, 114, 205, -155, -27, 57, -147, -166, 50, -214, 185, -161, 249, -1, -163]
3769a63R1K35j62M9k07K40J02l87Q2K8K6J76j21L7R4l08K02N6K7l0k22J96p9o2
3793a00O4j42M7L62J97n02K3J39j38jJ82p8j86J41j8j12K56k73j10L9J19K02l33
3816b22J81p9P3OM5j30J06P4qJ28j62K2j17K60j13q9j21Q9K15j26o5N4nk5r6J
3842a04J07m4m5J05p4J2K13j53R4j38j63L25r0j53R1Q9Q5p6O5k0N8J6m83L90k63
3867a56J55N3P3m15J88Q9J22j10k4r7Q2m6K70k51L2L51k13k41j08L31k07L86k46
3890A8J12J1n5K6o8l4k16J85j63j45N21k92K02j55r0Q4j20K09k9OJ47q9NJ4r3
3915iK81m42J88L5MJ2k6m7L6p3R2p9k21N04l54J78Kj21J57j64J64k65J91j06j03
3940a66R2K70k99J90j6j07j52J14J8K4k10J96j7j83L30K7j58J56p9j64P7j20K41
$$ y = [-163, -72, 163, 1, 50, -157, 83, 185, -202, -120, -92, -66, 110, -11, 26, 120, -188, 14, 70, 97, 67, -155, 41, -38, -100, -36, -178, -131, 231, 428, -74, -51, 88, -50, -51, 131, 53, -133, 8, -10, -122, 134, -139, -249, -210, -91, 111, -222, -41, -120, -47, -41, 4, -126, -20, 54, 46, 174, 12, 34, -83, 177, 64, -25, -146, -57, 158, 32, -33, 21, 16, -9, -105, -104, 3, -41, -86, 19, -55, -43, 170, 17, 111, -27, -190, 135, 45, -108, -17, 72, 157, 81, 146, 126, 184, 200, -283, 107, -156, -1, 52, 125, -290, -102, -13, 109, -1, -25, -122, -40, -86, 184, -67, -35, 316, 103, -138, -246, 85, -122, 264, 18, 130, 141, 86, 112, 44, 10, -206, -21, -184, -329, 192, -100, 102, -53, -143, -59, -179, 30, 1, 7, 154, 65, 70, 84, -9, 272, -170, 18, 53, 57, 69, 43, -4, 32, -41, 51, -28, -249, 255, -99, 79, 81, -40, 117, -47, 117, -148, 43, -63, -166, -74, 196, -103, 87, 71, -36, -188, -74, -56, -32, -242, -46, -63, -246, 84, 111, -47, 109, 30, -134, -57, -177, 64]
3963F4j20J27j31k3k09K86N6l1j28M72m53N8J10J47q1l20K85j99J86m3R2j80K11
3986A76M2j35j94L33k22Mk0j71J79N4O3jj44L8K8k20M45k36j95j9J25j27M35k05
4010C3nj30N1J75k62R6K62l17j06K29j74L08k56J60q8R2ml79J85K49j73j30K55
4033G1q9J37p7j81K20N5jl32K32j19J02r0j89L88o2k96R6o5L12j05P5j21nJ52
4057A08k4j31o6J91n8J00k65K24p0J13M7k78O8r4K46l33K74R9l73L11k61k0K78
4080H6J04J04n57O37l97l2J77k89L01j49K74p2j40l6Q6j68Q1k65L09j00J68k49
4102a27K43q8j57pK11O2k93K88qk04K0M6p6J54k9p3j3J34P3j93RJ21k91Q4J56
4127D2n3J3J68k02j6n8P9L9j26J04J51q4j1k17K17J64m0k06N9P1K9k30L66l18
$$ y = [64, -56, 71, -60, -83, -292, -6, 50, 19, -109, 363, -90, -32, 78, 225, 144, -176, 109, -90, 96, 53, 145, -35, 176, 218, 83, -111, 222, 0, 4, -16, -187, -8, 46, 109, 108, -36, 2, 30, -190, 255, 19, -176, -195, -70, -197, 238, 33, 28, -102, -51, 124, -138, -42, 220, -97, -203, 26, -148, 160, -96, 64, -24, 68, 64, -315, -130, 119, -54, -184, 71, -18, 119, 42, -139, 81, 136, 135, -197, 35, -84, 18, -72, -261, 127, 65, -231, -135, -200, 112, 7, 82, -39, -44, 108, 84, -47, -113, 78, 20, 120, -145, 79, 9, 122, 169, -109, -41, -135, 111, -222, 52, 151, -222, 89, -172, -192, 86, 190, 294, -263, 374, -23, -55, 122, -167, 134, -15, 259, 187, 47, 11, 97, -71, 10, -255, 54, -46, 122, -127, 116, 28, -129, -136, 75, 137, -156, 132, 124, -80, -60, -14, -90, 64, 35, -38, -51, 83, 156, -37, -28, 93, -198, -114, 42, -11, 2, 170, -32, -48, -106, -27, 12, -114, -10, 141, 57, 46, -171, 46, 210, 170, -36, 23, 94, 123, -107, 259, -59]
4151e9P1o4Q1j03o8J28k46K83j47K80l14K92R5l66L16r2j44J74j06k03N4O3J52
4174G7k47J63M5k5p9K8O7O0q7r3R6k71L18n7K33l82L5Q1nJ49k2p3P2l12K95j05
4200c9R1R7j59J07j8J07j76J87l38j0J48j46k0K25r7L6L10k71Lk62K80K50k36
4223F9K45n27J08J13J28r3n9J52r5J02K27l89j78M41j59k93N7K82j77oQ0Oj29
4246i5l7Q1j93K26L7P8O0j67M6l4k86K83J01r6L4Q8k79K90j49j18J78k40q0k9
4270c01L27j91m4K58j06N0R5N4N4j41K01k79o4J6N6j17K84j55k28K84q7J62l74
4293b46J92R9R2j65k05Q4O2J16oJ6q1J65k06PJ43j77J78k04O1R0K1J7%M8k21K20
4319A00j94K4NL08k95M59m21R5j55n7K27L0L4j10j56qk1j2P8m9J17l8o6J01r8
$$ y = [-59, 12, -52, 29, -74, -142, -14, -260, 23, -124, 156, -158, 134, 229, -137, 179, 87, -57, 117, 11, -192, -138, -75, 77, -170, -7, 38, 13, -66, -38, 29, 89, 2, -91, 5, -266, 52, -5, 228, -154, -119, -38, -43, 106, 84, 11, 83, -229, 66, -39, 52, 149, -10, 97, 79, 186, 10, 197, -141, -151, -3, -149, -169, 56, -41, -5, 305, 34, 37, -225, 55, 305, 69, 314, -213, -105, 8, 136, 43, -16, 136, 41, 143, 370, -19, -197, 244, 85, -208, -151, 131, -46, -52, 28, 34, -95, -132, -51, -244, -18, 19, 97, 157, -10, 36, 2, -284, -1, 100, 4, 38, 126, -153, 137, -12, -130, 48, -192, -272, -301, 26, -165, -209, 49, -57, -7, 88, 142, 196, 55, 256, -23, -87, -71, -15, -132, 152, -3, -231, 53, -34, 128, -246, -54, 45, 137, -28, -233, -149, -87, 29, 23, 39, -42, 123, -83, -76, 67, -110, 68, -136, -75, 15, 36, 53, 53, 101, -120, 100, -94, -70, -65, 243, -52, 407, -14, 81, -74, -131, 96, 126, 160, 50, -106, -114, -135, -147, -69, -118, -1, -39, -105, -4, -102]
4344a02J46j32O9j13j39N8L7K26k01p7L43j53J0O8J79n02M15j21J05k9k66M04
4366B25j28J59j05o2pJJ19k76J35m0k6K39k60q1J07L0J90k52O4l9j11L35k16R2
4390I3J8j82l9J46j16J30M5r9j26rL5J57m6k33L52r6K7J77k25k46Q6m5L24P7l15
4415a10n9K24j08K45k03L9J75k33k4Q3o9OJ78j84K8J31j98r6J94k53K90j15K38
4438A79j96J22j99K18m4L1j78Q2Q0j22P2j6j03j4J73nJ96l00K02j96J16p5J49
4461A72n0k9l59L32j65P6J16J0l04K28Q0k01J19j77j7J45J70j00j84J54k03OL7
4484a44L3L09m12J76j95L14j55J8o8kK3O4J39k11n0l3P8K18k99L54k4Q7k32q3
4508i5J94k87P5L0K01l18K37j33J47k16k0L87l02P4J68j71o1KJ55j14J53j72K43
$$ y = [-102, 44, -88, -19, -132, -271, -213, -176, 50, -151, -228, 115, -38, -28, 40, 219, -283, 132, 11, 116, 87, -179, 225, 97, 256, 151, 89, 82, 83, 202, -74, 61, 21, -5, 234, -26, -107, 0, 30, 220, -32, 32, -7, -118, 217, 1, 93, 111, -71, -110, 36, -80, 50, 95, -4, -130, -139, -104, 53, 7, -226, 126, 30, 57, 234, 9, -237, -151, -196, 128, 205, -110, -169, 55, -53, 192, -11, 28, 203, -30, -54, 29, -40, -34, 144, -40, -12, 119, -79, -175, 19, -234, 56, -59, 179, -17, 105, -94, 124, 80, 111, -67, 15, 95, -27, 45, 29, -74, -88, 85, 80, 276, -24, 178, -18, 98, 23, 172, 122, 93, -266, 66, -99, -23, 93, 103, -201, 27, 107, -94, 25, -152, -169, -24, 146, 46, -138, 16, -187, -181, -144, -111, 198, -214, -38, -233, 81, -74, -56, -124, -126, -103, -39, 100, -111, -161, -194, -116, 102, -197, 157, 133, 220, -12, -95, 99, -188, -113, -83, 118, -200, 37, -96, 51, -165, -185, 202, -100, -26, 142, -29, -90, -88, 67, -47, 106, -66, 177]
4531A77k30j5R6K18k75Q5j11J71j00L3O4n6J16p4j5%l8r0J13p6Mk26L65j28j17
4556a09J28p7K1K58l26K31k48J84o7j72M33l69L82l97L43j54j29k91K40mJ56J08
4578A41j67k43K01j27J12K02O5j65k44L16j73R0N7R9n3N0l28L70l97M73k83K71
4600B67k50Q2K2j32J64j03j9K1J1o9m1J61Q9p6k03kj75K13Q3j1k39J00j3N4L5
4625c1j5O5j80j45L56n4q7q3j60K60K7N1K86j43k80J67M5j00N7Pk06p1J09O8l0
4650h7J9j02J06M3Q0j13J40r3O8k31L4J9R3p7J22l7m9j42J91j3J34P8j37M5l1
4675F0j18p2K48j83J71o9j16O4j30K23j58j40J8L55o1k18K48j71K1l7o5L20j56
4698C4n4nj73O4M63l56O1K19j35Q7l47j9L3RJ45j50l4J28o0o5P2j44K40J6M2j00
$$ y = [177, -53, -68, 28, 246, -29, 56, -55, 116, 16, 49, 113, 57, 173, 99, 84, 84, 46, -44, 69, -7, -3, -229, 136, 8, -109, 19, -58, -37, 221, -105, 126, -122, 62, -5, -177, 256, -113, 269, -128, 215, 61, -68, -359, -119, -123, 33, 141, -26, -269, -68, -195, -83, 119, 184, 19, -225, 91, -82, 8, 65, 164, 111, 161, -167, 203, -194, 279, -4, 267, 17, 99, 121, -11, 153, 50, 31, 52, 63, -6, -47, 114, 203, 127, -76, -78, -253, -40, 43, 32, -207, -107, -120, -66, -31, -46, 19, -161, -306, 50, -4, -91, -174, -334, -74, -47, 4, 290, 147, -133, 34, 79, -21, 36, 43, -163, -234, -125, -57, -87, -68, -170, -64, -21, 59, -54, 86, -7, 61, -170, -136, -117, -24, -101, 21, -16, -65, -207, -16, -29, 105, 183, 46, 91, 60, -58, -130, 118, -65, 106, 37, -79, -15, -145, 78, -80, -220, -202, 153, 92, -126, 122, -49, -28, -65, -130, 190, 34, -20, -25, -198, -134, 329, -27, 34, 253, 118, 205, -142, -161, -128, -119, 26, -124, -158, -30, -90, -155, -83, -227, 13, 29, 71, -29]
4724b9k6J23M4j65J64j17J46q5QL8j89K08q6l39L46p4k3j17L34l51rJ20J4J43
4748G8O4m80J57J74q3J98l1j64j7p2K51J11q2J84l01j05R0lk0J29N8j62n1J61
4772H4j16P5L4k80o0K09J14j25j64J94j47K90k38K59J34M6m04J19Rn5j13k9j1
4795a75M38l77J54k08J95J92n6J5j08J13k21n7K34k9j1k19J21j51K97j99k31K94
4817A1O0j8q3J44k81K96J67l77L2L9k6q6K60l1P2n4p9j13q0L12k81j1m2M5j18
4842b42J72m%J49J33j41k09L11k53R4J43O7l51J14j49J67k7o0L1k02J46l5M1N9
4866d6j38J41l27K00J81k30J16J51k44kJ30O2j71J52J08K18k90P4k32pJ98l05
4888b61L28Q5j29K6r3K26m9l09K49M6q7l9K7L2J8j96M0Q5n9J59mJ6R3j07p5r8
$$ y = [-29, -55, 68, 112, -53, 111, -6, 140, 55, 63, 101, -88, 120, 34, -305, 41, -33, -56, -173, 161, -190, -199, -79, -65, 78, 142, -338, -181, -7, -90, 108, 77, -87, -104, -176, 75, 186, 104, 288, -13, -118, -28, -31, -51, 78, 136, -26, -77, 84, -32, 43, 77, -203, -263, -54, 60, -65, -229, -35, -182, 108, -130, 129, 263, 309, -95, 24, 33, -22, -135, -164, -175, 263, -114, 40, -168, 27, 219, 163, 178, 70, 183, -38, -95, 139, 110, 99, -120, 1, -150, 147, -52, -283, 11, 71, 53, -30, 114, -167, 129, 296, -81, -49, -10, -36, -122, 138, 107, 179, 125, 46, -67, -147, 165, -116, -127, -169, -124, -242, -70, -74, -74, 75, 208, 67, -142, 169, -84, 10, 153, 220, -131, -17, -166, 1, -26, -86, -55, -257, -111, -146, -105, -46, -184, -43, -370, -170, 11, -219, -103, 48, -196, -198, -68, -6, -177, -25, 83, 301, 11, 85, -147, -154, 44, -261, 67, 152, 23, 49, -44, 182, 133, -176, 73, 119, 32, -7, 20, 52, 70, -126, -86, -1, -60, 99, 95, 111, 204, 97, 22, -76]
4914g6j4M17j64k03o6l4j02O1J45p8K2J08o8p2K14l48K44M4j97J95l1pKK4r9J35
4940E2k70J51o3j02J24O5n4J26nk5O1k26j0J75J37k69K04M4j01k7J94l7j83J71
4964A32M5l3L3k28K06n4M5k41l0J58Qj27J75j25j2%J67N8J23j53j97J29o8o7J58
4989A02l9P1k26P7K68j93j14L5n6L94k17j08Q2J9J51j37p6j41R7K0L4k4l6k5j3
5014e5J68p8L7Kr6n2K13q9J48j35j47R6k98L26j25J68j9k9K47n75J99J83k5m07
5038c43L87K0j65J22m2Mk6K4J63q7O3J17j73MK1L3m8j45J26M0j69lL9j06K48J7
5064A21M5k00J10J00j94l5k97L95j87o8K81j77L29k02m88J79K71q2l2J90m4k24
5086b09K19o0J2j80K19j02P5k4O0r2q7J88j17O3l2K40O5k51j87K72k44L2L17l52
$$ y = [-76, -90, 327, 163, -40, -106, -140, -242, -181, -36, -114, -92, 16, -52, -124, 90, -258, -14, 30, -167, 28, -3, -10, -8, 16, -83, 52, -218, -67, -130, -232, -108, -43, -97, 29, 24, -1, 60, -166, -176, -1, 136, -133, 71, 115, 14, -13, 181, 144, -39, 132, 177, 144, 177, -51, 155, 101, 146, -95, -125, 33, 41, -86, 89, -36, -48, -48, 119, 177, 300, 147, -50, 79, 11, -56, 102, 63, 134, -92, -15, 253, 60, -54, -19, -75, 319, 102, -6, 76, 95, 246, 109, 33, -108, -11, 9, 43, 19, -17, -42, -55, 113, 35, 72, 74, -22, -74, 139, 50, 198, 63, -84, 12, -286, 40, -85, 83, 64, 35, 282, -293, -94, 89, 64, -343, 44, 64, -101, 21, -21, -17, -43, -19, 144, 57, 120, 237, 64, 68, 89, 122, 74, -71, 55, 95, -74, -77, -38, -144, 104, 121, 166, -34, 76, 176, -18, -53, -350, 45, -142, -210, 71, -106, 223, 21, -467, -288, -17, -99, -131, 59, 15, -209, 10, -50, -38, -218, 1, -101, -26, -50, 10, -82, -169, 19, -98, -35, -67, 173, 238, -13, -200, 72, -172, -140, 177, -175]
5110a75J12N5J54r4J36j03j75j63L20N4O4j27k14K61KL1k07K22r6q3L26j52k30
5133h2J25M2m4j1j25K77k88R4o8N3K45k97K27m5j51%J53J0j71K36L2l5J19j36
5157A60m9k80N27j3l38r6k1J71j26J41k21m6J09J56j67Q8j35K30j00J41m6n1n8
5180b4Q7K27j85o0n9j0L7j00O6k6J10k5r8J15k69M20j68J50j27J34K3k79K1j01
5204a41M4k13K96J73k43L95K3l08q6K55l45P6r0K44r6L3j92q3K99j13L19k67q7
5227a07k0L0NJ4M04l15qj23j9J37j18K12l7j88j02K11R6j17m2Oj50J06L0K14k15
5252i6R7k9n5p3J43J38j53k18K48l5k3K53o8j53l2J22j34J62j52K68m58M22j82
5275hJ48p8k21M23j45j1L1j54L9k3n5J37o4N0k38K07j60J41J29j92L0MJ9J0r8
$$ y = [-175, -63, -8, 146, 52, 188, 85, -90, -253, 67, 121, 185, 58, -156, 105, 107, 138, -69, 153, 57, -26, 300, 148, -82, 43, 85, 41, 30, -95, 182, -106, -12, -80, -27, 218, -79, 148, 103, -48, -48, 105, 115, -56, 180, 212, 177, 296, 160, 111, -169, 358, 345, 7, -89, -110, 61, -65, 76, -145, -191, -82, 74, -93, -5, -140, 90, -10, 131, 85, 34, -24, 63, 290, 105, 45, -14, -24, 13, -87, -21, -47, 63, 38, -60, 55, -214, 206, 38, 188, 61, 195, 218, -61, -40, -141, -97, -310, -14, 159, -84, 311, 334, 26, -60, 195, -150, -74, -164, 80, -16, 17, -175, -258, 41, -72, 247, -20, -107, -127, -97, -92, -78, 326, 11, 3, -120, -139, -2, -120, 92, 55, -133, -235, -24, 72, -45, -87, -81, -231, -125, -95, 119, -96, 1, -28, -83, -156, -13, 125, -28, -246, 2, -33, -56, 197, 129, -24, -56, 66, -68, 94, -58, 210, -248, 174, -8, 140, 62, -159, 264, 119, 108, 139, -15, 24, 1, -54, 83, 19, 69, -169, 38, -122, 19, 148, -44, -14, -10, 9, 19, -79]
5300g9j4K20k85l7K67r8r3J59Pr8k37J78M5J32R5j09J15k08K01k79L59J8l89J95
5324F5k25Q9p4K47k73J63m5J04q5j09J24qJ91j50K75l38l2J58l7J68m26PL18L4
5348A41J49l77J03Mj4q0J77j19j50K26M11o68J74Q6j30P7k00L07J9l16N6Q1j8
5371f1O7j20K0J54J41j17k54J72R1k16L37p4l40L01k7k52J42M3N0j03Np9j90M62
5395A52o0j04r5j44K55NQ2r5m5m2J84k65M60l74K3j6r9j1R0K51l00J16pn4J82
5420H9n1j39K23j56kk17K71k30L08j83R2L08k49j63L44m76O7J31QM5p4k20K11
5443f3m7J81j13J55J50k11N8j49J12L0j36K43j88rq0K39p1m0j82Q9J04j26M6J13
5467A05k38J26Mk7j24Q0m3j99M35p8p7j14L65j48j25q5M10r6l38L25j09j13K03
$$ y = [-79, -93, 127, -158, -195, 72, -26, -119, 40, 47, -51, -288, -110, -65, 67, 162, 53, 168, -40, 161, -118, 241, 259, -130, 65, -160, -71, -145, 102, -171, -8, -53, 51, -34, -143, -19, -27, 164, 14, 289, -49, -81, 77, 40, 208, -218, -211, 107, 141, 290, -87, 16, 20, 6, -74, 103, -16, -166, 60, 471, -197, -23, 63, -67, 10, -190, 117, 136, -180, -124, -43, -61, 6, -114, -94, 60, 201, 84, -170, 2, 93, -123, 214, 140, -200, 101, 74, -178, -36, 7, 57, -46, -41, -120, -310, 152, 92, -12, -107, -251, 4, 9, 91, -4, -49, -91, 93, -172, 288, -86, -63, -79, -178, -189, -99, 152, -148, -32, -39, -93, 89, 38, -101, 122, -34, -36, -253, 18, -212, 96, -87, 5, 313, 64, -99, 245, -231, -164, -33, -25, 20, -54, -274, -63, -110, 71, -42, 113, 263, 52, 110, -39, 73, 103, -33, 210, 22, 13, -67, 172, 101, 61, -121, -32, 72, -54, -8, 105, -133, -7, -3, -30, -154, -74, -117, -316, 119, 41, -36, -150, 215, 67, -58, -143, 267, 171, -167, 158, 49, -64, 139]
5490A39l11J23j0O7r2P8l7K81m07K78J02m90L22n5j02K10p6J3j67K92J1l98K72
5513D3j98L39j47l7l8J03l23K65n5Q2J38k61rK23l0M8k65K69k31j1J78l01K43
5536B5j12q4M4L37l95J40Q2O5j39K9N1j48j51J53L11l08P0K4K31n04K07J53k49
5559a68K64q1o6Q1j91j8K08Kn3J42J70j71j45P7j55m3J6K00j66K75M4n07M36J6
5583A67k16J17lJ35l51k03L87j11J19k4k00L66k14N9j80K01k6k9k09R5K37k92
5605a75J10r3R7J20j07k3J03k24K42j29J80l87J11J55n6n6J25J58N9k95J11k00
5627a74j48M92k69J18k1p7P9J5n3J85N6m50K62ll1k03N3m8K75j32J16j31n2K3
5651a18Q1j13J01o0K08p7J61p7%r1K38l24L11p7n8J07l53K62j32J15J29l38O6
$$ y = [139, -172, -49, -59, 8, -84, -6, -43, 238, -169, 109, 211, -279, 43, -12, -114, 96, 20, 33, -134, 158, 169, -229, 43, -155, 184, 37, 0, -38, 65, -258, 7, -48, 34, 172, -89, -98, 125, 95, 143, -122, 147, -84, -95, 83, -218, 25, -87, -171, -127, 210, -185, -45, 37, 102, -37, -8, 43, -105, -256, -103, 208, -100, -30, -6, 225, -279, -72, 81, -168, 96, 15, -51, 30, -161, -179, 29, 31, -22, 120, 290, 119, -26, 51, -104, -147, -131, 69, -97, 178, 222, -285, 151, 167, -49, 68, 65, 200, -151, -354, 33, -78, 41, 17, -183, 183, -31, 28, -152, 49, 23, -6, -215, -120, 117, -175, -65, -158, -61, 59, -48, -71, 32, -192, 50, -79, 101, -286, -175, -20, -76, -132, -7, 151, 210, -85, 26, -174, -322, 170, -99, 19, -2, -79, 0, 15, -38, 147, 203, -247, 15, 12, -19, -222, -169, -217, 58, -74, 42, -89, -141, -118, -37, -150, -49, -109, 99, 22, 183, 106, 106, 15, 253, -71, 240, 163, 105, 212, -141, 121, -11, 104, 233, -105, -39]
5674c9r1K78k38J66Lk17J17j80L43l21K25rm3m5o6M5j27J50r9R6J55n9r8o5j6
5699a35J86J72l59L71j54J33l26l7J15Q9l1n6k10L19l19L14k49p1M24o3j21J84
5721A76k62J45j12K8kj34K84k01K23Q7q1j10j15O7L1N8Oj44L33l17Jj6L05k42
5745HJ09j95QJ85j62o6k4k8K21k52R1J24J0o2j87L13j49QKp7Q3J71k04J70Q8k05
5771b0j42j19L20nJ25j00m7n6J71k08j01J52L31k50j16o7J09J96l41K30PL0K6
5794A25j27J58j66j66L5J41J37k61P0j06M8K21m9j36J92j51R7k81L2K70M7j16
5816A4j85J0J68K40k28J8p8q2L5L07l85L22k06J10K9j11O1qj91RJ07m7K07M2m27
5841b69J65J14j52J98j43J34R4k80L75k47j04J94k21J97j41J26j75OJ85l30J70
$$ y = [-39, -130, 148, -90, 76, 79, -138, -21, -201, 142, -179, 46, 37, -6, -51, -117, -72, -199, -49, -148, -52, 103, 44, -54, -119, -135, 51, 223, -136, 235, 81, 214, -112, -149, -34, 55, 24, -32, -242, 77, -242, 72, -177, -248, 176, 113, -8, 176, -86, 59, -53, -25, -27, -161, 123, -78, 145, 232, 151, 41, -74, -7, 24, 82, 88, -56, 277, -40, -39, -55, 250, 8, 117, -78, -70, 115, -47, -113, -137, -165, 56, -196, -105, 19, 29, -33, -220, 93, -56, -48, -46, -123, -40, 131, -73, 97, 185, -20, -162, -281, 39, 34, 159, 59, 12, -44, 127, -81, -182, -30, 301, 51, -65, -132, -23, 173, -168, 62, 69, 99, 125, -2, 156, -10, -176, -141, 0, 137, -124, -54, -160, -112, 109, 60, -76, 116, -35, 62, -219, -187, 83, 130, 14, -171, -161, 7, 247, 19, 37, -41, -123, -88, 219, -166, 156, -50, 60, 89, -22, 39, 31, -160, -151, -44, -91, 116, 158, -269, -104, 10, -142, 56, -87, 47, 141, -139, 236, -11, -115, 79, -142, 55, -86, 40, -135, -129, 56, -274, -104]
5862a04m3n3K16q3K34k98L47j87r6J83j53j12J00mN9m4o5o0K95j75K81j97j25
5885h4PL02r3j90O4K5J49k69P0J92l34OP7N5J09o1J6l6M2j14K0N2p2k1l7J73k29
5912a81J63k65J93J39j57R0J76m1l71K75j13j01J9m1P0J78O6m2J52j90j79J19
5934d1K70k49J20j78J28K6j47P2j51q7L00k30P5O2O7L6j74K37k29M8Q9k9J10k60
5958a35J27Lj60P3jr5J96J33L8j05Ok18l04O43k34K10l22L6K05j00M4k8m8k9m5
5983a10J81l38N04l08qJ52m8K24j47j88j71M76k06k53k46K66J85k9j97M2P3J05
6005d1NJ35j43j24L23j73K46j39k68LL15o2J08j59J01j64J83J64j82k15J69j07
6027b5J8j23J90n0J46j67K69n80K62J54j42O5J5j9L4j79J23L1nJ31j07Q3R7k37
$$ y = [-104, -147, -200, 16, -67, 167, -131, 216, 29, -67, 116, -37, -149, -49, -53, 6, -38, -103, -163, 132, -43, 238, 41, -84, -77, 225, 132, -58, 6, 31, 180, -89, -19, 173, -161, -155, -78, -23, 86, 25, 41, 5, 47, -67, -47, 5, -67, -88, -125, 48, -181, -18, -283, -90, 49, -108, -18, 158, 117, -254, 21, -92, -193, -174, -215, -145, 33, 99, 57, 209, 19, -160, -41, 229, -20, 100, -78, 50, 76, -71, 1, -150, -237, 63, -167, -92, -30, 37, 73, -101, 136, -93, -45, 44, 15, 125, -135, -8, -5, -165, -92, -93, -188, 8, 141, 179, 74, 80, -138, -442, 201, -33, 177, -145, -109, 96, -4, 40, 12, -36, -65, -110, 71, -267, 237, -71, -79, 73, 25, 249, 102, -86, -257, 219, 13, -240, -486, -220, -35, -64, -261, -219, -146, -41, -36, 99, -44, -168, 155, -18, 228, 89, -179, -176, 139, 77, 185, 26, 127, -37, 146, 310, 128, -87, 82, -25, -7, -130, 60, 10, 156, -11, 258, -322, -60, 94, -48, 17, 32, 13, 47, -132, -9, 22, 17, 148, 41, 124, 221, -16]
6051a6M7Q2j14mj0M7K3k7J90k04j1J29j18J32r2j72K38j28o9K0nj80J24P4J2J66
6077A34j27k36J72J19o2j97K54Q0j02k39K1K24o7O0P8n2R0k21J80q1p9M3K5n3
6101c6Q6j44J57r4J72k41K02J1j98l6O1M5R9j31K53j14r7j8m0m4p6K50j66NK09
6126A15m92L37k05N22j24j68l5R3J4N8k11k00L56K04l39K37j31J22m8p0J66n2
6148A49j15j16o9q8L08k64L50j34k11K04k3n6O7J67p9R9j55P1l04K48j08J69l32
6171b22L01p4o2K6J06j56J4P0l1N8N8Kk81J11K27k47k8n4P2m5K0J12r8Q2j8k2
6197g9l05L01j3J25j11P6j10n9L07j24k46L21j02j12o8J46l7p3L15k55J06K17
6219B20l9j42n1J3N1n3r8K57k20l7Oj49N1KL08j26Pl9R8Q2m28J63j41L11q2n4
$$ y = [-16, 31, 113, -1, -5, -15, 32, 55, 28, 218, 14, 3, 132, 14, 146, 54, -118, 120, -8, -77, -57, -62, -242, -118, -44, -32, 134, 7, -229, -57, 62, 0, -197, 57, 137, 35, -204, -183, 41, -26, 34, 112, 60, 150, -71, 109, 28, -51, -8, 17, -36, 50, -94, 63, -31, 141, -100, 102, 113, -85, -121, -60, -15, 84, -47, 206, 92, -5, -23, -63, -107, -183, 67, -99, -94, 115, -377, -40, -245, 277, 153, -15, -50, 43, 57, 115, -96, -296, 60, 264, -75, 162, 31, 153, 105, 35, 201, 149, 34, -82, -151, -239, 69, -195, 155, 21, -190, 14, -9, -65, 2, 169, 90, 189, 34, 105, -199, 49, -59, 110, -222, 79, 5, -57, -31, 75, -81, -67, 3, -28, 30, 88, 90, -191, -80, 147, -100, -128, -182, -110, -155, -135, -23, -121, -39, -57, -79, -384, -83, -96, 29, -82, -6, -116, -175, 132, 8, -238, 83, -19, -131, -199, -53, -90, -163, 152, -103, 3, 220, 181, 39, -12, 1, 52, -1, -99, 158, -62, -99, -93, -242, -191, -189, 119, -7, 0, -39, 59, 141, -287, -124, -265, 46, -36, -90]
6245i0J41O1p8K5k72K28M5j53l4J42j74L52oj77k13K21l4N9j7K8N6P2j19J2J6
6270I1j2k30K26k24J98O3K4j64k59L81K51m13K9Q1o8J26l03J58j64J79P9j53J49
6293D5R4k57L12l6j0j31K6J60j42j09N5O9l30K66K44o45M56k05M1j0J7K5J42o2
6317A5J08p0k68O9L48m23M46k21O7n5J27k36K4L0J71j83M9M5Nl7j46J66P5pk86
6342a87K9K40k60L01j78N2m7K13j72j29P5K12l14o1L1r7QL95m1n6J32r8Km9P5
6367G6j87p8k4K15r3qK44k47J74j27Mj20J31M4j09j22M47k26r1J02j14O0Lm2J02
6392A4k48L03k69L21j78N3p5O9j59m9LK05K7r9q6K39l66L67m8q2o5J70k10J30
6416c3r4N1N7L66l26Q4j81q3J73j2O7J39l04r7L06j40k8R8lj52k3K45j58j8J75
$$ y = [-90, 51, 112, 34, 59, -213, 15, 60, -93, -127, 15, -159, 193, 187, 10, -203, 18, -16, 43, 26, 54, 110, 182, 63, 75, 91, 79, -151, 75, -149, 49, 112, 136, -28, -287, 94, 345, -68, -39, 42, -26, 100, -203, -45, -209, -30, 49, -104, 45, 139, -118, 194, 158, 148, 17, 43, 203, 61, -48, 7, 76, -254, 12, 256, -389, 67, -138, -97, -107, -90, -65, 77, 15, 123, 53, -215, -146, 202, -221, 225, 4, 71, 16, 143, -93, -69, -39, 132, -51, -2, 43, 48, 11, -135, 31, 106, 99, -187, -158, 82, -178, 123, -55, -3, -50, 163, -9, -138, -63, 149, -165, -226, -195, -292, -284, 111, 70, 14, 146, 48, 50, 1, 76, -111, -189, -213, 2, -91, -99, 145, -102, 72, -55, -51, -171, -40, 4, -105, -227, 220, -6, -97, 5, -109, -49, -46, -88, 14, -234, 69, -200, 121, -57, -4, -79, -10, -169, -218, -215, -10, 17, -82, -168, 71, -295, 72, 24, -58, -123, 47, -163, -33, -127, -76, -19, 347, 21, 105, -76, -159, 14, 2, 69, 208, -96, -193, 113, -27, -55, 43, 40, -112, -135, 110, -48, -66, 109]
6441A09k61J64J55j42Oj87J55L7m5R3j65J34L1j12M4m2J8J52N3k23J4K9O3Qj10
6466b2on0J03j05J6J10j73O9J99l51K3L84k78j20K09J53k08j38K00o8J61kjp9
6490B6j9Nj07N39p14K40J40K56k85l45J70J08j5P4r7p1n2J8R8J15Q2j33L0k09
6514a46J12J90j6j66j56K60l85K91J7rmL07j80j59K97k53n2n3J32k1l7M9j26J35
6538B7j08J20Q5Lp9J57j31r1J9Q0j11j04J85k11J88n6j58L4R4PJ47m7k41K95k60
6563a56J03k6L50l71RN3J92k59J6J33j28J95q7k5J5j34J57o7O5j37j01nL66j94
6587c6r4R6k68M26j39k15l2J46KO7k4L9L8m0j69R6R0n6P4j2j21K58j84O5j29O8
6613e4j13l2n1L18m5j49j19J75M8m0j06p1M40r2o3j24k1JK9j39k2J85k36L35j8
$$ y = [109, -152, 12, 167, 25, 31, -156, -1, 36, -9, 84, -81, 53, 84, -28, 16, -26, -8, 144, 197, -26, -12, 17, 80, 88, -22, -28, -78, 25, -80, -64, 46, -127, -58, 141, -210, -187, 197, -81, -201, 8, 161, -47, -185, 15, -53, 108, 106, 105, 26, 7, 12, -95, 444, -270, -30, 110, 366, 81, -264, -94, 14, -1, 73, -24, -95, -147, -129, -31, 84, 166, 33, 63, -146, -34, 156, 140, -26, -182, 78, -307, -16, 1, -8, -12, 295, 115, -44, 253, 0, -52, -105, 27, 6, -31, 18, -108, 27, -81, 39, 124, 127, 48, 205, 74, -17, 2, 82, -29, -133, 52, -159, 29, -27, -185, -151, -57, -50, 97, 50, -191, 104, -156, -53, -79, 271, -100, -91, -38, 154, -105, -89, 44, -84, 111, 24, -1, 14, -120, 37, -30, 35, -102, -203, -208, 158, -36, -130, -34, -302, 124, -15, -230, -262, -116, -114, -47, -71, -32, 6, -34, -203, -107, -17, -73, 1, -11, -132, 126, -58, 7, -122, -54, -167, -199, -250, 68, 23, -126, -245, -70, -22, -62, -168, -239, 201, 109, 46, -78, -99, -98, -69, -208, -230, -45, -281, 54, 36]
6638C6J32l39J76J08k50J42N0n7j85P5K42m85N59l08K21k03J14lP3j67j51J68
6660e2j04L29j85R0k10K36j51p7J11j12L54m18O8KQ2K58n9p3m0L4j18j15J06r
6684e3K24k82K45j95qJ78l00L02j07P4rr1L45l43J76q0k25L26k19K6r1K8K11j02
6708C0J8J16m21L74j58n8N5p6O0J14j9N3j39n4K14j2j09rk9K0Q8R5k62L4q4P8
6734h1L8l7P2K2p9l7J65Nj50j47K29j34p1J38M0K02j89J84r8q3J59j85o9O2K58
6759B14p9k26Q2o2J48j96J22J27o04N84r1LJ15n8p8K17l98K54k32J78o7J00j17
6782f4K63j81r5J82k21J74l8j78K01J37k32J24j32J9K3N1K51m72K30r4L7Rk06
6805b12J90k62K57j50p4K45J15k73k6J32r7J52L20k56j58R9R4j23J49k39k6J25
$$ y = [36, 168, -171, 5, 113, -137, 5, 55, -2, -187, -112, 130, -355, 204, -104, 117, -86, 28, 25, 98, -69, -220, -52, -156, 173, -12, 78, -132, 104, -47, -124, -13, -125, 229, -189, -121, -119, -37, 221, 162, 89, 49, 83, -35, -150, -44, -53, 171, -111, 134, -61, -69, 109, -191, 111, 4, 78, 69, -22, 323, -20, 156, 76, -149, 177, -42, -16, -107, -79, 132, 30, 48, 164, -257, 117, -41, -99, -44, -120, -60, 54, 35, 88, -51, -105, 109, 97, -12, -21, -50, -30, 58, 153, -109, -75, -159, -81, -43, -80, -8, 14, -65, -102, 63, 68, -82, -229, 0, -134, -205, -67, -27, 175, -14, 170, 72, -11, 148, -37, -106, -44, 214, 135, -91, -9, -71, 77, -119, 3, 130, -474, 110, 19, 22, 137, 79, 1, 218, -180, 74, -158, 20, -47, 53, -64, 199, 18, -77, 105, -116, 58, 20, -158, 43, 180, -52, 72, -60, -41, -18, 33, 284, -188, 42, -52, -15, -6, -212, -22, -284, -27, -177, -251, -6, 109, -164, -190, -58, -155, -3, 317, 61, -97, 2, 96, -27, 122, -117, -143, -18]
6827a8L4J4j9q1o9O65o36M32m46L25k85j2K14k72J08Q7l53K08O0j31L74m22L78
6850A55j18j84K0J86R7k24L6K4N2J2o3K22k42K55j82p1P1P9l04K26l26L28N7j23
6874a7k88L43j81K09L5q2km4Lm9J8o3q9J73j68K13J23j84oj01K28k04J54l4rJ06
6900H4J9l4J46k59L0M4K00p9o9j73M2K0N8j00J35r1J78j03j23J38k03J48l6j48
6924a76J38J22k40o1K33M4j36K0l2nK9j42J32R7P3O0J23k04m42N49l2q1m11M53
6948A11jk87k6M34m67L05n5l8j65J70k32K82r8l0n8L55n1k78MR3P1k07K68k41
6972a41J31k25J19K34j95K11n5k38o2R6K99k78P5k02K21j16J62j02k2n7RMK02
6995G0j06J19Q3k66K97J3q6k72J89l0L5j95M82j84p0j22q0J86J68j08l8j13J01
$$ y = [-18, 16, 30, 11, -70, -139, 526, -110, 322, -124, 201, -84, -96, 118, -154, -46, 41, -312, -104, -44, -175, 199, -223, 155, 37, -147, -127, 59, 156, -68, -32, -8, 44, 56, -7, 215, -27, 228, 46, -25, 46, 125, -179, 47, -279, 49, 106, -17, -305, 38, -143, 66, 101, 19, 17, -27, -24, -73, -55, -118, -207, -34, -202, 11, 134, -50, -56, -157, 71, -133, 21, -13, -22, 84, 103, 69, 215, -44, -14, 30, 230, 151, 82, -91, -49, -29, 29, -71, 64, -27, 151, 48, -75, 63, -140, 8, -28, -176, -38, 84, -156, -217, 16, 60, -76, -56, -88, -93, -64, -206, -74, 23, 96, 156, 279, 75, -367, 182, 150, 69, -342, 111, 110, -177, -203, 231, -236, 69, 14, -24, -189, -19, -251, 31, -67, -97, -155, 200, 149, -129, -125, -32, 39, -168, 100, -141, -10, -235, -116, 118, -77, 134, 79, -159, -221, -125, 174, -104, -29, -231, -10, -126, 36, -66, -88, -145, -136, -132, 70, -36, 83, 166, -100, 197, 210, 124, -148, 41, 11, 46, -149, 333, 149, 79, -43, -123, 63, 231, 123, 85, -28, 73]
7018G3J85k8l05j70N12k28r4Q3J01j6k85M4N2J92J03k32J54k34N0K9J3Q8j46j92
7042b51K86r9Q8j55K36k38R9O6K0K18o41J71J32RL7lK06j67l90N49j98J5j70J54
7066b6r2M00k62nJ99k53J95k05J64j51O7k06J6l0K26r8J9N0l9K07l24k6J90m7
7090c1K96k13k35L26n5ml3j46K23j75L3K16l56N9J90j47J5oK2j10M03l33K68l12
7114a05j01J73mj7rPj45R5j18J96J71k79J6K56k99L05j12K44n7j51J6j65J37P2
7138A26j75Q7j43J58J2k29J10J16K3r8l3OJ16J71j33j84j9o9J91l3j61K18q7Q1
7162E1k83J50K17k70J49j6k21J77J57r1m6l0O8j13K87l14j13O15l88j60K33J75
7184B34j84j62p4L50j56O3r3J15j17q2N8L8j89N9J5QR4K1k31L69j03j5j67j5j31
$$ y = [73, 258, 230, -75, -245, 267, 39, -55, 28, 129, 113, -172, -128, -76, 116, 219, -13, 141, -93, -43, -14, -1, 87, -59, -251, 35, -64, 24, -131, 105, -133, -34, 32, 52, 270, -371, -200, -68, -59, -22, -25, 181, 14, -376, 173, -25, -10, -180, -26, -118, 282, 20, 15, 214, -39, 156, -49, 115, -36, 31, -175, -159, -189, 37, -61, -42, 8, -31, 176, -148, -174, 16, -31, 265, 52, -183, 143, 88, 84, 51, -95, 128, -47, -14, 202, -154, -95, 95, -52, -37, -43, -21, -131, 272, -61, 207, -105, -206, -33, -37, -54, -63, -56, -201, -106, -224, -28, 143, -136, -120, 136, -163, 142, 30, 274, 217, 66, 82, -83, 54, 126, -49, 38, -105, 53, 65, -164, -54, 62, 85, -13, -46, -40, 76, 247, 114, -70, -89, -158, 33, 0, -161, 57, -30, 51, -232, -82, 135, -135, 14, -2, -223, -46, 111, 20, -26, -56, 12, -101, 186, -128, -241, 374, -14, -174, 59, 234, 50, -112, -186, 164, 8, 71, -22, 93, -24, -106, -48, -10, -199, -140, -125, -117, -23, -2, -233, 136, 33, 18, -149, -164, -295]
7209b95J05J34J29J25n7Qp1K6j24P6N9j91K7L01k44l7j12O6j4m4R3J47j26j02
7233a21L14j56r5M7m2J14o1k27J91j96K59J06r3R4r9j94J90J44l33J34j37Q8j62
7256b35N1O6N4J41j96J87k64J55P3L2J10M3k56%N9j2q0J49J22j25J9l6j9r6O3
7281EQ8q8j02K36k35Q5o2k11L80l86M39j70Q9k98L01N3r7N8j37K58k90J92l55
7304b47K06p2J84k15L47k77K21l78L67k39KJ31j99N8P0K38m95K16K23l80J77O
7326e6M3l0J16P5k43j90L14J09k22L29k60j60L22l79J39pR0n8M1m5N0K7n2M9O9
7351G1k76K03j19j91K25K52jk95K09j35L6j34J90K03j25J67n6l87J47kj71K48
7373E9p4J81j60n9K4j15o8K01q0N9K7K19n21L39k25K40j41J58j95n7J73j9P5L9
$$ y = [-295, -190, -56, 73, 198, 141, 149, 78, 104, -20, 56, 115, -76, -49, 252, 8, -29, -141, -75, -89, -133, -40, 107, -19, -121, 193, 37, -58, -11, -53, 61, 0, -227, -36, -232, 27, 133, 40, 134, 35, -159, 31, 175, -158, -24, -161, -73, -235, -184, -118, -64, 77, -119, 68, -196, -41, 32, 64, 174, 217, -39, -39, 20, 8, -72, 77, 199, 74, 93, 57, 38, -58, 5, 93, 5, -97, 139, -96, -11, -73, -284, 96, -290, 149, -21, 68, -230, 71, 124, 27, 85, -52, 206, -84, 108, -247, -41, -113, 71, -144, 203, -74, 147, -231, 136, -103, -101, 30, -169, -111, -41, 197, -298, -82, 141, -239, -62, -56, -13, -43, 73, 148, -95, -285, 29, 138, -84, 245, -15, -175, 147, -232, -93, -100, -10, -68, -27, -72, -22, 5, -47, 2, 71, -205, -2, -121, -312, -87, 165, 164, -131, 78, -57, -21, -155, 35, 238, 113, 280, 224, -163, -16, -18, -189, 59, -15, 166, 6, -53, -29, -144, -212, -11, -91, -32, -5, 214, -307, 32, -193, 47, -94, 64, -131, -188, -15, -34, 41, 80]
7397H0oj84n4J49K0N0j78m8K53k95K41O5j40j39J44m2K25j24j05K0j3J58k52K21
7421D6k02K08k19L61k44K2Q5n4P0K08r8o4J71k94k57J48J62k4n3K1j05P6k3J22
7445F3N0k58J97Q9p4r8K34m26J73l6M1J23j97O4l5P4K3j18J47r9J7k5r9N80l99
7470A1K0m9N1J3J11k03M9j7J36j80j73M07j07j47J63r3L3K08k53L5R8j34n0rL1
7495d9K66n6j70qJ4J97o3j78k5l0Q2q3K7J36j12N5J33j96K1m5J15J72k73M6M53
7520D29l63Qn7J18l15K45J4j65Q4P1k03J24J74k38J7k15L05j33L7j83K69j43J72
7543E2R3j29m1j88K83lj39J38q3J05J34l22J7Q3ko0K6K18J26k77PrR0m43Q0J45
7569i9j05J17Q6j46j3L11r1r9R2j86J62l3J21L6n1m04M66o4k99L06k03Q8p3o4
$$ y = [80, 74, -110, -164, -15, 5, 55, -123, -171, 82, -213, 28, 93, -47, -186, -42, -84, 141, 17, -88, -68, -81, 77, -175, 46, -156, 52, -167, 194, -50, -28, 57, 3, 73, 281, 183, 119, 290, -4, -261, -113, 49, 25, -28, -7, -112, -36, -59, 63, 113, -145, 52, 141, 67, -31, 203, -223, -50, -86, -45, 78, -119, -55, -90, -16, 7, -111, 36, -63, -46, -71, -170, 410, 11, 31, -18, 33, 46, 157, -46, 3, -14, 122, -58, -231, 176, 69, -78, 85, -8, 25, 233, -20, 15, 113, -21, -71, -80, -49, 217, 161, -9, -17, -3, 194, 131, -47, -72, -102, -20, -103, -76, 60, -52, 3, 136, -60, -39, -84, 31, 203, -70, -24, 429, 66, 74, 17, 135, -180, 65, 79, -86, -2, 69, -134, -10, 164, -74, -57, -272, 33, -100, -63, -246, 23, -120, 52, 145, 16, -25, -213, 70, 67, -72, 66, -17, 88, 222, -100, -83, 0, -2, -62, -36, 182, 308, 31, 38, 29, 119, -324, -244, -99, -204, -87, -1, -147, -160, 151, 60, -39, 53, -133, 29, -4, 117, 153, 102, -302, 164, 100, -199, 107, -96, -8, -81, -145]
7593a45K12J24m08K37J0l7J32k5j26N4j79L76q4k63J02n5L0O9J9j17k0J95N2l72
7617b19K34J12N5j07K0j74K3J87j09j18O1p9L99k93R3J5k76j2J3J38J29J46k61
7640b3j6L64o07K63j5J71k09j18M6J69rl8J29Mk31N2j7R7J4K1l15J94K16n09K23
7665a44p1J94K42k27j93J44j13J90L58l94K73n7j70j69K53LN1l1k68J47l0O8J8
7688G4o1J6p1l2R4MR2l76K31K02j12j74N8KL0j01J39J7K03k66J5J28j37K77n8
7713A94k62L0n5q0l5K82j73pN2N1J13j92K87l00J69k12k35L25K27k40J72o2N6
7736A05l3j53j30J10MP4p8N7J49j39J39m2j60j58K91m0m0r3M0j08Q1J90j78K5
7760h7Q8K03k77K1k49K50j94K57l06M9K25j14J51J57l33K40J45m7j21J15k11r0
$$ y = [-145, 67, 191, -217, 20, 30, -7, 125, 100, -26, 28, -151, 225, 141, -122, -20, -75, -45, 24, 43, -74, -94, 101, 153, -219, 15, 127, 182, 75, 95, -79, -56, 131, 22, -96, -35, -114, 285, -8, 85, 100, -176, -188, -175, -37, 92, 238, -23, -39, 325, -282, -19, -34, 137, -72, -190, -144, 25, 16, -22, 107, 111, -120, -68, -85, 12, 26, 47, -268, -74, 142, -367, -144, -215, -21, 221, -6, -199, -55, -168, 22, 380, -14, 259, 202, 32, -137, 116, 119, 170, 139, -129, 18, -12, 56, 74, 13, 29, -42, -74, 20, 24, 116, -260, -29, 173, 61, -113, -55, -53, -23, -124, 15, 32, 235, -31, -16, 112, -25, 252, 194, -68, -38, -93, -173, -208, 74, -99, -106, -54, -3, 110, -82, 205, -95, 74, -138, -373, -48, 179, -61, 111, 49, 105, 72, -81, -211, -101, -97, -23, -101, -44, 105, -34, 105, 63, -97, -255, 36, -4, -44, -137, -97, -205, -124, 66, -112, -87, 1, 204, -73, -52, -301, -51, -245, 12, -294, -245, -20, -134, 17, 174, -159, 81, 226, 179, 58, 173, -38, -128]
7782a28K55j01pj59J93j87oL66l67J72J23k64Q2J94Q8m6k23M7p6J27k01K62j98
7805e4n5J65m6o7n8K73Q7j37k25K19j54j00L08j01J9k05j11M99k31p2R5Q9k11
7828g3K76k15R6j21O1n7N4j64J62%m5J89j75j1J1J52ol6o1l06K58j45K39j24J26
7853H5J01n0k42P1K72m33L6L48J0k52J03j03J32p9J04j11J27l22J84Q0j24j64
7875b27K2rJ91K17k53J58M6jm02K60L4m9J19k91J28P6J13j47n8K71l11nK76j51
7899Gj20j23K86j9Nj25J04J32j59N7k4j88K68J6j16j1R5j12L5J00j76o5J88k41
7923a86N04l96j34K50p7J96j07m0jJ96k77J64l43K65j8j18j28L69J46m36K22k7
7945B4R9j95J26k4J38j11j37j8J83M4l42K00J12j80J03n4m5O4PK8k1J79P5o49
$$ y = [-128, 127, 26, 19, -140, 53, -134, -140, 226, -141, 31, 154, -110, -28, 166, 254, 208, -15, 32, -44, 83, -118, 144, -54, -109, 56, 10, -57, -115, 158, 245, 108, -117, 102, -52, -152, 156, 55, 74, -131, -242, 257, 26, -46, 49, 138, -73, 203, -12, 84, -37, 24, -33, 21, -143, 19, 19, -26, 163, -12, -23, -12, 140, 134, 98, 37, -269, -11, -156, 83, -41, 85, 186, 136, -106, -35, 237, -196, -160, 188, 198, -54, 49, -54, 78, -1, 103, -8, 119, -203, -19, 61, -63, -227, -205, -214, -23, 194, -59, 99, 145, 144, -258, 2, 36, -13, 106, -185, -57, 19, 132, -15, -73, 198, -113, -118, 158, 7, -113, -236, 50, 31, 36, -89, 15, 147, -12, 45, 21, -167, 101, 117, 1, -10, 85, -27, 8, 108, -68, -133, 55, -186, 318, -78, -212, 38, -39, 157, 50, 10, 9, 205, -72, 92, -251, 14, -4, -122, -250, 119, 265, -171, 51, 24, 123, -72, 54, 30, 168, 57, -80, -98, 85, 129, -213, -13, 99, -81, 22, -32, -77, -13, -6, 22, 1, 180, 255, -394]
7969c94K86K0O0O4j99J00n1j0p7K98O1k30J83l92K73Q1m5K58k45M7j64R1K25m63
7993b23J60p1J58qM9j99J18m4L9M5k67P0K38j36J91j7j78p6j53K97p1K9j43K13
8017B1J14k34j10L27j81O6J48k16j38N4K90q8j68MJ34k5M0j9m6o8K2K8K61R4n39
8042b29K41L8K6J8J16n5j20k88K93o3J53j51j17r6J77P5o9J93Q1j67j56L54l53
8065i9L10k09k77L54j68L05j42k9Q7j28N8Jk5O2l05K19k9L8j02K59l88J40J73
8088A05m3P0j70o4O1p4J13j29J25n0K22k71J18k83J16J77o7K88k93P4Q0J3j02
8111A6k07K98O7j50k06K93p0j74l3J51p9K90l06MJ37J38k15k8J86Q6j14l55M34
8134A63k58l86M79n4nJ19p7M7j49K49j78M2k9p8R0j4J79p6n9K9l8J65M5j7k36
$$ y = [-394, -108, -88, -28, 36, -163, -63, -114, -124, -201, 97, 158, -72, 111, -281, -8, 73, 28, 286, 41, 88, -76, 15, 240, -223, -63, -134, 24, 16, 65, -134, -16, -60, -21, 24, -243, -173, 65, -71, 120, 103, -75, -151, -304, -7, -78, -49, -192, 21, 135, -99, -209, 118, -63, 3, 151, -65, -203, -149, 141, 53, -115, -111, 23, -2, 38, 19, -27, -95, -73, -45, 216, 310, -229, 12, 50, 76, 94, 210, 155, 35, -253, 40, -23, 130, -21, -138, -234, -57, 18, -51, 142, 223, 56, -100, 254, -99, 211, 2, -275, 79, -89, 216, 74, 45, 132, 4, 62, 63, 38, 100, -205, 14, -15, 23, -79, 180, -208, -68, 105, 62, 132, -38, -102, -41, -115, -2, -131, -6, -56, 166, -105, 13, -270, -154, 23, -44, 244, -49, 25, 105, 118, 16, -191, 107, 174, 24, -182, 111, 41, -133, -166, -15, -94, 196, -110, -106, 31, 169, -46, -74, 112, 198, 84, -271, 163, -95, -481, -2, -56, -61, 58, -19, 28, -121, 128, -50, -8, -37, -115, -25, -39, 140, 64, 5, 34, -4, 161, 206, 189, -47]
8159d7LJ87l0L8L0k08J87k91j68O24j45r8k63l26N14L22j33l74K39j38o5R2J5
8182c5K3j17K99k53K23Km79K54R8
$$ y = [-47, -44, 143, 113, 151, 181, -27, 160, -131, -299, 325, 180, 82, -181, -507, 7, 329, 196, -178, 61, -77, -142, -50, -35, -12, -129, 170, -83, 140, 142, -337, -83, 15]
8191A5
$$ Imaginary data points
##PAGE= N=2
##DATA TABLE= (X++(I..I)), XYDATA
0@%%%%%%%%%%qJ6j6J6j6K4l2M0m8N6p2Q8j04J20j44J71j96K28k66L07l52M03m59
33b44N21n91O67p49Q41r45J057j178J312j457J617j793J983k190K417k665K937
50A540l234L559l921M323m771N271n834O473p204Q053r053J0252j1719J3559j5950
65h656J9205k3926L1532m6535J30609k51425K4505Q1516o3880L70622l39439j11460
77a87332K80482j12423K03466m6238l98676K65391k2559l1512K12091l06754Q7774
88e6290K28627k39194J57099r3526j66272L05480j67673p1486J79293j82177K07499
99A01380L6381k97691J78891l7186q865J97700l08487J4629K01264r8756J86969
110A66229j41748k38003K61287l1998K2049O6045l02606J47753J66719j08504
$$ y = [0, 0, 0, 0, 0, 0, 0, 0, 0, 0, 0, -8, 8, -8, 8, -8, 16, -16, 24, -24, 32, -40, 48, -56, 64, -80, 91, -105, 123, -143, 164, -188, 215, -244, 277, -314, 353, -396, 445, -500, 557, -621, 691, -766, 851, -942, 1041, -1149, 1268, -1397, 1540, -1694, 1865, -2056, 2267, -2504, 2767, -3067, 3406, -3798, 4255, -4798, 5454, -6265, 7294, -8656, 10549, -13377, 18155, -28380, 102229, -149196, -124691, -43175, -107055, 263567, -75872, -187332, 93150, -19273, 184193, 137955, -260721, 4670, -17889, -49401, 162690, -144064, -56290, 172337, -66857, 90242, -3284, -169556, 135924, -31749, -103235, 76058, -106119, 101380, 137761, -159930, 18961, -18225, -27090, 170610, -137877, -123248, 78016, -20740, 166229, 24481, -213522, 47765, 15767, 37816, 103861, -198745, -50992, 115727, 7223]
120G223J17859j96403q3727K60879j05612K2953J4017j93690K12132L1200j27481
131d0650J15652j49946K5063J55553j73089P2053L1444j04950J61151r4190p2974
142g4883J49704j04877M2754K8003j57999J49707K8671p9216Q0069j40091K5455
153e2703J53009j12364K5587l3910q5455J83519k1977p5325M1562j12713Q9043
164a727R2367j23546L7880l8615k3870J45677p8452l6187M3339q1600R0548J8038
176D3852r4911P3076l7804q468Q0603q7681K4615L8265p3830O1462k0762l4792
188c6375Q5252n6677j0572L7528n7376O4205P657p2016M4086k4262J1529O4001
200E6980p2999k468K1730k7024O4673k3420n2874M0810k0603K6092L0588o5608
$$ y = [7223, 125082, -71321, -155048, 105831, 219, 23172, 37189, -156501, 55631, 86831, -40650, 75002, -74944, -49881, 105672, -67417, 4636, 36080, -68870, 92281, -1909, -74883, 74821, -30056, 12698, 40701, -117298, 32409, 61080, -18136, 61933, -78158, -52703, 100306, -12058, 13529, -20381, -105836, 77683, 55706, -19619, 21943, -90770, -1727, 90640, -32906, 4974, -33641, -57511, 88166, 9714, -26473, 16866, -64734, 25814, 43852, -51059, 22017, -15787, -24255, 56348, -31333, -6718, 31547, -42283, 19179, -1583, -36375, 48877, -7800, -18372, 19156, -38220, 25985, 33642, -38374, 5712, -18550, -7021, 56980, -16019, -18487, 3243, -23781, 40892, 17472, -35402, 5408, -15195, 10897, 41485, -24123]
212b4123J7096R639j6155M7338l4552k0482L4464k6465K3702J0444m1007K7914
224G813p495j3501L3083k6190K393J7325l0454K1390L838j7279K2391k0764o153
237a3603K4806j5911J0482M69k4678K0578J474n720J2502k1773J491J6431r419
250b871R514o561j4326J6516k214lO037j5772N579P202n925Q049o079o465R470
265B151m212K676L835r197M173J177k524O252l870k396L039k907L701J741m490
280h51J740r58k41L943k534n71O59j880K308R36j783L15j100O96J322o64j56o32
298E49m47R21K29m82P0p29j53K42M8J1k87m56J00m4J23p1k07k07K66l00K04l95
320a015P4M31o43M22J71r68J000l01p72J537j741L33J756k247J598m5j544K753
$$ y = [-24123, -7027, 2612, -13543, 33795, -757, -21239, 13225, -13240, 10462, 20906, -20101, 7813, 318, -13183, 19900, -6290, -3897, 13428, -17026, 4364, 8202, -9077, 13314, -7450, -13603, 11203, -4708, 5774, 6243, -18435, 2143, 3617, -2103, 10399, -11374, -9883, 6548, -2871, 6643, 82, -14244, 2272, 58, 55, 6092, -9680, -4101, 3101, -2824, 5225, -854, -7319, 2151, -2061, 615, 4450, -4747, -574, 603, -1921, 4331, 461, -1935, 1104, -1803, 1898, 3639, -851, 889, -69, -310, 3633, 1099, 528, 1187, -693, 1615, 2551, 768, 1083, -17, 679, 2001, 1337, 1181, 549, 102, 1023, 1252, 770, 840, 111, -42, 200, 248, 259, -28, -484, -384, -428, -305, -376, -583, -790, -524, -824, -620, -1015, -941, -510, -1153, -731, -560, -1528, -528, -829, -1601, -64, -1805, -1472, 284, -1963, -365, -410, -1954, 799]
338G99j606n03K378l248K152J456l757L668j254j860M700m320P41L765n439M301
354A973k59n361P436k943j562M888p808M579M166p525O104m185l613J1712p624
369b2m73M512j0320J0315J584j0252Q960p188R8J2245j3300L400L654j0967J4931
384G177n344r186J3941j1266L315Q852j7544J2862J534j2443J4708j1817r22J7924
398A1791j8337M812L703j4188K2933o776j4520J4910j4540J1251J4493k7369R836
411b001R30p807K6966j9653j1221J8360j4952J7918M035l0223K0312k866m085
424d287K2986k8930K188J9339k0919K0030o344k0836L1006j5332m903J8964k7434
437a4472K0478Q673l1110K3525q590m686L0013l4999O56K0782j9647K8469j2599
$$ y = [799, -807, -1310, 1068, -2180, -28, 1428, -2329, 1339, 85, -1775, 2925, -1395, -654, 3111, -2328, 1973, 1714, -3647, 3789, 846, -716, 4172, -3636, 943, 5109, -2416, 3688, -497, -4110, 7602, -22, -495, 4017, -6303, 4012, 5596, -4656, 4304, -2884, -2786, 9459, -3841, -441, 3213, -7754, 7177, 1833, -7353, 6588, -4678, -1363, 7489, -10055, 2807, 4341, -8102, 6606, -5211, -6133, 11791, -6546, -1734, 1969, -12219, 10714, 3938, -10582, 4328, -10212, 1039, 15532, -11837, -2001, -1071, -8878, 18088, -1565, -12786, 5574, -9378, 8540, 12575, -17648, 2664, -202, -4287, 18699, -10231, -8043, 11296, -9623, 10407, 4063, -16773, 14233, -1099, -6002, 12962, -14472, 6006, 14679, -16431, 7094, -1496, -6182, 23831, -11168, -10512, 10270, -9377, 19092, 6493]
450F493l2523L4139q236N252J6264m6517J7095K0783j7051K5621k9868j7561M2505
463A6396j6649P451K929m0784L5950P767k1337K3279l1574M221L4864l3494J3409
476B428K045k5351L9442j7971j7792L1626k5876J5216J1364m2499L2241M548j6981
489g560K7022l8769K059M1061k7616J3374j1633l1430N2677n108j8099J3783m0439
502c0678K8198L3492l7822J2745j8283j0175N3747k5414j3513J2717l0308L9155
514A3861Q678l9859K4687j6377J522L5611m0689P255J7119k6771L1084j4903k1503
527b0285M0137k1946j714J4784l4950L3804R960l4464K1178k0984N671M1782l9200
540f227l129P061j7820M6799j2314l6631K2575j6210K2690K4338n0229R670O704
$$ y = [6493, -26030, 8109, -127, 5125, 21389, -25128, -8033, 12750, -4301, 21320, -8548, -26109, 16396, -253, 7198, 10127, -30657, 5293, 13060, -8277, 15002, -16572, -12351, 22513, -10981, 2428, 4473, -20878, 18564, 593, -17199, 14427, -11449, 3767, 15131, -27368, 4873, 9421, -7560, 19462, -19307, -17248, 23813, -3803, 9571, -2062, -33492, 19185, 14077, -4022, 9761, -30678, -2480, 31012, -6810, 5935, -12348, -22523, 31224, 5810, -7703, 5014, -25294, 13861, 22539, -17320, 7367, -9010, -7488, 28123, -12566, -5311, 11808, -14963, 16121, 1218, -20285, 19852, -2094, -3808, 10976, -23974, 9830, 19790, -14674, 6504, -14480, -8809, 32973, -6227, -9356, -2295, -20115, 26684, 14370, -22261, 314, -15896, 6794, 31132, -19097, -9427, -2723]
553b723p191L9583l1087k0727K8536j7438K3079L829m0149K6881p63q658K5818
566A8990l1918N060K3136k7719J8200l066j7774L3728k0623j1037K2243j9725
578a0505K1024L864l5859K2441L43j317K3067l6631k029K4564j1463K1174j5281
591C392k9387L1306j427L004R239l7819J4203J9424j3003J6717k1608j2534L1009
604A2516j2450M133M216k6531K1943L482j4560J7931j7041L08J8151k1903J0399
617E94O263j5483J7377j2336q119K2682j2514L294J992k0916K0342N781j1736
630b779Q784j8183L537K2663j3854J932n423j2390K4553j315r652M766j5665J1348
644a678J4233j5099M508o499n046J9792q938l268N574j2589J1492L639j0815J0072
$$ y = [-2723, -9914, 29669, -1418, -22145, 6391, -11047, 12032, 15861, -24288, 2593, 1830, -6828, 18990, -12928, -7868, 15268, -12451, 5749, 2683, -15091, 18637, -1986, -13023, 9220, -10505, 10519, 14383, -21476, 965, 1308, -9, 23058, -13573, -15602, 8962, -2501, 18673, 3392, -25995, 5311, 3884, 6888, 16127, -21692, -7489, 11935, -1068, 15649, -5959, -18493, 12516, 66, 4199, 8415, -18116, 3827, 7309, -7251, 10680, -6361, -6053, 12098, -9805, 594, 6857, -8626, 8751, -3585, -11704, 10978, -1536, 1758, 3750, -17166, 3176, 8957, -2779, 6005, -12178, -8641, 14022, 168, 2100, -3323, -15713, 8840, 7525, -2127, 2639, -13026, -1678, 12555, -2544, 1964, -4535, -9581, 10211, 1273, -1995, 3579, -9010, 2482, 6121, -4694, 5378]
658E378o893l474J1303j0209N242N194j2361P392j571l183J1897r025l206N110
672A594o393J0234J105j1448M821k680K592R740j1227j671K777l120J0159k633
686C850q732M731l084M469N092r121J089O79j997P639l902l545L410m299L950
701B29K752m969K698j917j989N907l158L67J016m726K979K001j683K527l915j395
717c276M291j135J452o96l846K737J409l89J651m016m69L147m87J557j261k947
733b278K316J83Q04J022k852p0J309j92J791j016j723R53l02R52Q54j511o05L96
751C1J75J248n99j327M12n97J032P59j196j87l29J87P33j3m31n12k58Q20M71l99
771B0k11m15K8P24j28j34m93m64P25P3J23k01m32j3L92J75K12k55n69N01J80l1
$$ y = [5378, -1515, -4989, 6314, -3895, 1347, 6541, -5820, 1572, 1, -3182, 8715, -310, -3516, 1594, -4799, 5435, 6540, -4908, -87, -2767, -175, 9565, -1662, -3333, -556, -3676, 6483, 3850, -4882, -151, -3235, 1234, 6326, -2795, -1706, -1027, -3024, 4615, 713, -2832, 578, -3721, 229, 2981, -1988, 710, -1207, -3196, 2711, -447, -80, 936, -3790, -811, 1190, -493, 2034, -1881, -3276, 1015, -120, 1332, 636, -3210, -473, 936, 547, 2198, -1818, -2287, 860, 373, 1930, 669, -2278, 38, 221, 1025, 2047, -805, -875, 434, 242, 2033, 1017, -706, 247, -55, 897, 1751, 240, -365, 31, 206, 1454, 855, -472, -60, -657, 375, 1134, -62, -249, -578, -391, 342, 329, -102, -614, -872, -52, 419, 20, -191, -606, -578, 146, 18, -116, -609, -1073, -348, -275, -152, -353, -785, -798, -406, -231, -19, -274, -843, -342, -162, -193]
793a93J5k55K16O5K53q4k23o1O40k77J48l4l76L32lN5J87k30k79O30m21L62L02
816G69n46K05j53K5M82o77M04L04j084Q02k64n15Q22o43l0P54p01O63l00j003
836f86J198o04l04J082j480P52O44j332J044p67m68J906j523M5Q07j683J550J96
854C77j861J796r94k71K022k296P82O39j836K478j106j015K161j667O23J267l168
871b069K433N10j898K278k252l06L203k626Q06L68k293L908j014k447K705k627
887a321J909K283m195J639K49j801M331l110j832L546k640K541P98n103L741o63
903C72j140L693m461M99L408l861K939r01l477N479k519j207K839m194L279J578
919B326n155L711j476p61M957n699J56K954k979M352j560n228N594j658P92K946
$$ y = [-193, -178, -433, -217, -152, 101, 17, -206, -267, 373, 96, 244, 210, -166, 166, 163, 218, 405, 175, -104, 526, 105, 467, 769, 223, 428, 275, 300, 782, 105, 509, 813, -271, 531, 267, -248, 574, -69, -99, 655, -46, 617, 317, -686, 512, -92, -396, 686, -794, -42, 602, -730, 314, -453, -921, 985, -538, -493, 314, -1369, 181, 377, -1484, 312, -682, -953, 1069, -1227, -445, 194, -1642, 836, -270, -1285, 876, -791, -168, 1099, -2069, 364, 874, -1024, 1254, -998, -1304, 1899, -727, 79, 447, -1846, 2062, 1048, -1399, 1306, -1321, 588, 2871, -1324, 315, 564, -1237, 3094, -16, -1848, 1698, -942, 1599, 2397, -2706, 1035, 372, -768, 2925, -1536, -1037, 2371, -1490, 1449, 548, -2929, 2550, 31, -1176, 1663, -2531, 748, 2326, -2829, 882, -594, -1355, 3602, -2097, -1941, 1013, -1966, 2386, 826, -4402, 1192, -466, 326, 3272]
935C272p482K760L317l031L971m409k582O785k764P01R56o006N592J223m163L922
951B062m150N46N313n351J622J201l904N712k563l353N205l429K145J742p080
966d282N076J199k369L752o048J39O585l910J776j591n178Q052p94k931K156n968
982d336M012M935n497J717k177k196Q254l981k199K608m888N265J501o234M333
997A117j887r99N374o074J426L306m381L587j916l210O857l585q24K286n087N268
1013A258K059n866K928k731N47O570n386j429J490k625P093j489n757L451k446
1028b333L288L806p058R27J301j254N703m369k907M100k636L085J312o025M103
1043A043k38j905L817l911O35L318m509K219N01k491M628l258k038L838k576K727
$$ y = [3272, -4210, -1450, 1867, -1164, 2807, -1602, -4184, 2601, -163, 538, 1494, -4512, 1080, 2303, -1860, 2062, -2088, -1542, 3771, -1580, 42, 1243, -2661, 3051, 488, -2865, 2340, -1089, 1056, 2798, -4282, 794, 1993, -376, 3376, -2672, -2533, 4052, 142, 1918, 327, -4851, 3201, 2407, -524, 1632, -4336, -324, 4611, -886, 831, -1346, -3542, 4712, 731, -1468, 1140, -3748, 1517, 3018, -3216, 1117, -770, -1769, 3605, -2469, -1043, 2263, -2118, 1469, -447, -3657, 3200, -385, -1209, 1077, -4010, 1258, 3317, -2549, 379, -2352, -1805, 4765, -621, -2050, -560, -3185, 3908, 2419, -3338, 113, -2333, 955, 4761, -2297, -1370, -69, -1323, 4380, 11, -2896, 1204, -1432, 1653, 2965, -3060, 1043, 805, -1100, 2717, -1194, -559, 2759, -1750, 469, 970, -1521, 3107, -151, -2189, 1649, -927, 1800]
1059A800O84n751L048O01J22L073n687q52L981j198K793k038m920M531J15M67
1075G69J702n535J257L164j850K408k575k457M334j884Q30J279m065K786L76k098
1091a559K918j846k51J997l244J694J701k323J977j945j173L700r79l66K27l004
1107b476L157J220j843Q97k697N00L448j291n71l26k405L769O41j798M60k266
1123a581J141K203j643M82j123q92K871j122o4O48j797N89J211j234J391j136
1139e6j035J532j112J036N53k112P98R5j74J919j279j009M67m40J412K83j797
1156i19L47k20N55J358j302o69K65j12J286l2j130R8l04M02J358j177j77R1j44
1175d26J049j36o52R2m47M78R69j028J76j77o38J336n4j30j50p05J89P65m2K29
$$ y = [1800, 2484, -3267, -219, 382, 504, 3577, -2110, -2962, 1019, -179, 2614, 576, -4344, 187, 302, 769, 2471, -3064, -1807, 1357, -493, 1915, -660, -3117, 1217, -667, 163, 1442, -2623, 163, 539, -1559, 1359, -487, -738, 1259, -1985, -291, 1410, -913, 1064, -881, -2054, 1646, 667, 301, 528, -2476, 681, 1901, 58, 955, -1742, -1242, 2206, 915, 344, 18, -2387, 1382, 2023, 225, 685, -1581, -440, 1763, 120, 602, -521, -1413, 1458, 336, 272, 920, -877, -288, 923, -311, 1080, -56, -1091, 441, -671, 365, 918, -1194, -396, -301, -475, 1444, 165, -844, -377, -817, 595, 878, -919, -572, -792, -237, 1121, -181, -850, -585, -697, 589, 557, -573, -475, -779, -377, 981, -196, -373, -282, -426, 623, 487, -165, -73, -520, -42, 927, -101, 75, -102, -740, 596, 542, 412, 262, -443, -254, 511, 469, 698]
1195F98o55n29P37J11K17j24r74M48N06P2L32p22l80K95J86L22k64n69O0L21K12
1216C00K5n98j75j15L71K92k39j01K28k98M61j04k50j39L7j75L97J7k98R6J97
1237g1kj7l1j98j98J54N02k15J33l62o6K98PP9Pk25j55N62k09P2r0J54l31K83
1261H1J25Q8k20j8K79m3j43j53J67l29M24j70L42m08L9K05J1k00K10k3l8j34J23
1284B15j50K6J1j24L92k07r6j94J98J57n9J7j63k39O6n6L69l52N2j05n4n8J40
1307b14r1K22k6j80P0j65K26R2k00J35q9R1k5q4QK74j28j43J42k49N44m68N7M39
1331B38l72J26O8o5r9L12j82K44k05J1K59l76M13j33m44M81p5m0nk45P8O65p53
1354i9O11m73l2K23o6k87L04k83K06J79n07M87o23M12J80n50K62K15o46O58j0
$$ y = [698, 43, -486, 251, 362, 579, 455, -519, -71, 435, 507, 839, 117, -263, 32, 218, 540, 276, -293, -233, 88, 300, 325, -273, -448, -563, -192, 100, -139, -240, -12, -310, 151, 47, -203, -342, -305, -480, -83, -66, -364, -268, -71, -73, -90, -121, -319, -517, -363, 139, -76, 57, -305, -371, -73, -66, 13, 20, -205, -360, 202, -7, 65, -25, 129, -202, 81, 206, 294, 74, 56, 335, 292, 149, -4, 163, -166, 258, 88, 430, 22, 61, 266, 277, 77, 287, 264, 226, 92, 215, 65, 91, 102, -22, 370, 163, 67, -127, 71, 228, 169, 186, 23, -216, -150, -206, 163, -189, -137, -242, -296, -354, -214, -305, -83, -109, -289, -219, -384, -158, -66, -266, -131, -220, -129, -154, -238, -230, 44, -84, -227, -85, -334, 210, -258, -201, 238, -134, -8, 60, -5, -104, 208, 26, 270, 65, 76, 335, -41, 372, 239, -205, 276, 201, 161, 156, -89, -11, 654, -99, 512, 39, 7, 230, 164, -123, 181, -102, 104, 283, -224, 263, -360, 52, 232, -318, -56, 159, -487, 171, 161]
1375A61l90L64k92Q2J6n97O73J6l86L83k74j01O51n73J9K70n86M28O3m10L22j30
1397b91o4O67n62J22J32l24R27p25l15Q16k63J37R2p92N54J53l17Q62r84k57Q55
1418D23m14L71m22k22O43l4j85L59o42K48O67r28K24Q5k49M57n23m00J001o67
1438b08M64n9n94O79m3m30M73q89L57O12p84K67L8l47Q34n60p2K53p38P50L74
1459C77r44N23m39J51O95o37Q9J80n39L87K99o24L77j66J92N33q16J70O58r65
1479d99Q77m10m47R04l59K03j26p16J078j39m96L58j60j19P12o29J27Q0o00R87
1499F26k47p71N28j69J07O36r94L03j86J20Q65n45n53O95n82M74j06m51L80L8
1519A68l77O44q51L09L47n01K99k48k00N59l55j42N58l63J99K25o20J31KK06J53
$$ y = [161, -229, 135, -157, -75, -59, -656, 17, 33, -353, 30, -244, -345, 306, -267, -248, 22, -564, -136, -73, -483, -161, -291, -355, 312, -250, -128, 4, -320, 607, -118, -433, 383, 120, 257, 349, -443, 111, 264, -53, 809, -175, -432, 423, 9, 380, -42, -264, 379, 345, 160, 519, -123, 125, 792, -136, 88, 173, -76, 381, -142, -542, 459, -208, 256, 197, -397, 282, 239, -191, 282, -607, -250, 362, -422, -155, -117, -464, 370, -190, -262, -9, -747, 3, 377, -567, -44, -483, -332, 363, -274, -185, -5, -544, -157, 142, -482, -105, -271, -79, 454, -362, -192, 466, -499, 378, -32, -479, 425, 66, 269, 143, -573, 505, 366, -130, 228, 68, -51, 661, 32, 159, 239, -361, 626, 379, -392, 136, -33, 74, 710, -284, 19, -167, -47, 818, 273, -280, 415, -167, 307, 201, -250, 130, 168, -209, 435, -416, -107, 240, -261, 38, -210, -410, 149, -206, -348, 210, -153, 46, 271, -349, -218, -216, -10, 143]
1540A43n55l13Q25l37K21q6n52P94o1j43J43l93J41J33NO21q19J00K54k17K18
1561A22J51n12K23L28l33M54k85q7Q2j43P7K17j58M42n41o8L98p1k54O9k84L45
1583A72J16j02J0m79K36L51q3k31K04j36J88l13j21J65k88J41K66j89R6k5l54
1604c76L82k36R2q4k30L05K46j48m6mj55K19l47J36Q2j53J05J27N8m6k4k11J96
1627a12M8J42J18l95K43j37J46J89k28J31L7Q4m74L04k20L70k27j19K23r7r1K42
1649A77k36K07j2l43M98n9j47k0R7l4k21N2j41J69o5K63q8j33k6k61K66j44J09
1672i2O6r7K20k15k60K61J17p0o3J28l73K52J75m6J14l60K13P1l37M51j36j84
1694a65J18j13M12rl84L9j66L23j53J02j8K6m4l8K13j34J25m16L73K05m9k87J76
$$ y = [143, -412, -725, 100, -237, -16, -102, -654, 140, 79, -64, 79, -314, -173, -40, -35, 586, -233, -133, 121, -96, 122, 273, -239, -16, 312, -21, 433, 148, 61, 143, 0, 77, 294, 136, 578, 37, -31, 367, 296, 42, 111, -173, 172, 288, 186, 196, -283, -47, 304, 221, -10, 194, 58, 246, -67, -188, -23, -311, -170, 96, -93, 3, -22, -376, 6, -230, -138, -222, -452, -147, 99, -49, -95, -99, -254, -35, -382, -246, -164, -317, -212, -85, -27, -73, -97, -308, -112, -64, 78, 196, -199, 44, -93, 53, 242, 14, 145, 182, 266, -208, 96, -124, 246, 19, -100, 123, 26, -65, 177, -59, 148, 136, -207, 291, 232, 85, 65, 162, 128, -93, -41, -182, -13, -78, 185, 97, -36, -62, -323, -57, -201, -92, -26, -123, 97, -118, -378, -117, 0, -70, -133, -5, -378, -126, 49, 3, 117, -243, -30, 41, -296, 155, 19, -165, -47, -160, 252, 243, -141, -102, -268, 55, -98, 4, -14, 12, -32, -70, 143, 9, 134, -282, 91, 296, 247, -40, 136]
1717A36J9j6j10J94P3n34J19L85m00KL68l66L02j30L11j41j09p5K36j25j34J35
1739A40j12n4J9q0P2L3r6J05k52L6K70j09P0O9j48J92l9l15K41j30k52J77J89
1762B6k9k61L63j68J03k61L40r7j8k50J09K7j4J22r0J5K6R6o6J84q3K6o8K56l34
1787d6O8M7j1J36j18J04k42L39o7k39n6k4K46m8J19NJ28k62KK36j35M3j21k2j23
1812d1j1J41J38l12Oj88J95K5j38K95j89M1j2j35J00J16k14q6N0L4J69k8j09J65
1836A2m1J4N9k48K90l68R7N5j42K56o0J87k01J33m31O49k56j53J6r1K89M0j99
1859i3L51q0k19N9J0J38J70k08O1j33j75K10k04J62K73n79K56N0k17M50j77j02
1881CK58k04k33L77l70M20r5k39K23k31R0L62n29K08j60n5L77k75p5P6j17j22
$$ y = [136, 155, 139, 29, 223, 296, -238, -119, 266, -134, -132, 236, -130, 172, 42, 353, 212, 103, 28, 264, 139, 5, 140, 28, -26, -7, -87, -15, 18, -78, 27, -225, -189, 81, -28, 42, 111, -37, 155, 116, -199, 42, -88, -340, -163, 26, -3, -264, 99, -69, 34, -227, 113, 16, -2, -252, -143, -116, -130, -8, -98, -83, -57, 39, -27, 157, 74, 100, 32, 288, -46, 22, 69, 58, 194, 76, 180, -62, 277, 210, -29, -85, -109, 137, 89, 208, 213, 341, 79, 81, 317, 182, 225, 104, 82, -41, -52, 89, 227, -85, -79, -267, -72, -47, -185, 110, -79, -38, -50, -185, -85, 31, -183, -269, -219, -185, -16, -44, -153, 12, -29, -15, 44, -204, 86, -282, -185, -130, -272, -16, -76, 111, -90, 43, -388, 261, 5, -148, -132, -223, 66, 106, -93, 258, 178, -41, 18, 28, 166, 336, 128, 189, 56, -119, 91, -113, 49, 322, -257, -1, 49, -168, 282, 105, 3, 261, 57, -176, 201, -169, 251, 156, -83, 140, -91, -1, 361, -168, 40, -120, -175, 202, -73, -148, -72, -189, -311]
1903c11L54j73K20Kl77L30j71r4K93l04M1L15l72n7P4Q4J89k5k73L51k16K95j90
1926a5l4J50j80j11M07k24j7J90n3L0p2k67M75k48j42L6r9K06N1nK19jl58L10
1950B48m04K25j63L01n4P2j78J16k08K39k7m93N25j87QJ98j82k48K14q8N3Ol07
1973c34N49k41j07o7Q2J1J94m04M13l20k25Q20l96j08m3j5o6K19j17M69m08k19
1995c13N07k2l58O48p03L29p3p6J64j01J9r4j08M31M0m30J76Kk86M12k20O6K78
2018B88n14M89M9l56J15n4K7K34k52J03J27j55L91l38j21K03m33J02J01j16P5
2039c5k57J91L29Nl01K59k90j35L10k03R6P9l04J50O2J74N8n88N42n22q0L89R1
2062B0j03r3K02k18K26j6k27K09l71N30k45m8K27l2q7M2l57M30m4L2jl90M29J5
$$ y = [-311, 43, -130, 90, 92, -285, 45, -126, -220, 73, -231, -190, 125, -247, -304, -230, -146, 43, 18, -255, 96, -120, 175, -15, -49, 101, -79, -190, 217, -7, -24, 166, 113, 143, 71, -196, 279, 31, -111, -75, -174, 32, 83, 78, 297, 296, -62, 248, -156, 69, -94, 207, 153, 225, 47, 163, -45, 194, 167, -326, 199, 12, 20, 218, 36, -212, 2, -86, -33, -27, -334, 215, -26, -133, -200, -118, -107, 87, -317, 96, -224, -449, 371, -25, -133, -176, -191, -257, -38, -155, 314, -94, -313, 194, 172, -186, 462, -241, 88, 15, -61, 103, 2, 21, -73, -181, 250, 290, -140, 36, 38, -248, 164, -56, 10, 288, -226, 263, 312, -44, 71, 17, 44, 278, 26, 129, 256, 101, 492, 154, 33, 236, -197, -95, 6, -110, -35, -292, -101, 228, 233, -68, 191, -99, -234, 76, -127, -31, 48, -256, -106, -44, 130, 188, -400, 142, -380, -460, -71, 20, -83, -176, 26, -192, 34, 18, -209, 0, -371, 159, -86, -134, 93, 61, -26, 16, -341, 89, 45, 77, 76, -314, 115, 130]
2086A30l31K66r5m5J06k87K33L45j68k89N15m25L44m12L43k07r4M06k65Q0n0O
2108A06k9O3j17L67k69l78K92J07j40J82k52N9N7Q0j98J67j26p1J59P3k89k22
2130c79K4L12j59L85k31j02J68j79J66l65R9j37L36k14P1R8j83O3L21l37K94k05
2152a54J61r5J54N3j93R2j01j37K14J29m1j96J41qn7j8M46k96J3J48k42J13j77
2175e1j4Q4j9n5n0K15Q6j28J89k22M2J2j2j80K57R3j45j27K8P9j04k7OP3r8j66
2201b34M1j3L70k58O2j47K63j52n7n6K18q1J1J13l77O1J40L89m92J40j20K24l7
2224Hk33J97j17J02L91k36K9k38o1J05J04k64N09l24J40P3k08M8p9J66n6k43L07
2247A20O6k97K10k24L77j55R7j30N0j66R9p7J77l54J74pK26j60k47K59l70L90
$$ y = [130, -201, 65, -30, -75, 31, -256, -23, 322, 154, -135, 380, -45, 299, -113, 230, 23, -71, 335, 70, 150, 100, 106, 77, 140, 23, 390, 121, -257, 35, 142, 2, 184, -68, -9, 48, 128, -70, 97, -29, -100, 59, 132, -157, -379, -355, -43, -202, 183, -48, -150, 18, -161, 5, -360, -261, -398, -62, -276, -205, -107, -290, -227, 94, -243, 51, -154, 7, -88, 66, 119, -74, 18, -83, -220, -6, 123, 82, -114, 27, 19, -38, -56, 390, 94, 107, 255, 13, 126, -51, -65, 19, 0, -55, -105, 110, 196, 68, 257, 35, 77, 89, 77, -103, 154, 247, 102, -25, 3, 82, -22, -49, -43, 30, -68, -234, -193, -206, 164, -94, -32, -179, 84, -68, -125, -181, 37, -44, -33, 80, -297, -236, -96, 293, -199, -59, -179, 45, 8, -225, -28, -145, -43, 348, 112, 141, -97, -158, -53, 51, -213, 296, -28, 112, 185, -23, 25, -54, 112, 56, -187, 120, 186, -111, 99, -125, 252, 97, 194, 64, 114, -52, 47, -30, 147, -207, -33, -40, 186, 26, -221, 38, -332, 58]
2269E8N3Q5j69j30M1n1r7K35m42M81l14L22j86j0j63j8J24N6J38j7P6%K59k49
2293H2n1o3j46N7K14j39o2K37J8k09k6K13N9j27k20J03l9J70q2j28M2K04N3j4
2317A46l75L28p7K07r3k39J89N9p7J48k41k56M60o7P4j06J8p5o0j7R6N7L12k89
2341A22j32n6kj66L29l76K21k7K42k83R1M5J12l01K44n9l06R8P3M8j92K43lJ87
2365A52m09K79M9k01K15j76k29L25n9J15n7k41P0L03j46k0k3R3P8j88Q9J32m84
2388c33M42J83n9n6l01J50N8j90L42l46J7K64nj01o3j13J15J09j67K96j86J48
2410B04Q8n00K17P2j57L41j93k89K91l6O3j13l11L26K6j53K85j03l23K82j97K60
2432H0n7k60J80k14K59j01p7K50j27j3J67j11j93K87J39l78K15l4o2l2r6K04k89
$$ y = [58, 111, 196, 27, -103, -62, -113, -210, 25, -417, 64, -250, 72, -114, -124, -287, -305, -181, -125, 13, -4, 72, 72, 331, 82, 31, -32, -178, -121, 93, -46, -108, 129, 147, -62, -88, 125, 184, 57, -163, -60, -99, 71, -11, -139, -97, 107, 160, 146, -229, 99, 22, 229, 136, -103, 86, 145, 68, 216, -25, -281, 179, 112, 186, 80, 98, 23, -37, -54, 42, 99, 411, 122, -10, -66, -68, -234, 95, -281, -60, -87, 155, -128, -37, 8, 120, -181, 63, 4, -302, -204, -131, -83, -275, -32, -35, 152, -257, 22, 71, -130, 85, -91, -320, 5, -54, 61, 4, -237, -167, 136, -10, -30, -53, 40, 118, -70, 19, 151, -333, 109, 292, 233, 177, -124, 26, 84, -106, 236, -110, -93, 171, 166, 65, 2, -111, 4, 113, -54, 242, 56, 204, 292, -208, 9, 81, -76, 265, 72, -217, 74, 38, 101, -12, -323, 3, 29, -124, 161, 58, -265, 17, -180, 80, 23, -237, -57, -271, -12, -113, -190, 60, -67, -80, 87, -24, -217, 70, 209, -169, 46, 12, -50, -82, -178, 26, -263]
2455b63J35P0n1K03r8l9jR7mK21k81K10l17j69K02J12r5M54l97o0K33l39K11m5
2479a1j96L44l3k92K92j33q0K76j61q9K59r3m0J69k05J10J02k55J2j26K34j73
2501h9k89M70m12K55K29k0k78N7k1K28rl32M75m79R7j5j00K78j24k2K20m30K01
2524a10J97m80K78M5R7j05j31J18O6J05J08k65L46k06L1p9N6P7j17j34j05L14
2546A06J02j51JR4j45J69r4j82Q4J09K4J93k03m0k32K44k9J0j29K48j18o8n6l4
2570i7K6%n3L47l03k10M06J7j09k00R8K0j24L5K71k21K03m49L18k35L86k43n0
2593a67n6K36K6k45J81j51K21k03J34Q8L4k82K52r0L4k38J54Q4r8K4K04j25p6
2616e9L10j11j66J70j70O9j11O0J68j04j8p8O2M89n02j71O6j2J94L27n00N4J89
$$ y = [-263, -128, -58, -109, 94, -4, -43, -44, 53, 49, 270, -11, 199, -118, -287, -85, 27, -68, 386, -11, -71, 162, -177, 34, -11, -207, 137, 104, -188, 104, -29, -109, 167, 6, -83, 176, 83, 43, 212, 7, 117, 219, -36, -24, -150, 84, -89, -378, 92, -320, -65, 164, 144, -134, -77, -98, 130, 121, -211, 264, -215, -118, -133, -233, 45, -79, -101, 119, -311, -110, 87, -393, -115, -70, 27, -78, -209, -91, -25, 80, 188, -77, 269, 63, 94, 15, 71, 148, 31, -103, -208, 106, 208, 57, 58, 152, 7, 176, 82, -100, -16, 93, 117, 310, 107, 67, -165, 79, 50, 60, -69, 179, 61, -7, -63, -97, -71, -71, -124, 223, -80, -290, 116, 133, 24, -176, -78, -58, -182, -147, 124, -97, 106, -343, -25, -260, 126, -117, -167, -223, 13, 39, -206, -25, -176, 45, -158, -24, 64, 98, -184, 68, -22, 12, -226, -72, 12, -86, -62, 142, 17, -59, 251, 140, -26, 144, -26, 43, -68, -8, 160, 56, 38, -40, 22, 511, 9, -162, -96, -108, 86, 413, -87, -33, 156]
2639A56K8q1k1j93N0J25r6j52L87j48j72K98%j91m0J66j76J61J85l06j00J45k23
2662a98J56Q3k64j5J21J16j65L9N8O7q0L1l94L33P3K65l90L14j16j8j17k04L34
2685B9km7j8n8j07L87j39K4J03j91L2O5Kj61J45j19K19k07L9j47OJ92j07L64j06
2710A98k74j36N6J59J94J41k13j47L35j22l70J75K64l11K56j70LRj92J77O4j98
2732a02j71K45J87k25k36K87M4p6J04r6n9j56O1J99n07L60j07K74k09J37K4K01
2754A79j74K33k54Q2O4m4j3k09K30k10l7J31K4j51L9R8M66n13L6P2o6L4J04j13
2778HRJ6L8K0J18l45K33k98K83p6j3L25l39P7j9j75J22J54j97R1k21rM12j35p0
2803IJ8K4J29l78J29%J74j83J2j4J76k31p2K27l1n0M3J7Nj91J65q3J55m0k4K42
$$ y = [156, 184, 103, 82, -111, -61, 64, -32, -184, 203, 55, -117, 181, 181, -10, -50, 116, -60, 101, 286, -20, -120, 25, -198, -42, 41, -223, -238, -117, -1, -166, -127, -69, -2, -82, -51, -445, -112, -39, 226, -164, 150, 34, 16, -101, -305, 29, 27, -20, -38, -96, -203, 184, 45, 69, 172, -19, 13, 78, 80, -81, 64, -55, 164, -43, -4, -151, -145, 47, -60, 304, 198, -76, -212, -156, 3, 197, 338, 125, -22, 313, 191, -179, -4, 260, -51, 205, 35, 38, 47, -145, 32, 96, -102, -273, -28, 159, -66, -302, -15, 29, -47, 57, -39, -98, -254, -193, 6, -501, -141, -248, 26, -183, -46, -22, 179, 5, 238, -16, 66, 130, 86, 73, -136, 94, -116, -153, -22, 2, -149, -110, -12, 454, -59, -23, 49, -17, 17, 121, 8, 17, 33, 71, 91, 209, -136, 97, -201, 82, 6, -7, 318, -21, 56, 37, -138, -16, 138, -59, 32, -189, -198, 214, 79, 9, 27, 51, 180, -198, -69, -69, 105, -78, -66, -80, 96, -135, -207, 20, -11, -61, -18, -1, 4, -187, -22, -105, 50, 10, -14, 228]
2829B28m84L44J9n9m1R8jj45K1K57l52J64O9k4r4k07KK28M28l74rJ23k88K10k68
2854a55K83r5J64l8k68Q0j30j4J91J00k92L62qj44J28O1K5j97K5j94n5j0L24k04
2878f1N0j26Q4J71k78J47R9l14NK32r4o5j20j61J84M43l34P3M6M0Q5n1J61j32
2902H4o7L9j66J58J25k08N9L2j40K93k46K2qJ55j11l8k74M15j30r2L46j14j31
2925CN0j07K55l5l6J26k00k06M22l45J70Mk20P7K40k82L17j13m4q5K06k04Q6j09
2949c0J61o9j59J54l4J4j51L02l18J60m2L1J29l30J96J04j98J0j80L99k59J20
2971A0o2j4N4l1K8J77j81j49K77l10J74l81J64M68p0k94M09k01l75M69l0P2j73
2994C1j67M3J00K02J13m11K02J18k57J55m1j35J32J5k39L81k39J63lr2P0j07M2
$$ y = [228, -256, 88, 107, 48, 7, 105, 104, -41, -20, 237, -115, 49, 118, 94, 0, -207, -205, 23, 451, 77, 68, 191, -97, 113, -155, 128, 33, 197, 159, -109, -29, -159, -173, 18, 118, -174, 188, 180, 36, 164, 225, 250, 53, 78, -116, -171, -181, 143, -61, -11, -137, -53, 118, -160, -13, 86, -228, -223, 9, -85, -150, -270, -431, -247, 196, -138, -65, -19, 21, 106, 55, 216, 84, 17, 56, -110, 48, 173, -35, 24, 56, -84, 209, -37, -15, -23, 132, 21, -17, -291, 124, -6, -98, 248, 134, 3, 53, -54, 201, 166, 130, 256, 56, -150, 272, -73, 97, 101, -119, -42, 198, -84, 233, 120, 76, -9, 197, -7, 79, -30, 131, 62, -97, 57, 23, 37, -114, 188, -130, 30, -12, 19, 148, -182, 14, 118, -80, -70, -250, 149, -110, 10, -52, -66, -12, -43, -15, 162, -19, -168, 109, -201, -27, -408, -244, 224, 154, -140, 269, 68, -307, 162, 132, 204, 31, -136, -93, 7, 209, 322, -89, 113, 231, -26, 129, 88, -47, 85, 100, -139, 242, 3, 166, 163, 71, 141, 34, 76]
3017G6J07m55L72J4j07J48k09J85J37l72J15L49m65ln5l43L76p8L02j31k2j6M7
3040b8J22j25k8K74k91l0p0K31N7k89K99m01J49J27k98J89nj60L28L4j59j76L31
3063H1j9p1O6j16K8N7k7Pl4J93j68J91qJ0m6q9k99N50j53nj89Q5J11O8l13O3K84
3090B57k94J05j54K26Q6k93o9K26p6Q7j35j72L96k90K8M9q5K59j83j72J73l5j7
3113h3J13J21j90J75n8j09j2J51p5K2J12k49q6N1J19lK2k6p5K66p5k1j62J83o3
3138D8q2J85l10J45j36K21O1R7k11nJ65q7Nk11K51p6J09j89J15l7n4J3Q8K25j37
3163A93l41K64j65m7j1K57K42l17O1n4k27J95Qj83J16p3j14J53J77j37J71j31
3185C7J2L1l18J12J27j83K4J94J69l61K51k9k59J66q1j7J9J4J00m1N4L6l01J33
$$ y = [76, 183, -272, 100, 114, 7, 155, -54, 131, 268, -104, 11, 360, -105, -108, -163, -506, -130, -208, 94, -37, -59, -75, -28, 94, -31, -59, 215, -76, -106, -176, 55, 112, -177, 122, -279, -130, -3, -301, -112, -117, -277, 51, 85, -74, -250, 81, 62, -9, 57, -59, -31, 26, -1, 6, -28, 165, -3, 188, 180, 190, 144, 55, -244, 306, 153, 148, -41, 44, 155, 223, -90, -27, 257, -37, 68, -86, 140, 226, -67, -136, 90, 14, 101, -34, -206, 190, -100, -72, -23, -108, 151, -32, -204, -31, -66, -83, 30, 151, -39, 136, 78, -31, -43, 108, 33, 55, 167, -82, -168, -117, 2, -1, 21, -5, -80, 186, 111, 90, -72, 111, 48, -34, 151, -159, -14, -150, 71, 132, 229, 18, 13, 178, 91, 96, -115, 136, 60, 169, -20, 95, 58, 4, 17, 105, 330, 193, -148, 116, -49, -96, -107, 150, 392, 75, 136, 82, -145, 50, 58, -125, -9, -82, -196, -43, 134, -3, 168, 37, 49, 80, -238, -126, 1, -182, -158, 36, 205, -156, 95, 66, -193, -27, -108, -125, -106, -92, 8, -33, 21, 57, -244, -111]
3209a11J2L07k33M1o5K78j40j47j18N7O5J88m6j14K31l39O0M26k41K9k06J97j73
3232d2o7J74J04Q0k32J54j60J55R6k31M2j67J52K23l55J15o5K07m09J25J11j88
3254a78K5R2J67l27J77N9k33J83k19K73J50j24o6K05J64m58j93J12NO9L10r9k06
3277a12k2J69j05r6L88j57q0k23J75N9J05j91o4J26O9L6j36n6L15j97j58K97k95
3300a53J73k91K23K64k4j20m8j41L1M2j77K80l7j60j33L24J71k39J51r8r6Q8j73
3323a43K51r7Q4N6j55k68M86r9MJ00k25j31J07j52O7O1J25L1J64j04j52R0J08
3346B08l79R0K37p1j45J57k39J38j65J84q1J07L9K8o5k1rq0J17k15N4J76p5k28
3370b38J93m4J90M7j98J74K1k77N03m68J12%O3J74k74m9J82q7j45K24Pk23J35
$$ y = [-111, -99, 208, -25, 16, -49, 229, 89, -58, -176, -119, -54, 134, 88, -26, 205, -134, -74, 352, 111, 140, -66, 131, -42, -109, 65, 169, 249, 17, 171, 11, 166, 262, 31, 73, -94, 58, 281, -74, 41, -24, 183, -226, -101, 10, -178, -153, -61, 106, -221, -44, 15, -218, -35, -254, 19, 169, 45, -21, 184, 348, -110, -303, -191, -186, -117, 193, 94, -112, -134, 35, -70, -166, 222, 65, -15, -238, -63, -4, 101, -90, -154, -28, 41, 77, -59, -115, 200, 3, -155, 142, -153, 20, -271, -48, 216, 192, 72, 24, -117, -86, -44, -221, 59, 22, -138, -271, 53, 224, -15, 136, 38, -58, 30, -143, 108, 11, 95, 151, -4, -272, 214, 115, 119, 219, -6, -137, -30, -182, -115, -54, 71, 102, 266, 162, 10, 100, 208, -171, -81, 156, 85, -60, 97, -142, -4, -169, 15, -66, 41, 80, 108, 43, 22, 13, -67, 50, -165, -111, 65, -10, -238, -45, -89, 101, 148, -50, 124, 145, -132, 371, -97, 15, 15, 78, 252, -22, -71, 111, 24, -121, 103, 110, -113, 22]
3393B2j29K94j01M5j46j0k06Q5J72q6j33J59P1L5l56Q5K50J73k39j16L10j36K8
3416G1k14K60J64l61K31l55m7L96j31k51Q9K32j70l7J57k0p7m1K12p2j0J37j56
3439Gj7pL1L2P8k40k4J44j67K54j01K12k33k13M36k30j50L76k94N3K01j04k4k5
3463eK3j82J21k7L39k15O7k31k9Q8J16l33J40J85j27R8k0K2j39L11k69p5m3J33
3487e2J33j35M83n10J12j45k3J84Oj77j04K23N7L2k42L74k82J42N5j8l15N39l57
3510b0R8j86L75M9j93P4m53K89J8n1J74j85qM2P2j55M7j42K09J56l16J56p0j01
3534a21K56j7J85k59L2N0j94K1r9K22J7J34k63K09l92L25k54K84k5m16J33j0J49
3557c3J77m33J74K48K0j72L2k0Q2l2MPj07j61J34K09j45k33K13L1j22R3J13n8
$$ y = [22, -107, 187, 86, 131, -15, -25, -231, -146, 26, -60, -193, -34, 37, 72, -284, -199, 51, 224, -15, -131, 179, 43, 71, -143, 117, 281, -80, 151, -204, -251, 145, 14, -237, -148, 84, -86, -123, 34, 14, -63, -104, 108, 36, 26, 163, 7, -10, -17, 14, 46, 124, -116, -140, 4, -163, 91, -10, 202, -31, -244, 192, -38, -188, 188, -106, -53, 148, 44, 20, -5, 18, -164, -43, -70, 269, 54, 121, -110, -139, -51, 65, -268, -128, 57, -70, 28, 8, 30, -109, 202, -67, -142, -185, -52, 81, -54, 429, -81, 31, -114, -137, 47, 53, -124, -228, -5, 52, 84, -158, 216, -66, 76, 131, 113, -202, 337, -20, 78, -108, 267, 316, 123, 197, -256, 33, 51, 0, 174, -11, -19, 23, 95, -60, -13, -155, 54, 210, -106, 50, -20, -121, 135, 118, 303, 44, 76, 126, -68, -47, -146, 76, 93, 227, -36, 173, -219, 106, -148, 136, 111, -305, -172, -182, -33, 144, -289, -115, 133, 153, -19, 13, -7, 75, 43, 47, 54, -53, -214, -80, 129, -16, -249, -36, -5, -127, -34, 79, 21]
3581B1J70k37k0J48k61P5N7Q1m3K9J1j21J90n8J39j86P7j10jJ78k3j50k10L39
3605I5ml60L37J72m45j02L56j28J45j24m0l0k2L15O5k83k2J98R8m11J7J50m1J02
3629C8J72j45r2p2J5q3Q8N3R3n4k57L06qj04mL75l35m1p2J21j3J8m5N2j34J78
3655E0l1j82Q2QK51j31rK9j6J62J0k88p3k6K91k40J80j68K53m09M24l5k46J80
$$ y = [21, 191, -46, -66, 82, -179, -104, -47, 34, -9, 20, 31, -90, 100, 42, 181, -5, 72, -38, -39, 139, 116, -34, -244, 95, 91, -269, 68, 240, -205, -307, 49, -79, 66, -58, -98, -128, -150, 165, 230, -53, -75, 123, 221, -190, -173, -23, -64, 38, 210, 65, -27, -99, -84, -167, -79, -26, 67, 13, -244, 62, 54, -50, -54, 321, -14, -55, -127, -6, -19, -1, -46, 6, -128, 50, 19, -163, -81, -73, 178, 47, 38, 67, 51, 213, 223, -65, -138, -164, 127, -113, 67, -101, 152, -257, 167, 132, -114, 66]
$$ [...]
8191a59
##END NTUPLES=NMR FID
##END=
