##TITLE=1H_SR43
 CDCl3,8 sc, 
 9.03.2021
##JCAMPDX= 6.0         $$ Bruker NMR JCAMP-DX V2.0
##DATA TYPE= NMR FID
##DATA CLASS= NTUPLES
##ORIGIN= UXNMR, Bruker Analytische Messtechnik GmbH
##OWNER= root
$$ XWIN-NMR		Version 3.5
$$ Tue Mar  9 13:47:13 2021 Russian Standard Time (UT+4h)  she@DPX200
##.OBSERVE FREQUENCY= 200.131506
##.OBSERVE NUCLEUS= ^1H
##.DELAY= (6, 6)
##.ACQUISITION MODE= SIMULTANEOUS
##.ACQUISITION SCHEME= undefined
##.AVERAGES= 8
##.DIGITISER RES= 18
##SPECTROMETER/DATA SYSTEM= spect
##.PULSE SEQUENCE= zg30
##.SOLVENT NAME= CDCl3
##.SHIFT REFERENCE= (INTERNAL, CDCl3, 0, 15.7039)
##AUDIT TRAIL= $$ (NUMBER, WHEN, WHO, WHERE, WHAT)
$$ ##TITLE= Audit trail, XWIN-NMR		Version 3.5
$$ ##JCAMPDX= 5.01
$$ ##ORIGIN= Bruker BioSpin GmbH
$$ ##OWNER= she
$$ F:/spectra/data/she/nmr/H-F/1/audita.txt
$$ ##AUDIT TRAIL=  $$ (NUMBER, WHEN, WHO, WHERE, WHAT)
(   1,<2021-03-09 13:46:34.59 +0400>,<she>,<DPX200>,
      <created by zg, POWCHK disabled, PULCHK disabled
       configuration hash MD5:
       00 E9 B6 7A A2 85 ED C7 34 08 36 98 17 FE 4E 26
       data hash MD5: 16K
       AA D4 86 1B C9 52 C8 AE EE 7A 2B 7C 75 0B 4C AB>)
$$ ##END=
$$ 
$$ hash MD5
$$ 08 2F FA A1 DD 64 39 E6 AB 92 B8 AD 16 2F E6 14
##$RELAX= 
##$RELAX= 
##$RELAX= 
##$RELAX= 
##$RELAX= 
##$RELAX= 
$$ Bruker specific parameters
$$ --------------------------
##$DU= <F:/spectra>
##$EXPNO= 1
##$NAME= <H-F>
##$PROCNO= 1
##$TYPE= <nmr>
##$USER= <she>
##$AMP= (0..31)
100 100 100 100 100 100 100 100 100 100 100 100 100 100 100 100 100 100 
100 100 100 100 100 100 100 100 100 100 100 100 100 100 
##$AQSEQ= 0
##$AQ_mod= 1
##$AUNM= <au_zg>
##$AUTOPOS= <>
##$BF1= 200.13
##$BF2= 200.13
##$BF3= 200.13
##$BF4= 200.13
##$BF5= 200.13
##$BF6= 200.13
##$BF7= 200.13
##$BF8= 200.13
##$BYTORDA= 1
##$CFDGTYP= 0
##$CFRGTYP= 5
##$CHEMSTR= <none>
##$CNST= (0..31)
1 1 145 1 1 1 1 1 1 1 1 1 1 1 1 1 1 1 1 1 1 1 1 1 1 1 1 1 1 1 1 1 
##$CPDPRG= <>
##$CPDPRG1= <>
##$CPDPRG2= <>
##$CPDPRG3= <>
##$CPDPRG4= <mlev>
##$CPDPRG5= <mlev>
##$CPDPRG6= <mlev>
##$CPDPRG7= <mlev>
##$CPDPRG8= <mlev>
##$CPDPRGB= <>
##$CPDPRGT= <>
##$D= (0..31)
0 1.2 0 0 0 0 0 0 0 0.06 0 0.03 0 0 0 0 0.0002 0 0 0 0 0 0 0 0 0 0 0 0 
0 0 0 
##$DATE= 1615283194
##$DBL= (0..7)
120 120 120 120 120 120 120 120 
##$DBP= (0..7)
150 150 150 150 150 150 150 150 
##$DBP07= 0
##$DBPNAM0= <>
##$DBPNAM1= <>
##$DBPNAM2= <>
##$DBPNAM3= <>
##$DBPNAM4= <>
##$DBPNAM5= <>
##$DBPNAM6= <>
##$DBPNAM7= <>
##$DBPOAL= (0..7)
0.5 0.5 0.5 0.5 0.5 0.5 0.5 0.5 
##$DBPOFFS= (0..7)
0 0 0 0 0 0 0 0 
##$DE= 6
##$DECBNUC= <off>
##$DECIM= 32
##$DECNUC= <off>
##$DECSTAT= 4
##$DIGMOD= 1
##$DIGTYP= 9
##$DL= (0..7)
0 120 120 120 120 120 120 120 
##$DP= (0..7)
150 150 150 150 150 150 150 150 
##$DP07= 0
##$DPNAME0= <>
##$DPNAME1= <>
##$DPNAME2= <>
##$DPNAME3= <>
##$DPNAME4= <>
##$DPNAME5= <>
##$DPNAME6= <>
##$DPNAME7= <>
##$DPOAL= (0..7)
0.5 0.5 0.5 0.5 0.5 0.5 0.5 0.5 
##$DPOFFS= (0..7)
0 0 0 0 0 0 0 0 
##$DQDMODE= 0
##$DR= 18
##$DS= 0
##$DSLIST= <SSSSSSSSSSSSSSS>
$$ [...]
##$SUBNAM2= <"">
##$SUBNAM3= <"">
##$SUBNAM4= <"">
##$SUBNAM5= <"">
##$SUBNAM6= <"">
##$SUBNAM7= <"">
##$SUBNAM8= <"">
##$SUBNAM9= <"">
##$SW= 16.9725357007746
##$SWIBOX= (0..15)
0 0 2 0 0 0 0 0 0 0 0 0 0 0 0 0 
##$SW_h= 3396.73913043478
##$TD= 16384
##$TD0= 1
##$TE= 0
##$TE2= 300
##$TE3= 300
##$TEG= 300
##$TL= (0..7)
0 120 120 120 120 120 120 120 
##$TP= (0..7)
150 150 150 150 150 150 150 150 
##$TP07= 0
##$TPNAME0= <>
##$TPNAME1= <>
##$TPNAME2= <>
##$TPNAME3= <>
##$TPNAME4= <>
##$TPNAME5= <>
##$TPNAME6= <>
##$TPNAME7= <>
##$TPOAL= (0..7)
0.5 0.5 0.5 0.5 0.5 0.5 0.5 0.5 
##$TPOFFS= (0..7)
0 0 0 0 0 0 0 0 
##$TUNHIN= 0
##$TUNHOUT= 0
##$TUNXOUT= 0
##$USERA1= <user>
##$USERA2= <user>
##$USERA3= <user>
##$USERA4= <user>
##$USERA5= <user>
##$V9= 5
##$VALIST= <valist>
##$VCLIST= <CCCCCCCCCCCCCCC>
##$VD= 0
##$VDLIST= <DDDDDDDDDDDDDDD>
##$VPLIST= <PPPPPPPPPPPPPPP>
##$VTLIST= <TTTTTTTTTTTTTTT>
##$WBST= 1024
##$WBSW= 4
##$XGAIN= (0..3)
0 0 0 0 
##$XL= 0
##$YL= 0
##$YMAX_a= 116865
##$YMIN_a= -96369
##$ZGOPTNS= <>
##$ZL1= 120
##$ZL2= 120
##$ZL3= 120
##$ZL4= 120
##$ABSF1= 10
##$ABSF2= 0
##$ABSG= 5
##$ABSL= 3
##$ALPHA= 0
##$AQORDER= 0
##$ASSFAC= 0
##$ASSFACI= 0
##$ASSFACX= 0
##$ASSWID= 0
##$AUNMP= <proc_1d>
##$AZFE= 0.1
##$AZFW= 0.1
##$BCFW= 1
##$BC_mod= 2
##$BYTORDP= 1
##$COROFFS= 0
##$CY= 11.3945322036743
##$DATMOD= 1
##$DC= 2
##$DFILT= <>
##$DTYPP= 0
##$F1P= 15.9154993809931
##$F2P= -4.1035820241983
##$FCOR= 0.5
##$FTSIZE= 0
##$FT_mod= 4
##$GAMMA= 1
##$GB= 0.15
##$INTBC= 1
##$INTSCL= 1
##$ISEN= 128
##$LB= 0.24
##$LEV0= 0
##$LPBIN= 0
##$MAXI= 10000
##$MC2= 0
##$MEAN= 0
##$ME_mod= 0
##$MI= 1.114404
##$NCOEF= 0
##$NC_proc= 0
##$NLEV= 6
##$NOISF1= 3.799351
##$NOISF2= 2.8
##$NSP= 1
##$NTH_PI= 0
##$NZP= 0
##$OFFSET= 15.70392
##$PC= 1
##$PHC0= -11124.23
##$PHC1= 17.00094
##$PH_mod= 1
##$PKNL= yes
##$PPARMOD= 0
##$PSCAL= 0
##$PSIGN= 0
##$REVERSE= no
##$SF= 200.130013532006
##$SI= 16384
##$SIGF1= 3
##$SIGF2= 2
##$SINO= 400
##$SIOLD= 16384
##$SREGLST= <1H.CDCl3>
##$SSB= 0
##$STSI= 0
##$STSR= 0
##$SW_p= 3612.71676300578
##$SYMM= 0
##$S_DEV= 0
##$TDeff= 0
##$TDoff= 0
##$TI= <>
##$TILT= no
##$TM1= 0
##$TM2= 0
##$TOPLEV= 0
##$USERP1= <user>
##$USERP2= <user>
##$USERP3= <user>
##$USERP4= <user>
##$USERP5= <user>
##$WDW= 1
##$XDIM= 8192
##$YMAX_p= 0
##$YMIN_p= 0
$$ End of Bruker specific parameters
$$ ---------------------------------
##NTUPLES= NMR FID
##VAR_NAME=  TIME,          FID/REAL,        FID/IMAG
##SYMBOL=    X,             R,               I
##VAR_TYPE=  INDEPENDENT,   DEPENDENT,       DEPENDENT
##VAR_FORM=  AFFN,          ASDF,            ASDF
##VAR_DIM=   8192,          8192,            8192
##UNITS=     SECONDS,       ARBITRARY UNITS, ARBITRARY UNITS
##FACTOR=    0.0002944,     1,               1
##FIRST=     0,             0,               0
##LAST=      2.4114304,     0,               0
##MIN=       0,             -96369,          0
##MAX=       2.4114304,     116865,          0
$$ Real data points
##PAGE= N=1
##DATA TABLE= (X++(R..R)), XYDATA
$$ [...]
1740A56o30Q78n76M76j88l93O58m22L28l88M85l77q7n8j36O16l72K97o8j66K44
1761B77j82K00l25j21J52l1l55L39opN9m13M40j59J82m42O26k81kR4k92M37n51
1784c61O24n71p1N16k81M26q00N19p7J86k81L8L97p94Q55o46L52m2l35N34k62
1805g4K78l50J82K4N2n9k08M14n31L46j0l13M31k77K71k48K15j48K3L1J35p8o93
1828e87R10l48J45j55n3P7j74J39k3Q5l8l3p3P1K2R9k11J6J84k24K42j15j15j33
1852b92M04k43k77M88j40P2k69L3K09J08j01Kj27n4J10J05j67M71p26M06j38K12
1874H6j55k32M79l23M04m74M01l51R1K57n05L02l52M43j14N2J40k12J36j77K31
1895A27k88K23l7jK67n92L29j49K08J2m01M22j38O9j87L32n06L62j69M8J36j38
$$ y = [156, -474, 404, -172, 304, 116, -277, 381, -41, 287, -101, 384, 7, -80, -138, -274, 342, -30, 267, 199, 33, 277, 95, 295, -30, -151, 1, -30, -385, -46, -52, -59, 0, -413, 27, -132, 50, -392, 234, -47, -49, 45, -247, 190, -361, 263, -308, -379, 137, -144, 282, -518, 1, -76, 110, -171, -133, 264, -530, 325, -321, 31, -11, -346, 188, -74, 204, -146, 36, 60, 112, 53, -155, 259, -272, 74, 64, -249, 182, -95, 176, -72, 143, -5, 18, 49, 184, 106, -587, 323, -25, 120, -35, -88, -11, -185, -46, -69, 16, -22, -55, -128, -57, -35, 64, -147, -131, 53, -171, 71, -44, -159, -292, 112, -131, -408, 80, -60, 12, -257, -224, -15, 93, -8, -6, -133, -187, -77, 28, -139, 332, -394, 12, -126, 86, -69, -301, 178, -145, 259, -215, 186, -165, -74, 183, -322, -20, -372, 71, -43, 9, 149, -63, 73, -104, 127, -161, 62, 25, 24, 291, -301, 28, -121, 87, 99, -302, 120, -18, 51, -136, 196, -310, 52, -117, -69, 67, -71]
1917g1J53k72L39l55K61m46J37M14m70N30m95K64k74K87K24o17O58m68L42l67
1937b26L76m51L64J34l81N81p23L29m59J59M05k88M97l91P7KPL19o82L65p4J50
1959I0j08j23K60k77P25p00K75m84M22J59l44L14l66L06k70L06P6l84K22n5J50
1980A94k75R9l45L29m9j8K37l19K86k76M6o4L73k94L31l14q6J14n6L41l37O9O9
2003E5L4j29J6Rj91K80k28J51J81r7p3n4K19k53l5Nj0K16k02J64n8K8p8l6pl43
2029d36M97k16L21k55K00O6j91R2p8K1O3P6Q0l23L10k19K70l91l5K13r2K18j46
2052D5L39l38J28j10j7lm2K3nK13l56L30k19j18J42l3J10k00J81l33K12j22P2
2075a01K16k09K46j63m2j6j2k06L48J81m30K48j29lJ68j89J78l31J87jJ31p4O6
$$ y = [-71, 82, -190, 149, -206, 55, -391, -254, 160, -310, 220, -275, -11, -285, 2, 226, -391, 267, -201, 141, -226, 150, -301, 63, 197, -184, 397, -326, 3, -456, -297, 108, -180, 317, -74, 3, 5, 12, 331, -351, 14, -60, 90, -18, -141, 119, -158, 567, -133, 142, -342, 80, 239, -105, 209, -157, 149, -121, 185, 261, -123, 99, 44, 194, -81, 18, -327, 2, -47, -65, 172, -147, 139, -137, -91, -155, 218, -76, 255, -59, -145, -31, -87, 254, -83, -14, 55, 89, -40, -24, -15, -206, 74, -154, -3, 178, 81, 8, -46, 173, -80, -115, -110, -120, 96, -106, 58, 0, 28, -50, -86, -93, -436, 61, -155, 166, -89, 111, 177, -14, 78, 0, 21, 84, 160, 240, -83, 227, 8, 278, -113, -148, 65, -27, 191, 45, 384, 46, 174, 64, 47, 44, 2, 25, 20, 233, -123, 207, -12, -130, 12, -21, 89, -111, 70, -263, -51, -173, -101, 115, -94, 152, -11, -53, -69, -81, -287, 61, 242, -188, 60, -69, -72, 96, -93, 85, -246, -59, -60, 71, -3, 63]
2098F3J52j35R2n02M61nJ02k77R2N4j73K31k38j69J16L66j09k99K92l25M16k93
2120h8J51j20l1K84n16L53j35p8Q5K5J66k21K85m1j06k61M00l92L0K32j36M7o
2143g3j6J29j34J16j86J95j63j08M5J22J35j73K31k16M68n41K21Pj87j9n7J79
2165b5J8L67m44K35k1j46Q2k37M24l33LJ66k47Q8J1Q6j05K63j04J2N4j56Q1l0
2189D2K02k56L6jq0K26L1K76p89M47j24M9k0Rl0r9K23o6j08j58K25r7L0m4qK32
2215A48k02J55k17R0M9K13m19K70k3k08K00q6M4M8J18p0r0K9j50l5J59n4J13j31
2239d9j6N1K28k62r9J58r4J95j35J65q4o3Oj14Q7k77M31O0kk31J71j15J63q9m9
2264C6O9j45K4k20J81j27J59K9m3K66l90K05lj32L93l01jo9j9M30p46N01O5m3
$$ y = [63, 215, 80, 172, -330, 131, 126, 228, -49, 43, 97, -76, 155, -83, -252, -136, 230, 121, -178, 114, -211, 205, -88, 63, -57, -88, 196, -320, 33, -102, -180, -95, -70, 96, -125, 160, 119, 13, -248, 152, -240, -210, 22, -114, -67, -73, -89, 40, -94, 22, -164, 31, -132, -240, -195, -73, 62, -111, 120, -96, 372, -169, 52, 59, -128, -147, -204, -25, -7, 360, -84, 151, 130, -16, 66, -171, 253, -80, -77, 89, -158, -70, -59, 27, -78, 185, 81, 93, 147, -9, 72, 42, 244, -12, 24, 23, -57, 169, 200, 476, -313, 134, 10, 59, 39, 48, 18, -81, 142, 76, -32, -190, 35, -62, -32, -76, -84, 148, -54, 101, -116, -26, 23, 236, -183, 87, 64, -144, 56, -30, 14, 62, 180, 110, 20, 49, -101, -136, 23, -31, 82, -49, -65, -14, 214, -48, -147, 11, -83, 112, -23, 142, 58, -5, 1, -113, -26, -303, 128, 188, 186, -45, 126, 11, 174, 85, 36, 105, -40, -16, -236, -55, -182, -23, 6, -37, 229, -161, 44, 41, -91, 302, 1, 0, -69, -88, 342, -404, 97, 162, 119]
2288A19k81L31k56qj0j17M77l82nJ08j6q0M0R0l1J33j23j41J10j22J90r9P2J6
2312A5N6k05L2RoK46n0j16N1j42K82j19j22O5j9M3m7J89j90m4n3L13j38J46l37
2337a41K20K1j9J57j53J01l55K20r1Q0J63j30n1j46N34l84J10o4J2p2j6P3L9n8
2361E0l8k07M03l00L90l97N8j68K05j06r8K59r9K08k19q8J70q8J59l15L03k32
2383a50K17J02j32j21m0M04m55k1K03m9K77krk33j24l4K3J91j52J07m8J48m20
2406c18M06j80lJ79j04j07K60k62J39L0j97N03k73J16k03rrk18K91o7q1J2r7L13
2430A21k45K00k13K00n5o3o1J93j6q4R7j38j37Q0M06m6n18M26j57J02K2o2o1Q9
2454H0J7j59m2O7o2J05k63M47j58q3j8J3Q7K05j50k64J88lK50l34L78k37j82K19
$$ y = [119, -162, 169, -87, -95, -105, -222, 255, -127, -132, -24, -40, -120, -80, 10, -21, 112, -11, -152, -42, -164, 26, -73, -1, 15, 71, -134, -102, -93, -99, 147, 97, -19, 32, -110, 172, 53, -69, -4, -23, 20, -27, 162, -28, -72, -125, 188, 50, 196, -141, 79, 100, 81, 238, 85, 186, -169, 51, -40, 40, 203, 73, 22, -124, 410, 26, 136, 72, 84, 12, -4, 69, 108, 50, 12, -195, 208, -92, 298, -99, -41, -209, -4, -110, -208, 51, -48, 160, -59, -147, 23, -65, 94, -221, 82, -150, 67, 169, 37, -84, -124, 280, -175, -196, 7, -42, 235, 233, 224, -9, -133, -167, -144, 47, -105, 2, -46, 102, -318, 88, -92, -95, 84, -20, -127, 133, -129, 10, 40, -157, 346, 73, 189, -14, -23, -32, -250, 41, -26, -107, -95, -192, 121, -124, 76, -137, 63, 8, -55, -116, 77, 61, -23, 74, -64, -201, -121, 285, 239, -279, 147, -10, 92, 114, 52, -9, 80, 97, -62, -104, -37, -99, 6, -257, 190, 32, -51, -69, -56, 31, 236, 86, -178, 10, 7, 257, -77, 301, 64, -118, 101]
2478A01J67n2k29j72K78m9O0l39M00j45J45n8j26J9K49l82k54N36m17M14k76Q0
2500e0R6l23N88k92J16j23J16m8k37K18k97L80k94L33K67l87k5k18J49q9L22L
2522B05j59M4k94N21m04K31r8k63K87l72M29l53K95J1rJ68j18j42Q5l4k94L51
2544H7l32L38Q3l10J84k6p7J50j02j01J0K6J01j61K89rM6l76M8J30l5J54J08k83
2568e8J97j41j43K32l29M69k35K57j57R7j67Q0q6o9M0qK83l63J97k47K0J80j27
2591g8Q7k01P9K01j97j2K38j6r4K26k29p0Q7j28J59p0k7K9J42k35J2K30k3q2J47
2616A75k12kl9p4J69o6N2J78j21k41P9K06k44N8L3K95q9k14J90j7l4k71J48J56
2640A15k31L22m23K91l5M0J52k86J07j36M43m10Rr5Q0L70n27L27j44M7j91Q9J25
$$ y = [101, 268, 216, -13, -185, 93, 44, 104, -235, 165, 20, 165, 107, -19, 0, 249, -133, -387, 149, -268, 146, -130, -50, 46, -277, 311, 19, 135, 12, 128, 80, -157, 61, -236, 144, -150, 183, 450, 63, 38, -180, -31, -120, 202, 205, 46, 90, -204, 317, -87, 144, 46, -217, 70, -302, 127, -226, 69, 80, 71, 239, 121, -21, 64, 30, -264, 87, -245, 93, 176, -134, 50, 24, -53, 97, -5, -106, -96, -70, 31, -130, 159, 150, 196, -180, -132, -2, -37, 117, 225, -58, 139, -2, -145, 87, -242, 227, -8, 249, 92, 189, 22, 102, 16, -53, -13, -21, 262, -101, 96, -151, -131, 49, -78, 9, -192, -113, 88, -109, -121, 117, 101, 7, 233, 4, -66, 21, -107, 52, -18, -45, -16, 126, -109, -97, 133, 110, 28, 175, -37, -39, -78, -152, 17, -49, 3, 181, 60, -181, -102, 104, -140, -82, -49, 246, 157, -57, 133, 116, 82, -189, -41, 115, -116, 206, -217, 74, 39, 79, 231, -55, 52, -84, 359, -51, -42, -137, -57, 313, -214, 113, -31, 16, -175, -86, 39]
2663C9k78M97m61R5J94k01K73m58M04p5K86l93j08L91j32J00l08J56j15r7K08
2684A7k39N02l96Q5R5m0P8r6K18j64j74r0J50o0j46L68j21J01k31M17l35K34l46
2707a73L95k62L4J19l80M31k75K84p4k53J85k02K70o8k1J61k27L84k89M2l89M37
2729A29j65J70p1j47K04k45M72o04J28K88k83K32k54J71k58M39l02J8J44k42K07
2750C1j24q0J15K33K3l53J63P1k70J12K20J53l07J4N5j01m6J53J1J1Q3k55K14
2773A26k39K10j14k14K68k15J76J10j37j2J4j4L47m65L11q3K5J62m19K88j59P0
2795C6o0R9r7NK19k78J05j47K50J64n37K55j96K70j18J09j42O5N2j03K20l28J06
2818e1j3j83M76m19N7J36K22j68l27K2K60J84k79M1J16l00K3L26q3m2O5k03R6
$$ y = [39, -239, 258, -203, -108, 86, -115, 158, -300, 104, 29, 315, -78, -186, 205, 73, 173, -135, 21, -94, -191, 17, -222, 280, -116, -31, 64, 24, 102, 6, 224, 60, -114, -204, -54, -114, -260, 108, -13, 88, -143, 274, -61, 173, -173, 222, -40, -6, 113, -267, 164, -111, 173, 99, -154, 31, -171, 99, 31, 10, 171, -56, 328, 39, 81, -308, 129, -36, 134, 63, -84, 120, -125, 347, -257, -129, 159, -124, 108, -146, 25, -233, 206, -96, -78, 66, -176, 31, -93, -173, -58, 175, 198, -155, 8, 79, -191, -79, 141, 294, -13, 1, 56, -45, -91, 62, 73, 84, 167, -88, 126, -113, 97, -17, -231, 37, -178, -2, 108, -29, -41, -27, -41, 306, -159, 152, 69, 94, 256, -163, 125, -34, 36, -24, 75, -22, -17, 202, -76, 29, -118, 132, 296, -241, 14, -182, 88, -30, 79, -63, 2, 54, -49, 171, -157, -51, -64, -247, 229, -190, -133, 3, 225, 57, -270, -248, 12, 196, -83, -42, 74, -226, -203, 123, 40, -2, 63, -140, -44]
2841d4p2L26k35l4K74j53J49k06QNj2n1l1K10k04K41K2j54P8p5m0LJ54j36K00
2866B23k64J25q7m3L50n38J24J80l3j19K01J44l33J32k24J13J02k23K93j95J64
2887I2k06P6j26J17J27l27O53n73K31j23R9m0r0L0j40N63m85J02j22O1K61j18
2909F2Q7k74P9N1o9L41j42K6j27K43j68k25J51k16K0L08k56K07o4n1j27J96j09
2932e7J21k63M10j66R9j31k9J58j23p1k36K96j34K40m8j19J3n9L2L5J51o7J7m
2956F5j41J56l74N02m69L02K73m55L91l51M26l10j17j1K83n2j47L89n26L78k32
2977b0J4JJ97k54J32o0J34j65O5N2k37J10P7j10l5J19o7k71L69j3J25M3j24n6
3001B6l49L86jj10K25k05M06j67K1j03k5Kk34L75l30J51m55K90P1L5K7j74m0J26
$$ y = [-44, -116, 210, -25, -59, 215, 62, 211, 5, 13, 18, 6, -45, -76, 134, -70, 171, 193, 39, 117, 42, 2, 5, 159, 23, 223, -41, 84, -3, -46, 304, -234, -110, 70, 37, -82, 119, 263, -70, 62, -162, -49, 53, -170, 123, -72, 92, -114, -38, -164, -47, 80, -247, 406, -167, 64, -59, 40, 0, -90, -60, -200, 363, -122, -20, -142, -81, 180, 62, 149, -125, -46, 5, -64, 277, 135, 161, 34, 277, 109, -116, 35, -181, -161, 147, -109, 98, 34, -17, -144, 52, -57, 64, -199, 211, 45, 144, 13, -16, 142, 19, -52, -288, 8, -126, 114, 66, -53, -40, -99, -67, -32, 119, 52, 69, 65, -76, 80, -294, 208, -261, 41, 314, -141, 250, -101, 325, 15, -102, -113, 170, 118, -29, 360, -166, 212, -20, -6, -5, 192, -62, 70, 10, 144, -21, 44, 96, -141, -31, 46, -64, -99, 20, -47, -318, 51, 38, 163, 206, 82, 26, -323, 63, 62, -48, 177, -28, 378, 211, 232, 129, 104, 106, -128, 247, -83, 68, -387, -97, -26, 9, 36, -138, -178, -52]
3025e2o2N3R4J41l69L27j48K15k56j13P4J6L8J2J94k39J42k9j17j5J00j7o7NQ6
3050A3l0rL9p4j03K51j90O3J73o1j29l4K29k67M24m14L0K00l63K67m0K24k82N
3074g8J30K4q2N9j93K52L9j89K48k97O6O1j71R5R5K31n16LM37k58j0J26K3N0j4
3099A31N3j60p1L22j00j39k61K84k91K54l9R1r5J0J03l27M88n04M06l04J03J17
3121G1j28R3j64j3MmJ07l3j8J14O3j17m8m7K05J3j39j99J84L03k88R8j1n3oR0
3147G7j32J75j77J8N7k11K70j21J40j27j43J64n4l3r8L85q1p4n2J05K2l58K12
3170c6J49Q6k2r2j20L7R1J6K3k32j36M16l01J94n2K0J49l22L01j78l4p0P1j41
3194a83R7K04j65M8J5j76P6J81j35m4J19J08j15j69J82k00K1J84l8J87k87O3j74
$$ y = [-52, -114, -61, 33, 174, -195, 132, -16, 199, -57, -170, -96, -80, -42, -30, 164, -75, 67, 38, -79, -94, 6, -11, -78, -73, 13, -17, -26, 13, -61, -164, 87, -103, -40, 133, 72, -57, -91, 138, -129, 295, -119, -89, 111, -252, 15, -25, 199, -83, -78, 52, 76, -6, 53, -140, 112, 151, -38, 210, -87, -21, 40, -131, -36, 59, 290, -226, -223, 214, -44, -54, 72, 95, 145, 131, 184, 24, -47, 275, 175, 36, -225, 59, -232, 22, -17, 74, -21, -11, 92, -235, 253, -251, 155, -149, -46, 71, -57, 36, -128, -141, -137, -141, -34, -67, -85, 29, 92, -25, -73, -120, 85, 98, -41, -240, -56, 247, -41, 57, 46, -7, -13, 77, -55, 120, -57, -39, 18, -193, 77, -44, 96, -31, -174, -10, -64, -97, -195, 190, 109, 35, -17, 88, 110, -248, -36, 113, 199, 177, 85, -35, 2, 93, 109, 132, -100, -236, 180, -121, 73, 21, 41, 190, -132, 169, -9, -43, -113, -42, -183, -86, 118, -47, 1, 16, -160, -84, 97, -38, -82, 37, 145, 30, -139, 43, -157, -136, 48, 10, 197, -90, -27, -201]
3217b01J34j98K54J57k68k0j50M01j67K7J45k00J39q7K51o7N7j31k55K29l24O65
3239C91k51j15j85J95R0j87J43j60P9K21l01J71m9j08n7M4J74p4J7k15L84k74
3261f7J81k06K05k3k2l1R5k20j85K71R7j55K18k62l12N08j13P8rk1q0j54L02j85
3285i0j67L65k28o7J30k24L95j05k9J04J8j03J26r4j87L18j76m8K7N0J97j35p8
3308ak67L14r2K25l52L51l10q3L51k82L80l55M2K10j32K17m19P5K93j86j4O9j68
3331a34J11J27j95q4J89o0K5N6j9k27KJ54K9K09l33J44j61K88n4j48j10r4L96
3354A11j26J81k17J41j72J57J59k84k00K02J66j85J11j84J11J19K5o9L8j28j65
3375b09L96m62L33J07m17L68k57L25j30j02J35k57K76j01L13m24J6K48j27L3j63
$$ y = [-201, -67, -265, -11, 146, -122, -142, -292, 109, -58, -31, 114, -86, 53, -34, 217, 150, 207, 76, -179, 50, -274, 391, 140, 25, -160, 35, 125, -62, 81, -79, 0, 221, -80, 91, 42, -66, -123, -79, 95, 21, 38, -177, 207, -67, 114, -92, 113, 90, 68, 37, 132, -88, -273, -2, 95, -60, 158, -104, -416, 92, -21, 57, 48, 27, -53, -207, 95, -90, -257, 108, -120, -187, -57, -281, 114, 9, -20, 84, 102, -1, 125, 31, -156, 162, -14, -62, -35, 15, 212, 77, -1, -268, 46, -46, 179, -173, 178, -132, -215, 136, -146, 234, -121, -79, 131, -1, 216, -203, -128, 165, -21, -35, 34, -134, -23, 104, -91, -175, 14, -46, -21, 35, 16, -211, -209, -55, -26, 183, -150, -6, -167, 121, 67, -81, -191, -285, 111, -15, 166, -51, 90, -82, 75, 234, -50, -250, -48, 118, -67, 44, -140, -29, 90, 115, 46, 84, -44, -209, 187, -275, 58, 165, -252, 116, -141, 184, 54, -48, 87, -170, 106, 5, 318, -106, -90, 158, 31, 64, -99]
3396i9K1j66K07pK41l33J44J57n16N10j26J48j20j64J22j35L52l46K99j02j62
3417g5j6J14L0r5n1m1lK08o3q4l2K51j99J66P3j27J2j44K47j59pp8K75J1l26J80
3443F7o2j79O5K10k03M5K1J23r3j51L57k60j59K41k54K54O0Q3rJ49l36P0L76p40
3467c25M31k16J75j36LJ24j08J07l0J29k75J62M5j03K95n21J71j8K4l7k27M84
3489A54k98K92k33mN6J0P3m7k54K16R5p3K30k95Q2J65j17j18J8J46m8p6p1K15
3513A18q5o4O3k37M82l19R4p9j29J99p9j18R2L6k63N16k02J4j4l0J82n1J10k57
3537b1L5n0m0K11l12K11n2K69M4l79K15m34L73oq6o6O6J14Qj64o4K29j96J31j38
3562a02k4j01K79O8j14M2j45k7K10k67J53L66k56ln7J44k42O8j62J11K15O5j77
$$ y = [-99, -78, -244, -37, -44, 197, -136, 8, 165, -351, 159, 33, 181, 61, -103, 19, -116, 236, -110, 189, 87, -75, -91, 23, 53, -42, -93, -134, -137, 71, 8, -76, -108, 143, -56, 110, 183, 56, 68, -76, 171, 12, 5, -73, 202, 213, -113, 67, 5, -174, -109, 101, -102, -57, -36, 87, -6, -157, 200, -60, -219, 22, -232, 22, 82, 165, 156, 305, -31, 39, 415, -325, 106, -110, 65, -71, -68, 56, -52, 55, 25, 154, -121, 41, 86, -17, 278, -243, -72, -90, -66, -103, -330, 154, -144, 148, -85, -89, -33, -23, 50, 3, -251, -35, 60, -13, 217, -78, 4, 169, 52, -66, -48, 98, 50, -26, -97, 118, 33, -31, 32, -205, 277, -42, 52, -27, -156, 43, -36, -154, -62, -26, -289, 227, 25, 39, 25, -5, 177, 126, 236, -21, 14, -36, -76, 135, -177, 34, -18, 251, 295, -84, 131, -303, 70, 64, -22, -88, -22, 92, 100, -64, -128, 101, -95, 36, -102, -126, -227, 52, 120, 6, 48, -97, -124, 86, -181, -28, 338, 82, 79, 22, 166, -76, -8, -170, -59, 156, 221, 44]
3585D4j87K19j33N4K77q8m2k01m7J36L61p56L44j53L10j85p9K15k72K71n9j1j0
3608HJ56k11m9K28k50J89J5J27M9n15N08l24K38j53K6j78J67j94J1L73j72O0N7
3631A66O8k50R3r8k16L39j77m6q7L88k16l7o4J12M0J04l76L65k11R4p7m7j80J90
3655a23j6J99Q7k38R6J63m7j17K03j93o7mK1k5J74l26L1Qj2L43r3k29K48L2j16
3680aO6KJ20j95Qk38J45kM3J28o4J2r5k7K59l17K55j06J18J72l18j1P0l91K05
3705a62Q7O3Op3QJ30j10LJ46j73M7L9M3m1L2k1J08l1rml00K76J9k60N6J63J71
3732B13J4k06N5k87J64KJ94j24k63L38r2P3k51K89k68r7K68k43K72J35l44K39
3754H1J17l58N4K03J66k66J37k12O1j84P2J09P8j25j38L54k57N80r05N89k01J68
$$ y = [44, -143, 76, -57, -3, 274, 186, 144, -57, -104, 32, 393, -363, -19, -172, 138, -47, -126, 89, -183, 88, 29, 18, 8, 164, -47, -96, 132, -118, 71, 86, 213, 262, -253, 255, -69, 169, 16, 42, -136, 31, -163, -152, 221, 49, 109, 166, 234, -16, 77, -21, -237, 102, -75, -121, -208, 180, -36, -73, -137, -25, 15, 119, -257, 108, -103, -9, -86, -133, -313, -123, -139, 60, 147, -91, 5, 168, 121, 4, 207, 14, -53, -57, -36, -61, 113, -213, -182, -174, -186, 157, 64, -165, 83, 115, -1, 65, 67, 187, -8, 0, -238, -93, -95, -52, 76, 12, 24, -71, -98, 161, -156, 99, -7, 111, 283, -35, -46, 24, -367, -162, -75, -12, -6, -79, -71, 59, -51, -48, 98, -75, -28, 11, 54, 13, 45, 24, 132, 101, 92, 88, -212, 64, 83, -177, -121, 42, 213, 227, 21, 76, -211, -47, -45, 149, 25, -238, 100, 8, 81, -170, 119, -149, -246, 22, -221, 51, 186, -158, 81, 198, -160, -106, 97, 263, -3, 134, -78, -17, -201, -129, -20, 58, -67, -205, 149, -108, 472, -433, 156, -45, 123]
3776A23L7m97N54j05k58K75k3k09RQ4R0j17J33j80R0j69J53Pp9j31K55j37J61
3799F6k38K80m1R6q2K14m49L70m3l89O5K57M1k13J74jp0Q1Ok21PJ32N4l08J35
3824g7M17m79N7J18M7O3q7J75k92m0n7L84l68K33j78K10l5R3r5j94Q5q4J65j20
3848e9R3L21l86O3j86J57L3j38K38k48R4J22k40K16L6j13k66Q2j65K51L27l30
3870i8j97J95M0j09K99l56K49j24P6K18Nk83Q0M8K0k44K60j55O4j64K2K52j22
3893b4J07J25j22j20K15j74r6lK55j14j37K42M3j9k30J20J62m88J76J50j49J00
3915A9L27l69K33k24J15j5Q4k82K21l2k38J13J04mk88J95n2J28P5N0r1j3l43K46
3939d1O3n9j43K73j19j7j08K03o7R6m4p3j12M95ol57j97J26J74j59L8L63l79j17
$$ y = [123, 160, -337, 217, 112, -146, 129, 106, -103, -94, -10, 80, -37, 96, -84, 6, -163, -10, -3, -82, -213, 42, -95, 66, -172, 108, 67, 163, 81, 295, -154, 216, 173, -216, -151, 106, 147, -66, 108, 107, 37, 118, 124, -97, -90, 42, 96, -212, -77, 340, -139, -82, 36, 83, 146, 59, 234, -58, -98, -155, 229, -139, 94, -84, 126, 91, 184, 89, -105, -20, -104, 61, -59, 34, 355, -31, 32, -154, 3, 36, -102, 136, -112, -18, 104, -136, 80, 116, 3, -263, -181, -346, -95, 232, -98, -295, -100, -60, -169, 130, -226, 23, -101, -25, 193, 198, -85, -5, 43, 63, -181, 79, -76, -12, -176, -154, 98, -24, 83, 208, 86, -34, 181, 7, -89, -92, 163, 49, -88, 154, 197, 178, -52, 68, 230, -258, -82, 68, -81, 19, 346, -23, 210, -14, 101, 86, 170, -112, 109, 77, -161, -48, 56, 52, -236, -41, -93, 35, 110, 160, 69, 56, -287, -41, 22, -37, -180, 93, -26, -43, -151, 52, -15, 81, 37, -36, -148, 347, 341, -16, -213, -87, 87, -72, -34, 329, -50, -167]
3963a67M20k14j11m3N9K07n2O8k32K11j89K33Q8p4p1j03p5o6J19j9M8q5L0r4k7
3988a39J28kL5R5j59p1J23pO5Ok67L16k20L95k70J22j88K59j40j22J36k52L18
4011A61l21J03L5j08m4L64j77J5o4n0J69Q4k05M8p9J78k54J11j49K27q6n6N3J7
4035b8q2J65KJ91j89j81K80n9P0k85L09m04K43J2k9j20K66l0j56l9J32j12J72
4058A28k34K7J01j07q2K94j08j37J76j10J26r3J56j87R7k18L16q5K56n13J15N0
4080c2J48j45J11k13L4J20Kj58Q6K62j80o2J07j35RP4p5j1j35J48M8j49m5K68
4104G7j65K00l4j95J72p4o7K52j82q1K97k62J13p0J98k30j02j93K25J63l1R5k45
4127a39J00J08o0L6R4j5k21J43m9J31k1j94Q0p1J16o8m9J93k2M3j61J74j89O5
$$ y = [-167, 253, 39, -72, -115, -56, 151, 99, 167, -65, 146, -43, 190, 278, 204, 133, 30, -45, -111, 8, -11, 37, -48, -18, -112, -139, -11, -13, 22, 117, -42, -113, 10, 3, 68, 74, -193, 123, -97, 298, 28, 150, -38, 221, 81, -41, 95, -157, 161, -160, -57, -22, -130, -174, 190, 13, 28, -36, -86, 83, 167, -38, 10, -69, 109, -145, -34, -183, 44, -42, -98, -45, -28, -110, 55, 57, 248, 59, -122, 158, 99, 169, -116, 193, -211, 32, 44, 15, -105, 161, 131, -25, -64, 68, -44, 128, -106, -79, 22, -85, -167, 127, 19, -118, 58, -52, 74, -19, 137, -50, 47, -171, 145, 60, 316, -197, -82, -32, 116, -29, 82, -131, -97, 23, 25, -133, -47, 215, 35, -27, 80, -55, -46, 28, -47, -58, -193, -45, 3, -146, -191, 77, -88, 112, 78, -117, 55, -19, -86, 166, -16, -97, 200, -62, 51, -19, 179, -51, -153, -346, -121, 42, 11, 106, -139, -39, 69, 9, 45, 139, 124, -97, 46, -3, 128, 107, -87, -7, -78, 38, -30, -79, 114, 92, 135, -26, 148, -41, 24]
4151B4j15j23J76O2K3k08M28j86l14K22rO5l5O1J06k41J84m9l21K06K7n9J77J10
4175B11l09j33K30j77K41P1k41J2J46o5ROj40k9N8M7L47l98R6M9K2J1j01M8j36
4200a25J92j40rM2p7K3k7K56k26Q4L1j69M0K34k01K16l52M3J03N1n1J00N6j55
4224f1J33o7O6l48K54L9j13J69j47J79j16K42j40k48K01j13O6m9P2R1k15K20n8
4247E7O0r2k48L46l05J94j22M6L5k2k3k9M1J94k03o1o8L7K29k30K01p4k21J79
4271g9J60k28jR6p0J18N8k6J99j23q7j05O1k05J79q4M7J46j33O9o5K07Q9j97J05
4296A31k57M49l13J54j69j1q3r0J49K37k74K36k04J62j37P9J0l21L02PPj67J05
4319Bk04R0K3j55K52k2j2K21k55J11j25K10j96K35k13k6J39J8n5J7l3l3J29j40
$$ y = [24, -91, -214, -38, 24, 47, -161, 267, 81, -233, -11, -20, 45, 10, 71, 177, -64, 120, 71, -250, -44, -17, -76, 101, 211, -98, -231, -1, -178, 63, 134, -107, -95, 51, -14, -5, 1, -139, -168, -110, -63, 284, -114, -18, 31, 53, 64, -37, 11, -125, 67, -73, -82, -40, -117, -94, -121, 135, -91, -7, 24, -145, -105, 129, -72, 144, -208, -165, -62, -11, -62, 38, 94, -61, 72, 5, 71, -277, -23, 16, -97, 72, -75, 104, -12, 230, 90, -158, 43, -70, -4, -53, 19, 110, -105, 115, 57, 117, 25, -223, 123, -182, 12, -110, -64, -29, -51, -74, -103, -62, 132, -71, -132, -200, -163, 66, -164, 37, -37, -258, -79, 81, -147, -148, -52, -122, -4, 54, 28, 227, 104, 17, -88, -27, -232, -53, -137, -90, 56, -77, -8, -73, 134, 223, 26, 131, -126, 323, 10, 164, -5, -16, -99, -189, -40, 197, -77, 159, -45, 117, -20, 59, 69, -252, 50, 57, 64, -103, 2, -202, -112, -89, -244, 8, -14, -26, 195, -60, 51, -74, 136, -60, 175, -38, -64, 75, 93, 38, 55, 22, -11, 118, -22]
4343b2r7N8q5M2L30j36K1j34J7J48m4j37l0J14R3J1k31n3K84j57n1L17j56L5k55
4368a18Q1J93R4n1j53N6l35R8R5J33k86J36p4J27o3nK47ok31M0n3J54j10K64k57
4393b4j69J89j17J80rm7K15j68O2j12J26j7Q6j26k47K30Q2k40Q9P8q8R8j42J09
4417C8j21O6J02n0k46L26N8j85P3n2J47k23m6K9O8J48l61M09l47K7J51j88K82
4440A05j92K09m37J27L4J92j77J36q9J89j58r5L6J41n4K30j51j30l3J68l92K98
4462d3J20K09l36j12L77j92r5M3J05k44J90n0J37r8nO2k7l1k2j06J72m5J44j21
4486C2L5j10L1n1J99l08J47K5r2r4L84k67J4M9q6j9K72l67K10M6j79K1J11j92
4510a89J85m3l7J33N3j63oK14k94L10l3l12J78J00l1K03m15J79j86K44M0j71L3
$$ y = [-22, -119, -61, -146, -104, 226, 90, 111, -23, -6, 142, 98, -39, -69, 45, 138, 149, -82, -135, 149, -8, -59, 258, 102, 137, -118, -37, 156, 250, 199, 46, 102, -233, -135, -40, 93, -193, -57, -131, -4, -67, -72, 175, 169, -62, -22, -75, 79, -31, 233, -24, -193, -4, -121, 59, 50, 3, 218, 50, 112, 0, 126, 109, 195, 69, -178, 52, 134, -106, -17, 61, -27, 71, -71, 38, -83, -17, 85, 35, -211, 115, 173, -12, 61, 9, 156, -67, -113, -84, -16, 132, -229, 180, -167, -140, 11, -177, 105, -87, 122, -315, -188, -154, 38, -139, -3, -92, 97, -61, -156, -120, 21, -33, 197, 46, -84, -117, 51, -341, -43, 77, 286, -50, -162, 215, 23, -72, -29, 76, -168, 22, -28, 109, 11, 6, 68, 41, 10, -12, -118, 54, 9, 153, 32, 67, -43, -12, -63, 136, -172, -25, 0, -92, -186, 198, -69, -55, -6, -92, -111, 161, -206, 4, 50, -129, -108, 3, -189, -4, -47, -84, 49, 102, -61, -67, 147, -147, 163, 130, -182, -4, 96, 65, 268, -147, 32, -154, 90, 130, -41, -8]
4533hj29K51o7%j71k2J6J85j34J53l5j1J43k68J1j55J53J52Q3j39q5n9K30j01
4557gM8K60k77J14j80J94k29K80k77j54M74j84o3L2j76pK09q5P3P9q4p2nK11k32
4582e8M3l7Q5%k67L30o0k09l7J88j43K06J39j09Jq9kO6j43J42R5q1Q0r6l50L51
4608D5q9l10N88j70j42Q5K06n04J17J98R0Q4l19K03L8n7j13J04o5J66j09k05K78
4631A19j31r5Q0m8O9j17K90l98J48J31jKk61L4J02K5J64n0n9l0q2J15J53j87o5
4656i2Q3J5J95j55J05j14p0N7M8P9k60J69j57R5M4l2n2j28R4j5K27o1J39k20j12
4681a18kj0J55k05K87l05J07j12J79k14J33K47k76K63K4l44K97k56j16L06j48
4702a08L3P0O5j03J92l44J33R2p0L8l7K59q3k59J69j13K15l03K16j62O4M8J18
$$ y = [-8, -137, 114, 47, 47, -124, -146, -130, 55, -79, 74, 39, 28, 171, -97, -86, -241, -88, 64, 147, 8, -77, -136, 94, -7, 41, 301, 24, 138, -42, 152, -77, 203, -74, -228, 246, 62, -1, 31, -145, -152, 57, -28, 45, 124, 40, -32, -37, 174, -58, -15, -52, 33, 33, -234, 96, 36, -173, -210, -22, -165, 41, 180, 71, 72, -17, -19, 47, -96, 46, 141, 60, 140, 44, -306, 45, -44, -354, 234, 64, -78, 7, 213, -291, -174, 24, 114, 198, -121, 82, 120, 63, -50, 54, -11, 155, 46, -159, 119, -12, -107, -27, -75, -6, -123, 167, -231, -83, 48, 47, 49, -212, -178, -76, -51, 113, 63, 4, -26, -108, 7, 160, -27, -92, -9, 6, 201, 46, 151, 37, -33, 24, 72, 151, -109, 60, -97, -2, 42, 10, -42, -170, -76, -91, 136, 75, 214, -6, -118, -120, -130, 25, -180, 107, -198, -91, -203, -24, -238, -105, 142, -134, 129, 153, -191, 106, -150, -266, 40, -108, -75, -5, 60, -43, 149, -195, -62, 30, -40, -2, -39, 220, 137, -122, 47, -66, 149, -154, 62, -100, -36, 12, 130]
4725A30j54o0K32l65K43l7J4J94j73P2k90J47J49j25K4K3R7l7J71k90R5j89K31
4748A02j52K12k92K19l8J74m54L38l23K71j27J44j42J37K5j58M14m62J40j0j51
4769a33J79O8j19j96L35j93P4l5O7n2j58R4j51J9K96k1j55J52rp6r4J19j60J88
4793C9j33p5J92K33l04P0n3r0k10M27L3J15j89J87k14n8j84K17J49L8j97L42k72
4816F3r5N3L5J8O6q9J44j56j26j72K96j05K05n9R5j70m8j11K30j29J07q0j74J20
4840h2K01k7K02l99K15j54JP4M4n5jn1K51k69J19Q0l57J80Rk18J59mN3K31j55
4865D7j00j40L44k36M8k6j1J53N6l21Q7J34m5L5K1j86L04k27J01Q1k80J00j02
4888a63J22m2j7P3K49j07o2K1P8l26M5L67j83j79J46n3N4j20P9P8j36J58k2J50
$$ y = [130, -24, -84, 148, -217, 26, -11, 3, 197, 24, 96, -194, -47, 102, -23, 1, 24, 121, 84, 255, -35, 60, -129, 102, -50, 162, -130, 89, 51, 225, -229, 109, -214, 57, -70, 74, -68, 69, 94, -64, 350, -112, 28, 18, -133, 46, 114, -5, -201, 134, -59, 15, -20, 47, -5, -163, -69, -220, -201, 95, 74, -81, 71, 62, -14, -108, 11, -149, 39, -94, -169, 23, 256, -48, 22, -31, -121, -331, 96, 129, 244, 55, 242, 28, -30, -214, 3, 152, 190, -7, 335, 63, -32, 21, 56, 74, 140, 51, 195, 39, -87, -259, 37, -68, 137, 78, 173, 3, -45, -156, 74, -55, 52, -28, -202, -82, 119, 92, 294, -105, 110, -44, -43, 31, 75, 20, 19, -32, 219, -50, 69, 149, -208, -28, -19, -237, -78, -82, -29, 202, 47, -53, -193, 151, -85, -37, -63, -74, 79, 135, -186, -99, 35, -10, 25, 46, -140, 164, -63, 38, 119, -161, -61, -163, -41, -83, -100, -27, 222, 115, 53, 74, 152, -174, -129, 238, 55, -124, 22, -31, 23, -97, -18, 60, -76, 82, 60, 210]
4912B10k75M6N3j95J01J6LK34m41L14M3k04l6n2K58j89K99k54J80Q8m3Nl15K0
4936a34R2J10l86K97J45q4Q4o0r9J18l71M29r8L23k75j38o4qJ52J88k61j9J61
4959A02m00M35lq9k41L24j73l2J05q1j57M74j64j92J63j68L1K28l02K86j20J83
4981B09j12m6j89NL27j01M1j0k25l0j5J55J3j48J28J93j07j59J8n3Q4J20J8L2
5005A48q3R8j41P6J0M0j37k0j5P0k87K06o9J34J92k17m3P9K27l37J65k98P9J67
5029D4r5l3k12L75r6k2J13k06K33J13j75J07r3o3J35j80j30K71k42K0JK10j22
5052d7J54j58k7q6R9J83m0L4j56M5r0K18r6Q8k35J25j80K06K04l92n7K09J1j85
5076a73L20k25K80j50NJ68m45K65j0PL9j72J81l6M8r5k25J95qK9qj04J39L6o3
$$ y = [210, -65, -19, 34, -161, -60, -44, -41, 193, -248, 66, 109, -95, -131, -183, 75, -114, 185, -69, 111, 199, 156, 161, -154, -134, -42, 68, -318, -21, 124, 40, 124, 64, -35, 83, -288, 141, 43, 366, 91, -47, -111, -119, 33, 221, -40, -59, 102, -298, 137, 134, 45, -196, 128, -45, -77, 28, -53, -210, 264, 100, -92, 71, -97, -66, 162, -140, 146, 26, 209, 97, 51, -138, -133, 194, 93, 134, 124, -101, -131, -146, 9, 22, -126, 2, 195, 88, -71, -53, -106, -22, 98, 116, 148, 65, 163, 22, 98, 108, 148, 11, -9, -24, 46, -241, -35, -104, 30, 222, 5, -38, 41, 268, -69, 96, -202, -123, 44, -51, -84, -296, 79, -17, -39, 74, -132, 101, 214, 39, 146, 53, -10, 125, -55, -185, 86, -156, -136, -135, 75, -47, 107, -51, -78, -164, -65, 118, 78, 112, -44, 1, -89, 129, 33, 121, -114, 11, -169, 37, 241, -151, -208, 1, 12, -173, 147, -78, 202, 52, 57, 225, -220, 45, 35, 42, 81, -91, 90, 54, 102, 7, -218, -23, -31, -2, -10, -114, 25, 61, -2]
5101bq7K2n9Q9J67j46l3K26l19K48j06O3k44K94n5j16QK45j49o5l2J77k24K0L24
5126B46m06K30J6j44j41L21j81J22J01j25J62Oq2k44K35j39j03j4j34J93J71O6
5148A56N8j55R8k79K66j5j91K38L1k47J74j65K28l38J98j31J43m7l4o2M5J87m09
5171b51M18j35l8J82k85j12J55J5M6K22l45K49o8j91L42k95J41N7p8m6j08J08
5193a7K11l16R2P8J4j42J02K36l11J11k48K85k5j92J37O6m6R1r8mj55r5K40M5
5217E9l34N2K00q5J61l3J5j55l2K45m9m0l04K23K5k1J98o4p6M1N6k23K00j46m7
5242a34Q4J52p8N7l7j18m6K34j72j5L2K78l73k6Q2L1j29M40l47K49k17q9O2J9
5266f1k7P2j9M3N8K88l08rR4k29O3k0O6j79K15l9j31J74K13l8k04K3R2k84K1K1
$$ y = [-2, -89, -67, -126, -37, 130, -16, -49, 177, -142, 106, 0, 63, -181, 113, 58, -58, -50, 195, 46, -19, -51, 126, -98, -78, 246, -160, 70, 86, -58, -199, 122, -59, 63, 164, 39, 201, 207, 125, -119, 116, -23, -126, -140, -274, -81, 90, 156, 214, 59, 157, -122, 144, 129, -62, 176, 207, -40, 134, -31, 197, -141, 57, -74, 69, 22, -12, -74, -29, 158, -251, 167, 32, -6, 176, -109, -221, -66, -51, -5, 217, -128, 121, 53, -138, 204, -91, 50, 107, 29, -17, -125, -17, 194, -122, -30, 48, 62, -80, 22, 258, -53, 58, -190, 95, 70, -122, 15, 81, 35, 126, 28, 24, -131, -226, 14, 59, -275, -223, -23, -108, 53, 20, 35, -120, -152, 93, 44, 4, -300, -77, -52, -73, 125, 61, -15, 26, 82, -141, 59, -87, -134, -50, 102, 24, 81, 44, -74, -120, 114, -58, -73, -41, 237, -136, -162, -80, -49, -178, 262, -85, 164, -53, -142, -80, -61, -88, -16, -35, 8, 66, 354, 46, 37, 131, -98, -35, -55, 11, -168, 47, 8, -123, 51, 264, 226, 22, 45, 137, -147, -126, -105]
5292a05m3n6K37jl5K41k36l4N2j29Q4P1m3K09k35j17J66j39K73j29N5q4K61j01
5316A62L0j64l6J67k33j6M2L08m6j88L4J14l28K96N9j73p7J85o9L7k41J99j0m9
5340CL3Np4L1l4j27K75J72k84j29K7N1OJ02j82J68J12r7qj53M9J5N5O6k57L19
5366A44kN0l39R1Jk11J44K10k33K22j99M62l27j41m6N26l08P6k87O7K06j68L30
5389B68k29K2k38J90k0Q8KKj80m1J56mJ2J5j9M4kK93m73j12K75K0O1O3m37O4L58
5416A78m04K94j81J39k36L66l6k70K33r3n1K49r8r1J08K98l62j29j90J38m5J3
5438a70k5J25K76k54j49P7J88J18j52Q8j64Q1j85j1l6J96q1Nk14L49k61P5k54
5461c78M45K7k59L35j03n7k23K06P3l6L7J9pj2j40K52j51Q6j90K44P4k04j58o8
$$ y = [-105, -148, -204, 33, 32, -3, 238, 2, -32, 20, -109, -25, 46, 3, 212, -23, -140, 26, -113, 160, 31, 86, 2, 263, 162, 192, 28, -8, 159, -74, -90, -48, 260, 214, 26, 60, 174, -154, 142, 201, 28, -49, 136, 67, 104, -137, 62, 52, 3, 36, 41, -33, -2, -36, -163, 112, 284, 0, -129, -102, -51, -45, 57, -125, 43, 155, 58, 50, -103, -54, -39, 16, 82, -175, 144, 142, 192, -147, -56, -55, -266, -122, 88, -145, 77, -122, 340, 13, -128, -174, 352, 44, 120, -167, -100, 106, -62, 268, 39, 61, -177, 13, -7, 81, 83, 85, -95, -136, 20, 16, 28, 43, 24, 68, 66, 359, -114, -226, 49, 69, 130, 193, -244, -180, 178, -226, 68, -113, 26, -210, 156, 120, -150, 83, -10, -61, 188, 90, -1, 107, 405, 43, -86, -276, -138, -183, -170, -195, -70, 206, -48, -197, -120, 68, 186, 34, 122, -42, 39, -146, -157, -193, 3, -78, -73, -287, 62, -199, -124, -378, 67, 94, -165, 170, 67, 10, -213, -7, 66, 30, 67, 86, 79, 67, -73, 179, 28, 114, -76, 168, 242, 38, -120, -188]
5485a88J90P5k76J91l7k1J15k5L3k19L27q0q4O0p8J51J5j35oo3L53k56r5J02J2
5510F1j41m6K49j26k19L15k93R9M04k65J9M1k22L44k68R6KLlk54K06J44j3k52
5534a19K40j95J05k9j20J75j97J11J03j11J97J19m57l3L16j25k04K44J68n07L42
5555B3J6j17j63M77j88k9K6L8p5L1m7j46J62J24j29j77L32j37n4m2J18m2j26J65
5579D0j67P2J04l8j24j77J15Q7N1KJ13K14j16k59O3j90J30KJ10j13n4J73r3J48
5603I3N3n4j32J87k58J28jM0K7j23P0k80J53L20k58J16n2j15O3Oj07o1K61r7j80
5628b01K40j49m8j3L42k96J19L5l9p2J82j32J07o0J06K6j15k29K86m9l5L0k65
5651b30K46J47k79q6J17J6M73l42K83l90J95k46J12lK4M0o3m3j05j32K50J47l06
$$ y = [-188, 2, 77, -199, -8, -45, -66, 49, 24, 57, -162, 165, 85, 1, 61, -17, 134, 149, 14, 8, -55, 298, 42, -53, 49, 61, -80, -126, 123, -3, -222, 93, -200, -101, 303, 38, 57, 98, -124, 220, -48, 48, 50, 53, 50, -204, 2, 146, 133, -119, 121, -74, 31, 2, -118, 57, -140, -29, 74, -37, 160, 279, -178, -211, 105, -20, -224, 20, 188, -319, 23, 39, -78, -241, 236, 48, 19, 45, 83, 8, 39, -8, -154, 8, 132, 3, -174, 158, 21, -33, -75, 43, 1, -125, 40, -127, -55, 49, 11, -113, -290, -175, -88, -37, -35, 78, 292, 176, -83, -20, -210, -80, -78, 32, -81, -135, 38, -55, 93, 146, 92, -40, 147, -111, 17, 16, 56, 83, -40, 30, -250, -97, 223, -35, 81, 29, -86, -23, -17, -124, -185, 76, -21, -201, 39, -110, -158, -171, 171, -125, -6, 29, -10, -82, 100, -32, 75, 15, 121, 147, 32, -197, 89, 40, 5, 35, -230, 16, 163, -116, -202, -85, -69, 404, 62, 345, -45, 150, -96, 16, 13, 37, 77, 14, -29, -134, -266, -16, 131, -175]
5674a75J25o6k8K8J82j57J33J45l91K79j03M1r4J7N4L9j13K18k20K26Rk79K89
5697A59j34J33r0L2j27J37m2M0n8j00j35L46l48M82m28K90j16o8J8k8k9J98k35
5720a03K29l31L08r2J76l28J81o9j50L48j91R8k64L43j36J76r7l44K93k33L81
5741A95k33p9O2M8j2J02j34JJ31m4n3J2j42J02lp1K59j1L1Q6M1m02J31j6n5o4
5767a18n8J32J1k24J28P5J7J74k83K73k32P6O0m8o6J41J6m4J4J17o1p1M9j12J99
5792A65k00K56j04k02m4j90M22m6K3l47O9p3L09p3J26m0r9k0J18j08k2O8q0O0
5816c2P2j57J43k26K24l6K92m94Q4L6k5J64j40P8QJ10m2Q4l01l2J14r3N01k73
5840E9j24l6n0J14J12l1j78J47K15J08l08P4Q1k93J84K4j10J23o9p9MK03j52Q9
$$ y = [-175, -50, -116, -144, -116, 66, -91, 42, 187, -204, 75, -28, 13, -81, -64, -10, 29, -84, 134, -86, 140, 149, -130, 159, 25, 158, 68, 100, -27, 110, 68, 108, 50, -50, -185, 161, -187, 295, -133, 157, 41, -27, -9, -37, -66, 132, -103, 126, -205, 103, 11, 187, -141, 40, -29, -179, 169, -22, 76, -188, 155, 19, 195, 98, -246, 47, -186, 195, -38, -117, -55, -7, -19, 83, -51, -50, 81, 37, -16, -4, -146, -44, -47, -118, 141, 130, 161, 247, 288, -114, 17, 1, -54, -118, -176, -44, -33, -257, -129, -54, -37, 137, -146, 127, -105, -29, 31, -17, -83, 58, 74, 30, 44, 161, 100, 29, 78, -34, 165, -35, 221, 117, -85, -129, -319, 103, 57, 80, -267, -198, -271, 38, -35, 91, 51, -48, -68, 50, -58, -80, -12, -92, -32, 40, -117, 26, -200, 24, -12, 280, -214, -130, -94, -119, 45, -95, -17, -9, 101, 59, 143, -158, -190, -76, -169, 332, 59, -65, -101, -151, -37, 75, 44, -134, 13, 228, 336, 28, 102, 183, -110, 74, 98, -12, 111, 42, -37, -33, 170, 18, 107]
5864A07k99j11K68J83l26J86n1oL8K4k08P3J42q4Q3j44Q9J0j1n6J2pqK2J33k8
5890C1q1o0M3J15P2q8L3J33m7k46K11j39j43Q6N1K8J01R1L4j47k32K24j10J56
5914A16p6J96k07p0J57k22J21l9J61Q0k33P4J79o7k02NN2J20k73Q8j35K95K83
5937D03n88k6K46q8k0J10P8jl3k20K51R8j23m14K43pJ18Q5j38Q0K03j71Jj14J46
5962A19k8j60n2P6k7K41J9j02j32J1J0o2J56j99K6L7K27m23K07J57k67L23k52
5985i5o3K38k40L31p0m7k38J27r5O4j15J75J31k6M0m9l47L96j37j86R2K73l29
6008a70K72k25K71j70k3j39Q6o4j07K56Ol6K39l3j02j35J20p2o0K8K91k08k35
6031b10J48j50K32k08J24j5m1J85kpk06K03P2m30K47J00j07M6K09k84K65%r0n8
$$ y = [107, -192, -303, -35, 148, -178, 8, -43, -49, -11, 13, -195, -122, 20, -64, 19, -125, -36, -26, -37, -93, -81, -88, -96, -74, 59, 31, -50, -110, -67, 48, 120, 32, 65, 198, 151, -95, 116, -23, -166, -80, -29, -1, 100, 191, 225, 78, -154, 70, -40, 116, 40, 236, 29, -41, 116, -106, 15, -24, 137, 217, -16, 58, 237, 170, -32, -27, 25, 145, -128, -40, -175, 120, 403, -185, -211, 35, -53, -73, 37, 115, 114, 81, -139, 112, 210, 87, -327, -84, -91, 27, 112, -26, 54, 257, 86, 87, -27, 119, 91, -69, -121, -45, -72, 169, 188, 86, -46, -35, -25, -87, 69, -130, -104, -67, 160, -263, -56, 101, -166, 157, -95, -158, 80, -160, 171, 101, 54, -184, -57, -152, -88, -203, -28, 103, 77, 117, 68, -279, 117, -20, -206, -114, 159, -170, 102, -123, 148, -22, -45, -184, -98, -162, -269, -13, -7, -43, 196, 163, 61, -74, 46, -26, -86, -58, 233, 25, -210, -62, -212, 20, -188, -64, -79, -120, 65, 63, 56, -150, 53, 125, -305, -58, 42, -65, -19, 190, -94, 171, 171, 81, 23]
6055B3J40k5O0n33K96n7J23k19J56J11m6jk01MJ42R9N9k87J29J20L5p5N6K8j23
6080A4N5j35k16J52J62j00P5j24K82k01j62J38J10j08K6L5n9Q7J77j45PR5k19
6103e4j4L41l56p6p2J23N8M2j48J63K61j30q1j12J22j2J2j26j00m9K32j77K48
6126I5p0p6r1J06J83k86R1r7J37J10j04j95J59K43m25K44j69j06K73j16o8L04
6148A42j11o5NR7l14J18J06J75m4j22K32k48J2J76p5k50J44Q9Q8j48J48j34j34
6171a13o9K47P6n3m5k03M93l57K1j03J83j54K27k8k74k3J86j00J4K07k68J47J22
6194A33j81O6k1M4M2K9k43k43J94K46p2n0J99L7j14q6j7q8J32o9p2L31l61J26
6218c8q3K37J40k50k1K47l67L21l61K85j06k1J94j26k26L4J01q7J99k24K55j52
$$ y = [23, 163, 138, 198, -335, -39, -96, 27, -192, -36, 75, 29, 28, -173, -169, -27, 72, 131, -156, -27, 93, 128, 53, 109, 137, 14, 69, -66, -282, -130, 32, -68, 7, -117, 165, -36, -198, -60, 50, -58, -32, 3, -56, 31, 208, 63, 70, 165, -54, -68, 273, -83, -159, -231, -108, -50, -8, -156, 7, 268, 138, 57, -55, 67, 55, 67, -59, -159, -208, 24, -153, 95, 25, -51, -142, -36, 147, -139, -48, -145, -8, 102, -2, -197, -38, 205, -220, 24, -145, -251, 22, -94, -162, 142, 31, -34, -29, 68, -246, -128, -22, 153, 109, -13, 219, -29, -17, 159, 84, -166, -22, 67, 155, 7, 155, 21, -113, -182, 65, 141, 88, 43, -160, 333, -24, -3, -106, 77, -77, 150, 122, -152, -175, 11, -89, -75, 132, -136, 11, 133, -48, 18, -3, 41, 83, 112, -131, -374, -180, 66, -6, -56, 143, 180, 66, -20, -37, -125, 7, -62, -134, 197, -164, -38, -121, 116, 256, 6, -15, 232, -135, 186, -175, 110, 4, -17, 177, 51, -175, -141, -40, -127, 72, -152, 103, -49]
6240d9j45L09j17J21m1J8j37m8Q2R3P3k45j8N8l7J33k5J64q5j70K18p6K0j96N
6265i5J0J66k5k36L81k65N0J45k18L4J61r2r9P9LJ67k1j58J81k77K7K21j03Pl64
6290c21L44K6j21J26K2O0O4o3k77k8N0K23q6j69R3n8L22j59p3N9j1j78J9J96j73
6315a13J46k00N8K95j55R9j61l0J44j18l2oj6L14m63R3J39P1j74R2J98j69j05
6338i3Q2l4J54k83L77k64l0J28J68j9l72J2J19K39j31L9p2k8J27k13l6J88j37
6361g9J25j14R3Q8k75O3K68k30N9J12j79J36j67J64P3k09L6J60j29M8R6o0J18
6384A97j86m6m1J53LQ3k14j80K59k02J54j60R7P2J2M2j80K93k13J47k42L53k96
6407i5r2K35O3o3k9K43m58L51j89N3J36r6q2%j26J10J82j19OR7mK6l08pK74r8
$$ y = [-49, -194, 115, -2, 119, 78, 96, -41, -89, -7, 86, 159, -86, -104, -46, -83, 50, 25, 189, 104, -66, 152, 76, 96, -100, -95, -85, 81, 56, -180, 201, -64, -14, 131, -87, -53, 108, 16, -83, -4, -1, 166, 145, -13, 168, -109, -82, 139, 36, 43, -321, 23, 49, -72, 54, 76, 136, 200, 137, -140, -168, -118, 105, 19, -150, -57, -115, 207, 48, -25, 34, 23, -155, -136, 60, -113, 33, -167, -109, 186, 31, 130, -31, -61, 83, -35, -67, -73, -89, 225, -238, -145, -6, 65, -109, -17, 181, 12, -93, -11, -45, 109, -174, 203, -61, -91, 37, 205, 186, -186, -174, -55, 184, 53, 92, 20, -8, 119, -94, -130, 58, -79, 46, -68, 25, 113, -162, -99, 169, -61, -2, 110, -69, 67, -100, 64, 137, -72, -36, 124, -5, 43, 139, 79, 197, 11, -35, -76, 77, 80, 163, -51, -231, 28, -174, -20, -180, -83, -11, 1, 43, -137, 156, -57, 90, -152, 201, -95, -187, 48, 111, 48, 19, 262, -196, 155, -34, 19, 155, 59, -23, -23, -149, -39, 143, 24, 30, 127, 123, 149, -159, -166, 108, 10]
6433A0nk88L30N7M5q7j90O8k1R5q7k0Q8J22k53K33j37J11J1p0R8l95K35L3j05
6458a22l6J07q4M1J15j56K76l6j26l6J01j46P3j2R0Q1q2L8l58K73j18O8nj40K23
6483B9l38K52Kn7L7J2O4N7J3M4o3q1J64k38R9k02J02j49K24r1Q2J21k3j90J43
6508A3pl7l6q2J41K2J44k20l6NJ51j73K66Qp3l5K1k46J82J37j84k10K9L34j74
6533f0J54k58O9K43l35K49J25k58O2J39l56J65j11Q0J05J82j38q5J8J19O6m2j0
6556A23j31N1k17j72N05k32j6J90l8k11j21K38K4j98K42j37o2J14P0j48N9L43
6578B76k32o1N0r9J91j70JK5K6j36K56k22J24J20o3R4j26P1j19J9N8o4j81J54
6602hoQM1K5J8j27Mk01J82R0O0q8M4r1r0K54l42K13j69J3K81j49Q6o2J8J21Lj56
$$ y = [10, 5, -283, 47, 104, 149, 62, -128, -60, -81, 14, -73, -93, -5, 117, -136, 97, -40, 71, 82, 12, 110, -285, -50, -17, -122, -158, -51, -135, -94, 21, -135, 141, 105, -21, -57, 44, -102, -29, -41, 49, 130, 48, 86, -272, 1, -117, -49, -54, -194, 29, -309, -57, -55, -112, -75, -63, 1, 58, 71, 115, 52, -29, 135, -103, -4, -206, -104, -253, -29, -120, -38, 83, 60, -130, 13, 6, -31, -67, -149, -8, 14, 158, -62, -98, -93, 58, -115, 151, 159, 86, 51, 72, -174, 8, 145, -39, -249, -220, 114, -60, 94, -164, -95, 148, -187, 62, 187, -71, -9, 130, -226, -61, -172, -92, 13, 195, 57, -28, -10, 109, 175, 133, 123, -8, 43, -174, -346, 159, -73, -89, 101, 63, -148, -269, -31, -7, -205, 37, -100, -162, -48, 22, -126, -67, 276, 44, -17, 33, -66, 125, -45, -44, -19, 7, -129, 127, -95, 29, 149, 86, 180, 54, 125, 6, 25, 83, 19, -162, -8, -14, -6, 35, 60, 78, -49, -45, -246, -64, 26, 86, -2, 42, -49, -139, 115, -227, -14, -183, -170, 111, -38, 48, -14, 4, 125, 128, -28]
6630b8q9K75l28J58o7J0J54n5j08K34k52M0J39k29K66k17M8j35M00j60j05J25
6652G6N2j92J15J5j2J54j20k20K33L8j15K45m22K41j24l5J61k90J15K6J81k9J4
6675A07Q3l48J59J15k52L4J47p3j37J07r1j67P7L54J6j22Nk20J28L9n0J85j8K2
6699A00R3l31K20R7m3j19j04L55l43J7r7K78p3j07j5K00m07K47R5k53J89R1k40
6722a50J03J12q2J7k0J27P3l21M26n36J49J35j85J76J76j09n3R2r9j57K76m4J12
6745B18k58j27L9Q3N7j85J89k3l0L2k2J67j62j2J22l59J75k7K7q7J42K79n12K56
6769a8j38K15k26K00m09K18P9J79k8j32rm9q6L08l7J80k21L5j45j81K52oQ4o8
6793cp6pJ34l8J16p0J5M5j71J29o4ln3K16r6nO8k08m4n5J98J71j33K94l38j55
$$ y = [-28, -117, 158, -170, -12, -79, -69, 85, 30, -78, 156, -96, -56, 83, -146, 120, -97, -49, -184, 216, 56, -49, 76, 128, -64, 51, 66, 54, 208, 88, -132, 101, 139, 24, 269, -153, 88, -36, -71, 90, -200, -85, -59, 122, 93, 107, 190, -158, 1, 116, -136, -102, 45, -28, -165, -58, -149, -316, -239, 115, 131, 9, 14, -206, -78, -39, -89, 96, 78, 100, 193, -138, 82, 179, 136, 17, -87, 268, -75, -58, -155, 123, 50, -57, -72, 128, -279, -32, 63, -190, -1, 90, -150, -47, 65, -17, 0, -20, 107, 180, -141, 285, -251, -102, 33, -152, 24, 200, 91, 38, 130, 31, -126, 150, 106, 218, -40, -167, -128, -45, 12, -173, 16, -7, -37, -5, -27, 140, -22, -34, 88, -271, -96, -123, -96, -183, -41, 238, -274, -18, -156, 59, -167, 33, -376, -158, -79, 100, 72, -60, -69, -118, -204, 104, 67, 247, 26, 61, -84, -265, -13, -19, 65, -3, -79, -86, 48, 10, 126, 56, 71, 116, -55, 74, 10, 7, -46, 170, 74, 69, 137, -71, -115, -170, 28, 199, 66, 360, 22, -133]
6819a33K24q7J6j19J60o9k34J16J38M9k35J43K21r9L1j01P3j97L2O4j46L75j65
6842E7J1k04J40k03K64J18l34J69M2L2p0m9O8k71K96j96K29k08J52mK6j05J18
6865G8k40J91j70R2M7n7J74J33l63m4J11QRK44Nj58j52J64Qj67K8J41k12L32j08
6890I4j25J47k39J89K4k6M3j00Pj51K70k02J33k75K65j23k4K09j09K43l40J71
6912H1k28K25k9m0j70J41J94j86j16J63m5L0K0rM9q3j56j41L44k97L19j81K2J04
6936A1J51m56M37m5k17L06j29O6p4o4n1k2K7J29P1n8K8j37j47K97m13J58J93j82
6960a21lP1o3J64jj90J24Q0m2o3r4j78L68k2j41p4K24j37P1J87k75N5J61k30L94
6985B65k27O9k34J44J28j86J36j06Q5k17J6J62j08K27k07oj49J03K24l09J56j86
$$ y = [-133, 91, 4, 20, -99, 61, -8, -242, -126, 12, 61, -174, -31, 190, 91, 122, 21, 94, -103, -71, -7, -153, 222, 57, 68, -136, 4, -199, 65, 183, -151, 18, 60, 92, 22, -27, 41, -230, 66, -130, 99, -109, 43, 39, 65, -40, 78, -162, 29, -141, -49, -2, -59, 115, 248, -115, -159, -48, -40, -31, 213, 218, 60, -92, 72, 80, -87, -59, 82, -130, 202, 94, -31, 116, -123, 66, 90, 64, 107, 7, 14, -137, 133, -69, 64, -211, 54, -69, -93, 116, 7, 250, -90, 81, -147, 78, 49, 9, -161, -20, 174, -12, -128, 35, -10, 20, 40, 31, 80, -3, -159, -300, 44, -253, 66, -115, -93, 11, 162, -294, 143, 98, -119, 187, 58, 124, 50, -14, -65, -87, -60, 69, 140, 82, 110, -27, -174, 123, -290, -132, 61, -121, -124, -53, -116, 48, 47, -143, -19, 61, 19, -44, -138, -316, 52, 30, -111, -185, 39, -98, -27, 160, -115, -60, 101, -129, 265, 38, 107, -127, 17, 145, -41, 95, -11, 74, -143, -127, 35, -73, 154, -53, -59, -208, -105, 119, -190, -34, -220]
7007b20J83j79K57J58k57j55N2K26P9j9j11J60k05q3L43k2k13J9p6Q1MJ38j52
7030HO6m2n5J13j3j34M9m8k4J96j59j88L81Nk84P1p5P8Q4J40j53m0J48l17J60
7055c3j0Kj20K68j70J21k67J72j34Q2j7K01Q0q6J36j99k9jk3J7k44J38q6p9K95
7080A4r6Q5n0J12k01J3oL06r6r1j78L06p8j60L79k15J6j84j87L50J26k26p2K11
7104G8M9j35J94j05J6j69m9k3P2J28l7q0L7K1k7r7K0J17j45P7k1N3l1k2j21r3
7130b93M64k66Q2N2J8l7J16j69j16K50K24j56j60j00n1m7J42k3j23m7J74K8j37
7153a75J34N4j83L46Jk65m7K9l5J1K18k53K92l92L01j09P6j03K2j8M3LpJ02N5
7178A00j94J47j40r6J65p3M2P0J17n6jr8J35l51M91k99j2j29j33L73J93j35k32
$$ y = [-220, -37, -216, 41, 199, -58, -213, -161, 65, 144, 125, 14, 174, -31, -114, 229, 207, -6, 13, -63, 18, 22, 160, 8, 74, 32, -23, 90, 77, -57, -8, -56, -80, 116, -43, -231, 150, 155, -129, -58, -133, -55, 29, 169, 16, -24, 124, -193, -33, -43, -41, -161, 107, -63, 58, -209, -37, -171, -89, -106, 95, 175, 89, 225, 26, -3, -4, -27, -10, -254, -116, -202, -281, 14, -82, 3, -47, 65, -136, -123, -129, 177, 81, -10, -188, 118, 40, -120, 259, 44, 60, -124, -311, 39, 165, -61, -133, 78, 127, -8, 186, 81, 97, -72, -121, -144, -72, 56, 19, -61, -24, -3, -30, -127, -107, 10, -135, -58, -79, -26, -57, -79, -200, -293, 171, -95, -13, 39, 57, 20, 136, -33, -149, 101, 325, 169, 9, -91, -142, -189, -47, -70, -193, -240, -66, -38, -175, -41, 13, -170, 176, 177, -88, -135, -106, -141, -130, 88, -165, 127, -265, 36, -73, 3, -100, -78, -96, -53, -50, -57, 45, 100, -94, 53, -87, -183, -18, -91, -49, 21, 138, 82, 81, -17, 118, -233, 258, -41, -53, -182, -315, 58, 251, 116, -116]
7201a16j62L41j03M1J3J81l9N5n5l00R9J23k07J22K32m74L35J4j00o1J52j8k60
7224a87K50j45K4M2m2p5j07K00N7P4O2j23o1n2J91j11N5n7K61p9j83J96q4l4J22
7249A94j47j8q8J14o3J6J37k68J15m3j2j68N5J83q4L0L40l84K9o1L05n9p0j06
7273e3k17M27m6q8N2k47J12K01k13j58J78j60n1L60m3j16J29O1l09L43l80K96
7295G8m2l16L72J92l47j1k05L41l6J21k75K11J74l25L79m80J89k02N4j56Q3J91
7317a0p6p6J36j7P6j85k2K24J3j03J52k72R2O5j53J10J6J06N0k08J36J15M8j68
7341D9q0K43k16K80l21O5k04K00k4J55j85R1j8R3N3k18k3P9R6m4K0M2k59J21r8
7366a03N2J34l27M65m42L89k72L9J65j74oM5J6j21j51L34j71J60j8r7l9K47j53
$$ y = [-116, -278, 63, -40, 1, 14, 195, 156, 211, 156, -144, -45, 78, -129, -7, 225, -249, 86, 100, 0, -61, 91, 73, -187, 63, -82, -58, -16, -58, -133, -240, -40, 17, 91, 153, 30, -31, -83, 108, -3, 52, -5, 256, 177, -6, 190, 106, 72, 194, 47, 29, -59, 55, -8, 8, 145, -123, -8, -51, -63, -231, -176, 7, -77, -47, 293, -91, -62, -123, 182, 123, 53, -53, -270, 157, 111, 23, 75, -172, -60, 141, -72, -230, -52, -212, -263, 97, 54, -62, 67, 128, -181, 162, -218, 78, 36, -280, 92, 284, -63, -74, -279, 62, 26, 147, -128, 83, 257, -68, 311, -169, 20, -182, -128, -284, -201, -10, -86, -162, -26, -43, 33, -152, -174, 50, 63, -40, 112, -160, -68, -3, -156, -46, -30, 76, 126, -82, 54, 169, 217, 49, -31, 212, -4, 276, -45, 20, -184, 16, -8, 147, -38, 53, 35, 128, 181, -37, -60, 19, 115, 71, 91, 133, -126, -5, -103, -51, 83, -244, 221, -221, 168, -104, -65, 100, -74, -80, -35, -19, -140, -291, 43, -128, 32, 14, -83, -122, 125, -28]
7389b8K66k00o3J78k17O6j0J59m8j47P8L3R3q2o2J98j66j60j2P6l7R6o5j30K06
7414B2K2O6r4o8O1j20nk99M34j07M4k2Q2J54k87j1J9o2R5r6K93j60k2M8n7J41
7440G1k88J18k0k7J87l1p7K39j42MO0qq4j5L4m9N5n0j3M0J09j27%L4k87J70M3
7467e4J21M9j78J39o2R8k03K74j87J21j52JJ24L3J4j66J20j21M8k0m1l4j04J89
7491Ij34L05l26K57n7J24n4m64M98k92k2K50Q9j63j44J77q0J38j11k16K04J37
7513A25j74j5oo0J06N0m2j37J26L05m98K40O3j90J02J33l10J22j4J87k24j82K31
7536f2Oq9K02k11L0J05l6K9L6MK6l0l9m4JJ10M6j76K4J14j27q0O7J99j60Q7j69
7563a37O8O1o0Q5j85K24l1r7K85k08J95k4m09J87j77L20j03j88K37N3k92J13J84
$$ y = [-28, 238, 38, -25, 153, -64, 2, -8, 151, 103, -44, 34, 67, 160, 78, 16, 214, 48, -112, -124, -48, -85, 11, -54, -184, 22, 44, 110, 16, -52, 9, -111, -116, -415, 19, -88, -44, -66, 16, 170, -117, -128, -109, -171, -76, -172, 121, -39, -61, -13, -70, 71, -217, -99, -119, -146, 41, 10, -67, 172, 30, 34, 94, 86, 2, -13, 21, -28, 27, -23, -36, 4, 113, -14, -14, 20, -267, -97, -54, 67, 116, -62, 77, 15, 113, -90, 184, -3, 118, -34, -33, 91, 124, 138, -28, 92, -29, 19, -1, -42, -76, -180, 9, -125, 180, -146, 111, 54, 178, 124, -340, 158, -134, -156, 94, 183, 20, -124, 53, -27, 111, 0, -216, -12, 125, -49, -64, -70, -130, -24, 26, -16, -153, -27, 278, -220, 20, 83, -107, -5, 128, -182, -60, -74, 113, -111, -293, -62, -56, -145, 57, -154, -124, -19, -55, -26, 10, 14, 40, 10, -29, -73, -72, 38, 84, -92, -68, 46, -81, -161, -94, 105, -55, 32, -137, -69, -8, -68, 17, -168, 56, 25, -72, 213, 5, 200, 176, -233, -46, -223, 97, -6, -194, 43, 96, -196, -83, 101]
7586A01r7J1k16K28mP8j32K9O6l1M1j1k6nQ2l25K90q8o4Q0j42R4J5j0P8j85K63
7613A20J17k79L03k07l9j04O8L3j19Q7j08J86L09n54M5K38q8j29M6J41j89K47
7635A24J09j74r9J8J36q2R1k09l9J10N0o4J3J30k12j82L33N0j31J79L0r4q6q1
7659h0R3k14J99J19j98N9J50j51L2K8m1N3J2N5l1J7J06l44M9K02m9j10N3J10l0
7684H9j30N1R9j19L30j61q1k24K02j53j27R5N6K74m27M55k21J43j82J93j91n7
7706h6J61p6n0J23p5l6N0L5k23J50K29l78K57j15j20K41Q2p1l1K4k02J96J79m74
7730b10J2J39j11J10j42K68l0K14l02n5K40o8J0q9M7j61N3R3J45k90PJ93k4M9
7754I8k14L9K62o1l36K96J9r0J54j48n2N0R0k46L49k93J17k7j65K43j38J14Jj95
$$ y = [101, 4, 15, -201, 27, 23, 101, -31, -2, 64, 33, 74, 63, 37, 32, 114, -211, 79, -9, -73, 7, -135, -41, -26, -36, 42, -143, 120, 237, -42, 261, 54, 15, -89, -21, 12, -107, -20, -128, 58, 367, -187, -142, 96, 8, -121, -75, 66, -123, 124, 233, 59, -40, -22, 114, 32, 123, -86, -125, -15, 35, -29, -16, 114, -98, -280, 53, 103, -28, 151, 181, 87, 1, -80, 13, -201, -2, 117, -81, -22, 128, -23, 9, 37, -4, 49, 61, 116, 85, 102, 208, -136, -87, 115, 66, -44, 9, 119, 89, -41, 10, 109, -10, 320, 159, 78, -146, 56, -97, -224, -129, -73, 201, -226, 229, 8, 151, -31, 162, -29, -86, 75, -1, -51, 72, -3, -39, 11, 46, -177, -27, 202, -176, 81, -34, -154, 87, 169, 98, 67, 91, -111, 85, 264, -210, -198, -59, -170, -60, -202, 66, 36, 250, -52, -107, 133, 65, 75, -14, 33, -128, -75, 18, 163, -127, -120, 73, 49, 98, -116, -77, 185, 124, -212, 84, 103, 13, 167, 19, -33, 17, 107, -139, 210, -83, 34, 7, -158, 85, -53, 61, 62, -133]
7778a33L29k54R2r4L2NK08l46M98l67o2J74l07K97j49J21N9O1p9j33N6J93j65
7801C6rj45j70L21j34o5K52N2j86j02J74n5k4j6L60l95R0K7k05J19j5J84k16p7
7825a99q4K19j06q9K10N0k56K96L0p1q1J4K74j41k52P8kL79j58k48K54J73k06
7848H4k16M4m5N2J07K5P1k64J67K5J30m24L33k79K34k0l9q2k87L15K39l57K80
7871I3p9k25K79l00J73L7j72J24J23oL4m0k3K19k81J67M6k74p1l5M11k30l2K4
7895c8J28l3P0k76K31N3l2k47R2J87k59J06P5j50P7K91n65K26j48K33r3k6J55
7918E7k7j10J88j01M4r3l3P9K34j58j22J40J3k50J09J14q1p9%J82j23J12k02K01
7942I4k77J61J1Q0j60L3k08K93Pr7Q8m0M1m4N3k1j0o5j08J13nQ0r8J56lP9k79
$$ y = [-133, 196, -58, 34, -60, -28, -23, 185, -161, 337, -30, -92, 82, -225, 72, -77, 44, 103, 164, 85, -48, 8, 201, 36, 27, -118, -288, 33, -101, -166, 86, 138, -48, -150, 24, -31, -55, -71, 289, -106, -16, 11, -194, -75, -90, 94, -122, -199, -283, -64, -170, -259, -49, 1, -255, 41, 71, 0, -81, -67, 207, 66, -186, -108, -110, 269, 111, -137, 117, 290, 84, -132, -88, -133, -81, 26, 51, 122, -142, 25, 50, 180, -244, 89, -190, 44, 24, -15, -97, -384, -69, 170, -187, 93, 14, -211, 68, -232, -59, -22, -194, -70, 53, 47, 81, 41, 18, 237, -44, 123, 169, -105, -176, -211, 200, -30, -62, -38, 90, 57, 127, -149, 82, 135, 103, -144, -52, 135, -124, -18, 57, -93, -16, 275, -290, -64, -212, 21, -72, -98, 57, 30, -80, 108, 7, 51, -42, -75, 4, 238, 80, -42, 98, 111, -139, -30, 84, 3, -76, -76, 106, -17, 95, -107, 94, -183, -22, -11, 69, -91, -58, -266, 27, 34, -63, 25, -15, 26, -18, 35, 14, 4, -61, -169, -56, -61, 19, -79, 77, 74, 153, -126]
7969a26K0O4J77k82J05J66k01Q9nj91L1n8K00k03K16k69J20K99k55J11j42K51
7991A17J37j94J7j08K8R8k6o8j75J50K40j80k12L84n4N0k43J4k00K05K66q2l17
8014a53R7o8MQ7J15L3j35j22O0J5J03j2j51Q0K26n7j76J31J04j0k55Q6L8j03R1
8039B8j30L22m85L24j62J4K92l31Q9J30l55K5J59J62k3l11L15J02k10N8p7N4R
8062aJ09j61k64M44q0r5J34j44j82K41n7k81L08K11j88oR4m2P7l42J40K40l20
8085a65K46K8j85Jn7O6J34k54P8P9K80k23J11K1l55R0J70J7k5p7Jk74K01R9R8
8110A05l15J26j46L41j42jj78J40K5L7J35l07P6J67M9r8j47R7L20l76J9N3J60
8133A40k09l6P2J14o1l3p2j34L76m80L39q7J77q0M1j56P1J30j83K63l02K76l52
$$ y = [-126, -106, -42, 135, -147, -42, 124, -77, 12, 7, -184, -153, -211, -11, -214, 2, -267, -147, 152, -103, 8, -134, 117, 254, 60, 77, -31, -3, 95, 69, 1, -174, -24, 216, 36, -176, 208, 154, 204, -39, -25, -225, -20, 246, 164, -153, -56, -124, -120, -33, 82, 115, -20, -142, -82, -67, 36, 24, -127, -47, 179, 122, -54, 77, 181, 171, -84, 2, 40, -63, 28, -102, 220, -265, 59, -103, -89, 203, -128, -39, 91, -264, -239, -80, 82, 59, -252, 63, 165, -45, 13, -64, -10, -1, 108, -53, -317, 127, 47, -48, 86, -58, -240, 1, -56, -337, -29, 182, -6, -12, 82, 40, 117, -225, -85, 155, -165, 81, 109, -76, -75, -132, -66, 68, -186, -108, -29, 251, 28, 139, 160, -195, -105, 65, 82, 57, -20, -19, -293, -92, 7, 105, -210, -84, -230, 111, -31, -32, -210, -70, -45, -8, 127, -180, -104, 63, 112, 14, -133, -36, 284, -92, -73, -20, 140, -69, -105, -33, 81, 20, -13, -85, -219, 157, -323, 16, -71, 106, 26, 67, -89, -18, 112, -71, 192, -110, 166, -186]
8156a86L02j07m9M5p4J03n9O8j34q4L4J32M2p8J04k64L99k14J97l05j4P9J03j15
8180g5J2Ml8L4j57L91k16J46k70L07k73
$$ y = [-186, 116, 9, -40, 5, -69, 34, -25, 43, -91, -175, -141, -9, 33, -45, 59, -205, 194, -20, 177, -128, -142, -63, 40, -75, -63, -59, -97, -63, -220, 171, -45, 101, -169, 138, -135]
8191a35
$$ Imaginary data points
##PAGE= N=2
##DATA TABLE= (X++(I..I)), XYDATA
0@%%%%%%%%%%%%%Qj6J6j6K4l2L7m5N6o5P4r0J06j28J52j76K05k36K70l09L51l96
35b10M49n09N74o46P24q07Q98j001J113j234J367j511J670j844K031k236K463
52A291k712K986l290L627m004M429m909N460o099O849p744Q835j0200J1967j4376
67g890J7912k3998N6859j39252J75160p4255m0271J15915j25746Q2850m6910L5824
79B6198m0869O2660q8103N2863L1551j08692J43645j31272N5494L6183r1751J03133
91E1040q1859K4478J5458o015j8124J8834J220m2165P9259p8376L1607K3585p1908
104e2966J04447q0636J1113N1260q0148P0410k1865k8033L6849j7991l798K3774
116A2416j7574k1335O0539o5594L5068J9300p4871R6347o8222J9812K6808o3720
$$ y = [0, 0, 0, 0, 0, 0, 0, 0, 0, 0, 0, 0, 0, 0, 8, -8, 8, -8, 16, -16, 21, -24, 32, -33, 41, -49, 57, -71, 81, -95, 110, -126, 144, -165, 186, -210, 239, -270, 304, -342, 382, -425, 473, -528, 585, -649, 718, -793, 877, -967, 1064, -1172, 1291, -1421, 1565, -1725, 1902, -2102, 2327, -2582, 2878, -3221, 3628, -4116, 4719, -5481, 6486, -7890, 10022, -13976, 42883, -96369, 78791, 4536, -35735, 80180, -45566, 37284, -9626, 26198, -14671, 47989, -40114, 12749, 44300, -64392, 79253, -52019, 3475, 39658, -52093, 51040, -30819, -6341, 9117, 3102, -15022, 3812, 5032, -37133, 42126, -36250, -4643, 18942, -52966, 51481, -29155, -18042, 33218, -46930, 23480, 1615, -26418, 10431, -7560, -11358, 12416, -5158, -26493, 34046, -31548, 3520, 22820, -52051, 44296, -23926, -4114, 22694, -41026]
128d1026O6836l8454J1302J936l155n954Q919J6192n0277O7613o0371K6782K5881
141B6224p0316Q1359o1729K5279J5254l6580L0517j5987J2601j7789L2244m4086
153b3009L2247L272m4516P5781q0957N0111k96m2194O1391n3781K7917j226r252
166d512M450J690l727p188K9169m3810L7723j4203j9210M7969n2289L1584j428
179F218k5383L6390k7804R649M658p220K145M118j568j3112L2004l8013K6373
192H455J865l6551N8383n5486L2352J110k9752M1198l4755K2215j2041J0191j2724
205e540J1050J608k4521M6892n7173M7447j7665j9367M6285n4951M4418k2380
217c897L042O678j0174J1112j5749K5910l5613L5188k0586n990L2893m9130M6043
$$ y = [-41026, 25810, -12644, -1342, 594, -2561, -8515, 404, 16596, -33681, 33932, -26439, 343, 26224, -44092, 37267, -24462, 817, 16071, -20509, 10008, -5979, 6622, -11167, 21077, -23009, 9238, 12510, -32006, 43775, -37182, 12929, 12633, -29561, 31830, -21951, 5966, 4740, -4512, -62, 1628, -2099, -9287, 19882, -23928, 13795, -408, -19618, 28351, -23938, 7646, 6218, -19165, 17225, -10579, -930, 3728, -3492, -1347, 2771, 1203, -11909, 20095, -17918, 8455, 10320, -26231, 32152, -23334, 9018, 10128, -19624, 21574, -13181, 9034, -3007, 7184, -5540, 5510, 7118, -17403, 29489, -27684, 19763, 2098, -17269, 29016, -25935, 18483, -3897, -855, 5823, -4351, 6761, -8988, 16922, -18691, 16497, -4089, -10079, 22814, -26316, 19727]
230A9727k5785k64J9504k6852K0726r843M112m852R091j1210L225J1903k6272
243a6790L1248k2114J131J9953l1884K8606j2144p013J9198j9741J0443J61m861
256c807L000K456m671j028J1817k0950K1660r167j0612K8489l5249K7600q576
269I62j0929K3828k5437J9288j1495O799n698N574N17j3342K8351l8299L5768
282A5887j8638n811K9644m2246L9696k6551R917L521j0268J3265j7450K3146k9068
295a4956L0020k1014K243K0425l9222M4531l5219J6128M949j8907K2312j9796
307h506J4923j2745J2912j1905N159O479k0915L0158k9172J6795J757j8054K4540
320A1426k0561J0043J083o819O389l308J023l277P803j0206P253K289j4135K1136
$$ y = [19727, -6058, -6322, 13182, -13670, 7056, -2787, 1325, -3527, 5564, -5646, -2421, 9482, -16790, 14458, -7656, -6525, 13428, -18456, 10150, -1994, -9007, 10191, -9550, 893, 1054, -3807, -807, 1649, -3022, -4050, 7767, -13183, 8477, -690, -11302, 17187, -18062, 9538, 962, -9967, 13861, -11576, 7712, -3783, 3016, -2682, 2892, 3409, -9933, 18418, -19881, 15887, -2751, -8562, 21082, -21164, 18532, -8019, 1898, 5419, -4849, 8416, -9034, 14112, -14956, 15064, -5950, -3707, 16718, -22504, 22027, -13192, 2936, 7885, -11022, 11290, -8506, 6417, -6328, 6584, -5321, -162, 6317, -14598, 15560, -13612, 3183, 4940, -13114, 11426, -9135, 908, 1991, -4828, 1561, -1747, -724, -4001, 3802, -6404, 849, 3138, -10997, 10139]
334A0139j8940P968P803j9639K2954j7078N784M818r496R398o579N825q749J2633
348F841j2767O385O712k0519K8750k6671J4508K397j5773K2307k0433J2874o020
361a409K655j682O72M180j2583K0660k3300J7257l458j1903K3299k5594J8054
374F848o586l837R004q306N201m816P424j0852J1465o316l771J4261k0372J7439
388F786p365m971J3759j4798Q437o29n539O355k424k218L551m78n331P836l996
403a025l990J1882j4707R669J168j2422J8644j6710Q557J690q993J0939r125P150
417B727o121P757r201O733J622j2776K3600k6443J8974m894r733J9514k1538J7270
431G491j0589N718l141J213K331q612J7312k3123K2155j4073n02J5471k4058K3725
$$ y = [10139, -8801, -833, 6970, -12669, 10285, -6793, -1009, 3809, -5687, 3711, -2868, 2957, -5792, 6841, -5926, 459, 7171, -13348, 15402, -11269, 3239, 5636, -10137, 12170, -8263, 4611, -1409, 1246, -436, 236, 4416, -8167, 12493, -10807, 6450, 2992, -8911, 14388, -11206, 6848, 262, -3575, 5429, -2877, 2324, -2492, 4932, -5920, 5545, -771, -4542, 9719, -10653, 6786, -579, -5550, 8209, -6589, 1848, 1219, -4320, 2035, -389, -2607, 944, 466, -4865, 2971, -1025, -5015, 6867, -7840, 1829, 2997, -9425, 9219, -7491, 1066, 2756, -6237, 4702, -4423, 2727, -3394, 4363, -4838, 1895, 3517, -9259, 14341, -12102, 6872, 1978, -7755, 11759, -9779, 7491, -3098, 2620, -521, 692, 3023, -5589, 11723, -11400, 10755, -3318, -3820, 11651, -12407, 11318]
445A1318j6376N576K803n492N108n359P646j1699J4344j3050N594N412j4586J8672
459I911j5667N992L748r023R093m565j331K917m3l478N181l389k798Q415r138
474d175L938L808j0322J1608o063k872R609j3301J0759k352m856P267n992K134
488h10M52K424o284P923o312M6R102j6309J7287j0772Q27R196j3819J2248p998
503b799M413j499J223j970m58O652j2759J6861j5118N822O266j4896J7728j4458
517d992O954O31m606M760l762K958n350J0020j1677P279l35q452J5946j6453R905
532B826j357o937J1041q524K778N55j173j22K619l119j131N911q033P202k511
547B5n894J0831r242M655J847q359R216n356J489J878l399J180Q13J024m900Q284
$$ y = [11318, -5058, 518, 3321, -2171, 2937, -2422, 5224, -6475, 7869, -5181, 413, 5825, -8761, 9911, -5756, 236, 3984, -5039, 4054, -511, -1842, 1075, 1032, -2446, 2735, -654, -3452, 4963, -4175, -237, 3571, -6751, 4857, -1206, -4078, 5531, -7770, 2989, 637, -4219, 3048, -2944, -810, -358, 2066, -4218, 3705, -2607, -2561, 6541, -9768, 7519, -3253, -2426, 6770, -7049, 5199, -2799, 1614, 115, 1338, -632, -1090, 5562, -7197, 9664, -5454, 368, 6634, -8262, 9466, -4992, 1962, 2593, -2013, 2747, -1015, 1943, -3407, 6613, -5064, 2215, 1880, -6572, 9374, -7079, 2826, 1469, -5468, 5573, -2951, -173, 382, -791, -913, 1706, -1413, -2544, 3367, -4666, 2536, 25, -5869, 4962, -4280, 375, 2222, -6137, 3079, -2277, -788, 1090, -2309, -1129, -316, 708, -4192, 4092]
563D092r803O545K203j0824J4737j4441R579q8o882Q879q557O589l673M100n830
578c374M949q32n156J2676j6871J4290o311k321R761j2958J0521n846L346j622
592B52R86j552r46O453j0058J0790q849K313N590r586R280o355J027K766k410
607b99m61K325k145r9M267p270N294j454k488N616n065K23L517m762L477R87n924
624d261P530n278J401K870n791N006k247R22j131K116l644L120J144o127R744
639E374j0705P522j199m516P896q675O906m073L091l126K050R54m639R281j2515
654f374J1304o187o46P715j1722J1153p267L348q6j524J166k127N151p851Q946
669D999p566L719K377p697R931q957N007m26k486K857k227J594j884L363m410
$$ y = [4092, -5711, 834, 3037, -7787, 6950, -7491, 2088, 2000, -4882, 3997, -4560, 2029, -1644, 2456, -3374, 1575, 743, -4413, 8263, -8608, 5682, -629, -2950, 6811, -6147, 4374, -1472, 1874, 252, 1238, -314, -1260, 5193, -4865, 5925, -2924, -611, 4979, -4607, 4673, -1682, -655, 2111, -299, -760, 1565, -580, -679, 3588, -3682, 1612, 158, -2330, 3286, -1779, -1556, 1961, -2801, 676, 1663, -4261, 3269, -2009, -608, 2262, -3529, 1477, -770, 152, -979, 1137, -2507, 613, 1757, -4370, 5374, -5331, 2191, 992, -3524, 4372, -4303, 2603, -1470, 1621, -1505, 545, 1499, -3140, 6141, -6374, 4930, -1257, -1903, 5812, -5910, 5243, -2024, 1324, 1238, -286, 880, -1247, 3904, -3947, 4999, -2567, 1152, 3529, -4168, 5763, -3194, 1813, 1387, -1099, 1758, -469, 1125, -759, 2604, -1806]
684a806L288j001k600N390n721K864J116l829M090k286q28L039l714K464j57j918
700a609J930l11q77M81J625m567N460l861K27M471p894Q436n831J569K293m398
716b856M572l816L355l366L608k725P16K891p065R582q559M638M37m509O324n753
732b526M221k720K098j763J035J244l997O430p507N918j903k664N948o468M325
747A671j287o89J243j099J11K09J031k565L169k331J90K286l753K785n48k088
763a665L581l016O96J683l552L408j665L68M07q68M90o15J904l501M555m255J917
780a28J962n779P391o547L931n23k162L585m104M257m569M816m495L074M06m643
796c528Q395r629P600l644o84M211n977O161n202M331l614K930j128j597N223
$$ y = [-1806, 1482, 481, -2119, 3271, -2450, 414, 1530, -2299, 1791, -495, -1323, 1716, -1998, 466, 309, -1609, 321, 10, -867, -386, 1239, -3328, 2132, -1729, -1502, 2969, -4925, 3511, -2320, -751, 1542, -2856, 1716, -2100, 1255, -2111, 1497, -1228, -512, 2379, -4686, 4896, -3663, 975, 1412, -3097, 3227, -2526, 1695, -1025, 1073, -690, 345, 1589, -2408, 4022, -3485, 2433, 530, -2134, 3814, -2654, 1671, 384, -305, 938, -161, -50, 159, 1190, -1375, 1794, -537, -347, 1939, -1814, 971, 423, -1665, 1916, -1100, -404, 1279, -2273, 1135, -530, -162, 245, -623, -133, -748, 1156, -2345, 2210, -2045, -128, 1834, -3945, 3446, -3101, 830, 307, -1855, 1730, -2374, 1883, -2686, 2130, -2365, 709, 1115, -3528, 4867, -4762, 2838, -806, -1490, 2721, -3256, 2905, -2297, 2034, -1580, 1350, 222, -1375, 3848]
811C848q012Q516o388K507J769m511N596n019L368k155J478j343Q65R59l229M788
827C037n345M085j292j639L102l239J654K19o71k03J549k276J784m99j649K722
843A339k990J925l48m87j15J149j722J459K61k823M469m834L263p18j246L043
859A625l486K543j899J671k047K016n77j946M651n872N768l702L27K861m513M596
875B016l702K661j697J137q43n08K856m569N538m589K192J006l468M721m432K800
891A119o53o73Q24p19P88j342K507l028K248o36j373L104l384K186n01j608K290
908A149j190M4R85j450N04L70o52n7O37p82M39R25k528K802k112L28K035l618
926b171L840l145J411K01j182J527j633K076k836L226l042J495J461l956N416
$$ y = [3848, -4164, 4352, -2036, 471, 2240, -2271, 3325, -1694, 1674, -481, 997, -346, 519, 1478, -1751, 3037, -2308, 1777, 485, -1154, 1948, -1291, 363, 582, -89, -292, 1257, -1019, 765, 266, -1383, 1339, -1651, 274, -74, -561, -676, 473, -1249, 210, 471, -2352, 2117, -2717, 546, -172, -1418, 1625, -1861, 682, -1217, 454, -1593, 423, -154, -2100, 2551, -3321, 2447, -1255, -928, 1933, -2580, 2016, -1686, 975, -722, 415, -428, -936, 1920, -2649, 2889, -1700, 492, 1498, -1970, 2751, -1681, 1119, 466, -207, 617, -102, 686, -656, 1851, -1177, 1071, 435, -938, 2166, -1218, 968, 467, -1141, 1149, -41, 3, 988, -462, 42, 412, -240, -297, 340, -442, -3, 922, -1606, 1196, -916, -588, 1447, -2171, 1669, -1476, -65, 136, -1046, 481, -1152, 924, -1912, 1314, -1728, -233, 1228, -2728, 2688]
941B688n651M095j269j195K816l461L211k686K710k809K338o34j344L698n101
956b594M856l040N01J899l016K968k360K015j856J596j453M75J233k450L318l251
972a159K107l11j138J730j333K00M18j96o66J608k243J655K95j858J772j584J038
989C35k29K11r98J491j574M95J250k916L922l652K086j71j257J675j817K242k505
1006a412K431k354J604L64k446L976n001M546k493K5J572k605L241k957K902k702
1022a309J943j021k47K842m895N054m379K753j0k200L248l307K689j909K010j477
1038b15O74J95j654L065l768L088j325k20J579k408J862r58M81k92P62j174L68
1055F0Q38j583K069j915P86J22n22M91j92n54O13Kj013J833k433J844k67r98J338
$$ y = [2688, -2963, 1132, -137, -1332, 1484, -1977, 1234, -1452, 1258, -1551, 787, 153, -1191, 2507, -2594, 2262, -778, -277, 1622, -1394, 1574, -786, 1229, -627, 969, -484, -9, 1224, -1226, 2092, -1159, 948, 637, -501, 1229, -104, 96, 514, 318, -348, 1260, -983, 672, 967, -891, 881, -703, 335, 106, 317, -681, 810, -764, -269, 981, -1935, 1987, -1665, 421, 250, -1007, 668, -1149, 1093, -1412, 1019, -1335, 269, 633, -1813, 2163, -2838, 1708, -785, -760, 812, -1793, 1448, -1509, 1393, -1309, 634, -387, -634, 2208, -2687, 2367, -2012, 741, 731, -1469, 1779, -1528, 1161, -748, 1262, -215, 459, 654, -1000, 2065, -1703, 1385, 60, -160, 1419, -989, 873, -85, 396, 104, 866, -308, 60, 898, -685, 1384, -531, 255, 377, -145, 346, 154, -400, 213, 215, -798, 1035, -1398, 446, 179, -819, 519]
1074E19j423J014m58R09j774J501q27j96J696k742L069k532J132N07j465J406
1090C36j132J412j489J386j134P60L31j574K373k509J842o37n11J213j400R74
1106B41m72J002j038P48q48L89R82k155K089j330N88N31r82O09j58l23L84K83
1124E40j154J508j389O91J26l55L87l69J83l53Q62j337J551p64m05J535k513K508
1142A252j767O61L7o20Q90j221J633k362K773k459J241O85k305L166l381K814
1158A037j363j22R19j573J950k029K260k541K244r72p92K383l198L140k417J373
1174B99j53r05J446j604J858j988J764j523P03R54k052L079l026J871o78k45R07
1191G07j275J334r20O74j265J495q15lR30j636J982j602Q98l81j28P2J35O0o39
$$ y = [519, -904, 110, -348, 561, -1213, 288, -539, -735, 961, -1781, 1288, -1244, -112, 395, -1070, 336, -796, 616, -873, 513, -621, 139, 470, -1104, 1269, -1240, 602, -35, -546, 667, -733, 241, -231, 771, -267, 481, -367, 22, 1004, -1151, 938, -392, 196, 727, -255, 354, 196, -127, 257, 540, -614, 894, -495, 196, 322, -33, 354, -15, 168, -185, 677, -660, 891, 127, -278, 1257, -1256, 1252, -515, 146, 183, -437, 453, -768, 865, -1497, 1276, -1183, 58, 743, -1562, 1604, -1777, 1037, -326, -448, 471, -1102, 848, -1181, 1079, -1462, 782, -190, -982, 1401, -1797, 1343, -1074, 299, 146, -759, 687, -917, 941, -1047, 717, -806, -103, 851, -1201, 1878, -1148, 723, 45, -200, 707, -568, 766, -154, 520, -745, 750, -65, -68, 862, -774, 1208, -394, 504, 123, -5, 67, 202, 262, -377]
1210c77J187j555J307r31K56O41j071J006p52N98q86Q15p41P53j28p94J626k330
1228a376J821o21j07O61j075J100j076J149j447J415q38j08J101j948K545k043
1244h47R69m8o40P08p76Q67q55J316j267Q71k54o94J751k033J645j095K49L62
1262B29m84M42r2M39r68J160j257P74Q6o26R29r86R59n13m7j2L41m49L69N0o07
1283b63Q66n60J07R1k87L11p5o2m93Q32r52J073q82J02P75j303J355j280M83J78
1303A6k02J67j71K40q38J334j436J127n10k40J039j498J344q19M54r8l6R2l49
1322c84Q57j212J410j288Q82k62q62J478j251J181p37K74m06P10m0m44R23j786
1340i57K071j301M67K89r21J113j257J111j040R83p41K84n8o49J708k043J901
$$ y = [-377, 810, -745, 562, -369, -113, 528, -543, 463, -289, 309, -577, 238, -503, 250, 122, -672, 954, -1376, 445, -176, -283, 378, -697, 403, -673, 476, -971, 444, -394, -502, 599, -1349, 1196, -847, 122, 74, -566, 142, -634, 233, -622, 694, -573, 298, 44, -650, 1101, -932, 713, -382, -133, 229, -255, 187, 95, 534, -434, 726, -531, 243, 329, -297, 632, -354, 605, 92, 45, 33, 374, -75, 294, 344, -263, 603, 43, 150, 241, -46, 265, 190, 128, -365, 467, -485, 588, -294, -192, 583, -720, 635, -645, -162, 16, -186, -19, -190, 50, -788, 546, -890, 237, -273, -513, 526, -972, 372, -447, 7, -91, -127, -35, -384, 473, -739, 671, -617, 265, 3, -859, 619, -632, 549, -188, 86, -320, 390, 350, -94, 829, -957, 1114, -187, 280, 569, -352, 761, -496, 615, -425, 558, -183, 101, 43, -606, 1102, -941, 960]
1357I60j136M4M91o30Q21q06R05j358J303n88J37N11j445J834j950J543p21r8
1375a83M38o07Q21j177J523j490J193p18j98J098j699J584j419J057l73o1N68
1392C57o85P97j130J333j270O30K38q07J519j751J183p36M43J12p12P92m62O57
1410E08r15R72o11K02L74r51J075r13O67l36L72l82JJ53k98P49j293J006l75j1
1430fN23j096J136q29M31q9k19o5K07J46m10O78r33P50j66pL85j081O41k34N26
1451B88o12O57m54j3M74p92O84m92K50O2m72J61J23Oj16N85o24M31m14O5M76p50
1473d77O16k93K32j88L03p51O14o6j34O83r88J009o80K87l52p4M19l01M36o32
1493c37Q22p57L54K27o94J210j226Q38o54K16r3k02N12k62O95j134R99p24K51
$$ y = [960, -176, -132, 359, -271, 550, -256, 649, -709, 594, 6, 143, 654, -791, 1043, -907, 636, -85, -183, 255, -352, 469, -708, 815, -675, 518, -200, -398, 700, -999, 585, -834, 223, -150, -211, 357, -328, 469, -661, 672, -598, 32, 270, -537, 982, -769, 414, -322, 121, 233, -479, 313, -149, 508, -407, 565, -46, 156, 530, -421, 654, -259, 408, 72, 444, 62, 63, 216, -82, 667, -626, 380, 5, -6, 517, -579, 557, -272, 159, 70, -149, -214, -7, 139, -271, 407, -526, 224, 58, 51, 436, -645, -4, -238, 288, -324, 333, -121, -134, 340, -452, 232, -260, -10, 52, -420, -259, -136, -130, -246, 339, -285, 146, -268, -203, 273, -477, 139, -154, 78, -110, 193, -558, 56, -10, -144, 539, -449, 560, -120, 167, -185, -259, 160, -141, 295, -337, 485, -272, 82, 309, -385, 825, -401, 437, -217, -1, -94, -296, 216, -46, 649, -485, 514, -210, 41]
1512D1N55j086J137j112P41jl34L88l53L15n40P30r85P10l84j92Q82j054Q41q15
1532e16L12L09k41R1j53L81q11J105p79N69j55m27O06o34N94o50M07m69M06N9
1552Dj49M91j102J247r02N51J5m25M74p60P22l57O06o62L81J1n59J140j141J125
1572G10r75L07M92r23R40q51O82o47O42n34O9O16j047J232j224J117n78q3N91
1591E36q17Q47q25O70q15M87P8n14O36p72O55k21O9J99m60M53m12K82m67M45j41
1612h7L18om64K46l91N38K0k52N8l47K77Q0J29m30M39l10O5J64o3J97k85M8q6
1635a42L70l94K69K5l10L99n24L85o2J10l2j79K49l4j20k81M68o17M08L14n78
1656b76M66k71K47m12L17K55n37K58j62N02o45O64n44J48n5l00Q53p62M65j06
$$ y = [41, 596, -490, 647, -465, 276, 275, -59, 329, -24, 291, -249, 481, -504, 206, -178, -370, 512, -542, 299, -516, -204, 105, -136, -45, -198, 183, -628, 477, -302, 267, 112, -315, 291, -343, 251, -399, 8, -461, -55, 4, -145, 346, -756, 491, -411, 140, 155, -270, 204, -556, 166, -191, 415, -247, 134, 145, -414, 726, -415, 710, -265, 42, 534, -389, 551, -300, 382, -265, 377, -157, -88, 528, -519, 713, -511, 606, 28, -55, 536, -281, 566, -259, 411, -404, 83, 161, -353, 283, -489, 166, -55, 14, 213, -247, 206, -206, 76, -391, 54, -87, 231, 225, -239, 7, -384, 154, 174, -78, -20, -367, -90, -10, 119, -311, 128, -182, -117, 47, -16, 181, -104, -56, -142, 228, -166, 103, 128, -182, 217, -307, 78, 16, 126, 94, -85, 164, 130, 10, -271, 197, -420, -12, 302, -276, 190, -81, 166, -246, 71, 326, -211, 47, -115, 387, -258, 406, -138, 10, -45, -345, 508, -254, 211, 105]
1676A05l69L43m2K6j96J97l67N07n32J86K00J5k20J18j92j74M45j58K43j58k59
1697b82M98p57Q95n47J93p2k0Q5k94O53o94P25p23M57k27k7O53r23N75k17K96
1718B47r0l95M19n43O76o73N26l09J55M94q95R95r72P96l74m0K80l61M84p55Q06
1739D71o80L78j09m48O23n35P08o00M29j93j92L70l44Q8k71N69m99M45k04k08
1759b02L69j65O0Lo6k11K18J25m78M14l55N15n90M31K2j87J22j86L76l96J12R
1781f0L87l75k3K62n10N00n28K46r2J53K34m25O37o20N18l66K05M6k38O90q69
1802b28N72l59J31J62n36N37k37M23o22M54j80k87N08p06O05n38N36l16j16K46
1822D9l69M94l24L83l30k3L60l18K21m17J16M22l88J52j46k3K51k48j06Q2M4J49
$$ y = [105, -264, 79, 37, 63, -133, 64, -303, 204, -328, -142, 58, 73, -147, -29, -221, -395, 50, -108, 135, -23, -282, 216, -541, 354, -193, 0, -72, -92, -7, -301, 352, -342, 383, -340, 117, -110, -137, 516, -407, 168, -49, 247, 157, -238, 181, -362, 314, -359, 167, -142, 13, 507, -388, 607, -365, 431, 57, 17, 297, -64, 420, -335, 471, -209, 169, 60, -388, 235, -300, 408, -192, 237, 44, -148, 222, -122, -34, -305, 264, -235, 210, 6, -202, 167, 2, 62, 65, -1, -212, 6, 131, -347, 67, -288, 227, -363, 68, 90, -97, 25, -161, 215, -181, -69, -60, 327, -48, -71, 191, -319, 181, -347, -101, -193, -40, 194, -231, 406, -214, 304, -62, 143, 189, -49, 641, -228, 344, -15, 116, 278, -258, 279, 42, 465, -157, 297, 117, -170, 338, -368, 237, -301, 235, -81, -197, 49, -320, 174, -150, 233, -97, -120, 240, -78, 143, -274, -158, 264, -124, 28, -118, -141, 110, -138, -244, -162, -118, 31]
1844C1q7J05J25l54kJJ38r8K76l28M04j70l30N02n32M90l65L09j49J21j64r8J40
1867c5j45N41m28J49J20m05N64m31R0J27k17K59j13K32m84K83m14M44Jl12K11
1888C7k34J56j46L69k75j95K60J36J19m08L58k85L6N7k06M64m76K26n0J86j99
1909g0j4R2j82J62k74L18l83L61o4j13J57m4L5j6J78k76J35l4n4J79j71L21l34
1932i1q7J03K05J46l03J55l90O28n80K35L41p66O37n67M87l61J42P5L34ll81L50
1954C09m58L09j66j46L11l96P32p97L60l23L27J03j98L25p22M71l62L00j31K93
1974A41J4k48K80l61q4L36j2j08p4K73k36L14p1j37P6k20J85Ok89M3K56K4j32
1997b4P3j60K70l05J68j71J92j11QK50l26M30j16m0l35J52j66k5L74m11M83l31
$$ y = [31, -56, 49, 174, -180, -182, -181, -43, -141, 135, -193, 211, 41, -289, 213, -319, 171, -194, 115, -34, 87, -77, -175, -35, -180, 361, -67, 82, 202, -203, 361, -70, 20, 147, -70, 189, 76, 308, -176, 107, -307, 137, 138, -174, 37, -197, -41, -187, 182, -93, -288, -28, 108, 227, -181, 177, -108, -72, -15, -221, 243, -233, -7, -57, 129, -70, -84, 8, -174, -12, -286, 32, -351, 10, -54, -167, -10, -54, -19, -35, 143, -133, 2, -32, -86, 93, -78, 243, -91, -178, -75, 130, 276, -27, 128, -262, 366, -214, 21, 362, -404, 233, -334, 153, -208, -66, 9, 343, 340, -41, 309, -149, 160, -6, -152, 159, -237, 495, -302, 58, -265, 62, 165, -33, 292, -430, 41, -321, -21, -152, 141, 155, -93, 187, -174, -258, 78, 66, -42, -116, 157, -79, 235, 164, 27, 103, -117, 68, 74, -215, -172, 84, 108, -24, 49, -111, 159, -146, 22, -149, 43, -68, -60, 190, -136, 294, 178, 138, -197, -45, -211, -236, 138, -273, 210, -121]
2019a21K77j30L8j1j59K09l48L19k02M56j4k85j4k49N39l46K12k16j3J18k12K06
2041E4j5n8m2J03K1k74L00K3J16k78K55k85J45j15LK11l54J44j24L7K3J14l0q
2065c4J25o2l9o2J22l9J09p5j53K95m04M69j8k24o0K45j60j39K97k95J85m9l9
2088eJ01l20K94M0o6k23J50O8P0j0j25K74l95O0J11l5J22j93P3k47L26j19j0J48
2112H9j52M32o30L50j85j52J58j81L69r9m7j89K51J15l03K72j92L43l49K9J82
2133A11j27oJ5J2p5J33j35K72m78K0M11l51J38k17L86l58M04j38k02L20m54K60
2155e9M2q2N1j47L91n54M31l6N5j17P1o1l7q1J23L2p3O2J30P7j00j50M16l60J74
2180A98k50l3J79k0o2km1p3J14n5J41j6J68l9k85J9K3J61j06KO1q7k3k2O0O2J07
$$ y = [-121, 156, 26, 64, 53, -106, 103, -245, 74, -128, 328, 314, 29, 15, -234, 305, -41, 171, -45, -58, 60, -152, 54, 39, -19, -61, 42, 63, -211, 89, 112, 228, -50, 205, -80, 65, -50, -47, 164, -190, -46, -170, -133, -110, 4, -26, -34, 91, 29, -10, -72, 50, 11, 120, 45, -108, 187, -217, 252, 234, 10, -50, 195, 35, -104, 193, -102, 83, 34, -5, 96, -224, 70, 110, 44, -179, -29, 39, 109, 99, -26, 248, -147, -87, 24, -11, 111, -82, -9, -256, 70, -49, -59, 89, -63, 369, -261, 89, -96, -248, -90, -271, 98, -1, -48, -237, 14, 129, -174, 98, -94, 249, -100, -71, 111, -16, -22, -7, 5, -70, 63, -72, 200, -278, -258, 153, -198, -60, -277, 109, -249, 155, 17, -185, 135, -319, -59, -17, -99, -48, -195, 196, -358, 73, 37, 92, -25, 46, -15, -52, -133, -10, 22, -51, 11, 141, 218, 118, -32, 384, 24, 198, -52, -85, 94, 74, 12, 10, -31, -104, 10, -45, 96, 80, 248, 209, -76, -57, -34, 127, 21, 23, 84, -3, -26, -48, 12, 74, 181]
2207A81j79m4K47j45j17j78L35p0k96N59m17P1K55l27L23j48L3K9l32J33K35j60
2229a2j1k00L32j25J30O8k81Q9M6r6L66m26K25l50N37m93L52j60P8M7j7N0r2j13
2253e6J64RP2j93R5k50J85R8j80J64j46o8P3L6k25L42l07J26O3l5K10l24J04j19
2277a62J07N7n9J35j96J64k49L59l92K90M0k73M51l24J77q5Q7r2j37K15o5J00
2299A48j95J24J2j97K05j93J12R4QN7k92N8K78j45n1J42k60M0nK3M7k4N4k08P0
2324i8K27k7k11L9K31k15L86k45j69J49j24%Q9l8r0J29k20J74p4q7L29k06J12
2347F1J30P4j50n1j61J09J04m09L72j17PJ45l69N64n10J36K4j8N9Kr8Q4K40k40
2371a2O5M6k17P4k08K61k34K61J1j10J53j05L12l46K07j15l82K13J93r1M9M1K4
$$ y = [181, 2, -42, 205, 60, -57, -235, 100, 30, -266, 293, -124, -53, 202, -125, 198, 50, 83, 112, -220, -87, 148, -12, -23, -223, 109, -16, 114, 182, -99, -10, 36, -60, 306, -120, 105, -245, 292, -201, 151, -9, 69, 116, 99, 149, 57, -56, 108, 117, 189, -4, 91, -159, 26, 124, -56, 108, -38, -106, -33, 3, -222, 120, -187, -61, 2, -33, 177, -147, -43, -162, -55, 2, -57, 78, -118, 46, -203, 156, -236, 54, 94, -179, 272, -52, 125, 40, 127, 35, -102, 113, 48, 148, -47, 77, 89, -108, 97, -96, 16, 110, 118, 175, -117, -59, 219, 74, 23, 165, -95, -55, -60, -37, 10, -14, 40, -168, -98, 129, 102, -109, -70, 161, -54, 332, 87, -82, 67, -57, -57, 32, -6, -96, 33, -187, -13, -87, -174, 155, -51, 61, 191, 265, 115, 64, -97, 12, 116, -293, 79, -38, -31, 114, -255, 309, -201, -65, -41, -59, 0, 2, -96, -12, 228, -12, 53, 99, -118, -44, -252, 9, -225, 36, 47, -63, 90, -15, 297, -49, 158, 43, -339, -126, 67, -24, 25, 66, 90]
2394I0Q3p3k04K65k25K95l47K51k71R3J3q1K16j33L2q2J23j22J45Q4j31k4j07
2417a10k68L07J98j03Q6k02R0J3K0j19k71N17k75J17Q7k99K21j36O3O2m7j00M39
2440B90j11j80M8m63J93R0P7o5O5L98l90p1L5J30k96M79k94o8K17k3K67m16P9
2463io1k5K68l97M18k96L85l32j32K25k20K71k23K02k19M5j07K85K2l77O09k31
2485A01j79M5j09J93j92L82k85k22L58q7J57o1j37j07K23m78M91K0l24J76J57
2506A22j05J8J18j60O1n6q0L56m51P4r3J70J6q3L2O3L86n91R5K43k90M05m55J22
2530h3j51K26K51q7J99m98M16l18k4J60k8J31l0k85R4J57k32L66k49n1K65k04
2552B5R6j66J61M7p1o1J6pJ83l75RL16k96L03k44O5N9l05K88j69L90l96J33j64
$$ y = [90, 173, 100, -104, 161, -64, 231, -116, 135, -136, -43, -30, -111, 105, -28, 4, -78, 45, -77, 68, 152, 21, -3, -110, -378, -71, 127, 24, 110, -92, -2, 11, 31, -88, -359, 158, -117, 0, 87, -212, 9, -127, -64, -2, -49, -149, 290, 179, -1, 47, -416, -223, -133, -56, -121, -56, 342, -48, -119, -84, 46, -250, 229, -65, -133, 84, 61, 328, -88, -9, -70, -95, 173, -224, 194, -102, 283, -49, -181, 44, -176, 95, -128, 74, -145, -100, -207, 78, 100, -277, 332, 101, -78, -33, -142, 51, -141, 241, -44, -266, 92, 5, 162, 101, -36, -143, 80, -398, 93, 113, -211, -35, 122, 17, 35, 153, -7, 54, -2, -82, 274, -177, -103, -196, -26, -10, -93, -61, 2, 388, -203, -108, 135, -155, 250, -205, -83, -234, -8, 243, 156, 355, -143, 273, -45, -69, 91, 63, 194, 164, -121, -27, 130, -102, 264, 15, -36, 229, 25, 121, -45, 116, 163, 92, 31, 47, 40, 223, -152, -143, 173, -123, 180, -64, 1, 60, -245, 43, -126, 264, -132, 1, -163]
2576a63q2M10l67L96k56R7jj38L47k84J76l04L54l59NL10k61J81r0J71j98K15
2598A59k10L9R2j02J8mJ61n7o6Q6Q2j83r5J9j0j18K29Q1l2j78PQ8k7j93J20p3
2624a67P3J54K6J68l44N8j29K72q0j04N7O0J06k72L92m17K45J70l80P7n4J95k09
2647a03O1K36n35M16j94J32k86K39p5P0K3j12L74m54K64k26R0J22J14P3l96M49
2669B82l82K98k34k29K63J7N9k80J43k4J54J91k84Ko2nR6k77J49j70M69l09J63
2692C0q1J44o4q0n1K87j98l7Q5L8j53J37K5m5j6K8o9k5O7p9Pj49K95M2o2j86l3
2719a43K20k45L60j30j15N7J23k14K4K27l67M13l97J87p0q4K34l03M13m65J21
2740a54K14j60O0j34M45l11RmN4J2q2L53j37n3k50N0L13k68K3k4L04k35O3N4j24
$$ y = [-163, -245, 165, -202, 194, -62, 35, 34, -104, 243, -41, 135, -169, 185, -174, -169, 141, -120, 61, -29, 142, -56, 159, -51, -12, 80, -22, -4, -8, 153, 96, 30, 116, 198, 15, -80, -61, -71, -189, 40, 121, 89, -89, -82, 6, -21, -214, -94, -167, -94, 60, 86, 254, -90, -32, -161, 111, 31, -73, -16, 44, 150, -122, 270, -147, 98, 268, -112, -35, -89, 106, -103, -42, 194, -341, 75, -119, 13, -273, -34, -109, -39, -16, -128, 246, -208, 56, -170, -80, 42, 156, 229, -167, 282, -100, 198, -36, -265, -2, 15, 74, -206, -63, -87, 67, 258, -26, -24, -86, -91, 5, -272, -123, -293, 176, -133, 30, -51, 93, 29, -51, -102, 185, -13, -50, 35, 73, -80, 57, 82, 37, 21, 49, -20, -45, 22, -57, -50, -199, 96, 138, 76, -110, -143, 77, -168, 192, 62, -53, 4, 127, -87, -63, 164, -203, 210, -187, 0, -70, -154, 80, -223, 190, -275, -154, 60, -100, -40, -174, 271, -40, -31, -35, 19, 31, -51, 302, 165, 112, -138, -88, 225, -43, -20, -44, 260, 25, 88, 142, 18]
2765A8m9J61j42J82n8q9K0k79K15Q7p5J10N3m51M46j63k2K66j51O5k82o5K19p7
2789f1n2r1J64k48K27K4rJ32j25J18j40R7j27k4K64k44P8J47k89K42k85K65l26
2812b63J29K51k29P8j31N53o85K15K08l15J76j1k47J90J73k38L23q0N8j28j06
2833g9K79k65J09j03K47k57M1K59l68K95o5k00K6m2J45J06j62j03N49l77k1k0
2855fJ15L5j1m6l57M21j30J10J17l02P9k09J56R6N9l52J00J30k92L50m42M28j66
2878a17J48R4l67K43K5j41J1L35r0k05L87l93J17n2k6K59n02K91k92L35j43M0
2900d3L6j63J70j11K9K09j34k1j5J48j4l4j25Q8j37J84K3m2L4p1q3K8J3Q9j93
2925a35L2J89l50K14R9k70L59k02O2J14k35K81j36J35n03M63O8j08oj17J56k62
$$ y = [18, -31, 130, -12, 170, 112, 23, 43, -236, -21, 66, -9, 101, 154, -297, 149, -14, -36, 230, 79, 144, -138, -203, 16, -61, -113, -204, -40, -288, -61, -37, -46, 86, -39, 79, -61, 36, -91, -115, 149, -95, -17, 130, -159, 83, -202, 63, -263, -134, 117, -112, -34, -165, 388, -297, -82, 126, -189, -13, -24, -271, -81, 92, -146, 177, 97, 155, 27, -79, 200, -65, 44, -59, 188, -69, -28, 231, -137, 158, 93, -107, -81, -123, 22, 128, -34, -137, 412, 35, 14, -6, 109, 144, 133, 87, -270, 151, 21, 131, 248, -54, 25, -184, -28, 68, 127, -225, -125, 5, -287, 63, -379, 49, -117, 31, 125, -242, 1, 26, -115, -104, 231, 141, -64, 323, -70, 47, -5, -31, 228, -274, 17, -275, 60, -83, -43, -7, -170, 0, -111, -82, 127, -7, -28, -43, 105, 91, 57, -68, 20, -117, 67, 90, 48, 82, 11, -72, -44, -31, 58, -135, -103, 86, -264, -50, 49, -221, 138, -64, -2, 112, -123, 158, 22, 157, -346, 117, 185, 77, 71, -46, 110, -152]
2947a52J15j89L06K7k65L19l71L97j98p1J79l76K68k52L06M4nj58K4J27r5Jp9
2970i8n2J36K05l30M31l26lO6J44l85M12k24L7J02q5q0J56j62N2J69j34j07J97
2993A21K9q6j9K2K51n18K87j16O6Rj01j7K93o1m1R5R8l84J02q2K94l74N2K85n03
3018b98K99P9K6m91J20L48j10J55j49K00k32J41o1o9J46j17m9Q4J39l75N8J33
3040b3k01L20q9J41k26R8P3j58K37j54L2Pk37K55K2j41j42K42l25J96K47j95J02
3063H1K1j49l1P2j12M44l54J00q7p5N20n10K96l39J43k84K48J30J9k03R3L21n30
3086a86L75p3k56J95j62K9J79o9M5o7J25l35M44l83K08j65k9K98m48M94l91p5
3108b47M15j86J80k38R1j34J07J20k98K34pl4j94J69j56N2M23l61J80j99L14l49
$$ y = [-152, -37, -226, 80, 107, -158, 161, -210, 187, -11, -82, 97, -279, -11, -263, 43, 87, 82, -76, -52, 75, -20, -19, -98, -150, -14, 191, -139, 292, -34, -37, 29, 173, -212, 200, -24, 13, 115, 30, -50, 106, -56, -4, 165, 31, -76, 121, 150, 64, 45, 67, 318, -200, 87, -29, 37, 46, -55, -72, 221, 160, 119, 214, 312, -72, 30, -52, 242, -132, -80, 205, -298, 1, 80, 106, -385, -265, 83, -27, 128, -21, 179, -53, 88, 27, -42, 104, -13, -62, 22, 161, -214, -156, -23, -224, 96, 7, 148, -78, 20, 93, -65, 172, 18, 50, 57, -180, 75, 97, -44, -186, 56, -269, -73, 174, -21, 81, 102, -47, -78, -6, -118, 326, -28, 72, -15, -90, 430, -80, 216, -123, 20, -264, -16, 114, 133, -70, 23, 344, -186, 189, 116, -140, 55, -107, -78, 101, 32, 77, 10, 135, -200, 244, -139, 69, -96, -125, 173, -275, 219, -172, -247, 168, -18, 162, -76, 15, -119, -12, 108, -190, 44, 37, 3, -191, -22, -178, -126, 297, -64, 116, -83, 231, -118]
3130a18J20K32k70j46J08q6J05q7J91O1j53J26j5O3j94kK09j15K45m16K81k29
3152i0K39l70k6M77p1j09k55K84N8l89L39j91J77J9l00K58pJ12j78J85j53q5J00
3175B4l25N03l72J98k20K46k3k23K48n1K40n87M19j60OL7j96L20m8n6j6J43j24
3198a7n5J44k06J17j83K53L8k5n4q0J96q2m5n7J01m2k00K97k08K90J8j63j08K20
3222A49k18k6nK67K4j72L0K01k82q3K6K94m18J00J41j24J27j44K12l83L32k03
3244a55K80j59r2K39k16K78l10J64J1j05J87k01J80p1K61n30M09q8k15K09j18
3265d2j05L06k86K40l07M23j90J07j04Q6k66j65M62lj42L23m01K51j68n0q3J8
3287i6K13k29J15m8j8J97j30j55M1K06j10j10J38n5n7N0P6k5j94K00p1j1J84j67
$$ y = [-118, 2, 234, -36, -182, -74, -160, -55, -142, 49, 110, -43, 83, 68, 131, -63, -65, 144, 29, 274, -142, 139, -90, 149, -221, -247, 230, 159, 50, -205, 79, 137, -252, 87, -104, 73, 92, -208, 50, 43, 155, -23, 162, 9, -76, 24, -301, 202, -170, 28, -192, 54, 31, -192, 56, 5, 245, -342, 77, -83, -77, -40, -236, 84, 36, -20, -36, 107, -17, -72, 72, -134, -17, -200, 53, 91, 66, 12, -68, 128, 46, 1, -56, 45, 3, -197, 100, -108, 182, 200, 37, -71, 149, -69, -95, -100, 167, 191, 19, 49, 250, -32, -115, -89, 205, -213, -113, 28, -96, 31, -113, 99, -284, 48, -155, 125, -34, -126, 113, -103, 175, -135, 29, 40, -65, 122, -79, 101, 30, 291, -239, 170, 82, -133, 76, -42, -147, 159, -127, 113, -194, 229, 39, 146, 42, 128, -138, -303, 159, 156, 14, 337, -64, 187, 19, -31, -114, -96, 117, -112, 3, -45, -63, 134, 4, -151, -110, 96, -14, -124, 14, -41, -98, -48, 28, 3, -191, 9, -62, -73, 111, -56]
3311e6j17K33J98k77J30j49L1J44N6m11Q3J67P9l56Q6l5J87j04J69l26J87l3j8
3334a32K76k64M1j50j14K91L0K70m28J10K9J28l5j88M3J17n0j03J35L2j1J60p7
3357A10k95L12J14j80N6l77L44k02K54q2Oj64K4K37l68L83m04L54m49R2M33j12
3379H6j33k05R9O3K09j3k58J31JoK22k55R7m6n4r5L00l23K60k06K19j49J09j5
3403C8j18K2K10m25L80j47K02k18j3j3k4j6K03l7k45J73k6K16k85K28M6l52O9
3426a32J14J14m3q3J9N5J01j45j73K73J9M7J48k20rj58R2K44K5k75j13k29K28
3449a01K51k0j68J59L7j32J36j29K6m86L82j60J64j66R5L32k97K12j50j77K00
3470Hn3n3m4R7k33L34m3o4J70l45L86l42l6L18l68L72l25K96k22k5K83k14J43
$$ y = [-56, -173, 60, 258, -19, 111, -38, -7, 137, 193, -218, -135, 32, 111, -245, -159, -194, -7, -111, 58, -268, -81, -114, -132, 144, -120, -79, -229, -343, -52, -22, 248, -180, -70, -41, 87, 52, -136, -93, 24, -26, -129, 6, 38, 27, 187, 110, -185, 127, 241, 61, 117, -260, 84, -118, 136, 54, 60, -104, -80, 157, -211, 172, -232, 122, -327, -235, 198, 86, -47, -252, -153, -90, 119, 106, -152, -21, -20, -26, 196, -59, 38, -8, -62, -157, 143, -180, 80, -126, 93, -56, 53, 38, -80, -58, 152, -273, 107, -40, 162, -56, -69, -82, -106, -122, 81, 44, -201, -28, -54, 162, -123, 105, 151, -201, -132, -18, 96, 53, -30, -11, 44, 145, 0, -173, 100, 119, 166, 314, 94, 85, -73, 19, 263, 288, 13, -100, -329, -101, 150, 130, -38, 121, 158, 26, 162, 33, 59, -427, -45, -205, -41, -207, -112, 220, -77, 135, -15, -192, 8, -45, -98, -142, -45, -278, 56, 13, -51, 119, -226, 160, -182, -218, 100, -268, 104, -221, 75, -147, -172, 111, -103, 40]
3493D0j00N1R9j00m2O9j23L1J09j38j07K50J07j66J05L4j78J4J18L5j16N0m1K81
3517B82m60M49m81Q6J73j97L39j04k96J39J74j46j4n9P5k3K1j5J69j46m2R8j59
3540a37M2p8n5K28K07m50M49l55J77J07k50N0K92j08j51k2k7L8P0j48J29J06p8
3563C6M5k21j48K54k3M8J32j38j71K87k49K39k88J97K1J08j43O8j87M2K07K6j64
3586b2l3J32k48K96l8j83P2QM7j42K38M6l03J47q8O1l85M62n2j07L91k85rjJ73
3611A77j47m13O81l18n6m3M04l83j18K77j86M22l03J35l4j11j16J38l2l9J61o5
3633C1q3J35j49J37r6K73l53J60P2k46K2Q4Q0k2%J82j03j36J30n1nl1l6L2r7j6
3659h6M9P8O0k49N3K1N8K10k55k41M45q7j93J41m2j78M17j28p0j01N1n0R7J0Q2
$$ y = [40, -60, -9, 90, -10, -52, 17, -106, -75, 34, -104, -211, 39, 146, -20, 85, 119, -59, -45, 73, 108, -8, 42, 1, 282, -178, 271, -210, -124, 49, -148, 191, 87, -209, -70, 104, -42, -56, -115, -40, -63, -42, -57, 112, -34, -76, 22, -137, -95, -173, -228, 0, 207, -243, 206, -149, 28, 135, -115, -65, 227, 119, -32, -54, -81, -43, 27, -121, 8, 114, 36, 81, -140, -288, -34, -57, -9, 123, -15, -186, 101, -148, 91, -197, 0, 21, 129, -14, 54, -133, -91, 116, 142, -22, -55, 77, -171, 125, 87, -96, -24, -16, 31, -111, 127, 173, -130, 17, -71, -10, -395, 67, 15, -92, 299, 14, 5, 4, 177, 30, -383, 298, -20, -76, -119, 285, -98, -216, 61, -125, 297, -6, 129, 95, -16, -132, 6, -26, -65, 96, 31, -52, 83, -66, 71, -25, 248, -105, 55, 127, -119, -97, -13, 67, 45, 45, 227, 124, -12, 118, 67, 62, 31, -5, 27, -70, -86, -37, 41, 101, -148, -95, -74, -16, 194, -61, -302, 143, 56, -137, 4, -38, -216, 201, 73, 3, -98, -47, -97, 0, 10, 92]
3684I2k75K26r4N3j06J24O2j28K60j49q3Jk54K50R8k35K37j00O9jk37J07j2J17
3708B2P7k7j46R6m4J1Q8n4R3j02r5J13j5j27j2N9J67j83L1J1o5K02oN6j75J78
3734A53l03L13l6j11ql48J69L68m83M8K63q6Lj4J39j04J36J1J5pp2r6lJ05k39
3759a87L53k53MK5nL37l10K0r7M01k61j10J53m74N85j19O2r0j66K70k00J15k00
3782a47J27nN6j59K24j48Q3j4j67J7L58k17np1M0K7ok4k2P8k4K88l95Q2n1J45
3808G0K10l97J2M5J38O4j33J44rj96l1q1J93j82J10J17N5k25p0K43j49M17m87
3831a42J91K48m31K07j59kq0J65J9n8K93l03k5PO7l5o4J18J36r1q6L8K59k56j47
3856a31K17K0k89J86K7k40L99l25K97J18m19J17j37K20k84J21J27Lq9M8j87o3
$$ y = [92, -183, 43, -51, 2, -104, 20, 82, -46, 214, 65, -18, -17, -271, -21, 77, -158, 79, -21, 48, 47, -190, -83, -95, 22, 99, 72, -74, 22, -22, -11, 77, 23, 116, 14, -81, 32, 17, -110, -122, -63, 104, -79, -48, -37, -102, 100, 94, 150, -25, 153, -150, 163, 127, 16, 8, -340, -171, 197, -286, -238, 25, -61, -58, -72, 67, -37, 99, 110, 125, 118, 46, -50, -53, 52, -187, 166, -87, -83, -58, -63, 274, -36, -16, -113, 288, 27, -83, 70, -404, 181, 62, 124, 34, -132, 138, -62, 53, -147, -20, -25, 31, -128, 96, -52, 31, 17, -150, -133, 225, 8, 3, -68, -28, -1, -7, -31, -53, 25, 1, 289, -106, -24, -75, 70, 280, -117, -105, -60, 78, 142, 9, 153, 144, -52, -83, -164, 29, -153, -43, 74, 129, -96, -166, 77, -72, 345, -142, 49, 297, -134, 73, -86, -88, -168, -3, 16, -42, 251, -52, -77, -70, -3, -38, -102, 16, 152, 61, -25, 13, 272, 16, -131, 86, 106, -183, 3, 30, -210, 189, -136, 161, 279, -140, -23, -160, 60, -224, -103, 24, 27, -62, -14, -201, -264]
3878b64J89J69p3J63j61K0j3K5K2k22k7J52j83K22NL2J3m0J23q4P1j43j26O7J68
3903A05k93K00J40k09J06j30K4P3j5l00J50R3j38L75j31L1k83J14J81r5J02J07
3925B07k40P6Q7o2r3P1q1K10q7k73J37M7K2l1j74K35O4j81Q5o5L12k44J1m05K89
3950h3J11j49J05j22J89n9N2L4J89l18j84K08pL9%m9Q5k70o1M99l54L00l31l3
3974b09K1K27L8J88j45m8j45L4Q8k87K48J02N2j01j64o0K05k11J44l10L63r7J31
3997F4p4J12k61J74n4n2r5J67k0o2j34K01J51J79j50k72n6K71j04K90k86J36m0
4020H5j70J92q0j2J02q1r6J36m8J03n7j34J21nk53N6L54j64j87r2J59K42k88J39
4044B2J20k17q0r8L63k37m8J46O5q8K85j85j14K20n3j69J0J12j1j02P9L4j46j33
$$ y = [-264, -75, 94, 21, 184, 23, 43, 30, 55, 77, -145, -172, -20, -203, 19, 24, 56, 69, 29, 152, 68, 139, -4, -130, -63, 105, -188, 12, 152, -57, 49, -81, -57, 16, 1, -299, -149, -56, -194, 181, 50, 81, -202, -88, 93, -2, 100, 207, -33, 43, 130, 68, -25, 46, -35, 175, 88, -185, -48, -1, 21, -10, -184, 51, 115, -66, 19, -46, 266, 22, 33, -372, -83, 28, -121, -16, -138, 51, -8, 44, 78, 267, -51, -235, -27, -34, 5, 5, -44, 41, -229, -290, 209, -145, 155, -176, -209, -188, 39, 77, 265, 120, 72, -73, -39, 49, -238, 10, 112, 164, 63, -101, -161, 44, -167, -23, -333, 30, -67, 64, -10, 102, -159, 15, -39, -91, -186, -19, -39, -101, -235, -34, 117, 296, 146, -126, -182, 89, -15, 275, -11, 125, 85, -85, 107, 27, 15, 117, 36, -60, 76, 28, 131, 74, -60, 61, 56, -197, -141, 213, 49, -138, -230, -71, 171, -117, 22, 142, -75, -155, -253, 110, -127, -175, -29, 36, -52, 233, 48, -66, 154, 101, -68, -58, 54, 43, -59, 20, 54, -92, -225]
4068b25K05R8P0m22M08j00k84L20o6J12n7j6l09J85RPo5J45K32k80k43K84Jr9
4092i0O0k2K9lj26K60j04M4K9r0j42J91K06l62J29J17k43Q2J31k2N0j7k48K46
4116A05j55J49j77Q5K34l73K66j11l7J80j1j26j35O9j20j2L11o6J81k4j72l7N9
4139H3j2O7j69K88l21j47K49M8j10M2O1J01j58O8n4K7o9J84M0k23J81k90K40j74
4163d8J48k7j92J98n8R0K13m59J84R7j61O3j32J9O2%J72j07k9k1j8oJ25j90K23
4188A46O7j01j32N3j9J1p5J36l19J35L7j29J72m0q1O1j9K35j56r3o6R5j2J17L1
4213E4J9q7M9%r8J5l0k8K46l05K97N0k23J98j49p7p0J91k29M36l72K56j03j26
4237h6J31l69L47j05P3J04K6j01p0J24j71o5L21j33l7j91K32q6J77j97P7J32j56
$$ y = [-225, -20, 78, 148, -274, 134, 34, -250, 70, 4, 116, 59, 43, -266, -81, -72, -65, -130, 15, 247, -33, -276, 8, 9, -90, -30, -52, -23, -26, -152, 108, 4, 48, 77, -13, -155, 36, 242, -120, 9, 126, -117, -35, 96, 74, 124, 107, -141, 105, -50, 99, -78, 7, 241, -132, 134, 23, -14, 166, 155, 29, -106, -37, -157, -169, 142, 76, 257, 233, 61, 24, 83, 71, 138, -31, 257, -64, -211, 38, 86, -24, 18, 79, 180, 22, 90, 36, 63, -6, 178, 218, -5, 176, -114, 126, -48, 100, 73, -119, 79, 21, 111, 324, -135, 49, 146, -15, 48, -84, -65, -3, -3, 169, 62, 33, 12, -6, -12, 113, -77, 146, 213, 112, -20, 33, 14, 25, -50, 86, -233, -98, -61, -190, -18, -58, -139, -78, -97, 138, -18, -111, -177, -82, -94, 23, 54, 73, -14, 35, 35, -63, -48, -78, -106, 140, -165, 132, 182, -41, 157, 8, -69, -139, 52, -177, 259, -113, 143, 40, -86, 45, -324, 23, -82, -9, 95, 121, 20, -50, 74, -97, -162, 159, 26, -11, -202, 30, -56, 121, -76, 1, 133, -23]
4260b3q4J17J71j88J45j68M8L0k36MR9K57q9n9R8j72O1J7K00k43Q5J75l0n6o2
4285I7k03N8P9n3R4q1J42j27O2N8L7q7j58J18j51k08J23L39q2J03j20K16k20p3
4309c7J69K2j24J18k96K50k76J23L11k20m8Ll43K48K26p3j41J10o7K75j81N4M6
4332A49j00N1j37M8n3k7J6J23j80M00j81l53J13K31j76k45M67j55J96J02k66j19
4354i6J62J02l51j5K95k31K9K4R2j35J90R7k73K15k17J40J91j17j9j62K32k15
4376f2O5J3n1J05j21M3m7J00k94L46q2J34j92l7J07j63K71p2L8r2J32K4l01K28
4400I2l8j13K20n3k50J64J13j9L3k6J11l85K5K72j13N5Kj58K12j0j56J16r1m7
4424d4J74j70r9k0P5R9ok64K26Q3L35m25l0N0o0K51l7m7n1j18J10J2k7k41K35
$$ y = [-23, -107, 10, 181, -7, 138, -30, 18, 48, -188, -184, -85, 172, 83, 24, 122, -50, 11, 28, 228, -15, 70, 245, 215, 159, 97, -106, -48, 31, -22, 72, -9, 133, 6, 68, 126, 163, 76, -82, 36, -115, -323, -200, 139, 57, 160, 40, 256, 36, -37, 132, 154, 30, 148, -148, 102, -174, -51, 260, 40, -8, -5, -348, -100, 126, 53, -88, 22, -45, 230, 49, 103, 149, 49, 100, -37, 11, -42, -69, -53, 70, -110, 290, 109, -244, -131, 100, -76, -321, 146, -9, 187, 289, 23, -96, 66, 168, -183, -198, 97, -134, -105, -81, 11, -124, 66, 163, -110, 105, -112, 28, 219, 102, 83, -79, 153, -62, 3, 16, -35, 70, -51, -8, -55, 45, -249, 97, 15, 149, -43, -80, 27, -136, 135, 63, 101, 9, 141, 165, -136, 92, 54, -59, 161, 108, -142, 22, 135, 116, 149, 123, 234, -151, -126, 146, 33, 88, 90, -68, 144, 134, -22, 94, 3, -44, 130, -40, -139, -159, -84, 15, 9, -255, -29, 54, 389, -36, -66, -16, -76, 175, 138, 91, 40, -78, 32, 44, 17, -224, 11]
4449A1j70K80k19L8L21m58O4K42j16k58l7K28L1k1M6j8J65j74O4j41J42l05J50
4472a35J54j11J00l1J54n2k72L22l22J89l0N2j83J91p9J80m6k35J85j71J06k07
4494b41N3J91k28L06j64K99r7m32J66J57n5L2j80K73o4j32j04L01j13J01l3r3
4516e7m0J19m1l0J83k64J75j68K23R6M6k02l00N05k02k60J54J34o7J13j08P9j22
4539c4m8O0j6n3J91j7j23J35m5P5j57K7j84L26k85L71L0q0o9k65L09j83K51R0
4563C06o13L98j09J89p6q6J09L9j52j40L14j95J7l95L85nl5J41P8n1ll2j4l1m3
4588dK20j18l12L53l52K91q7r8k4L28k34N3nJ9k8j67K04j36J25n5j10N2R0m4J81
4613A42n09J12K92P8k81M58j38k68J75J03q1r7k2P4q5L0j61P1n1L79l99qJ46r2
$$ y = [11, -159, 121, -98, -60, 261, -197, -133, 109, -7, -265, -302, -74, -43, -64, -18, -36, 129, -45, 19, -122, 20, -285, -135, 19, -92, 8, -23, 131, 79, -193, 129, -193, -4, -34, 18, -165, 26, -53, 127, 81, -154, 31, -140, -34, -241, -188, 3, -225, 81, -83, 216, 119, -313, -147, 10, -45, -13, -193, 80, 16, -116, -220, 81, -32, 69, 36, -57, -97, 22, -19, -49, 134, -130, 45, -123, 100, 196, 242, 40, -260, 245, 43, -217, -63, 71, 4, 117, 9, 88, -34, -82, -22, -38, -91, 100, 83, -40, 95, 50, 125, -32, -5, -189, 137, -148, 223, 253, 173, 104, -161, 148, -35, 216, 306, -307, 91, -18, 171, 95, 9, 118, 157, 5, -135, 179, -16, 1, -394, -9, -14, -49, 92, 170, 119, 116, 84, 70, 39, -4, 216, 98, -214, 139, -213, 78, -9, -107, -131, 197, -37, 16, 11, 30, 2, -165, 39, -97, 28, -27, -137, -85, 5, -39, 142, -367, -255, 37, 115, -166, 292, 154, -114, 61, 164, 83, -14, -36, 38, -47, -17, -178, -107, -158, 221, -178, -186, -40, -132]
4637a32K34o9k6m67M68j38l3K95l70L50k14n7J10R7j40K13Ql38L27j68j03J81
4659B8L7P6k65J20O0L9k11k3L8j15K93j66J76j75N4k67N15k56l5k3j26L12k44
4682a58K04p1l9R5J18j07j37N7J32j24L9M7J29l12J41Q4j16Q5j19J94j96K96l85
4705a43L55P1k79J51j32J31k62J68n1J55K9k70J47j07P6k14J17J29o6J20j51j44
4727a70J24M9L4q5j80L84j41j19J50K22k94J64j69j99J2J75J8q3N6M3K00m39M43
4750A95k88L00j02j70n4L98k71M9j42Q4j70J22J33j47J48k38P7l4J42j27j1K30
4772A24m6k09J21j58K74j49p3K84l05J80P3j31J03k58L69l79K10k40L66m2j06
4793HQ0K14k96N4j89J04m4q4Q7J82J32l30K74j46k4R1k32J06n3j59L82mp6k26
$$ y = [-132, 102, 33, 7, -460, 8, -130, -163, 132, -238, 112, -102, -159, -49, 48, -92, 121, 129, -209, 118, -50, -153, 28, 65, 141, -124, -4, 56, 95, -116, -139, -101, -216, 77, -89, 87, -88, -34, -301, 214, -42, -77, -100, -226, 86, -158, 46, -25, -64, 31, 149, 42, -95, -38, 94, -30, 9, 56, 185, -127, 14, 98, -18, 67, -52, 142, -54, 242, -143, 212, 283, 4, 155, 23, 154, -108, 60, 9, 164, 193, -77, 70, -37, 39, -175, -58, 71, 5, 125, -26, -170, -46, 3, 37, -48, -228, 156, 15, -104, 46, 268, -26, 138, -31, -230, -218, -43, -25, -108, -52, -9, 191, -248, 195, -93, 207, 105, -65, -119, 279, 8, 57, -85, -1, -171, -49, 84, -63, 85, -153, -76, -110, 32, -95, -106, 124, 78, -131, -10, -168, 106, -43, -116, 168, -137, 43, 116, -15, 88, -170, 199, -180, 30, -210, 156, 114, 8, 88, 302, 6, 60, -129, -25, -69, -153, -66, 116, 248, -82, 192, 46, 22, 113, -119, -13, -66, -225, 157, 153, 77, -149]
4817a49l6L32k30L30k16j31J21Mn2R0J38k39l8j8L82l74J71l2j09J57J1k74O3
4840i9J79k54J50J30p7R8j65J88l56K86j00o4L4l3J15q2k31K53K45j51p7R5Jj04
4864a9l3m2o3J92p8j00J75q9J50j96mO8K16j65L6Rk8j72J4J52j07K60k72n3K02
4889E3j02O3j11J25k30K39k51K26k0j18M83k37j01r5J10k58J93O5K03k15P5j33
4911c6q0P9J47j23o4J10j46J05n4n4J59N6j48k0J19o6l0j22J4K35j52Kk7L41l09
4936f4J16r4J72R0j15j96k32K80J6j14O2N9j13K50Jj55N0oJ70k03o4K31m23M37
4960A55j12l3j72L91j55p1J46j30k57K13j62N9J01R6p5K48k73ln9P7l0%J00k19
4984a65J98J66j78o0m2J56j99J64N8o8k09J86J59j40J37k15r1J16J7j2j9j0j45
$$ y = [-149, -185, 147, -83, 247, 31, -100, 21, 25, -27, 63, 201, -38, -76, -94, 288, -86, 85, 53, -56, 101, 112, -162, -99, 80, -174, -24, 106, 29, 127, -38, 150, -206, 80, -20, -84, -50, -83, 32, -50, -281, -28, 217, 66, -11, 84, 85, -19, -52, -94, -157, 35, -43, -143, 32, -57, 93, -103, -107, -39, 177, 12, 48, 57, 29, -143, -129, 23, -84, 176, -96, -149, 53, -49, 14, -97, 28, -202, 37, -214, 12, -8, -126, 357, 120, 19, -76, 34, -224, -31, 34, 237, 22, 97, -36, -116, -37, 110, -13, -77, 33, -113, -8, -62, -116, 43, 99, -49, -69, 50, -16, -46, -168, -154, 81, -71, -69, -96, 245, -64, 52, -42, 130, 220, 105, -91, -323, -43, -27, -141, -79, -20, -133, 117, 118, -37, 13, 7, 177, -26, -90, 141, -282, 155, 43, 10, -162, 229, 74, 3, 149, 19, -238, -25, -187, -128, -27, 69, -6, 242, -31, -34, -93, -16, -46, -46, 54, -165, 33, 199, 21, -39, -81, 75, -124, 40, 98, 30, -179, 7, 166, 26, 163, -52, -143, -27, -10, -22, -41, -51, -196]
5007a96L26k18m0K14l3j67K67r0j86k09K77P0Mj00j04N9J52j19%l3K33J02Nk20
5031fK02P2j68j02J22k12M00l50j1M55l87o5k3J47q4j39J0P7J17m2r4n3K09j02
5055b7k55L74l6j06J65O5n5j85K25l55K71o3j63L9R8j03J9j9J61j47J4m6N6J66
5079I3j27R2j65M2J65k26J69l06L67k54J91j14o0Q7N3p6J58N5m14L06k2j23K87
5102A78j56M6j61L0k4O1O5j6j51J45k57Q5J72K22l18J71p3R0N8j79J52l80L61
5125A21j92R1o1o7K35J9j11J13j24p2K40o9k45J20m9l2J37o2nm4n3Q2j1R4k5P1
5151A01J41j86k17K41k48JK34P8j82J68k72J58m12L28J23j15P4l3J78ll08k1J27
5174d5J09O1k63J41j48K8J25J8r1oR6k11m5K18K8r6o6L47k08J7k23K67j08p2J72
$$ y = [-196, 130, -88, -128, 86, 53, -114, 153, 63, -123, -332, -55, 15, 19, -81, -185, -126, 26, -93, -93, -126, 107, 209, 214, -6, 196, 268, 100, -2, 120, -92, 308, -42, -53, 402, 15, -50, -73, 74, -10, -149, -139, -62, 55, 13, -81, -134, 75, -27, -282, 92, 56, -50, 115, 180, 125, -60, 165, -190, 81, 18, -145, -106, -8, -111, -92, -111, 50, -97, -83, -129, -73, 93, -34, 58, -107, -65, 100, -126, 43, -263, 104, -150, 41, -73, -133, -46, 7, -69, 89, 144, -270, 36, 14, -109, 178, 22, 68, -93, -63, -87, -26, 39, 23, -128, 17, -240, -155, 17, 239, -79, 92, 19, 109, 167, -12, 140, -240, 121, -71, 20, -41, -108, 127, 146, 35, 148, 24, -48, 192, 123, -122, -2, -51, -83, 54, -8, -13, -57, -110, -28, -39, 55, 30, 101, 242, 56, -161, 80, -168, -167, 67, 145, -37, 131, -141, 17, -395, -67, 56, -59, 15, -18, 160, 157, -151, -172, -45, 64, 125, -138, 3, -145, -117, 8, 26, -65, -71, 25, -186, -231, -13, 15, -81, -147, 200, -8, 9, -214, 53, -55, -127, 45]
5199D5K3j8j46R2M2J11j12k05J23K81j78j57K88k15J4n6K4J02l11L37j75o8L52
5222A93q0l2M2r0p3J11j24J36N3r1Qq2JQ0l8j55K10J3qK6j25k06K70J18q5R3j04
5249F1j50K09lj62J30k81J77o8P5j2N1J27%m36M33m6p9N3M1k29K49r0lm8K9j1
5275A7k47KK82N7k14nK70m6l6j43K78j80rJ40k32m4N9oK50n5j66Q9j03J01J57
5300B16k16L9n8J36k14J3J48l5J64l0k50Q4k14J84O9j98oJ26K04M7k7j08k87J09
5324a04K5K34k45K27m76M31k55K82p9J27l19L33j90L3k89K91j07j18L08j05j77
5345a73J10J49N2k91J61j54J76J8n8l5k8J48K9k39k1L48j20j43J06J20q8l11K46
5368BNM2k8J69j09j11P0j12m1J07k9K09j83r3M6P6oq4M6J9j71J21Q8n0MJ06j6
$$ y = [45, 68, 50, -96, -4, 38, 149, 37, -168, -45, 236, 58, -99, 189, -26, -12, -68, -44, 58, -253, 84, -91, -159, 193, 113, 81, 123, 33, -40, 71, -53, 83, 136, 45, 53, -29, -28, 52, 14, -141, 69, 82, 74, 100, -25, -231, 39, 157, 72, 165, 61, -89, 120, 117, -45, 85, -196, -19, -87, -12, -24, 27, 154, 154, -282, 151, 105, 26, 79, 120, -109, 140, 50, 47, -1, 28, 17, -230, -228, 54, 111, -103, -108, 162, 116, 80, -63, 215, 35, 26, 166, -66, -110, -51, -57, 193, 138, -28, 61, -42, 59, 216, 0, 39, -19, 117, -97, -84, 64, 29, 193, 163, -87, -3, -217, -33, 36, -162, -168, -42, 162, 209, 182, 74, -213, -104, -79, 155, -90, 137, -339, 92, -163, 119, 40, 167, -152, 181, -9, 24, -265, 26, -81, -199, 109, 4, -173, -63, 86, 138, -153, 8, -146, 30, 48, -10, -45, -73, 75, 104, -135, -156, 192, 72, -71, 35, 155, 67, -244, 2, 7, 49, 21, 190, 81, -30, 40, -72, -113, -6, -35, 174, -9, -102, -56, 20, 14, -70, -24, -5, -176, -55, 33, -17, -13, 93, 77]
5395G7n1M3j70K40m4K0m3q9K2J37j89P1j2P2j16M11k91k71K29N0k08j17L30k99
5419a98K53j80J87k14K44r7Q0p2Q0k05R2K59k68k90K68J16j25L1K05j70L33k47
5441H2j09J6m5o5R0K65k90J33j13J06P6k70O0K05Nj45P4r8K2m6n0q1KO5J38r7
5467g0O4k7K04l85N40n21L67j93P7k65L8J2J14m8J7J37L3j17O3L7j51j53J17P7
5491c3j03K39k76J28J92j96n2J70j90J27N4j23J78k59J61q4P0L08l53P3l2L12
5513C11k37O5j06P4j04q1K2J05j18K22j96j42J92O8j61P8L6Q3pR3k55J24l41L58
5537H3n9j9K11l10J02j65l5N37k55k38M8K00Rn7j06N9k35L25o5k45L73P5l08M0
5561c5J00k2K00m40J11O1l4K83l46J79j42R9l3J2q3J57l02N51m79k06K52K27R3
$$ y = [77, 26, 69, -101, 139, 95, 115, 72, -17, 5, 142, -47, 24, 12, 84, -32, 379, 88, -183, 46, 96, -112, -229, 101, -198, 55, -125, 62, -152, 92, -5, 75, 3, 83, -122, -30, 229, -39, -329, -61, 55, -70, -39, 166, -4, 329, 82, -27, -11, -56, -121, -31, 234, -56, 77, -36, 70, 146, -124, -64, 141, 146, 1, 75, -23, -1, -47, -97, -178, -176, -111, 27, -70, -6, -33, 171, -214, 326, -195, 172, -21, 56, -209, -171, -159, -45, -93, -76, 61, 94, -23, 40, 77, -74, -227, -110, -33, -136, 103, -173, -45, 147, -49, -101, 69, -121, 6, 60, -63, 115, -144, 17, -67, 3, 311, -42, 31, -1, 311, 74, 139, 33, 107, 3, -78, -56, 49, -69, 153, -43, -185, 7, 75, -86, -8, 28, 111, 104, 197, -58, 66, -275, 83, 24, 5, 216, -94, 8, -157, -192, 345, 90, -148, -100, 100, 109, 52, -54, 5, -230, 95, 30, -215, 158, 233, -75, -35, 65, 43, 243, -197, -86, -25, -59, 224, -122, 57, -85, 14, -19, -7, -90, 67, -235, 316, -163, -369, -117, 110, 203]
5584B03j65M3p1J51k17J17j51r6J13P7J3pK3j31K6J14J9j3J05l65J10K88k62M8
5608b8n2J02P0j40j47J34J99k38PK4jj3J90j95K29r7r0j85M63j76j04j18K68j8
5632H4j89J86nj97P6q4n4K63O6j62n2MJ21J27k96J66l48L19k09j25M87r7J0Q4
5656A75q6j34jq8J32j2J9r1o2J97J47l13J33K3K7m7N9j19O2q0K15q2m6j01P0k04
5682b07J87Q1j1J22M4k15J65k06j8n3K27n4l09K62j14j6M8N3Pj68J70K09k37M8
5706A5J52k64J71j03N6k3m0J24o9K50m6m85L65l10J68R5k56K75j47k0K21k14K40
5729A55k48L76p8j51k47n1N00l96MK93j61j58J90o2J41l2j63n9K61k79K16N3k04
5752a00O7L1J8k40J69J98j60M6k2J67j05J31l08R1R6k78K95R1n6j35n7J61j41
$$ y = [203, 38, 81, 10, 161, -56, 61, -90, -186, -73, 4, 17, 10, 33, -98, -72, 42, 61, 48, 153, -212, -102, 186, -76, -28, -80, 22, 92, -48, -195, -61, 138, -100, -93, -69, -70, -83, 107, -88, 141, 44, -46, -231, 232, 56, -48, -166, 102, 84, -105, 81, 76, -121, -45, -129, -183, 80, 146, -16, -68, -64, 57, 184, -112, 54, -294, 25, -184, -309, 178, 81, 91, 175, 89, -45, -46, -134, -2, -14, 5, -86, -148, 49, 196, -117, 16, 39, 66, 19, 78, -41, 21, -59, 156, 74, 28, -73, -3, -207, -20, 61, 50, 172, 216, 1, 166, -40, -58, -111, 116, 62, -247, 15, -99, -115, -67, -14, -7, -175, -5, 204, -33, 15, 167, -97, 74, -29, 27, 4, -36, 88, 19, 269, 223, -262, 103, -207, -39, 56, -200, 75, -72, -92, 129, -85, 155, -93, 283, 205, 54, -193, -244, 256, -140, -136, 157, -4, -162, 28, -34, 107, 75, -88, -147, 114, -165, 51, 104, -100, -33, -2, 16, -224, -55, 143, -17, 29, 7, 174, 69, 200, -108, -17, 79, -199, 96, 187, 131, -4, -61, 100, -41]
5775d1n0K37k97J39J68p3j10m0k0K55j97R3Rm9R3j37j99J44L5j38K94j30kR7L4
5800A15p6J95k90lM16m76J99M6K6j75L38l50k47K51P2m7J96J40l74N4k04J46j07
5823a55K37J85k19j93J94k9l14J76K7m2K87o5j29j33L47k64P2j22K69k11L61k45
5845C4o8J85j04k3J53l51L12k26J81o1J28l68J13J92j5j98J70o3k2L5j0J07J2
5868A13P7m28J85L1j28M35l21j39J89j24M3k47L00L2j64J54J44j16j59K75l5l4
5890H3q4j24J42q3jm5r2K79j5J6J00l4j50n8O7M6l1r8jn9N4J81J2r9m2o9J02J81
5918A78j47J9j46Q4J86k28j14J28j67K19p4PJ80j55Mj32J38n0Q9n2J15K0j45K83
5942B40o2k94J73j76K96j4j00o9l1j02K69K0k98J95r0O8q4L2j34J09L1p5n7J0
$$ y = [-41, -91, 146, -151, -12, 156, 83, -27, -67, -87, 168, -29, 64, 73, 24, 117, -20, -219, -75, -40, -178, 116, -14, -16, 81, 115, 39, 234, -56, -59, 357, -119, 80, 126, 152, -23, 315, -35, -282, -31, 41, -6, 190, 330, -44, 10, -194, -48, -155, 82, 267, 48, -145, 49, 20, -294, -118, -91, -133, 154, 89, -40, -173, 174, -90, -18, -140, 129, -82, 279, 34, -34, 151, 47, 24, 177, -174, 138, -88, 93, 32, 160, -208, -95, 97, 82, -116, 54, -9, -31, 4, -6, 101, 113, 190, -238, -53, -22, -150, 285, -36, -175, 14, -110, -67, -314, -14, 18, -146, 8, 152, 36, -123, 152, 117, 83, -1, -125, 17, -66, -67, -112, -204, 75, 60, 76, 176, 142, -8, -66, 1, 47, 16, -82, -83, -142, -88, 93, 105, 6, -36, -105, -3, 178, 31, 50, -96, -12, 174, -54, -168, -40, -207, 12, -62, -55, 125, -30, -26, -158, -20, -70, 19, -33, 82, 102, -43, 240, 178, -116, 57, -119, 177, 163, 63, -6, -37, -139, 130, 150, -148, 47, -43, 25, -59, -27, -161, -52, -21, -96, -153, -143]
5966a43o8L28q8Oj02j01R5K30k67M50l89MJ61n8j43K2P2j4J19K6j30J28k19j1
5990i2K10j24M8j52Q6j59L16j44K0J6K41j72K38m20J05r0K29k6j87J5J23k24P1
6013g2J23j32N6N2j48L2P9k5Q9N4k06K16m5j3j32r6M11j71q9J20j55m8L0K41k32
$$ y = [-143, -211, 117, 29, 35, -67, -168, -73, 157, -110, 340, -49, -45, 116, 58, -85, -63, 9, -5, 114, 140, 10, 138, -81, -92, 118, -6, 42, -110, -24, -183, 133, -11, 9, 25, 266, 94, 332, -88, 17, -73, 156, 130, -57, -42, 81, -143, -72, 51, -81, -25, 27, -121, -89, -10, -35, 54, 108, -98, 118, 73, 60, -72, -168, 243, 72, -17, 103, -52, -100, -70, 171, -61]
$$ [...]
8191B12
##END NTUPLES=NMR FID
##END=
