##TITLE=1H_SR41_oil
 CDCl3,72 sc, 
 2.03.2021
##JCAMPDX= 6.0         $$ Bruker NMR JCAMP-DX V2.0
##DATA TYPE= NMR FID
##DATA CLASS= NTUPLES
##ORIGIN= UXNMR, Bruker Analytische Messtechnik GmbH
##OWNER= root
$$ XWIN-NMR		Version 3.5
$$ Tue Mar  2 13:05:56 2021 Russian Standard Time (UT+4h)  she@DPX200
##.OBSERVE FREQUENCY= 200.1315066352
##.OBSERVE NUCLEUS= ^1H
##.DELAY= (6, 6)
##.ACQUISITION MODE= SIMULTANEOUS
##.ACQUISITION SCHEME= undefined
##.AVERAGES= 72
##.DIGITISER RES= 18
##SPECTROMETER/DATA SYSTEM= spect
##.PULSE SEQUENCE= zg30
##.SOLVENT NAME= CDCl3
##.SHIFT REFERENCE= (INTERNAL, CDCl3, 0, 15.7039)
##AUDIT TRAIL= $$ (NUMBER, WHEN, WHO, WHERE, WHAT)
$$ ##TITLE= Audit trail, XWIN-NMR		Version 3.5
$$ ##JCAMPDX= 5.01
$$ ##ORIGIN= Bruker BioSpin GmbH
$$ ##OWNER= she
$$ F:/spectra/data/she/nmr/H-F/1/audita.txt
$$ ##AUDIT TRAIL=  $$ (NUMBER, WHEN, WHO, WHERE, WHAT)
(   1,<2021-03-02 13:05:12.82 +0400>,<she>,<DPX200>,
      <continue with go, POWCHK disabled, PULCHK disabled
       configuration hash MD5:
       00 E9 B6 7A A2 85 ED C7 34 08 36 98 17 FE 4E 26
       data hash MD5: 16K
       87 EA 16 22 F9 5E 16 96 95 2A 52 B5 2D BA 14 54>)
$$ ##END=
$$ 
$$ hash MD5
$$ C8 68 DF 21 C3 23 F2 9C 92 A5 03 31 9F E3 36 B9
##$RELAX= 
##$RELAX= 
##$RELAX= 
##$RELAX= 
##$RELAX= 
##$RELAX= 
$$ Bruker specific parameters
$$ --------------------------
##$DU= <F:/spectra>
##$EXPNO= 1
##$NAME= <H-F>
##$PROCNO= 1
##$TYPE= <nmr>
##$USER= <she>
##$AMP= (0..31)
100 100 100 100 100 100 100 100 100 100 100 100 100 100 100 100 100 100 
100 100 100 100 100 100 100 100 100 100 100 100 100 100 
##$AQSEQ= 0
##$AQ_mod= 1
##$AUNM= <au_zg>
##$AUTOPOS= <>
##$BF1= 200.13
##$BF2= 200.13
##$BF3= 200.13
##$BF4= 200.13
##$BF5= 200.13
##$BF6= 200.13
##$BF7= 200.13
##$BF8= 200.13
##$BYTORDA= 1
##$CFDGTYP= 0
##$CFRGTYP= 5
##$CHEMSTR= <none>
##$CNST= (0..31)
1 1 145 1 1 1 1 1 1 1 1 1 1 1 1 1 1 1 1 1 1 1 1 1 1 1 1 1 1 1 1 1 
##$CPDPRG= <>
##$CPDPRG1= <>
##$CPDPRG2= <>
##$CPDPRG3= <>
##$CPDPRG4= <mlev>
##$CPDPRG5= <mlev>
##$CPDPRG6= <mlev>
##$CPDPRG7= <mlev>
##$CPDPRG8= <mlev>
##$CPDPRGB= <>
##$CPDPRGT= <>
##$D= (0..31)
0 1.2 0 0 0 0 0 0 0 0.06 0 0.03 0 0 0 0 0.0002 0 0 0 0 0 0 0 0 0 0 0 0 
0 0 0 
##$DATE= 1614675647
##$DBL= (0..7)
120 120 120 120 120 120 120 120 
##$DBP= (0..7)
150 150 150 150 150 150 150 150 
##$DBP07= 0
##$DBPNAM0= <>
##$DBPNAM1= <>
##$DBPNAM2= <>
##$DBPNAM3= <>
##$DBPNAM4= <>
##$DBPNAM5= <>
##$DBPNAM6= <>
##$DBPNAM7= <>
##$DBPOAL= (0..7)
0.5 0.5 0.5 0.5 0.5 0.5 0.5 0.5 
##$DBPOFFS= (0..7)
0 0 0 0 0 0 0 0 
##$DE= 6
##$DECBNUC= <off>
##$DECIM= 32
##$DECNUC= <off>
##$DECSTAT= 4
##$DIGMOD= 1
##$DIGTYP= 9
##$DL= (0..7)
0 120 120 120 120 120 120 120 
##$DP= (0..7)
150 150 150 150 150 150 150 150 
##$DP07= 0
##$DPNAME0= <>
##$DPNAME1= <>
##$DPNAME2= <>
##$DPNAME3= <>
##$DPNAME4= <>
##$DPNAME5= <>
##$DPNAME6= <>
##$DPNAME7= <>
##$DPOAL= (0..7)
0.5 0.5 0.5 0.5 0.5 0.5 0.5 0.5 
##$DPOFFS= (0..7)
0 0 0 0 0 0 0 0 
##$DQDMODE= 0
##$DR= 18
##$DS= 0
##$DSLIST= <SSSSSSSSSSSSSSS>
$$ [...]
##$SUBNAM2= <"">
##$SUBNAM3= <"">
##$SUBNAM4= <"">
##$SUBNAM5= <"">
##$SUBNAM6= <"">
##$SUBNAM7= <"">
##$SUBNAM8= <"">
##$SUBNAM9= <"">
##$SW= 16.9725356469052
##$SWIBOX= (0..15)
0 0 2 0 0 0 0 0 0 0 0 0 0 0 0 0 
##$SW_h= 3396.73913043478
##$TD= 16384
##$TD0= 1
##$TE= 0
##$TE2= 300
##$TE3= 300
##$TEG= 300
##$TL= (0..7)
0 120 120 120 120 120 120 120 
##$TP= (0..7)
150 150 150 150 150 150 150 150 
##$TP07= 0
##$TPNAME0= <>
##$TPNAME1= <>
##$TPNAME2= <>
##$TPNAME3= <>
##$TPNAME4= <>
##$TPNAME5= <>
##$TPNAME6= <>
##$TPNAME7= <>
##$TPOAL= (0..7)
0.5 0.5 0.5 0.5 0.5 0.5 0.5 0.5 
##$TPOFFS= (0..7)
0 0 0 0 0 0 0 0 
##$TUNHIN= 0
##$TUNHOUT= 0
##$TUNXOUT= 0
##$USERA1= <user>
##$USERA2= <user>
##$USERA3= <user>
##$USERA4= <user>
##$USERA5= <user>
##$V9= 5
##$VALIST= <valist>
##$VCLIST= <CCCCCCCCCCCCCCC>
##$VD= 0
##$VDLIST= <DDDDDDDDDDDDDDD>
##$VPLIST= <PPPPPPPPPPPPPPP>
##$VTLIST= <TTTTTTTTTTTTTTT>
##$WBST= 1024
##$WBSW= 4
##$XGAIN= (0..3)
0 0 0 0 
##$XL= 0
##$YL= 0
##$YMAX_a= 91901
##$YMIN_a= -31474
##$ZGOPTNS= <>
##$ZL1= 120
##$ZL2= 120
##$ZL3= 120
##$ZL4= 120
##$ABSF1= 10
##$ABSF2= 0
##$ABSG= 5
##$ABSL= 3
##$ALPHA= 0
##$AQORDER= 0
##$ASSFAC= 0
##$ASSFACI= 0
##$ASSFACX= 0
##$ASSWID= 0
##$AUNMP= <proc_1d>
##$AZFE= 0.1
##$AZFW= 0.1
##$BCFW= 1
##$BC_mod= 2
##$BYTORDP= 1
##$COROFFS= 0
##$CY= 11.3945322036743
##$DATMOD= 1
##$DC= 2
##$DFILT= <>
##$DTYPP= 0
##$F1P= 15.9154993809931
##$F2P= -4.1035820241983
##$FCOR= 0.5
##$FTSIZE= 0
##$FT_mod= 4
##$GAMMA= 1
##$GB= 0.15
##$INTBC= 1
##$INTSCL= 1
##$ISEN= 128
##$LB= 0.24
##$LEV0= 0
##$LPBIN= 0
##$MAXI= 10000
##$MC2= 0
##$MEAN= 0
##$ME_mod= 0
##$MI= 1.114404
##$NCOEF= 0
##$NC_proc= 0
##$NLEV= 6
##$NOISF1= 3.799351
##$NOISF2= 2.8
##$NSP= 1
##$NTH_PI= 0
##$NZP= 0
##$OFFSET= 15.70392
##$PC= 1
##$PHC0= -10766.58
##$PHC1= 19.80094
##$PH_mod= 1
##$PKNL= yes
##$PPARMOD= 0
##$PSCAL= 0
##$PSIGN= 0
##$REVERSE= no
##$SF= 200.130013532006
##$SI= 16384
##$SIGF1= 3
##$SIGF2= 2
##$SINO= 400
##$SIOLD= 16384
##$SREGLST= <1H.CDCl3>
##$SSB= 0
##$STSI= 0
##$STSR= 0
##$SW_p= 3612.71676300578
##$SYMM= 0
##$S_DEV= 0
##$TDeff= 0
##$TDoff= 0
##$TI= <>
##$TILT= no
##$TM1= 0
##$TM2= 0
##$TOPLEV= 0
##$USERP1= <user>
##$USERP2= <user>
##$USERP3= <user>
##$USERP4= <user>
##$USERP5= <user>
##$WDW= 1
##$XDIM= 8192
##$YMAX_p= 0
##$YMIN_p= 0
$$ End of Bruker specific parameters
$$ ---------------------------------
##NTUPLES= NMR FID
##VAR_NAME=  TIME,          FID/REAL,        FID/IMAG
##SYMBOL=    X,             R,               I
##VAR_TYPE=  INDEPENDENT,   DEPENDENT,       DEPENDENT
##VAR_FORM=  AFFN,          ASDF,            ASDF
##VAR_DIM=   8192,          8192,            8192
##UNITS=     SECONDS,       ARBITRARY UNITS, ARBITRARY UNITS
##FACTOR=    0.0002944,     1,               1
##FIRST=     0,             0,               0
##LAST=      2.4114304,     0,               0
##MIN=       0,             -31474,          0
##MAX=       2.4114304,     91901,           0
$$ Real data points
##PAGE= N=1
##DATA TABLE= (X++(R..R)), XYDATA
$$ [...]
2718b90m74Q91j92j88m65n7N24k55pm32j11J020k17L95k59p99P69K17m61n73O07
2739c57l56n2M62J36K75K04q38q2P67l70K71O99L8j73O2k63N11J11n33L82j47
2760G47r95P04L7k83R22o00l43K14q2J41k87R7j61Q81n82m27J045r75M82l32M33
2781F36K34j293P19j359J163k22o28J44K78k8j32j12NM16K32k32L0l19L17k46
2801c97l88j22L48n35L77N49p37K19l37Q91p48K98K27m00L76K24j19O70r86O30
2821D0l10L76J51M2m8k89K72l52O57n34J349j95q44L42jj097P26O08q12K32m32
2842a19O13M44p07p36J119m87r8N83r05L91k54K5P17j74n85M87k38k19k71Q46
2862D32J7r85l69L29k8N21p9n18j0j62l05P50r23M98O6r49R66P86r23n79P07O38
$$ y = [-290, -764, 127, -65, -253, -718, -775, -251, -506, -513, -945, -1056, -36, -253, 142, -117, -916, -147, 70, -391, -964, -357, -713, -765, -303, -167, 108, 312, -526, -608, 159, -211, 60, 759, 797, 624, 686, 423, 934, 1045, 512, 894, 747, -248, 456, 493, 210, 1132, 532, 189, 403, 321, 462, 175, 272, 111, 992, 410, -17, 1028, 53, 535, 203, 636, 870, -423, 296, -1063, 100, -122, -750, -606, -328, -356, -488, -600, -595, -179, 53, -179, -149, -468, -151, -397, -785, -907, -559, -1094, -717, -168, -905, -686, -1023, -132, -880, -582, -355, -755, -379, -155, -274, 396, -590, 40, -270, 106, 257, 299, 251, -38, 234, -118, 539, 5, 1354, 1159, 315, 657, 656, -441, 285, 893, 81, 313, -119, 494, 938, 231, -505, 614, 127, 29, 612, -293, 98, -156, -131, 586, 412, -173, 314, 76, -143, -414, 432, 449, -536, -905, -576, -604, -83, -162, -680, -690, -852, -1157, -407, -1330, -832, -766, -1715, -749, 37, -886, -1465, -758, -120]
2884a20Jj706K168o2k99N14p86J33L91p20R40j15M21l19n05L52N17p4o25K35J261
2905A602j705J32P00q10O66r0J64l7m31M49L6o49M63m27P15q44P77k59N21r35
2925C8N11n96q6j94P38Q1j088O05L77o84M95n52K04l63K24k54j25K43j92K36o0
2946d42L22q04P46l55R83j414M44M95m02R18j106j43K92k89K51k32N54l7q69J082
2966fn41K17J06L03n31O99J96m44K65m57J164j122N62P39k89m36J75j11Q1m24
2986A46Q62O3p95K64j72K42N20j55o23p06J436p81J054p85l55l60Q43l72m74K38
3006I0O99j27m57j037l17R36K58m62l5M42j162J344j90N61j378O05Q5p72J029
3025A12n94l14N83o39P2L21J10K25o57P18R5P4J53p89p83J269n8L89l98J03k69
$$ y = [-120, -119, -1825, 343, 281, -18, 496, -290, -157, 234, -486, 454, 339, 760, 441, -64, 288, 805, 731, 106, 341, 1602, -103, 29, 729, -81, 585, 495, 659, 622, 191, 640, 676, 27, 490, 63, 778, -66, 711, 452, 973, 38, 549, -47, -133, -327, 411, 492, -596, 9, 386, -298, 197, -355, -151, -514, -290, -544, -669, -426, -618, -382, -442, -120, -924, -178, -533, 450, -964, -520, -25, -427, 491, -615, -758, -466, -755, -504, -736, -182, -219, -1088, -6, -547, -330, -224, 79, -452, 247, 443, -1, 264, -193, 971, -151, 411, 1150, 861, 425, 600, 489, 570, 146, 1008, 1071, 276, 540, 368, 610, 1130, 975, 352, -354, 1082, 301, 1355, 570, 215, -145, 698, 326, -148, 90, 789, 662, 205, -832, -1149, -213, 45, -417, -452, -10, -1172, 172, -18, 543, -835, -230, -145, -917, 112, -482, -796, -213, -852, -780, -459, -349, -124, -781, -63, 32, 106, 259, -530, -1313, -44, -102, 287, -111, -8, -277]
3046b77q46J206O47l44q87Q56L07n08P01j34m05N16M2R4j62K80q56n1n68J201
3066H12q63N72o31J339j422O82j03o82M69m78O51M5m23L38n83k76O91k42m33P17
3086A80N99m55m22l55L94n78Q08o4j307rJ138k12m2m57K86M83k26m90K74N00R0
3107A35n53R28j254N21N4R5k39n54L7N33n63J338j132N15q3M7L32N46n03J54J74
3128E28l25J74q3K87p52M44O81p68j29R09j037J256j699M24J148K96l48n78O00
3147A028n52L17j055K97R29j186Q31l20j383J413N2r89m14J574J06q14J19L27
3165B80k82l07n29J103j063K61m67O75K17N0M2l68p44K45P27n27O66p19P77R4
3185A31n45q2M15l52O10Q62j181J1K25o88R17l37o0k01j67R11k74J66J60K08o64
$$ y = [-277, -1123, 83, 730, 386, -501, 355, 662, 154, 855, 721, 316, 832, 874, 968, 806, 1086, 230, 179, -389, 812, -51, 521, -110, 1229, -193, 489, 386, -296, 173, -305, 346, 391, -32, 306, -277, -553, 138, -104, -537, 180, 779, 324, -98, -453, -59, -637, 171, 107, -1200, -1209, -71, -283, -325, -782, -496, -13, -239, -729, -455, 45, 135, -418, 510, -744, -223, -169, -74, -313, -867, -830, -297, -860, 478, -654, -139, -222, -175, 157, 703, 200, 354, 528, 203, 377, 294, 581, -171, 273, 954, 186, 57, 966, -71, 1185, -514, -90, 1058, 1354, 1006, 428, 1028, 476, 793, -262, 35, 964, -222, 609, 289, -1094, 319, 371, -618, -1032, 542, 648, -166, -47, 280, -2, -309, -838, 265, -798, -537, -1004, -329, -112, -62, -20, -388, -1132, -887, -160, -687, -21, -740, 37, 131, -414, -496, -81, -433, 177, 1039, -142, -131, 94, -594, 323, -14, -74, -275, -442, 469, 195, 361, 521, 729, 65]
3206F5j74j90P42o09J586j953J097p4p59N56q7J065j081J39m91J017j366k6J074
3225E31q30m5O29O27p11k9k59r58P1n88J094J58q34J41P35K77o32P66r9j362J215
3246a03j17L4j033L76K20O09j138J063j253J419k30q11M94J65k42P72p99P85L97
3265F08l17m91J05j09n1K38Q51Qn32R24j228P9N04l82J50K41L0o41K47m6M30L40
3287I58m44J59k78n46J4J00K28J037m24j38p66L30J03N1K28q83M74n01M18R5k24
3308iJ96L28p37M84q61L55n19N99k1m76K16j67J14N6k63J16P9N5p3J86j80K21
3330c01K7n07Q36M73o02L14j68k61n5p9o55J280j223J507o18L54j11j37m19L94
3350D9n1J82M79k85k35N2K90K37k60J82k63l6m90j86Q92n54L05K97k75N90o31
$$ y = [65, -109, -299, 443, -166, 1420, -533, 564, 490, -269, 287, 200, 1265, 184, 323, -168, 849, -517, -543, 531, -299, -344, 285, 912, 201, 172, -87, -1045, -974, -1562, -468, -310, -1144, -1003, -268, 9, -623, 143, 44, -1318, -103, -220, -186, -1219, -843, -623, -14, -1152, -89, -1342, 77, -153, -964, -470, -305, -547, 225, -574, 211, 608, 291, -200, -95, -204, -255, -17, 834, 842, 310, 1234, 6, 85, 589, 207, 357, 598, 628, -13, 234, 188, 618, 958, 514, 673, 395, -151, -137, -37, 191, 1228, 804, 666, -100, 230, 333, 384, 612, -271, 203, -298, 120, 215, -9, 187, 515, -222, 262, -599, -244, -763, -164, -185, -661, -445, -612, -498, -442, -705, -589, -510, -455, -528, -342, -522, -301, -274, -781, 55, 528, -74, 240, 72, -189, -244, -323, -978, 302, -921, 586, -32, 322, 211, 74, -345, 49, -2, 180, 659, 374, 139, 191, 481, 718, 458, 640, 377, 341, -149, -335, 557, 3, 308, 605, 330, 920, 289]
3371B89q00O52L29kQ6p67j07J039j327J13J127r81m28J033n45j21L47j7N47p87
3391c20J92q50K15K94j05L17m3k65K55N4N09q48l84R50p41N93M4l07N84n43P6
3412c23M15m37m20Q55N09j29L09l28l17j15P31q76J067j164M51k24P00o29L99
3431D74m39M82K46o64K74p2Q8m45L75j88M08j44J83L29q82j70J65q49P53M38j41
3452B21l65k34Q43r50R05j061M00r7j70n80P53K52K82m04J04l11K35K97p41n17
3472a138M63Q60m21n33R47o28J71o36N17M51n75O15m42N07p42O61l47J74O59l47
3492B16p90Q91L03q34N76m27O56K15p38L13m4j15M58o66rL77M3j53O1k15k74J88
3514C2J85L46k42P86r68Q0j33L85n31L77K14j426M48J03R3L0rn46k95R84K02L69
$$ y = [289, -511, 141, 470, 468, 554, -213, -320, 719, -608, -495, 632, -349, -777, 256, -289, -410, -63, -80, 467, -320, -128, -978, -763, -469, -574, -257, -300, -565, -310, -256, 253, -595, -979, -29, -770, -177, -133, -440, 144, -399, -323, 92, -345, -765, 90, 599, 470, 779, 451, 134, 19, 750, -126, 941, -223, 228, 4, 704, 75, 474, 35, 517, 763, 99, 373, 301, 389, -56, 319, 131, 539, 395, 578, 907, 25, -145, 20, -829, -76, 362, 221, -144, -378, 465, -485, 420, -641, -241, -338, -508, -1088, -335, -83, 199, -205, -101, -412, -177, 120, -621, -1138, -675, 185, -236, -769, 178, -450, -279, -915, -398, 53, -522, 93, -349, 158, -584, 77, -270, -96, 563, 216, -574, 317, 620, -214, 362, -65, 591, 806, 68, 381, 337, 222, 680, 14, 5, 382, 425, 272, 333, 118, -156, 32, 217, 563, 321, 1107, 139, 219, 86, 471, -60, 317, 531, -895, -447, -344, -251, -221, -230, -776, -1071, -87, 115, 484]
3536D84j118k74J210k49J57l13r76O50k61N12J49r99P35j4Lk22N30n09Q7K31K07
3557B0j68j57n00l50R50j60M22m95P19J70m66o13J258o82j30P95k91J31R37q94
3577D96R2m97O3J84J46n73R98n75J34l47K04J83l66l07J57L82L68J80m88M62n25
3598C71p47l27J050j24j9l58o93J865j498L32o70N38j56J13P75n27K98k55p41
3617g73J148l20p97M36M65n41PN27p00O27q06J40K6k17L57l34M56P84j080Q02
3637B07l12l31J56M82M45q77K61M17K99p15P41P2m03l89L00K24k31O08j379R13
3657D88r0p80K09J044p39O87l76K59m31N90p60N88k8p23J52pj55L46m05M11m89
3678b09P09k23n78J55j98r7k95r6R54p70M52o5j09l4K75N92q55n7K45N43m30k07
$$ y = [484, -634, -908, 302, 53, 210, -103, -1079, -429, -690, -178, -29, -1028, -293, -307, -304, -526, 4, -505, -418, -187, 20, -148, -305, -805, -1155, -205, -365, 57, -438, 281, 451, -15, -628, 630, -52, -182, 613, 322, 453, 1390, 496, 588, 91, 154, 338, 484, -89, 909, 334, 468, 121, 325, 508, 142, -165, -8, 374, 742, 922, 434, 896, 371, -376, -703, 347, 223, 204, -154, -847, 1018, -480, -148, -818, -280, -436, -323, 452, -75, 223, -32, -773, 375, 55, -742, -306, 159, -382, -375, 152, -548, 79, -727, -587, -561, -778, -421, -755, -299, 485, -595, 207, -105, -436, -280, 202, 647, -230, 31, 448, 747, 32, 773, 845, 442, 53, 353, 577, 346, 954, -425, 488, 398, -382, -173, 871, 132, 819, 443, 702, 271, 861, 101, 689, 661, -62, 90, 83, -72, 274, -131, 280, -209, 500, 277, -301, -146, -344, -441, -736, -832, 122, -648, -196, -261, -370, -404, -129, 463, -392, -449, -204, 339, -91, -298]
3700b98mJ27m39n2L24l80j97J319k94K12q73N96j43L52k94k14P55n65k53M15m27
3721c33N25k00M47j87n04M29L11j22j252J142M89l00k29NL03m61J58j50J97M16
3741F84l23O55r74M91k17l47j76K49M55j91j67j2o72J93Q62M2J34p82l02Q76l39
3762A39p0p9k34J77K95l46L8P89j543P32N33r40J124q54Q7k90Q20r95M20K78p20
3783f39J8P78K82o40Q6J22P4k7N12m69J0k09N14j082P48M49m24O66o63J90L15
3804F11j77n61K76K2M98K55l62m81P09J84q55j05j76M50m72j95L9J5O06n95J30
3825a84P89r91J50l28J666j002Q6o63N95m94k40K02J208q62o3l0Lj184O94Q61
3845B13j919J006O80q09n09M47lJ193j043L61L51l18p85J607L4J67j164Q37m74
$$ y = [-298, -302, -175, -614, -666, -342, -722, -919, 400, 106, 318, -555, 41, -102, 250, -44, -258, 497, -68, -321, 94, -333, 192, -8, 439, 252, -252, 177, 488, 366, -886, 256, 745, 445, 216, 221, 524, 63, 221, 71, 268, 684, 361, 1016, 42, 533, 316, -31, -207, 42, 497, 306, 139, 127, -545, -352, 510, 552, 686, -96, -398, 478, 139, 69, -10, -244, -67, 228, -118, -80, 709, -834, -102, 431, -509, 615, -239, -152, -442, 378, -617, -197, 81, -639, -621, 157, 439, -201, -115, 7, 81, 54, 566, 97, 107, -102, 412, -670, 78, 527, 103, 769, 106, 296, 611, 434, -127, 149, 171, 669, 924, 562, 81, 790, 974, 119, 14, -162, 288, -184, -379, -340, -325, 281, -314, -184, 605, -386, -236, -564, 1102, 100, 186, -477, 118, -376, -616, -414, 794, -68, -131, -161, -158, -1342, -648, 213, -1706, -700, -20, -829, -1338, -891, -894, 299, -744, -383, -32, -350, -1135, 472, 506, 673, -491, 346, -128]
3864a28N88j417l57J429r97P83mR16m95L31k16r6m0q14O63m41M89L3o04L72O41
3885F36n50k91J088j463J150J05p66J72M67r05O28R8m31l78K60L65o63J359j279
3904c98l1K36j46K37M02j104l2K77l23M27J140J25j085Q67p45L19N76j030Q45
3923E57j033P98q38M32P90j015M72N0R3q29J112j417J055L04k30K16l84o44J331
3942H20r02P7N92o07nL20N04j82p37J037l06r01J387j256L83k70j01K68J4j13
3962B2K8O99m44J51m16j44L55m86Q29k63j96k55K64k05N30m39q78Q18j70O25J76
3983F01j073L74L29K16j025O32M0o68N04l5O60j290J22K75J84n92J101m98o9n03
4003g15j97R53l52K26N12p74O28q36R48k92J12j00L56r3j91k66M75n86K35J313
$$ y = [-128, 460, -957, -1314, 115, -882, -99, -103, 813, 318, 649, 433, 337, 297, -517, 146, -295, 194, 227, -377, -5, 636, 86, -205, 883, -580, 570, 675, -91, 81, 548, -357, 271, 369, -62, -440, -180, 185, -478, 881, -398, -429, -193, -339, -102, 300, -804, -836, -559, -882, -455, 685, 810, -275, 592, -153, 166, 742, -288, 557, -476, 322, -516, -84, 706, -309, 163, 213, 306, -523, 589, -828, 227, 531, 301, 517, 133, -511, 820, -82, -5, 587, -20, -25, 295, 799, 617, -120, 917, 611, -290, 1097, -159, 224, -46, -147, 121, 135, 22, 50, 749, 305, 456, 40, -104, 251, -235, 594, 331, 135, -120, 144, -61, 469, 30, -848, -30, -200, 425, 601, -472, -98, 231, 447, -578, 54, 94, -574, -70, -105, 555, -735, -613, -338, -154, -746, 355, -143, -212, -715, -912, 41, -311, -85, 427, -347, 281, -555, 393, 101, 213, 113, 469, 376, 185, -81, 394, -192, 43, 1356]
4023A356j565O00n68l8P58r6L57k96l94K8K40q59P72N43l68nq68M36k19L34J48
4044B96q4j89n24O04q26N05N30r27k6O73J26n79J035j506J410j039P38n30M66
4063A53o81M38p0L10l47r5q3O1L06m42l98Q88O3k68k06r1M29l06j49q0R59p83
4085c92P67k07J49q35k68Q57j24K33N67j118P77j09J65o21k88K23K62M90k76L
4105B55l26N06l03O40o54M85m81Q32n41k97k2L45q43J057k44q87N83M37j67q68
4125d93K33M3k76j01K81O39j185R50m35M51j08o09l37M69p6M34n15K78K21k13
4145c49l87J275o70k24J91J02l49J082p50j90J99n88O83l99J3k29L50j24M9N8
4165b57M51o94R91q41K19L55m85N6M92L90j88L50q19O02m50n5l30L08N77n39l89
$$ y = [1356, -209, 391, -177, -215, 543, 447, 804, 508, 114, 142, 382, -477, 295, 838, 470, 465, -403, 33, -186, 148, 296, 212, 23, -501, 103, -723, -218, 312, -615, -641, 32, 158, -421, 614, -892, 518, -521, 217, -313, 153, -528, -90, -160, 150, -197, -292, -375, -314, -8, -450, -848, 40, 103, -165, -371, -462, -33, -339, -488, -568, 391, -392, 375, 168, 317, -518, -786, 71, -53, 180, 747, -371, 406, 297, 462, -159, -447, -224, 38, 528, 252, 255, -71, 435, 132, 772, 118, 603, 122, 954, 413, 116, 94, 439, -404, 653, 409, -478, 105, 542, 375, -493, -260, -217, -493, -594, -313, 326, -859, 91, -344, 107, -1, -610, -947, -478, -554, -120, -635, -357, -136, -349, -736, 539, -131, -355, -164, -62, -411, 671, -79, -269, -70, -658, 25, -374, -361, -590, -240, -364, -315, -257, 194, -500, 491, -350, -131, 224, -261, -205, 287, 677, 489, 839, 20, 622, 172, 117, -213, 95, 672, 133, -256]
4186b56M67Q1K3m15J99M21j140J281o12Q9N09R9r29N02j79Qm98l35O74j175M32
4207g54J299m93Q28j478O34P0n43P6M09L55j014J260j037L9K69j85L64p4J7m4
4227bj1n78P73n04L14L74j787J183j49J9j51R96p7r11J275j304P96n35J265m81
4247E05m70qQ20j77n53j021J243q64Q34j79o20N65m30N27N79o50J15k22k30L26
4267I0K13k14P84k98l62n4J56J28j100M43j20J45L05n87K89n81P87Qn33L52K15
4288F6M76j829J198L35j12k00q06N27r0O1L78j70K81J48m40L58o63R51j35nk69
4309F0m2o10P62m58J90K07l53J171p52l68L81j55J02K64k26l11P37j22o05N01
4329C73o73J109j605K36J163l23o55L05n80Q54R6l6n80O01M7k77N1j36j25R29
$$ y = [-256, 211, 292, 315, -100, 99, 520, -620, 661, 49, 138, 647, 746, -183, 319, 140, 148, -350, -685, -11, -1186, -754, 545, 52, 880, -598, 36, 106, -437, -361, 48, 403, -611, 649, -388, -349, -80, -265, 99, 25, 42, -2, -13, -591, 182, -322, -8, 366, -1421, -238, -387, -368, -519, 477, 400, -511, 764, -540, 256, -279, 986, 505, 35, 27, 847, 670, 117, -904, 339, -525, 309, 130, -490, 75, -355, 172, 751, 101, 216, -6, -236, 90, 303, 89, 873, 575, 213, 159, 315, 443, -657, -214, -334, -189, 116, -471, -182, -763, 24, 32, -501, -149, 66, 542, -1287, -89, 246, 134, -66, -872, -345, -435, -374, 4, -166, 115, 263, -177, 181, -482, 469, 334, 329, 60, 18, -592, 170, -288, -98, 109, -244, 927, 175, -193, 188, 33, 135, 399, 173, -138, 599, 477, -128, 373, -300, 809, -796, -560, 603, 280, -375, -70, -650, 204, 300, 264, -316, 285, 332, 55, 106, -30, -155, 774]
4349G74j335J79M94q30R98k76l49l56N98j23M30j395R69K05M8K15q46N86j004
4368a018J03K10J6j27O81P2J78j93m50J582j201k24O88q45N60PK45k86p51P08
4388d5K23r7O82j284N92m14J30k07J672j429J79L86K0O50j290J161j120J15LR62
4408H89j507J184l27r55R69r54J013m22r54J803N86j077j093Q18M80j004L72J62
4426a7P59j437O97P1j71o88K09P14K79l77n74O03q15N27o07J287n56j80q41J176
4446E9j301N58L92j034J933j300J231m26L26m28M94o82N41j014N59j09K56K30
4464B85m65O26n1o49J37O47m41Q0l53J527r80j33q4L11l55J14J80l05R8j30M37
4485D96r43L18Q28j143J48J64R37Q30j820J39N65l33o1q66J410p38M26m53J95
$$ y = [774, -561, -382, 112, -718, 280, 4, -345, -701, -103, -226, 204, -1191, -222, -17, 31, 246, -600, -14, -1018, -915, -705, -689, -816, -135, -63, 115, -78, -528, 1054, -147, -371, 317, -528, 32, 39, 284, -2, -753, -45, 178, 81, 763, -521, 71, -343, -213, -420, 1252, -177, 2, 388, 408, 1058, -232, 929, -191, -76, -73, 889, -618, 566, 239, -716, 253, -701, 312, -110, -1064, 739, 1325, 248, -845, -27, 453, -551, -179, -17, 742, -695, 2, 73, -98, -786, -577, 137, 416, 39, -535, 68, -747, -220, -827, 460, -96, -276, -1117, 59, -1242, -684, -292, -1326, 607, -693, 538, 112, 438, 10, 504, -178, 363, -651, -92, -201, 55, 285, -180, 446, 395, -254, -117, 530, 89, 169, -184, 1343, 363, 230, 146, 457, 102, 216, 396, 91, 189, 59, 496, -447, -129, 699, -444, -296, -132, 805, 1635, -185, -46, 519, 186, 125, -741, 669, -69, 357, -96, 99]
4504I9J20r23J876n90q25J363j843J242K71k188K133j465O24L23J420k391R95
4521B41j276P00mJ275p82P34r62O9k44J470j368q79R99J97N71r95N88j82P08j583
4541g23R60K90l77l46L30J34J19l94O40P6q5m84n98K34J200o94K72P80j302N92
4561F24j050J295p38K89L91L1J80j218M9N5j69J93k15Q45m18l09N21m66Q45p61
4581b6M43n87M14l27j107J372r16j78J118j98K4m69L86q3P18j186J00Q68q19q6
4601e39M61K29k00j77P44m01o30N50m89J13Q28K92l29p76Q66o93K00p28J045L55
4621G21l88l98n20Q32l03P74n11J493k26p96q08N42j46j72O67P4o34L34j113P68
4641A90o20N75ro66J02k17O29K25q87J179m88q65K57J301n38j94p47M78j27r8
$$ y = [99, 219, -704, 1172, 582, -243, 1120, -723, 519, 790, -1398, 735, -730, -106, 217, 1637, -754, 241, -1035, -335, -339, 936, 154, 888, -74, -5, -249, 1221, -147, -1026, -27, 170, 741, -254, 334, 152, 860, -723, 237, 527, 150, -196, 134, 268, 387, -7, 633, 709, 624, 140, -458, -224, 976, 282, 554, 1334, 32, 624, -426, 869, 131, 420, 811, 842, 1022, -196, -147, -92, -261, -68, -283, 562, 144, -165, 356, -110, 735, -26, 417, -170, 244, -83, -1190, 182, -734, -912, 206, 8, 32, -437, -51, -134, 584, -602, -502, 366, -453, -539, -78, 151, -49, -226, 518, 117, -513, 37, -452, -339, 489, 781, 452, -324, 542, -151, 49, -679, 366, 721, 333, -65, -585, 247, -56, 718, 207, 1700, 1474, 678, -130, 412, 266, 94, 761, 835, 201, 535, -578, 190, -430, 145, 136, -530, -428, -645, -16, 209, -678, 501, 13, -852, -595, 706, 168, -26, -773, -295, -422, -520]
4661e20p2J080r20l0N02k74j43M48j69k02J373j563Q41ll66k53Q2K72L45j86j6
4682B26l50n38J636j411R90l05L74m91K01k50p18J122o59N84k72J04l17L14N29
4701G69j148j13M46j35l28K94J20q2Q00j088j79J197p71j42Q66l47M41r78M21
4720D3J079p70o45n58Q31j09K42j17O68p75M61J42l02m82k23Q89n68P51l50M87
4740F94q29N0J153j113P3Q74q61J1Q76j240K82J015k458J316K02o7m32Q93n29
4759i0n56Q01J41n36K31M27j091Q03M10k03n82O99J95k97P7q62P56l73J51j8P34
4780H17j034O12j1o29O95n18R82j135R48o7l33l99L86m19l20J22K5k26j63R65
4800B98j306P87l5K85l72O52r29K40J28m91O52P41q08J83l61L02J33n09O0O26
$$ y = [-520, -592, 488, -432, -462, 40, -234, -377, 71, -98, -300, 1073, -490, 351, 348, -18, -271, -189, 83, 428, 242, 226, -124, -662, 974, -437, 553, 248, 622, 131, 332, 82, -636, 486, -173, 411, 139, 243, -74, 240, 769, -379, -492, -46, -181, -509, -215, -95, -177, 623, -465, -644, 553, -218, -360, 506, 159, 600, -378, 43, 1122, 352, -293, -851, -20, -129, 113, -4, 664, -111, 350, 492, 190, -292, -515, 374, -194, 557, 207, 694, -135, -85, 1068, -45, 28, 902, 41, 52, 928, -312, -30, 985, -1473, -157, 45, -22, -454, 439, -90, -646, 155, 296, -240, -9, 418, -673, 130, 540, 337, -245, 454, 649, 352, 429, -433, 323, -50, 101, 83, 817, -217, 395, 384, -245, 450, -68, 914, -221, 727, 660, 327, -72, 314, -105, -425, -303, -278, -504, -667, 298, -1008, -221, -256, 29, -343, 309, -620, -380, -252, -743, -91, 650, -158, 25, -336, -34, 99, -410, -350, 276]
4820B76j64k28J16k84P52r12R08k61J68%K80o08j97j53M45l71N68l23N95j151
4840e44J2K29j22M88j55M24N93o11l36l11M67n74N73J42K61k74r24Q10p77J184
4860E55q35L55L16k12P37p51m06Q07p38m98J015o7J91n29n32Q44k82J30rn46K97
4881a58K86L57l46K3q35J031p93J53O5L18J99l58l7l00J029j126O04k15M4q1K98
4902A58r3K23P3J54k70m7Q2K07j346R47K44N60p31p23R16q2k86N2J80K19k20O47
4924H64k38J99q73J046N3j196J1K34j66O69j383Q93N29j58N41j221Q33n48O87
4943G76n04j309R65K85n25l82L61L97j99n05J888j998l75J177p48J30m56R60o04
4962f66P99O13j780O47J97K46L65p83J97n13K1R23p42J27m00J203l37K69q54P03
$$ y = [276, 112, -116, 0, -284, 468, -444, 464, 203, 371, 371, 651, 43, -154, -307, 138, -233, 335, 12, 607, -544, -532, -303, -425, 63, -92, 332, 925, 314, -22, -333, 134, -440, 133, 275, 536, 262, -662, 148, -629, 555, -280, 75, 391, 179, 916, 165, -241, 566, -172, -670, 345, 278, 469, -60, -592, 252, -30, 100, 91, -455, -158, 128, 485, 139, 162, -673, 358, -435, -282, -217, 101, 300, -58, -95, -395, 634, -492, 112, -103, -59, -140, 158, 65, 288, 361, 515, 245, 198, 280, 487, -859, 88, 332, 892, 161, -562, 354, 272, -14, 38, 218, 437, 217, 864, 626, 825, -48, 998, 1051, -145, -134, 100, -66, 603, -780, 113, 642, 484, 1025, -196, 637, 89, 776, 272, -1037, -72, 213, -312, -694, -333, 64, -135, -640, 1248, -750, -1125, 52, -696, -566, -1022, -62, -666, 133, 746, -1034, -387, -190, 56, 421, -362, -165, -678, -657, 266, -476, -349, -749, 454, 117, 386, -468, 235]
4982B35k37Q2L11m41q9J497p95l74m29P72N80j339j87J368j732J65J249o25J40
5001A51L05q47R63p49L75j74o54J516n55k31J01m83j63L50j88p75J603n0q62M2
5021c25Q05q69J163q47L44n50k77K11O57o99M94k59p07J014l76M85m78O66n46
5040i4J3k39R7j30q1O91q69P32n28J99n0k6K29N06k84J89j183M17O62j90n70R05
5062C96n13N95Lq0K71j09J9j48l90m70n9O15L9k43l65P48N3J2o65l9Q51l08m13
5085b00J60N35m88l35Q49j96k09k19n2J04M70l68Q6j25K27j145M71J37L92M81
5105E75j169P96k38q1J36M3j15K39K82l70p64P99o0N91j067P39k44m92M12l67
5125c55R4j07L75j029O48O3J72l4q7m4j43l52J663J4j182N6L35k79O56p78K89
$$ y = [235, -2, 80, 391, -50, -139, 1358, 563, 189, -240, 532, 1112, -227, -414, 954, -778, -613, 636, 11, 151, 456, -391, 572, -177, 198, 24, -630, 886, 331, 100, 201, -282, -445, -95, -283, -1058, 545, 495, -367, -325, 480, -389, 774, -73, 271, -279, -556, -345, 312, -387, 107, -152, -859, 155, -221, 264, -214, 452, -94, -81, -320, -223, -353, -434, 257, -612, 120, -408, -209, -259, -285, -56, 450, 166, 355, -828, -411, 251, 61, -509, 396, -117, 478, 481, 401, 672, 563, 582, 434, 44, -426, -485, 130, 169, -74, -439, 309, 362, 374, -291, -330, 521, 213, -200, -40, 495, 7, -328, 521, 325, 116, -103, -155, -51, 419, 51, 137, 12, 239, -906, -435, -298, 94, 575, -594, 202, -36, -117, 19, 62, -53, 186, 468, 98, -666, 133, 73, 664, -403, 336, 92, -400, 12, -355, -261, -368, 7, -1022, -374, -311, -139, -173, -260, -304, -447, -799, 864, 878, -304, -248, 87, -192, 464, -314, -25]
5146b5J28K08j039J135J44q63L97l65n49R37l01P3j9n77L96J74O0l01J145j286
5166e28M41R06j018N64q12J336j342J66L12j436J620M60j173M48l53N21L30k01
5184B41q65J057j96K24l37M70q65M72K81r99R19p85P82m61J51L01p34K60p03Q92
5204A05L74n12ol59K25K06K15k00o56N33K62k16J57K95p45R87m38L18K92r03L06
5225B40j90k13P05K28n90n41P37n28L77m15J13o35P30P65p59j23j12o17M26Q8
5245c14K03J62l24M20l13R4j05R4N40m41J14n23l1j43O83J13K63K77q46O42n0
5266E15R2m94j83K56k68l20N91O1P34r73j85K70n47L41n9k90P24q7q86J080j65
5287B07p98J133o20K76l21J95L9q4O20n97j10K23l07K97J11j43K7N51m77L5o72
$$ y = [-25, 103, 311, -728, 407, 551, -312, 85, -280, -829, 108, -193, -120, -139, -716, -320, -146, -86, -387, 758, -528, -87, 819, -199, 365, -447, 889, -453, -287, 25, -1411, 209, 669, -504, -56, -409, 112, 442, 241, -624, 433, 237, 461, 124, 594, -271, 201, 482, -517, 402, -383, 399, -62, 89, 390, -344, -84, -787, 105, 479, -33, -39, -398, -173, 33, 248, 48, -608, -75, 187, -29, 128, 423, -322, 665, 227, 545, 837, -66, 240, 50, -163, 542, 770, 180, -361, 376, -152, 225, -190, -77, -712, 18, 783, 24, -99, -211, -828, -402, -314, -111, 51, -273, 147, -166, -72, -177, -83, 457, 16, 130, -393, -424, -567, 116, 229, 492, 769, -77, 565, 515, 607, 113, -70, 186, -82, -402, 189, 250, 984, 11, -174, 96, -451, -110, -169, -459, 265, 178, -708, 372, 207, -591, 542, -78, 198, -123, 72, 111, 27, 647, 50, -60, 163, -144, 153, 264, 121, 148, 699, 222, 257, -415]
5308d15J35M67k25k92N01q26J037J51m21M12o49l14O5j89J61M16m39L34M14p33
5328d10J1o51Q16M10m79n36Q61n11M00K75M7n48N02j8p11Q67l70M03j026J286
5348F18j070K53k62K69M41r47J32Q00q35J069J23n35m13P11j543J401k0L2J39
5367C63J12j262J033q37J27l55P66j8j6j07Q35n82l09Nm30M73N89m25l31L36l89
5388d22O95J00m13P55j110J167l56l18m44J67K68m53L23K11j073j6J014jk73l18
5408d97L98N52j13j47n02M78K69o56o20M37L92k05Q58l99K47n16L70j037L06Q3
5428c02P81o54J17L68k31k48J67L10n99L23k25P30o20j17rJ216j085Q75r05P09
5448F01n23P83j278K8L32O61k66l2j91n13J414j815N12K41R56o33j89o52N96l50
$$ y = [-415, -280, 187, -38, -330, 171, -655, 382, 533, 112, 524, -125, -439, -374, -563, -402, 14, -425, -91, 323, -410, -399, -1050, -234, 176, -303, -839, 22, -489, -89, 186, 233, -315, 187, 169, -542, 325, -45, 358, -668, 618, -452, -199, -461, -192, 249, -698, -566, 234, -601, 468, 591, 56, -357, 354, -1189, 212, 192, 224, 363, 475, -787, 246, -591, -464, -819, -53, -71, -87, -194, 641, 59, -250, -245, -675, -202, 387, -38, -369, -33, -422, 273, 373, -40, 715, -395, 772, 416, 98, -346, -179, 89, -364, -41, 170, -903, -919, 95, 94, -179, -497, -99, 453, 340, 193, -309, 169, 438, -218, -838, -401, -9, -214, 644, 245, 492, -24, 346, -691, -385, -302, 479, -175, -58, 310, 79, -169, -2, 308, -291, 32, -193, 537, -83, -200, -209, 1007, -78, 797, -108, 601, 78, 861, -417, -389, -57, 604, 338, 306, 115, -398, 1016, -799, -287, -46, 910, 277, 88, -564, 32, -318]
5468c18P67j08j272J544O52j154j93q52P90j68k13P29q38NR92k42J00j072L61
5487d90J23P61n63k20L4k48Q47K59k37j71K91k56K03l53K28L21n69q28J089j99
5507B2j06O95p99R7O20o49J38l27O96k93k1M92l93j22l46P21m12J24N57l96L2
5528C30N79r85k3k59K82M71l57l83J23K51K11n41Q76j102Q61n71J23n20L08Q64
5548E38m29J96m20N36n23k2K40J64n55l4j95J0P98j010P20K21n60L64k87l1K82
5569CL21l19M25m50K30J78l47o65J125m56m18O8M01L72l46N74n09O12n52pn17
5590b77R26j184K47P19k39q2l85L57J2q87P58p0L00n57M47n60L87K57q14O72k97
5611b70m58O35J52l74K50L54Q5M46j025M7L87q17O92m95J82J51P4L10p0j293J287
$$ y = [-318, 449, 341, -931, 613, 1265, 111, -82, -934, -144, -312, -525, 204, -634, -629, 363, 121, 221, -851, -490, -367, 394, -169, -389, -355, -603, 244, 503, 266, 95, 386, 130, 333, -20, 208, 529, -40, -868, 221, 22, -84, 611, -188, -91, 529, -120, 18, -309, 387, 94, 73, 565, 172, 50, -296, 425, 13, 137, 694, 298, 330, 909, -76, -99, -358, -76, 395, 38, -345, -222, 29, 240, -301, 575, -527, 334, -237, -114, -634, -326, 538, 109, 305, -115, 421, -102, -124, 116, 280, -275, -309, -504, -494, 304, -706, 14, 235, -325, 39, -248, -279, 3, 324, 5, 430, -20, 210, 388, 41, -624, 501, 45, -373, -305, 96, 468, 122, 696, 187, 799, 247, 240, -277, 649, -535, -288, 431, 192, 110, -275, 82, 94, -793, -35, -105, 195, -362, 85, -475, -88, 169, -645, 27, -270, -728, -93, 59, -315, -65, 289, 374, 820, -205, -158, 229, -588, 104, -391, -209, -58, 16, 326, 256, -1037, 250]
5632B50j53L79k62J6N47p48n50N28L16n10L66l57L61q5q5o8J15J98l45j32j75
5653c94Q83o55o3Q78o24l31k25O93o85O36p98J193l23K1n3Rl89M20j04J070j000
5674A59R24j243K04j99k65M61L81M03j085j0N57J024j103q38k68L47Q27j255J109
5693A30Qj8Lj336O98J65Q7J051j657Q36R6J88n70L7J024o62q57J352k43P92p37
5714C87m44J433l93n46q68J57J196m13j758J245K94o29r22J678m40O6Q45p11o48
5733d71KK38M27k29O75j39M37l52M7n63p08k69Q12M43r32J131l80l93l10N08l46
5754c72Q78j11K44k79p65O59n42L77p0k35M64j64j37M50j020P94Ol83J53O6l51
5775c38P89j43k63j50L01n80J81O90l47m7n60p8R71p14R69r85L1J90L39j99k82
$$ y = [250, 97, 476, 214, 230, 777, 29, -521, 7, 323, -187, 179, -178, 183, 98, 13, -55, 60, 258, -87, -219, -394, 489, -166, -229, 649, 25, -306, -531, 162, -523, 113, -685, 508, 185, 206, 153, 162, -227, 193, 89, 1159, 159, 1083, -160, 44, -155, -420, 41, 422, 825, -260, -270, 287, 1311, 208, -630, -898, -551, 276, -979, 130, 138, 120, 123, -1213, -515, -350, -263, 788, -869, -33, 63, 251, -319, -282, 742, 80, -777, 575, 332, 1124, 387, -57, 1376, 983, 437, -431, -274, 922, 509, -1249, -4, 290, -339, -1261, 417, -23, 43, 888, 177, -471, -469, -231, 196, -33, 642, 503, 940, 588, 635, 72, -636, -905, -93, 350, -582, 549, 169, -224, -534, -26, -372, 506, 395, 639, 360, -405, 254, -288, 89, 19, -216, 248, 84, -53, 397, -623, 171, 177, -206, -53, 13, -338, 451, 308, 45, -105, 196, -384, -203, 487, 140, 93, -467, -545, 426, -288, 681, -304, -273, -83, 256, 57, -225]
5796b25K17N19p03n00M17o90K04P60l97R06j32O45r49m60O85l53P9N24j59o65
5816b77K57P5M33j119M35R52m15k82k46K88o96P66m15N27k50Q8K62J67l73m14
5836b37o2P66j06l15m2l19l75L74M27J81n3n63K47J87O13o20j40k73K69p5l9N16
5858C61l61Q55p86R9Ql18l66J78N36M28r21K22P86l85k81L03J23r70M83J50K93
5879D37k99p90j08L65K53O22o43j24j59Q46l38J12k76j17L39K51k16p16M81j63
5899b43Q1n46P37M79j253J060l12rM0m90j53R10p96M41K73m30M44m63p15O49J93
5920a03P08o99n70N40m77N85l1L20k81j38P5o70J040j59Q64j628N45O71n38J06
5940A60n95J39m78J099p8q54K73Q6K94K7J85l27M73m28j18m33j69J836j800K245
$$ y = [-225, -8, 511, -192, -692, -275, -965, -761, -1, -398, 508, 376, 1021, 72, -388, 297, -56, 23, 547, 388, -277, -20, 55, 488, -631, -196, 756, 341, 59, -187, 101, -595, 171, -244, 283, 33, 121, 383, 550, 177, -237, -299, 467, 361, 46, 4, -315, -690, -316, 111, 292, 239, -324, -77, 110, 723, 103, -37, -310, -41, -116, -155, 361, 0, 855, 69, 168, 176, -142, -508, -330, 206, 634, -287, -65, 721, 336, 55, 358, 481, -489, -6, 144, 437, 138, -652, -760, -395, -142, 480, -163, -287, -446, 400, 62, 174, -102, -219, 120, 371, 155, -561, -80, -243, -162, -708, 29, 508, -745, 315, 3, -6, 34, -456, -609, 301, -495, -54, 219, -211, 233, -230, -945, -296, -103, 605, -94, -664, -124, -601, -16, -47, 273, -8, -146, -71, -741, 299, 140, 1004, -624, -79, 592, 54, 160, -435, -296, -774, 325, 247, -607, -334, -248, 46, 73, 258, -69, 404, -24, -142, -575, -744, 1092, -708, 1537]
5960A537j803j72L83J11J031q02P38j539Q55k1j59j12P46r22k4M68q96L5O43n92
5980d95J099o59Q98l10l08o47J085j5j119P86J71j226M70M07m97M32J124j203
5998go43R37m47Q99j581K030j691Q11l09L84r85M70Pj45L55Q86j004nj09k43N83
6019A93P94l47p99K97k22O42k75M95j351J138j33r44Q17R1o49R27o32j43L12L71
6039E82l09M9k01M99n9j03o69l17J6J089p4P02j204o43Q99j19M91j304k16K43
6059f48L85m59P09m19L69J15j38O83k00k71m65N68j36l99J632p35j618J013p01
6078g15P31M97p67K15m03L50K7k88Q37L74o24p51J48L87J4l50M36P95k80p45K4
6099h8K28l16Q63o46K20o53N14N93q53o25R52N80l48J67k92l16M89l08J07o1j29
$$ y = [1537, -266, -438, -55, 56, 1087, 285, 1023, -516, 339, 318, 159, 47, 793, -129, -153, 315, -581, -546, 97, -495, 604, -55, 843, 533, 225, -422, 663, 648, -471, 315, 486, -740, -270, 137, -360, 72, 1196, -7, -650, 287, -160, 739, -842, 1188, -503, 308, -1, 383, -602, -132, -125, -270, 85, 971, -33, -38, -147, -390, 193, 987, 640, -159, 138, -84, 558, 283, 778, -573, 565, 432, -512, 305, 396, -253, 674, 42, -101, 211, 582, 273, 322, 121, 620, 561, 458, -211, -528, -512, 577, 503, 1205, 1, -642, 257, 138, 629, -675, -891, -648, -263, -722, -13, -432, -63, 52, -86, 597, 397, 126, -339, 229, 93, -306, 1326, 591, -1027, -14, -715, 16, 513, -254, -39, -442, -92, -65, -353, 484, 858, 234, -517, -369, 18, 32, -318, 118, 913, 633, -112, -88, 140, -176, 687, 41, 261, -392, 122, 715, -138, -763, 189, 769, 421, 588, 296, -20, 469, 161, 268, 207, 78]
6120G8o96M06p1J19l68O29M60p39J35O67l87M86j156M09l92N17J5p22L0J132l00
6141B52o05J18N47O64r14j047J43J444j621Q69L91j266R65P29j803J261k83J63
6159GL97l75q59J156L66j631R53l35L47J59J96n10O69k09p12n6R58j519N54R59
6179E15o13l48O90m38P7J35q20M18P19N14m53L95k49K06l78o81P52K99q08m79
6199e47M73m68N98O30o45J581q52j683O18M34j107N76m7J12Q29K37k42j201J347
6218F43n99j468J653M71m02Q44k243M24J489p15o82R12j69o95R45j238Q16m59
6236d73M92J51m32k93N09m96M19O56L56j356K07O09q04M70M00K61j706K069j167
6255a28n45N58P6k6p35m63J087O4R27j407J007K9j012K8k21J027L80Q3m95m69
$$ y = [78, -618, -212, -283, -164, -532, 97, 557, -182, -47, 620, 233, 719, -437, -28, -420, 97, 112, -610, -580, 552, 252, -353, -235, 312, 976, 62, -985, -842, 602, -1019, -150, 241, -1025, -60, 669, -1134, 127, -156, 7, 404, 29, -830, 326, 692, -939, 14, -321, 26, 185, 381, -129, 540, 331, -381, -437, 521, -998, -444, 515, -98, -446, 244, -194, -117, 18, -802, -384, 335, 849, 396, 791, 542, 748, 370, -311, 441, 740, -68, -547, -74, -542, 56, 686, 41, 1622, 770, -913, -295, 139, -968, -392, -439, -327, 502, 739, 497, -704, 643, 44, -1424, 229, 700, 298, 1142, -1101, -677, 812, 97, -585, 327, 158, -537, 408, -830, -14, -473, 19, 170, -262, -555, -46, -542, -123, 533, 889, -467, -260, 349, -455, 15, 415, 676, -1030, 1039, -128, -673, -115, -39, -65, -800, -1263, -176, -112, 815, -592, 415, 444, -568, -540, -761, 266, 646, 729, 234, -235]
6275b35M46n16O95l13j275J941q51n39O32m14q3j0M17j875J289Q90m82j41J32
6294b92K09l52J243j282j310J802j529O48j74J792J092j799N1m87J673o46J01
6311G40j74m98J61j370J553j17J97J5O16j303P48j099K34j013J584O2J46o60N25
6330C47K55l81j89P99J009j955R57j529J831j767J355q13L07O07p12k78L77m01
6348a81K40M39j148M78o1Q93j140M78R6n55J4J29N40j384J463p16J25L56J50j71
6368D5K5Q13j423P7N8n44J875j408m6M42o5O15j455J105n73J22n28L92N83k16
6388a06m75J498n96r2l35l01R85m00K27j86o67K59R77p76k8m00L00O0j8L30L0
6409B86j5M2L13j05k60Kj82O0j30K63J71q44J17K78k30N20m15R4R2K32m22q5Q88
$$ y = [-235, 211, -305, 390, 77, -1198, 743, -108, -647, -15, -429, -512, -522, -105, -1980, -691, 199, -283, -424, -292, -83, -435, 808, -474, -1784, 18, -1511, -863, -1037, 755, 1847, 48, 99, -388, 1285, 639, 740, 566, 68, 229, -1141, 412, 295, 492, 507, 1123, -180, 568, -531, -297, -1310, 274, 336, 482, -178, 347, 602, 221, 32, 831, 1840, -115, 842, -687, 1144, -623, 732, -81, 226, 833, 121, -157, 220, -181, 59, 498, -650, -172, -233, 660, -480, -2, 94, -461, -447, -318, 222, -1162, 301, -415, -290, 66, 216, 45, 70, 883, -540, -463, -405, -949, 926, -482, -528, -86, -151, 464, -991, 114, -459, -337, -865, -473, 110, -106, -581, 917, 321, 229, -106, -407, 578, 178, 405, 219, -448, -189, 788, 12, -16, -416, -116, -56, -74, 256, 286, 271, 313, 626, 521, 261, 263, 81, 141, 11, 274, 445, -399, -282, -4, -234, 286, -129, -35, 57, 289, -133, -218, 670]
6432F70n10J65k16k15J09L42l29k82J60l95K13k70P1R06j367M64N5j43o7j51R88
6453A98n15nJ085j318J54J67J193q63r0R25j624P61q03J345l60L35R9l99l36N95
6473E44k46K8j353J285J022j437R99j809P82Q95j625J146m85J06n78N90n65L28
6491c73J53J88M12q90k7m29K023j230J072o58o88R48J23m99O19n27N43j143K82
6510a01J477o77j186J046j481J123K57j17k5p43Q98n11L44k70k63M77k25j43k74
6529c94M19J65k07j05N1k98O7L9N26m0m43N9k69L97J21k64K56O82p61k74J54J04
6551a5L13j02j248P60M72m15jN3K24J17k52M80m81O26l80N0N3o70N77r4m88l24
6573g45R17l16K47J59L0P3j59n01L42M55n37j06O5k21L5k1o29P97m7K00J88P5
$$ y = [670, 160, 325, 109, -106, 3, 345, 16, -266, -106, -501, -288, -558, -487, 419, -948, -484, -429, -572, -639, -790, 198, -317, -322, 763, -555, -401, -234, 959, 96, 6, 931, -693, 68, -735, 610, 250, 585, 684, 285, -51, 544, 298, 326, -1027, 258, 1280, -157, 842, -967, -185, 710, -915, 231, -254, -148, -726, -136, -701, -373, -220, -32, 380, -510, -537, -966, 1057, -173, 899, 241, -447, 501, 624, 125, 744, 217, 760, -383, -101, 1376, 699, -487, 559, -922, 201, 458, 341, 316, -427, 471, -40, 304, 34, -229, 248, 23, -120, -394, 25, 190, -17, -122, -71, -369, -302, -263, 263, 223, -220, -161, -430, -33, 88, -176, 80, 762, 1, -273, -119, -15, 298, 196, -1052, -292, 180, -235, -236, -183, 41, 158, -94, 386, -95, 531, 151, 201, 254, -416, 161, 67, -421, -745, 172, -144, 103, 262, 292, 365, 206, -295, 47, 502, -35, -141, -76, -297, -262, -283, -912, -115, -162, 38, 226, 301]
6595C01q12n0P50l62j64q58J261j10J61l03n23N91L6n96Q78M28N75l74o16j042
6615h29R65n30J127q78L12l35N4q84L4J375q0n50m64Q23K4K62p25O83o88Q15k78
6636B33l5R2R1j061J819p91p68N28N92n12K17j245M28N61l69m29R6N23l48n9O5
6657c72Q37j686N46J39P63k5r1J41j034J79j92P1N64k20O31l57M45nN1n23O6o16
6679f88R53O18j091l2Q26n16J49n47k67N63o4M82m80j14K51m27O58p75N26N47
6699E72o46Q5J91L60o29J56n7k34M59n29l18J9P95j71p37M56j89J302j319O95
6719B61j03M71r44N56k20P41o29m18N1Q02j205Q69o43o2j14Q32q8LJ21l07l39
6740c65j18M05O70n77j43M97n15J38m57M67P88q16l28L75m79M77o64Q66n36P4
$$ y = [301, -511, -561, 189, -173, -337, -1195, 66, -44, 117, -186, -709, -118, -82, -678, 200, 628, 1203, 829, 213, -829, 136, -394, 733, -145, 167, -168, -114, -998, -964, 411, 331, -219, -683, 140, 164, 426, -299, 384, -304, 511, 233, 198, 290, 381, -680, 1139, 348, -420, 108, 700, 188, 405, -840, -412, 149, -220, -649, -553, -30, -378, -437, -372, 465, -1221, -675, -536, 227, 202, 111, 252, -782, -603, -795, -724, -160, -380, 251, -106, 339, 334, 385, -138, -72, -688, 265, 883, -208, -240, 586, 70, 219, -328, -595, -32, -96, 386, -94, -208, 43, -384, 274, -501, 25, 572, -74, 11, 202, 562, -67, 89, 32, -202, 257, -272, -590, -571, 224, 53, -684, -228, -417, 885, -434, 261, 158, 629, -315, 241, 21, 762, 133, -285, -234, 568, -637, 232, -411, -473, -587, 245, 157, 160, 281, -26, -365, -483, -78, 592, 15, -128, 369, -146, -8, -465, 2, 790, -26, -354, 21, -458, 19, -645, 221, -315, -241]
6760b41m43P86K69l51j73L44J92o20P42o14k72k51M00J70q5M3L8n54K118j403
6780I5K00L06n96K88P88o67RL47p67L37m85J37k96P97k68j033R95m83J42N93n68
6801a29l09O85K67p8q05K79l12j6P9N86k62N82k89j55q81oJ077R5L40R8r05Q6
6823B7J159j767K31K05L47n7o92L55K97O77j085L19O23M7k95k58M82j358O69j97
6843b71O12m37j3p73J494q22O20N5j2o39L46J37p87K49J75l34L10J32M45L70j357
6864e00l88J222K23m81n36J189p63L50J94q69N27l48PJ12k85J260j095O6L27j269
6884a057J037N41m63j69k5j73O11m83n0q18J292l9m36N81p78Q27k28m67L67L54
6904D24k44m5O2L03m47J08oj59L15l72j94O72N10j124J53J53L1P48j166k92R42
$$ y = [-241, -684, 102, 371, 20, -153, 191, 383, -237, 505, -109, -381, -632, -232, -62, -147, -104, -66, -620, 1498, 95, 295, 601, 5, 293, 1081, 414, 423, 770, 3, 340, -145, -8, -304, 493, 225, -808, 187, -296, -154, 439, -129, -438, 247, 514, 436, -369, -90, -402, -418, -339, 247, -15, 567, 278, 123, -758, -764, 313, 408, 748, 846, -59, 27, 1186, -581, -350, -145, 202, 145, -547, -192, 105, 782, -303, 16, 639, 686, 391, 133, 615, -743, -74, -271, 341, -96, -109, -882, 612, -210, 410, 465, 453, -186, 160, 297, -490, -241, -66, -400, -90, 42, 487, 857, -500, -888, 334, 557, 76, -460, 729, -34, 316, 510, -359, 168, -180, -173, -61, -346, 914, -181, -115, 212, -1057, -20, 521, 58, -111, -136, -309, 302, -181, -231, -1049, 243, 204, -232, 349, -429, 398, 170, -297, 70, 424, 180, 135, 197, 500, 53, 161, 155, -4, 311, -61, -255, 417, 927, -197, -44, 109, 140, 888, -278, -570, 372]
6925C72L3k99r74R67p56P87k94l8n5p4Q10l04n82O1J68J69o02O13l61K70Q49J30
6947H90p23j99ok8K99m87m80N11J121j302M25r2M04J34r58M52J72P88p72o68M71
6968d8N78j223O21K65j82N93j034P02o93M18n12l64M43O47Q5m29l36N74n64N46
6988H7J1O02o85M43k71j16K6j90LK66L66o33j78K69J5m81n67J196p38R90p54J60
7010a79r13J383k75l72Q90k22m22J95l24j62k70J176l13j36n72M92m09Q03p05
7029c35J15K78k20n09J52J148m88J14O9o92J73N07n71O35l08l06K45N0k93O8%
7050a68L02n53J32O46p13k8N11jJ18J06k51L61k92j40Q2m35k01K76j11M90o4L18
7072C85n16o10o6L48J389q48k40P60r71R09m32o7j16j123J288P77q75M96k43j19
$$ y = [372, 405, 106, -868, 99, -657, 130, -164, -202, -257, -331, 479, 175, -407, -346, -178, -9, -611, 2, -359, -89, 760, 890, 167, -32, -38, -66, 233, -254, -734, -223, 898, -404, 21, -71, 333, 467, -491, -39, 133, 921, 149, -519, -48, 530, -693, -72, 193, 11, 604, -430, 272, -421, -3, -515, -879, -436, 211, 296, -133, -469, 105, -459, 87, 98, 700, 15, 458, 187, 71, 97, -93, -90, 176, 542, -91, -269, 0, 15, -466, -1033, 163, -575, 415, -339, -179, -1092, 291, 16, -356, 534, 312, -110, 85, -239, -401, -671, 505, 192, 56, -516, -24, -433, 370, -335, -220, 58, -162, -671, -519, 629, 141, 255, 324, -368, -195, 312, -259, 376, 68, -238, 7, 57, -236, -168, -168, 134, -419, -287, 359, -354, -382, 129, 128, 246, 352, 101, 462, 170, 30, 112, -323, -524, -248, -359, 131, 67, 385, -131, -741, -807, -459, 930, 82, -158, 602, -369, 540, 108, 41, -75, -1198, 90, 867, -8, 488, 245, 126]
7092A26R6K5q5j14M27l55l24j63J5k29L73k16O47k84M73r8n07j24P79L2p56k10
7114d72LJ51O43m93O31p80K96M15r94J616j559R61l79r03Q36K72m55Q09o01p03
7134g06Q80r18Q47L11r73L26J83k15Q80l34k18l18M21M13q54J38K00P67k54m87
7154H9q3J63R08j083R91l24p83L81p6k9p13J140n61K28l26J31k97O14p1o9n76
7175c46L77r00N21L09K14j89K96r6n07K93m07J51P60l09j27M60l42j02p41N91
7195i4M46K08j012L38j53n7n9K95J39o00M18J88J73J16o04j84L88m99Q18L43k05
7216D03q09N84k03j80J155j714N00o29O7L16J226p4j01p27O24n14K94q83J152
7235D87n47p95J055o60L16R21j528J021j073J003J50q14p6j14Q30K35r17P57l04
$$ y = [126, 222, 247, 162, 48, 475, 120, -204, -367, -352, -581, -208, -424, 223, -61, 412, 314, -193, -317, 462, 494, -262, -472, -469, -318, 325, -168, 463, -317, -21, 394, -600, 1016, -543, 418, 39, -864, -28, 244, -211, 598, -3, -706, 174, -744, 103, 414, -559, -233, -50, -265, 615, 281, 63, -255, 166, 579, -275, -137, 63, 830, 576, 89, 6, 169, 1077, -6, 985, 661, -122, 259, 183, 154, -559, 581, 20, 248, -78, 53, -244, 370, 299, 230, -346, 31, -869, -348, -39, 175, -14, 282, 186, -321, -28, -435, -284, 476, 167, 40, 500, 158, 56, -685, -94, 352, 560, -452, -114, -267, -324, -383, -88, 51, -549, -131, 57, 230, 346, -258, -442, -54, -553, 265, 608, 403, -406, 178, -25, -205, 950, -764, -264, -893, -826, -510, 716, 642, 541, -186, 438, -76, 218, -665, 487, -60, -855, 200, -460, -144, 777, -751, 270, -803, 200, 350, -464, -540, -654, 176, 411, -506, 251, -53]
7254e3k0j1M50m58J32M07r47N56j25K67oM60J34j354P44k94P29j396Q93j24r8
7275a14K69J22l23P62j137K57J52n32K44J22k0k3J93O8j5K4K55k55p51N06M19
7296B23m34N4m70J259q45j84P59p3l82L10M2l29M04l9j1o66N73k18L99k2n85O53
7318D18j6k88j41j33J43n07L85j59J29l09L86k95R21n45j93J95j60O5M05p05R65
7339E61n45j47l71K91M37L68j32p43J002n81M22p50R56r93N7N18k16r61M18L79
7359c0J00j058J067j22R7K88K17r88R80o19l51N77j81m68P77k66j03k27l89J71
7379e28N03L2m5K63j82m75N78l81O8l72O61l13M23Nj62K18L63j194J8r6P05J7
7401A06k1M33p58M77jp57k63j22P61j1m33N50n92J447p04J88M92j173Q23j269
$$ y = [-53, -73, -84, 366, -92, 40, 447, -500, 56, -69, 198, 192, 652, 786, -568, 176, -118, 611, -785, 108, -16, -114, 155, 277, -46, 716, -421, -164, -12, -544, -300, -178, -198, -221, -28, 40, 25, 49, 304, 49, -702, -196, 223, -211, -157, -627, 632, -213, -397, 362, 289, -93, 217, 259, -70, 334, 295, 284, -382, 191, -27, 372, 350, -235, 418, 402, 114, -27, -160, -17, -524, -139, -298, -169, -478, -92, -387, 534, -11, -204, -9, -169, -104, 301, -404, 561, 16, -131, -502, -211, 226, 594, 462, -281, 721, 140, 562, -188, 768, -225, -168, 350, 134, -827, -409, -30, 70, -988, 79, -43, 54, 342, 559, -429, 551, -68, -419, 158, -23, -491, 286, 20, -83, -310, -699, -528, -25, 7, -38, 225, 43, -432, 146, -235, -167, -539, 122, -191, 232, 237, 75, 293, 656, -538, -520, -616, 89, 106, 85, 518, -240, 237, 236, -521, -784, -906, -145, -156, -589, -39, -631, 816, 112, 300, 792, -381, 442, -827]
7421h27L20O23O10j72K17j132O99L79l48n60j31K03L28m49k77K24O21O05n55M00
7441G78j154O4k38L53k10l92N22m1R4K97k92J353m73o93j20N28J18p48l37O62
7461G1k26M28l56L45m47l96J260r25P90q57o0K12P19p23j50N87L1k60J0L48q60
7482d59R40j12l6l19K68n3J06j02k38O21k76K46j071K28K42k53Q51p49O34m56
7502A2Q75r23N26k63m27L12m12L11J80J03n88p7j72M68J30P44l75q2J17J66j38
7523D87p68k67K96P05J60j356Q0r8Q62n97J003k47j139k89Q82J83p9k2q2P27j336
7544h95O62J058j247Q94n4o79K52M22j043R04M9k59k37N02J029k77j965N17O36
7563B69J232l79j951J931r70Q65j397m44K91P82Lk33M21m11o17O22l60M57J52
$$ y = [-827, -507, 116, 726, 554, 771, -361, 338, 717, 369, -191, -322, -119, 209, -240, -517, -293, 328, 933, 378, 778, -376, -312, -550, -197, -407, -799, -277, -318, -224, 73, -219, 1134, 661, -32, -152, 376, 494, -254, -591, 71, -155, 273, -83, 262, -185, -581, 679, -246, 544, -313, -373, -161, 558, -165, -315, 272, 303, 43, 53, 401, -459, 481, 369, 333, 14, 282, 229, 335, 233, -5, 616, 340, 586, -485, -257, -15, -268, 583, -166, 468, 12, 887, -36, 490, 227, -200, 112, -300, 11, 191, 294, -294, -371, -543, -75, 55, 799, 424, 342, 459, 625, 487, -281, -548, -252, 453, 613, -743, -663, -761, 101, -496, 507, 260, -879, -1168, -286, -103, -182, -204, -286, 441, -895, -233, 825, -422, 472, 418, -261, -9, 413, -630, 274, 323, 64, -173, 329, 1358, 1081, -884, -367, 269, 1501, 1122, -829, 1102, 132, 997, -400, -844, -553, 229, 232, -1, 420, 9, -608, 14, -346, 111, 263]
7582B63p95J285q23l8Q73o21L25O1n8%m29N58j452j11M3J549r90M48M8o38P96
7603B94l53O53K03m73m67k06M60O08k88J06m16p91L90K37j44o82M30P23l85J19
7623A8J32M86p44j09L6O5j54R69p66N4M93k14j090J237k01m77N72k66j83j16J26
7644a32l31M80N3K43J82r31K80L74m5o06J163q78m70Q59k56J45m21J71P61n24
7664A17r35P76q0Q8K82k18J28p4r1O4p16J333l50k59k9o62P4J66P5J240n80L49
7686F98n75N05n79L83L56j322K66J00j46J44Q4k44J35N16l47jK54j060Q26R15
7706I08p22R53j152N28n43N83j359M16N14m67L89j12L09J05k49N2k17K52q84M40
7726b56N02P2m97j98J92R5r5J80L7r2O91r98J93J92j1q39J265o81J07N21o24R6
$$ y = [263, -532, 753, -70, -108, 765, 144, 469, 530, 472, 472, 43, 601, -851, -962, -919, 630, -360, 88, 136, -502, 294, -59, 594, 797, 324, -143, -349, 111, 719, 431, 537, 121, -670, -280, -43, -187, -869, -439, 284, -101, 18, 150, 636, -108, -217, -181, -116, -270, 699, -67, -13, 480, 266, -824, 413, 212, -265, 307, 41, -142, -258, -132, -463, 17, 70, 313, 495, -436, -156, 218, 173, -433, 730, -148, -618, 241, -15, 130, -291, -120, 641, 117, -818, -42, -122, -34, 248, 30, 158, 84, -7, 57, -659, 674, 324, 65, 36, -626, -552, -386, -311, 929, 349, 698, 123, 628, 49, 432, 788, -534, -268, -168, -314, -170, -86, -330, -195, 321, -26, -27, 227, -833, -7, 908, 186, 1139, -13, 515, -28, 555, -804, -388, 126, -341, 48, -64, 245, 350, 101, 153, -64, 188, -696, -256, 246, 318, -179, -377, -185, -90, -185, -5, 32, -60, 631, -367, -174, 18, 7, -832, 433, -248, -141, 380, -244, -148]
7748a48J91n99J159P7r77l4J42p6j18L61M57M92j763K59n68J125Q80n29k20J93
7768C04K30j97l49M09O03j383M59K68L2O4o71LJ341k096P84N20n86P1K91L29j114
7789f88O58n96J005o61k16O74ql09Q4J61p76R35r1L85M31j625J374r54M47j035
7809h05N85N1M52M18n98q62Q10m2j7p7J023j168p17J639p53M44L87n04l30p4J118
7830I80r40l56M63Q57p62j083L27N19k54J07R10r29O03j277J293m08O44p49J41
7849H6O9j08N33n03L96n28M60j62o74R11o73K99K01K24m80O35J31j642P97j064
7869a092L64Q92j65L10o31J039j008O0Q93r24P07o78M81m8K7k25k32k88Q76k93
7889F5J60j63n40O06Q1o37M52p62P58K27o83J98N12lo49j22J149p54P82l87P7
$$ y = [-148, 43, -556, 603, 680, -297, -331, -189, -265, -383, -22, 435, 927, -836, -577, -1145, -20, 860, 331, 111, 304, 534, 337, -12, 397, 1000, -383, 76, 344, 376, 440, -231, -228, 1113, -983, -199, 321, -265, -194, 97, 426, -688, -30, -626, 379, -282, -498, 176, 168, -141, -57, 104, -672, 263, 172, 557, 988, -637, 737, -217, 230, -805, -220, -169, 283, 701, 103, -759, 51, 9, -8, -85, 938, -230, -947, 692, -61, 383, 770, 266, -64, -138, 980, 40, -316, 147, 1004, 242, -841, -514, 5, -249, -142, 768, -161, 442, -835, 458, 50, 694, -55, 86, 155, 47, 580, 77, 473, -55, 405, 243, -431, 480, -193, 106, 307, 531, 51, 686, 817, -825, -28, -1092, -728, 164, -1, 309, -322, 717, -291, -231, 662, -262, 445, -233, 248, 200, 227, 2, -230, -518, 358, 65, 225, 62, -478, 128, 209, -428, 24, -738, 20, 247, -436, -238, 274, 271, -378, -500, 649, -105, 677, 290, 367]
7910C67m63k4O31n29M62m5l47K65M38j277j25L98N62k93K21p56J143o27k29k20
7930d48O45j37p57L5P25o5p7M43l33P48p86p30R37o9J06n18L59K2l22K89O31k06
7952D92j323Q07n1R26q31n12J362j707P84K59Nj015R82l98M58m30L9Q5O42k06
7972C68m18M73p18j46N02K58j36L1k1j91O6j55L93J43j51J92r0J79k78J93k51
7993B43R3n00L62n5m55m67J038ol57j2L67n64L91L73r24O5K14P74o27k3M6j97
8015b21J83k47l91P33l74J92M96j14p0k29M80l92J5R7j86J19K20l42j2M71l82
8036D6k31k54J611n32n34K04j192N64L10k96M72p13M74P42m02k45M61o23m18K68
8056b88N68n25R55j510J246o27J414p27j644N71M82m56Q99K94j483Q14j57R5R0
$$ y = [367, -96, -120, 511, -18, 444, 399, 52, 317, 755, -522, -647, -249, 313, 20, 241, -515, 628, 1, -228, -448, 197, 60, -697, -662, 63, -2, -79, 364, 31, 779, -7, -737, 200, 131, 237, -281, 78, 100, -222, 67, 698, 492, -831, -24, -75, 851, 20, -492, 870, -837, -53, 206, 211, -804, 178, -220, 238, -192, -153, -68, 574, 368, -50, 423, -295, -441, 61, 319, 183, 214, 193, 2, 68, -87, 306, 449, 298, 490, 400, 579, 301, 494, 243, 336, -164, 198, 143, -312, -779, 259, 253, -104, -116, 251, -313, 78, 451, -473, -408, -194, 580, -47, -70, -24, -221, -38, -285, -676, 57, -317, -125, 371, 257, 187, -42, 438, 46, 61, 158, -28, 91, 311, -31, -43, 428, 46, -185, -439, 1172, 640, 106, 310, -882, -318, -8, -304, 168, -545, -71, 671, 269, 24, 485, -138, -556, -288, 280, -245, 710, -800, 446, -181, 1233, 506, -1138, -567, -85, -541, 358, 652, -831, -17, -174, -79, 11]
8075A1J141k315J267K11o24P61K94k18r44o26R66J91k62K6N78k73N3n55m8R83
8095F17m83j66N51l74m81k38M33L81M02q15L51l30k47N00l25P70n44r3l84K08
8115b67M42K97p54N92n37L58l42l19Q90j189J138J113o14m12N87j883N49P43Q51
8134A243j444j46N28N02k34l06j27P41j084M22L51j61q12N93j43J178k150J035
8152a4N22r93N02j09O10J00j17j110J026O24r50Q13j094M29J46o46O99p30O59
8171C67M80l92j161J112o18J126j044l66J708j005k85J44j5N22q68K10K92L62
8189E69m21l18
$$ y = [11, 1152, -1163, 104, 315, -309, 452, 746, 528, -416, -1042, -76, 115, -147, -121, 457, 184, 237, -318, -366, 617, 134, -32, 519, 145, -336, -574, -141, 240, 642, -173, 178, -152, -399, 101, -224, 546, 2, -91, -475, -267, 175, 472, -282, 310, -227, 131, -211, -530, 360, -829, 309, 1422, 808, 396, 983, -900, -351, 392, 1243, -201, -347, 181, 683, 449, 143, 16, 757, -327, 95, 446, 285, -527, 66, -77, 1101, -1049, -14, 508, -485, 17, -92, 518, 618, 501, -609, 417, 1041, 91, 904, -190, 239, 385, -261, 438, -292, 367, 847, 455, -706, 406, -212, 914, -130, -496, 1212, 207, -78, 66, 51, 573, -295, -85, 207, 569, 148, -170]
8191a70
$$ Imaginary data points
##PAGE= N=2
##DATA TABLE= (X++(I..I)), XYDATA
0@%%%%%%%%%%%%%%%%%%%%%%%%%J3o0J14j38J43j44J44j45J59k03K47k73K94l28
39a77L70m10M62n10N62o31O96p67Q47r28J024j128J242j370J508j663J844k043
57a072K266k527K831l195L634m172M855n766P047q977J2316j9874J04535q7515
71D386l993L9724n0978K8682k421k4337J7066P763l1672J7074O752k2080M197
84i837J3336k3080O414J3196k2855L700J8677k5790M747J5998k1736M176J7417
97e637k5837Q307J7827k3417Q120J5282k2695Q610J4445j9146R297J1916j5452
110a8380N819J2087j3508N073J3335j2064R34J7622j3437j515K0672j7868J376
123A46K0136j7390J730J8477j7406K780J6320j6285J896J5396j5506O70J3425
$$ y = [0, 0, 0, 0, 0, 0, 0, 0, 0, 0, 0, 0, 0, 0, 0, 0, 0, 0, 0, 0, 0, 0, 0, 0, 0, 0, 13, -47, 67, -71, 72, -72, 72, -73, 86, -117, 130, -143, 151, -177, 193, -217, 245, -265, 297, -334, 362, -405, 442, -486, 538, -590, 652, -718, 790, -873, 971, -1072, 1194, -1333, 1498, -1697, 1937, -2235, 2620, -3146, 3901, -5076, 7240, -12634, 91901, 4386, 393, 40117, -10861, 17821, 15400, -8937, 8129, 15892, -15780, 1294, 8046, -14034, -9837, 3499, -19581, -13167, 29, -22826, -19126, -449, -26239, -21492, -5494, -27230, -23054, -5637, -31474, -23167, -5340, -28757, -20637, -5355, -28050, -19440, -4995, -24141, -14844, -2928, -18380, -12561, -474, -13982, -8909, 4426, -7638, -6704, 10918, -2519, -4034, 16638, -1230, 146, 20282, 2892, 4622, 23099, 5693, 8473, 24793, 8508, 10404, 25800, 10294, 10964, 24389]
136B4389j2616q23J2519j1281k581J2361j0741m463J2199r093p451J3630r646
149F403p882J5451j0842q388J6512j3124n561J5058j3667l218J3139j3754k318
162a2191J0936j0514l421R953o666n006R984m827o260R752l604q344J2191l502
176a1519p839J2198l719p500J3919m283q400J4352m175o866J3994m844o084J3089
190B323l668n435J1542k991l987Q798j042n546R465n3p278R334m54p073R114J36
206A3185q540J0768j650q125J0289k453p181Q849k297p017Q329k782o511O750
220A1614j714o824N242l02o810M410R93q364M425J595r126M870J777j0107N727
235b594J207r321N745K309j0431O880M48q839O582l64o509O587N27o595N619K22
$$ y = [24389, 11773, 10950, 23469, 12188, 9607, 21968, 11227, 6764, 18963, 9870, 2419, 16049, 6403, -1479, 13972, 3130, -5258, 11254, -1870, -7431, 7627, -6040, -9258, 3881, -9873, -12191, -1255, -11769, -15190, -5237, -11903, -16909, -6925, -11752, -18012, -8260, -11864, -20208, -8017, -11519, -19358, -7160, -10879, -18379, -4460, -8743, -17143, -2791, -6966, -13832, 162, -4682, -10766, 2323, -1345, -6780, 4762, 1771, -2216, 6582, 5540, -6, 9459, 9406, 2128, 11462, 11008, 3935, 13049, 13185, 4645, 15413, 13763, 5638, 15927, 13474, 6293, 15142, 12845, 5828, 14157, 11375, 4864, 11614, 9900, 3076, 8318, 8016, 1206, 5616, 6609, -1755, 2670, 4265, -4861, 9, 1786, -8321, -2594, -1387, -10708, -4963, -2654, -13085, -6205, -5757, -14596, -8014, -8378, -14887, -8300, -7773, -14368, -8749, -8527]
251h527m959L927K441m542K733L177m973K675M464n377L065M960o741M724N006
266B053p204N244M227o523M695L644n274L213M096m640K954L226m630K625K882
281A0588l814J085M371m811J108M239n111P17M856o578O59M623p161K309L781
296A0861p212J102L342n035j46K073m844k5K538m014q7K378m574j490L509l403
312e027j578L278l633j672M411m493j148M621n117K1M804m695j144M868m073P10
328i867M282m222J193L912k637k36K998j677R37L334l89j578M323j892j419N445
344B507j714r95N009j349k431O473k589j201M529j751j540M578j906j177L446
359I889k482k89K515j599j801K753o32k693L204k216k464L658k174l124L584j705
$$ y = [-8527, -13486, -9559, -7118, -11660, -8927, -5750, -10723, -8048, -3584, -8961, -5896, -936, -7677, -2953, 2053, -5151, 93, 4320, -2203, 2492, 6136, 862, 4075, 8171, 3531, 6485, 9711, 5081, 7706, 10588, 6774, 7859, 12230, 7419, 8527, 12766, 7655, 8372, 13228, 6650, 7309, 11932, 4771, 7080, 10861, 3649, 4751, 8093, 3058, 2912, 4985, 141, 116, 2654, -1360, -1447, 931, -3643, -5133, -1624, -5027, -6605, -3327, -6960, -8632, -4221, -8714, -9862, -5241, -10358, -10337, -5533, -10228, -11372, -6504, -10577, -9867, -5585, -9807, -8614, -4702, -7339, -7575, -4577, -6254, -5317, -1983, -2372, -3950, 373, -1519, -2938, 2507, 793, -202, 4807, 3458, 1027, 7500, 4911, 3710, 8239, 6488, 4948, 9526, 7620, 6443, 9889, 7407, 7118, 9633, 8034, 6233, 8986, 8354, 5661, 8865, 6649, 4185, 7843, 5669, 2545, 6129, 4424]
375D424l400L789k396l075L395l007k328L306k592k037J315p92k471J990j736
390e615j615K371j876j954J780O96k598J906O38l734L129P66l526L365L27k711
406h651L758l59k227L502L14j875K647L49r01K406L71m73J909R75j024J559J645
423C925j596J817J469k279K407J877k972J839J292k582K443N06k123J015J414
438H452k788K070Lk397J839k87k409J380m92k051L88O58j873j027J971l022m89
455g4J245k937l05J329k763N62O45l416J343Q70k987R78R57k681J505N07k577
472g799J631N5j004k27J506j246o39K358j580J345J664j693K28K813j432J44L759
489a17k596Q44K683k127J639K495j596L07K095j619J789K94p49M31J365k79J43
$$ y = [4424, 1024, 4813, 2417, -658, 2737, -270, -2598, 708, -1884, -3921, -2606, -3398, -5869, -3879, -5615, -7230, -4859, -6735, -8689, -6909, -6213, -8811, -6905, -6267, -10001, -6872, -6106, -9632, -6267, -5940, -8651, -4893, -5252, -7479, -3977, -3663, -5538, -2891, -2542, -3443, -1037, -666, -1139, 770, 1745, 721, 2280, 3925, 2329, 4146, 5615, 3336, 5743, 7620, 4648, 6487, 7779, 5197, 7640, 8146, 6023, 7038, 8452, 5664, 7734, 7737, 5340, 7179, 6892, 4483, 5863, 5371, 3320, 3708, 4366, 2493, 1466, 3437, 415, -74, 1171, -1766, -2071, -742, -3505, -2943, -2298, -5714, -4371, -3501, -6488, -5510, -4553, -7234, -5729, -5222, -7799, -6168, -6113, -7117, -7344, -5838, -7084, -7723, -5365, -6945, -5600, -3936, -5629, -5401, -2588, -4020, -3876, -117, -2713, -1869, 814, -1313, 326, 2821, 1225, 1532, 3627, 2008, 3797, 4091, 3342, 3773, 5138, 4859, 5002]
506E002J469l24R7J123q80j051J344l63j272K209j808k96P41j685j11J223j982
523C436o7R91k348k52Rr04r64P37k253M46J027k225l85O94o93k025J616r21k122
542f203J259p27j393J284j146J928R22l109L51J563j334N74J097j252LK539K67
559c377j546R39Q42N52N52J502r17J08J769j36N93j05K02K399m14l31K253p9j062
578C744J892n23o23J231k48o93J603l72k38L39j23j064Q17j55j232J203j230r11
596C417K28J73j427J472n37k720J980j668j560J319j637j194M44n54q25M99k97
613b887o44q20L90p51J65L28r73k8J84m01j39J000j165K36O22q10J071N1m99P24
633d346L93L17N23J72K9J242m16P51Q89Q30o31L59J388jk24J100M32P24K75J59
$$ y = [5002, 6471, 6147, 6244, 7367, 6487, 5436, 6780, 6417, 5145, 7354, 5546, 5250, 5991, 4306, 4195, 5418, 3436, 3369, 4360, 2012, 1760, 1769, 865, -99, 638, -1615, -1169, -142, -2367, -2752, -2058, -2751, -4776, -3160, -4081, -6203, -4944, -5671, -7064, -5780, -6926, -4998, -4076, -7185, -6834, -5271, -6605, -6031, -4934, -6186, -6183, -3644, -3377, -4923, -3984, -3142, -2590, -2038, -536, -1453, -1345, 424, 288, 881, 776, 978, 3377, 2963, 2632, 4885, 4806, 3744, 5636, 5113, 4490, 5721, 5473, 4780, 6383, 6011, 5773, 6112, 5989, 4925, 5742, 5587, 4355, 5558, 4328, 3417, 3645, 3818, 2391, 3863, 3326, 606, 2586, 918, -642, 677, -960, -2154, -1710, -2264, -3089, -2590, -2887, -3531, -4351, -3961, -4712, -4547, -4219, -5192, -5220, -5036, -5437, -5576, -4576, -5741, -5505, -4883, -5693, -4622, -4571, -5070, -4346, -3953, -3636, -3113, -2941, -2912, -1670, -2086, -1335, -446, 384, -247, 112, 1500, 1499, 1275, 2375, 2807, 3531, 3806, 3965]
653C965m63J609o60N56J010j161k73O18L05j02m78k31R36q50K94j162k58M34n68
672C521K49j567K40l94j445Q80m31l23j437K71j215L20K98j396k14L08j136r9
690c570P61k603L63P47r06N4M13p05j72R22o83O42l09o06R53K99N34l79J178o02
710c669Q63M38M34K16J183L24j083J555m98J227J85N34J014j022O87J668M88p59
728C785K17k00N93n7N03o62M20J51j9N2J95p41m02N66l03l73L15p57J21o00l57
749B447K23o48k95l73o29k02p87k04o55P47j213l55j031k25L27m40k93j94k61
768d061K54k74n13J29K1k4M53p95Q69n27L1P39k24L1m77J686K10mn39R67K90O11
790a147P12o95J347K79K49N58K95L30R57p66N00l54l5P26P21j32P90L9j16m01
$$ y = [3965, 3502, 5111, 4451, 5007, 6017, 4856, 4583, 5201, 5506, 5404, 4926, 4695, 5631, 4781, 5075, 3913, 3655, 4089, 3521, 3770, 2203, 2443, 2049, 604, 1484, 1053, 730, -707, -436, -1651, -1331, -1033, -2429, -2643, -2335, -3471, -3570, -2809, -5412, -5049, -4302, -5208, -5154, -4741, -5446, -5618, -4696, -5379, -4737, -5046, -5652, -4699, -4400, -3866, -4245, -3067, -3669, -2806, -2368, -1934, -1718, -535, -211, -1294, 261, -237, 990, 1175, 1709, 2723, 1701, 2388, 4056, 4544, 3785, 4002, 3802, 4395, 4338, 4841, 4179, 4599, 4750, 4731, 4783, 4978, 4237, 3835, 4401, 4098, 3725, 4040, 3283, 3404, 2804, 2447, 2670, 2022, 1727, 1354, 725, 523, -264, -468, -1123, -376, -1589, -1944, -2975, -3200, -2873, -3313, -3606, -3800, -4061, -3807, -4081, -4594, -4465, -4444, -4468, -4015, -4810, -3941, -4468, -4437, -3698, -3922, -3891, -4368, -2682, -2472, -2476, -3015, -2048, -1758, -1147, -435, -1130, 217, 496, 745, 1303, 1598, 1928, 2885, 2119, 2619, 2265, 2230, 2956, 3677, 3545, 4335, 4374, 4258, 3857]
810C857J103l14k23j52L9l45p92J097j241J80l6n57J90Jq05n32K78k99m54r64
830C1r58Q65j265l46J10j6o67j82l2n45p56K11m3K36o71n8j38O12n95k88O11m38
852d322P98j82m82P42O02m51L91j12Q90J20J008n2L02PM39J09J389l68k05N38
872A161Q72K35K95j3P41n00M13M45J12k50M21J338j741O75k86l44L41Q38j645
891C108K44mn46l47O40m53l86k26j017J89j14Pr13Q8Pm46J79j150q55Q13r76K01
913a957q82j40l66J039o10l54n96j29R10K82j148N20nq97N83L25M06r42J069N60
933b332p20J416L69p45J150q33M76J035m5J40Q16M31J53M15q0R0P1J070p88K29
953B318N28k2M64l63K0P83L27l50n00L44m31N86K58r71N19r31l00l42L3M08l29
$$ y = [3857, 4960, 4646, 4423, 4271, 4310, 3965, 3173, 4270, 3029, 3209, 3173, 2616, 2806, 2807, 2002, 1470, 1748, 1449, 995, 31, -927, -62, -1327, -1673, -1563, -1579, -2246, -2428, -2460, -3005, -3761, -3550, -3593, -3357, -4028, -4086, -4224, -3612, -4207, -4495, -3884, -4322, -3524, -3706, -4188, -3446, -2844, -3295, -2904, -3016, -2126, -2006, -998, -1050, -748, -741, -302, -193, 1196, 828, 623, 1161, 2033, 2268, 2563, 2550, 3291, 2791, 3204, 3649, 3761, 3511, 3932, 5270, 3529, 4204, 3918, 3574, 3915, 4753, 3108, 3352, 3348, 2802, 2455, 3095, 2642, 2256, 2030, 1013, 1202, 1088, 1095, 182, 270, 277, -169, 10, -1140, -1995, -1182, -2158, -1957, -2839, -2979, -3345, -2306, -2916, -3270, -3866, -3995, -3085, -2803, -3951, -3431, -3436, -4333, -3750, -3425, -3019, -3961, -2892, -2332, -3052, -1636, -1267, -2012, -862, -1695, -1219, -184, -229, -89, 727, 1158, 1311, 1726, 1646, 1736, 1807, 2877, 2089, 2318, 2846, 2824, 3288, 2925, 2945, 3728, 4055, 3705, 3205, 3549, 3118, 3704, 3962, 2991, 3510, 2579, 2279, 1937, 1970, 2378, 2049]
974B049j522Q71O1p60p06l31j95M70q10m95N91l48J33r26l71K6n55nN12o88l30
995c329l19L65j14K52LK7r97J596P0p52J487q25M98O0L96k97R75r84J410l02L76
1016d04L48J46O36K13m17O51P07P6r4N06K01j014J048K61J85j57l81N76m11J31
1036B807l62J188l76k85K91o14J59P5m3r50K1j006J253j22n77r56K2n39l35K65
1056h4L26j877P22J28q36m11o4q60L39N82j013L66M5m11m9K61k77n15Q47K15o5
1077b631n71K27J173j483J347Q37j148n10J415j25P20p31J79P19Q73k88O15M50
1095A068k65L67M08J09K9O05j48L62K37r00P09J98PK77j18J82K97j74M6j552Q67
1116B611O6n12M79o84M80n57j61j008N75R4l63m06j70o13p4m50n26k76n4K54l5
$$ y = [2049, 527, 1398, 1459, 699, -7, -338, -533, -63, -873, -1368, -777, -1125, -992, -1918, -2289, -2263, -2818, -2823, -2311, -2999, -3329, -3648, -3283, -3397, -3145, -3142, -3115, -4112, -2516, -2446, -3198, -1711, -2536, -2038, -1978, -1582, -1879, -904, -1888, -478, -780, -404, -56, 90, 726, 939, 522, 1173, 1880, 1956, 1862, 2368, 2569, 1555, 2603, 2864, 3049, 2892, 2511, 3087, 2676, 2807, 2445, 3633, 3257, 2972, 3263, 2649, 2808, 2883, 2840, 1890, 1911, 905, 2158, 2036, 1459, 503, 525, -14, -349, -84, 242, -1635, -913, -785, -1621, -2032, -2096, -2956, -2617, -2035, -3048, -2682, -2637, -3048, -3097, -2836, -3113, -3628, -2781, -2566, -2631, -3202, -2975, -1802, -3285, -1938, -1101, -2249, -2759, -1344, -1469, -749, -1480, -1301, -582, 291, 3, 618, 1068, 803, 1170, 1578, 1687, 1716, 2321, 2173, 2535, 2772, 1872, 2581, 2779, 2786, 3063, 2945, 3127, 3424, 3250, 3296, 1744, 2611, 2677, 2165, 2644, 1960, 2440, 1883, 1722, 714, 1289, 1383, 1020, 614, 444, -169, -243, -693, -1219, -1495, -1549, -1295, -1330]
1137a330l49l05k42q70P41o61R33n71m35k11k52R59k12L09M6k03J18k99M69N36
1157a829J41l18N66K97K45n1l47O13k76N35J032J13n38O4P45j083J897o61J939
1176C084q87L6O57k24P47l84j78J51P65r05n50M88M73j150L54k6o37J6K57M78
1196B565n49j299N47K54l39q30K34o96l92J47o90K35j6j3o12N82n93j088K29J
1216b323l67P14o74m31J221P3o50k00l12O80o18l97J659p44K5J022J01q24R80
1235a065P23m66l9R67n32P55o26O73j46L49P20o53N85L21KJ75M79M15p15p6M72
1256B318m48R32m81j092J005L70P28o93j110M72p09J23J66K72k77n42m31k91J90
1275E02L32j144P03m07k59p38Q40q34J97p11Q13j192K48J68l29K16P63j691J822
$$ y = [-1330, -1679, -1984, -2226, -3096, -2355, -3016, -2083, -2654, -3089, -3300, -3552, -2593, -2805, -2496, -2450, -2653, -2535, -2834, -2365, -1829, -1688, -2006, -1440, -1143, -898, -949, -1296, -683, -959, -424, 608, 721, 183, 247, 992, -91, 1806, 1145, 3084, 2197, 2233, 2890, 2666, 3413, 3029, 2851, 3002, 3767, 2862, 2312, 2800, 3273, 2123, 2477, 2451, 1814, 1830, 2087, 2565, 2016, 717, 1264, 1518, 1179, 349, 583, -113, -505, -358, -1048, -813, -829, -842, -1454, -872, -1465, -2553, -2324, -2323, -2690, -1976, -2650, -3081, -1860, -1787, -2437, -2637, -2949, -2269, -2887, -3284, -1625, -2369, -2344, -1322, -1221, -2045, -1065, -342, -808, -847, 120, -412, 343, -283, 390, 244, 593, 1313, 660, 1245, 1566, 1568, 1743, 2222, 2637, 1922, 1846, 2318, 1870, 2802, 2321, 1229, 2234, 2604, 3332, 2639, 1529, 2001, 1292, 1415, 1581, 1853, 1576, 1034, 603, 312, 502, 834, -310, 393, -14, -273, -1011, -171, -1005, -808, -1519, -706, -1898, -1650, -1482, -1811, -1595, -832, -2523, -701]
1294g01r54j063k79J409j103nJ754j831R67L10j188O27M2J582M64k142P44J291
1312g6N5j142O64j99J514q26Q21l78Q35r35O25J145O79j147J722k032M38J100
1330B863j914R51R83j058K27P64l5j102J068n11l22mj90n5n17N32j315J355j490
1349B30j63k22jO13m6n21k70K36r60K15J79q3J34j90q53o94J67J168m47l7o38
1370b183n46P32L19m95p77J96J338R7o37p66J724o86M78n5j08J91k36R29N43J73
1390B31qR36q81R2O40j28L84M68k12j6M88n31K01O23m41N44J65n77K03r7L84n26
1412A942l32N62j5m35J13k25o59O35n35L07j858J716j427l04J610n98k60j562
1430a325J074q42o60J74K16O77j98j103M16J436j275o02J32p3J229j646m9l7j00
$$ y = [-701, -1655, -2718, -2997, -1588, -2691, -2696, -942, -2773, -1806, -1496, -2684, -2057, -2015, -433, 31, -2111, -1367, -76, -21, -1163, -499, -698, 816, -10, 811, 433, 1268, 333, 958, 2103, 2782, 1635, 3357, 1325, 1763, 2863, 949, 1900, 2883, 1825, 2052, 2816, 2781, 1679, 2747, 2236, 1914, 1910, 1720, 1665, 1148, 1680, 365, 1720, 230, 67, -155, -156, 457, 411, -110, -380, -144, -1104, -889, -710, -793, -659, -849, -1702, -2396, -2229, -1061, -1508, -1545, -2183, -2729, -1997, -1678, -2173, -2950, -2754, -1416, -1319, -1956, -2722, -998, -1684, -1206, -1261, -1369, -1178, -1414, -485, 58, 231, 223, 1159, 278, 370, 1010, 882, 1266, 1734, 1522, 1506, 1994, 1463, 1664, 2287, 1846, 2390, 2555, 1978, 2181, 2084, 2468, 1942, 1610, 2172, 2157, 1722, 1835, 1610, 951, 1586, 1051, 1358, -500, 1216, -211, -515, 1095, 497, 237, -1325, -251, -1093, -1753, -1579, -1363, -686, -884, -1987, -1571, -135, -1410, -2012, -1880, -1953, -724, -2370, -2419, -2456, -2556]
1449b556Q48J58k3N6j6O82j23l14Q1M43l11K00P29k81J53K09Q94j205J360o31
1469C53M68j16K97k49L45L07m89N58n48J198K36p00J27O3p4J57P9j72M86J68p42
1490A752o75l61J55Q00K58n99n25K21K10j417L42k40q05J002k54k5k0p35R10n14
1510e20k26m43j215L56R36r18J92K9l21O43j12j001P55N3k88N23q11M24J119k101
1530b926Q60J386m38J444j82O4p94o96J690q7K31M63m68M73j30p21M42N17O33
1549A761r70R68m91K78k93J165n66M05L33p89L17j135J189m19M6l12p88O09l07
1568A001N84L45q25m05O84j073j66N17k29m67k57N4q50M88n92k68R22k88r2m27
1588a344m69K79J25K81n28l25m86J624q56L63l85P96J31m07N62j610K88J379o41
$$ y = [-2556, -1708, -1550, -1573, -1517, -1533, -851, -974, -1288, -1207, -764, -1075, -875, -146, -427, -274, -65, 829, -376, 984, 353, 821, 705, 1002, 753, 1098, 1405, 916, 1474, 926, 2124, 2360, 1660, 1787, 1850, 1776, 1933, 2012, 1840, 2326, 2494, 1752, 1077, 716, 871, 1671, 1929, 1330, 805, 1026, 1236, -181, 161, -79, -884, 118, -136, -161, -181, -916, -6, -520, -746, -1189, -2404, -2048, -1112, -2030, -1838, -1809, -2130, -1487, -1599, -2600, -1845, -1792, -2080, -1557, -2368, -1944, -825, -2926, -2066, -680, -1118, 326, 144, 208, -586, -1282, 408, 321, 552, 1015, 547, 1020, 890, 169, 611, 1128, 1761, 791, 1759, 1268, 1546, 1253, 2418, 1852, 2257, 2590, 1801, 2118, 983, 2172, 1753, 1799, 1487, 699, 1308, 1001, 1585, 1930, 1105, 700, 1384, 311, 145, 662, 433, -34, -291, -237, -1087, -599, -1191, -1459, -537, -825, -917, -1344, -1813, -1534, -1409, -1128, -1656, -1981, -2467, -843, -1699, -1336, -1721, -925, -794, -1201, -639, -2249, -1961, -582, -1223]
1607a223O45o29N16M9O32O87n89m65Q48m86j89J337J01q75M82Q12m78k94j53L9
1627G67P74L23q33N31K9j1n65R38k78k47K31o24O54o33O13m16l27M51k80j207
1647a10R60j59j372N08k22p1N72q46M91j14m18j0o35K89l84P6O72m40n90K09o24
1668b218L54l6K14M51j084J241q63O42P58j129J621n79j14o53k8J042J56M62k45
1687hM41j125P40k73O24m4l9K41L92N65q51qM16L24K6M90m03j85R11j26o48M64
1709A924n98J014k84o69J6q85R54l64R9n87M85J22j08j49j051O07p24o1j81K40
1729b00l47l70L37J2o80P13J21p43M98p50k73R98p77P9M38n63l0P57p13O11l38
1750a220M11j20r9J173j564R11q29P11j08p3O61q0L82j96j04P83q19K50M23J47
$$ y = [-1223, -578, -1207, -691, -642, -10, 677, 88, -377, 471, -15, -204, 1133, 1234, 359, 841, 1653, 1175, 881, 728, 767, 1541, 1864, 1031, 1562, 1591, 1580, 1015, 1953, 1675, 1428, 1659, 1035, 1689, 1056, 1669, 1253, 926, 1377, 1097, -110, 850, 691, -681, -173, -395, -466, 106, -740, -249, -363, -781, -791, -1426, -1137, -1521, -1445, -773, -1213, -1803, -1594, -2218, -1864, -1900, -1686, -1235, -2319, -1078, -1941, -1299, -541, -1670, -49, -628, -742, -1395, -1423, -381, -225, 237, -8, 433, -692, 48, -225, 399, 355, 316, 557, 949, 1514, 663, 655, 1071, 1395, 1421, 1911, 1508, 1323, 2234, 2108, 1460, 1924, 1326, 2340, 2056, 1387, 1403, 518, 1472, 1108, 1207, 620, 1105, 1227, 1119, 970, -81, 526, -198, -259, -440, -200, -547, -917, -580, -568, -1248, -535, -414, -1157, -659, -1409, -1682, -684, -1461, -1382, -944, -1507, -1537, -780, -1493, -882, -1220, -809, -929, -1028, 145, -1419, -508, -1337, -626, -734, -807, -146, -226, 156, -40, -144, 639, -180, 70, 493, 640]
1770F40k03J609p50j45q5M86K35p03J24K06M97o80L43j95m75J112j099j46M57
1789A228K43m62j63m72o66N00Q75l09k85l3l68m39j5N99p54K8K80Oj286M79k74
1810a288Q87p50J80r6O55j319L71l58P36j77k61j25r2K5J99o15O57R48j663P88
1830a298m06J522r93O35o3k83K36L28Q31L51r79N99j53j48P67p69K78O41n10K50
1850H36O8k39N28N30j021M56j11P2j48P55o94j2M9m2N93j072n87J046r35k52K39
1871E9P58k99n76L64n97N61j115K61M89k69j009J387j298J151r32o0K0k13K32
1890a086N26J4o19P20j120J37J99J04N35j014N33J37j351J549l60j20J4N39K99
1909c64J0K68Q7P23j492J056J1k86J001j160J33J003q25Q42K55m74L88n82L48
$$ y = [640, 437, 2046, 1296, 1151, 1066, 1552, 1787, 1084, 1208, 1414, 1911, 1231, 1574, 1379, 904, 2016, 917, 771, 1228, 1471, 1009, 846, 374, -292, 208, 1083, 774, 489, 456, 88, -351, -366, 233, -521, -493, -213, -207, -1493, -1014, -1288, -401, -1151, -971, -1067, -412, -1731, -1360, -1718, -982, -1159, -1420, -1545, -1637, -1612, -1413, -2028, -1371, -423, -2086, -1298, -1704, -182, -1175, -540, -603, -886, -650, -322, 509, 860, -119, 480, 327, 179, 946, 177, 455, 1096, 586, 836, 904, 665, 1193, 1723, 702, 1158, 1047, 1119, 971, 1726, 1032, 1020, 1069, 1027, 1620, 548, -39, 1007, 72, -180, 59, 817, 518, -58, 306, -291, 270, -845, -584, -95, -364, -1373, 14, -1284, -133, -1065, -1125, -1105, -1318, -1086, -560, -546, -1165, -445, -1565, -1428, -1229, -1125, -590, -1604, -1071, -934, -2285, -736, -1096, -1216, -1202, -663, -364, -354, -86, 1, 724, -768, 288, 299, 13, 1014, -146, -13, 990, 165, 1007, 1262, 788, 1176, 594, 942]
1928I42l11R1L46k96N95Q8K4o24J38N99m31j82k33j14m15N35k77M03n89J42l92
1949C9m96K60Q5m72L60j26L11k06K80q02K06k73J11m6l42K66l30n93R63r79L77
1970a407o7M4o83J068P59o04P9j78N42N23l98l72N50o36J81J051p9m58K48K16
1990C79n19M51R4J686r57j031J298m8J8K10p38J176q51j19j36O61o75K10K6rr49
2011A77P42k10l35N37k51n38N66n3k41N93n48l06M5n11j07j88j77L62O6j69K36
2032c10k75L4l98n06N38l28N87q1m29P46n72J98k67M79p93J07Q0J03n34J302m21
2053g40L72k03M14L4l94O39o09O59j96L06L27l85K4J77K64j45J85Q12j509J392
2073A424o27j43j46Q27n51J51j037J087P3n62M55r7o3M31L87l31j069j03Q59j05
$$ y = [942, 631, 722, 1068, 772, 1367, 1455, 1479, 855, 993, 1592, 1161, 979, 746, 632, 217, 752, 475, 878, 289, 431, 39, -457, -197, -112, -584, -224, -350, -39, -245, 35, -767, -561, -834, -723, -769, -1111, -845, -1175, -1768, -805, -1784, -1407, -1474, -1430, -2113, -1045, -286, -890, -811, -989, -447, 76, -322, -694, -144, -780, -599, 452, 373, -85, 163, 379, -140, 311, 405, 2091, 1134, 103, 1401, 1353, 1371, 1581, 843, 2019, 1168, 1049, 913, 1574, 899, 1109, 1135, 1126, 177, 919, 709, 374, 911, 660, 122, 688, 635, 394, 987, 439, 133, 178, -333, -440, -628, -805, -443, -377, -546, -310, -585, -551, -949, -1455, -917, -1245, -658, -739, -1168, -422, -994, -796, -1063, -584, -1377, -1270, -1190, -1087, -1621, -319, -740, -368, -571, -157, -123, -517, 122, -487, 172, -24, 282, 609, 224, 248, 425, 689, 544, 729, 1541, 32, 1424, 797, 654, 508, 1335, 784, 935, -102, 985, 1058, 496, 951, 854, 791, 1222, 1609, 1278, 209, 106, 965, 860]
2093H60o08l4m13J98J46o83M57k24j49O3M68m25n45k79M41j10M44m43l9l19N28
2114f66r4q06L64J031j077O05L5o53N0O26r67N97J570k87l28M95L90o78j08p57
2134f58K30N62m75RL32O14m07L81l48L25K29L24j94m36M00l61J145r27M50m41
2154G54R1K16K94r98Q70k10M35n24j78N34o42m63R95J06o12p37Q49p65o24L18
2174b91K17J18k18P02j441P34n15o03M24L93Po82k11Q26k62L0L15o75J62j47N51
2195e66N82n19q81O79M74j859J341p82J437j107R80K26m22J77J59r80L92R02m04
2214a71J045k84K52j165R67n57K11J029j098J243q46N96l78k77JR25m84k97j11
2233F01k79O15n94K43n32K01kO44j129Q72J12j254K02L43p25M17P37o18q4l51
$$ y = [860, 252, 218, -195, 3, 149, -534, -77, -301, -450, -387, 81, -344, -889, -1168, -727, -837, -393, -836, -875, -1194, -666, -760, -1566, -1202, -171, -1248, -643, -608, -1261, -1211, -585, -1552, -955, 615, 328, 0, 495, 885, 207, 99, -658, -428, 134, -341, -332, 0, 614, 207, 588, 240, 565, 794, 1118, 924, 488, 888, 527, 1672, 745, 1195, 754, 845, 1061, 1355, 357, 1227, 1017, 1452, 928, 750, 1284, 642, 179, 1174, 1280, 668, -69, 780, 15, -609, -291, -74, 44, -174, 528, -913, -179, -694, -1297, -873, -480, -473, -1155, -1366, -540, -802, -772, -457, -1132, -970, -1117, -566, 16, -503, -1384, -705, -231, -2090, -749, -1531, -94, -1201, -221, 5, -417, -240, -81, -1061, -669, 233, -171, 874, 590, 842, -323, 644, 87, 298, 1327, 229, 1472, 626, 1222, 844, 567, 568, 1493, 1009, 712, 601, 322, 937, 343, 586, 54, 255, 253, 897, -232, 640, 752, -502, -300, 43, -682, -265, 472, -146, -230, -581]
2253e81P46o42j92O60q46N84q15J168j029k40M49n39J037N88j719J562j780J054
2271e35Rj051J164Q15j444R30o1q5l67M46o67N68N32n81O8j18M86m74L63N41m0
2292D99l19L02n39P27J7l8Q8j23k85O58n98N56k67k34M53o0m01K47J96r46P72
2313G05k21L73k13l09j50n20K41L77L30j618J531p19N64q81J30R01j367l13N17
2332f42n72R75m40j5k49N5M40n44R81p14m0j14L20J80Q7N73l06j246L32M06K37
2353b96m50J579j074M96M0p83L92N72l03N92q16L03L38j44Q0J15K69m44K50k48
2373D68k79p9P12k24l30M88l10K51k30p7j44J22P85l07j267M65L93l75M01k72
2393A91m85P78j056J26O96P1J07r18L1M69o77J037p38r14J186o23l26J74L67m19
$$ y = [-581, 165, -477, -669, -9, -855, -271, -1086, 82, -947, -1187, -738, -1277, -240, 348, -1371, 191, -1589, -535, -526, -1577, -413, 402, -1042, -112, -173, -258, -625, -179, -846, -278, 254, -327, -259, -377, 109, -365, -2, 539, 499, 180, 482, -57, 670, 687, 649, 737, 614, 329, 987, 389, 945, 678, 444, 897, 837, 436, 683, 879, -67, 705, 484, 857, 644, 335, 185, -335, -94, 283, 613, -1005, 526, -193, 371, -510, -380, 521, -846, -1159, -642, -1214, -239, -679, -694, -943, -888, -448, -992, -11, -725, -765, -879, -559, -379, -292, 281, -25, -1271, -939, -533, -296, -746, 833, -241, 255, 295, -488, -96, 476, 173, 765, -51, 252, 590, 446, 526, 641, 910, 466, 716, 468, 189, 110, 822, 598, 268, 756, 446, 697, 467, 390, 246, 368, 1153, 846, -421, 44, 437, 62, 463, 191, -294, 484, -572, -446, 250, 321, 428, -490, -459, 10, -667, 370, -368, -1282, -96, -719, -1045, -871, -504, -923]
2413i23L15J77n5J31q29O13j53N01l71m42O31L65q33J805j530O44P0m81L95P95
2433H25r19K30J63J00k35j65L62L23j94J92l7j59R2j61L68l02l1O40l12N79Nk95
2455A069J81q93J96L94p95L57J76n85n82r1Q98Q7k26k11O42J23j022L37p15K35
2475d25l95M49J14o69j42J407r05k12N32p09K97o27R42l74L41K40k48K17n26M30
2495b63j49K06l41P1n28Q14O54r80P31l81J96J48J08n79K24K17j21K23J52J80
2515E82K6p93Q85k76R74j071P31o95Q51m43K8o13L23L67m41Q94o42o41O6L02k99
2536A15N07k16j42J43l14P7m16L48J33q59R90o00M39q81O58q85k16R13k74O19
2556A39q39l63N01l37R82K22o62j91j53K4m00J218o76m7j28J42m51O56L89j049
$$ y = [-923, -608, -431, -486, -355, -1184, -571, -724, -223, -594, -1036, -405, -40, -873, 932, -598, 46, 116, -365, 30, 825, -94, 136, 299, 399, 164, -1, 361, 684, 490, 682, 645, 486, 578, 417, 785, 483, 452, 1092, 780, 1359, 1364, 1069, 1250, 357, 553, 947, 152, 509, 685, 100, -482, -573, 325, 412, 186, -25, 617, 740, -282, 55, -660, -425, -820, -371, -257, -926, -1068, 339, -566, -778, -246, -955, -658, -1285, -343, -717, -376, -136, -384, -167, -693, -263, -412, -206, -547, -476, -1004, -190, 464, -516, 215, -166, 30, 178, 286, -293, -69, 148, 27, 250, 402, 582, 608, -185, 700, 424, 1398, 327, 1058, 363, 1214, 771, 799, 186, 509, 876, 435, 1329, 687, 46, 112, 414, 115, 622, 406, 264, 407, 93, 170, -246, 102, 235, -624, 366, -234, 205, -676, -18, -903, -1119, -206, -480, 139, -700, -1063, -562, -899, 83, 305, -357, -548, -701, -677, -1077, 141, -535, -582, -710, -568, -1019, -363, 26, -1023]
2576a023J227m80J95k29Q28l12o79N43O58j59q74R82K44r65J024l18PP41o57O67
2596A420n47j125Q21K42m2R74j316K40q3l64L50n87Q41r02K47k12P4J18J7k20
2616e4j57n9Q71n92j18O9L72j073J006j240J86L87L0k38n76M53J139j791J139
2635b46n75N96K35o29k03m51R71O01n54P5J02j79j88P68m00j26l15Q74l21J5m5
2656EN89j126J3M31J48K67o72R58l8n18M81J59J14l01O43K49j184O32K10p02j35
2677B23J23m12Q72m97j54o8K91k12J62n32l4O44o9q9n83K46K60n94K89n14N02
2698a46m38P01k22K33n48J31j61J60O9n90j74Q26n21n16P01K1n92L29N38K16J46
2719A63l71L8l8J42k80k12J171j366j37N16K97k72K65L15%r6l70O41k72Q46o77
$$ y = [-1023, 204, -276, -81, -310, 518, 206, -473, 70, 728, 569, -305, 677, 921, -44, 980, 662, 669, 1410, 753, 1420, 873, -252, 569, 811, 769, 1743, 427, 667, 584, 220, 570, -17, 824, -78, 169, -43, 31, 149, 166, -54, -211, -270, 601, 9, -109, -40, 332, -741, 265, -975, -789, -402, -372, -610, -1186, -733, 406, -1385, -246, -821, -225, 10, -619, -822, -1273, -302, 299, -255, -180, -78, -257, -445, 323, -77, -203, -518, 356, 35, 50, 5, 594, -532, -519, -88, 60, 327, -345, 613, 575, 57, 538, 697, 811, 510, 1153, 1402, 218, 850, 1060, 358, 223, 346, -66, 806, 309, 155, 87, 378, 166, 328, -204, -238, 406, 337, 248, -335, -89, 171, -423, -134, -648, -146, -584, 117, -105, 128, -420, -289, -450, -290, -221, -811, -985, -159, -680, -1196, -495, -474, -1066, -737, -199, 17, 163, -208, -170, -208, -66, -346, -558, 613, -753, -890, -374, -77, -349, -84, 231, 231, 135, -235, 406, 134, 980, 303]
2740C03k25N86m13o43J585r09O10J58m82k35l34J166l58o81M39j89k94L10k67
2759A27N4n44Q11o3q1R2R08j279j280P10J96J61l41j86N7l71N59O07o60N15j43
2780a51q75M03k13K88N08O4m53L4J18N39k61o68N25m67P28o35J86K40J96K68L1
2801D05r6o88Q07K33l66k6N4j22Q6N5J83J58j57j87j05K8L99j52K0m29J44l70
2823a26P00M94L5q28M78K26j192M21O98q48L48j06k63M65k60j292J287o3K81n09
2843e4Q9M71n92k68l06J088o08q40J246k98q86R14q52j11q0Mp9P84J57p66M64
2864e23P83m88m86K83l02n1P10N8n78l37P05L88K40m75Q41k16j80r52J801m06
2884H15j337J298P4m18L37k76P1l28L04m09P84m4o59L6J121q02o17O04p31R77
$$ y = [303, 78, 664, 251, -392, 1193, 284, 894, 1052, 570, 335, 1, 1167, 809, 128, 567, 378, 84, 394, 127, 181, -363, 448, 385, 304, 396, 1304, 25, -1255, -545, -349, -188, -529, -715, -658, -1029, -470, 137, -523, -8, -151, -1026, -623, -836, -548, -40, 24, -429, -395, -277, 262, 1, -667, -142, -609, 119, -516, -330, -90, 106, 374, 405, 309, -379, 428, 661, 295, 269, 323, 201, 287, 342, 525, 683, 526, 339, 234, 262, 661, 509, 529, 100, 244, -126, 574, 1068, 1103, 275, 753, 979, -213, 208, 906, 58, 406, 300, 37, 502, 242, -1050, 237, 174, 455, -54, 35, 506, -86, -354, -660, 428, -180, -1020, 226, -72, -958, -44, -896, -1007, -1087, -1083, -1162, -378, -221, -987, -523, 260, -228, -714, -431, -733, -784, -74, -16, -594, -931, -226, 162, 402, -73, 768, 552, 372, -580, 1221, 815, -522, 776, 850, 432, 769, 493, 564, 236, 540, 131, 915, 871, 212, 248, 1369, 567, -50, 554, -177, 800]
2904H00M20o54o82R84J8n45J96j090J233k24k03J04m77P5j1K9j18m11J217j340
2924f79Q65j320Q53L5n93Q03K0o06L61n83K50l54K14N7M54j52p8O36q05J044j794
2945a372J058M2O9J78M36q22k61J959n9r12j26r88P09j56R49q44P87P99j549N83
2965D80m4l42M10L76n34j9j58k34M48j40J07M36p42K62P1j70K32O23j35j74k14
2986E39j238J444q67o51P02J8O6P9J47n03m86N24N13n12n44J99n82J314o74L24
3006a88n42n53J198m75K76l19p8P37p09Q2J91n30J560m84n56K36q5K48j24M13
3026B98o28P42j224J543k76n39Q41k16n5m16l71Q86k80L53N3m44J015j325J151
3045A108r65L36l45L13j317J460p93M54j33O86o41N30l42j060P30L40k87K71r53
$$ y = [800, 1220, 566, -116, 868, 886, 341, 537, -553, 680, 456, 253, 357, -120, -45, -56, -27, -145, -556, 661, -679, 186, -1134, -281, -246, -839, -36, -16, -622, -261, -844, -594, -948, -734, -677, -223, -375, -453, 183, -622, 422, -1372, -314, -272, -203, -25, 411, -411, -672, 1287, 1228, 316, 190, -798, -89, -245, 704, -140, 647, 1446, -103, 480, 436, 94, 504, 880, 346, 327, 169, -65, 383, 243, 350, 786, 44, 306, 377, 207, 439, 1062, 927, 753, 539, -699, 745, -122, -773, -71, -53, 13, 92, 239, -264, -750, -226, 287, -225, -769, -570, -1152, 162, -512, -188, -730, -1283, -85, -560, -284, -603, -681, 56, -653, -571, -380, -910, 650, 166, -390, -154, -239, 9, -115, 298, -330, 412, -812, 731, 455, -84, 757, 541, 486, 70, -301, 585, 305, 658, 711, 267, 1282, -43, 1108, 143, 479, 134, 447, -870, 590, -203, 251, 118, 804, 163, 693, 351, -709, 21, 361, 74, 345, -608]
3064f08J62J132J30o80l48k58l63J142n55m21L86m65O18j65k37N13j51j22J03
3083a87m73L67J34K48o50O82n16m07Q84m76q9j8L8L88k87k32N04Q38o80J54Nm98
3105b71O17L36l49N14j45l11j9k9l7NM15p2r88Q58O01j200K38L70K69q71P52j9
3127F64j56q41n7J271l19K05l68q57J97k8K63L0p97k18M22M29p06J060p79j22
3147g07K43n36J010m6k72L79n15J98J91l96O7m04m3M40L86n74q55J345m20m10
3167i19J002p74K91k07Q8M8j29P15r18J440m88q23J62M96j56J206O42j398L09
3186E87k31L4J05l50J67p28Q93k74Q93p65M16j49n45N30n29oK09M06R8o59O55
3207G57Q10j881J035m52o20l26j71M75M84j65L54q37o16O93J502p76j267M82k33
$$ y = [-608, -446, 686, 816, 136, -212, -470, -833, 309, -246, -667, -281, -746, -128, -293, -530, -17, -168, -290, -187, -660, -293, -159, 89, -561, 121, -395, -802, 82, -394, -483, -501, -463, -75, -362, -594, -90, 748, 68, 222, 227, -271, 346, 682, 333, 847, 702, 391, 372, 343, 306, 311, 726, 654, -334, 524, 1125, -75, 163, 533, 802, -69, 683, 664, 508, -333, -390, 881, 562, 767, 399, -458, -261, -289, -26, 4, -793, -1011, -589, -160, -866, 194, -585, -707, -464, -1000, 10, -36, -308, 71, -444, -246, -55, -451, -384, -788, -831, -391, -5, -579, -1434, -89, -509, -919, 83, -691, -400, -607, -519, -471, -600, 115, -803, 637, 149, -674, -512, -16, -172, 1034, 1676, 278, 587, 356, 390, 495, 145, 312, -416, 477, 203, 1096, 331, 747, 598, 53, 583, 54, 48, 257, 663, 761, 102, 757, 1567, -314, 721, 269, -351, -677, -848, -373, 111, -54, 300, -537, -1153, -460, 1042, 266, -1001, -519, -752]
3226g52L03J00J039r59q52J732j280l26J579j167J039j227J64l74J607k247J573
3243d8m19l94M72NJ06p60l29J52J034r8N60R6k7L3l46O09J19j068J129k60m76
3264I0N14q22J127n14K69l78j09K42r9M14J40m98n54J344j288K79j16L98K53j213
3284e21J179m43pp77O70j48q04J065r02M91K31j181J169m05k21N39m17j70k00
3303h52L20K38n42Q9L73m97P8M5M66M78n86L92j121N24Q97q02O49q75J489m77
3323B86j91j25l58N87j45N07L87k40o00M45r95R25Q0J44m27J31M44l96l72K99
3343C86M76r83M88N2K7q76J130o02L8q6M22k97l01J578j280K35k93n00N78k42
3363e0n18Q34k05o91O0N7L23p88J079p5K92j70p25m4O54q31R20j053p17J234m00
$$ y = [-752, -449, -349, 690, -269, -1121, 611, -669, -995, 584, -583, 456, -771, -607, -981, 626, -1621, -48, -467, -861, -389, -384, -278, -1038, -1367, -1215, -181, -279, 281, 377, 350, 383, 37, 646, 765, -303, 826, 566, 90, 604, -218, 909, 395, 664, 286, 177, 419, 320, 734, 874, 376, -178, 1166, -122, 157, 41, 439, 692, -521, 658, 215, 208, -569, 101, -47, -851, 214, -688, -197, 34, -1147, 22, -383, -604, -65, -482, -652, -852, -532, -294, -836, -747, -374, -871, -793, -748, -282, 196, -390, 2, -1119, -595, 302, -500, 149, -726, 763, 286, 95, -30, -388, 199, 54, 561, 948, 708, 108, 553, -442, 483, 563, 707, 280, 411, 855, 459, 87, 386, 862, -121, 367, 419, 446, -430, 700, 98, 136, 50, 472, 175, -126, 1452, 172, 407, 114, -386, 192, -50, -568, 266, 61, -630, -570, -513, -190, -978, 101, 26, 318, 148, -577, -621, 33, -798, 122, -931, -1648, -414, -814]
3384h14M1M74j80m3l92N39J95q1O34m03n33N74k48N54J82L36n01R4P84j159J050
3405A103n74q12k96R53J67j096N57M36k58P57J01m99q42N35N36m95P5j52L30p48
3425b22Q40K54q34O35o10J81j08n01L07M47L79P8j009N72j90m35L45J17n32L9
3445b47p13K04J308j124J79j83m71K83j02N11p8n6m62K93n53J052J05l01J92L12
3465A49J90k52Q7j50K33o15k35M34l4P5M40p3k83Q16l29p01L99l11m12J133K0
3486E81k61l92J75k1P6m9J72M06n21L62l66L76r6L53n04k69PQ37k84m7n47J27
3508A15k43K36k89n34Q30Q92q72j75K3M85M94j152p26J20k61N13m19k8J407o54
3528b38q47Q54m81K44K65m1L45K22m68l9m30j34P32J67L4k14R82n16o8q02L63
$$ y = [-814, -773, -299, -479, -522, -914, -375, -180, -261, 373, -30, -563, 11, -237, 317, 499, 835, 334, 428, 1212, 53, 1103, 529, -283, -579, 374, 541, -555, 2, 438, 180, 937, 1038, 539, -303, 232, 768, 273, 348, 196, 526, -222, 618, 872, 38, 673, 63, 244, 136, -365, -58, 389, 768, 846, -163, 409, 219, -216, 129, 246, -286, -247, -960, -756, 552, -572, -393, -576, -1047, -764, -866, -355, -433, -489, -951, -658, -1211, -159, -54, -355, -163, 149, 339, 87, 174, 24, 257, -358, -593, -159, -193, -118, 322, 249, -34, 782, 453, -248, 151, -160, -572, 561, 581, 320, -72, 103, 82, 158, 109, 281, 687, 166, 528, 162, 538, 442, 795, 291, 22, 29, 866, 582, 535, -12, 115, -128, 108, -181, -715, 115, 1007, 135, -40, -17, 468, 962, -190, -916, -796, -1057, -544, -963, -991, 416, -238, -1085, -231, -712, -468, -203, -244, 101, 323, -145, -184, -614, -748, -16, 151, 185, -29, 953, 437, 369, -433, -70]
3549g0m10M09N09pM73j209M89r03P33J53r0n19P72J90k69L94r17J004l57M96j54
3570G17n29J46p85N62K38OK48P8l3q5n25O8j03l06l35J070l24n29P49n61k41J32
3592c42P6K66j232O80j84K93Q57l93l41k03o51k01M50J490j403M76K83p96p9N08
3612d46J1J49M52J13J26p88R09j644P05pP01j36q5P6K44q65m53J477M81j033J8
3633Em79J100m9m53o8m06Q76l83j06L1L84n42L95K37J57N64j567L00q33J182M91
3654H36l76j042J016n63K08p1n91P44J94n90m16O40Q4q97N19m89L29N89r70J031
3674A85r87N85J10j16Q6l33N28l08j8J97l44pm96n6Q10K46l55l96L26K07L74L1
3696B69j80l23P58K36r70P38p18K06J08M36q73K27N53k32q29J505j500J229l48
$$ y = [-70, -480, -71, 438, 431, 904, -305, 184, -719, 14, 167, 77, -442, 330, 520, 251, 645, -272, 732, 375, 871, 717, 188, 334, -451, 111, 349, 355, 603, 681, 648, 563, 38, 106, 3, -303, -638, 432, 108, -421, 328, -233, -474, -342, -266, 0, -1232, -552, -736, -443, 414, 21, -320, -523, -1174, -1375, -925, 565, -838, -362, -79, -875, -954, -446, -435, -286, 166, 279, 405, -383, 526, -1118, -413, -420, 281, 145, 60, 136, 380, -485, -938, 539, 1020, -13, 5, -474, 626, 577, 124, 56, -350, 526, 143, 37, 68, 452, -90, 305, 542, 699, 1263, -304, -4, -837, 345, 836, 460, -582, 434, -129, 79, 8, -583, 161, 355, -235, -651, -11, 73, -824, -305, -794, -465, 124, -846, 185, -802, -217, -107, -223, -137, -470, 58, -250, -268, -71, -415, -422, -918, -974, -164, 82, -273, -669, -343, -136, 238, 269, 89, -234, 524, 760, -210, 528, -190, 16, 124, 560, -313, -86, 467, 235, -594, 911, -589, 640, 292]
3715B92j18P56j086l4O22Q89j056K65j71J34O07j721R15L27q57L47k41O13q31
3734c48O26K87k27j143P02L5K90L2j285L36J167p56j56O57q37L39N85q46L63J83
3754Dq87P42r82Q88L89r11P93j28k24L64m61K68qO38l23o13K93L85p47N22k80
3775b78O99m78K76r61M11N13L07N35q17L46l65L23O6m34n6J43n2M43k1j47k35
3796B18l20M97l90M98l12m05N24J8M99n13l82k84O27k41M3o62P56o14K33l25j35
3817f70J95l41N95J32l9R4L94n97n40J9N02k14l44k0J583j637L86P89q05j188
3837a706J750r73J199q72o34J208o2P72q2j48r72K122j327m25o82L01m32J592
3855F29j356K82m07J066k94k5R58o44o62M88j0q3n2n7N04j86k2l05M32J63l93
$$ y = [292, 174, 930, -156, -190, 432, 1321, 265, 530, 359, 493, 1100, -621, 294, 621, -236, 111, -130, 483, -348, 278, 565, 338, -805, -103, -68, 222, 254, -1031, -695, 472, -284, -440, 217, -620, -281, 304, -542, -179, 4, -883, -141, -1123, -235, 154, -757, 36, -92, -316, 48, -413, -145, -153, 485, 162, -451, -158, 227, -520, 2, -278, 421, -57, 219, -742, -331, 182, 489, 1024, 207, 553, 188, 511, 577, 143, 87, 230, 178, 621, 600, 453, 218, -102, 395, 5, 503, 191, -214, 310, 328, 827, 314, -68, -352, 275, 34, 77, -585, 171, -443, -210, -535, -670, -475, -816, -221, -89, -128, -34, 360, -237, -777, -758, -256, -470, -814, -834, 749, -888, -502, 287, -518, -1706, 44, -929, 270, -602, -1236, -28, -90, 682, 600, 452, -520, 1602, 275, -150, -832, -531, -963, 629, -727, -445, -852, 214, -80, -105, 853, 209, -453, 35, 25, -58, -110, -167, 337, 151, 129, -176, 256, 419, 26]
3876B6k45m2R73j076j72R02p92N77Q39j691J010j45m95R81n36n3J72o36M47o68
3896f24O12p6r17P80P6j433K004N28r35r71J422J61m20n83K16P59r45l68K86J076
3916F48j46m72p08J145r0j104J49R04L04o21J12k50r48J130o11J185n83J43L46
3935E33o1J17N39j605Q21j93M37o58J26K32P6n95j38L34l39K31L30j91M08m37
3955c3o06M0O43J02K06l34q74M37R2L15l86L3K65j60l53P96j114P34q34J182k83
3976a32m75N39N93p75j25Q5o18J311j294O62m20J150n91j53n38Q73K45p24Q83
3995D96m84k9pO52j070J39O9O79j19J21o48j06L89n54J013m91L49n2O84J54j186
4016aJ132j487M62k3Q73j319N51k81R69q10k38N10q93P37j03j67R9m20j08L59
$$ y = [26, -219, -261, 712, -364, -536, 366, -426, 151, 990, -701, 309, 164, -331, 650, 114, 61, 233, -403, 44, -624, -12, -88, -1005, -225, -149, -1582, 422, 950, 15, -956, 466, 627, 207, -376, -160, 599, -346, -714, -428, 648, 502, 30, -678, 467, 377, -727, -578, 326, 630, 9, 121, -129, -1077, 53, -558, 627, 44, 187, 533, 472, 589, 1128, -477, 344, 151, 588, -70, 56, 288, 364, -231, -369, -35, -374, -143, 187, -4, 404, -33, -639, -599, 44, 146, 352, 18, -856, -419, -327, -12, -398, -365, -100, -260, -613, 183, -931, -197, -1031, 151, -132, -607, -68, 525, -250, -375, -290, -908, 403, -891, -229, -649, 501, -90, -243, -781, 92, 337, -387, 496, 12, -17, -24, 628, -442, -303, -234, 445, 326, 447, -201, -307, 82, -472, 541, 50, 399, 347, 1031, 1185, -1, 1131, -356, 106, 83, 956, -363, 188, -93, 876, 66, -172, 338, -555, 182, 79, -88, 11, -409, -517, -158]
4036a58j91O86Q8m31k20j7L83p40N01M51m37Q41j941N92k23j18N04K95K53j227
4056a109J035J56n29P67kp16j33K10N70M6q65Q19k60k3k72R08p81L03K59M63r73
4077a27J066j015K41K54j40m81N47L00j6k91k38J07P52l39q96J003J75j021M16
4096B97l34n53R88q50P65l43L3l2l75K3O07k58M21l08l35q16P78L88k71m01N17
4117e9Q0K09o68J78j66L85j04p14J015j60P8m69N66j5K52j037n40J109L0l42l98
4138g70N46L13P7k09r8N9L31K14J11p91l4N89Q7l70n76j04R89k64J02J28K13j75
4160C68m45k09N28J84k69N6N51j111J21J257j049K95k06j83P36K42j04j832J35
4179i35J070L35k90r36P45p17N21J04m00R28J33j219L69r5M47m79R77n85j80N49
$$ y = [-158, -349, 337, 425, -6, -226, -243, 140, -600, -99, 352, -85, 756, -1185, -593, -816, -934, -430, -135, 118, -1109, -74, 82, -447, 320, 318, -398, -531, -321, 249, 295, -570, 249, -11, -34, -306, 602, -179, 124, 383, 846, -127, 939, -76, 165, 419, 279, -202, 345, 645, 629, 338, 100, 207, 959, 620, -276, 727, 902, -119, 297, -37, -590, 398, -452, 313, -30, 3, -29, -404, -381, 226, -32, 389, 81, -254, -1070, -292, 96, -175, -576, -59, 21, 230, -438, -260, -426, -41, -145, -859, 156, -4, 74, -395, 171, 156, 408, -629, -1169, -60, -30, -372, -770, -224, 89, 166, -43, -141, -82, 249, 463, 574, -217, -251, 338, 425, 55, -521, -625, 364, 100, 202, 330, 543, 368, -77, -286, 242, 426, 157, 213, 764, -347, -226, 1031, -18, 277, 71, -112, 624, 866, 762, -1070, -935, 135, 470, 180, -756, -11, -728, -207, -103, -503, 425, 558, -661, -292, -387, 60, -419, 558, -27, -207, 342]
4199C42m20k97J19l23o37J498j173J189l21K64n04M23K95J23K48m92m27N02k84
4218A25M72j94K29p00k0J15m28J044j187O77j22K07oj96M24K51L01N12j134k27
4238A43M51j035l05R19K49l96N13o78k21P07j043R67k35l9Q3K50o62L96K46k41
4258F9N22p26q52J341p06J48O8K19k46k56O30q97J405j73j143O47n09N46K23j11
4278A99l85k24p3P95k64P3n26r7N00Q58r09J77O4l64M93p61M89M65m84M20n9j83
4300B04j13R08l90p63L72L66k83m54K78l5J60Q7K37n94M70m65J63j44j86l96Q41
4321B63N1J65p29N71K01J9L3l09j15l35j40k67K50n3O57j150J433r39P80j152
4341g66M56M54j151J048j8L28p61M5l96N72k44J159r50L75J18J49m20Lr01j12
$$ y = [342, -78, -375, -256, -579, -1216, 282, -891, 298, -23, 241, -263, 160, 455, 578, 826, 334, -93, 409, 125, 597, 403, 632, -68, -88, 27, -401, 643, -544, 133, 11, 218, 212, 16, 440, 691, 992, 1504, 370, 143, 594, -441, -746, 173, 422, 26, 539, -139, -360, 347, -696, 271, 36, -3, 80, 330, -332, 64, 310, 69, 591, -135, -987, 354, -352, -204, -136, 83, -163, -419, 211, -686, 719, 546, -597, 50, -459, 87, 310, 199, -186, -410, -483, 312, 48, 121, -405, -502, -2, 856, -53, 124, 188, -176, 317, -444, 45, 510, 26, 446, 387, 204, 91, 999, 609, -154, 218, 584, 301, -153, 125, 90, 250, 337, 574, -20, 450, -15, 148, 4, -182, -578, 263, 314, 479, -250, 321, 522, 541, 574, 265, 150, -185, -325, -592, -342, -395, 262, -888, 545, -394, 386, -766, -310, 144, -1007, 41, 23, 351, -410, -365, -761, -189, -433, 726, -224, 151, 269, 418, -2, 1, -900, -1012]
4361a012N33O40r05O39R65j089L0n64N30L75J67m42K28K04o7q3L61o51O39oj109
4382f17Q08N94p12R73p79m30M26R4o37M90K94N76j476J75j44J43K90k82M58k11
4402C3j71j45M07O48r07L83o8m85N51k58L9O56j007J021q71k33Q71o08K84q54
4422g14J94J246r09K92L82j135N45o39P15m24M61K46O7j282k24J292j128M09R81
4441C75K53k41J15l34q82O48L47n0M3m27j45K15M62q2J35M41m90O9q22J031n71
4462I0J08Q3qp7P1n71K67K17L96j19k4j037O9M58L67j13j57J66o34J006J4l02
4484B70L62J54o02m27j22P63p32J99n9o62N23K86n13J17M32j392L80J094j226
4503a155k40J399o78R79m68K84k65o99K68M99o56J083L86j284N92O63j508J374
$$ y = [-1012, -479, 161, -744, -105, 860, -229, -199, -763, -233, 142, 309, -133, 95, 299, 232, 149, 510, -141, 498, 492, -617, 191, 785, 73, 1046, 267, -163, 263, 357, -280, 210, 504, 1080, -396, -221, -365, -222, 68, -214, 244, 33, -138, -283, 124, 772, -135, 248, 180, -305, 246, -12, 27, 683, -324, 697, -174, -407, 464, -144, 140, -714, -520, 726, -183, 109, 491, -644, -99, -738, -23, -447, 14, 260, 327, -955, -1179, 113, -1015, -606, 375, 628, 387, 502, 168, -714, -66, 281, 231, 274, -153, -298, -83, 379, 297, 432, 873, 383, 452, -370, 661, 90, 198, 281, 273, 196, 267, -304, -37, 180, 576, 457, 433, -604, -535, -77, 290, 177, 20, 186, -448, 558, 572, 270, 632, 786, 184, -243, -365, 398, -334, -135, -194, -856, -333, -47, -560, -443, -11, -1403, -1023, 71, -1155, -1395, 4, -674, 305, -163, 121, -144, -843, -575, -76, -732, 351, 737, -547, 45, 708, -800, 574]
4521E74K97q77j57m12K127k521J092J560p22j768J680o12q53L25M28o29Q35K57
4539F24m49j004J409j409J448j35m64L62k33j45j13M48m75J08m89l34O79K48m
4558G2m01Q55P3j272L13r1l97O80J246j885J367j428P07O75q41O42j451J950q28
4577a4j94r96J424n48J027j315M48L07M64r35Q8j32j9j2J89m43O44k9L11k43J75
4598A97j91N94n22k06L13q01J286n49q84P40M77j48n65N31o74R39m12J172k291
4617i94J388l51m45J106q23N81K98n44M72l07m3K07n8k02J33o71L03o72m52J763
4637F89K18n79j385J500k11j175L3P87o44J381j245j53J33O49j695J779m56j4
4655c88n72J108P71q30O75j647R60m92R0M71j38L21o79q74J120K85p64J022l01
$$ y = [574, 871, -6, -163, -575, 1552, -969, 123, 1683, 961, -807, 873, 261, -592, -267, 161, -468, 367, 624, 175, -829, 580, -829, 619, 484, 20, 382, 149, 4, -109, 339, -136, -28, -517, -851, -172, 76, 72, -329, 526, 599, -673, -360, -451, -848, -168, 1078, -807, 560, -868, -161, 514, -327, 315, -1136, 814, -14, -208, -1204, 220, -328, 699, -616, -168, 139, 603, -332, -244, -376, -395, -407, -218, -661, -17, -46, 265, 22, 197, 6, 600, 78, -128, 185, -616, 670, 121, -763, -23, 454, 306, -259, 272, -402, 537, 125, 1297, -994, 394, 43, -402, 704, -119, 462, 760, 216, 688, 381, 338, 545, 487, 285, 418, -253, 50, -622, -1074, 689, 907, 328, -1057, 443, 232, -943, -910, -123, -767, 614, -631, -784, -651, -2, -1697, 82, -374, -388, -960, 148, 919, 89, 764, -883, 77, -415, -325, 146, 8, 329, -350, -1224, -104, 181, -583, 439, 138]
4674A38m9m50P73L34q90O75M12j409O38r90J096m55N10P1k75j91R27j633P24M75
4694D31m94N79M52n61J85k20L26j230L19L01n99L53R56j296M87m05R62m74Ro99
4714f18L06j12o5Q17o12j95p8L26Q81j373M48l03j40Q56K18l72N87j011P05q7
4734A78l90m14J68J29M73o54N51J83j596K338j149O32k61n55N81m05l96J219p28
4753i6p6P95p66O21j180M74K48J13k50l3M02j127O19N47K45j112M41L81K80r63
4773d37J455q24j40m58j18J71N54j96m59J92j25L87r9L34j281O17P78o61o15O89
4793b36n09J343q98M38o9k93q3n55J136m29q8L70k66k0P5J49N4M21j073j39K44
4814d28P2K81L70r98O63J36K04p15O36l53N29q35N34J66N5L02p78L59k87N5N5
$$ y = [138, 89, -361, 412, 746, -144, 531, 943, -466, 172, -818, 278, -177, 333, 404, 129, -62, 865, -768, -44, 431, -63, 516, 968, 407, 592, 372, 698, -532, -213, 88, -511, -158, 798, -498, -11, -416, 546, 72, 81, -618, -312, -424, -489, 328, -284, -479, -557, -231, 650, -723, -275, -578, -718, 138, 356, -16, 571, -440, 265, 178, -212, -626, -458, -329, 144, -510, 41, 224, -1372, 966, -183, 449, 188, -367, 214, -191, -587, 632, -96, -172, 623, -143, 478, -702, -228, 20, 133, -117, -150, 252, -875, -256, 291, 536, -576, -135, 246, 526, -437, 1018, 194, 54, -404, -522, -351, 203, 7, -452, -260, -385, 2, -97, 237, -1044, -427, 351, -310, -925, -236, -745, 598, -300, 138, 69, -224, -307, -862, 274, -155, -243, 127, -139, -159, -84, 65, 119, 540, -533, -672, -428, -356, -75, 295, -703, -40, 96, 300, -415, 221, -132, 397, -438, 96, 262, 317, 619, -159, 200, -87, -32, 23]
4835B3O94l56q65P74n03J97J70j2o38R97o42J31L16o71M11l77O01n1j44j16p3
4856a34nJ30J7l44k71N92M11m33j88j38n15O00M86l03Q8j31J06j01n8J32k91P94
4878D44p50L89k45K08l63N74o26L81k07N95m15O27j25M7j150R28%j53r92Q94n13
4899d52J012R5l39K39l64j5m88K37n77m21J324l24l07L72j67N88p73N87N25k16
4919E36j133J97M31P0j69P31K51r51j60L87l68l75O92No35J155j207K16R58q05
4939a74j5L35l0n62M10n70R21q9M06j202N70K52k31O82o85m91m43J058P03q37
4959Hr3M84p67L13Q30l67k90o21N47O60M26j216R00m8n27j186J436j581J195P77
4979H80j152M08l97q9O95j62q05R12J55L52q03m36O1L56K41R65r74j55J453j041
$$ y = [23, 717, 361, -504, 270, -233, -36, 134, 122, -516, 481, -161, -30, 286, -385, 26, -351, 250, 199, 55, -61, -134, -139, -9, 8, -336, -607, -15, 396, -37, -225, -363, -878, -278, 208, -95, -7, -138, -32, -133, -191, -59, -350, 444, -306, 83, -162, 46, -317, 257, -369, 12, -195, 400, -15, 612, 487, 534, -616, 312, 312, 159, -833, 61, -452, 560, 655, 316, 555, 191, 176, -312, -75, -652, -1073, 251, -73, -380, -8, -175, 413, -360, 227, 752, 536, -597, -400, 31, 101, -68, 663, 914, -37, -197, 190, -178, -553, 139, 144, -491, 664, -543, -327, 631, -174, -189, 146, 116, -446, -36, -606, 315, 226, 632, -570, 0, 252, 21, 703, 18, -473, -916, 142, 845, 8, -85, 399, -368, -55, 775, 408, 118, -503, 44, 704, 1130, -86, 814, 766, 239, -947, 489, -1092, 103, 880, -272, 136, -261, -350, 345, 183, -622, 290, 445, 797, -6, -442, -381, -25, 216, 1181, 207, 52, 1505, 464]
4999D64l60l36N24m9p22R15j032N67L02K78L28o97L33j154Q42L29l0l0j27l88
5019d3q45J831n69j91L71k46j369J006M84p53l2j14k13R18n03J02j44O56k40K37
5039C43n19J013j279R23j98p31O98k44k3P81p30k73J146j222M76r7r75J557p43
5058i7K71j28j65k95K73M00L00q98M95j08m11m42J038K38r45L34m71M56r4L48
5078I9p15J702j418J01N8M1L72m77o47L36K63k2N54o57J7N87j92k11m14P12o1
5099B8M96k19p90P10k6j03P83l74m06J69l21l38K21j28k63M72J44J16k49m3l23
5120d44J212n36J38j90J7J15q06N06m10L17M37p29J236j084P86o50R4J34l73O79
5140D49j18q03P89l35l24R70j004N0k70P8K13Q36n29m1k95Q24m25L07n07j15J247
$$ y = [464, 104, -232, 292, 243, -479, 436, -596, -29, 273, 551, 879, 182, 515, -639, 203, 532, 502, 472, 345, -43, -888, 943, 374, 183, 554, 308, -1061, -55, 429, -324, -356, -470, -683, 235, -268, -166, -310, 346, 106, 343, -176, 837, -442, 481, 283, -448, 250, 6, -17, 764, 34, -239, 907, -315, 161, 64, -911, 646, -97, 174, 46, -119, -414, -141, 259, 559, -339, 156, 48, -363, -805, 233, 471, -474, -140, -611, -155, -249, 99, -616, 1086, -332, -231, -173, -132, 240, -237, -884, -548, -285, -307, 247, -410, -393, 194, 2, -209, -623, 89, 28, 524, 305, -485, 225, 199, 96, 879, 505, 99, 268, -53, -391, -170, -298, -561, -89, 55, 171, -78, -121, -444, 768, 232, 370, 180, 197, 312, -494, 12, -398, -81, 356, -373, 863, -221, 565, -85, 9, 143, -230, 449, 331, -472, 317, -18, -342, 628, -376, -326, -596, -518, -305, 531, 2, -39, -334, 490, 65, 372, -135, -250, 997]
5161I97j117M2L37J51N41P62j978N00m47O1j042P53n0P66N04j475M95L97Q61r06
5181A52j191P66P38P9j022N5J141m53o84P79R4p62M67N2K82n26L8J47m67L18M39
5202D42M3J04k77n9n2o18O76J84K88l54L0r1k78l35NL93o50J243L1O39j896o9
5224f01O98l56M54j87P7k20P07l24J01K35p08l62o4O56j19P25n84m11P32p72n00
5245h23N85N88m48L01l88M26K5n98J53l42L04L00M48l14p15O74j188Q15M95l2
5265B66N9n32O03j03m93m91P88J00k96n1k84Q47l63o16J321k05q19L42n69P92
5285B96j22K28l00m04N54K25m19l6K12L06r34Q93J74n61q07P28L14R0N15j027
5305g5M43o66k70J51j2J85j69J199m36m38%m95Q38m17p6j093R17M50p42K97P42
$$ y = [997, -120, -78, 259, 410, 951, 1713, -265, 235, -212, -151, -1193, -440, -490, 276, 780, -695, -200, 197, 1058, 152, -1039, -273, 465, 544, -478, -423, 718, 265, -419, 360, 454, -308, 159, 211, 493, -33, 5, 152, -315, 3, 442, 485, 589, 312, 253, 201, -417, 259, 443, 731, 377, 407, 316, 38, -297, -292, 101, -549, 694, 725, 1364, -532, -601, 97, -259, 195, 8, 85, -135, 572, 248, 349, 584, -124, -486, -550, 106, -13, 712, 128, -283, 449, -323, -823, -238, 350, -98, 203, -185, 241, 266, -332, -179, -521, -217, 83, 531, 217, -498, 176, -1012, -197, 298, 266, 325, -207, 396, 293, -200, -691, 97, 197, -99, -150, -434, 413, 50, -566, 755, 550, -269, 73, -496, 296, 174, 402, 102, -302, 252, 477, 58, 22, 234, 540, -394, 499, 673, 112, -695, 33, 347, 437, 952, -75, 368, -298, -568, -417, -429, -244, -413, 786, 350, -88, -88, -583, 255, -162, -238, -1331, -414, 36, -706, -409, 333]
5326C33K00p14r22Q89J31o95O15k5L78R84j272j44l65J053L95p45Q31j481L35
5345b19P15j634J190o6L92q37J241p72N90k96j71l66N82K30j80j75k91j09J70
5364fk51K71j45L09k86M95l76j38Q2j13J58l64L43K8J7l55J68k48o12O46r34J371
5386F0n47J19K38o51J418j421M94m68Q33K5l07l41q54N05N28J609j043J76p53
5405c80J161n2o1l51j17O16j383J88Q38n82K98o02K11k26n49P98q34M06Q46n34
5425c09K58J46J42R84m00o60j0M0n66j03O38k20Q93j276K92J077j776M45R63j064
5445e06l46J875j145N72M85o83o29P82o16l03K82L36j66l05M45n29L36p14R13
5464H4j63Q7M5p57N76j41j30O51j11O81l5L27j251Q8O74r98R85j036J33L29l12
$$ y = [333, 533, -181, -1103, -214, -83, -778, -163, -188, 190, 1174, -98, -242, -607, 446, 841, 96, 927, -554, -219, 496, -1138, 52, -14, 378, -459, 782, 10, 600, 304, 133, -233, 349, 579, 399, 224, -67, -176, -6, -257, 14, -131, 178, -108, 387, 11, -127, -45, -158, 0, -364, -21, 7, 24, -331, -163, -411, -1023, -377, -1311, 60, -487, -368, -130, -781, 637, -784, -290, -758, 75, 100, -207, -548, -1402, -897, -369, 1240, 197, 373, -380, 781, 729, 668, 317, 200, 816, -567, -379, 459, -123, 175, -427, -216, -442, -991, -193, -1027, -621, 225, -309, -51, 95, 237, 1221, 821, 161, 151, 191, -375, -478, 160, -60, 833, -443, -151, 926, -850, -405, 558, -506, -852, 1023, -122, 450, 935, 252, -377, 405, -211, -514, -232, 104, -62, -367, 78, -451, -115, -829, 84, -79, 8, 53, -704, -128, -269, -399, 252, 141, 822, 787, 1114, -137, -49, 625, -373, 612, -424, -291, 38, -274]
5485b74P52p23K18k37N98qk96l9O55l30L95j082J83N20j017P94r53P24m66j08
5505f94O38K46k91M18L2n06M02o59P30k38O2j8k00K95m31L42k19L14l5J9k62Q8
5527C3K59m75j47K63l5l51N32k97K62pQ1K37lk55p10O04k47l60O47m24n41O32
5549c02M72O0J31j27k72M42n99J3j85O23k86K73q5o1M79Qn48J00O4q20R82p99
5571d37M78l04L17l33K63J90J31l42N90r06J019k00l80N12q69P44j42q58N89L25
5591C87o95M63k36P14P2j065l82N18n0P19p89K09l85O53l12j37p7L43k83P0k49
5612e12L29J84K98l88M05m68J07N58j73K47p29O45q85R24n71K30n06L48L58l58
5632D3J05L69n31mL41k41l56L03Q95p60o02Q09o44k29N63j46L65P06j040K99o58
$$ y = [-274, 478, -245, -27, -264, 334, 326, 30, -9, 646, 316, 711, -371, -188, 332, -685, 109, -844, -120, -586, -694, -56, 190, -101, 317, 349, -157, 245, -414, 316, 78, 140, 122, -78, 217, -214, 128, -91, 223, 188, 207, -55, 33, 292, -183, -330, -67, -102, -453, 79, -218, 44, 37, 118, 355, 352, 97, -613, -9, -256, -616, 31, -393, -934, -302, 170, 230, 361, 234, -38, 404, -195, -182, -367, 256, -30, 243, 158, 97, 576, 584, 36, 136, 200, -620, 362, -437, 41, -263, 54, -279, -16, 174, 305, -37, 553, -353, 666, 466, 86, 598, -271, 473, 331, -527, 62, 387, -308, 155, -81, 633, 705, -360, -742, -224, -274, 445, -344, -135, -520, 133, -179, -316, -393, -50, -333, -263, -512, -183, 1, 299, -89, 316, -152, -45, 513, 340, 587, -142, 503, -382, 542, -29, 201, -305, 43, 401, 43, 148, 517, -14, -18, 323, 82, -274, 29, 924, 164, -438, 371, -273, -502, 61, -85, 280, 986, -54, 245, -413]
5653d13Q53j31l42j76l62R42L8o61p59J084k35j9o81J776j53o89M09p61RJ405
5673A134j439J858l025J245m90R86rj356J354o63L63L63n92l06R96m04K48j35
5691A28j013J538M06k99n24m00M90j188J187o84K04P85o53o27J911j286k8j73
5709b26P08n14R74m59m29L54n12Q84j080O29K24J206j807Q1L56o37J3R29m47J36
$$ y = [-413, 440, 309, -33, -209, -571, 371, 409, -252, -1011, 73, -162, -181, -862, 914, 761, 72, 481, -280, -271, 1134, -305, 1553, -1472, -227, -717, 269, 260, -1096, 258, -405, -42, 321, -271, -577, 419, 15, 263, 128, -885, 653, 1059, 760, 236, -164, 326, -862, 325, -359, -155, 630, -23, -650, 1261, -25, -53, -226, 482, -32, 942, 483, 54, 408, -104, 780, -300, 329, 553, 1759, -48, 33, 389, -248, -235, 694, 247, 383]
$$ [...]
8191a12
##END NTUPLES=NMR FID
##END=
