##TITLE=1H_SR41_k
 D2O,8 sc, 
 4.03.2021
##JCAMPDX= 6.0         $$ Bruker NMR JCAMP-DX V2.0
##DATA TYPE= NMR FID
##DATA CLASS= NTUPLES
##ORIGIN= UXNMR, Bruker Analytische Messtechnik GmbH
##OWNER= root
$$ XWIN-NMR		Version 3.5
$$ Thu Mar  4 10:55:18 2021 Russian Standard Time (UT+4h)  she@DPX200
##.OBSERVE FREQUENCY= 200.1315066352
##.OBSERVE NUCLEUS= ^1H
##.DELAY= (6, 6)
##.ACQUISITION MODE= SIMULTANEOUS
##.ACQUISITION SCHEME= undefined
##.AVERAGES= 8
##.DIGITISER RES= 18
##SPECTROMETER/DATA SYSTEM= spect
##.PULSE SEQUENCE= zg30
##.SOLVENT NAME= D2O
##.SHIFT REFERENCE= (INTERNAL, D2O, 0, 15.7039)
##AUDIT TRAIL= $$ (NUMBER, WHEN, WHO, WHERE, WHAT)
$$ ##TITLE= Audit trail, XWIN-NMR		Version 3.5
$$ ##JCAMPDX= 5.01
$$ ##ORIGIN= Bruker BioSpin GmbH
$$ ##OWNER= she
$$ F:/spectra/data/she/nmr/H-F/1/audita.txt
$$ ##AUDIT TRAIL=  $$ (NUMBER, WHEN, WHO, WHERE, WHAT)
(   1,<2021-03-04 10:54:12.12 +0400>,<she>,<DPX200>,
      <created by zg, POWCHK disabled, PULCHK disabled
       configuration hash MD5:
       00 E9 B6 7A A2 85 ED C7 34 08 36 98 17 FE 4E 26
       data hash MD5: 16K
       D4 1B E4 AD 54 07 F4 06 10 B4 9E DB 97 37 69 CC>)
$$ ##END=
$$ 
$$ hash MD5
$$ 3F 00 BF 75 33 C9 07 2F 17 B0 2F A4 E9 75 1C 08
##$RELAX= 
##$RELAX= 
##$RELAX= 
##$RELAX= 
##$RELAX= 
##$RELAX= 
$$ Bruker specific parameters
$$ --------------------------
##$DU= <F:/spectra>
##$EXPNO= 1
##$NAME= <H-F>
##$PROCNO= 1
##$TYPE= <nmr>
##$USER= <she>
##$AMP= (0..31)
100 100 100 100 100 100 100 100 100 100 100 100 100 100 100 100 100 100 
100 100 100 100 100 100 100 100 100 100 100 100 100 100 
##$AQSEQ= 0
##$AQ_mod= 1
##$AUNM= <au_zg>
##$AUTOPOS= <>
##$BF1= 200.13
##$BF2= 200.13
##$BF3= 200.13
##$BF4= 200.13
##$BF5= 200.13
##$BF6= 200.13
##$BF7= 200.13
##$BF8= 200.13
##$BYTORDA= 1
##$CFDGTYP= 0
##$CFRGTYP= 5
##$CHEMSTR= <none>
##$CNST= (0..31)
1 1 145 1 1 1 1 1 1 1 1 1 1 1 1 1 1 1 1 1 1 1 1 1 1 1 1 1 1 1 1 1 
##$CPDPRG= <>
##$CPDPRG1= <>
##$CPDPRG2= <>
##$CPDPRG3= <>
##$CPDPRG4= <mlev>
##$CPDPRG5= <mlev>
##$CPDPRG6= <mlev>
##$CPDPRG7= <mlev>
##$CPDPRG8= <mlev>
##$CPDPRGB= <>
##$CPDPRGT= <>
##$D= (0..31)
0 1.2 0 0 0 0 0 0 0 0.06 0 0.03 0 0 0 0 0.0002 0 0 0 0 0 0 0 0 0 0 0 0 
0 0 0 
##$DATE= 1614840851
##$DBL= (0..7)
120 120 120 120 120 120 120 120 
##$DBP= (0..7)
150 150 150 150 150 150 150 150 
##$DBP07= 0
##$DBPNAM0= <>
##$DBPNAM1= <>
##$DBPNAM2= <>
##$DBPNAM3= <>
##$DBPNAM4= <>
##$DBPNAM5= <>
##$DBPNAM6= <>
##$DBPNAM7= <>
##$DBPOAL= (0..7)
0.5 0.5 0.5 0.5 0.5 0.5 0.5 0.5 
##$DBPOFFS= (0..7)
0 0 0 0 0 0 0 0 
##$DE= 6
##$DECBNUC= <off>
##$DECIM= 32
##$DECNUC= <off>
##$DECSTAT= 4
##$DIGMOD= 1
##$DIGTYP= 9
##$DL= (0..7)
0 120 120 120 120 120 120 120 
##$DP= (0..7)
150 150 150 150 150 150 150 150 
##$DP07= 0
##$DPNAME0= <>
##$DPNAME1= <>
##$DPNAME2= <>
##$DPNAME3= <>
##$DPNAME4= <>
##$DPNAME5= <>
##$DPNAME6= <>
##$DPNAME7= <>
##$DPOAL= (0..7)
0.5 0.5 0.5 0.5 0.5 0.5 0.5 0.5 
##$DPOFFS= (0..7)
0 0 0 0 0 0 0 0 
##$DQDMODE= 0
##$DR= 18
##$DS= 0
##$DSLIST= <SSSSSSSSSSSSSSS>
$$ [...]
##$SUBNAM2= <"">
##$SUBNAM3= <"">
##$SUBNAM4= <"">
##$SUBNAM5= <"">
##$SUBNAM6= <"">
##$SUBNAM7= <"">
##$SUBNAM8= <"">
##$SUBNAM9= <"">
##$SW= 16.9725356469052
##$SWIBOX= (0..15)
0 0 2 0 0 0 0 0 0 0 0 0 0 0 0 0 
##$SW_h= 3396.73913043478
##$TD= 16384
##$TD0= 1
##$TE= 0
##$TE2= 300
##$TE3= 300
##$TEG= 300
##$TL= (0..7)
0 120 120 120 120 120 120 120 
##$TP= (0..7)
150 150 150 150 150 150 150 150 
##$TP07= 0
##$TPNAME0= <>
##$TPNAME1= <>
##$TPNAME2= <>
##$TPNAME3= <>
##$TPNAME4= <>
##$TPNAME5= <>
##$TPNAME6= <>
##$TPNAME7= <>
##$TPOAL= (0..7)
0.5 0.5 0.5 0.5 0.5 0.5 0.5 0.5 
##$TPOFFS= (0..7)
0 0 0 0 0 0 0 0 
##$TUNHIN= 0
##$TUNHOUT= 0
##$TUNXOUT= 0
##$USERA1= <user>
##$USERA2= <user>
##$USERA3= <user>
##$USERA4= <user>
##$USERA5= <user>
##$V9= 5
##$VALIST= <valist>
##$VCLIST= <CCCCCCCCCCCCCCC>
##$VD= 0
##$VDLIST= <DDDDDDDDDDDDDDD>
##$VPLIST= <PPPPPPPPPPPPPPP>
##$VTLIST= <TTTTTTTTTTTTTTT>
##$WBST= 1024
##$WBSW= 4
##$XGAIN= (0..3)
0 0 0 0 
##$XL= 0
##$YL= 0
##$YMAX_a= 506423
##$YMIN_a= -404484
##$ZGOPTNS= <>
##$ZL1= 120
##$ZL2= 120
##$ZL3= 120
##$ZL4= 120
##$ABSF1= 10
##$ABSF2= 0
##$ABSG= 5
##$ABSL= 3
##$ALPHA= 0
##$AQORDER= 0
##$ASSFAC= 0
##$ASSFACI= 0
##$ASSFACX= 0
##$ASSWID= 0
##$AUNMP= <proc_1d>
##$AZFE= 0.1
##$AZFW= 0.1
##$BCFW= 1
##$BC_mod= 2
##$BYTORDP= 1
##$COROFFS= 0
##$CY= 11.3945322036743
##$DATMOD= 1
##$DC= 2
##$DFILT= <>
##$DTYPP= 0
##$F1P= 15.9154993809931
##$F2P= -4.1035820241983
##$FCOR= 0.5
##$FTSIZE= 0
##$FT_mod= 4
##$GAMMA= 1
##$GB= 0.15
##$INTBC= 1
##$INTSCL= 1
##$ISEN= 128
##$LB= 0.24
##$LEV0= 0
##$LPBIN= 0
##$MAXI= 10000
##$MC2= 0
##$MEAN= 0
##$ME_mod= 0
##$MI= 1.114404
##$NCOEF= 0
##$NC_proc= 0
##$NLEV= 6
##$NOISF1= 3.799351
##$NOISF2= 2.8
##$NSP= 1
##$NTH_PI= 0
##$NZP= 0
##$OFFSET= 15.70392
##$PC= 1
##$PHC0= -10763.28
##$PHC1= 8.00094
##$PH_mod= 1
##$PKNL= yes
##$PPARMOD= 0
##$PSCAL= 0
##$PSIGN= 0
##$REVERSE= no
##$SF= 200.130013532006
##$SI= 16384
##$SIGF1= 3
##$SIGF2= 2
##$SINO= 400
##$SIOLD= 16384
##$SREGLST= <1H.CDCl3>
##$SSB= 0
##$STSI= 0
##$STSR= 0
##$SW_p= 3612.71676300578
##$SYMM= 0
##$S_DEV= 0
##$TDeff= 0
##$TDoff= 0
##$TI= <>
##$TILT= no
##$TM1= 0
##$TM2= 0
##$TOPLEV= 0
##$USERP1= <user>
##$USERP2= <user>
##$USERP3= <user>
##$USERP4= <user>
##$USERP5= <user>
##$WDW= 1
##$XDIM= 8192
##$YMAX_p= 0
##$YMIN_p= 0
$$ End of Bruker specific parameters
$$ ---------------------------------
##NTUPLES= NMR FID
##VAR_NAME=  TIME,          FID/REAL,        FID/IMAG
##SYMBOL=    X,             R,               I
##VAR_TYPE=  INDEPENDENT,   DEPENDENT,       DEPENDENT
##VAR_FORM=  AFFN,          ASDF,            ASDF
##VAR_DIM=   8192,          8192,            8192
##UNITS=     SECONDS,       ARBITRARY UNITS, ARBITRARY UNITS
##FACTOR=    0.0002944,     1,               1
##FIRST=     0,             0,               0
##LAST=      2.4114304,     0,               0
##MIN=       0,             -404484,         0
##MAX=       2.4114304,     506423,          0
$$ Real data points
##PAGE= N=1
##DATA TABLE= (X++(R..R)), XYDATA
0 0 0 0 0 0 0 0 0 0 0 8 -8 8 -16 16 -16 24 -32 40 -48 56 -64 80 -88 104 -128 144 -168 196 -224 256 -295
31 -295 335 -380 429 -484 544 -612 684 -763 850 -945 1050 -1162 1288 -1424 1570 -1732 1909
48 1909 -2103 2317 -2553 2812 -3102 3424 -3786 4194 -4665 5204 -5832 6582 -7486 8603
62 8603 -10030 11910 -14517 18379 -24675 36648 -67279 306969 503009 -262645 -45646
73 -45646 -132979 -381970 209529 506423 -47153 -189054 -166404 -211262 106649 340137 140023
84 140023 -108752 -333746 -150938 212323 175350 144328 83481 -381585 -282455 289716 187678
95 187678 19853 160897 -252635 -404484 206581 282150 -3456 78113 -129232 -351618
105 -351618 47914 302065 117005 421 -141283 -230711 -20194 188278 225074 54781
115 54781 -229297 -190213 14044 73855 205702 154705 -228745 -248114 51500 74904 124698
126 124698 192369 -142171 -289346 6271 125177 118539 144668 -66462 -251484 -87465 119830
137 119830 164189 108496 -58043 -187704 -125087 47470 191445 126894 -80578 -153266 -107786
148 -107786 311 173356 163088 -62655 -164911 -94743 -1728 137992 175992 -18030 -166916
159 -166916 -120058 -3011 119388 153898 19568 -142198 -146976 -16951 112997 140309 32504
170 32504 -111865 -147012 -36413 109473 143357 45212 -93926 -146285 -49471 91227 142823
181 142823 64015 -81639 -147176 -65792 70381 132170 74761 -59136 -144211 -77364 57167
192 57167 126281 83041 -44375 -129373 -85064 38605 130346 93840 -36424 -120139 -90451
203 -90451 14270 118021 110332 -25209 -118811 -88660 -4478 97237 118135 -4239 -113328
214 -113328 -92555 -5843 84850 114655 18386 -100458 -102855 -14078 83307 110375 28321 -80110
226 -80110 -111009 -36447 77319 109144 32546 -64085 -104415 -54379 61684 113854 39116 -55717
238 -55717 -93945 -59410 47225 114154 54236 -48288 -93869 -61873 32613 105962 67675 -35441
250 -35441 -95804 -70199 21030 93559 72443 -18183 -91129 -75765 13072 87127 75548 -5346
262 -5346 -81208 -80011 3762 83851 79569 4487 -73944 -84837 -10104 74042 83057 14336 -66359
275 -66359 -85946 -23055 62863 83930 24106 -55749 -83501 -29822 54834 84711 32867 -47236
287 -47236 -81603 -37997 45948 84771 40263 -38967 -81321 -47548 33104 81181 48292 -29765
299 -29765 -77286 -52527 22285 76261 54811 -19372 -72112 -55261 14798 72175 60159 -10133
311 -10133 -68994 -60137 5333 66215 64032 -675 -64485 -65166 -5134 58071 66041 8812 -56764
324 -56764 -65917 -12161 52361 66890 16563 -48479 -66058 -19603 47813 67923 22231 -41115
336 -41115 -66538 -30439 39246 68617 27128 -34225 -63243 -38902 28608 69220 33774 -28004
348 -28004 -57813 -41153 19210 67111 41609 -21622 -57342 -43121 12481 60818 47019 -12425
360 -12425 -57830 -49409 6589 54367 48156 -1164 -52028 -55172 1345 51913 47343 6155 -43072
373 -43072 -57482 -6708 50388 49407 9206 -37390 -57352 -16711 43926 53610 13878 -34170 -55715
386 -55715 -23438 34268 54799 21765 -29605 -53208 -26225 26661 53822 28099 -24235 -51806
398 -51806 -29647 21043 52175 32916 -19080 -51042 -34770 13101 49979 37237 -12980 -48204
410 -48204 -38103 6399 46385 40271 -5286 -44142 -40874 3632 43499 39626 2883 -38884 -47553
423 -47553 -1648 44397 36810 6000 -29079 -52702 -12757 45212 38308 5361 -19920 -48105
435 -48105 -23518 40337 45135 7374 -19609 -40886 -25975 28052 47815 18247 -22395 -44374
447 -44374 -20718 19713 37032 31670 -13556 -55432 -20400 23390 24655 33047 4393 -57987 -31624
460 -31624 30035 24608 23142 14740 -46597 -45124 22313 34784 20864 8701 -33245 -43276 2078
473 2078 36256 35263 1250 -34261 -27798 -8700 19488 50802 9656 -46875 -21081 251 1337
486 1337 47788 30249 -50263 -33933 9519 1034 31877 38886 -33662 -47110 -122 13786 26241
499 26241 28210 -14162 -40041 -21397 15518 39287 16301 -14810 -20246 -30266 -2211 52773
511 52773 22049 -27484 -12708 -21419 -19700 46615 39491 -28133 -22964 -10817 -18712 28998 45567
524 45567 -10984 -32023 -17625 -6331 21827 33192 6132 -24710 -34415 -4404 30250 21006
536 21006 5917 -8056 -40777 -18662 38326 24137 -2485 -97 -31148 -30721 30690 35050 -2280
549 -2280 -6170 -21796 -28730 16149 36739 10274 -12142 -25177 -20278 8895 27644 21165 -6150
562 -6150 -33114 -19024 11867 18958 21192 4886 -33902 -25798 13711 19037 16990 9192 -26276
575 -26276 -30903 7208 23282 16912 7004 -20029 -29763 -1677 21705 22837 5892 -18919 -25126
588 -25126 -7010 16450 26192 9565 -18818 -23735 -7370 11743 25378 13722 -16523 -25185 -9300
601 -9300 9940 24055 15346 -11857 -25334 -13089 8822 23212 16480 -8272 -23818 -15682 5923
614 5923 22810 17579 -4563 -22062 -17886 3576 20749 18491 -1414 -21273 -19683 1474 19525
627 19525 18448 2064 -18091 -22008 -903 18768 18596 4646 -15258 -22017 -4824 16823 20002
640 20002 5501 -13407 -21042 -7499 13315 21040 8324 -13124 -20766 -7945 9596 20741 12328
653 12328 -11306 -21247 -9012 7603 18568 14808 -7157 -21654 -10960 6497 17044 14838 -3926
666 -3926 -20190 -13974 4566 16972 15191 -1893 -17889 -15890 1333 16895 16450 -337 -15471
679 -15471 -15741 -2167 15417 17527 1714 -14568 -16014 -3908 12791 18252 4030 -13304 -16484
692 -16484 -5567 10844 18111 6888 -11260 -17240 -7034 8938 17430 8854 -9337 -16806 -8487
705 -8487 7262 16782 10061 -6303 -17160 -10395 5526 15628 11721 -4235 -16133 -11720 3722
718 3722 14883 12175 -1770 -14843 -13294 1589 14386 13129 -361 -13407 -13655 -1098 13310
731 13310 14336 862 -12010 -13957 -3145 11109 15000 3064 -11235 -13594 -4682 9210 14996
744 14996 5194 -9663 -14336 -5566 7783 14650 7321 -7827 -14688 -7027 6257 13801 8191 -5651
758 -5651 -14236 -9118 4906 13550 9060 -3549 -13320 -9976 2985 12932 9921 -2259 -12253 -10885
772 -10885 854 12191 10858 -450 -11496 -11516 -752 10968 11614 943 -10236 -11709 -2199 9681
786 9681 12296 2880 -9327 -11646 -3550 7877 12443 4102 -7938 -11896 -4909 6769 12424 5818
800 5818 -6334 -12045 -5918 5489 11847 6940 -4520 -11792 -7311 4105 11387 7619 -2889 -11370
814 -11370 -8598 2860 11217 8256 -1858 -10365 -9142 1277 10293 9117 -485 -9582 -9589 -384 9353
829 9353 9917 1145 -8762 -9919 -1511 8300 10050 2396 -7745 -10200 -3077 7321 10687 3622 -6607
844 -6607 -10012 -4188 5466 11001 4810 -6167 -9697 -4830 3876 10456 6373 -5265 -9851 -5051 2748
859 2748 9565 7353 -3163 -9855 -6534 2615 9059 7042 -1389 -8538 -8578 1415 10132 6874 -906
874 -906 -6423 -9524 -1544 10368 7856 -1307 -5074 -8280 -3651 8987 9981 -971 -6092 -7294 -3901
889 -3901 6305 10031 2493 -6508 -8501 -2700 4920 7612 5372 -4100 -11272 -3045 6526 5518 4465
904 4465 166 -11730 -6827 7738 6505 2590 1660 -8646 -9560 5153 9166 3127 -310 -6260 -8141
919 -8141 1017 8730 6901 -1827 -7925 -5036 -260 4381 9798 1397 -10872 -5306 2298 1376 8102
934 8102 5937 -10459 -8671 3390 2697 4936 6895 -6207 -10795 104 5161 4976 4605 -3308 -8440
949 -8440 -4224 4117 8629 2793 -4507 -4754 -4978 -55 11057 5608 -7026 -4422 -2543 -3059 8385
964 8385 9280 -6021 -7326 -1396 -1616 4891 9299 -1616 -8469 -4122 553 4979 6652 827 -5661
979 -5661 -7345 -377 7086 5141 117 -2772 -7111 -4060 7778 6976 -1434 -2294 -5415 -5709 5343
994 5343 8951 129 -3960 -4288 -4850 2626 8479 2892 -3709 -5870 -3755 2106 6563 4524 -1869 -7124
1010 -7124 -4394 3014 5193 3853 137 -6446 -6087 2389 5946 3826 758 -5347 -6480 965 5985
1025 5985 4389 319 -4667 -5969 -779 5536 5602 722 -4396 -5536 -1293 4266 5873 1581 -4216
1040 -4216 -5640 -1761 3495 5634 2698 -3288 -5938 -2428 3089 6029 3052 -2816 -5492 -3501 2247
1055 2247 5936 3456 -2239 -5494 -3569 1437 5482 4090 -1214 -5347 -4216 998 5213 4142 -285
1070 -285 -5108 -4934 794 4840 4310 623 -4351 -5391 -128 4618 4485 599 -3539 -5383 -1245 4211
1086 4211 4810 1470 -3589 -5181 -1814 3356 5476 2044 -3194 -5124 -1899 2485 4901 3177 -2366
1101 -2366 -5484 -2185 1999 4303 3377 -1452 -5426 -2817 1522 4292 3640 -920 -4933 -3807 1114
1116 1114 4651 3874 -606 -4296 -4152 -6 4539 4094 -26 -4007 -3887 -637 3423 4413 434 -3687
1132 -3687 -4244 -1012 3333 4732 1222 -3303 -4477 -1493 2648 4538 1826 -2727 -4535 -2100 2432
1147 2432 4545 2106 -2154 -4496 -2473 1642 4457 2707 -1634 -4546 -2798 1128 4308 3361 -974
1162 -974 -4429 -3075 782 3866 3443 -666 -4040 -3853 212 3850 3648 97 -3480 -3879 -321 3317
1178 3317 4020 432 -3128 -3696 -1212 3011 4284 777 -3010 -3783 -1499 2512 4256 1764 -2552 -3867
1194 -3867 -1608 2119 4074 2098 -1906 -4142 -2221 1551 3739 2304 -1139 -3808 -2359 1263 3799
1209 3799 2814 -961 -3587 -3061 841 3527 3077 -135 -3378 -3190 19 3071 3405 2 -3107 -3442
1225 -3442 -556 2966 3438 268 -2955 -3554 -851 2688 3665 921 -2523 -3762 -1183 2408 3608 1452
1241 1452 -2203 -3470 -1475 1662 3516 1999 -1948 -3766 -1879 1534 3250 2306 -1376 -3436 -2492
1256 -2492 1174 3349 2400 -800 -2916 -2499 853 3403 2722 -383 -3230 -2782 134 3084 2839 -88
1272 -88 -2835 -2900 -196 2635 3066 444 -2631 -2990 -676 2551 2991 775 -2425 -3037 -1021 1916 3563
1289 3563 1129 -2023 -3107 -1476 1471 3240 1612 -1902 -2817 -1634 1106 3248 1949 -1517 -3216
1304 -3216 -1799 944 2806 2308 -953 -3143 -2294 726 2701 2192 -519 -2348 -2798 240 3090 2137
1320 2137 -425 -2148 -2939 -854 3219 2648 -616 -1780 -2485 -1616 2521 3292 -227 -1991 -2397 -1182
1336 -1182 1596 3145 863 -2095 -2866 -1229 1708 2620 1535 -1138 -3597 -1438 2330 2370 1007 -126
1352 -126 -3564 -2559 2298 2562 655 259 -2320 -3272 1270 3166 1095 -289 -2047 -2450 185 2781
1368 2781 2095 -625 -2639 -1943 180 1528 2997 725 -3375 -2222 1043 953 2389 2106 -2675 -3413
1384 -3413 792 1614 1477 2071 -1627 -3484 -144 2006 1855 1115 -1192 -2862 -1235 1686 2920 1203
1400 1203 -1512 -2201 -1315 17 3124 2188 -2017 -2053 -883 -308 2321 2930 -1358 -3025 -847 -129 1325
1417 1325 2726 -352 -2989 -1631 367 1680 2092 435 -2341 -2441 -180 2424 2082 -164 -1315 -2406
1433 -2406 -1269 2362 2808 -338 -1534 -1928 -1466 1410 2935 256 -1607 -1891 -1257 1122 2761 935
1449 935 -1526 -2333 -1205 1090 2490 1220 -673 -2517 -1490 1030 1979 1382 -657 -2263 -1920 842
1465 842 2364 1398 -112 -1896 -1940 326 2145 1822 -322 -1898 -1974 -7 1714 1952 67 -1755 -2103
1482 -2103 -365 1556 1783 442 -1699 -2350 -474 1669 2153 683 -1330 -2109 -849 1074 2168 714
1498 714 -1150 -2018 -1347 1061 2064 906 -1246 -1973 -1083 503 2157 1123 -843 -2025 -1406 517
1514 517 2234 1512 -302 -1987 -1795 384 1897 1592 -151 -1717 -1942 113 2132 1648 -7 -1524
1530 -1524 -1801 -297 1972 1867 130 -1417 -1762 -369 1259 2136 382 -1305 -1906 -504 1521 1918
1546 1918 907 -1302 -2183 -630 1063 1722 1042 -382 -2047 -1008 1127 1630 1112 -647 -1880 -1271
1562 -1271 870 1754 1001 -593 -1781 -1500 612 1713 1456 -297 -1793 -1481 57 1430 1642 -285
1578 -285 -1516 -1641 -91 1459 1452 309 -1565 -1660 -113 1332 1643 286 -1335 -1711 -640 1351 1855
1595 1855 799 -1310 -1887 -928 923 1567 658 -1046 -1779 -892 877 1613 835 -782 -1676 -956 760
1612 760 1628 997 -681 -1578 -1114 638 1739 1415 -461 -1878 -1068 232 1414 1436 -75 -1369 -1224
1629 -1224 102 1314 1502 150 -1113 -1590 -312 1302 1645 193 -1306 -1426 -462 1261 1663 540
1645 540 -1097 -1670 -592 938 1627 921 -631 -1560 -792 889 1568 900 -1022 -1614 -986 747 1840
1662 1840 773 -447 -1823 -1047 781 1402 1096 -367 -1594 -972 607 1525 1230 -265 -1424 -1245 -9
1679 -9 1299 1372 15 -1454 -1138 42 1274 1464 245 -1299 -1463 -165 1083 1342 440 -1198 -1613 -400
1697 -400 946 1423 656 -994 -1426 -508 824 1330 569 -1063 -1323 -611 861 1480 881 -331 -1305 -652
1715 -652 492 1463 730 -520 -1454 -988 281 1309 857 -404 -1465 -970 104 1128 1198 -86 -1236
1732 -1236 -1124 -58 1006 1015 97 -1195 -1135 37 878 1331 291 -1209 -1269 -215 800 1252 419 -1113
1750 -1113 -1285 -256 863 1312 403 -954 -1396 -615 680 1242 794 -775 -1235 -728 415 1328 821 -412
1768 -412 -1122 -837 338 1404 975 -401 -1052 -646 -55 1169 1025 -559 -1282 -1066 -207 1061 1068 -104
1786 -104 -1051 -995 -44 896 956 272 -702 -1436 -427 1484 1233 109 -619 -1192 -588 784 1184 -30 -441
1805 -441 -1162 -757 460 1308 411 -798 -785 -711 787 1189 755 -690 -1293 -620 532 902 670 -472 -1544
1824 -1544 -707 730 618 721 -13 -1324 -1133 639 964 585 263 -834 -1133 69 1054 706 167 -976
1842 -976 -1199 -218 1055 963 269 -1008 -830 -350 650 1275 652 -1196 -1046 -37 586 960 794 -636
1860 -636 -1217 -332 681 981 650 -676 -1172 -517 600 1001 609 -238 -1044 -906 328 1265 871 -410
1878 -410 -750 -559 40 1021 737 -164 -772 -874 -171 794 795 157 -928 -724 141 723 1128 143 -916 -1144
1898 -1144 -415 847 932 90 -606 -1092 -383 876 1048 374 -497 -1008 -509 731 973 270 -635 -1124 -351
1917 -351 451 935 562 -511 -836 -638 250 729 751 -168 -1066 -904 -4 671 677 -40 -955 -772 -22 899 919
1938 919 -263 -790 -645 -305 740 890 173 -617 -742 -189 598 997 173 -776 -962 -285 331 896 77
1957 77 -389 -945 -288 494 968 380 -497 -950 -663 43 1049 718 -213 -951 -840 397 946 335 -297 -826
1977 -826 -600 221 1134 765 -127 -842 -641 94 966 824 -38 -766 -931 -68 786 692 403 -696 -1059 -160
1997 -160 748 696 612 -576 -781 -383 758 888 200 -461 -800 -362 438 837 574 -552 -781 -385 404 729
2017 729 654 -324 -767 -514 407 999 643 -195 -854 -479 209 1007 621 -200 -913 -846 124 702 653 -76 -599
2038 -599 -617 14 653 706 164 -626 -794 -379 440 911 457 -508 -667 -213 457 561 497 -185 -802 -447 461
2059 461 553 405 -613 -871 -411 475 603 579 -12 -801 -555 256 884 567 -140 -1046 -734 126 690 765 -255
2080 -255 -742 -807 -56 676 745 184 -882 -604 -162 750 753 202 -787 -882 -148 509 499 270 -624 -833 -230 533
2102 533 825 600 -453 -676 -116 367 839 223 -586 -521 -243 368 777 406 -381 -709 -644 71 802 567
2122 567 -144 -573 -674 -52 624 652 -172 -594 -650 -111 683 710 -143 -773 -630 -235 519 752 143 -628 -600
2143 -600 -121 813 773 84 -602 -494 -419 381 789 156 -489 -896 -437 193 784 634 -469 -910 -556 176
2163 176 714 565 -250 -804 -487 220 751 511 -386 -803 -710 118 867 636 -152 -778 -730 -159 698 596 99
2184 99 -709 -474 275 608 956 246 -781 -711 -188 698 952 142 -753 -789 -60 329 651 500 -375 -557 -373
2205 -373 195 734 409 -583 -830 -261 436 892 426 -407 -536 -595 -44 746 538 -201 -654 -427 -43 639
2225 639 928 -170 -772 -588 45 875 891 159 -841 -718 -140 492 602 107 -551 -804 -112 712 523 3
2245 3 -80 -654 -323 513 975 378 -193 -746 -533 400 739 402 -305 -732 -434 463 459 537 -208 -522 -456 125
2267 125 621 320 -277 -506 -447 155 695 403 74 -744 -547 209 630 392 -14 -426 -547 -30 652 721 92
2288 92 -707 -762 -124 396 604 59 -374 -728 -103 300 853 472 -395 -766 -245 485 606 443 -381 -508 -287
2309 -287 462 505 319 -66 -637 -394 171 734 368 -101 -646 -640 85 623 615 -53 -711 -391 -47 426 560 -68
2331 -68 -577 -461 -90 475 764 -23 -481 -559 -309 408 697 141 -638 -708 35 433 736 -78 -476 -624 -258
2352 -258 76 670 378 -318 -587 -438 316 634 477 -71 -651 -454 380 520 437 -171 -668 -429 91 473
2372 473 495 -103 -691 -608 -66 398 660 -101 -452 -335 -227 347 527 -4 -670 -699 -12 302 590 119 -472
2393 -472 -745 -132 423 644 -8 -410 -764 -233 290 655 322 -187 -671 -314 116 492 278 -346 -529 -300
2413 -300 370 737 599 -185 -548 -514 164 659 397 -403 -579 -685 150 482 385 -17 -418 -731 -17 457 388
2434 388 -23 -632 -483 -28 467 607 37 -328 -519 -55 276 631 25 -422 -630 -39 524 603 184 -171
2454 -171 -553 -342 498 486 567 -89 -664 -303 324 568 590 -192 -594 -391 139 659 493 -299 -597 -629 136
2475 136 335 634 -41 -392 -482 -180 616 597 203 -461 -795 70 478 470 103 -243 -613 -279 465 614 90
2496 90 -363 -495 92 526 524 228 -233 -657 -278 304 602 99 -444 -771 -414 233 499 252 -302 -636 -504
2517 -504 -114 545 421 -136 -436 -327 140 657 353 14 -651 -429 368 736 216 -15 -596 -710 198 475
2537 475 499 71 -305 -616 -194 505 529 -156 -476 -564 -37 337 373 303 -311 -437 -250 475 754 141 -391 -431
2559 -431 -283 389 602 247 -228 -713 -514 311 454 436 -204 -442 -362 233 304 502 -63 -365 -445 261 663
2580 663 435 165 -348 -417 -64 419 490 53 -186 -250 -144 402 564 110 -376 -492 -301 327 435 434 -257 -514
2602 -514 -52 398 197 -31 -593 -415 -414 101 710 348 -256 -446 -378 164 325 336 -301 -354 -260 19 368 475
2624 475 2 -652 -155 55 564 491 -6 -446 -323 -49 620 469 -123 -459 -425 206 519 477 73 -98 -523
2645 -523 -70 259 396 294 -372 -857 -139 149 349 15 -257 -510 -81 332 397 269 -241 -477 -175 54
2665 54 371 195 -259 -512 -133 115 432 452 -266 -219 -372 17 572 410 -208 -393 -638 117 412 267 93
2686 93 -255 -256 -346 270 559 26 -116 -420 -54 244 439 61 -195 -261 30 495 453 87 -273 -653 -141 283
2708 283 473 365 -346 -729 -314 90 321 160 -212 -535 -285 206 611 187 -344 -527 -497 21 451 396 -168
2729 -168 -467 -197 61 189 356 142 -283 -134 -191 306 310 -75 -397 -545 246 1 408 99 -320 -230 -226 233
2751 233 66 109 -197 -384 325 141 89 307 -22 -390 -251 384 588 160 -209 -409 46 93 364 590 -257
2772 -257 -266 -243 57 420 443 -169 -464 -265 206 45 179 160 -272 -616 56 336 349 22 -315 -373 -177 450
2794 450 428 366 -390 -428 -236 312 556 137 -159 -337 -241 242 232 -60 -350 -250 -303 228 408 149 -462 -406
2816 -406 -232 193 130 237 -159 -456 -189 170 411 269 -319 -345 -245 -31 370 352 -93 -65 -158 -84 371 200
2838 200 -46 -409 -269 121 222 372 165 -413 -298 189 286 334 -25 -224 -348 -192 336 415 -86 -246 -270
2859 -270 -213 228 406 21 -116 -379 -103 58 373 288 -23 -32 -358 137 415 156 -163 -44 -184 152 104 301
2881 301 -66 -362 -333 16 216 164 -26 -616 -294 -27 226 488 121 -156 -290 -68 307 309 -1 -230 -227 -154
2903 -154 275 96 16 28 -366 18 41 381 -91 -124 -301 -322 100 374 350 -212 -316 -330 0 232 294 42 -470
2926 -470 -69 -126 379 87 74 -239 -171 71 178 351 -192 -196 -319 61 161 38 166 -65 -438 -239 266 96
2948 96 28 -18 -252 9 319 196 94 -446 -282 72 309 10 22 40 -378 22 79 250 103 -112 -207 61
2970 61 276 209 286 -106 -157 -123 219 178 17 -261 -454 -356 182 178 38 159 -403 -47 114 275 184 -45 -412
2993 -412 -404 -68 22 192 -31 -360 -157 -3 180 79 53 -362 -141 -243 160 326 84 25 -218 42 299 376
3015 376 90 -74 -303 -219 78 39 170 -330 -160 -140 100 280 157 -30 -329 -16 88 102 53 121 -426 -330
3037 -330 144 150 1 -190 -141 -254 -167 153 184 -180 -292 -396 -165 61 176 56 -78 -349 -173 441 342 133
3059 133 -311 -106 -224 115 248 322 -105 -364 65 38 75 55 -50 -337 -249 134 -35 243 -134 -103 -58 10 49
3082 49 152 56 -316 -196 -28 233 147 64 -483 -242 -107 233 98 -89 -325 -63 76 229 221 -55 -294 -113
3104 -113 -35 -46 170 241 -7 -132 -127 204 248 121 21 -196 -153 226 -43 111 -310 -48 -91 -33 209 61 -144
3127 -144 -117 -270 37 106 182 -4 -238 -107 96 293 369 -154 -320 44 8 230 148 -119 -245 78 -104 7
3149 7 101 78 -139 -101 12 72 153 76 -249 -10 -56 284 450 225 -59 -318 -341 64 286 -163 -40 -127 -125 126
3173 126 76 26 -99 -12 -46 -25 152 45 -17 -32 -292 -49 8 90 31 -346 -89 112 389 79 -116 -274 -145
3196 -145 281 250 257 23 -122 -302 35 169 221 -205 -58 -209 31 86 113 223 -151 -336 -201 172 47 149
3218 149 -81 -147 -77 167 263 -157 -116 -426 -291 43 238 23 -20 -158 -89 58 146 151 -183 -124 -168 -14 126 121
3242 121 -133 -101 -232 -41 108 -8 298 -188 43 186 200 -36 -9 -24 -148 -28 196 51 -50 -107 -179 48
3264 48 252 250 200 -127 -142 -65 103 24 18 -150 -132 -34 -122 150 49 -373 -308 -136 -7 23 8 -26 -40 -64 7 252
3290 252 192 -109 -214 -236 -35 184 104 133 -141 -181 93 426 114 -141 -136 -70 25 -11 105 169 -171 -194 -85 231
3314 231 197 230 -94 -137 -49 -62 161 114 133 -127 -73 126 214 155 -147 30 18 9 391 306 22 -283 -32 -77 -10
3339 -10 134 183 24 -90 -107 328 145 -24 -331 -4 -97 248 -63 -262 -259 -190 -16 -72 21 228 -131 -103 45
3362 45 213 25 187 -123 -277 39 109 47 -131 117 -274 -140 79 88 106 -111 -65 -187 23 82 135 76 -185
3385 -185 1 -27 122 83 -101 -129 -170 35 -83 -21 122 -103 -343 27 78 15 118 -9 -167 8 107 166 66
3408 66 -123 22 -69 66 89 105 -100 -262 -125 -80 37 132 67 -278 259 36 -113 139 -225 -109 -92 -95 202
3431 202 43 -130 -66 -5 83 157 41 -39 -159 -26 47 11 338 69 -110 108 -176 230 -58 -230 88 87 -126
3454 -126 -85 -119 37 -22 -105 -163 129 225 223 51 66 39 80 -12 -113 -102 -141 -52 147 133 -139 -335 -127 -105 126 170
3480 170 227 -77 -163 -202 -279 75 77 96 -206 -113 -221 188 46 25 -277 -270 4 284 220 108 -7 152 196 139 19
3505 19 -92 -118 -23 48 260 38 -32 -200 -239 -9 -22 107 -67 124 -17 -81 118 45 -122 -199 13 -111 227
3528 227 -136 149 -38 -44 -316 173 151 -108 -94 -33 -154 156 323 -7 263 -390 -107 53 26 -2 32 -250 -212
3551 -212 1 38 -29 104 -133 -86 -3 151 156 -69 -50 -111 -221 -41 154 163 104 -82 -142 -39 57 17 -119 -214 295
3576 295 31 100 316 50 -54 20 101 61 -55 -54 -15 -143 -87 -59 188 -153 2 -82 -30 68 85 -47 -143 26 92
3601 92 215 105 -210 -86 -65 123 173 -247 107 -181 -11 77 -50 231 -12 167 -169 81 217 222 -48 15
3623 15 -142 -9 162 329 -159 -251 -59 -87 88 155 -29 11 -66 -132 -140 177 26 53 -21 -184 -4 259 76 -139
3647 -139 -64 -55 58 136 -168 148 79 -105 -21 250 -193 194 127 -65 -152 111 -49 175 -323 -209 144 133 29
3670 29 53 6 215 -91 -50 162 -80 2 -311 -93 -71 62 116 9 -193 102 -2 185 -183 -41 -53 -22 169
3693 169 188 185 -96 54 154 19 276 -28 197 36 195 25 75 -52 132 -339 -350 49 88 -40 170 -156
3715 -156 -115 -52 -59 125 81 -147 49 2 -43 -26 -24 -20 -145 -20 -75 78 -113 -39 31 -218 97 71 1 2 -246 159
3741 159 111 126 153 140 -13 -158 82 90 -116 90 -24 25 -48 -23 203 82 -61 -34 81 -4 42 92 216 128 -85
3766 -85 -26 38 173 -252 168 86 104 -64 43 -149 20 -126 293 -103 204 -5 16 181 140 129 183 87 -29
3789 -29 58 12 135 -23 47 -28 47 -159 180 -14 -109 -25 55 -172 17 270 -44 -37 -47 68 -27 187 -39 -210
3813 -210 58 -212 -26 -153 -235 35 67 -44 8 167 -100 -85 200 181 316 97 -135 -31 -73 -119 -52 55 155
3836 155 -75 68 24 165 165 -61 29 -266 -24 -154 123 54 -33 -120 -103 17 109 -8 -124 -19 70 119 150 -145
3860 -145 219 -168 92 -18 233 -5 -100 52 -39 -112 129 164 -178 -266 -65 22 -68 110 -58 -154 136 -17 125
3883 125 95 -1 -112 1 186 11 483 46 -17 51 38 -81 -168 -68 -95 34 -288 -110 63 -147 -38 95
3905 95 179 129 80 -66 0 23 -140 133 -199 204 81 180 -24 44 -86 -8 -49 -205 -247 -87 -113 50 -52 134
3929 134 -85 168 -57 -73 39 -39 22 59 190 329 184 251 5 -91 -66 134 199 -84 -4 -302 293 -18 -93
3952 -93 -71 -23 84 -96 -57 -43 -33 34 56 325 166 59 -144 -114 -22 118 133 22 -12 -18 -76 -38 257 282 103 -229
3978 -229 -75 320 21 257 -80 -105 0 -37 16 161 160 -90 81 5 298 0 -96 -31 144 -91 60 -35 56
4001 56 70 -18 -32 357 86 47 -107 -84 -86 -4 55 -86 62 66 -48 -260 174 -90 -161 44 89 -37 -1 -134 -134 8
4027 8 70 98 -126 45 -13 165 -111 83 23 175 -60 -311 156 15 -77 24 -232 169 -150 39 71 -30 73
4050 73 -163 -65 -188 42 214 15 -94 6 -82 -242 39 62 -26 -90 188 51 82 -80 84 -202 -203 228 201
4073 201 35 62 42 59 37 47 104 -10 -247 -110 258 281 90 96 69 -116 172 -144 257 -120 45 192 -184
4096 -184 118 108 -77 -229 22 -1 -58 -112 -52 43 1 1 -107 -1 -198 -218 53 -24 187 174 353 -207 -29 -84
4120 -84 -248 -50 164 -33 -258 81 -117 -190 -33 -154 -43 18 142 220 161 -238 187 68 241 -23 160 202
4142 202 -120 90 17 182 90 -52 -291 -286 171 96 -69 -37 -131 -79 178 75 -290 33 -347 -1 -69 100 -114
4165 -114 -33 -198 90 6 246 133 -124 -246 -268 185 37 243 -137 26 -83 27 104 -19 -6 76 -299 64
4187 64 7 -58 -189 -87 10 -111 21 -42 20 60 74 -63 121 -19 196 62 7 -161 -31 64 -56 -11 87 180
4211 180 -202 -58 -143 -144 106 -35 160 103 -78 368 -70 -25 -194 41 162 -97 -10 -170 -37 140 49 -120
4233 -120 -140 78 -54 -28 -65 9 -105 -188 -32 103 -22 -2 258 120 20 58 107 -101 -80 221 107 -48 207
4256 207 5 -111 253 -48 262 -115 8 67 -81 141 -58 -256 28 -1 -7 -98 27 126 79 -104 -270 -109
4278 -109 -86 -9 -129 -52 -303 -311 -6 -61 -257 -184 4 -193 247 162 198 4 71 47 6 -21 -101 241 -87 -63 -98
4303 -98 243 62 26 117 21 -65 102 60 -24 -16 215 101 -2 38 -205 -53 -7 -146 56 114 -88 -176 -59 245
4327 245 -43 29 -130 -60 -63 -89 98 -9 7 115 -70 -116 -34 -1 -21 206 -33 82 97 68 162 -28 -141 -22
4351 -22 -157 103 -157 50 186 -115 125 -217 -43 -48 -103 -146 33 84 233 39 79 -161 146 -28 175 227 62
4374 62 127 -64 -82 -42 135 -11 45 78 190 92 7 -107 301 72 197 17 -29 -167 -56 -155 198 9 181
4397 181 -19 -49 -16 -136 82 123 -99 24 -183 -91 282 45 42 -76 -326 8 35 -148 105 -177 -159 47 277
4420 277 -28 -158 18 -51 -17 151 -148 -55 -217 -153 63 133 21 178 114 57 -15 189 -100 -53 -87 -136 -4 -61
4444 -61 103 17 130 -2 233 -103 64 -188 74 57 41 138 114 183 -94 -143 -31 155 100 -11 123 191 188 2
4468 2 74 143 239 104 3 -105 -9 -50 -138 -190 -67 34 -279 -70 43 66 -280 -23 -105 -89 -65 -158 6 -143 -327
4493 -327 -52 147 47 -114 77 2 2 -70 67 109 35 5 167 -42 105 -243 -137 -14 -40 -154 34 386 -72
4516 -72 133 103 57 82 -111 6 51 -25 -167 98 102 23 -217 -37 20 44 -25 243 131 -51 14 -113 98 45 209
4541 209 93 0 -185 98 107 -241 136 -130 -99 -172 38 59 -45 329 84 193 -123 -88 1 -162 -136 -67 78
4564 78 29 -83 -12 -6 53 -9 154 15 15 85 -54 -123 -18 -201 95 85 79 153 133 51 56 -247 165 -47 4 89 33
4591 33 -268 144 -172 -172 -125 -154 17 13 -51 -114 36 -15 -185 88 111 -31 -137 -18 18 -39 -25 -363 -286 133 16
4616 16 150 3 41 58 52 -116 -83 129 -29 -227 3 27 -125 -95 -95 45 -13 65 -35 283 3 170 -194 136
4640 136 2 -7 -30 18 38 73 -76 -119 -2 -63 -171 15 147 137 200 102 -10 188 82 91 45 -147 8 110 -11
4665 -11 -9 146 31 71 29 164 -134 -113 53 -47 66 -44 -7 -15 25 15 -235 29 -39 -203 252 -94 -185 149
4689 149 -108 220 55 -62 127 60 14 125 -64 -118 19 -210 118 -129 -97 -127 95 -78 -80 183 -88 -167 70
4712 70 87 109 55 42 -96 -85 -25 -4 -14 261 -37 -47 199 -119 172 171 155 -8 22 102 -2 134 -7 -181 70
4737 70 -40 -30 46 139 60 76 21 -64 72 138 -18 126 91 154 106 -187 -34 -167 -1 -47 -28 -14 -291 64 139
4762 139 -43 51 -306 155 -60 -68 245 153 210 -40 -103 84 172 46 3 -6 124 72 123 -6 -96 28 -39 -107 -58
4787 -58 192 69 238 -206 -125 5 20 104 20 45 -128 -222 199 157 -85 6 151 15 -4 46 66 41 -104 108
4811 108 -16 -58 43 -88 -46 -83 -168 -151 -6 -233 97 72 66 -213 90 142 130 156 131 -179 38 12 5 -158 -23
4836 -23 1 -1 -61 -143 -72 -93 128 89 14 289 -317 -4 -84 -157 -39 -242 -22 14 24 -238 17 77 -56 -60 46 209
4862 209 -39 -152 -14 -92 34 14 -153 100 -44 -186 -120 57 79 77 -171 -193 53 -48 -16 138 88 -88 -29
4885 -29 -244 44 78 114 152 32 -31 -174 29 -73 -123 -86 -129 -256 -209 -108 18 261 -36 -31 34 -71 13 -247
4909 -247 20 238 173 162 -77 25 85 140 -112 79 37 -138 -14 201 -106 248 69 -108 1 21 18 -201 -93
4932 -93 -62 -78 134 32 163 -36 -28 -98 129 -21 38 109 54 -189 -67 -138 -131 -86 13 -126 -224 10 55 -31 -90 -20
4958 -20 -262 -289 -16 9 151 -189 137 50 27 -45 -237 112 -109 19 -4 -164 52 202 1 -103 -121 -155 66
4981 66 250 88 -24 -43 28 47 132 243 -116 -79 -63 -186 -205 -49 53 2 -7 68 -102 104 125 -41 -175 0
5005 0 159 98 89 93 -114 81 -227 87 -185 333 -226 -84 -29 -113 -90 -141 71 -4 -44 -131 92 17 -93 -16 -102 0
5031 0 -58 -113 -90 -87 103 50 1 83 -87 -75 -49 41 6 -60 162 -344 3 -110 -114 65 -124 -19 168 -14 -84 -272
5057 -272 89 146 -154 -247 -230 -136 72 -73 -56 33 -33 -59 193 169 108 101 -74 103 34 -7 -67 -199 -61 125 -69
5082 -69 56 84 -157 211 -19 35 70 151 131 -92 107 -109 -213 106 100 41 -20 22 -112 -74 -23 69 53 -23 -191
5107 -191 -12 -232 -168 90 -190 267 60 -228 72 -88 118 41 89 -8 148 37 254 124 -175 48 20 -104
5129 -104 251 187 -28 107 85 -66 18 103 -29 -246 279 66 -40 -135 5 139 134 92 -41 -202 70 137 -11
5152 -11 46 135 -171 -59 -20 -154 -29 -54 172 196 0 38 130 -225 53 41 -75 132 160 47 101 -153 -104 73
5176 73 50 -65 156 -62 -8 196 -124 248 -30 -137 -12 -46 -47 183 67 -99 35 -184 -3 70 0 87 30
5199 30 103 126 -176 95 -38 78 -14 78 148 82 172 -79 -8 -66 -84 110 -61 -82 166 -80 -180 -7 -33 35 -57
5224 -57 30 72 -264 212 214 44 19 -125 60 31 -41 36 -128 72 -111 -158 -38 -121 79 20 30 187 -48 97
5248 97 75 -8 -74 -1 -120 -290 140 31 -195 -7 -294 -112 -7 12 48 145 -140 -38 114 82 83 -141 -82 77
5272 77 -83 -22 69 58 -8 192 -110 15 -22 91 43 51 -224 91 -199 -90 35 -240 -20 77 141 -7 79 -200
5296 -200 78 219 -24 -132 -254 -32 -30 39 168 -1 -15 -67 77 48 -126 -47 -62 156 69 -12 -47 173 101 -3
5320 -3 -147 46 -16 -92 -124 -182 120 -31 -18 29 -117 75 73 27 -11 -33 -108 -170 134 -21 -74 16 117 -40 -35 -24 40
5347 40 132 -44 195 11 -93 52 -321 -27 -30 -40 5 -36 188 153 -55 -204 -62 -102 158 -194 -122 -75 35 37
5371 37 35 -34 119 15 -70 -117 -26 33 -134 174 16 -9 -62 -7 20 -43 79 85 -165 -114 65 49 -136 -12 24 78
5397 78 104 -233 -148 -38 135 -63 2 140 90 2 -50 30 246 78 69 -83 193 -81 56 -197 -19 99 -198
5420 -198 405 104 25 221 -27 -149 -87 63 -76 -70 -160 -135 149 -68 -114 -244 66 24 154 30 88 79 16 -10
5444 -10 95 -48 -125 -68 -145 30 -108 -25 35 21 151 -58 -52 106 -72 53 165 -8 261 34 -11 43 -1 8 -104
5469 -104 198 -65 43 34 202 7 162 -314 115 -103 -18 29 52 -73 -8 14 -106 -27 -166 76 -3 -7 77 -187
5493 -187 74 90 -114 -181 -187 -258 54 -43 62 -120 27 14 -96 28 -91 99 203 -157 -86 62 -75 -44 52
5516 52 -79 -61 -59 86 -177 175 -53 -7 57 74 73 -131 173 83 -28 88 133 6 -71 -149 16 155 94 -45 -87
5541 -87 -60 160 -273 -77 -215 14 50 -298 85 -99 -123 14 -11 54 -151 113 198 34 -336 95 12 -221 33
5564 33 338 -5 -293 -152 111 308 141 222 153 44 236 -40 -155 -233 -131 -306 -29 157 -96 -119 -92 162
5586 162 -32 20 -8 138 278 -211 46 51 -5 106 -1 23 165 5 -48 -33 -83 -191 -263 -84 25 -29 -48 -163
5610 -163 95 -253 223 -106 167 60 -52 -2 -9 -23 -244 -245 -40 26 105 7 64 50 54 13 143 197 12 -244 3
5635 3 32 50 45 -138 170 34 148 -72 79 52 20 -113 -205 -98 -92 -176 -9 69 82 6 -60 74 110 -32 -49 140
5661 140 90 83 -29 -132 32 -18 -137 43 88 -247 -42 35 145 -47 -12 -32 27 76 -189 111 69 119 -173 -343
5685 -343 -49 -90 -118 -18 17 189 30 190 -203 -358 47 -135 41 -104 46 190 80 -261 -1 31 -31 176
5707 176 -199 -50 65 -132 -92 -40 -34 -81 -53 204 -88 11 70 -68 -8 -10 -66 -148 -103 -133 132 -83 -28 166 -50
5732 -50 29 -69 -34 70 81 111 11 148 93 42 -176 134 102 -23 -95 70 197 36 -163 -5 -256 58 85 180
5756 180 12 -51 45 1 -146 -47 61 -19 -10 -26 42 4 128 173 -219 -100 157 9 209 50 -67 -81 67 -2
5780 -2 202 194 228 -65 15 -16 123 142 60 -11 -241 -107 56 -33 -263 -156 5 -117 -85 -74 -311 99 63 -145 138
5805 138 -197 157 142 -405 88 273 -130 84 219 29 11 -138 226 -31 -141 -138 9 -6 -105 -7 -118 25
5827 25 -148 -83 148 122 -34 -148 -15 113 -96 -102 -80 34 123 -125 -69 -133 42 -67 23 27 -221 -93 194 -100
5851 -100 26 73 -6 118 180 120 161 -51 81 -17 153 75 38 68 -103 -64 186 125 -46 215 -194 44 29 99
5875 99 213 138 102 168 -37 177 73 -9 -2 57 -78 145 -17 311 21 31 -10 -120 94 173 22 155 59 27
5899 27 -92 204 -67 5 -124 -289 -90 72 14 -117 18 -85 44 -150 -159 -249 174 216 -84 -70 232 163 -343
5922 -343 -208 -44 236 -8 159 79 94 232 -80 -50 71 -7 85 -47 81 -95 12 15 -160 -64 -27 151 -204
5945 -204 106 -148 291 -175 119 -83 146 0 -105 114 125 33 -98 5 69 300 63 -14 -321 -98 -169 -76
5967 -76 -78 182 197 -48 146 18 69 -273 204 -100 290 31 99 36 -2 -25 -20 -197 -94 2 78 162 -237 -184 144
5992 144 359 -184 33 -136 236 311 170 65 -118 216 -69 -233 58 -182 43 42 160 3 54 72 -122 91
6014 91 -86 -29 149 20 -28 24 -92 -29 -93 -67 59 -17 229 -49 -152 115 78 67 -85 -91 258 -42 -100 -42 180
6039 180 273 63 -42 80 -134 167 -160 -76 1 -17 219 14 -21 27 60 146 32 -127 -49 30 37 -137 11 202
6063 202 -175 -222 4 25 314 -153 97 -89 107 29 -21 125 -49 39 176 11 -86 128 214 -198 15 11 -139
6086 -139 -69 -72 47 -159 -25 110 150 79 -182 -68 -8 -130 47 71 -40 -20 168 99 -93 -324 -101 -68 -9 159
6110 159 47 -202 185 -149 58 200 85 57 -23 -2 20 35 -22 -37 -174 -33 -83 -187 27 -264 255 98 -12
6133 -12 -123 -101 -32 154 -3 108 160 -26 11 50 -121 73 -61 -250 19 63 32 -1 84 -231 98 -62 -155 -6
6157 -6 -87 -109 -64 -88 -178 188 102 31 -43 215 136 -216 -9 48 107 -27 -142 256 -233 -97 -62 72 118 -40 102
6182 102 -68 -204 -100 22 -279 56 7 2 -26 -203 -161 -251 111 68 -39 95 -62 22 217 24 -96 26 -5
6205 -5 8 142 42 -70 -53 -32 -114 -4 -167 -112 15 -5 -123 40 76 13 -74 180 -7 110 97 54 -43 -68 -44
6230 -44 240 -109 -142 79 85 -23 -130 -8 -90 30 36 -29 117 116 -34 20 221 -232 -2 -24 -119 271 -96 -17 -47
6255 -47 -157 165 6 -65 -100 22 51 -12 -122 170 136 -210 144 -153 -140 -8 173 -57 -26 261 320 -38 37
6278 37 52 15 16 -56 -40 -219 274 1 -25 114 -137 -65 212 -27 29 66 0 39 -82 -33 175 52 151 -56 241
6303 241 -264 -30 79 -49 35 87 300 68 167 -36 -74 111 -199 70 -14 -33 -44 -216 -130 105 -176 -74 116
6326 116 10 183 -189 -290 -77 -226 -128 -143 152 249 -135 -65 -26 77 -70 5 -145 65 -4 -65 205 220 320
6349 320 48 171 12 -59 -94 -63 46 129 -197 117 145 83 -30 -59 75 -161 -76 -13 -101 -231 -112 109 76 -55
6373 -55 88 -115 90 19 20 -272 -65 -34 -97 12 -167 105 -133 -66 -49 -35 12 -17 174 72 -134 -25 60 141
6397 141 87 161 -20 -87 38 -144 73 -58 -300 -82 163 -57 -76 44 -71 -92 -61 -17 156 -68 -24 -131 7
6420 7 -201 42 -79 -72 -95 37 -215 -2 -36 -192 138 -33 -75 -69 -149 -179 50 -7 84 -26 -107 -43 62 175 -27
6445 -27 72 8 -94 -53 -3 -23 -58 -209 107 86 122 213 -52 -11 -126 -165 56 1 39 117 -123 -133 29 -31 19 253
6471 253 -15 317 -84 17 121 88 65 -191 57 -33 306 285 65 -102 149 53 -263 -190 27 -185 221 23
6493 23 -62 272 128 -85 -10 -11 -135 107 71 125 52 2 28 97 149 97 1 123 -57 29 51 210 -200 53 -154
6518 -154 -55 49 -83 103 49 230 148 168 -142 -78 125 209 11 -43 115 -112 -49 -114 7 -80 -33 102 259 -327
6542 -327 -50 -83 -180 66 98 105 29 116 22 -21 85 -264 165 214 -61 239 -72 120 37 -143 52 143 -65 352
6566 352 7 -256 -58 114 7 -24 201 -211 -142 -45 99 294 -24 -111 -60 -148 66 -31 52 -80 93 129 181
6589 181 12 310 -130 68 -101 51 -161 -33 45 27 -79 7 51 92 -115 -105 -43 41 -16 -153 -7 -35 57 -1
6613 -1 -73 -9 -16 160 -70 -61 45 67 -259 -144 5 -49 -1 -29 -73 -101 80 -33 -215 84 70 -96 130 20 14 -12
6639 -12 14 -33 69 -193 75 -11 -40 54 37 -14 -55 124 -44 36 53 44 -235 56 -109 -117 -50 40 71 155 77 -112 75
6666 75 271 -55 -96 -163 19 188 60 56 103 41 -109 -133 -125 -138 79 -91 -206 63 -7 -167 3 -44 -3 -71 -60
6691 -60 5 217 97 -50 84 261 125 -76 177 8 -53 31 -289 18 -101 -134 -1 -123 27 -156 89 -32
6713 -32 152 146 251 -162 179 -216 -261 -35 -25 -63 -79 -101 61 -10 173 108 -119 190 -212 25 -95 -66 -18 115
6737 115 123 168 -98 -47 -105 -82 93 236 -94 40 -263 26 88 176 92 -122 -193 27 -121 -71 120 -246 -162 -35
6761 -35 -99 -131 94 -52 196 67 -227 26 61 7 84 -46 -30 68 -12 -266 -14 -39 118 125 72 67 20 -119 -65 -64
6787 -64 -19 -105 120 61 173 -37 -162 25 -104 -68 -113 59 -144 99 110 65 56 -125 217 -205 108 26 -17 98
6811 98 -116 -169 -16 -172 54 -82 78 -399 -41 140 -5 -1 11 52 113 49 144 92 -63 -3 -107 48 -137 -168
6835 -168 50 -32 38 100 132 171 -205 -97 -141 -114 276 68 -22 103 56 15 81 -83 121 -316 129 150 10 91
6859 91 113 -153 222 -47 -105 -59 -351 90 40 -9 -173 -24 -69 -96 -154 27 16 67 -271 -52 -259 143 16 -105
6883 -105 -109 12 176 216 -29 192 115 -101 -177 -82 7 237 123 -26 -130 -16 -58 58 -246 102 -149 137 264
6906 264 -73 -73 -57 108 -184 285 106 21 -105 218 -193 116 -17 40 53 110 71 -7 -152 17 114 -28 -65 -12
6930 -12 -4 -35 191 69 36 -98 -38 -92 26 -25 19 -21 -22 55 -138 -145 -149 -59 144 11 -29 312 0 177 -2 3 142
6957 142 -73 273 -5 83 100 29 262 -164 54 82 54 -38 218 -183 -62 40 -177 -133 -33 37 184 1 -81
6980 -81 -46 33 -113 -134 159 10 -181 1 388 -93 -102 -7 234 229 1 -75 -60 -138 141 -46 52 -33 -148 -181 -78
7005 -78 234 -53 5 124 181 -25 92 29 215 -132 -195 158 -37 -124 -189 136 -4 208 -35 -41 146 -122 -137
7028 -137 -222 23 -38 76 63 25 222 -129 -232 -39 176 150 -40 122 71 -67 193 20 112 31 44 -154 12
7051 12 -2 131 -6 -39 -80 43 265 -25 61 -97 -69 -67 -84 66 -149 -46 122 100 -20 -159 -29 -150 79
7074 79 173 45 242 130 157 43 97 21 -182 -147 134 -8 24 45 -69 -58 -234 188 -60 38 40 37 93 -163 302
7099 302 -169 110 -199 -39 -57 -149 131 114 58 48 -203 -23 -87 -66 79 26 -240 -73 80 42 -169 -95 -40 213
7123 213 206 -4 -2 -200 -153 187 -237 -33 248 152 -87 113 135 -91 119 -285 -134 7 -36 -67 86 -14 138
7146 138 122 4 6 -59 119 -22 187 94 22 -319 120 143 -26 105 14 47 139 -248 18 5 -58 126 206 39
7170 39 -156 153 122 -78 -125 -49 -92 46 70 82 -205 -143 13 156 27 -61 -33 -18 119 104 -57 45 -35 123
7194 123 -30 -126 -82 -10 175 -64 -274 -33 43 74 110 95 -65 154 65 89 183 -140 -75 43 -18 -12 -11 85 20 3
7220 3 105 -22 5 -111 254 162 -53 -70 84 121 126 231 155 -173 66 -53 -109 -139 184 -12 -31 7 -2 158 84
7245 84 45 75 148 54 186 -163 -36 -82 205 -241 68 -70 35 73 127 -203 -95 93 -159 51 -121 30 97
7268 97 101 -146 233 45 -92 -132 -80 -119 -69 19 -114 22 -50 -21 -74 -151 -54 -112 231 -119 101 -142 -138 10 133
7293 133 -165 -256 -176 -108 192 -17 262 191 60 223 -49 92 -2 141 -36 -80 -66 -44 -38 113 1 -224 -78
7316 -78 -138 146 -137 -99 9 47 33 -228 -257 -94 18 16 257 -6 -5 47 -165 -62 45 -176 -140 15 -141 -246
7340 -246 -148 -43 23 57 -15 280 -57 -86 136 182 275 -106 28 67 -104 -56 150 247 -39 100 51 112 42 102 277
7365 277 26 453 38 74 -59 -205 -83 122 41 -74 165 -107 47 49 122 -8 -69 156 -2 -29 -166 102
7387 102 -86 -142 -54 -18 154 23 83 -238 30 -203 234 8 -240 210 4 -33 -1 -99 59 -40 123 101 3
7410 3 116 -92 -73 -98 -81 -46 -7 -170 197 67 -120 69 193 1 -190 37 80 -47 71 -17 50 -80 176
7433 176 -106 -38 -59 251 170 -276 -102 1 0 244 67 63 76 71 -14 19 -30 275 110 35 65 43 -57 -110 148 240
7459 240 -39 -7 -59 -334 -85 222 -16 5 233 37 20 18 99 98 -14 1 23 94 -165 98 89 17 18 106 -160 -223
7485 -223 139 286 51 -200 103 -66 0 -24 83 36 -52 55 -136 -124 -248 203 42 1 104 32 121 11 133
7508 133 6 -5 -132 18 -80 -346 21 -222 136 34 -38 -165 86 -11 68 -257 -213 -55 82 27 -195 -66
7530 -66 242 -92 95 -5 -77 -127 -66 -114 -4 -16 -128 6 -20 -68 -74 75 -58 -309 105 -155 12 -151 230
7553 230 97 118 -86 -102 71 103 -80 76 80 -180 -11 32 -49 63 67 -155 -26 -163 -41 -64 152 46 13 259
7577 259 26 4 -42 -137 -7 20 96 257 108 -177 -7 221 57 -132 9 -64 17 96 32 73 127 24 199 -145
7601 -145 87 -127 -45 -91 -396 -19 89 235 -114 -100 41 -109 172 -85 42 -136 -49 152 180 -92 -106 -113 -85
7624 -85 -103 -76 85 -66 136 -160 73 61 67 59 -253 0 -241 -69 20 -28 -171 139 190 34 86 303 58 86
7648 86 137 260 41 -59 169 -95 136 92 -210 -120 160 -56 -14 96 103 -42 -155 -39 -42 12 28 -55 79 -254
7672 -254 -168 43 -34 159 81 -126 -262 160 -170 136 -93 114 -49 -61 153 -133 -233 -147 -18 70 21 -162
7694 -162 -113 -116 -122 77 186 194 62 -7 101 282 92 -84 71 169 59 -34 80 7 84 81 -209 -81 -126 106 77
7719 77 69 33 -43 172 -33 57 84 13 -62 -13 -39 114 62 -76 41 -104 32 -16 -223 189 -72 -56 -8 -141 -80
7744 -80 65 -124 -97 62 -207 -121 167 -131 -210 -10 -84 140 152 -7 238 -76 57 29 59 -6 130 -57 47
7767 47 -23 -200 -44 -65 -107 -12 -147 -172 23 -224 -53 92 59 -112 19 124 125 95 14 1 -49 302 -156 13
7791 13 -101 97 -208 434 -13 4 -56 -104 50 80 -38 88 38 114 -43 152 2 32 38 15 -133 185 -80 164
7815 164 1 -156 8 42 33 -3 10 -128 35 -295 46 234 91 -57 -157 2 27 -101 122 -116 -54 -205
7837 -205 264 241 -163 -166 136 -84 -95 -233 -10 11 158 -114 45 123 -287 188 -62 82 266 66 58 -187 72
7860 72 -137 -12 9 -8 169 50 60 -47 23 100 33 -22 86 77 188 26 -24 67 -8 -54 -31 80 135 68 -53 128
7886 128 120 -128 6 -87 -50 -126 103 136 -123 -19 231 84 -52 43 51 -104 163 193 -37 90 -78 251 -43
7909 -43 87 3 233 172 -99 -78 -186 -25 84 -96 195 -17 -156 -109 169 -281 108 72 136 -322 75 -84
7931 -84 -204 -43 -94 12 -63 186 -20 11 -303 -60 -43 -98 -198 170 11 -250 36 36 -132 -189 84 41 225
7954 225 57 344 28 9 150 -20 -225 -114 -32 -24 87 57 110 -82 -92 9 -77 -57 122 140 -55 -86 -74 65
7978 65 -100 118 -176 4 22 22 -40 -95 -157 93 -33 -121 78 -23 -148 -121 36 -112 -2 139 -19 -45 112
8001 112 -136 -172 56 116 -132 -261 -99 -151 -54 184 162 46 102 251 -185 1 -26 -221 176 91 -38 -78 140
8024 140 -18 8 -18 140 -40 -288 194 25 70 -35 38 146 -2 83 146 -144 38 117 -143 -96 25 -14 76
8047 76 133 23 -141 -313 -2 49 -24 137 -220 173 -69 31 71 -39 70 -152 -172 -6 30 22 2 18 173 173
8071 173 -185 17 -58 144 44 -35 -16 5 72 -202 11 178 -92 -39 -121 -66 -10 83 126 -68 -102 -49 108 -125
8095 -125 -49 104 141 9 3 22 -12 276 250 102 247 -51 23 -130 40 91 190 32 -98 -103 -114 -6 161 -61
8119 -61 78 3 100 234 9 278 28 -57 -203 137 26 -180 -1 -56 -129 -151 -17 -145 -93 -145 -131 -89 -188 81
8143 81 -5 40 -92 -92 39 146 163 -95 -104 103 -22 113 30 -2 136 158 78 -27 14 -99 -119 126 -40 -23 -23 213
8169 213 72 -272 -106 -77 14 106 -281 -84 -59 113 -15 110 -7 -106 -53 -14 16 5 -3 -103 -175 -173
8191a73
$$ Imaginary data points
##PAGE= N=2
##DATA TABLE= (X++(I..I)), XYDATA
0 0 0 0 0 0 0 0 0 0 0 8 -8 8 -8 16 -16 20 -24 32 -40 48 -56 65 -80 93 -111 128 -149 175 -202 229 -265 302
32 302 -343 391 -440 495 -559 627 -702 784 -872 971 -1079 1195 -1323 1462 -1613 1780 -1962
49 -1962 2162 -2380 2625 -2891 3187 -3518 3891 -4310 4793 -5345 5994 -6764 7696 -8848
63 -8848 10322 -12274 15002 -19103 26033 -40769 142258 -329383 -333437 77485 -201316 232514
75 232514 495209 -139444 -393988 -72669 -34712 173863 316576 3928 -263290 -266227 -46261
86 -46261 316201 200212 -41951 -64938 -294057 -208501 382742 282062 -138406 -22593 -159437
97 -159437 -317606 265625 389624 -111336 -115433 -88959 -250971 108334 365787 35109 -168571
108 -168571 -157926 -145299 79053 247467 136193 -70666 -256819 -147853 143171 164278
118 164278 114312 44189 -246516 -232729 153460 187984 46347 60978 -161590 -278368 81944
129 81944 232060 68979 12999 -116038 -228888 -7410 213643 149453 1506 -128501
139 -128501 -175188 -34286 138953 181639 49407 -157100 -167913 -20170 88376 160853 89703
150 89703 -138326 -192417 -23728 94365 137856 103367 -91290 -196710 -58283 95246 144531
161 144531 95302 -58167 -170925 -96450 70862 150277 92274 -48394 -150034 -106409 40727
172 40727 146628 103562 -38942 -139068 -112377 25999 140023 114003 -13509 -128843 -121800
183 -121800 10095 128684 118106 3613 -111167 -128212 -12278 115345 116905 14060 -101612
194 -101612 -126621 -24837 96584 124470 32734 -96582 -124632 -30698 81361 123914 57941
205 57941 -80512 -132732 -37248 67474 109678 71310 -60052 -135049 -53751 59685 102802
216 102802 68911 -40541 -125557 -70490 50265 109432 74942 -30818 -110256 -78917 27272
227 27272 111585 87347 -23853 -100946 -80492 5297 95991 97197 -13511 -99728 -79598 -3704
239 -3704 81673 100307 3634 -93530 -86308 -7414 75825 99692 21499 -80990 -94093 -20089
251 -20089 68729 96983 30560 -65149 -96262 -35015 59257 93863 35679 -54945 -92518 -44004
263 -44004 49205 95696 44662 -45233 -88755 -51203 38630 94288 56001 -33492 -86635 -58361
275 -58361 24905 86547 62277 -23165 -82187 -64221 13710 79656 65879 -13244 -77588 -66856
287 -66856 5939 75029 72566 -2050 -71143 -70170 -4212 67580 75719 9506 -64478 -73931 -14484
300 -14484 56802 74437 17857 -56645 -75132 -22145 50102 74017 26199 -47677 -74975 -28729
312 -28729 44119 74646 35362 -38542 -74613 -37581 34511 71674 41382 -29146 -72363 -44743
324 -44743 24519 67547 45259 -21313 -67750 -48632 16599 66466 51525 -14171 -63308 -51540
336 -51540 7003 62255 58608 -6320 -60191 -53464 -3311 52904 62269 2697 -57067 -54591 -8428
349 -8428 44468 62392 12528 -51491 -57505 -12448 41164 61922 20889 -42227 -60460 -21409
361 -21409 37471 61153 24471 -32909 -58536 -32076 29971 61658 26579 -27383 -53487 -37186
373 -37186 20869 62725 32810 -23598 -50512 -38401 12892 59645 41585 -16497 -50538 -40900
385 -40900 6340 52627 45214 -7527 -49495 -44542 1105 46226 46104 617 -45518 -46708 -2859
398 -2859 43087 48535 7371 -41080 -48280 -8544 37887 49797 14297 -36563 -50135 -15209 31451
411 31451 48805 19326 -30301 -49720 -20930 27467 49343 21494 -23916 -45132 -28404 21933
423 21933 54019 23523 -22099 -38432 -33200 9689 56739 30203 -22942 -34958 -31780 -1896
435 -1896 50851 39564 -18557 -38068 -29042 -3036 41035 42668 -5483 -39752 -36480 652 38919
448 38919 34684 6031 -29315 -49877 -4870 45562 27164 5057 -13054 -52585 -21071 50040
460 50040 33272 -3144 -6663 -40886 -33552 39895 46009 890 -14586 -32745 -29623 21915 45315
473 45315 18797 -19189 -41146 -18705 15809 27857 32836 -5289 -56202 -19424 26941 14492
485 14492 27230 15670 -55623 -36687 33571 21233 14447 21076 -38384 -48613 18842 34027
497 34027 16583 8782 -25347 -39665 -3416 30682 34796 1984 -32223 -22715 -7738 11206 47315
510 47315 14549 -45526 -21027 3217 -2205 39467 33069 -42266 -36238 8274 2617 24153 36182
523 36182 -23807 -43839 -4948 13471 24325 23409 -10631 -33160 -22272 10990 37364 16326
535 16326 -14560 -17442 -26291 -5881 45061 25084 -22886 -15438 -17420 -16865 35546 37239 -18462
548 -18462 -23804 -12572 -12949 22915 37607 -3670 -27268 -20796 -5383 20532 28048 6319 -19729
561 -19729 -31062 -8391 25806 22907 5274 -8740 -31853 -18034 26975 26047 2731 -6125 -25436
574 -25436 -22735 19066 31407 6442 -9058 -22062 -21037 11336 29751 14182 -8656 -24742
586 -24742 -18530 7140 24294 19077 -3967 -26406 -19810 6813 20776 19487 1308 -24399 -22407
599 -22407 4098 20761 19669 3249 -20994 -23643 -350 19645 21224 4784 -18420 -23364 -4509
612 -4509 17047 22616 6787 -15943 -23094 -7543 15141 22521 8931 -12844 -22916 -10837 13452
625 13452 23131 9885 -10026 -21328 -14172 10234 23633 11082 -8107 -19955 -15202 6571 22617
638 22617 14495 -6455 -19410 -15349 3589 20556 16549 -2677 -19807 -17187 2926 17662 16748
651 16748 1511 -18858 -19669 1115 16782 16139 4292 -14987 -21120 -2082 16556 16526 5087 -12264
665 -12264 -20438 -5871 14377 18337 6279 -11078 -19247 -8144 11107 18995 8988 -10170 -18909
678 -18909 -9131 7743 18264 11405 -7931 -18895 -10614 5993 16820 13156 -4891 -18455 -12050
691 -12050 4209 15898 14167 -2777 -17045 -13956 2315 15303 14141 -134 -15559 -15143 -33
704 -33 14069 14925 1603 -13559 -16071 -2214 12892 15100 3707 -11610 -16214 -4526 11300 15683
718 15683 5113 -10061 -16146 -6915 9569 15901 6753 -8536 -15713 -7863 6977 15748 9205 -6918
732 -6918 -15381 -8752 5142 14467 10750 -4773 -15483 -9970 3759 13362 11633 -2161 -14655 -11652
746 -11652 2051 12698 11689 -214 -12952 -12712 103 12051 12368 1105 -11284 -13168 -2207
759 -2207 10836 13090 2377 -10060 -13093 -3977 9336 13558 4311 -9035 -13085 -4875 7744 13373
773 13373 6068 -7403 -13066 -6315 6379 13060 7326 -5608 -12819 -7480 4824 12448 8499 -4241
787 -4241 -12676 -8296 3376 11704 9702 -2287 -11837 -9442 1946 11121 10048 -426 -10955 -10480
801 -10480 433 10007 10400 860 -9576 -10824 -1280 9351 10999 1876 -8314 -10818 -2986 8389
815 8389 11562 3254 -7198 -10869 -4203 6507 11524 4546 -6492 -11105 -5395 5322 11093 5999
829 5999 -4714 -10816 -6420 4141 10698 6829 -3248 -10493 -7448 2896 10211 7563 -2157 -10035
843 -10035 -7933 1584 8862 8655 -422 -9860 -8566 977 8157 9088 1583 -9087 -9685 90 7525
858 7525 8742 2674 -7866 -10150 -1891 7165 9151 2467 -6190 -9496 -4067 6025 10647 3288 -6288
873 -6288 -7825 -4795 3057 11375 5228 -6703 -7989 -4079 972 9805 8029 -5415 -9111 -3919 1365
888 1365 7825 8173 -2462 -9474 -6504 1867 8189 6137 89 -6976 -9552 260 10488 5181 -1105
903 -1105 -3449 -9300 -3775 10890 7768 -3038 -3381 -6538 -6191 7998 10646 -1037 -5531 -5973 -4466
918 -4466 4529 9457 3318 -5545 -8630 -2464 4555 5740 5516 -1725 -11900 -4060 7348 4248 3433
933 3433 2216 -10779 -8462 7652 6395 1092 2212 -6631 -10161 3642 9130 2961 -496 -5078
947 -5078 -7320 -220 7281 7662 -577 -7704 -4821 -154 3072 9012 3279 -10425 -6236 2583 959
962 959 6157 6908 -8294 -9506 2505 3168 4013 6206 -4081 -10116 -1401 4891 5520 3925 -2501 -7263
978 -7263 -4402 2874 8135 3746 -4193 -4644 -4170 -746 8938 6435 -4847 -5222 -2573 -1902 6374 8400
994 8400 -3042 -7219 -2840 -720 4380 7675 -92 -7041 -4976 263 4839 6107 1110 -4668 -6670
1009 -6670 -1730 6037 5888 773 -2963 -6348 -3477 5318 6666 580 -2916 -5183 -4065 3420 7278
1024 7278 1978 -3488 -5365 -3450 2197 6638 3454 -2649 -5931 -3747 2040 5823 4203 -1517 -6014
1039 -6014 -4518 1552 5490 4559 -502 -5369 -4975 462 5335 4862 -207 -4628 -4799 -279 4877 5181
1055 5181 522 -4555 -5204 -1056 3870 5647 1395 -4160 -5542 -1670 3956 5570 1551 -3116 -5372
1070 -5372 -2579 3205 5754 1944 -2646 -4739 -3484 2174 5799 2553 -2328 -4828 -3758 1267 5482
1085 5482 3535 -1817 -4961 -4010 849 4682 4026 -553 -4963 -4305 770 4386 3952 380 -4386 -5073
1101 -5073 267 4140 3846 760 -3421 -5055 -758 4123 4132 1189 -3054 -4788 -1636 3580 4699 1486
1117 1486 -2920 -4606 -2194 2587 4773 2355 -2680 -4836 -2603 2305 4709 3024 -1720 -4840 -2534
1132 -2534 1617 4110 3234 -1249 -4567 -3352 1055 4153 3571 -722 -4455 -3655 492 4032 3649 -98
1148 -98 -4028 -4008 45 3713 3941 539 -3692 -4054 -661 3061 4184 1098 -3024 -4224 -1274 3042
1164 3042 4201 1347 -2609 -4467 -1894 2499 4403 2017 -2081 -4189 -2490 1715 4310 2482 -1602
1179 -1602 -3976 -2426 1183 3935 3290 -1219 -4054 -2912 714 3663 3355 -537 -3898 -3243 661 3781
1195 3781 3403 32 -3463 -3496 -248 3052 3429 519 -2941 -3718 -487 2946 3925 1145 -2588 -3561 -1134
1212 -1134 2586 3898 1305 -2251 -3909 -1741 1988 3862 1925 -1743 -3594 -1771 1702 3546 2267
1227 2267 -1345 -3671 -2301 1489 3600 2572 -902 -3693 -2488 702 3518 3001 -489 -3478 -2964
1242 -2964 425 3099 3053 117 -3158 -3142 -107 3047 3261 330 -2669 -3299 -430 2782 3046 796 -2689
1259 -2689 -3280 -1021 2176 3437 1071 -2276 -3523 -1371 1784 3478 1640 -2007 -3222 -1346 1415
1274 1415 3533 1845 -1419 -3347 -2185 1360 3306 2187 -1012 -3140 -2425 569 3062 2544 -490
1289 -490 -2948 -2481 259 2746 2688 -100 -3002 -2961 -38 2546 3052 674 -2827 -3060 -45 2428 2822
1306 2822 806 -2225 -3021 -1023 2214 2760 1009 -1948 -2927 -1406 1996 3679 1354 -2248 -2470 -1106
1322 -1106 1041 3579 1872 -2202 -2590 -1237 411 3091 2730 -1693 -3102 -1292 489 2497 2676 -660
1338 -660 -3034 -2165 662 2721 2028 -353 -1954 -2823 -337 3475 2287 -543 -1245 -2752 -1481 3445
1354 3445 3068 -983 -1618 -1987 -2008 2197 3484 -175 -2056 -1698 -1363 1503 3193 984 -1651 -3201 -1040
1371 -1040 1999 2360 1773 -304 -3391 -1940 2405 2031 683 293 -2853 -3185 2133 2941 545 246 -1769
1388 -1769 -3193 987 3288 1072 -245 -1741 -2253 -116 2314 2367 29 -2546 -1956 266 1266 2592
1404 2592 1178 -2912 -2578 666 1144 1915 1903 -2317 -3426 270 1779 1521 1775 -1193 -3106 -984 1922
1421 1922 1946 1207 -1092 -2424 -1559 816 2522 1398 -1587 -2036 -1048 108 2480 2380 -1399 -2382 -936
1438 -936 -138 2068 2562 -825 -2616 -1304 138 1484 2265 -47 -2464 -1909 245 1892 2180 232
1454 232 -1735 -2247 -412 2037 2136 -25 -1312 -1990 -906 1851 2448 292 -1257 -2030 -1028 1331 2389
1471 2389 817 -1453 -2153 -1057 1185 2087 1116 -1007 -2147 -1360 1085 2108 1332 -715 -2139 -1598
1487 -1598 680 2059 1561 -491 -2099 -1685 421 1862 1870 -203 -2077 -1762 87 1624 2034 102 -2113
1504 -2113 -1774 -49 1491 1795 406 -1599 -1900 -421 1464 2122 484 -1524 -2124 -551 1465 2104
1520 2104 586 -1050 -1732 -1016 1123 2162 811 -1298 -1707 -1022 843 2124 1170 -1033 -1765 -893 464
1537 464 1816 1499 -657 -1841 -1295 439 1810 1494 -219 -1808 -1549 162 1967 1319 -47 -1659
1553 -1659 -1860 -131 1980 1491 -79 -1449 -1562 -536 1317 1748 488 -1387 -1755 -621 1320 2059
1569 2059 697 -1200 -1781 -589 1147 1650 944 -1153 -1897 -990 653 1693 1343 -612 -1799 -1302 792
1586 792 1571 1168 -525 -1879 -1231 753 1997 1235 -458 -1707 -1290 384 1762 1448 -302 -1414 -1498
1603 -1498 -82 1883 1573 23 -1461 -1539 -66 1494 1735 80 -1470 -1568 -556 1501 1574 453 -1257
1620 -1257 -1506 -470 923 1598 656 -1127 -1796 -679 1091 1293 816 -768 -1894 -988 684 1378 772
1637 772 -540 -1466 -1015 600 1603 794 -427 -1575 -1087 376 1423 1199 -213 -1637 -1267 -180 1508
1654 1508 1385 -37 -1325 -1298 -133 1467 1451 135 -1258 -1572 -334 972 1690 268 -1131 -1553 -486
1671 -486 1063 1695 568 -927 -1385 -414 948 1501 828 -621 -1521 -821 804 1417 1093 -527 -1541
1688 -1541 -926 735 1399 781 -496 -1158 -934 365 1322 1061 -219 -1223 -1143 114 1251 1116 -254
1705 -254 -1101 -1189 -40 1279 1480 -5 -1182 -1280 -165 1177 1414 133 -1155 -1360 -378 1030 1318 453
1723 453 -822 -1416 -459 818 1373 828 -553 -1459 -572 681 1454 915 -538 -1360 -625 726 1403 901
1741 901 -590 -1443 -806 588 1506 1129 -103 -1108 -983 459 1260 1037 -56 -1300 -1030 210 1311
1758 1311 1075 18 -1215 -945 -135 1054 1130 -85 -1043 -1000 -29 792 1481 503 -1198 -1273 -114 723 1199
1777 1199 955 -1014 -1376 -452 782 1033 1004 -572 -1261 -653 748 1213 654 -508 -1094 -695 274 1549
1795 1549 705 -619 -906 -877 141 1548 1110 -699 -1180 -746 97 1197 1052 -326 -1113 -754 -40 897
1813 897 977 -50 -1141 -993 -108 1072 888 180 -675 -1381 -412 1320 1013 -164 -315 -929 -770 892
1831 892 1174 61 -496 -902 -711 382 1207 301 -386 -902 -456 360 1080 783 -479 -1135 -717 462 962
1850 962 806 -146 -1449 -781 525 766 612 427 -922 -1257 387 1022 946 181 -1070 -1108 -45 832 817
1869 817 -41 -751 -894 -133 417 1087 258 -1063 -943 -193 427 1209 528 -864 -874 -414 394 710 622 -643
1889 -643 -1156 -386 376 795 526 -330 -926 -793 292 1017 572 -216 -964 -725 139 838 676 -281 -947 -735
1909 -735 126 783 755 37 -889 -800 -131 833 866 275 -764 -837 -248 710 818 283 -826 -868 -476 588 799
1930 799 227 -746 -988 -409 593 1010 303 -428 -906 -478 601 1085 490 -469 -1013 -505 488 1175 645
1949 645 -437 -824 -471 159 768 741 -90 -783 -818 -46 632 1033 28 -752 -582 -100 624 762 1 -830
1969 -830 -958 -14 697 791 308 -928 -787 -185 549 586 315 -462 -836 -376 445 844 421 -336 -1210 -331
1989 -331 495 722 404 -452 -764 -732 328 991 527 -227 -560 -679 178 755 702 -210 -668 -704 145 976 615
2010 615 98 -1032 -581 137 692 725 -42 -793 -787 -224 711 804 206 -647 -864 -286 466 939 295 -513 -696
2031 -696 -284 594 644 678 -387 -753 -571 429 793 403 -271 -941 -534 116 808 550 -85 -816 -724 240
2051 240 818 669 -131 -808 -783 -250 913 677 -154 -735 -630 -33 525 629 166 -529 -695 -197 584 865
2071 865 167 -606 -784 -212 455 729 317 -298 -789 -174 614 846 435 -386 -895 -504 516 788 374 15
2091 15 -649 -482 217 637 695 -239 -889 -578 8 624 506 -263 -676 -700 132 765 664 -165 -661 -824 -33
2112 -33 436 755 -73 -591 -831 -251 711 885 -1 -420 -927 -389 452 893 399 -415 -873 -288 218 784
2132 784 491 -273 -800 -578 338 666 447 -252 -619 -445 251 782 741 -389 -528 -414 12 895 665 -58
2152 -58 -606 -728 97 858 643 15 -637 -741 2 709 779 26 -560 -779 -154 415 586 41 -352 -621 -182
2173 -182 522 1070 173 -617 -568 -342 555 782 528 -399 -640 -420 454 611 548 -352 -740 -658 370 792 331
2194 331 -183 -870 -552 194 958 636 -112 -730 -611 32 823 665 73 -559 -646 -152 570 490 208 -491 -789
2215 -789 -92 349 704 74 -428 -909 -283 417 636 258 -494 -573 -165 478 746 365 -390 -801 -360 31
2235 31 922 389 -94 -657 -530 132 722 727 -459 -637 -589 99 621 624 -342 -707 -404 -59 585 664 2 -903
2257 -903 -780 13 629 697 184 -654 -924 -120 601 547 301 -516 -567 -356 536 951 51 -346 -736 -331 358
2278 358 692 438 -464 -284 -595 286 784 590 -307 -717 -272 285 602 565 -9 -695 -570 130 399 643
2298 643 18 -626 -1009 -112 679 617 77 -645 -788 -260 947 488 -141 -701 -488 -101 398 618 -1 -643
2318 -643 -470 -49 580 767 196 -276 -728 -269 484 573 508 -359 -714 -455 299 858 494 -109 -672 -589 20
2339 20 643 390 -29 -544 -274 126 555 396 -236 -545 -569 -48 428 589 -120 -508 -693 126 446 308 -42
2360 -42 -535 -728 -122 804 556 285 -596 -576 -238 349 650 219 -311 -428 -289 375 943 443 -414 -835 -245
2381 -245 243 675 48 -517 -508 -223 162 601 395 -315 -636 -517 304 565 265 -14 -513 -614 -13 674 474
2402 474 47 -546 -435 61 525 629 86 -636 -630 117 295 701 51 -540 -471 -281 234 657 240 -397 -744
2423 -744 -163 536 573 34 -113 -675 -185 344 650 396 -201 -439 -183 205 776 441 -148 -483 -453 219 538
2444 538 440 -219 -617 -705 33 657 778 -121 -361 -342 244 539 584 103 -411 -567 244 491 652 190 -375
2465 -375 -491 -2 190 700 285 -463 -360 -22 411 764 137 -225 -371 -309 538 442 256 -350 -420 -428 230 707
2487 707 308 -191 -677 -549 84 419 396 68 -518 -638 282 571 612 -359 -436 -522 -52 482 510 -73 -540 -557
2509 -557 -220 447 428 62 -396 -488 64 580 625 -77 -294 -445 67 183 457 321 -646 -539 -240 497 614
2530 614 271 -202 -664 -326 326 810 275 -15 -583 -499 162 348 451 -25 -436 -508 102 703 545 35 -442
2551 -442 -505 -44 393 622 -52 -495 -493 -38 411 192 -194 -401 -547 -149 483 465 175 -301 -516 143 653
2572 653 625 195 -541 -572 -114 446 650 97 -297 -560 -220 150 619 373 -148 -346 -396 136 417 314 -226
2593 -226 -311 -343 223 388 286 -248 -322 -222 88 244 464 -70 -632 -412 260 337 462 175 -351 -501 102
2614 102 400 544 -54 -373 -300 -62 236 395 535 -397 -622 -119 447 418 323 -452 -554 -256 151 578 137
2635 137 -302 -499 -252 259 437 370 -321 -493 -236 265 347 196 -240 -502 -378 -180 229 203 86 -284 -637
2656 -637 47 113 427 -65 -330 -301 -76 427 258 233 -428 -518 -54 405 432 179 -250 -326 -47 411 679 280
2678 280 -297 -327 -173 153 466 -127 -393 -425 -180 467 606 289 -187 -387 -300 213 464 321 25 -313 -178
2699 -178 296 312 343 -33 -635 -253 -134 587 239 5 -290 -369 -238 414 373 -115 -324 -374 -147 306 523 243
2721 243 -145 -344 105 347 629 169 -246 -336 -144 82 288 434 -104 -411 -220 265 221 478 -44 -626 -178
2742 -178 242 524 161 3 -246 -436 83 479 199 -93 -336 -510 -38 210 435 -44 -325 -430 -162 332
2762 332 358 -57 -349 -204 -34 250 362 107 -242 -380 -193 260 338 -114 -382 -330 51 230 259 146 71 -302
2784 -302 -459 150 148 146 -49 -421 -205 -77 305 162 -121 -596 -182 -13 302 206 -114 -407 -72 193 187 467
2806 467 12 -216 -167 -11 221 360 -7 -340 -395 -240 406 192 106 -200 -335 -148 358 275 40 -165 -273
2827 -273 116 255 314 91 -175 -320 -94 144 436 -72 -131 -462 -98 190 266 211 -221 -217 -238 95 148 145 -188
2850 -188 -274 -255 301 112 259 -28 -163 43 -16 324 217 126 -309 -174 76 201 79 80 -255 -207 24 422
2872 422 625 10 -114 -205 -199 14 135 -80 -425 -292 -111 233 422 117 -258 -229 -240 -117 169 123 -66 -300
2894 -300 -46 -39 297 69 -152 -200 37 -35 281 218 -291 -44 -180 146 216 187 -61 -335 3 161 428 313
2916 313 59 -209 -344 16 289 247 105 -96 -73 -447 190 218 121 -305 -473 -73 76 297 104 -484 -458 -225
2938 -225 79 410 89 -50 -225 -309 -43 535 166 -81 -101 -316 296 247 211 -221 -467 -265 119 269 282 -82
2960 -82 -187 -188 198 179 183 66 -346 -271 -133 199 387 -39 -44 -243 19 28 269 131 8 -304 -233 235 170 261 -105
2985 -105 -300 -178 142 336 314 -110 -172 -301 106 420 19 -66 -215 -177 28 221 298 -162 -310 2 -24 225
3007 225 307 -177 -341 -111 -78 193 8 -89 -221 -220 -258 100 223 -22 -162 -86 -66 -18 189 9 -221 25 3
3030 3 83 365 195 -58 -181 -194 277 148 -121 8 -218 -204 127 395 112 -173 -183 -152 -49 24 9 -170 -222
3053 -222 -9 121 99 -166 136 -168 -219 210 328 153 70 -131 -314 -106 364 74 -52 -177 -281 -74 171
3074 171 328 -119 -203 -3 73 147 203 152 -238 -231 -26 100 224 22 -294 0 -43 -162 176 72 -114 -322 -258
3097 -258 271 113 -6 -177 -70 -182 204 205 148 90 -338 -117 54 162 142 -47 126 -74 129 181 9 -33
3119 -33 -218 -319 -66 85 32 97 -298 -224 -117 134 33 62 -332 -156 -248 159 27 35 -175 -200 -318 261 270 -107
3143 -107 -254 -141 -314 -151 159 77 84 -229 -149 38 182 130 -41 -181 -300 -21 223 74 -57 -79 -82 94 -21
3166 -21 239 -71 -72 -112 54 93 56 19 -231 -219 81 219 166 6 -222 -191 -3 -73 141 -90 -352 -145 -161 114
3190 114 46 198 118 -234 -299 -87 59 197 -123 -115 -8 30 145 218 125 -433 -306 84 396 -26 -14 -80 -49 96
3214 96 157 -15 -74 -230 -113 -132 -20 100 139 5 -213 55 97 -62 238 -165 -234 75 -131 71 100 -45 -98
3237 -98 -80 110 106 76 -264 -167 8 145 -38 32 18 -55 -48 57 493 159 -102 72 -329 -23 290 105 144 -248
3261 -248 -142 160 117 -82 -112 -66 -69 82 147 81 -134 -381 -57 -67 9 -7 74 -188 -222 -77 -7 71 134 -205 -171
3286 -171 50 -27 101 199 -73 -186 -38 73 248 -96 147 -141 -79 85 102 25 176 -34 -142 185 244 37
3308 37 41 -199 28 -2 15 18 91 -159 -155 269 281 -36 -6 -140 69 -94 95 164 238 -52 -142 -1 239 299 -76
3333 -76 0 -201 -66 98 189 -19 -118 -72 -18 164 295 185 -79 61 123 -65 -9 222 -101 -249 -114 108 239
3356 239 220 -11 -59 109 191 283 183 27 -35 -82 -37 110 293 12 -337 -109 -23 -95 77 77 140 -28 32 102 53
3381 53 79 155 -13 -21 154 198 161 76 28 182 115 135 82 -37 -305 186 -35 139 -176 -253 110 -82 155 342
3405 342 248 -145 -257 -308 114 109 -83 -231 38 8 -32 151 94 -98 -245 147 -47 131 121 32 -76 35 -26
3428 -26 44 168 -201 -89 22 -59 202 144 -195 45 -184 -76 -30 88 -58 -209 -99 -113 67 317 -14 131
3450 131 15 -14 170 -64 -39 -5 -166 -139 15 32 257 -60 -174 -174 -112 353 -39 211 116 -84 -92 322 14 122
3474 122 -226 -69 -33 25 129 158 -91 -167 127 144 116 42 -177 -190 -44 138 243 5 126 -78 -126 -83 273
3497 273 -114 -179 -153 -146 -73 184 -23 -305 -59 199 -121 12 53 -202 -216 -17 76 -34 9 -64 46 -56 -211
3520 -211 76 53 -148 -106 -70 -143 -23 117 254 2 153 -154 -130 118 -79 -76 -29 -164 -76 -50 55 -42 25 73
3544 73 146 62 76 -139 -140 -23 27 -32 82 -38 -315 -50 201 8 85 -228 -89 345 -134 -11 -176 -28 70
3567 70 -99 -119 142 320 -120 -31 250 -76 22 -160 -123 -13 -146 139 159 249 18 107 73 185 119 -25 62 -124
3591 -124 15 9 162 221 -82 -31 -100 -81 -77 297 -124 58 -83 48 86 -27 201 144 -33 -243 -89 -45 16 -82
3615 -82 -57 -198 -122 138 -140 3 -255 80 69 82 218 59 -102 -57 -39 -60 144 -137 -173 80 30 123 301 -15
3639 -15 -245 85 -195 48 155 -56 9 -64 204 -56 119 -18 58 11 15 15 186 12 -69 -89 46 59 89 103 -99
3664 -99 -92 283 47 -20 61 138 -178 -85 -45 89 214 102 32 -3 75 -16 -156 156 -154 -126 -54 93 346 -190 -293
3689 -293 18 -74 146 18 28 -7 16 -147 114 -109 92 -191 70 -17 -104 61 25 -65 -108 243 56 184 -80
3712 -80 100 -80 -108 103 336 -2 -189 76 -91 -83 -218 45 50 -150 -16 -60 289 -39 -147 2 108 127 147
3735 147 25 157 -48 68 45 228 71 -13 69 -199 105 12 -136 97 -29 -195 113 -91 54 38 -161 61
3757 61 -63 -51 87 104 -41 -93 -52 111 99 -2 -104 98 -248 242 196 70 71 18 11 248 -48 -6 -90 -10 -114
3782 -114 -252 76 143 -70 -92 -103 147 205 -254 3 -144 85 -190 -5 239 -37 12 137 94 -80 -73 -145 -159
3805 -159 -109 32 115 -134 -109 11 -52 -231 -2 7 -38 82 -105 -9 -103 73 112 -49 -157 -54 41 61 -137 119
3829 119 -24 -156 106 29 -23 -213 -53 -210 227 -56 166 131 45 138 -151 112 28 -194 -132 86 -97 -202
3851 -202 161 -75 -89 -121 11 62 -38 119 -52 -290 17 278 50 -52 -3 -129 -145 -72 -33 211 -297 -59
3873 -59 139 -18 -168 -115 180 22 83 -63 6 74 12 57 28 -49 237 41 -129 -153 -236 228 171 92 7 91 38
3898 38 4 370 -36 127 76 52 184 101 14 -146 88 -114 -166 70 25 104 -171 61 182 171 -16 116 96 104
3922 104 7 209 1 -25 -248 -188 -68 -58 74 122 -18 -51 2 197 -99 38 157 144 -147 124 96 -52 52
3945 52 181 -87 46 155 -66 -58 53 177 -168 44 74 82 33 48 41 -78 84 42 125 -135 68 75 171 85 11 -19
3971 -19 -7 63 91 28 -216 132 101 -71 -23 -145 203 -102 -217 -58 -16 455 -54 49 -105 -47 -119 -138 -261 -108
3995 -108 -57 -175 -84 -34 -161 194 -221 129 -69 198 62 -29 44 121 -214 -17 27 32 243 -110 78 352 -40
4018 -40 -128 -85 -41 -25 -72 -215 -70 -18 -189 271 125 146 13 54 320 166 182 -72 1 -124 -173 55 14 99 -136
4043 -136 -198 -219 15 -166 165 -92 39 -65 87 5 15 159 -85 12 64 238 -165 177 111 322 95 225
4065 225 182 -81 -112 87 73 -19 -21 -100 92 52 57 -136 0 -358 48 41 -73 94 234 -246 -199 -92 82 63 -69
4090 -69 145 71 -67 57 -6 -16 206 35 -160 -173 -306 31 42 -189 48 174 73 328 82 11 -55 38 -43
4113 -43 -47 -190 -84 -70 -30 -38 -193 116 58 -23 266 -74 85 168 -23 -34 -183 -84 145 -138 24 52 -174 -100 36
4138 36 19 20 -154 -97 6 66 214 17 -44 -55 39 67 26 -55 -111 23 60 207 17 -212 -26 -51 -59 18 -208 -133
4164 -133 41 -114 -251 170 4 87 105 -8 -46 120 -142 17 3 66 -44 -41 -74 -18 -15 -34 -78 126 263 -78
4188 -78 330 -229 -186 14 83 -18 21 -347 -71 8 24 45 -18 32 270 121 -14 143 -161 64 -170 29 0
4211 0 -18 150 168 53 89 -139 161 2 -229 -202 -70 -134 -206 126 44 -88 -43 159 -5 -183 -71 -209 49
4234 49 90 190 111 88 -81 47 -173 30 23 74 133 -304 -39 -52 -121 -105 22 -106 -146 -53 27 107 0 -205 -103
4259 -103 -47 62 245 238 72 22 -14 -128 134 -76 -358 17 137 -135 -13 -56 192 -49 -27 70 187 87 101
4282 101 -108 -67 66 200 -6 50 13 -50 -17 -203 120 76 -166 250 92 200 -13 -28 -48 -70 103 79 -63
4305 -63 88 -39 228 104 24 46 -38 -26 -67 171 -74 -54 -34 -25 136 -181 -96 111 -48 -9 -57 -90 31 -76 -98
4330 -98 72 -107 95 31 147 -148 77 90 -85 13 30 -113 5 -226 57 41 182 19 -83 29 18 -31 101
4353 101 -60 47 -34 -210 -19 -111 -112 -353 -177 -243 51 -163 28 -145 -67 4 -24 303 -124 -156 -113 64 108 -40
4377 -40 90 52 69 -88 183 165 -23 -15 -205 -95 -40 64 53 -112 -68 -187 1 251 -291 -21 74 -115 -45 83
4401 83 -81 -261 -289 -76 106 -153 224 26 71 -57 99 -54 -245 -59 -15 50 -120 -3 192 -3 -70 98
4423 98 -240 87 -97 -153 22 88 49 -78 142 -94 109 -134 18 -81 67 87 188 -145 95 -202 230 70
4445 70 -119 72 -187 -68 -153 52 1 190 97 47 -46 -12 -114 108 120 54 -36 -16 -233 109 192 -156 220 99
4469 99 98 -71 -185 -62 -136 -206 -202 -71 -2 4 -10 59 50 -119 90 -29 7 26 -52 -64 -3 28 61 -55 -14 170 -101
4496 -101 195 164 40 -195 -89 -128 -195 52 229 -37 74 -4 167 66 0 -35 141 -72 21 -44 22 -58 117
4519 117 196 -93 -85 -94 264 44 -21 -37 -65 37 100 257 -28 -63 -8 37 -151 -34 -26 -394 125 2 1 0 -30 227
4545 227 -25 218 -41 -14 151 136 30 -127 133 71 -20 31 -7 148 -53 -124 100 17 -130 -63 41 -12 81 60
4569 60 -237 95 -97 27 -178 -9 62 -69 -79 174 35 -134 85 -44 267 204 122 61 -11 11 5 10 54 -40 -186
4594 -186 -162 87 98 -80 97 -3 -119 -46 -231 -29 -31 105 -15 121 143 -131 -17 90 23 28 -123 -5 -66
4617 -66 -123 27 -122 -11 94 -157 15 43 184 -13 -102 61 219 -15 -17 144 -121 93 -182 -2 -252 113
4639 113 95 82 115 -21 -74 63 62 -103 -153 98 -31 166 103 103 19 -92 191 -11 153 112 -121 99 222 -22
4663 -22 102 111 93 -155 70 77 -206 -69 -143 62 35 208 -32 35 39 -98 -142 -21 173 -10 -107 22 44 50 293
4688 293 8 130 26 115 -231 40 -172 -147 22 200 10 -42 -94 -219 -48 -52 -132 -48 129 31 112 -91 228
4711 228 221 40 107 33 -274 5 274 -95 129 110 111 -123 -182 -153 -4 -8 110 56 -186 -60 121 105 58 12 -49
4736 -49 20 132 -240 -42 -127 181 -2 -49 100 54 3 -131 -196 148 -80 -6 0 -121 -30 -232 -280 147 67 158 100
4761 100 353 186 77 -100 245 4 -4 290 18 129 85 14 109 123 -3 -1 -36 30 -15 95 135 -294 -310 161
4785 161 24 72 27 -6 -53 -67 -209 245 112 -164 -81 78 -23 290 29 -14 -6 -13 -53 120 97 202 54 107 64
4810 64 188 -188 217 -103 -382 90 41 -225 159 -2 -115 -2 20 191 77 -39 3 89 -178 103 45 -16
4832 -16 -125 87 -4 251 18 198 187 -242 225 66 97 -30 -151 -59 -143 21 -89 -256 126 146 130 46 -125
4855 -125 -169 275 -196 -101 140 -100 -62 104 104 287 156 53 -95 31 178 129 143 167 -32 -136 -105 -87 -33 -16
4879 -16 -179 219 -184 15 66 51 -112 -41 -159 3 27 -60 -235 157 136 -46 176 -23 -1 69 -101 -61 66
4902 66 -18 169 -87 -52 38 -13 -109 57 -6 -199 -123 21 -148 88 -31 -34 100 258 211 -133 -134 -97 201 95 186
4927 186 242 229 -226 69 -133 30 -44 245 226 215 13 181 16 -18 -12 -138 108 -54 -91 -39 24 -32 -76 -44 -230
4952 -230 -97 -41 -175 87 -72 -62 3 -14 33 43 -36 100 -37 -51 237 -179 84 88 296 5 116 43 53 -158
4976 -158 41 -85 25 -16 -48 68 -79 53 -126 -2 -237 -121 -63 119 66 -128 140 -41 29 -137 -129 12
4998 12 -55 23 106 154 -75 27 -115 -24 77 142 -67 67 36 259 -63 -192 21 -159 194 23 -285 -66 -83
5021 -83 176 -39 -21 5 -117 -26 -202 -292 -27 -197 2 42 -102 89 5 105 -64 -23 -66 76 132 -160 95
5044 95 209 -23 229 75 -65 151 82 87 19 18 -122 53 -96 6 22 136 -62 -424 -18 105 148 123 -25
5067 -25 -68 105 110 -103 -103 -137 262 176 -73 -70 114 110 15 60 200 14 -106 -259 152 18 155 -90 -217 12 -1
5092 -1 122 -55 223 -6 -23 109 -123 81 113 -23 148 -41 140 -182 143 113 -57 118 -10 -73 87 -97
5114 -97 209 -32 -138 -11 193 -274 -17 -242 -242 -167 100 -132 -133 -146 -104 141 -8 117 -48 40 16 -99 47
5137 47 -224 43 46 25 54 -32 26 -266 47 -9 291 153 13 -57 51 -95 146 -202 -209 -98 123 -34 -33 77
5161 77 19 -90 -100 -31 -1 109 45 -139 -110 -289 -175 -74 112 -76 -151 14 19 35 98 -46 -257 258 -177 -168 -12
5186 -12 184 14 -51 23 32 -26 86 -18 -204 59 88 -100 131 -140 -260 -115 52 -16 -118 111 -313 122 -20
5209 -20 -256 264 112 156 -140 -187 -109 98 -27 -185 -99 134 -1 255 -24 5 69 67 -52 63 87 -35 18 -16
5233 -16 162 -155 -24 -43 14 130 95 270 186 91 81 -228 -143 -136 -9 -9 -122 -113 94 40 79 151 -146 49 178 -37
5259 -37 -198 15 -212 -88 57 -95 24 -77 -84 49 135 -31 -77 -3 -38 -30 -97 141 -213 -277 -274 -108 26 -107
5283 -107 63 -21 68 55 137 -57 -201 -121 -106 -170 160 221 102 -127 -100 36 121 -42 -203 64 1 -39 60 -62
5307 -62 75 200 -159 -62 -21 -208 -9 -45 107 189 -96 -82 15 293 82 -290 93 107 -20 -155 39 -179 -92
5330 -92 -130 273 150 128 81 -49 7 75 111 -41 -167 82 -136 -86 -100 -162 -11 -49 -88 -84 78 129 246 -144 10
5355 10 -29 50 75 109 184 -51 -10 45 24 0 -63 40 5 -155 -104 328 206 -79 121 -55 131 202 26 -128 25
5380 25 -30 242 -235 32 191 -118 -13 -86 -99 -57 -54 1 -288 -192 41 2 52 -93 59 178 160 142 -67 22 79
5405 79 -446 50 -78 38 -7 9 -9 -57 67 3 -65 246 -41 97 28 -84 147 -87 -163 -70 -18 20 -44 122
5429 122 109 -244 -23 -33 -127 -60 -171 22 165 174 106 -25 -157 153 144 20 -58 23 40 -161 10 57 -63 -79 -101
5454 -101 -123 203 41 -28 92 -81 185 -88 -132 124 -55 84 64 -67 12 -18 -42 -138 18 -11 39 111 -79 26
5478 26 68 92 -147 -59 41 128 149 42 -59 232 -53 -202 -39 76 13 267 101 -92 -39 -101 59 5 64 34
5502 34 -237 -211 16 240 -109 -86 89 125 -80 -62 28 -28 49 -373 -227 -136 -107 -72 65 142 -144 -70 -2 -28 -4
5527 -4 -19 -128 56 -42 253 47 -255 -49 -158 149 -186 -47 159 36 -41 -35 -50 -12 172 -17 79 -63 106
5550 106 207 35 -31 70 253 93 191 -1 -64 -3 -187 -16 112 -53 -299 12 -205 159 -5 37 -141 161
5572 161 110 231 168 -43 32 -18 189 84 168 -88 18 128 -81 -46 209 149 67 -136 -72 8 29 -95 18 -55
5596 -55 46 -152 -24 -74 98 -166 156 -114 155 261 224 116 93 264 -80 8 -112 -268 -40 102 -21 -63
5618 -63 -27 -152 -159 -215 334 25 -192 -46 76 -132 -42 169 120 141 81 63 166 -36 -58 -103 -105 33 -180 -85 -147
5643 -147 49 76 -70 -227 35 104 -137 101 -171 60 181 258 -57 -116 11 137 265 94 47 98 -285 119
5665 119 47 63 264 -83 178 67 15 110 -27 181 130 -218 -107 -19 155 22 98 240 152 49 17 101 -148
5688 -148 12 257 -18 -5 -52 143 185 21 76 211 -37 15 -97 -286 292 -98 -78 -165 269 179 129 -111 44
5711 44 35 63 156 -47 -130 -42 184 -295 -177 91 -201 36 56 30 -250 423 139 -70 56 7 165 5 -122
5734 -122 5 -110 -189 58 -270 203 65 139 -155 77 295 -128 67 -162 372 -118 39 -155 -100 136 349
5755 349 66 -83 -39 -52 -66 -90 17 -97 183 -25 -24 231 24 -92 65 -91 -76 61 -6 -59 -117 132 94 -42
5779 -42 70 34 -127 58 -40 231 -132 -117 -83 -18 -148 -136 179 -15 -71 32 196 -287 82 165 -35 75 168
5802 168 101 -27 76 13 69 31 -129 -181 -172 3 15 169 26 160 -105 40 -56 60 153 14 153 106 -91 -83
5826 -83 -40 -29 160 -48 -95 139 -155 26 71 98 -127 25 134 -25 -126 25 157 150 265 -34 9 61 154 -20
5850 -20 323 -79 242 -64 21 -134 -120 17 -119 71 -69 150 57 -205 100 -7 -58 107 27 -22 125 -88
5872 -88 -18 -57 -52 9 58 -103 46 -38 -4 92 85 60 -11 -107 198 123 -157 57 -137 41 -30 -135 -82 -185 83 223
5898 223 -164 19 -242 200 22 -237 166 -57 31 99 -64 -150 38 -55 -80 235 -51 224 157 46 -39 -210
5920 -210 -65 -95 254 -103 140 96 71 -40 -239 -318 34 3 -218 23 41 90 -82 -130 36 -30 1 -260 -37
5943 -37 17 -190 155 91 249 226 -221 -41 330 239 -75 149 5 -13 -51 -30 220 -161 -117 -107 -58 -99 108 127
5967 127 -134 33 -158 53 192 -128 89 -224 -240 -70 149 73 14 31 -126 -81 124 -138 -126 104 -80 89
5989 89 166 21 -170 101 144 90 18 18 70 -127 27 42 9 -10 -52 24 -114 -30 207 -61 -31 -96 27 -72 -116 225
6015 225 -22 31 -64 -170 211 168 -130 -16 53 -70 -45 -213 82 78 29 -45 -164 164 35 97 -234 -68 33
6038 33 -87 -97 100 90 184 -84 48 117 -108 -51 0 -75 7 -96 -43 33 -17 -98 117 62 42 94 -113 -145 -112 -11
6064 -11 -141 186 50 49 -120 -20 -141 -98 -144 -64 -144 -25 90 -36 189 -176 117 15 -101 122 -38 101
6086 101 -79 146 -8 255 118 -157 -36 245 -99 -150 -12 -143 -30 -16 94 21 1 18 81 -111 123 -80
6108 -80 49 32 71 118 142 118 78 9 -163 -13 199 -92 -125 108 27 -100 98 193 -84 217 -6 208 -223 164
6132 164 71 150 65 -47 -90 147 126 -187 -71 -201 131 40 42 -165 166 -79 -117 72 -70 -66 -256 81 13 -85
6156 -85 87 -48 88 -55 35 40 -140 -22 -115 -410 150 -80 32 -121 -166 134 -4 -234 -134 -4 170 -82
6178 -82 -40 -2 144 -64 -33 45 166 36 -130 71 11 -196 75 -331 237 29 -105 -31 37 -94 261 17 -58
6201 -58 282 -84 -8 108 121 -157 -19 -113 201 -66 -70 -112 -26 -147 110 -175 9 -84 -32 5 39 38 -238 -164 -214
6226 -214 -144 -29 48 -161 51 -109 36 49 78 86 99 -211 -180 -106 -75 -133 -76 -370 39 69 -4 49 -192 -12 54
6251 54 79 -97 124 22 -163 -61 4 -275 98 -211 75 37 22 -33 90 -135 63 24 71 -71 -176 73 -387
6274 -387 309 -127 15 108 139 97 -243 -85 80 56 2 102 9 -32 40 -116 277 51 -261 123 119 83 -35 -121
6298 -121 23 -245 4 226 -34 -90 151 41 233 -121 27 179 132 -87 -153 -158 31 -61 50 318 -39 222
6320 222 -110 4 -119 -318 -23 -47 102 147 28 91 -20 402 88 -289 -161 -78 -169 49 -19 -102 42 -22 -72
6343 -72 34 10 76 -138 14 213 -27 -71 -109 -101 221 62 42 -196 171 -133 -254 -21 87 -43 -88 -116 47
6366 47 60 65 -32 235 180 -121 -146 -131 -236 -163 151 -32 104 -61 -189 16 -86 -67 162 -130 202 112 66 42
6390 42 25 -62 129 -119 63 114 -123 5 -91 -6 -15 134 -57 139 89 269 42 196 113 73 253 -140 -117 58
6414 58 -210 -116 -44 8 -127 22 -38 8 -29 -113 -82 62 153 34 -86 110 91 -275 -14 -67 126 -124 -47 111
6438 111 159 -137 -52 121 33 -334 70 -21 -13 -100 -258 69 -15 -74 133 -31 -254 -176 -117 -96 116 -89 51 60 18
6463 18 27 -54 -5 -34 -177 -29 -144 -129 -129 130 38 -102 80 66 48 -162 -177 171 -103 -120 -112 -56 -237 148 1 -82
6489 -82 -68 104 -188 -33 -218 289 -190 13 -23 106 169 133 -62 -116 -32 -105 -73 -156 28 57 -6 9 110 181 19
6514 19 -124 88 10 20 57 -89 -65 -228 -215 82 226 148 -280 -19 115 -110 -97 -32 -114 219 -285 -63 -48 -124
6538 -124 137 4 -36 173 -33 -51 -100 28 132 -12 39 53 158 96 61 159 57 37 -84 70 -66 24 79 151
6562 151 -144 129 -235 -204 106 187 -93 15 88 -104 -12 131 -80 -81 -164 7 253 -23 -50 204 -75 156 -137
6585 -137 -117 -4 -234 -68 68 -173 -86 112 171 -51 2 66 -23 -13 -210 -69 -40 28 50 -82 -192 54 48 -272
6609 -272 -47 19 -18 274 80 -18 -3 155 -6 4 -72 -56 96 60 -103 235 11 -61 368 4 246 237 -329 213
6633 213 -126 -36 -182 48 -183 -83 47 62 -85 171 46 107 56 44 -26 -88 -6 84 55 0 99 25 12 -22 -61
6658 -61 -22 -101 -204 242 -188 198 -72 -100 -94 301 -28 -23 68 53 -74 -8 -137 48 26 -63 10 -44 -133 212 -38
6683 -38 51 19 -40 48 -120 35 11 61 -148 -165 -23 -27 148 -109 139 91 61 -76 35 -48 166 -26 -77 46 210
6708 210 -45 99 -237 51 -116 129 294 -266 17 -103 50 67 2 198 -349 -116 -192 -6 -32 -44 161 -8
6730 -8 7 -91 -82 10 144 -82 35 17 -34 6 157 182 70 105 -7 -11 174 -126 -147 19 169 -133 -30 149 -15
6755 -15 -123 -181 10 -107 -170 190 63 -84 70 154 160 12 41 190 109 143 135 -221 47 123 -202 -176 28 16 -364
6780 -364 -130 23 201 -43 -106 -204 151 -156 -167 -39 -277 226 -85 -32 -120 -224 -50 -190 -166 -41 -53 115
6802 115 51 223 78 141 36 -4 14 108 -6 -7 75 88 -53 -12 -18 43 -10 -172 -58 -34 -2 56 14 122 145 -114
6828 -114 0 72 -70 -182 -68 -157 -273 4 -251 96 -14 127 112 103 -86 78 139 88 234 37 -7 147 142
6851 142 174 147 116 120 -63 -184 35 133 -159 -152 118 -262 -283 148 26 -34 193 21 -117 -163 -121 -76 -13 125 -67
6876 -67 3 32 -196 274 263 101 -41 108 0 -88 -241 -18 -80 -23 -73 76 25 147 -13 -73 75 11 -2 150
6900 150 -20 -79 -48 36 140 -151 85 97 65 -280 -35 52 -261 36 -29 -29 18 291 -59 63 20 30 183 -145
6924 -145 -25 -77 0 -393 -5 146 146 -139 -56 76 181 91 181 83 64 -148 -120 34 -51 -103 46 -180 -100 -199 -225
6949 -225 -12 -152 3 -96 53 -122 -186 -144 -133 -31 -71 1 5 78 -169 -18 -14 -143 -102 -76 -95 65 -14 -10 -112 125
6975 125 -90 -16 148 -49 16 223 107 -28 -87 -55 -56 -130 34 -169 -100 -23 -25 -126 -158 -26 64 89 39 41 55 272
7001 272 40 9 -196 14 -28 -90 40 -84 35 -195 -287 160 -57 -70 68 -79 46 207 193 160 55 123 -116
7024 -116 -23 -75 -57 33 56 70 121 154 3 -261 204 145 -14 96 -14 -65 34 91 -20 228 -79 51 -139 -13
7048 -13 -82 19 -46 21 -134 252 14 -187 82 -219 -157 -7 -233 110 68 -164 -198 161 -51 -30 -65 150 139
7071 139 154 -160 -76 82 -161 190 39 -93 -31 -35 169 94 198 133 -76 -99 -139 149 59 -35 -19 38 73 -53 -140
7096 -140 -75 -48 -73 8 -48 -256 144 138 52 -262 109 -116 154 -72 -158 54 95 86 -23 -72 -177 40 -36 -43 -85 -10
7122 -10 -145 -159 66 173 134 -128 -260 -63 77 -16 90 7 89 27 230 -101 -9 -10 98 32 -135 153 -16 95
7146 95 -133 66 12 21 -28 114 -124 -77 -13 -125 -6 39 31 -140 -42 103 62 9 -67 25 225 110 -115 -177 291
7171 291 -22 -124 56 73 -204 -62 104 62 -40 261 64 -7 81 132 -59 -294 -26 156 -28 -229 191 -137
7193 -137 153 -34 46 -49 -26 -78 70 -280 108 -123 144 -95 -228 -162 182 151 -21 164 -113 125 -108 -51
7215 -51 -78 236 -25 111 7 231 185 58 -6 171 167 160 -167 127 -33 -38 -122 78 247 -250 186 -93 -78 334
7239 334 136 89 11 -63 230 61 -207 -108 -41 203 -159 135 132 -106 -8 -38 159 112 -8 -18 -52 -132 58 -58
7263 -58 248 182 -109 84 114 191 44 12 79 -127 -193 94 29 245 -92 98 177 -15 59 -105 -78 9 -60 74
7287 74 -49 -135 -47 76 -39 -26 36 104 104 -48 75 102 144 -130 6 89 188 -93 125 -88 -36 21 23 144 -101
7312 -101 175 225 165 -23 -152 -88 -53 -32 24 -93 -63 107 -14 -360 -138 268 175 8 71 136 20 204 13
7335 13 174 -86 -90 150 105 -102 156 256 40 68 22 151 15 51 -54 41 33 -11 92 -40 125 -45 -155 -28
7359 -28 152 -37 161 -111 39 129 -95 -164 76 4 96 291 104 -44 -86 80 -126 26 -51 -94 135 -138 48
7382 48 -174 77 13 -43 165 99 37 51 -94 -61 -17 -93 -1 52 126 224 146 32 -55 169 -94 -36 -213 182 89 -75
7408 -75 192 23 3 -65 -129 -125 -205 273 -169 -120 8 -95 -23 -40 37 -34 -11 1 -28 -114 -148 -280 -295 -32 48 284
7434 284 290 -183 -137 56 -338 12 178 -126 140 -55 -84 -296 76 52 -28 75 147 217 5 -197 35 172 -233
7457 -233 30 82 -111 -76 14 -241 75 -70 61 -38 149 -147 -165 124 39 -126 -105 -66 30 170 14 -21 -57 44
7481 44 -22 103 71 -113 26 60 39 142 -98 -118 -109 -135 -156 73 -74 216 124 8 213 77 7 120 119 -98 78
7506 78 -208 -47 -116 -86 -74 82 35 -42 119 115 194 -131 103 102 27 -9 -316 71 158 -25 -163 79 -99 81 -145
7531 -145 -18 167 113 29 5 -167 -141 -36 -49 -45 -84 47 112 2 45 27 192 23 146 170 6 34 81 154 33
7556 33 37 66 61 -14 -91 -137 -93 92 -4 1 75 -177 91 196 61 14 -165 -107 -107 130 13 -236 -83 229 142 65 98
7583 98 -127 -18 -13 177 64 -199 -315 -85 -17 175 32 -164 141 -72 192 28 90 -75 63 180 97 -120
7605 -120 -26 5 2 91 292 186 -149 -98 22 125 -208 -267 -109 -118 -261 135 -207 124 -114 -6 -27 -107 -97 96
7629 96 13 -246 56 62 -161 78 52 186 -230 50 35 -50 -126 103 -60 -92 165 64 221 -141 139 -37 -81
7652 -81 -69 -40 190 21 80 119 198 144 -85 219 -80 91 184 252 18 10 144 35 -177 -193 142 -43 -91 59
7676 59 -227 -20 -6 -30 244 -123 45 -5 -97 -50 260 159 -189 13 -71 -77 -55 246 48 74 -51 -86 56 21
7700 21 163 147 78 10 -208 145 70 114 102 -151 48 106 -4 -103 -92 17 -76 85 104 -138 197 148 -87 119
7724 119 18 72 38 -46 -83 -276 52 102 31 46 -91 -87 43 145 131 -78 68 -174 68 133 -57 134 -38 143
7748 143 212 225 66 -46 108 106 -13 -54 81 107 -36 151 -36 -98 0 50 5 -27 -243 -92 18 -28 -13 -150
7772 -150 89 212 322 27 -21 36 170 -118 -36 -11 -86 98 46 -159 -19 -225 -173 131 -34 -18 138 -175 120
7795 120 58 -55 -23 38 86 12 166 106 35 304 -56 -80 -4 -136 -107 89 29 -146 157 308 45 118 -182 40
7819 40 -39 154 94 -163 13 -72 145 72 149 -64 43 44 38 39 121 14 57 -107 -92 -53 -67 143 183 -9 14 84 -93
7846 -93 -71 -46 -215 -45 110 130 -11 85 -96 48 -71 46 18 159 98 -329 -205 22 -20 -110 -169 -27 -239
7869 -239 -182 64 174 -125 -226 189 -58 -59 -5 -19 162 4 72 -38 -146 73 28 198 130 63 -43 122 304
7892 304 162 -71 183 129 -65 3 9 57 58 -231 -123 -114 193 11 -28 111 134 -103 241 -241 112 286 57 220
7916 220 108 96 88 125 -88 114 98 -100 -61 -262 49 -67 -51 -227 234 104 -128 -13 -222 72 36 -13 -83
7939 -83 78 -31 -29 23 -42 302 -30 -37 -129 -18 86 95 103 -204 -215 41 -101 -23 157 -124 -35 -134 220 114 107 -111
7965 -111 41 72 183 61 188 -73 99 132 101 116 -262 -41 174 -147 42 218 138 -71 -124 -40 -226 -38
7987 -38 -30 -114 -164 241 -39 -176 324 160 17 18 -135 42 61 75 237 254 140 -122 -199 106 92 12 35 33 164
8012 164 7 99 30 43 27 15 -169 -167 66 -60 -46 -75 199 -3 73 159 128 -112 -36 -172 136 19 241 253 37
8037 37 -21 -14 14 -10 225 -105 2 -15 283 29 -35 125 171 52 158 -68 93 -108 78 -59 268 23 -103
8060 -103 5 -26 231 50 25 -101 -222 -38 -164 193 120 -67 -152 -80 230 -25 106 72 -144 -196 32 -153
8082 -153 128 -24 72 -183 -25 92 -188 -124 -28 -183 324 -108 94 31 51 200 205 -161 -15 129 -85 -233
8104 -233 209 142 -136 24 -71 25 -76 94 47 11 -96 -205 63 -54 108 19 -90 84 42 103 15 52 107 43
8128 43 -99 101 0 156 -215 -65 -53 139 107 292 127 177 33 221 25 55 146 143 232 -1 211 75 20
8151 20 77 164 -227 207 -4 19 52 -45 -50 -36 -89 127 52 -2 -48 13 -36 95 126 -203 76 146 180 72 -11 112
8177 112 -71 85 165 46 160 218 -42 -44 -12 -51 65 -63 -115 -5
8191e
##END NTUPLES=NMR FID
##END=
