##TITLE=1H_SR41(35)_k
 D2O,8 sc, 
 12.03.2021
##JCAMPDX= 6.0         $$ Bruker NMR JCAMP-DX V2.0
##DATA TYPE= NMR FID
##DATA CLASS= NTUPLES
##ORIGIN= UXNMR, Bruker Analytische Messtechnik GmbH
##OWNER= root
$$ XWIN-NMR		Version 3.5
$$ Fri Mar 12 13:13:48 2021 Russian Standard Time (UT+4h)  she@DPX200
##.OBSERVE FREQUENCY= 200.131506
##.OBSERVE NUCLEUS= ^1H
##.DELAY= (6, 6)
##.ACQUISITION MODE= SIMULTANEOUS
##.ACQUISITION SCHEME= undefined
##.AVERAGES= 8
##.DIGITISER RES= 18
##SPECTROMETER/DATA SYSTEM= spect
##.PULSE SEQUENCE= zg30
##.SOLVENT NAME= CDCl3
##.SHIFT REFERENCE= (INTERNAL, CDCl3, 0, 15.7039)
##AUDIT TRAIL= $$ (NUMBER, WHEN, WHO, WHERE, WHAT)
$$ ##TITLE= Audit trail, XWIN-NMR		Version 3.5
$$ ##JCAMPDX= 5.01
$$ ##ORIGIN= Bruker BioSpin GmbH
$$ ##OWNER= she
$$ F:/spectra/data/she/nmr/H-F/1/audita.txt
$$ ##AUDIT TRAIL=  $$ (NUMBER, WHEN, WHO, WHERE, WHAT)
(   1,<2021-03-12 13:12:49.23 +0400>,<she>,<DPX200>,
      <created by zg, POWCHK disabled, PULCHK disabled
       configuration hash MD5:
       00 E9 B6 7A A2 85 ED C7 34 08 36 98 17 FE 4E 26
       data hash MD5: 16K
       98 74 B7 03 6A 7D 63 4E 1B 14 67 11 20 0B D7 74>)
$$ ##END=
$$ 
$$ hash MD5
$$ 19 D8 AD 7D AE 44 2A 8E 59 FC 7A 06 3E EB 2B 5A
##$RELAX= 
##$RELAX= 
##$RELAX= 
##$RELAX= 
##$RELAX= 
##$RELAX= 
$$ Bruker specific parameters
$$ --------------------------
##$DU= <F:/spectra>
##$EXPNO= 1
##$NAME= <H-F>
##$PROCNO= 1
##$TYPE= <nmr>
##$USER= <she>
##$AMP= (0..31)
100 100 100 100 100 100 100 100 100 100 100 100 100 100 100 100 100 100 
100 100 100 100 100 100 100 100 100 100 100 100 100 100 
##$AQSEQ= 0
##$AQ_mod= 1
##$AUNM= <au_zg>
##$AUTOPOS= <>
##$BF1= 200.13
##$BF2= 200.13
##$BF3= 200.13
##$BF4= 200.13
##$BF5= 200.13
##$BF6= 200.13
##$BF7= 200.13
##$BF8= 200.13
##$BYTORDA= 1
##$CFDGTYP= 0
##$CFRGTYP= 5
##$CHEMSTR= <none>
##$CNST= (0..31)
1 1 145 1 1 1 1 1 1 1 1 1 1 1 1 1 1 1 1 1 1 1 1 1 1 1 1 1 1 1 1 1 
##$CPDPRG= <>
##$CPDPRG1= <>
##$CPDPRG2= <>
##$CPDPRG3= <>
##$CPDPRG4= <mlev>
##$CPDPRG5= <mlev>
##$CPDPRG6= <mlev>
##$CPDPRG7= <mlev>
##$CPDPRG8= <mlev>
##$CPDPRGB= <>
##$CPDPRGT= <>
##$D= (0..31)
0 1.2 0 0 0 0 0 0 0 0.06 0 0.03 0 0 0 0 0.0002 0 0 0 0 0 0 0 0 0 0 0 0 
0 0 0 
##$DATE= 1615540368
##$DBL= (0..7)
120 120 120 120 120 120 120 120 
##$DBP= (0..7)
150 150 150 150 150 150 150 150 
##$DBP07= 0
##$DBPNAM0= <>
##$DBPNAM1= <>
##$DBPNAM2= <>
##$DBPNAM3= <>
##$DBPNAM4= <>
##$DBPNAM5= <>
##$DBPNAM6= <>
##$DBPNAM7= <>
##$DBPOAL= (0..7)
0.5 0.5 0.5 0.5 0.5 0.5 0.5 0.5 
##$DBPOFFS= (0..7)
0 0 0 0 0 0 0 0 
##$DE= 6
##$DECBNUC= <off>
##$DECIM= 32
##$DECNUC= <off>
##$DECSTAT= 4
##$DIGMOD= 1
##$DIGTYP= 9
##$DL= (0..7)
0 120 120 120 120 120 120 120 
##$DP= (0..7)
150 150 150 150 150 150 150 150 
##$DP07= 0
##$DPNAME0= <>
##$DPNAME1= <>
##$DPNAME2= <>
##$DPNAME3= <>
##$DPNAME4= <>
##$DPNAME5= <>
##$DPNAME6= <>
##$DPNAME7= <>
##$DPOAL= (0..7)
0.5 0.5 0.5 0.5 0.5 0.5 0.5 0.5 
##$DPOFFS= (0..7)
0 0 0 0 0 0 0 0 
##$DQDMODE= 0
##$DR= 18
##$DS= 0
##$DSLIST= <SSSSSSSSSSSSSSS>
$$ [...]
##$SUBNAM2= <"">
##$SUBNAM3= <"">
##$SUBNAM4= <"">
##$SUBNAM5= <"">
##$SUBNAM6= <"">
##$SUBNAM7= <"">
##$SUBNAM8= <"">
##$SUBNAM9= <"">
##$SW= 16.9725357007746
##$SWIBOX= (0..15)
0 0 2 0 0 0 0 0 0 0 0 0 0 0 0 0 
##$SW_h= 3396.73913043478
##$TD= 16384
##$TD0= 1
##$TE= 0
##$TE2= 300
##$TE3= 300
##$TEG= 300
##$TL= (0..7)
0 120 120 120 120 120 120 120 
##$TP= (0..7)
150 150 150 150 150 150 150 150 
##$TP07= 0
##$TPNAME0= <>
##$TPNAME1= <>
##$TPNAME2= <>
##$TPNAME3= <>
##$TPNAME4= <>
##$TPNAME5= <>
##$TPNAME6= <>
##$TPNAME7= <>
##$TPOAL= (0..7)
0.5 0.5 0.5 0.5 0.5 0.5 0.5 0.5 
##$TPOFFS= (0..7)
0 0 0 0 0 0 0 0 
##$TUNHIN= 0
##$TUNHOUT= 0
##$TUNXOUT= 0
##$USERA1= <user>
##$USERA2= <user>
##$USERA3= <user>
##$USERA4= <user>
##$USERA5= <user>
##$V9= 5
##$VALIST= <valist>
##$VCLIST= <CCCCCCCCCCCCCCC>
##$VD= 0
##$VDLIST= <DDDDDDDDDDDDDDD>
##$VPLIST= <PPPPPPPPPPPPPPP>
##$VTLIST= <TTTTTTTTTTTTTTT>
##$WBST= 1024
##$WBSW= 4
##$XGAIN= (0..3)
0 0 0 0 
##$XL= 0
##$YL= 0
##$YMAX_a= 72495
##$YMIN_a= -52016
##$ZGOPTNS= <>
##$ZL1= 120
##$ZL2= 120
##$ZL3= 120
##$ZL4= 120
##$ABSF1= 10
##$ABSF2= 0
##$ABSG= 5
##$ABSL= 3
##$ALPHA= 0
##$AQORDER= 0
##$ASSFAC= 0
##$ASSFACI= 0
##$ASSFACX= 0
##$ASSWID= 0
##$AUNMP= <proc_1d>
##$AZFE= 0.1
##$AZFW= 0.1
##$BCFW= 1
##$BC_mod= 2
##$BYTORDP= 1
##$COROFFS= 0
##$CY= 11.3945322036743
##$DATMOD= 1
##$DC= 2
##$DFILT= <>
##$DTYPP= 0
##$F1P= 15.9154993809931
##$F2P= -4.1035820241983
##$FCOR= 0.5
##$FTSIZE= 0
##$FT_mod= 4
##$GAMMA= 1
##$GB= 0.15
##$INTBC= 1
##$INTSCL= 1
##$ISEN= 128
##$LB= 0.24
##$LEV0= 0
##$LPBIN= 0
##$MAXI= 10000
##$MC2= 0
##$MEAN= 0
##$ME_mod= 0
##$MI= 1.114404
##$NCOEF= 0
##$NC_proc= 0
##$NLEV= 6
##$NOISF1= 3.799351
##$NOISF2= 2.8
##$NSP= 1
##$NTH_PI= 0
##$NZP= 0
##$OFFSET= 15.70392
##$PC= 1
##$PHC0= -11115.08
##$PHC1= 0.6009388
##$PH_mod= 1
##$PKNL= yes
##$PPARMOD= 0
##$PSCAL= 0
##$PSIGN= 0
##$REVERSE= no
##$SF= 200.130013532006
##$SI= 16384
##$SIGF1= 3
##$SIGF2= 2
##$SINO= 400
##$SIOLD= 16384
##$SREGLST= <1H.CDCl3>
##$SSB= 0
##$STSI= 0
##$STSR= 0
##$SW_p= 3612.71676300578
##$SYMM= 0
##$S_DEV= 0
##$TDeff= 0
##$TDoff= 0
##$TI= <>
##$TILT= no
##$TM1= 0
##$TM2= 0
##$TOPLEV= 0
##$USERP1= <user>
##$USERP2= <user>
##$USERP3= <user>
##$USERP4= <user>
##$USERP5= <user>
##$WDW= 1
##$XDIM= 8192
##$YMAX_p= 0
##$YMIN_p= 0
$$ End of Bruker specific parameters
$$ ---------------------------------
##NTUPLES= NMR FID
##VAR_NAME=  TIME,          FID/REAL,        FID/IMAG
##SYMBOL=    X,             R,               I
##VAR_TYPE=  INDEPENDENT,   DEPENDENT,       DEPENDENT
##VAR_FORM=  AFFN,          ASDF,            ASDF
##VAR_DIM=   8192,          8192,            8192
##UNITS=     SECONDS,       ARBITRARY UNITS, ARBITRARY UNITS
##FACTOR=    0.0002944,     1,               1
##FIRST=     0,             0,               0
##LAST=      2.4114304,     0,               0
##MIN=       0,             -52016,          0
##MAX=       2.4114304,     72495,           0
$$ Real data points
##PAGE= N=1
##DATA TABLE= (X++(R..R)), XYDATA
$$ [...]
2227g09l13Q38R68L25r71r84l62P43J134N67p65j060n08P42J121L51o04j345l48
$$ -709 -1022 -184 784 1109 138 -846 -1208 -465 669 1236 471 -589 -1097 -355 766 1117 513 -832 -1180
2246a180M26J558L08o26j331j62P41J135O38j289q77n29M73J453M92m63j300q04
$$ -1180 -754 804 1112 486 -845 -1007 -266 869 1507 218 -659 -1188 -715 738 1230 767 -533 -1337
2264a337Q70J097L87o96p25r63Q41J058Q45q10j075m41M55R42P09m71j283n08
$$ -1337 -467 630 1017 321 -404 -1367 -526 532 1377 567 -508 -949 -494 448 1157 686 -597 -1105
2282a105N22R59R18m37j592l65N48J153L95k21j275n80L51J147Q91o99r00r73
$$ -1105 -583 376 1294 857 -735 -1100 -552 601 996 775 -500 -1080 -729 418 1309 610 -290 -1263
2300a263N23Q43R75m62r15o89L88Q79P46q1r22j011K56J282O71j52j172r13L4
$$ -1263 -740 103 1078 616 -299 -988 -600 279 1025 944 22 -989 -733 549 1220 1068 -104 -1017 -983
2319i83J411Q14m26q73r14J95J055O12L2j032r12J03J020Q83K7r07j240J96R78
$$ -983 428 1242 816 -57 -971 -776 279 891 923 -109 -1021 -918 102 985 1012 105 -1135 -939 39
2338C9Q34R8r54j019J91R08R93k63p69j092k87J353J079j77j222o09O6P67J128
$$ 39 873 971 17 -1002 -811 97 1090 827 58 -1034 -1321 32 1111 934 -288 -897 -831 -64 1064
2357A064m3r60r37k23Q27J063M72r25j246l20R21J219J2p51q28o45J008J217K51
$$ 1064 1021 61 -876 -1099 -272 791 1263 338 -908 -1228 -307 912 924 173 -655 -1300 -292 925 1176
2376A176r22r28o25Q71J293M59j155q80l37O16J102O74j091j120l31N74J318N94
$$ 1176 254 -674 -1299 -428 865 1324 169 -711 -1048 -432 670 1344 253 -867 -1198 -624 694 1288
2394A288r60j075m93R22J175K6n44j002m89Q14J056K03n37j180l16N92R06R17
$$ 1288 328 -747 -1240 -318 857 883 339 -663 -1152 -338 718 921 384 -796 -1112 -520 386 1303
2412A303o76j257l28O62P72P10n21j190m65M92J140N90n59j351l24R2J277R88
$$ 1303 627 -630 -958 -296 476 1186 665 -525 -990 -498 642 1232 673 -678 -1002 -910 367 1355
2430A355r09r41o83M50J118N72k63r91r06O37O60J002m70j143o74M58R61P45k98
$$ 1355 446 -495 -1178 -728 390 962 699 -292 -1198 -561 99 1101 631 -512 -1186 -728 233 978 680
2449F80r67p02K04J129M47Mr07r86K80J138O57l23q26p51R9Q11J054j87q26j103
$$ 680 -287 -989 -785 344 791 795 -112 -1098 -818 320 977 654 -172 -923 -824 -13 1041 854 28 -1075
2469a075J31R08J095j51j117p80J6J057J084l77j008p18L08O26R30M1j267n65
$$ -1075 -944 -36 1059 908 -209 -989 -973 84 1168 791 -217 -935 -627 -1 929 970 -297 -862
2487h62o6R27J099k20r48q91k11J278J092l69q08j085Q4J192R03j79j193o87j18
$$ -862 -928 -1 1098 878 -70 -961 -1172 106 1198 829 21 -1064 -980 212 1115 936 -257 -944 -1062
2506a062O82J398J67j123r12k69J010J081k75o24q40l49R31Q46M33r27j089j58
$$ -1062 -380 1018 1185 62 -850 -1119 -109 972 697 73 -767 -1116 -185 661 1094 167 -922 -1080
2524a080O94J226J45p57r03k60O34J064N40r54j252l6P93R48L05q00r54m32P34
$$ -1080 -386 840 985 228 -675 -935 -301 763 1303 349 -903 -939 -146 802 1107 307 -647 -1079 -345
2543c45J051K29m92j177n55R82J054L94o94j130k05K92J371L72q55r56m89O11
$$ -345 706 935 443 -734 -1289 -307 747 1141 447 -683 -888 -596 775 1147 292 -664 -1153 -542
2561e42J198N44p56q77o66O95R53N61l35j304o54P47R47O08l31j148p21N15J004
$$ -542 656 1200 444 -433 -1099 -404 549 1110 775 -529 -1183 -436 511 1119 788 -360 -1081 -566 438
2580D38N07l44j122l81K12R96R11o59r52m96K00R38O69j25j213o18L19J153M41
$$ 438 945 601 -521 -902 -690 306 1217 558 -394 -890 -690 248 917 792 -421 -1039 -720 433 874
2599H74l70q04r59L54J278P84l75j022p99R5J024J182n76q50q74J40Q22J234j74
$$ 874 504 -300 -1259 -905 373 1157 782 -240 -1039 -944 80 1262 686 -164 -1038 -898 -76 1158 984
2618I84j423o56K05J015P83n5r16j173L84J065O05J78r62j024N0J120O99L5j008
$$ 984 -439 -1095 -890 125 908 853 -63 -1236 -852 213 818 996 34 -990 -940 180 879 914 -94
2637i4p63q0R80R07j15p25j142K29P69J124k42r82p11r7R15R35j10p66j057K68
$$ -94 -857 -937 43 950 835 110 -1032 -803 -34 1090 848 -134 -845 -942 -27 908 798 32 -1025 -757
2657g57N37R66K14p19r00l39Q24J478j53r41r32k91O56J136J70j002o35k75Q61
$$ -757 -220 746 960 241 -659 -998 -174 1304 1151 210 -722 -1013 -357 779 949 -53 -688 -963 -102
2676a02P87P0o05p79l26N21J129J54m23q17p32R07R67M52j016j062r1L70J326
$$ -102 685 755 150 -629 -955 -434 695 849 426 -391 -1123 -216 751 1203 187 -875 -966 -596 730
2695G30M18p26r92k89M33J091L49p24p42l96K71J059M10m17j048l94M03J185L44
$$ 730 1148 422 -570 -859 -426 665 1014 290 -452 -848 -577 482 892 475 -573 -967 -564 621 965
2714I65n37j043l82L55J306N41q94r26o97R27J221K54n02j092q64O11J152P07
$$ 965 428 -615 -997 -642 664 1205 311 -615 -1312 -385 836 1090 588 -504 -1368 -757 395 1102
2732A102k98j288n75L18J213O59o81p77p71L08J091Q39m30j144o00O36Q56P32
$$ 1102 804 -484 -1059 -741 472 1131 450 -327 -1098 -790 301 1140 710 -434 -1034 -398 458 1190
2750A190m40j038j004Q07P36P45m43r55m69J92J073O66k69r03n75k06J270N14
$$ 1190 750 -288 -1292 -485 251 996 553 -402 -871 -679 394 1060 791 -112 -687 -893 377 891
2768H91q1j079o69J35R52J062m63r90r29L91Q37P14J51j021q40J37Q99R15k83
$$ 891 810 -269 -938 -803 149 1211 748 -242 -1171 -780 57 771 922 -99 -939 -802 97 1012 729
2787G29q22r28N4J070J083k53p65j191N9R46R08q3q91p65N2Q70O91K53j072r54
$$ 729 -93 -1021 -967 103 1186 933 168 -1023 -964 -18 890 807 -84 -849 -797 73 764 1017 -55 -1009
2807a009M17M90R83J97r34j103j22J295N44N2o09q74k88Q67R64K67r78j008j95
$$ -1009 -592 -102 881 1078 144 -959 -1081 214 758 810 201 -673 -961 -94 870 1137 159 -849 -1044
2826a044P46J141K11r03q40k04N30J122K29o63j096q9M87R35O38q31r39n16Q28
$$ -1044 -298 843 1054 151 -689 -893 -363 759 988 325 -771 -860 -373 562 1200 369 -570 -1086 -258
2845b58Q19K90q25o22l30N35J209J54n54r14o07O56R49O16p62r14m02N55J102
$$ -258 561 851 26 -596 -926 -391 818 972 418 -496 -1103 -447 502 1118 356 -558 -960 -405 697
2864F97L72p01q10q08P94J099M26p52q64n18N63R33O44o66r34m03O1J350N78l85
$$ 697 1069 368 -442 -1250 -456 643 1069 317 -547 -1065 -502 431 1075 409 -525 -928 -867 483 1061 676
2884F76j143m79N97P24M57k03j068n21L78R70O62l95r58p09N57N72Q25j98r55
$$ 676 -467 -946 -349 375 832 629 -439 -960 -582 388 1050 655 -303 -1012 -455 117 942 744 -211
2903b11r54N80O27Q97k39j125o67J03J328R15l69r67q40J31Q56Q83j06j099q46
$$ -211 -1165 -585 42 939 700 -425 -1092 -989 339 1254 885 -82 -922 -791 65 948 842 -257 -1103
2922a103K16J143M59j37p58q91K05R45O83j40n73j197J58J260P32j96q36q61R4
$$ -1103 -887 256 715 578 -180 -1071 -866 79 762 622 49 -1148 -990 270 1002 806 -30 -891 -797
2941g97P47P77jq53n90K5O95R40k31q53o37k70J099P53L05j008r57M7Q78Q96m0
$$ -797 -50 727 726 -127 -717 -692 3 943 712 -141 -778 -1048 51 804 1109 101 -856 -809 69 965 925
2962I25j001p76j74P76J149k50n84p54j04N95Q36L69p05j217J00M46J081M18r36
$$ 925 -76 -852 -1026 -250 899 649 65 -689 -793 -198 638 1007 302 -915 -815 -369 712 1130 194
2981A94j219N7N75Q50O31r86q73k65O76J011M29q29q25n06Q00J056k3m50j016
$$ 194 -1025 -968 -393 457 1088 102 -771 -1036 -360 651 1080 251 -574 -1080 -280 776 753 303 -713
3000g13k52M93J192M88r82o93m97O49N73Q02n76r47o47L32J305L08m64r90m34
$$ -713 -965 -472 720 1208 226 -467 -964 -315 258 1060 484 -463 -1110 -778 527 835 371 -619 -1053
3019a053P19Q93L44m92q86m14L49R86O81o95q13m91N12R40L02k90r88m07J66R28
$$ -1053 -334 559 903 411 -475 -889 -540 446 1127 432 -381 -872 -360 580 882 592 -396 -803 -637 291
3039B91O84l49j115o53O92R10N25m51j018n43K66J060M67k38p08o45N2R33Q50
$$ 291 975 626 -489 -1142 -450 460 985 534 -484 -1027 -761 299 766 528 -180 -825 -773 160 1010
3058A010k76j306m10M86O85J015n70q37p04M34N06P33r9r72n84L7J024Q33k63
$$ 1010 734 -572 -982 -496 189 1204 634 -203 -907 -473 33 766 667 -305 -889 -852 172 1005 742
3077G42r21q20L30J074R36o23q27p14J55Q12P05J75r22r33k54J149P64K76j117
$$ 742 -179 -999 -669 405 1341 718 -109 -823 -668 144 849 1024 102 -831 -1085 64 828 1104 -13
3096a3r46J31Q49P73Q1r90q14P8P86P85J58q45r10j34Q86R07J2r69l27l33M28
$$ -13 -959 -828 21 794 875 -115 -929 -851 -65 720 878 33 -877 -1011 -125 782 794 -175 -502 -835 -407
3117d07R90L77o67p65o44J026R05K80p74j099o4P66P79L19o86r88j79M37J067
$$ -407 583 960 293 -472 -1116 -90 815 1095 321 -778 -842 -76 703 1022 336 -652 -831 -394 673
3136F73jl91q22n48R12J085Nm39j085m12Q76O15M67p62r43o9M68Q69N77q03q27
$$ 673 672 281 -541 -1089 -177 908 913 474 -611 -1023 -147 468 935 173 -770 -839 -371 498 1075 272 -555
3157e55l65O83R32Q9l43j000m50P22R61J45j24j128n59N13J076K01m34p44o14
$$ -555 -920 -237 695 784 441 -559 -1009 -287 674 819 695 -433 -992 -479 597 798 364 -380 -994
3176i94L20R57P33n39q76m66K89Q25Q76m30r41j041N99J110N50l22q94r79N40
$$ -994 -674 283 1016 477 -399 -865 -576 249 1125 695 -246 -1287 -688 422 972 650 -244 -1223 -683
3195f83R93N47k82q83o06L08R67N74m14q66n87J04R05P18m4q99o56K5J044M49
$$ -683 310 857 575 -308 -914 -606 361 935 521 -345 -932 -828 77 795 751 -148 -804 -779 265 714
3215G14J73r91q52K65Q67O78k9j065p36l4J041P19J20j028q74L92N30J101k06
$$ 714 887 -104 -956 -691 176 854 825 -240 -976 -1010 31 750 870 -158 -1032 -640 -110 991 785
3234G85p35r31K78O38R40j46q35p84k02R89P22K96r37q19k58R54P47J61o60q96
$$ 785 50 -881 -603 35 975 829 -6 -790 -992 -3 719 1015 78 -741 -999 -45 702 863 203 -693
3254f93q0N73Q10K77p30r86j0Q06N94L95r35o47q7L35Q27N84p30j131Q1P12N27
$$ -693 -773 -200 610 887 157 -829 -839 -33 561 956 21 -626 -713 -378 449 1033 303 -828 -747 -35 492
3275D92M15n35j253j44R40O75L03l89j306k99P97J154j32l87q52o36O46J239M9
$$ 492 907 372 -881 -1025 -85 590 893 504 -802 -1101 -304 850 718 331 -521 -1157 -511 728 777
3294G77l21r71n06P19Q32M09m96j123j03M93P87M53k14j266l48P47M41N31k09
$$ 777 456 -515 -1021 -302 530 939 443 -680 -783 -290 497 950 736 -530 -878 -131 310 841 632
3313F32j038m70M46P08N62l42r41m28N62P67N22k13j270k60L81P96O55n49q28
$$ 632 -406 -876 -430 278 840 498 -443 -871 -309 458 980 767 -503 -763 -382 414 1069 520 -308
3332c08o02M40Q12N21k8j053p84M15O56R69m80p78p59K84P04N29Q9o32q08K83
$$ -308 -910 -470 342 863 835 -218 -1002 -587 69 1038 558 -220 -979 -695 9 538 627 -5 -813 -530
3352e30O94O00j59o08o97J67P02M54Q5r29n68J01P59P36N4r02p93MQ29P11N5p96
$$ -530 164 764 605 -3 -700 -533 169 623 708 -221 -789 -688 71 807 861 -41 -834 -830 -1 710 765 -31
3374c1q39LP96P29J60r57o52k05J102O11l9n34o46j69N48O85p2l32p50k27P91
$$ -31 -870 -867 -71 658 818 -139 -791 -996 106 717 678 144 -502 -671 -123 562 490 158 -592 -819 -28
3395b8Q23J67q60r81r3R21O11J78m60r20k62P40Q54J6m87p54k97O46Q46J01p00
$$ -28 795 962 102 -879 -972 -51 560 738 278 -642 -904 -164 690 706 219 -535 -832 -186 660 761 61
3416F1p35j96P29Q01J38m65r07l38N82R05K20m37r84j27N54O21O41n55q88r09
$$ 61 -674 -870 -141 660 798 333 -574 -912 -330 575 795 358 -626 -753 -199 422 1063 508 -380 -1289
3436a289R55R12N00p00p04j47Q2Q02N08l90j064m56M39Q67P89n35r67m18L39R88
$$ -1289 -334 578 1078 378 -326 -473 -391 411 919 529 -535 -991 -552 315 1104 569 -398 -816 -477 511
3456E11K83m59q49k17M07O66N48n10p86l97K04R22K02q7m80o90J69O35P75k46
$$ 511 794 335 -514 -731 -324 342 890 380 -406 -803 -599 323 525 438 -42 -732 -563 72 847 601
3476F01r91l70R2P01P22j50o81o78K54Q30O28m44n01j077L68R09O10k98p22m52
$$ 601 -390 -760 -668 33 755 605 -76 -754 -500 330 958 514 13 -1064 -696 213 823 525 -197 -649
3496f49j95R42N71q2o40r83L72R41L12j3m56j009K61Q06N75j40o15q38Q6Q71M96
$$ -649 -844 98 669 587 -53 -1036 -664 277 589 576 120 -889 -628 178 753 613 -2 -840 -754 117 613
3517F13L57q14o73l4N83P25J54j093m43q8P40N34R4p03p14k26J018N95qn56o28
$$ 613 970 156 -517 -551 32 757 911 -182 -625 -713 27 561 655 -48 -762 -988 30 625 617 61 -567
3538e67R2K91O00L34p16n93j86P92M77J71o49p22J35L95Q65Q1n52n08n97N04R04
$$ -567 -475 -184 416 750 34 -559 -745 47 524 695 46 -676 -541 -146 719 800 248 -260 -857 -353 551
3559E51M15p33p63k91O01N42N11m69r02l62P89P37Q4l30q13m38O13O42M66n65
$$ 551 966 233 -530 -821 -220 322 833 364 -538 -900 -111 626 710 380 -433 -871 -258 384 850 285
3579B85q95j47L20Q63M37n85r35k51M87Q81J52k68p61n85N33Q25L61k39q59l62
$$ 285 -610 -757 -437 426 863 278 -657 -908 -421 460 612 344 -417 -1002 -469 356 717 478 -381 -743
3599g43N18O09L28k80q40k91K04J146l4j48p81m67K54Q60M50k92q28o57N19P57
$$ -743 -225 384 712 432 -408 -699 -495 651 617 469 -312 -779 -525 335 785 493 -335 -992 -473 284
3619B84N62k60o95p79L91P22L68o8p66l69j2P75L78q7k71r58L02N98N63k73l77
$$ 284 846 586 -109 -888 -497 225 593 525 -241 -610 -622 153 531 444 173 -785 -483 115 678 405 28
3640B8o55M6P88M38P1q48o53R2N56R15k93m00q25J95P37O50Q9q98n36M5N90Q35
$$ 28 -627 -581 207 645 716 -132 -785 -693 -137 778 485 85 -740 -545 192 842 931 33 -503 -458 132 967
3662I67k32n63p90p3N67M15M97q33l54m06O97N33L78p14o41j24P04N50J8l76q61
$$ 967 735 172 -618 -691 -124 291 788 -45 -399 -805 -108 425 803 89 -552 -676 28 578 596 220 -641
3683f41k2L40Q53L00m87q20j07M72K82N79n89l86l32L69P80J99p28l53l18N18
$$ -641 -663 -323 530 830 343 -477 -584 -112 170 749 160 -226 -558 -189 591 790 62 -291 -609 -91
3703i1M69K72m26o32k77M91O04L78n14p92k04M76O37L24n07q07k1L73P59J92n52
$$ -91 378 650 224 -408 -685 -194 410 788 274 -518 -722 -246 391 715 208 -599 -620 -247 512 704 152
3724A52m32j82J11N27M90l18m88l23m6P39L32r9p96n6JO15M97k68o55m58R9J094
$$ 152 -280 -462 -351 176 666 348 -140 -463 -509 230 562 463 -333 -389 -388 227 724 456 -199 -657 -558 536
3746E36Q9k12o22k81M3Q94L30k92o96l71J10Q56L08l71n62m11L61M23L40j04n68
$$ 536 625 413 -209 -490 -447 447 777 485 -211 -582 -472 384 692 321 -241 -652 -291 132 472 368 -200
3767b00n05K04R50L5M4p53l55j67P34O29J2j017k76L60N26N95l09n51o00M8M32
$$ -200 -705 -501 449 484 528 -225 -580 -747 -13 616 628 -389 -665 -305 221 816 507 -44 -644 -596 -164
3788a64P03j08n66l95L2M02O52L8n14p84KP15P72j40m59n51l33M90P21j41p7o44
$$ -164 539 431 -135 -530 -498 -96 556 594 80 -704 -702 13 785 645 186 -365 -698 -208 513 372 295 -349
3810c49j47L93M84K2m02j46o81O32N77K93p83l05k74N88L90K22k95o86m0M40M84
$$ -349 -496 -103 381 403 1 -145 -826 -194 383 676 -107 -412 -686 -98 292 514 219 -467 -507 -67 417
3831D17R2l96n47j34M49P31J30n46n63m37N09Q10K86n69n16m81M96O49Q6l76l58
$$ 417 509 113 -434 -568 -119 612 742 196 -367 -804 -295 515 801 232 -284 -765 -269 380 466 90 -268
3852b68j78R2O97K20j77q96o3N32L53K9k78m62k40K80O12L98n47m12k59K29P56
$$ -268 -446 -354 343 563 386 -510 -573 -41 312 341 63 -399 -639 -359 253 651 104 -308 -567 -338 418
3873D18K31l09l06n83K90N55K28j29m76n74M70K23M96q9o93j64J15N05L35k46
$$ 418 649 340 34 -549 -259 296 524 395 -81 -655 -185 38 534 445 -248 -412 -297 208 543 297
3893B97p28j37P1P54J67n0n03p78L31O74N21j19o16l19K27K43N43j18p04k58K43
$$ 297 -431 -568 -497 257 424 374 -129 -907 -576 98 619 500 -116 -435 -208 35 578 460 -244 -502 -259
3914b59J96P26l59k38m12j08M17O31J57r66m51L63M03M99k10m54n63L63L10N67
$$ -259 -63 663 304 66 -346 -454 -37 594 751 -215 -666 -303 100 599 389 -65 -628 -265 45 612
3934F12k77l72m41J1N87M02m9o22m85K34L38O10l1l98l19k85L62M73J86n20m83
$$ 612 335 -37 -478 -467 120 522 473 -149 -634 -400 -62 548 517 119 -200 -485 -123 350 536 16 -467
3955d67p0L82N30o1q9n22j18K04M57J28l88m26k80M29N19Q3l83l62j29M12L65
$$ -467 -537 -155 375 314 225 -297 -415 -211 246 374 -14 -440 -720 -291 228 311 -72 -434 -563 -151 214
3976B14K13n4o75k53L27L99M82m82l91l10L12M00K96j67o37j60J56O55p0q9n17
$$ 214 427 373 -302 -555 -228 171 653 171 -220 -530 -218 182 478 311 -326 -486 -330 325 255 166 -351
3997c51k67K75N97J87j76p50l4K49M25J70j59m88k27K48K63O62k05n27l00K98
$$ -351 -618 -343 254 441 265 -485 -519 -270 155 325 166 -322 -549 -301 -38 624 419 -108 -408 -110
4017a10M92r3p5k99m42n8R98K56j74o59k66J2M29M17q7k36m75m9L73L75m6l06
$$ -110 382 289 214 -85 -527 -585 413 669 495 -164 -430 -418 11 428 341 105 -370 -419 -46 329 283 -23
4039b3n86M87M48J12k58j37k08k13N91K55J07n40n41j5J60R44k60l83l17J24M42
$$ -23 -609 -122 326 438 180 43 -165 -378 213 468 575 35 -506 -521 -361 583 323 -60 -377 -253 189
4060A89J90K4n58k55j17M82L54J89n12n13J12M34M68r2k26n95J38M16J41K97m42
$$ 189 379 403 -155 -410 -527 -45 309 498 -14 -527 -415 19 487 395 169 -426 -288 128 269 566 124
4081A24n71j2K87N56J44n68k98J6J98M47jl56m79Q8M08K31O3k7n07k53M90N9J00
$$ 124 -447 -459 -172 384 528 -40 -338 -322 -124 323 322 -34 -513 -425 -17 214 277 250 -257 -510 -20 39 139
4104A39j0n43j1K73K23K11k7n59l03N00J95L33k56m75N6J06N60J34m70k46k11
$$ 139 129 -414 -425 -152 71 282 255 -304 -607 -107 88 421 165 -310 -254 -148 412 546 76 -170 -381
4125c81L09K88K30k89l36k53J51N07K34n30k32J6M5N56J88m89j97j69mM22M81
$$ -381 -72 216 446 157 -179 -432 -281 226 460 -70 -302 -286 -241 315 503 14 -183 -352 -356 66 547
4146E47l73n20J32k9J46L85j4p38j20L54N08P7k19n9n28K92J74K88j4j63k88L7
$$ 547 174 -346 -214 -243 -97 288 274 -464 -584 -230 278 355 136 77 -451 -159 15 303 289 126 -162 -125
4168a25R4M48j92m28m41L28N20N2K14n89j04l80O40k9J45j81l61J09J21M73P4
$$ -125 -31 417 225 -203 -644 -316 204 256 470 -119 -223 -603 37 8 153 -28 -389 -280 -159 314 388
4189C88l86l8r1J05L83l31k5j93j70M18K55k2m15j8q2L83K10m48K89l70j2K35
$$ 388 2 -36 -127 -22 361 30 5 -188 -358 60 315 293 -122 -140 -222 161 371 -77 212 -158 -170 65
4211F5L13k5m20j59n6L00J99L9j41l61J31Q4J86J63l84j81n7L9O46J1l31k41j28
$$ 65 378 353 -67 -226 -282 18 217 256 115 -246 -115 -31 155 318 -66 -247 -304 -265 381 392 61 -180 -308
4234c08L19L6J58j82m10kN22K62r3l74k44j64K18N91K9k29l86l0M64N0J46m79
$$ -308 11 47 205 23 -387 -389 133 395 302 -72 -316 -480 -262 329 358 129 -257 -287 177 227 373 -106
4256a06l3k96L30K53L61l44k79%q2L85kj09q5j85l3N49p6j13m96Q4R9K82K05k52
$$ -106 -139 -435 -105 148 509 165 -114 -114 -196 189 187 78 -7 -192 -225 324 248 135 -361 -277 -178 104 309 57
4280E7j32m16L41K76J78r7m75j75J63N24J43n0n53lr9O52L0n1l11l59N5M01N8
$$ 57 -75 -491 -150 126 304 207 -268 -443 -280 244 387 337 -216 -219 -318 334 364 313 2 -357 -302 99 157
4303A57r8p2l46K78OL09J91n78K77k51K41J60r4q1k58q1K38J84j16Q4n00M28j45
$$ 157 59 -13 -359 -81 -75 234 425 -153 124 -127 114 274 180 99 -159 -240 -2 182 66 150 -350 78 -67
4326f7L88Pm16j89j03M85K03J11m59j83n3K30K69J94l97m07J69M3K04J64p1m08
$$ -67 321 328 -88 -277 -380 105 308 419 -40 -223 -276 -46 223 417 20 -387 -218 -175 29 193 122 -286
4348b86qJ6O42k02j07j64q8K81L3M29j54l72l02Q3K81K50j01k51k81K71j02M12
$$ -286 -294 -278 364 162 55 -109 -197 84 117 546 392 20 -282 -199 82 332 231 -20 -301 -30 -132 280
4370B80p7m89J07n3L30J13mn83J99L1K92J54p0l90o1O6K58K64k10l17p4J7L62
$$ 280 203 -286 -179 -232 98 211 207 -376 -177 -146 146 300 230 -160 -221 -155 103 367 157 -160 -234 -217 145
4393A45l2K40k79k64k28N54K74k95j78P1k7L45j38J05l60m6J3J11J28qq3l43J77
$$ 145 113 353 74 -190 -418 136 410 115 -63 8 -19 326 188 293 -67 -113 -100 11 139 131 48 -295 -118
4416a18J98J65k09o8k18K59oR1K83n31q4J83J69K85l88K1l49K14J52K3K87m70
$$ -118 80 245 36 -32 -250 9 3 94 377 -154 -238 -55 114 399 11 32 -317 -103 49 72 359 -111
4438a11j71P3J61K2J41k0o4l48K28J47o6P9k86qQ3M04K3m30j38K51R7N9m9k24
$$ -111 -282 -209 -48 -26 115 95 31 -317 -89 58 -8 71 -215 -223 -140 264 287 -143 -281 -30 67 126 77 -147
4462a47k38J92J98K40j62j85m6j5O5L15j62Kj16J29j11Q0J47r7q0l15O9L80n5
$$ -147 -385 -193 5 245 83 -102 -148 -163 -98 217 55 57 -59 70 -41 39 186 89 9 -306 -237 143 88
4485H8j10j89J17jL84l50pj81q6L04J29J40r8j27k88J34M06q0k5n9l05j01M39
$$ 88 -22 -211 -94 -95 289 -61 -68 -249 -335 -31 98 238 140 13 -275 -141 265 185 160 101 -204 -305 134
4508A34J25r6j51l20K09J10j2K18m10j90L11J33J2p1j48m0K18k1J56j24q0J7J1
$$ 134 259 163 12 -308 -99 11 -1 217 -193 -383 -72 61 73 2 -146 -186 32 11 167 43 -37 -20 -9
4531iR7j35O08n12l97J12J43j09L39j53q6R9j41L28r2j22j64J83K5Q7J13k56q7
$$ -9 88 -47 561 49 -348 -236 -93 -202 137 -16 -102 -3 -144 184 92 -30 -194 -11 14 101 214 -42 -129
4554a29K01j27M47k63l8k67p5J75L21j31k22J1j49L78j57J80j81j6k89M32K3J18
$$ -129 72 -55 392 129 91 -176 -251 -76 245 114 -108 -97 -246 132 -25 155 -26 -42 -331 101 124 242
4576B42j18k69m6JL11j83J02r9k42K68J31Om9j97m09N61J42J91j53l06n2j03M29
$$ 242 124 -145 -191 -190 121 -62 40 -59 -301 -33 98 104 55 -142 -551 10 152 343 190 -116 -168 -271 158
4599A58k31L22m14J06J58j29L55j6j39k33l6J40J67L6k03j46LJ84j76J63l92J71
$$ 158 -73 249 -165 -59 99 -30 325 309 170 -63 -99 41 208 244 41 -105 -102 82 -94 69 -323 -152
4621a52K45j3q3K17m60J02L7rL53j80j57j14K01R6q8J06j01k72Q6P3K36J05k13
$$ -152 93 80 -3 214 -246 -144 -107 -116 237 57 -100 -214 -13 83 -5 101 0 -272 -186 -113 123 228 15
4644A5j60L18j78j64K34o7K3j49J15m1J95j6l64L7J31nK83m25r6P9L57l43O13
$$ 15 -145 173 -5 -169 65 -2 21 -128 -13 -54 141 125 -239 -202 -71 -76 207 -218 -314 -235 122 -221 392
4667C92m39m4K6J97J10j02q9j85J59l17L17m7K9k41K39j49j1L24O3k39l64L57
$$ 392 -47 -91 -65 132 242 140 51 -134 25 -292 25 -22 7 -234 5 -144 -155 169 232 -7 -371 -14
4689a4J32J85k94P6l56n1L40j76K42k24n1ON91l49J54l86lK32Q7J45l61J50o5
$$ -14 118 303 9 85 -271 -322 18 -158 84 -140 -191 -185 406 57 211 -175 -178 54 141 286 -75 75 10
4712A0L5j88J71J02j37k62K17P6l3Rk4l47J85L14p5l81J40J56q1K68j00J23j60
$$ 10 45 -143 28 130 -7 -269 -52 24 -9 0 -24 -371 -186 128 53 -328 -188 -32 -113 155 55 178 18
4735A8k16l9J71K05JK4k50j48J55K46J27j09k66l5J08K35k5n4m15P6r6L91k6j05
$$ 18 -198 -237 -66 139 140 164 -86 -234 -79 167 294 185 -81 -116 -8 227 202 148 -267 -191 -287 104 78 -27
4759b7q8J04J5J5J76k45R6j39N2J73K82m31k96J24J56j16L40j58j82m6J91K23
$$ -27 -115 -11 4 19 195 -50 46 -93 -41 132 414 -17 -313 -189 -33 -149 191 33 -149 -195 -4 219
4781B19M0l15q9j69L90K6J10k9p0k90K82L7l1M3n2k90PK00R4J52k66k03J77J59
$$ 219 259 -56 -145 -314 76 102 212 183 113 -177 105 142 111 154 102 -188 -181 19 113 265 -1 -204 -27 132
4805A32l3p6j43J54k0L9K9J8k04k0o2k9M17j09k12p9M3K34K43j92j81k30M79k66
$$ 132 99 23 -120 34 14 53 82 100 -104 -124 -186 -215 202 93 -119 -198 -155 79 322 130 -51 -281 198 -68
4829f8J90J26j12l23K41j01Q8L1j90N5j55J08K62R8m43J05m7J29rR5k74N0LJ51
$$ -68 122 248 136 -187 54 -47 41 72 -118 -63 -218 -110 152 250 -193 -88 -135 -6 -15 80 -194 -144 -141 10
4853A0kk6o3jk43L32k5P2n2o8k77K39L42j31J60m07J10K19j80j6N7k14K11j80
$$ 10 8 -18 -81 -82 -325 7 -18 54 2 -66 -343 -104 238 107 267 -140 -30 189 9 -7 50 -164 47 -133
4877a33J03O7l8L8j70J48pN8J11m17J43J5J2J54o0l9j71Q8j7K04Q4k38k56K72
$$ -133 -30 37 -1 37 -133 15 8 66 177 -240 -97 -82 -70 84 24 -15 -186 -98 -115 89 173 -65 -321 -49
4901d9K58k5k30r0o5K82j41o0N22m14k30L5Q1K31L3j69n4J9KK22j91j95N1M13
$$ -49 209 184 -46 -136 -201 81 -60 -120 402 -12 -242 -207 -126 105 138 -31 -85 -66 -64 158 -33 -228 -177 236
4925B36j90lo8l2k47K84Q9J09n6j67l4j79L61J17k85j04K27l94K59J02n8J02k31
$$ 236 46 43 -25 -57 -304 -20 69 178 122 -45 -79 -258 103 220 -65 -169 58 -336 -77 25 -33 69 -162
4948a62qJ82rL8%JJ40k30K53j40k5j6j90R1L28j93O6k78J34J81lj37Qk00OP0o
$$ -162 -170 12 3 41 41 42 182 -48 205 65 40 24 -166 -75 253 60 126 -152 -18 163 160 23 31 -169 -163 -93 -99
4975i9M33l07k57N3K36L9Kj53m9Jo8L84p7p8Lo4no3L54k38k9k66J44K10O6r2J
$$ -99 334 27 -230 -177 59 98 100 -53 -102 -101 -169 215 138 60 63 -1 -6 -69 285 47 18 -248 -104 106 172 80 81
5002H1l09K70o6J08Qk58MK40j58K33q2l0m20L46K1J66j34J4j08n3J2K61K0l51
$$ 81 -228 42 -24 84 92 -166 -162 78 -80 153 71 41 -379 -33 -12 154 20 34 -74 -127 -115 146 166 -185
5026a85K6N8K64P6p8l32P7k95N68j69J40m03J53k20K14N46l01k66l9O1j0K99m6
$$ -185 -159 -101 163 239 161 -171 -94 -389 179 10 150 -253 -100 -320 -106 440 139 -127 -166 -105 -115 184 138
5049A38j49M4j58L06j54J21l38rJ39m7L15j18n6j26j16O1M02o8n02o7K47L3M48
$$ 138 -11 33 -125 181 27 148 -190 -199 -60 -107 208 90 34 -92 -208 -147 255 187 -315 -382 -135 -102 346
5072C46j30k79jL5K79n0P6j88j58k24N0M81m4j52k09J77K10l54L22j81Lk70L38
$$ 346 216 -63 -64 -29 250 200 276 88 -70 -294 -244 237 193 41 -168 9 219 -135 187 6 9 -261 77
5095G7l0L50m76k09J55K8L38k02M3j35k85L80N6J16j78j32k22K85p0L81j11k28
$$ 77 47 397 -79 -288 -133 -105 233 31 74 -61 -346 34 90 206 28 -104 -326 -41 -111 270 159 -69
5117f9r6J92J12q4L13n88J2j6K72J89j75k28k38O92k60J38k23%l2O8M5J71m6k44
$$ -69 -165 27 139 55 368 -220 -208 -224 48 237 62 -166 -404 288 28 166 -57 -57 -89 -21 24 195 149 -95
5141i5K8J6J93J8k82J67j71K23o0j7K80m04k04J47L74Nr6o0j55J4L73j44k0l46
$$ -95 -67 -51 142 160 -122 45 -126 97 37 20 300 -104 -308 -161 213 218 122 62 -93 -79 294 150 130 -216
5165b16N1l24M34L00n0k14k33L03O7R6j3k70K7j70M38m8j45o7j57J33K07Q0k54
$$ -216 -165 -489 -55 245 195 -19 -252 51 118 214 201 -69 -42 -212 226 178 33 -34 -191 -58 149 229 -25
5188b5j02Pj48K03L66j25k10J4r7K15o0j41P9m80K90K60J24M8l4m58J13L06J31
$$ -25 -127 -120 -268 -65 301 176 -34 -20 -117 98 38 -103 -24 -504 -214 46 170 218 184 -274 -161 145 276
5211B76j50k79J02n5M2K32J89k57j5l21J32J40J80l7n21M21JL9j16J12k62j89
$$ 276 126 -153 -51 -106 -64 168 357 100 85 -236 -104 36 216 179 -342 79 80 119 3 115 -147 -336
5233c36L78L08Pl74k14j51K56J55J57n0k25k66L32R5J22j19k83N7q0J92M07j30
$$ -336 42 350 357 -17 -231 -382 -126 29 186 136 -89 -355 -23 72 194 75 -208 -151 -231 -39 368 238
5255B38n16J55r2M28PM4m62N3J70K29j05o0l71KJ11L15J99m5n69l8N14n6l8K34
$$ 238 -278 -123 -215 213 220 264 -198 -145 25 254 149 89 -282 -280 -169 146 345 300 -269 -307 207 151 113 347
5279C47l24l99K44J35K07j97j36k23L00R0K03j94m38L47o2J3L99j50k32k52K14
$$ 347 23 -376 -132 3 210 13 -123 -346 -46 44 247 53 -385 -38 -100 -87 312 162 -70 -322 -108
5300a08J75J81l35j72K88k91K58M05k83j90j18P8Q6L06k29J36j96o1j07L25nj16
$$ -108 67 248 -87 -259 29 -262 -4 401 118 -72 -190 -112 -26 280 51 187 -9 -70 -177 148 143 27
5322B7l27J2J47M79k56k57j86j53P24j23J25l80j14RL22L17j08l12j68P6K97M7
$$ 27 -300 -288 -141 338 82 -175 -361 -514 210 87 212 -168 -282 -273 49 366 258 -54 -222 -146 151 198
5344A98L2j16l95lO41O5j86j03l18j83N33k2k0l5k83J1L05j72K19O5o84L47j15
$$ 198 230 114 -281 -284 357 422 236 133 -185 -368 165 143 123 88 -195 -184 121 -51 168 233 -451 -104 -219
5367b19L54p1O5l88o4J81J98N3k19m5K66O7NJ13k90j82P5j42N43r6pl82k8j94
$$ -219 135 64 129 -259 -323 -142 56 109 -110 -155 111 178 183 296 6 -176 -101 -243 300 204 197 -185 -213 -407
5391d07O27QQ3l89m2J54l1K83m30j13m1K18K49Q4J64p02L24j45L0M72k47j05l10
$$ -407 220 228 311 -78 -120 34 3 286 -144 -257 -298 -80 169 253 417 -285 39 -106 -76 396 149 44 -266
5414b66J47M51j67q2k84O0J64R5o6p7r8j20J05L65j43j01J29l20J09J60L29k20
$$ -266 -119 332 165 83 -201 -141 23 118 52 -25 -123 -243 -138 227 84 -17 112 -208 -99 61 390 170
5436A70l32J0R8J38O9R7l41j58J29L46m6j14l1m38K68K14M0J53m49k9J70pL77
$$ 170 -162 -152 -54 84 153 250 -91 -249 -120 226 180 66 35 -403 -135 79 119 272 -177 -206 -36 -43 334
5459C34p8l28l28R8K54L15J4j54o2l01J84N51r8l40l69J21K38M33n21J21j43l02
$$ 334 256 -72 -400 -302 -48 267 281 127 65 -236 -52 499 401 61 -308 -187 51 484 -37 84 -59 -361
5481c61M28K39j03l56j2n3J28J85K11m24k07J28J59N4n9Q2j55J02K4j74L88k35
$$ -361 67 306 203 -153 -165 -218 -90 95 306 -118 -325 -197 -38 16 -43 39 -116 -14 10 -164 224 -11
5503a1J03m26L24L12p0j52k85k0R0L45L5k4m13K1RM17j27j5j82j27Q6M34o5j79
$$ -11 92 -334 -10 302 232 80 -205 -225 -135 210 245 221 -192 -171 -162 255 128 113 -69 -196 -110 324 259 80
5527H0j15k99K70J02P1j32Ol21K25K97Q4k79l01Q4K15k1M29j74m90j17J95J82
$$ 80 -35 -334 -64 38 109 -23 -17 -338 -113 184 268 -11 -312 -228 -13 -34 395 221 -269 -386 -191 -9
5549iL59k22j64j27l0M16J62j21m54k1R1K55K85k27j82k71j36O28J77j53n21Q9
$$ -9 350 128 -36 -163 -193 223 385 264 -190 -211 -120 135 420 193 11 -260 -396 232 409 256 -265 -176
5571a76n1J99J97N1k02j69L4K24K14l9m71j83N5L49K66P2l70p4k12K94L06j40
$$ -176 -227 -28 169 220 18 -151 -117 107 321 282 -189 -372 -317 32 298 370 0 -74 -286 8 314 174
5593A74l05k20J47J13L46k8j84k04M9K36J37j25Lm10J98J4K89J8n74Q9K18j89
$$ 174 -131 -351 -204 -91 255 227 43 -161 -112 124 261 136 139 -271 -73 -59 230 248 -326 -237 -19 -208
5615b08L33Om3l31J79j05M62j28l87oN4K67J28J9j91k68j60L58L82k9k88k48M4
$$ -208 125 131 88 -243 -64 -169 293 165 -222 -228 -174 93 221 240 49 -219 -379 -21 361 332 44 -204 -160
5638a60R4K95r3J08k41o5J4L89j61j35o3k70J21K08J5j65l77K91K33K27K8j38
$$ -160 -66 229 136 244 3 -62 -48 341 180 45 -18 -288 -167 41 56 -109 -486 -195 38 265 293 155
5660A55n98J34K4M60K62l61k44l64M18K64j4J52n13n2K74K49J05l39O3l17L95
$$ 155 -443 -309 -285 175 437 76 -168 -532 -114 150 136 288 -225 -277 -3 246 351 12 75 -242 153
5681A53j75K51k12j80J4O1K3J83J8k87J17J2K04n4K4k56o2J41K21lk78j44L4K04
$$ 153 -22 229 17 -163 -149 -88 -65 118 136 -151 -34 -22 182 128 152 -104 -166 -25 196 193 -85 -229 -195 9
5705Ij1M33j97l01q0j06L47M12k40m02k14J63L21L28l3n46l2L4pJ26l5k51k75
$$ 9 -2 431 234 -67 -147 -253 94 506 266 -136 -350 -187 134 462 429 -117 -149 -115 -122 4 -31 -282 -557
5728e57K11N11J97k76m10R9n7K33K91p6j67l41K44J08M24l21j75O3l54L50J79
$$ -557 -346 165 362 86 -324 -225 -282 -49 242 166 -1 -342 -98 10 434 113 -62 1 -353 -3 176
5749A76qk02k55O0L32Q3J27k87j20r6P2L07J50l49l14j91N75j93N29m06k86K41
$$ 176 168 -34 -289 -229 103 186 313 26 -94 -190 -118 189 339 -10 -324 -515 60 -133 396 -10 -296 -55
5771e5NM04p9l31j58r7J38J75K37R1m84m3K68J3J97k10j51j94L33J11r3Om15J88
$$ -55 -50 354 275 -56 -214 -311 -173 2 239 330 -154 -197 71 84 281 71 -80 -274 59 170 77 83 -332 -144
5795a44Q1K33L7r5l61j73J55L89J06k65r4J93k03K68m1k35j20J07J61k5K33j30
$$ -144 -63 170 207 112 -249 -422 -267 122 228 -37 -131 62 -141 127 86 -149 -269 -162 -1 -26 207 77
5817G7l07PQ1L07R9j30k97l14J23M98m0L1m96L3L24K65%J0k53k19O6K56J55l7
$$ 77 -230 -223 -142 165 264 134 -163 -477 -354 144 104 135 -361 -328 -4 261 261 271 18 -201 -135 121 276 239
5841B39k34o8p1K55K77k25l87j33L68Q5K97k67k57K5r9L23J04n1l65p8j67N17
$$ 239 5 -63 -134 121 398 173 -214 -347 21 106 403 136 -121 -96 -195 128 232 181 -184 -262 -429 88
5863H8K51R8n99o8L3K49K54P4l73o11M12L96N8k17l38N0k6L52J20j19P3m10R6
$$ 88 339 437 -162 -230 -197 52 306 380 7 -604 -192 204 262 45 -293 -243 -269 83 203 84 157 -253 -157
5886a57J84K85n6l49k72j3K00N49j16k80j90q1K51L25m1l56K5l3J98j0K31k80
$$ -157 27 312 256 -93 -365 -378 -178 371 255 -25 -215 -296 -45 280 239 -117 -92 -125 73 63 294 14
5908A4k38k36M68L58l16J43n10K69k1L08j96J0j94j41K68L45k24o1m81J9M61p2
$$ 14 -224 -460 8 366 50 193 -317 -48 -69 239 43 53 -141 -282 -14 331 107 46 -435 -416 45 -27
5930b7K56l38k44P4J4O16p3k00l57O4M02J57p0k45l41P5L88p9M72j29n73r2%N81
$$ -27 229 -109 -353 -279 -265 351 278 78 -279 -215 187 344 274 29 -312 -237 151 72 544 415 -158 -250 -250 331
5954C31j64o5l93J43Q8M69K9l14l65K8m8K76K33N0m26k52M56Q8rj24j31k25L04
$$ 331 167 102 -291 -148 -60 409 438 124 -241 -213 -261 15 248 298 -128 -380 76 164 155 31 -100 -325 -21
5977b1K72K26k30m68O9M7N9L80m4k48k28L5Q0N64Jo26l17K45M95K04k04k57l51
$$ -21 251 477 247 -221 -152 -105 -46 334 290 42 -186 -151 -71 493 494 -132 -449 -204 291 495 291 34 -317
6000c17J12J80K65J13o97k1K62L74K7j87k11k75j60M24L66m8l23l1kJ06M85j05
$$ -317 -205 -25 240 353 -344 -365 -103 271 298 111 -100 -375 -535 -111 255 207 -116 -147 -149 -43 442 337
6022C37n20j33L62J73j45J9j89j06jL02K75j34l77l7j59J84N75k74p1l23Q5K79
$$ 337 -183 -316 46 219 74 93 -96 -202 -203 99 374 240 -137 -174 -333 -149 426 152 81 -242 -157 122
6044A22K77k49k57Q2l61M56L84j33j32m56q0N00qK9M8n28L5N41l86K05O0k58k44
$$ 122 399 150 -107 -25 -386 70 454 321 189 -267 -347 153 145 174 222 -306 -271 270 -116 89 149 -109 -353
6067c53K18L80j64Q4l11l84K82O16o5j89j61j3j10N53L8m55m24R1M11j9L70l06
$$ -353 -135 245 81 165 -146 -530 -248 368 303 114 -47 -60 -170 383 421 -34 -458 -367 44 25 395 89
6089H9j84k81K99J05M31k34l48j27N2M76l80J45k91J69J17K38n4k82k01J32J15
$$ 89 -95 -376 -77 28 459 225 -123 -250 -198 278 -102 43 -248 -79 38 276 222 -60 -261 -129 -14
6110a4N2K72l05j36j50J75L04J57k22l05j50O6K48L60j33m43k4p3P12q6n1j39
$$ -14 38 310 5 -131 -281 -106 198 355 133 -172 -322 -256 -8 352 219 -224 -248 -321 391 305 254 115
6132A15l91JK69K99p7k22l76N5N64K3r3j91k24P8K03M35k51k25k72J07M36J70
$$ 115 -276 -275 -6 293 216 -6 -382 -327 237 260 167 -24 -248 -170 33 468 217 -8 -280 -173 263 433
6154D33n6o16Q3L2J85L59k13m79P6q1J40M28o6m34R6n7K63J24K3r4q7l12J76L31
$$ 433 377 -239 -156 -124 61 420 207 -272 -196 -277 -137 291 225 -209 -113 -170 93 217 240 146 59 -253 -77 254
6178B54J58m73j82L6K84L02l69o9j43k25M63J49j03p2l00K27j09L66K22n60j1
$$ 254 412 -61 -243 -207 77 379 10 -59 -202 -427 36 185 82 10 -290 -63 -172 194 416 -144 -155
6199a55k92N44P6P6l09p0j31J60L16K2k24k53MK51r7M48l36J0lq2J81K48m63m4
$$ -155 -447 97 173 249 -60 -130 -261 -101 215 237 13 -240 -236 15 -82 366 30 40 37 -45 136 384 -79 -123
6223a23l71L68L30J29k52k94QJ09M04j55kk93k37M07J32P8j54k90J4K37L70k31
$$ -123 -494 -126 204 333 81 -213 -205 -96 308 153 151 -142 -379 28 160 238 84 -206 -192 45 415 184
6245A84J10o2m12Q4K78J03k34k66k9K48M26pl60j94J4K4K09L95m72k11j14M7K74
$$ 184 294 232 -180 -96 182 285 51 -215 -244 4 430 423 63 -131 -117 -93 116 511 39 -172 -286 -239 35
6268C5J46N5m38l3J96j67K46K69m04q8J01O4L42k03j57k02J72L21m3p3k07j32
$$ 35 181 236 -202 -235 -39 -206 40 309 -95 -183 -82 -18 324 121 -36 -238 -66 255 212 139 -68 -200
6290b00k31N91Q9j70l34k19J59M07q8R5k22o9N9J12J54J15k29j70k14N46rO3l71
$$ -200 -431 160 249 79 -255 -474 -315 92 4 99 -123 -192 -133 -21 133 248 19 -151 -365 181 172 235 -136
6313a36r9M2KL69m2m3l13K60j20J73q5j34n7Q4R8J00K03j26k44j81K41K94O1k01
$$ -136 -235 -193 -191 178 136 93 -220 40 -80 93 8 -126 -183 -99 -1 99 302 176 -68 -249 -8 286 347 146
6337A46m96J75K83J87n9p7j39k90K55R8O3j84k04k52M44L42k16j00j63K4J69J55
$$ 146 -350 -175 108 295 236 159 20 -270 -15 83 146 -38 -242 -494 -50 292 76 -24 -187 -163 6 161
6359A61J01j92l53L1J73L56j11m45K80m00L72L38l20N4l33N0J39M05Rk38q9l19
$$ 161 262 70 -283 -252 -79 277 166 -279 1 -399 -27 311 -9 45 -288 -238 -99 306 315 77 -12 -331
6381c31J24L49L36n72p4j9j29M69J76k12j39j31n0M43j49J94l36k14L53J35j60
$$ -331 -207 142 478 -94 -168 -187 -316 153 329 117 -22 -153 -203 240 91 285 -51 -265 88 223 63
6402F3j4n2j43j86L52M14n16p1k82K32N18j71J59m35k00M5M53K39k3n50j96J14
$$ 63 49 -3 -146 -332 20 434 -82 -153 -435 -203 315 144 303 -132 -332 -287 166 405 382 -168 -364 -250
6424b50J31K53qk14l22Q5M48K40l79qj89R2J60K04q2o7j22l75O05j52R2k25k71
$$ -250 -119 134 126 -88 -410 -325 123 363 -16 -24 -213 -121 39 243 161 94 -28 -403 202 50 142 -83 -354
6447c54L65J39R8j71j18k43J46J35M25j81j56q5j90Q7P6J57l1l66K72K11J7J22
$$ -354 11 150 248 77 -41 -284 -138 -3 422 241 85 0 -190 -103 -27 130 99 -267 5 216 233 355
6469C55k54l55J49Q4L34k10J69l04n9MK98l9k23j12j19o7M04K14j93l08o2L43
$$ 355 101 -254 -105 -21 313 103 272 -32 -91 -87 211 172 -51 -163 -282 -349 55 269 76 -232 -294 49
6491D9J82O9k31l30M2o9M93m8k31j37P8J40K56j2k16k15N7l1L02J91l25oj01K41
$$ 49 231 300 69 -261 -219 -288 205 157 -74 -211 -133 7 263 251 35 -180 -123 -154 148 339 14 8 -93 148
6515A48K59Ol90k78K04Q4J58k6k87j21KK1L58Q2k07j28r6R3O4K83j15j93k52N4
$$ 148 407 413 23 -255 -51 33 191 165 -122 -243 -241 -220 138 220 13 -115 -211 -118 -54 229 114 -79 -331 -277
6539b77M38Q0j41k55l0J50L53j51O1j37l04J73K19K56o86J12j04L55q1K66j79
$$ -277 161 241 100 -155 -185 -35 318 167 228 91 -213 -40 179 435 -251 -139 -243 112 31 297 118
6560A18l29J6L2L47J13r0o4m11J08L05K25q2l44l47J61L46m8K7k85k8r6L20J99
$$ 118 -211 -195 -163 184 297 207 143 -268 -160 145 370 288 -56 -403 -242 104 56 83 -202 -230 -326 -6 193
6583A93o9k13j61j04K41O62m05q1k95L90k53L54k45j4p0j44K98j1J20l45j27o2
$$ 193 124 -89 -250 -354 -113 549 144 63 -232 158 -95 259 14 0 -70 -214 84 73 193 -152 -279 -341
6605c41R1O08k98on31K01J88K03kk70Om45N76J00L60n68J79l68L72R8J98l64l2
$$ -341 -250 358 60 54 -477 -276 -88 115 113 -157 -151 -596 -20 80 440 -128 51 -317 55 153 351 -13 -45
6628d5k57L41J27N3j00l77L9K9M49k85L4j22k43L84L12k23j7k19M3j4L76l11n0
$$ -45 -302 39 166 219 119 -258 -219 -190 259 -26 8 -114 -357 27 339 116 99 -120 -77 -91 285 -26 -76
6651g6k07K5J03L07J44k55L7k86K82J28K6k22j52j47k9M70k9j26j10L1o9K07L03
$$ -76 -283 -258 -155 152 296 41 78 -208 74 202 228 6 -146 -293 -322 148 119 -7 -117 -86 -155 52 355
6674C55l91j19n6j45L83J91J00n65O6O0L10l4J71n29J49q3K93K50m14Ql41R6L72
$$ 355 -36 -155 -211 -356 27 218 318 -247 -181 -121 189 155 326 -203 -54 -137 156 406 -8 0 -341 -245 127
6697A27N1n3k47j27K13R0K90l23k28n2K95K54j61Q4k45q9K2M7L84k14k33l28M93
$$ 127 178 125 -122 -249 -36 54 344 21 -207 -259 36 290 129 213 -32 -121 -99 -52 332 118 -115 -443 50
6720E0R2K58k84j58j50l5K74J36O0l29k00L03N8j00R4m0j91j7J62K96J18m42k39
$$ 50 142 400 116 -42 -192 -227 47 183 243 -86 -286 17 75 -25 69 29 -162 -179 -17 279 397 -45 -284
6743b84L3L38J13k6k72k27L2K11O75l42l84j24J01J05K18o1k27L3k26J47K13K79
$$ -284 -251 87 200 174 -98 -325 -293 -82 593 251 -133 -257 -156 -51 167 106 -121 -88 -314 -167 46 325
6765C25l17k31q3L48M10k29k05p8l1l7L35p7on17K31l7L30O3j18j46k06N43l04
$$ 325 8 -223 -306 42 452 223 18 -60 -91 -128 207 130 124 -393 -162 -199 131 194 76 -70 -276 267 -37
6788c7L88m08L9j28J18J00L15m19n0l2J00l9L28j89k73J8L24P7p9n3k32j32J56
$$ -37 351 -57 -18 -146 -28 72 387 -32 -82 -114 -14 -53 275 86 -187 -169 155 232 153 100 -132 -264 -108
6811a08K05j50J30k38o2J26K80K14m30n4j37L50J25P7k57j58j08R2R8K86l51k03
$$ -108 97 -53 77 -161 -223 -97 183 397 -33 -87 -224 126 251 328 71 -87 -195 -103 -5 281 -70 -273
6833b73Q1J34K07m3o7j84M3j03L93Lj48l14Q4J28k0J45K52n25l33K80K45R4J75
$$ -273 -192 -58 149 106 39 -145 -102 -205 188 191 43 -271 -187 -59 -79 66 318 -207 -540 -260 -15 79 254
6856B54j38l74J98J58j39K87l25M6J43l00O30j5p14J45m4J69J00p8J33k09m2J62
$$ 254 116 -258 -60 98 -41 246 -79 -33 110 -190 440 425 -289 -144 -188 -19 81 3 136 -73 -115 47
6878D7L07l93Ml25L10J01K57j1m50n1j7K95J28K16m54m23L16O4L15k65J47k80
$$ 47 354 -39 -35 -360 -50 51 308 297 -153 -204 -221 74 202 418 -36 -459 -143 -79 236 -29 118 -162
6900a62O7rJ66m0P8r6k30J75L13k83J12k29K9K7N32l79j10j44o5K73L21r3l31
$$ -162 -95 -104 62 22 100 4 -226 -51 262 -21 91 -138 -109 -82 450 71 -39 -183 -248 25 346 253 -78
6923g8Q1k85L47R2K4k77j4rJ35P5J57j71r6j96K19l4J04O9j83j87J61J71J67l34
$$ -78 3 -282 65 157 181 -96 -110 -119 16 91 248 77 -19 -215 4 -30 74 143 -40 -227 -66 105 272 -62
6947f2j45J94J06k1J67j28m37R2P2O2M43l50j40q3P7M04l7j97m9q2R2J91M9j04
$$ -62 -207 -13 93 72 239 111 -326 -234 -162 -100 343 -7 -147 -230 -153 251 214 17 -32 -114 -22 169 218 114
6971A14k30k10L53j36L15J12o40j54O01p7L21l31j02K9J1J27N9j33j85l5p5L64
$$ 114 -116 -326 27 -109 206 318 -322 -476 125 48 369 38 -64 -35 -24 103 162 29 -156 -191 -266 98
6993I8J10j73k40PK16m2L04l2k68j79o9K18M08j91j36j33K72l5Q7k95m4k28K64
$$ 98 208 35 -205 -198 18 -24 280 248 -20 -199 -268 -50 358 167 31 -102 170 135 222 -73 -117 -345 -81
7016h1L2M32m64k84K51o2P3L41j72j62q2L25o1O6o9k14k42K46L14j34J72k19n
$$ -81 -49 383 -81 -365 -114 -176 -103 238 66 -96 -178 147 86 152 83 -131 -373 -127 187 53 225 6 1
7039Am8J32l0M2N5l14j8M01k1j18R8k12k45K57L38K5k99j23q6N8J53O4R3l75n8
$$ 1 -47 85 55 97 152 -162 -180 221 200 82 180 -32 -277 -20 318 343 44 -79 -165 -107 46 110 203 -172 -230
7064b30K29O6m0q2k8J69j82K58l4o9k52J61J25K64l77Q1j38k83J87K13L5K34m45
$$ -230 -1 65 25 -57 -85 84 -98 160 126 57 -195 -34 91 355 -22 59 -79 -362 -175 38 73 307 -138
7087a38m9p4N66k17k2k92k4J72L35N8m88L4k24M30O2r9p1N5j84L2J53L68k83M1
$$ -138 -187 -261 305 88 66 -226 -250 -78 257 315 -173 -139 -363 67 129 30 -41 14 -170 -138 15 383 100 141
7111A41j20jL9j10K94j76j93K11P0Q3m66J73j68K2L88r2k16J47j73j24K48J51
$$ 141 21 20 59 -51 243 67 -126 85 155 238 -228 -55 -223 -201 187 95 -121 26 -147 -271 -23 128
7133A28n6J82m48qK36J35j52m7p7P2lL61l36o7j0k84M61L8p3J02k93M9J43K10
$$ 128 72 254 -194 -202 34 169 17 -30 -107 -35 -38 323 -13 -80 -90 -374 87 125 52 154 -139 -90 53 263
7157B63j91j44j56J21K2L63p8l41M9k6M45j3j88k48J76k58O3K54k5k99K09r6o4
$$ 263 72 -72 -228 -107 -85 278 200 -141 -92 -118 327 314 126 -122 54 -204 -141 113 88 -211 -2 -98 -162
7180a62K43L6j73j12r7M13j84O3j35P4K2L2O9J63k06q6k50M10M9o7J9j83j48P9
$$ -162 81 117 -56 -168 -265 148 -36 27 -108 -34 -12 20 89 252 46 -40 -290 120 169 102 121 -62 -210 -131
7204a31L69j79o6M7rJ06j8o7o8j7P4k10K43M2k02Q5j37m4N43n0o3k64K9j2j79
$$ -131 238 59 -7 40 31 137 119 52 -16 -33 41 -169 74 116 -86 -1 -138 -182 361 311 248 -16 13 1 -178
7229a78O82k65n31K16J90j46L41J7m64J95N2k8L0j0k93pL2L51j04J36l09k9r8
$$ -178 504 239 -292 -76 114 -32 309 326 -138 57 109 81 111 101 -192 -199 -167 184 80 216 -93 -122 -220
7252b20K92K7J20k31k30K6J59l3J53j54J26o8J98q4j56O0j02K69q7K65j37k09
$$ -220 72 99 219 -12 -242 -216 -57 -90 63 -91 35 -33 165 81 -75 -15 -117 152 65 330 193 -16
7274a6j39RK32R0k60k7o3J10K02J48j81m1k19J64l3Q3P1k21Q2j43K22j17L46n21
$$ -16 -155 -146 86 176 -84 -111 -174 -64 138 286 105 64 -155 9 -24 59 130 -91 -9 -152 70 -47 299 -222
7298b22J10j52J89k7R0r8P0K9pL0M3j19m29K88K75R4n4k34R4L4j87L08q2J23l65
$$ -222 -112 -264 -75 -102 -12 -110 -40 -11 -18 12 55 -64 -493 -205 70 164 110 -124 -30 4 -183 125 43 166 -199
7323a99P4K46N4k01K1j49p1K92rJ43l82j4o3K22J08R3k48R7l92K73J99k7k4j7
$$ -199 -125 121 175 -26 -5 -154 -225 67 58 201 -181 -195 -258 -36 72 165 -83 14 -378 -105 94 67 43 26
7347B6l18K05J36K8l47k8K60L8J44M4k23j44K36J62M7j34l22m3O4J69L18k89m0
$$ 26 -292 -87 49 77 -270 -298 -38 0 144 188 -35 -179 57 219 266 132 -190 -233 -169 0 318 29 -11
7370a1j37N8q6K70P6k32J81k26k14L98M59l29j89k08K21K10l2N1j41r4j83K46
$$ -11 -148 -90 -176 94 170 -62 119 -107 -321 77 536 207 18 -190 31 241 209 260 119 25 -158 88
7392H8n6j23J51k88LK83m6K11l87J93j39o8J78R8l94K77nL6J47j62J03l77J20
$$ 88 32 -91 60 -228 -225 58 12 223 -164 29 -110 -178 0 98 -296 -19 -24 12 159 -3 100 -277 -157
7415a57J15J45k56j8L11J07j3j79L6J10j86k12K74J15j86p1k03K64J30j32J31
$$ -157 -42 103 -153 -171 140 247 234 55 91 201 15 -197 77 192 6 -65 -268 -4 126 -6 125
7436A25k25N4j5L26Jj50o1q1o4K41j98J03j30J55j4k32K96j35Q3p5j99P7K61n2
$$ 125 -100 -46 -61 265 266 116 55 -26 -90 151 -47 56 -74 81 67 -165 131 -4 79 4 -195 -118 143 91
7460I1p0j26J01N9l8J74k7j36k04K18j0q4R4j53k7N9K48j65J02r9j10J89j10J28
$$ 91 21 -105 -4 55 17 191 164 28 -176 42 32 -52 42 -111 -138 -79 169 4 106 7 -103 86 -24 104
7484A04j32K5O9p1j02K58j13j52N7O5M5l2R2J34m46J16M8R1k1r3R0l1L5Q6n2J0
$$ 104 -28 -3 66 -5 -107 151 38 -114 -57 8 53 21 113 247 -199 -83 -35 56 35 -58 32 1 36 122 70 80
7510H0j93L93l23L4R6q4O1J0n3j0q1J56r7q5J99j19n2K25k39J76K10k96k6l1J83
$$ 80 -113 280 -43 -9 87 3 64 74 21 11 -70 86 -11 -96 103 -16 -68 157 -82 94 304 8 -18 -49 134
7535A34l58L39q0N5n8k67K35j11K31J36k09k9J3J72j00j46O9r2R0j31K01j55q
$$ 134 -224 115 35 90 32 -235 0 -111 120 256 47 18 31 203 103 -43 26 -66 24 -107 94 -61 -69
7558f9J22J08r8J97k61j25l5J5J05J42l06L05l5k78L12k53K84R0k33K9l8L5L3
$$ -69 53 161 63 260 -1 -126 -161 -146 -41 101 -205 100 65 -213 99 -154 130 220 -13 16 -22 13 46
7581D6p4l6k42L42K5o9j07k12M00j60J70j42K56k65k5J61N8O8m23j0J21K37m5
$$ 46 -28 -64 -306 36 61 -8 -115 -327 73 -87 83 -59 197 -68 -93 68 126 194 -229 -239 -118 119 74
7604G4j6r2K3j70J80J7j92J92J2j05M04p2k49m7J0r4J78m4r4qJ44j01j60K56q5
$$ 74 58 -34 -11 -181 -1 16 -176 16 28 -77 327 255 6 -41 -31 -125 53 9 -85 -93 51 -50 -210 46 -39
7629c9O9k2k1j63J84R9j66N0o8J89p6J48j95n6l0j12L71M8k80J03k16J76R8J03
$$ -39 30 8 -13 -176 8 107 -59 -9 -77 112 36 184 -11 -67 -97 -209 162 210 -70 33 -183 -7 91 194
7653A94j89J12m24P8L40J20l26K08n30N30j06J22k1k15L22l49R8q7L9%j8p4J31
$$ 194 5 117 -307 -229 111 231 -95 113 -417 113 7 129 108 -107 215 -134 -36 -123 -84 -84 -102 -176 -45
7676d5L29m45j00K42j23J04J69J1k66J84j85K76m1j32j1J22m2k3j92K47j80K75
$$ -45 284 -161 -261 -19 -142 -38 131 142 -124 60 -125 151 110 -22 -33 89 47 24 -168 79 -101 174
7698A74m9m9k33L25j28k88L26J3q6l9Q7k74l2L53J38m35J50l25K03p6N09k77m4
$$ 174 125 76 -157 168 40 -248 78 91 5 -34 53 -221 -253 100 238 -197 -47 -372 -169 -245 264 -13 -57
7721e7j35L04j87J77kj15j71K10n7K2K74l63K35j41J5L4j33jn8K33J08k30J79
$$ -57 -192 112 -75 102 100 -15 -186 24 -33 -11 263 -100 135 -6 9 43 -90 -91 -149 84 192 -38 141
7744A41o6j63K4R5M7j9o3J33R8k29M22j24k74J04j31J46k42O5n5M3R1k02L79k26
$$ 141 75 -88 -64 31 78 59 -4 129 227 -2 420 296 22 126 -5 141 -101 -36 -91 -48 43 -159 220 -6
7768fM1p1j49K19j9J03J21l75J05o2J82j56j5K12j25K24k32J53j63m0K8m7j13
$$ -6 35 -36 -185 34 15 118 239 -136 -31 -93 89 -67 -82 130 5 229 -3 150 -13 -53 -25 -72 -185
7791a85N61l71J10k28N3J11P7J24k96k21m8J97o9K24j41K10k0J36j28k23J87r0
$$ -185 376 5 115 -113 -60 51 128 252 -44 -265 -313 -116 -185 39 -102 108 88 224 96 -127 60 -30
7813c0J83k18J01J27m88K49K49l22L24l02K78r9k00M6J7K99k83N7Q5j40J89k68
$$ -30 153 -65 36 163 -325 -76 173 -149 175 -127 151 52 -148 -102 -85 214 -69 -12 73 -67 122 -146
7835a46J39O9%j48J72k26J45J42J9o9k3L8k00Kj38J03J51K15j79l3J06K84l94
$$ -146 -7 62 62 -86 86 -140 5 147 166 97 74 112 -88 -86 -224 -121 30 245 66 33 139 423 29
7858B9J24j66Q4j46m0J00J04J49l22Q7j19K11k65L09n26O7K92J03N7R5j21j84
$$ 29 153 -13 71 -75 -115 -15 89 238 -84 3 -116 95 -170 139 -387 -320 -28 75 132 227 106 -78
7880g8J2Ql4j25qK55j68Q0M06l50j96J09K08r0r3k08j3L56j73O2m4K19j42M3O3
$$ -78 -66 -58 -92 -217 -225 30 -138 -58 348 -2 -198 -89 119 29 -64 -272 -285 71 -102 -40 -84 135 -7 36 99
7905I9q7l1J86j25p5m2J7J57r8l6m9J58kJ56k81K47l39Q3J3l4m0p6K14j28O1L7
$$ 99 12 -19 167 42 -33 -75 -58 99 1 -35 -84 74 72 228 -53 194 -145 -62 -49 -83 -123 -199 15 -113 -52 -15
7931a5PK05k79K53k13J19L0p1m1j5l1j87L06J81l65O5K92k61N3P5K9p1kk20K53
$$ -15 -8 197 -82 171 -42 77 107 36 -5 -20 -51 -238 68 249 -116 -51 241 -20 33 108 137 66 64 -156 97
7956I7J32k06m4M6Q4K0p6m2Q2P7k35K00R9o5j00j53p5l0L99j75Q7k46P8L4J24
$$ 97 229 23 -21 25 109 129 53 11 93 170 -65 135 234 169 69 -84 -159 -189 210 35 122 -124 -46 -12 112
7981A12j55PJ04q9j42j14N9K16k3j64K43k82J54k2J75q8l3m9nn8Q3J79J53m03
$$ 112 -43 -36 68 -21 -163 -277 -218 -2 -25 -189 54 -228 -74 -96 79 -9 -42 -91 -96 -154 -71 108 261 -142
8005a42oJ66Pn2J65k3k37rM8J45l1l20L90J31k9l48j72L61p3p0J38o3j73L35q5
$$ -142 -148 18 25 -27 138 115 -122 -131 -83 62 31 -289 101 232 203 -145 -317 44 -29 -99 39 -24 -197 138 53
8030E3R6k16r8Q6n5K62m64K60R2L1M67m73l0k88J04M8j52M98k10m3J86j18M4O
$$ 53 149 -67 -165 -79 -134 128 -336 -76 16 47 514 41 11 -277 -173 -125 -277 221 11 -32 154 36 80 86
8054H6j03N0R1J06j05k62L60j86J32J3R7l55L27r6k73L06k28q7j78K73j43K93
$$ 86 -17 33 124 230 125 -137 223 37 169 182 279 -76 251 155 -118 188 -40 -127 -305 -32 -175 118
8076A18j37j81K2N7R4J06k11J90m49K63K31j8j74Q2j40J68J11n4m2J5j5j28K59
$$ 118 -19 -200 -178 -121 -27 79 -132 58 -391 -128 103 85 -89 -7 -147 21 132 78 36 51 36 -92 167
8099A67k18J03J25j87n6j10J87M3k9k4j59J78J44l4j97L4j29K06mO8J71l44K29
$$ 167 -51 52 177 -10 -66 -176 11 54 25 1 -158 20 164 130 -67 -33 -162 44 40 108 279 -65 164
8122A64k85J36J56k22j69J12lO6L02j11m1j54p0R6p2R9k7J51p4N1J00k24MJ38
$$ 164 -121 15 171 -51 -220 -108 -111 -45 257 146 105 -49 -119 -23 -95 4 -23 128 54 105 205 -19 -15 123
8146A23r5Q4k16Q3q5o1kK15j35OK40l43KK25N2m2j08j77J26o3M19r3J48J16m83
$$ 123 28 112 -104 -21 -106 -167 -169 46 -89 -83 157 -186 -184 41 93 51 -57 -234 -108 -171 248 155 303 419 -64
8171f4L29k63J33j79j24R2J91q9k37K95mj08l4J21k7Jj03m5o6K24
$$ -64 265 2 135 -44 -168 -76 115 26 -211 84 80 -28 -62 59 32 33 -70 -115 -181 43
8191D3
$$ Imaginary data points
##PAGE= N=2
##DATA TABLE= (X++(I..I)), XYDATA
0@%%%%%%%%%%%%%%%%%Pj5J6j6J6j6K4l2L2l7M5m9N7o7P5q8J01j10J22j38J58j81
$$ 0 0 0 0 0 0 0 0 0 0 0 0 0 0 0 0 0 0 7 -8 8 -8 8 -8 16 -16 16 -21 24 -25 32 -35 40 -48 53 -57 65 -73 85 -96
39i6K01k23K47k73L04l37L75m14M55n02N54o10O71p41Q19r05R99j105J227j369
$$ -96 105 -118 129 -144 160 -177 198 -216 239 -263 291 -319 352 -389 430 -475 524 -581 646 -723
59g23J533j726J961k252K620l104L775m773O448r978L4213n2028k6432M5274p228
$$ -723 810 -916 1045 -1207 1413 -1691 2084 -2689 3759 -6219 27994 -24034 -50466 -5192 -12420
74a2420M8517K3194o6916m4391L0359K3803K8329K760m1551l3950L086L6687N3270
$$ -12420 36097 59291 -7625 -52016 -21657 2146 30475 33235 -8316 -42266 -39180 -2493 50777
87E0777j4609n1358j0106n778J1517O8806M940o9336j2813J4547m441M4958K4184
$$ 50777 36168 -15190 -25296 -31074 -19557 49249 54189 -15147 -27960 -13413 -17854 27104 51288
100E1288o1336l4491K2722J6802K7630J7531l7326m1361R04L2636L8578K599l0458
$$ 51288 -10048 -44539 -21817 -5015 22615 40146 2820 -38541 -37637 -5001 33577 36176 5718
113E718k3340j3631J6549N0418K855m4352j4819k355M369M4531J7193m6560l0757
$$ 5718 -17622 -31253 -14704 35714 38569 -5783 -20602 -22957 -18588 25943 43136 -3424 -34181
126c4181O852J2514L2203K3640k8425l8127m623K1240L0056J0824j8930k8566
$$ -34181 -27329 -14815 17388 41028 12603 -25524 -30147 -8907 21149 31973 13043 -15523
138a5523j4914J9188L7021N776k6506k4103j3056J1358L9892J7277k7421k7864
$$ -15523 -30437 -11249 25772 31548 5042 -19061 -32117 -20759 19133 36410 8989 -18875
150a8875q939R053L1694K0942j8260l0458j0548J4842K6387J4595j5043l0561
$$ -18875 -27814 -18761 12933 33875 15615 -14843 -25391 -10549 15838 30433 15390 -15171
162a5171j6628J5583L1429J3990j4155k7778j9037J0203L1538J7709j1068k5548
$$ -15171 -31799 -16216 15213 29203 15048 -12730 -31767 -21564 9974 27683 16615 -8933
174h933j5900R010K7269J7722j1356k7336j7100J0078K7341J7478r052k8245k0419
$$ -8933 -24833 -15823 11446 29168 17812 -9524 -26624 -16546 10795 28273 19221 -9024 -29443
187b9443P514K6403K0001n440k5408j8725O555K4064J8793m497k5110j9249P998
$$ -29443 -21929 4474 24475 19035 -6373 -25098 -18543 5521 24314 19817 -5293 -24542 -16544
200a6544K4109J8429l298k6345k3054M780K4193J9614j291k2101k2352J820K2520
$$ -16544 7565 25994 22696 -3649 -26703 -21923 2270 21884 20593 -1508 -23860 -22040 480
213D80J9995j119k1464j9175K641K1252K1055L06k4619k1725J621J9976K1138
$$ 480 20475 19356 -2108 -21283 -18642 2610 23665 23971 -648 -22373 -20752 -776 20362
226B0362L505k1172k4217m27J8701J9214L904j7789k1683j317J9870K0578K472
$$ 20362 23867 2695 -21522 -21949 -3248 15966 19870 2081 -19602 -20919 -1049 19529 22001
239B2001j8508k1932l640J8753K2870M574j8041k2675n349J4827K1542O351j6076
$$ 22001 3493 -18439 -22079 -3326 19544 24118 6077 -16598 -21947 -7120 14422 20773 4697
252D697k1126m608J5155K0605O887j5710k2377n589J6154K1912P941j4101k2819
$$ 4697 -16429 -21037 -5882 14723 21610 5900 -16477 -22066 -5912 16000 23941 9840 -12979
265a2979r014J3197K1116Q389j1973k0706r231J2323K0550P847j2391k0407q720
$$ -12979 -21993 -8796 12320 20709 8736 -11970 -21201 -8878 11672 19519 7128 -13279 -21999
278b1999J2771K1865R882j1213k1052j0986R634K1243J1034r428j9920j1630Q925
$$ -21999 -9228 12637 22519 11306 -9746 -20732 -11098 10145 21179 11751 -8169 -19799 -10874
291a0874J8958J0561q931j9928j0525R169K0147J1798p822k0195j2421P153J9844
$$ -10874 8084 18645 9714 -10214 -20739 -11570 8577 20375 12553 -7642 -20063 -12910 6934
304F934J2815n773j8418j3272N382J8131J1953n825j8134j2722N578J8656J3096
$$ 6934 19749 13976 -4442 -17714 -12332 5799 17752 11927 -6207 -18929 -13351 5305 18401
317A8401n282j8687j3449M367J8349J4860l176j7388j4087K260J6511J4342l053
$$ 18401 13119 -5568 -19017 -14650 3699 18559 15383 -2005 -16092 -13832 2679 17021 13968
330A3968j6732j3532K612J6028J4134k400j6973j4785J829J6595J5425n73j5095
$$ 13968 -2764 -16296 -13684 2344 16478 14078 -2895 -17680 -15851 744 16169 15596 501
343E01j5509m16J5764J5023p78j3984j3878j409J4485J5775o56j5920j3814j464
$$ 501 -15008 -15424 340 15363 14585 601 -13277 -14686 -201 15574 14918 -1002 -14816 -16280
357a6280J3803J6711K277j4981j5226k199J2759J5670L094j1998j5422k849J3110
$$ -16280 -2477 14234 16511 1530 -13696 -15895 -3136 12534 15628 3630 -11792 -14641 -1531
370a531J4813J699j2066j5065m447J2557J7088K542j2350j4357n563J0309J6865
$$ -1531 13282 14981 2915 -12150 -16597 -4040 13048 15590 3240 -11117 -16680 -6371 10494
383A0494N402j1398j4469m199R553J5252N302j0895j5498m909J0660J5327N233
$$ 10494 15896 4498 -9971 -14170 -4617 10635 15937 5042 -10456 -15365 -4705 10622 15855
396A5855r540j5996p206R420J6040O364q378j4536o725P740J5301O791q422j4946
$$ 15855 6315 -9681 -16887 -7467 8573 14937 6559 -7977 -14702 -6962 8339 15130 6708 -8238
410h238o290Q063J4583P817p815j6345p781P526J4778Q301n965j4978q368N964
$$ -8238 -14528 -6465 8118 15935 8120 -8225 -16006 -8480 6298 14599 8634 -6344 -14712 -8748
424h748J4401Q705n876j5053p057N957J3344R799n281j6608q370O319J2479R521
$$ -8748 5653 14358 8482 -6571 -13628 -7671 5673 15472 10191 -6417 -14787 -8468 4011 13532
438A3532k467j5225j0878N703J2956Q394k411j3007j0240L749J4036J0198m268
$$ 13532 11065 -4160 -15038 -9335 3621 12015 9604 -3403 -13643 -9894 4142 14340 10072
451A0072j4134q320K266J1670J2907j978j6332r041L998Q598J1249J822j5226
$$ 10072 -4062 -12382 -10116 1554 14461 12483 -3849 -12890 -8892 -294 10955 12777 -2449
464b449j1953N471J0897Q384J166j1777j3187J868J3757J0689k043j0816r885
$$ -2449 -14402 -8931 1966 10350 11516 -261 -13448 -11580 2177 12866 10823 7 -9878
477i878k397J0502J4350m18j4538p485P39N865J3236M489j5766j1858M728P638
$$ -9878 -12275 -1773 12577 12159 -2379 -9864 -9125 -3260 9976 14465 -1301 -13159 -8431 -793
491g93Q827O027j0830j5805O78J1529R395J612p238j1933m439J0169J3802J09
$$ -793 8034 14061 3231 -12574 -11896 -367 9028 10640 3402 -8531 -12970 -2801 11001 11110
505A1110j1298p486k704M524J5770N182j4485j0498J323L878J0573R010j0267
$$ 11110 -188 -7674 -10378 -5854 9916 15098 613 -9885 -8562 -4684 5889 14899 4632
518D632j5251K42Q194P760N567n686j3449n253R473J2439K125p308q952o268M374
$$ 4632 -10619 -10377 -2183 5577 11144 5458 -7991 -13244 -3771 8668 10793 3485 -5467 -11735 -7361
533g361J5371O005j1216q956k174J178J1639R905r342j3856o29M816Q039Q639
$$ -7361 8010 14015 2799 -6157 -8331 -7153 4486 14391 5049 -8807 -9436 -4620 3419 12058
547A2058m556j4593n241P325J0239N372l602j0183q589M146J3256N930o575r116
$$ 12058 7502 -7091 -12332 -5007 5232 10604 7002 -3181 -11770 -7624 5632 11562 4987 -4129
561d129n021R80J1470R770p153j1646l719K299Q827J0040l067j3232o062M273
$$ -4129 -9150 -8170 3300 13070 5917 -5729 -9448 -7149 1678 11718 8651 -4581 -10643 -6370
575f370Q680P517j380j0512q699L442J0524O782k816q862q138R16J0974Q682l196
$$ -6370 2310 9827 8447 -2065 -10764 -7322 3202 9984 7168 -1694 -9832 -8916 2058 10740 7544
590G544r513p052J56Q946J0081j118j0591p411J394Q073Q420K89j0080r019J704
$$ 7544 -1969 -9021 -8865 81 10162 9044 -1547 -8958 -7564 509 8929 9218 -862 -9881 -8177
605h177Q943P669L90q794r338j80R066R010N4p905q812r28Q382Q965O67q502q243
$$ -8177 766 8435 8825 31 -9307 -9487 -421 8589 8643 738 -8074 -9002 -620 8345 9012 510 -7733
622g733j263P975Q985J274p773r523j216P354R088J991p275r057k114P166R031
$$ -7733 -8996 -1021 7964 9238 1465 -8058 -9274 -1920 7168 9159 1884 -7173 -9287 -2121 6910
637F910K151o617r321k221O890Q857K691o522r477k718O560R054K835n790r138
$$ 6910 9061 2444 -6877 -9098 -2208 6649 9340 2818 -6659 -9377 -2817 6237 9072 3282 -5856
652e856l565O138Q740L543n426r043l342N424Q887L742n499q819m142N156Q886
$$ -5856 -9421 -3283 5457 9000 3574 -5469 -8811 -3387 5500 9242 3743 -5076 -9218 -4062 4824
667D824M377m784r158m264M352Q765M646m295q610m809M201Q826M587l781q792
$$ 4824 9201 4417 -4741 -9005 -4653 4112 8758 4463 -4147 -8956 -4755 4071 8658 4877 -3915
682c915m648L682Q651M994l353q824n270L580P805N408k904q103n480K991Q151
$$ -3915 -8563 -4881 3770 8764 5411 -3413 -8683 -5103 2702 8110 5206 -2897 -8377 -5386 2765
697B765N159k564p742n670K347Q399N278k250p895n700K011P562O232j931p777
$$ 2765 7924 5360 -2382 -8052 -5705 2694 7972 5722 -2173 -7873 -5862 1700 7932 6001 -1776
712a776n799J510P295O072j059p424o451J284P478O223j200o630o550K66P282
$$ -1776 -7575 -6065 1230 7302 6243 -1181 -7632 -6348 1130 7353 6153 -477 -7027 -6761 521
727E21P020j063o761o164l21O844O884m73o930o187R3O374O499L92o446o693m54
$$ 521 7541 6478 -283 -6447 -6768 76 6960 6487 -443 -6630 -6537 -163 6336 6728 282 -6411 -6865
744f865O446O405N91n467p476n07N958O740O56n275o684j643O121O928P29n286
$$ -6865 -419 5986 6577 1110 -6366 -6873 -915 5825 6481 1206 -5478 -7121 -1000 5928 6657 1371
760A371o670j711N245P221J593n350o581j904M848O677K146m627p149j950M614
$$ 1371 -5299 -7010 -1765 5456 7049 1699 -4882 -6786 -1938 4739 6885 2258 -4891 -6841 -2227
775b227O787K256m311o878k448M503O419K608l924o835k749M015O998K517l923
$$ -2227 4560 6816 2505 -4373 -6821 -2318 4101 6709 2785 -4050 -6799 -2784 4214 6731 2808
790B808o557k971L671O509L353l727o516l037L182O525L521l272o744l185L068
$$ 2808 -3749 -6720 -3049 3460 6813 3086 -3430 -6467 -3285 3240 6761 3489 -3255 -6440 -3372
805c372O101L629k448o737l857L200O193L435k203o476l943K689O390L655k388
$$ -3372 2729 6358 3910 -2827 -6684 -3484 2709 6144 3941 -2535 -6478 -3789 2601 6256 3868
820C868o096l999K029O422M094k256n728m265J661N884M755k034n930m171J443
$$ 3868 -2228 -6227 -4198 2224 6318 4062 -1666 -5931 -4270 1614 6369 4335 -1595 -5766 -4323
835d323N424M411r13n766m651J180N630M388o79n462m820Q27N624M360m59n305
$$ -4323 1101 5512 4599 -1167 -5818 -4638 992 5380 4701 -761 -5581 -4754 870 5230 4771 -534
851e34m778L27N503M867n68n107m864J54N179M621K90m959m745m05M809N062J09
$$ -534 -5312 -4985 518 5385 4817 -290 -5154 -5000 179 4800 5090 131 -4614 -5019 -210 4852 4961
868D961m870m690k39M412M799Q16m825m845n24M334M871Q68m188n254p00M257
$$ 4961 91 -4599 -4838 -426 4373 5189 364 -4481 -5005 -671 4200 5068 880 -4374 -5074 -817
884h17M932Q58l768n158j148L854N452P75l927m574j582L165N735J813m443m755
$$ -817 4115 4973 1205 -3953 -5101 -1247 4205 4980 1053 -3521 -5103 -1938 3797 5610 1167 -3588
900c588j152K706N060K251l175n911j254L424M611J984k543n558k453L664N265
$$ -3588 -4740 -2034 3026 5277 2102 -3809 -5063 -1639 2972 4956 2413 -3145 -5598 -1934 3331
915C331J386k612m308l011K523N810J989l205m324k125J588N168L240k930n558
$$ 3331 4717 2105 -2203 -5214 -2691 3119 5108 1903 -2421 -4546 -2958 2210 5450 2520 -3038
930c038j316J928L892L291j270n769k930K885M565J955j221m154l984K123N299
$$ -3038 -4354 -2426 1466 4757 3487 -2282 -5212 -2327 2238 4193 2972 -1182 -5166 -3043 2256
945B256K012j702l643l125L98N368L749k665m553j782N89L632M137r07n487l038
$$ 2256 4268 2566 -1077 -4202 -3804 1564 5313 2648 -1905 -3687 -3098 534 4671 3764 -1723 -4761
961d761K161L475L008K86m752m447J275N147K268m10l117m343l42N616L458j602
$$ -4761 -2600 875 3883 4169 -583 -5030 -3755 1392 3660 3250 133 -4210 -4552 1064 4522 2920
977B920l588k487p21L599M696o60m563k743L53K915L798Q16m373m408R03L964
$$ 2920 -668 -3155 -3876 -277 4419 3759 -804 -3547 -3194 -279 3519 4335 -38 -4446 -3543 421
993D21K352R87k748m839l20M413L374p36k138l594j272L483M418J12l852k829
$$ 421 2773 3760 1012 -3827 -4147 266 3640 2904 766 -2828 -4100 -617 3801 3913 61 -2768
1009b768q60K447M181J279l720l985j03K795L055J538k485m543p45L227L011J204
$$ -2768 -3628 -1181 3000 4279 559 -3426 -3529 -734 2321 3859 1374 -3169 -3914 -687 2324 3528
1025C528j977m036j851L142M051Q36k488l317j468J671M335J603k750l607j104
$$ 3528 1551 -2485 -4336 -1194 2857 3693 1205 -2112 -3580 -1909 2426 4029 1279 -2328 -3432
1040c432J717L715J829j985l878j329K038K975K047j726l726k005J705L848J900
$$ -3432 -1715 2000 3829 1844 -2034 -3363 -1325 1650 3697 1971 -1755 -3760 -2055 1793 3693
1055C693j981l205k208J538L912J739j691l165k237J553L462K089j206l844j960
$$ 3693 1712 -1493 -3701 -2163 1749 3488 1797 -1368 -3605 -2052 1410 3499 2293 -1551 -3511
1070c511J317L453K168q69l629k315R62L379K285q14l225k722J150L045K697p69
$$ -3511 -2194 1259 3427 2558 -1071 -3386 -2424 955 3240 2426 -799 -3521 -2371 674 3371 2602
1086B602l300k421M70L356K416q58k579k744M50K953K789o20k872k646J95L404
$$ 2602 -698 -3119 -2649 707 3123 2265 -314 -3058 -2608 345 3134 2514 -358 -3004 -2809 595
1102E95K530m16k909k526n4K840K750n9k765k772J24K428K939j09k483k875J16
$$ 595 3125 2709 -200 -2726 -2780 60 2810 2751 -14 -2786 -2662 -234 2705 2596 113 -2762 -2646
1119b646K608K574M4k467k524n39K469K854N15k283k913o08K279K899N98k166
$$ -2646 -38 2536 2580 113 -2411 -2950 -481 2373 2888 605 -2308 -2916 -637 2262 2860 694
1135F94k727r19K308K651Q21k084k736j202K318K963O92j798k726j115J599K991
$$ 694 -2033 -2952 -644 2007 2828 744 -1992 -3194 -876 2087 2779 981 -1745 -2860 -1261 1730
1151A730J098j593k968j027J860K448J219j465k987j150J766K713J329j667k728
$$ 1730 2828 1235 -1733 -2760 -900 1548 2767 1302 -1685 -2835 -1069 1644 2973 1306 -1422
1166a422j211J275K983J240j496k523j492J440K336J653j330k708j421J107K544
$$ -1422 -2633 -1358 1625 2865 1369 -1154 -2646 -1206 1130 2783 1453 -1255 -2676 -1569 975
1181I75J883j185k756j724R12K945J595q77k460j913O67K927J180o04k149j935
$$ 975 2858 1673 -1083 -2807 -1895 1050 2645 1768 -692 -2605 -1938 989 2169 1565 -584 -2519
1197b519Q39K509J640o86k474j671L53K401K219n30k279j927K10K001K172k03
$$ -2519 -1680 829 2469 1783 -691 -2362 -2009 392 2611 2081 -198 -2125 -1915 86 2258 2055
1213B055k568j573K38K067J810N7k357j894lK175K237q9j927k453K27J701K331
$$ 2055 -513 -2086 -1848 219 2029 2086 -271 -2165 -2168 7 2244 2155 228 -2225 -1998 -297 2034
1230B034N3j889j980l28J810K331o2j771j924l63J496K407M14k016j984j06J355
$$ 2034 2087 198 -1782 -2110 -300 2031 1969 198 -1726 -2089 -593 1814 2228 212 -1772 -1878 -523
1247e23J994N74j500k003p36J814J870Q28j664k105n01J391K199N07j290k063
$$ -523 1471 2045 545 -1458 -2194 -380 1490 2318 654 -1451 -1952 -561 1638 2145 855 -1208
1263a208q73J276J990Q01j234k015r69J360J937J060j143k063p31J055J777J191
$$ -1208 -2081 -805 1185 1986 752 -1263 -2232 -872 1065 2125 982 -1081 -1812 -757 1020 2211
1279B211j166j943j104J102J719R70m83j985j439Q79K257P76m95j892j219O01
$$ 2211 1045 -898 -2002 -900 819 1789 1306 -679 -2118 -1239 1018 1794 1299 -593 -1812 -1211
1295a211J809J600j102j818j313P10J715J913r34j848j483N35J679J444l53j506
$$ -1211 598 2198 1096 -722 -2035 -1325 390 2303 1369 -479 -1962 -1427 252 1696 1343 -163
1311a63j653K40K030J142j92j567j528oK045J335j63j496j637k4J493J643R2j599
$$ -163 -1816 -1576 454 1596 1404 -163 -1691 -1697 348 1683 1520 24 -1613 -1637 -144 1499 1591 -8
1329hj562m7J701J363J77j379j919j57J708J506J89j339j629m41J692J313O94
$$ -8 -1570 -1617 84 1447 1624 245 -1674 -1831 -123 1383 1572 233 -1396 -1837 -145 1168 1862
1346A862j431j577n89J505J235O42j200k233K16J498J256M84j064j683p99J700
$$ 1862 431 -1146 -1735 -230 1005 1647 447 -1786 -1570 -72 1184 1668 604 -1079 -1878 -178
1362a78J245M93q61j785p39J265J675M85j046j577p41J014J713Q57j202j603n77
$$ -178 1067 1560 699 -1086 -1825 -560 1115 1600 554 -1023 -1764 -750 963 1820 618 -985 -1562
1379a562R22J330R10m24j958q35J067J031M74o0j336j371P05K034M58p21j192
$$ -1562 -640 690 1600 1176 -782 -1617 -550 481 955 895 -441 -1812 -1107 927 1385 664 -528
1396e28j174N40J564J291o32j717n70J76J204J369m34j669j037O27J310Q84J42
$$ -528 -1702 -1162 402 1693 1061 -656 -1226 -1050 154 1523 1089 -580 -1617 -990 320 1204 1346
1413A346j567j753O74J903P17j98r64j839L44J718J119l62j296r51l7J087J346
$$ 1346 -221 -1974 -1300 603 1320 1122 158 -1681 -1337 381 1500 1138 -158 -1109 -1146 -59 1287
1430A287J60j621j200K96Q36J087Q03j670j505M20J192O62N55l70k049l09J422
$$ 1287 1447 -174 -1374 -1078 -242 845 1648 -22 -1527 -1107 85 747 1302 932 -1117 -1426 -4
1447dJ269k67p21j218l61J103J614J1j350j007k48M52J621P37j488j176j80P86
$$ -4 1265 998 277 -941 -1302 -199 1415 1426 76 -931 -1179 -727 894 1631 143 -1033 -1213 -427
1465d27J360M35q79j464r6N04J567K59l84j663o14P03J709K73p42r46j051P87
$$ -427 933 1368 489 -975 -1071 -567 1000 1259 875 -788 -1402 -699 1010 1283 541 -405 -1456 -669
1483f69J318P38r02j229n43O43J252R72r26j203r31Q35J074Q39k75j427j111O15
$$ -669 649 1387 485 -744 -1287 -644 608 1580 654 -549 -1480 -645 429 1268 993 -434 -1545 -930
1501i30J098R48k42r20j204L48J423P42m47j070j111M56J182J037k73j188r76
$$ -930 168 1116 874 -46 -1250 -902 521 1263 816 -254 -1365 -909 273 1310 1037 -151 -1127
1518a127M15R09J049n10r70p38l4J240P34J75j324p71L8J044R61K2j051j137k9
$$ -1127 -712 197 1246 736 -234 -972 -1006 234 968 1143 -181 -952 -914 130 1091 1113 62 -1075 -1104
1537a104R80J213P2q72j404nJ050J003J73q74j283k9R12J052L87q96j167l78J076
$$ -1104 -124 1089 1161 289 -1115 -1120 -70 933 1106 232 -1051 -1080 -168 884 1271 375 -792 -1170 -94
1556i4R92L47p94j284k17O66J070P66r63j104p25R11J220K80o13j259l53N26J293
$$ -94 898 1245 451 -833 -1050 -384 686 1452 489 -615 -1340 -429 791 1071 458 -801 -1154 -628 665
1575F65M62o37j054o46O99R99O59o17j288m12M14J429M65l41j295o92O41J061
$$ 665 1127 490 -564 -1210 -511 488 1147 530 -758 -1170 -756 673 1138 797 -498 -1190 -549 512
1593E12P25o97r05j028L92J322R04m06j226n14j86J572O78k56j218q36K86J108
$$ 512 1237 540 -365 -1393 -1001 321 1225 819 -407 -921 -1107 465 1143 887 -331 -1167 -881 227
1611B27Q67k9j309p49K93J047M64j93o26j225Q9J214Q93n3j192r20L39R32J100
$$ 227 1094 1065 -244 -993 -700 347 811 618 -8 -1233 -1144 70 963 910 -282 -1202 -863 69 1169
1630A169k39r93q93o0R51J076K43j177r38m2Q14J203j05p52r15p08J384Q64K17
$$ 1169 930 -63 -956 -1016 -65 1011 1254 77 -861 -903 -89 1114 1009 257 -658 -1366 18 882 1099
1649A099p52j225m00J156J145qo67j182n76R28J203M07q08j134k89O47J101O74
$$ 1099 347 -878 -1278 -122 1023 1015 348 -834 -1410 -482 721 1128 320 -814 -1103 -456 645 1319
1667A319q76j288l50J100P70L40m40j394n12Q68J212O33p11j264n23M51J040Q90
$$ 1319 443 -845 -1195 -95 675 1015 575 -819 -1331 -463 749 1382 671 -593 -1116 -665 375 1265
1685A265o79j001q04L28J284R60o63j240p38N39J018J039n02j250q55O32J002
$$ 1265 586 -415 -1219 -891 393 1353 690 -550 -1288 -749 269 1308 806 -444 -1299 -667 335
1702C35Q51l32j354r25O26J215O97l90r33j071K76J368M65R1j391n74J29J221
$$ 335 1186 854 -500 -1425 -799 416 1113 723 -210 -1281 -1005 363 828 919 -472 -1046 -917 304
1720C04O76o7j339q26L55J002R83j68j179r29M22O96J064j64p01j279J30J126
$$ 304 980 913 -426 -1252 -897 105 1088 920 -259 -1188 -766 -70 994 830 129 -1150 -1020 106
1738A06J016k3j054j146o9Q52J419j76o72j262p1Q81Q74M40j067r89n4O81J278
$$ 106 1122 1099 45 -1101 -1170 -318 1101 925 253 -1009 -1080 -199 675 1115 48 -941 -995 -314 964
1757I64P3q13j273mQ80J106M89j169j207n87J076J049Q30j100j187j76M28J449
$$ 964 1037 224 -1049 -1053 -173 933 1422 253 -954 -1541 -465 584 1414 314 -873 -1049 -621 828
1775H28L38q88j068m57P57J295O50q89j332l40N62J361K66l21j330p88O48J391
$$ 828 1166 278 -790 -1247 -490 805 1455 566 -766 -1106 -544 817 1083 762 -568 -1356 -708 683
1793F83P57r84j005n10M15J384N34p34j131n85J84J667N43m95j077r22N50J085
$$ 683 1440 456 -549 -1059 -644 740 1274 540 -591 -1176 -992 675 1218 723 -354 -1276 -726 359
1811C59O05J16j410r30K51J509O46l91j155p41K73J146J072l50j570n34J64J019
$$ 359 964 1080 -330 -1260 -1009 500 1146 755 -400 -1141 -868 278 1350 1000 -570 -1104 -940 79
1829G9J151l37j275j023O05R61J037m7j391r90K86J035J044k05j026q39lJ079
$$ 79 1230 893 -382 -1405 -800 161 1198 1151 -240 -1230 -944 91 1135 930 -96 -935 -938 141
1847A41J098j51j275o47k38Q82J726l81j379j006L17P91J080N03j587j282L61
$$ 141 1239 1088 -187 -834 -1072 -190 1536 1155 -224 -1230 -913 -122 958 1461 -126 -1408 -1047
1864a047R02Q56M74q40j379j53J287J176l45q58j114k81R20J267K82j017j142
$$ -1047 -145 711 1185 345 -1034 -1187 100 1276 931 73 -1041 -1322 -402 865 1147 130 -1012
1881a012o9P43J335L85j078j226q2O95J001O87j021j043m22Q05J255K30o83q76
$$ -1012 -1081 -338 997 1382 304 -922 -1004 -309 692 1379 358 -685 -1107 -302 953 1183 500 -376
1899c76q69O55J589K25q46r22p11Q02J401N01p05j358l57N08J120P32q37j333
$$ -376 -1245 -590 999 1224 378 -544 -1255 -453 948 1449 744 -614 -971 -463 657 1389 552 -781
1917g81o96J028R95M77l19j223p59L12J480Q23r18p66r68P26J310N90p11j045
$$ -781 -1477 -449 546 1023 704 -519 -1278 -966 514 1337 419 -347 -1315 -589 721 1311 600 -445
1935d45o22K45J244O45k52j142r01M15J356N51k47j190o72N5J082P36k32q35r92
$$ -445 -1067 -822 422 1067 815 -327 -1228 -813 543 1094 847 -343 -1015 -960 122 858 626 -209 -1201
1954a201N30R19J039l62j041j002L42J024Q74M4j170j110R2J049J292k91j051
$$ -1201 -671 248 1287 925 -116 -1118 -776 248 1122 1166 -4 -1114 -1022 27 1319 1028 -23
1971b3r36oJ227J016j54j162r60J15R59Q28N8q66j179qJ029J217o5j127r93J36
$$ -23 -959 -965 262 1278 1124 -38 -998 -883 76 904 962 96 -1083 -1091 -62 1155 1090 -37 -1030 -894
1991h94P29J219J96j070j104l05J222R59J79r40j115k59J045J227j83n39j259
$$ -894 -165 1054 1250 180 -924 -1229 -7 952 1131 191 -924 -1183 -138 1089 906 367 -892
2008h92j67R31J160K01q16j000l33N43J278M10p77j178n62R91J124J82o15j362
$$ -892 -1059 -128 1032 1233 417 -583 -916 -373 905 1315 538 -640 -1202 -211 913 1095 480 -882
2026h82l35P51J145N46j007r89n07P68J354K44n99j153n83O21J247O11q62j215
$$ -882 -1217 -466 679 1225 218 -771 -1278 -510 844 1088 489 -664 -1247 -626 621 1232 370 -845
2044h45n54O80J717L73r54q88o39K96J500O05o54j224n40M41J427M64m05j301
$$ -845 -1399 -719 998 1371 417 -471 -1110 -814 686 1291 637 -587 -1127 -686 741 1205 800 -501
2062e01p89O51J065P59m17j106j137P18J442K47j28j171q19J61J445Q76l64j252
$$ -501 -1290 -639 426 1185 768 -338 -1475 -757 685 932 804 -367 -1186 -1025 420 1296 932 -320
2080c20o79O0J181J054l58j147j000L23J230N89J53j250r95R3J495P49k14j068
$$ -320 -999 -939 242 1296 938 -209 -1209 -886 344 933 1086 -164 -1159 -1066 429 1178 964 -104
2098a04j081K85J132J032k39j125q43l6J009J075m08q52o32k47J049J248j98j086
$$ -104 -1185 -900 232 1264 1025 -100 -943 -979 30 1105 697 -155 -787 -1034 15 1263 1065 -21
2116b1j195J43J255Q52k8o42j533l2J289J175m08q06j069l33J289J232L7j218
$$ -21 -1216 -1073 182 1034 1006 364 -1169 -1201 88 1263 855 49 -1020 -1353 -64 1168 1205 -13
2134a3p58l45R05J300k2j121r34N2N81J390K08j065j135kJ038Q76J71o26j336
$$ -13 -771 -1116 -211 1089 1067 -54 -988 -936 -355 1035 1243 178 -957 -959 79 955 1126 500 -836
2153h36n32J250J154K09r15j188k60P46J254L50q62j079k36O54R48O55j066j132
$$ -836 -1368 -118 1036 1245 330 -858 -1118 -372 882 1232 370 -709 -945 -291 657 1312 246 -886
2171h86j87Q09R42N85o47j439m13R53R64O59p26j315n93R12J065M16m54j158p63
$$ -886 -1073 -264 678 1263 616 -823 -1236 -283 681 1340 614 -701 -1294 -382 683 1099 645 -513 -1276
2190a276O12J360L56n25j364k12M45J181R67q09j470n29Q22R70N94l16j391q05
$$ -1276 -664 696 1052 527 -837 -1049 -604 577 1544 735 -735 -1264 -442 528 1122 806 -585 -1390
2208a390O12J533L79l43j348o43L39J481L84m47r50p75L64J171Q74o36q31r46
$$ -1390 -778 755 1134 791 -557 -1200 -861 620 1004 557 -393 -1168 -804 367 1241 605 -226 -1172
2226a172N50R61R43k77j309q97L44R39J264l72j330p71J47J389O20J6j169r10
$$ -1172 -622 339 1282 1005 -304 -1201 -857 82 1346 974 -356 -1127 -980 409 1029 1045 -124 -1034
2244a034m7J527O10L2j196r49Q4J050J045l68q65q98Q7P93J235K3j314r51J09
$$ -1034 -1081 446 1056 1088 -108 -1057 -973 77 1122 754 -111 -1009 -922 -129 1106 1129 -185 -1136 -1027
2263a027J057Q66r3q84q56J1R15J188j58r08j218j36J266R14J10j078j017l37
$$ -1027 30 896 803 -81 -937 -926 -11 1177 1019 111 -1107 -1243 23 937 1047 -31 -1048 -1385
2281a385J330J044j04r57q52k15R35J183J02q71r85m16P99J403J97r33j252O8
$$ -1385 -55 989 885 -72 -924 -1139 -204 979 1081 210 -775 -1191 -392 1011 1208 275 -977 -909
2299i09O18J049L68p58j120m03P04J222M81q58j203m40P91J340J97o69j120o17
$$ -909 -291 758 1126 368 -752 -1155 -451 771 1252 394 -809 -1249 -458 882 1079 410 -710 -1327
2317a327O99J484K40n36j344k49L18J278P67r25j202l23O40J091N99m74j334r31
$$ -1327 -628 856 1096 560 -784 -1033 -715 563 1330 405 -797 -1120 -480 611 1210 736 -598 -1529
2335a529J325P80Q04q43j140o69N55J317K05l67j136m52M57J048R65n98j322o70
$$ -1529 -204 576 1380 537 -603 -1272 -717 600 805 438 -698 -1150 -693 355 1320 722 -600 -1270
2353a270O19Q51R66m28j298p78O07J239N78k40j079p84K66J230O12j10j619n47
$$ -1270 -651 200 1166 738 -560 -1338 -731 508 1086 846 -233 -1017 -751 479 1091 981 -638 -1185
2371a185O61Q26P48k51j129q70M14J225O28j37j177o94P5J348M23l7j193o84R6
$$ -1185 -524 302 1050 799 -330 -1200 -786 439 1067 930 -247 -941 -866 482 905 868 -325 -1009 -913
2390i13J249P58j46j073r09J71J021J178n23r86j027M12Q63R48j03j041q41rR36
$$ -913 336 1094 948 -125 -1034 -863 158 1336 813 -173 -1200 -788 75 1023 920 -121 -962 -971 -35
2409c5J029p5r04q84N4J086O40K28j007j055j51J211R75q8j152q52K8Q61Q25L80
$$ -35 994 919 15 -869 -815 271 911 1139 132 -923 -1074 137 1112 1024 -128 -980 -952 -91 734 1114
2429A114j084p97k11R14J034K72j132j063j00R95Q17J14o80j166j18P22J467J8
$$ 1114 30 -767 -978 -64 970 1242 110 -953 -1053 -58 759 873 193 -973 -1091 -369 1098 1116
2447A116q74r95l00O94J331L02r61q78m63Q22R17M78r85r30l71R00R05M26o32
$$ 1116 242 -753 -1053 -359 972 1274 313 -565 -1028 -206 711 1189 204 -726 -1097 -197 708 1134 502
2466E02j075n54P41R96M73l52j210p15O40J161O12p25j106l50M37J108L12m26
$$ 502 -573 -1127 -386 610 1083 731 -479 -1194 -554 607 1219 494 -612 -962 -525 583 895 469
2484D69j375k92P74R03M81l60j070o47M10J194N61n99r99n64N86J084N69o21j241
$$ 469 -906 -1198 -424 479 960 600 -470 -1117 -707 487 1048 449 -550 -1114 -528 556 1125 504 -737
2503g37k89N35J265K66m63j018p31N80J140M19j15j310m27L9J071J030n45r32
$$ -737 -1026 -491 774 1040 577 -441 -1172 -592 548 967 852 -458 -885 -846 225 1255 710 -222
2521b22p55J14J210O67n9j301q37M79R49Q45m17q97q61K84J090Q12m01o89j003
$$ -222 -977 -863 347 1014 955 -346 -1183 -704 245 1090 673 -224 -1085 -801 289 1101 700 11 -992
2540i92K18P89R89k66p14r92J79Q76R76l29p03j018J26J024R36j88j031o21m9
$$ -992 -774 15 1004 738 24 -968 -789 87 1063 734 31 -987 -861 163 1099 911 -120 -741 -790
2559g90R20R33kj105r97K27J112N26j88l79q85l77J095P67j63o33p68l69J351
$$ -790 130 1063 1061 -44 -1041 -814 298 824 636 257 -628 -1005 90 857 694 61 -707 -1076 275
2578B75Q41P5j202j070J66P18R88L38r44j246L2R08J011R4q29j201n8J091P83
$$ 275 1116 1191 -11 -1081 -915 -197 791 1129 185 -1061 -1029 -121 890 984 155 -1046 -1104 -13 770
2597G70R0o71r34j54P74R43J74o88j172j68P59Q71P57r86j187o6O09R77L62p00
$$ 770 860 189 -745 -899 -125 818 992 304 -868 -1036 -277 594 1351 365 -822 -888 -279 698 1060 360
2617C60j002l29O46J048L77o97j300k68R30R76L63q82o54p98O03J289N84p16j084
$$ 360 -642 -971 -325 723 1100 403 -897 -1165 -235 741 1104 222 -432 -1230 -627 662 1246 530 -554
2636e54p37P98J054O45o88r79l15K10J010M79m26q43o36K70J313N84p56r81n34
$$ -554 -1291 -493 561 1206 518 -461 -776 -566 444 923 497 -346 -982 -712 601 1185 429 -552 -1086
2655a086M79J322L41k85j226o04M96R34P70o18q69p08N12P42R32n24q81p71J73
$$ -1086 -607 715 1056 771 -455 -1059 -563 371 1141 523 -346 -1054 -542 200 1132 608 -273 -1044 -871
2674h71J278O02l19j070n03K35O48J153m13r60q86L61R15Q34k18j172m56N5J044
$$ -871 407 1009 690 -380 -883 -648 0 1153 740 -220 -1106 -745 170 1004 786 -386 -842 -787 257
2693B57P18r7j185p78L08J152N91l55r60o66K40P90J124j49r97j017J57J083N12
$$ 257 975 878 -307 -1085 -777 375 966 611 -349 -1015 -775 15 1139 990 -7 -1024 -867 216 728
2712G28J90j066o73lP39R87r0r50o42PQ02Q09R9r34r77L25M80J086J81j162r53
$$ 728 918 -148 -821 -824 -85 902 812 -138 -780 -773 29 838 937 3 -974 -649 -169 917 1098 -64 -1017
2733a017J01P07Q58J60o73j210N3J037O91M10q76j101m7P82R46L81j000q42n77
$$ -1017 -916 -209 649 809 136 -1074 -1021 16 707 1117 241 -860 -907 -125 821 1202 202 -640 -1217
2752a217J043R78ro56j139J10M70R98M27p45r51k53N80R16N84q17j396K90M48
$$ -1217 -174 804 795 139 -1000 -890 -420 578 1005 260 -691 -944 -364 552 1136 319 -1077 -787 -339
2771c39J005K98p06j176p3P25Q34N59o90j051n51P32R75M27n73j044k58M30J354
$$ -339 666 964 258 -918 -991 -266 568 1127 437 -614 -1165 -433 542 969 396 -648 -906 -476 878
2790H78K79p69j060l94N91J071O62p26j233m12O04J075M38o61q63n72N06J027
$$ 878 1157 388 -672 -1066 -475 596 1258 532 -701 -1113 -509 566 1004 343 -520 -1092 -586 441
2808D41M78m98o52q06K27J352M28n01j084l59N92Q21P16n47j062o04N00Q72O89
$$ 441 919 421 -231 -1037 -810 542 970 469 -615 -974 -382 439 1155 608 -454 -1058 -558 314 1003
2827A003l38r39q16O57R20O56m30q83q23L05J057M65%j068q34K93R77R06l76j149
$$ 1003 665 -274 -1090 -433 487 1143 713 -170 -993 -688 369 834 834 -234 -1068 -775 202 1108 732 -417
2847d17m71J50Q48Q85j29j202q17L18R32P49K35r67r64l06J350O32m6q69p22L3
$$ -417 -888 -738 110 995 866 -336 -1153 -835 97 846 1081 114 -850 -1156 194 826 780 -89 -811 -778
2867g78Q27J002m01o51q90j46R51O40K96j015o74j48J063N89J23q81r02k57J350
$$ -778 49 1051 650 -1 -891 -1037 -86 554 850 -165 -839 -987 76 665 788 -93 -995 -1252 98
2886I8N48M3m53j255Q2P82J010o2m98j087j83O67J038K91q43j018P9O34Q56L93
$$ 98 646 689 236 -1019 -937 -155 855 793 295 -792 -975 -308 730 1021 178 -840 -761 -127 729 1122
2906A122p04r74m67R49N48K71n37j076k67Q39R69L40o29q37p46Q39R44M08p60
$$ 1122 418 -556 -1023 -74 474 745 208 -868 -1135 -296 673 1013 384 -453 -1199 -360 584 992 232
2925B32o73o21Q13P50N20n80j197l15P85Q83M75p36j041m7K31J138M78o36r72
$$ 232 -441 -1062 -249 501 1021 441 -756 -1071 -286 597 1072 336 -705 -752 -521 617 1095 459 -513
2944e13o24P83R63L76k71j237n61M19J197O20o01r19q64N63J038O33k58j223n41
$$ -513 -1137 -354 609 985 714 -523 -1084 -665 532 1152 551 -368 -1232 -669 369 1002 744 -479 -1020
2963a020K34J122N28l53q76p20N92Q12N05l83p74p12M61R89P20m05r76r58N50
$$ -1020 -786 336 864 511 -365 -1085 -493 319 824 441 -333 -1045 -584 405 1125 720 -256 -1214 -664
2982f64Q94Q02l94p74j005N34J024M04l38p97l52l4P87R22l41q48n82J32P90O51
$$ -664 230 1032 638 -136 -1141 -607 417 821 483 -314 -666 -700 87 1009 668 -180 -762 -630 160 811
3002H11M3r14p51OJ080M96M6j028p62K40O30Q68L5r64n77k20J051P93k2q93q91
$$ 811 854 -60 -811 -805 275 771 817 -211 -973 -733 -103 765 800 -164 -741 -961 90 883 861 -32 -923
3023i23J80P83P22J30r79q08J64N47Q35K72p55q17l36Q82Q02J75p56r96P7N92
$$ -923 -743 40 762 892 -87 -895 -731 -184 651 923 168 -649 -985 -103 699 874 118 -878 -801 -209
3043b09J062j60o48r27p2N99J117Jn56j034J31L96R61K12n23r69j48N41J090K00
$$ -209 853 693 45 -882 -954 -355 762 763 207 -827 -696 -300 661 873 350 -619 -767 -226 864 1064
3063A064p47r13n11O97J056K73m91j164k68P15Q77N27o78j092l34N10J001O67
$$ 1064 317 -596 -1107 -410 646 919 428 -736 -1004 -289 588 1115 437 -655 -989 -479 522 1189
3081A189p45p69p12O18P61P09n74j081k83N74R95M27m08j269l39L62J182N58o75
$$ 1189 444 -325 -1037 -419 342 1051 477 -604 -887 -313 682 1109 701 -568 -907 -545 637 1195 520
3100E20r79o18M13J047O63p13n50p46J70R99P87m60r34n17K19J128M73j1j246
$$ 520 -459 -1077 -664 383 1046 333 -217 -963 -793 206 993 533 -401 -918 -699 429 902 891 -355
3119c55m34K34R18N81j16j146n41m0J190N94k85q49m78N1O61R10m05p94n37J13
$$ -355 -789 -555 363 944 828 -318 -859 -899 291 885 600 -249 -727 -676 -15 895 490 -304 -841 -728
3139g28J074N72k44q70r24K14J072P91k60r93n79j2J083R06j66j002q49K50J018
$$ -728 346 918 674 -196 -1120 -906 166 957 697 -296 -875 -887 196 1102 936 -66 -915 -665 353
3158C53M79O7j009m92m15J040Q16J3r10p37K59N35Q67J2q58q83j10O93J236r1
$$ 353 832 899 -110 -602 -1017 23 839 852 -58 -795 -536 -1 866 878 20 -863 -973 -280 956 865
3178H65q74j059J57O85J027j61m29q84j43N80R19J20p00o50m08N40Q30O49p04
$$ 865 -9 -1068 -911 -226 801 640 211 -673 -816 -236 683 803 103 -547 -955 -415 415 1064 360
3197C60p76m51O32J102M0o41j082r5O01R78K98o08r15n18P31P98M48l59j285M6
$$ 360 -416 -867 -235 867 907 266 -816 -911 -310 668 966 358 -557 -1075 -344 454 902 543 -742 -696
3217f96N01R13J0m31p15o55M46J365J58n17o48p17N54Q83M79m27j117o21Q49P99
$$ -696 -195 718 728 297 -418 -1073 -627 738 896 379 -269 -986 -432 451 930 503 -614 -1235 -386 413
3237D13M48l51j038j98K88Q90L26j41r03q53P97P18O72n85r64n08M17J031M84
$$ 413 861 510 -528 -726 -438 452 778 637 -266 -1119 -322 396 1068 483 -481 -989 -572 459 943
3256I43m25q67n85M60Q31M22M7j259m75J96J038N87l14r74m40O2P29J031n43n78
$$ 943 518 -349 -934 -474 357 779 826 -433 -908 -712 326 913 599 -375 -815 -753 -24 1007 464 -114
3276a14q96J98R00Q30n5r09q15P4P72R94l00p91r22L07O66Q12j15r20n71K08Q48
$$ -114 -1010 -812 88 918 863 -46 -861 -787 -15 979 679 -112 -1034 -727 -61 751 636 -284 -855 -647 201
3297B01P81p3q44r43q9J092O19Op32o10j80R48P31k33j006j89j84N09J175k04
$$ 201 982 909 65 -878 -967 125 744 750 18 -592 -772 176 907 674 -332 -521 -705 -196 979 775
3317G75p17r82J38J003N92L0p23p23m08P19J195Po60p97r3O24P58L1o11n55l08
$$ 775 58 -924 -786 217 809 839 116 -607 -1015 -296 899 906 246 -551 -644 -20 738 769 158 -397 -705
3338g05N75O00N50o07j121k69P53P22M78o58j037k52P44P59M19p61n89m45K35
$$ -705 -130 470 1020 413 -708 -977 -224 498 976 318 -719 -971 -227 532 951 190 -399 -844 -609
3357f09J289J21m94o72o16N81R06J81l50p99k27K00J108L35o44r69j80L59R64
$$ -609 680 801 307 -365 -981 -400 506 687 337 -462 -689 -489 619 954 310 -659 -839 -480 484
3376D84L13n34n49m32M1J005N53n90p45l97M61Q14N91o85q90m69N52P23O47l22
$$ 484 797 263 -286 -718 -677 328 881 291 -454 -851 -390 424 1015 330 -560 -1029 -477 246 893 571
3396E71r12n79M27Q95M45l31o51o54M08P00N78l48j016l22L82Q56M18k89q15n53
$$ 571 -341 -920 -493 402 847 516 -135 -789 -381 319 897 549 -467 -789 -407 449 867 578 -237 -790
3416g90J29P87O16l0j000m34K38P98L37j12p60o82L49P14N87n8q49o85J45P93
$$ -790 -661 126 742 712 -288 -722 -484 314 651 539 -221 -903 -554 160 747 689 -160 -845 -700 93
3436I3P06l2p14o27JO61M60K83r25o78M1O67Q88j45o87p58p1R92O98k58o44o00
$$ 93 799 767 53 -574 -573 88 548 831 -94 -772 -731 -64 824 679 -8 -766 -837 155 853 595 -49 -649
3458f49r2O15Q23J18p34q60J98O12O28K19q96n22k79P36N45M13p77p66j60O24
$$ -649 -741 -126 697 815 81 -779 -581 31 659 878 -18 -540 -819 -83 462 875 98 -668 -828 -204
3478b04R65O7o17n66l42M21P22N59p70q96k70P32R87j04m12j046K6L59Q22J63
$$ -204 761 828 211 -355 -697 -276 446 1005 235 -661 -931 -199 788 684 272 -774 -748 -389 433 596
3498E96l63o43l96P66M11L01l70p03m31N82N23O69p07p96j59L25R94J61n59p48
$$ 596 233 -410 -806 -40 371 672 302 -401 -832 -250 273 942 235 -561 -720 -395 599 760 201 -547
3518e47m85M12J001k3J71p95n13J70J267K18k77j028o26O92N34M78k43o54n21
$$ -547 -1032 -620 381 358 529 -266 -779 -609 658 876 599 -429 -1055 -363 171 649 406 -248 -769
3537g69K25P18Q14m96q35l70K11O12P00l22o45p67L53O98Q03m72n58p93L87P32
$$ -769 -544 174 988 492 -343 -713 -502 110 810 488 -157 -924 -571 127 930 458 -100 -893 -506 226
3557B26O16m26m66q64K12Q14N42k90o31k52k76P96R30m24m53q61K0R33Q34n64
$$ 226 842 416 -50 -914 -702 112 654 364 -267 -519 -795 1 931 507 54 -807 -787 146 980 416
3577D16n85m12k52Q29O80Q6n26j153K01P65M91p3m01o59j8Q40N47n6l90r75j60
$$ 416 -169 -581 -833 -4 676 762 236 -917 -716 49 540 467 66 -593 -611 229 776 720 330 -645 -805
3598h05O80R33o7p11n21j72M32R94j50n61n49k55N63P79n6m27q30n6P07M32K28
$$ -805 -125 808 741 30 -491 -663 -231 763 613 52 -497 -752 -189 590 534 107 -723 -779 -72 360 588
3619E88n54m35k25N89K48K55l60m10n24Q72N93k5m42p19k01N27P33K65o68n80
$$ 588 34 -401 -626 -37 211 466 106 -304 -828 44 637 612 170 -549 -750 -223 510 775 107 -473
3639d73j56K50J099m1o20m64k55L23N99N55n45p30m04N42O66N34m42q79l23M56
$$ -473 -629 -379 720 679 59 -405 -660 -337 262 817 272 -458 -862 -320 346 880 438 -441 -764 -308
3659c08Q20J90l28n75k80P0J096n6k26p84m37K98M67P33l20m64o04O11M48K51
$$ -308 512 702 374 -201 -481 -411 685 629 403 -381 -818 -520 -53 680 360 -104 -708 -97 351 602
3679F02k45r19k36K34Q59L87o5r45k51L6O32O89m19n03l43j6O43O17k93o27m05
$$ 602 357 -562 -798 -564 295 682 617 -328 -579 -543 89 778 359 -144 -487 -503 140 757 464 -163 -568
3700e68J50N05P24m82n15p70P58M30L94On93n54L6M58N00l6n15k81R6M04N59l26
$$ -568 -418 87 811 329 -186 -956 -198 232 626 632 39 -515 -479 -21 479 443 -72 -353 -257 147 706 380
3722C80m99n04k19Q00N74J86p08m69m7K64J001j19p45p85J86O12O37jn61o06j06
$$ 380 -119 -623 -842 -42 532 718 10 -459 -506 -242 759 640 -105 -890 -704 -92 545 544 -17 -623 -729
3743g29Q61L12J77o57m49j46M88N19L10o04n51K07K62O25k92k77n79k18O19N01
$$ -729 132 444 621 -36 -485 -631 -143 376 686 82 -469 -262 0 625 333 56 -523 -741 -122 379
3763C79J72m62m02j71J46R39R9n29m91k37M10M20L41o04n28k41J26J116K17m78
$$ 379 551 89 -313 -484 -338 601 700 171 -320 -557 -147 273 614 10 -518 -759 -633 483 700 222
3783B22n56j31K06N96L27m10o70j87K52O46L49l01n79k89M58M29K36j84q90m6
$$ 222 -334 -465 -259 337 664 254 -416 -603 -351 295 644 343 -236 -525 -67 362 598 414 -476 -522
3803e22J11R27K11m28p58J34o9O13L43l45m63m03K42P19K47j22n64o01K26Q03
$$ -522 -411 516 727 299 -459 -325 -394 219 562 217 -246 -649 -407 312 559 437 -127 -728 -502 301
3823C01M02l44m75n70L04L27O67m5o63l09J38N42K40j04m81m72j27P40N90j4o31
$$ 301 703 359 -116 -686 -382 -55 612 567 -96 -405 -267 275 515 411 -70 -542 -669 71 661 647 16
3844A6l50%M48N56k80o64k18M6M61L71J54p15m81o1O42O79k38k85n05J04M72M12
$$ 16 -334 -334 114 670 390 -274 -492 -446 15 386 540 -175 -656 -717 -75 604 366 81 -424 -320 152 564
3866E64n0n07l59m8K94N84j92l92n26J08M15O05K9m26o22o0P02M65O7n22o26L7
$$ 564 514 7 -352 -400 -106 478 286 -106 -632 -524 -109 496 525 99 -523 -583 119 584 651 129 -497 -460
3888d60K42Q24j74m11o01M8O59L56m3n8p04k99L40P22K37n85l93k38L59L92J59
$$ -460 -218 606 432 21 -580 -532 127 483 440 382 -322 -621 -281 441 678 93 -300 -538 -179 213 372
3909C72rq60k73O62K57M24m12n83k63N31L17M98n53m03n87O69M08N45m66r56k0
$$ 372 363 -497 -770 -108 149 573 161 -422 -685 -154 163 661 108 -295 -882 -213 195 740 274 -682 -702
3930g02M92K95M23k23m65j93R8L97L00k75l22l75J90N71M23r8n54m99K16N78K95
$$ -702 -210 85 508 285 -180 -373 -275 122 422 147 -175 -550 -360 211 634 536 -18 -517 -301 277 572
3951E72l00n54k51K22N49J45k14l65l88L01K55M86j14m35m18Q6M86N37r1p08k4
$$ 572 272 -282 -533 -311 238 383 169 -196 -584 -283 -28 458 344 -91 -509 -423 63 600 509 -199 -223
3972b23k53O04L88m60j64n86L13P13j54L77m11o39j4N13M32k14m91j38o4O16M09
$$ -223 -476 128 516 56 -108 -694 -381 332 178 555 144 -495 -509 4 436 222 -269 -407 -471 145 554
3993E54o2n36j16j97L66L79O6m32l08J9L7O23Q5m90l68k21P59K39m0l20k40l56
$$ 554 492 -44 -160 -357 9 388 454 22 -286 -267 -230 393 478 -12 -380 -601 158 397 357 37 -203 -559
4015e59M42M48j1k96n90l4N56M60M7m18m37j88M88L17L12j22r50J26K60K34L16
$$ -559 -117 331 320 24 -566 -600 -44 416 463 45 -392 -580 -92 225 537 415 -535 -409 -149 85 401
4036D01m86j87k43M13N20k18j11l55j93K45L70L09n5n14m72L39O66J03k53n99
$$ 401 -85 -272 -515 -102 418 200 89 -266 -459 -214 156 465 410 -104 -576 -237 429 532 279 -320
4056c20N6n9M97J93r3l65n73M34P30l20J89r59J91L93L03K67l94l56l25K30P80
$$ -320 -264 -323 174 367 274 -91 -664 -230 500 180 369 -590 -399 -6 297 564 170 -186 -511 -281 499
4077D99j68j37k44k33J70J11O13l33k67l99K63M46j11j5l92l04J97N55J37n4l54
$$ 499 331 194 -50 -283 -113 -2 611 278 11 -388 -125 321 210 195 -197 -501 -304 251 388 334 -20
4098b0m71L81J90K48j28l24m05K86L5P03j62k21m68pL05L69j2m44j38OM40L65
$$ -20 -491 -110 80 328 200 -124 -529 -243 -208 495 333 112 -356 -363 -58 311 299 -145 -283 -277 163 528
4120E28j58m39j59j14L98L21o6k93m41l6N95L16j10k74n49K82J95L69R6l16l88
$$ 528 370 -69 -228 -342 56 377 311 18 -423 -459 136 452 342 68 -481 -199 -4 365 461 145 -243
4141b43P2K17J89J13j03n18l4K30J61J39k04l48l8J61O84l62K8l00j63K75L22
$$ -243 -171 46 235 348 245 -273 -307 -77 84 223 19 -329 -367 -206 478 116 144 -156 -319 -44 278
4162B78Nl83q9m8K99K32j65r4l9o36L38M09J51j18m55l0J12O83l47J00m03r9J17
$$ 278 283 -100 -189 -237 62 294 129 35 -4 -640 -302 107 258 140 -315 -345 -233 450 103 203 -200 -299 -182
4185a82L27L35l28n24Q9J91O51j05j71m39k06K71K4O12m09m10n5J85N00J60l76
$$ -182 145 480 152 -372 -283 -92 559 454 283 -156 -362 -91 -67 545 136 -274 -329 -144 356 516 140
4206A40k80m12M43L37L37l40j90k57j85P09j21K83o75o0Q8J96L48k56k18k79J59
$$ 140 -140 -552 -109 228 565 225 35 -222 -407 302 181 464 -211 -271 -183 13 361 105 -113 -392 -233
4227b33K76L27k57j03m35r8N58J05O1j30l86K25lM54l4l82j31p3K42K21P9l55
$$ -233 43 370 113 10 -425 -523 35 140 201 71 -315 -90 -93 361 327 -55 -186 -259 -17 204 283 -72
4249g2j73j16L77L33m9l80k82K56J50K02k1p1m21J6mN71O7m26r5j91N18Pn2r0
$$ -72 -245 -361 16 349 300 -80 -362 -106 44 246 225 154 -267 -251 -255 316 383 -43 -138 -329 189 196 144 54
4273E4m83J83K46L99j69l21k58O7K98L66k19j28j39j38K58K07n8j48l47Q3K85
$$ 54 -429 -246 0 399 230 -91 -349 -282 16 382 163 35 -104 -242 16 223 165 17 -330 -247 38
4294C8O8M88k57m89k53L58L40j9j82k33j63o5P22m3j39k27j61J04L68J2r3j42
$$ 38 106 594 337 -152 -405 -47 293 274 92 -141 -304 -369 353 310 171 -56 -217 -113 255 267 174 32
4316C2l39K55K26O4j34k03LJ80N5pom50J20QK89L03k54j76k08K10K17L4r4k31
$$ 32 -307 -52 174 238 104 -99 -96 84 139 132 126 -324 -204 -196 93 396 142 -34 -242 -32 185 219 125 -106
4340a06k53K5M32Q8k89o9m29L64L74K72o6n49J7J5J85J54J78m12j91N3L16K36
$$ -106 -359 -334 98 186 -103 -172 -601 -237 137 409 343 -206 -189 -174 11 165 343 -69 -260 -207 109 345
4362C45j53l61k81K13J62L32r7j76j31M7n9J88K43m13l8p6K90K18P0m30j81J74
$$ 345 192 -169 -450 -237 -75 257 160 -16 -147 -100 -159 29 272 -141 -179 -255 35 253 323 -107 -288 -114
4384a14M1P1K48o1n06J21J50K46r8j28k26q2K70L07Nj60l81j10M37K9J41p0k68
$$ -114 -73 -2 246 185 -321 -200 -50 196 98 -30 -256 -338 -68 239 244 84 -297 -407 30 59 200 130 -138
4407a38j65L52k6K61l97l10K16K87J21o9J5k39P1J90L3N9k95P9l02K82N5PL8l53
$$ -138 -303 49 23 284 -113 -423 -207 80 201 132 147 -92 -21 169 202 261 -34 45 -257 25 80 87 125 -228
4431b28J89l29M41qR3l42R6l6J19J15l9o8o7j68M02lJ23k60l06L38N6P5k83M8
$$ -228 -39 -368 73 65 158 -184 -88 -124 -5 110 71 3 -64 -232 170 167 290 30 -276 62 118 193 -90 -42
4455d2l53K88K75Qj15l00O5J72R3R6j23j15k45K56K12J18j22k69k06J37K3L03
$$ -42 -395 -107 168 176 61 -239 -174 -2 91 187 64 -51 -296 -40 172 290 168 -101 -307 -170 -147 156
4477A56m2j60j52o8K11J46L2j43j34K63P9m2J99m14N9j50K1K01J16j58m21J99
$$ 156 114 -46 -198 -266 -55 91 123 -20 -154 109 188 146 345 -69 -10 -160 -139 62 178 20 -401 -202
4499b02J49j2O9J03l43J54n3J00K15k6P6m18K74L03j93q9k70J59m8K12j1j48K7
$$ -202 -53 -65 4 107 -236 -82 -135 -35 180 154 230 -188 86 389 196 107 -163 -4 -52 160 149 1 28
4522B8j32J38J71k5k17j01k1J09J02J11r5r7n2j03K27J16k96kj67J73L31m49L20
$$ 28 -104 34 205 180 -37 -138 -159 -50 52 163 68 -29 -81 -184 43 159 -137 -139 -306 -133 198 -251 69
4545F9k66o1K60K10j42j19j65J35J46K18k01mk43q7K24L64Q1j90k22k33J51k3
$$ 69 -197 -258 2 212 70 -49 -214 -79 67 285 84 80 -163 -250 -26 338 419 229 7 -226 -75 -98
4567i8M7J73k18jk1J59K53j90l19J69N0J1J84Q7j58j08m4J14K49j61j62j03j46
$$ -98 -51 122 -96 -97 -118 41 294 104 -215 -46 4 15 199 286 128 20 -24 90 339 178 16 -87 -233
4590b33K50J99k67r9l9J38J32lR8k12o3m7K00J61p1r1k46O1j15L72P3J4l03j18
$$ -233 17 216 -51 -150 -189 -51 81 78 176 -36 -99 -146 54 215 144 53 -193 -132 -247 125 198 212 -91 -209
4614b09L3K24rl9r2j11O6J64J14j6l61J28J18P6J2l88K45j41K39K91k72m8j11
$$ -209 -176 48 39 0 -92 -203 -137 27 141 125 -236 -108 10 86 98 -290 -45 -186 53 344 72 24 -87
4637h7m4n1L73k71J74j44j83J26K8J25J52k66j08K00j04M12j98J2l54O6K38Q3
$$ -87 -131 -182 191 -80 94 -50 -233 -107 -79 46 198 -68 -176 24 -80 332 134 146 -208 -142 96 179
4659A79j58l0P4j79J32J15j55nj34J51L7P8l4M7k97R0J65R1j31o3K54l39M9j5
$$ 179 21 -9 65 -114 18 133 -22 -27 -161 -10 27 105 71 118 -179 -89 76 167 36 -27 227 -112 -63 -78
4683g8K83j50l47J87K30L6l27Km8j03N74k95J53K0l26j14L99k8L71m20o4p1J54
$$ -78 205 55 -292 -105 125 161 -166 -164 -212 -315 259 -36 117 137 -189 -303 96 68 439 19 -45 -116 38
4706C8J45k89m7J9J07p6J48J66j90j62R4J15J96l15K14k86O4L44l16J38k18j52
$$ 38 183 -106 -153 -134 -27 -103 45 211 21 -141 -47 68 264 -51 163 -123 -59 285 -31 107 -111 -263
4728b63R7J35R8m1J58m31J50J54p9J68r7k59k4M03j29J12j38N3k43K22Mm6K19
$$ -263 -166 -31 67 26 184 -247 -97 57 -22 146 49 -210 -234 169 40 152 14 67 -176 46 50 4 223
4751B23k11j70J5L6J74K0m5k52q8L99J97l42J83k53J11MR6j50L7n4r1L88l3j78
$$ 223 12 -158 -143 -107 67 87 42 -210 -298 101 298 -44 139 -114 -3 1 97 -53 -16 -70 -161 227 194 16
4775A6P3l86K46J17K27k77n8j58L27k11K11nl98J44J38J7NK22k81L0j36p9K09
$$ 16 89 -297 -51 66 293 16 -42 -200 127 -84 127 122 -276 -132 6 23 28 250 -31 -1 -137 -216 -7
4798gK03m49J34L6L8J68M5k05l14J93M4M48r7k70j75J13j11L67j62p4M5j59J73
$$ -7 196 -253 -119 -83 -45 123 168 -37 -351 -158 -114 334 237 -33 -208 -95 -206 161 -1 -75 -30 -189 -16
4821a6K61J04n43L09l47j8K44J00p9j81L00k98P0K08J66k96j69J81J75Q6l11k07
$$ -16 245 349 -194 115 -232 -250 -6 94 15 -166 134 -164 -94 114 280 -16 -185 -4 171 257 -54 -261
4843b61M5J50J37j6j17K5K01j09J7J74r4k0l55M41j54J28k18n2N4j02J91L5r6
$$ -261 -216 -66 71 55 -62 -37 164 55 72 246 152 132 -223 218 64 192 -26 -78 -24 -126 65 100 4
4866Dj64O7K96k91p3J79Q7j44j38P1J82j4j27q4K39j8L7j21j24qm1K71k55K12
$$ 4 -160 -93 203 -88 -161 18 105 -39 -177 -106 76 62 -65 -149 90 72 109 -12 -136 -144 -185 86 -169 43
4890D3j15l9j4P0L05j47j42k05j11L59J20K0j4l16J80p6K13j48J63r3o9j85P8
$$ 43 -72 -111 -125 -55 250 103 -39 -244 -355 4 124 144 130 -186 -6 -82 131 -17 146 53 -16 -201 -123
4913a23K38K04m77J17Q1J47K37l45J3j05n8J40L34n69K6R9Q2J1J11j83p0j58J9
$$ -123 115 319 -158 -41 40 187 424 79 92 -13 -71 69 403 -166 -140 -41 41 52 163 -20 -90 -248 -229
4936b29M62j35j50qJqM01k9j84m36K0K44L83j47l38K2J3J97p9K18j88qo4j79K01
$$ -229 233 98 -52 -60 -59 -67 334 305 121 -315 -295 -51 332 185 -153 -131 -118 79 0 218 30 22 -42 -221 -20
4961b0J99k88O6j27K84lJ3jk43J4M6Q7M9O1q5j84L86k49K83j54j83q6j97O04j29
$$ -20 179 -109 -43 -170 114 111 124 123 -120 -106 -60 27 76 137 52 -132 254 5 288 134 -49 -135 -332 272 143
4986A43j3j62l60N40j43J2J19k74J55j80J0L07q9j43r7L3K33jN8Qk89J5J3K22
$$ 143 130 -32 -392 148 5 17 136 -138 17 -163 -153 154 65 -78 -175 -142 91 90 148 156 -133 -118 -105 117
5010A17L6k40j43L9M55k3k71Lj19LK6J75K51o3j47k80N2M29j82n2j67j39L82o5
$$ 117 153 -87 -230 -191 264 241 -30 -27 -146 -143 -117 58 309 246 99 -181 -129 300 118 66 -101 -240 142 77
5034G7P8j18l78j71N13J21L6m35L06K4j33K52K1j42j90K77l39J75J57ql71K39
$$ 77 155 37 -341 -512 1 122 158 -277 29 53 -80 172 193 51 -139 138 -201 -26 131 123 -248 -9
5056ij12K08K80n29K12k13J73p0JL1n9j48P1M15j26kj85r4%K22J67j44k66K8L7
$$ -9 -121 87 367 -162 50 -163 10 -60 -59 -28 -87 -235 -164 251 125 123 -62 -156 -156 66 233 89 -177 -149 -112
5081a12K18J66k42q0K1k62L12L92k93Pk66j82L49J12r4MN8j99K0N04j25k70j97
$$ -112 106 272 30 -50 -29 -291 21 413 120 127 -139 -321 28 140 46 50 108 -91 -71 433 308 38 -159
5104a59K43oo2R9j90n3R4L13j57k8N3k89l53N04K25M6n43k36K94K39J52j32O2
$$ -159 84 78 16 115 -75 -128 -34 279 122 94 147 -142 -495 9 234 280 -263 -499 -205 34 186 54 116
5127A16l37J57J39r4L38k37l40n9K62K88l48k9P7M8k9J13L3k20k26K13L43k0k5
$$ 116 -221 -64 75 -19 319 82 -258 -317 -55 233 -115 -144 -67 -19 -48 65 98 -122 -348 -135 208 188 163
5150A63K2l06r3M5L77P0j93k31K17j95L06K37l46j96j96L89O9L17m29j18j06m9
$$ 163 185 -121 -214 -169 208 278 85 -146 71 -124 182 419 73 -123 -319 70 139 456 27 -91 -197 -246
5172b46L46n8M0k3k31K68L6j56K89m56o7N14k27J6K41m73J6J50L47j60J13m96
$$ -246 100 42 82 59 -172 96 132 -24 265 -191 -258 256 29 45 286 -187 -171 -21 326 166 279 -217
5194b17j09P5K15L56m46Q4k43L71qJ2J98k61l38M32r7K62j01k62j09QJ86L53l31
$$ -217 -326 -251 -36 320 -126 -42 -285 86 78 90 288 27 -311 121 24 286 185 -77 -186 -178 8 361 30
5217C0k46J0Q6Q1Nlr8k53L77KJ86k9j45k96K57K08o6j05j12R8k08L62K04Om13
$$ 30 -216 -206 -120 -39 -34 -37 -135 -388 -11 -9 177 148 3 -293 -36 172 106 1 -111 -13 -221 141 345 351 -62
5242f2k16K29k23O25j88j87j44j38M02J23j62m53K81P8O1J91k56M0k39L3L54j8
$$ -62 -278 -49 -272 353 165 -22 -166 -304 98 221 59 -394 -113 -35 26 217 -39 1 -238 -205 149 131
5264A31J51l77O7k33M4M18k93K10j02k24K12K38j27k16j59M8L04KJ30j19k06J11
$$ 131 282 -95 -28 -261 -217 201 -92 118 16 -208 4 242 115 -101 -260 -212 92 94 224 105 -101 10
5286A0l0J57Q3k00j00k31K96L08l7m86q6Q6L3N80l38R1m2m88L78J86k3j09j75
$$ 10 -20 137 220 20 -80 -311 -15 293 256 -230 -316 -230 -197 383 45 136 94 -394 -16 170 147 38 -137
5309a37j5O4J77n8J6k76R1o1L96j77J37l33J22m4J86K97k82l32j05L25J42J62
$$ -137 -152 -88 89 31 47 -229 -138 -199 197 20 157 -176 -54 -98 88 385 103 -229 -334 -9 133 295
5331B95m14J36l2j72M70l8k93l2pM2j03L69k9k89P3l60P42k6l8m70pL5J22L21
$$ 295 -119 17 -15 -187 283 245 -48 -80 -87 -45 -148 221 192 -97 -24 -384 358 332 294 -176 -183 -148 -26 295
$$ [...]
8191B70
##END NTUPLES=NMR FID
##END=
