##TITLE=1H_SR40_oil3
 CDCl3,8 sc, 
 11.03.2021
##JCAMPDX= 6.0         $$ Bruker NMR JCAMP-DX V2.0
##DATA TYPE= NMR FID
##DATA CLASS= NTUPLES
##ORIGIN= UXNMR, Bruker Analytische Messtechnik GmbH
##OWNER= root
$$ XWIN-NMR		Version 3.5
$$ Thu Mar 11 13:18:36 2021 Russian Standard Time (UT+4h)  she@DPX200
##.OBSERVE FREQUENCY= 200.131506
##.OBSERVE NUCLEUS= ^1H
##.DELAY= (6, 6)
##.ACQUISITION MODE= SIMULTANEOUS
##.ACQUISITION SCHEME= undefined
##.AVERAGES= 8
##.DIGITISER RES= 18
##SPECTROMETER/DATA SYSTEM= spect
##.PULSE SEQUENCE= zg30
##.SOLVENT NAME= CDCl3
##.SHIFT REFERENCE= (INTERNAL, CDCl3, 0, 15.7039)
##AUDIT TRAIL= $$ (NUMBER, WHEN, WHO, WHERE, WHAT)
$$ ##TITLE= Audit trail, XWIN-NMR		Version 3.5
$$ ##JCAMPDX= 5.01
$$ ##ORIGIN= Bruker BioSpin GmbH
$$ ##OWNER= she
$$ F:/spectra/data/she/nmr/H-F/1/audita.txt
$$ ##AUDIT TRAIL=  $$ (NUMBER, WHEN, WHO, WHERE, WHAT)
(   1,<2021-03-11 13:17:42.93 +0400>,<she>,<DPX200>,
      <created by zg, POWCHK disabled, PULCHK disabled
       configuration hash MD5:
       00 E9 B6 7A A2 85 ED C7 34 08 36 98 17 FE 4E 26
       data hash MD5: 16K
       CB F3 20 E0 9A 1E 0B C7 2E 7D C5 37 87 87 78 2D>)
$$ ##END=
$$ 
$$ hash MD5
$$ 12 15 16 B1 E8 65 51 84 60 08 94 14 5B 5F 1C AD
##$RELAX= 
##$RELAX= 
##$RELAX= 
##$RELAX= 
##$RELAX= 
##$RELAX= 
$$ Bruker specific parameters
$$ --------------------------
##$DU= <F:/spectra>
##$EXPNO= 1
##$NAME= <H-F>
##$PROCNO= 1
##$TYPE= <nmr>
##$USER= <she>
##$AMP= (0..31)
100 100 100 100 100 100 100 100 100 100 100 100 100 100 100 100 100 100 
100 100 100 100 100 100 100 100 100 100 100 100 100 100 
##$AQSEQ= 0
##$AQ_mod= 1
##$AUNM= <au_zg>
##$AUTOPOS= <>
##$BF1= 200.13
##$BF2= 200.13
##$BF3= 200.13
##$BF4= 200.13
##$BF5= 200.13
##$BF6= 200.13
##$BF7= 200.13
##$BF8= 200.13
##$BYTORDA= 1
##$CFDGTYP= 0
##$CFRGTYP= 5
##$CHEMSTR= <none>
##$CNST= (0..31)
1 1 145 1 1 1 1 1 1 1 1 1 1 1 1 1 1 1 1 1 1 1 1 1 1 1 1 1 1 1 1 1 
##$CPDPRG= <>
##$CPDPRG1= <>
##$CPDPRG2= <>
##$CPDPRG3= <>
##$CPDPRG4= <mlev>
##$CPDPRG5= <mlev>
##$CPDPRG6= <mlev>
##$CPDPRG7= <mlev>
##$CPDPRG8= <mlev>
##$CPDPRGB= <>
##$CPDPRGT= <>
##$D= (0..31)
0 1.2 0 0 0 0 0 0 0 0.06 0 0.03 0 0 0 0 0.0002 0 0 0 0 0 0 0 0 0 0 0 0 
0 0 0 
##$DATE= 1615454262
##$DBL= (0..7)
120 120 120 120 120 120 120 120 
##$DBP= (0..7)
150 150 150 150 150 150 150 150 
##$DBP07= 0
##$DBPNAM0= <>
##$DBPNAM1= <>
##$DBPNAM2= <>
##$DBPNAM3= <>
##$DBPNAM4= <>
##$DBPNAM5= <>
##$DBPNAM6= <>
##$DBPNAM7= <>
##$DBPOAL= (0..7)
0.5 0.5 0.5 0.5 0.5 0.5 0.5 0.5 
##$DBPOFFS= (0..7)
0 0 0 0 0 0 0 0 
##$DE= 6
##$DECBNUC= <off>
##$DECIM= 32
##$DECNUC= <off>
##$DECSTAT= 4
##$DIGMOD= 1
##$DIGTYP= 9
##$DL= (0..7)
0 120 120 120 120 120 120 120 
##$DP= (0..7)
150 150 150 150 150 150 150 150 
##$DP07= 0
##$DPNAME0= <>
##$DPNAME1= <>
##$DPNAME2= <>
##$DPNAME3= <>
##$DPNAME4= <>
##$DPNAME5= <>
##$DPNAME6= <>
##$DPNAME7= <>
##$DPOAL= (0..7)
0.5 0.5 0.5 0.5 0.5 0.5 0.5 0.5 
##$DPOFFS= (0..7)
0 0 0 0 0 0 0 0 
##$DQDMODE= 0
##$DR= 18
##$DS= 0
##$DSLIST= <SSSSSSSSSSSSSSS>
$$ [...]
##$SUBNAM2= <"">
##$SUBNAM3= <"">
##$SUBNAM4= <"">
##$SUBNAM5= <"">
##$SUBNAM6= <"">
##$SUBNAM7= <"">
##$SUBNAM8= <"">
##$SUBNAM9= <"">
##$SW= 16.9725357007746
##$SWIBOX= (0..15)
0 0 2 0 0 0 0 0 0 0 0 0 0 0 0 0 
##$SW_h= 3396.73913043478
##$TD= 16384
##$TD0= 1
##$TE= 0
##$TE2= 300
##$TE3= 300
##$TEG= 300
##$TL= (0..7)
0 120 120 120 120 120 120 120 
##$TP= (0..7)
150 150 150 150 150 150 150 150 
##$TP07= 0
##$TPNAME0= <>
##$TPNAME1= <>
##$TPNAME2= <>
##$TPNAME3= <>
##$TPNAME4= <>
##$TPNAME5= <>
##$TPNAME6= <>
##$TPNAME7= <>
##$TPOAL= (0..7)
0.5 0.5 0.5 0.5 0.5 0.5 0.5 0.5 
##$TPOFFS= (0..7)
0 0 0 0 0 0 0 0 
##$TUNHIN= 0
##$TUNHOUT= 0
##$TUNXOUT= 0
##$USERA1= <user>
##$USERA2= <user>
##$USERA3= <user>
##$USERA4= <user>
##$USERA5= <user>
##$V9= 5
##$VALIST= <valist>
##$VCLIST= <CCCCCCCCCCCCCCC>
##$VD= 0
##$VDLIST= <DDDDDDDDDDDDDDD>
##$VPLIST= <PPPPPPPPPPPPPPP>
##$VTLIST= <TTTTTTTTTTTTTTT>
##$WBST= 1024
##$WBSW= 4
##$XGAIN= (0..3)
0 0 0 0 
##$XL= 0
##$YL= 0
##$YMAX_a= 94571
##$YMIN_a= -56281
##$ZGOPTNS= <>
##$ZL1= 120
##$ZL2= 120
##$ZL3= 120
##$ZL4= 120
##$ABSF1= 10
##$ABSF2= 0
##$ABSG= 5
##$ABSL= 3
##$ALPHA= 0
##$AQORDER= 0
##$ASSFAC= 0
##$ASSFACI= 0
##$ASSFACX= 0
##$ASSWID= 0
##$AUNMP= <proc_1d>
##$AZFE= 0.1
##$AZFW= 0.1
##$BCFW= 1
##$BC_mod= 2
##$BYTORDP= 1
##$COROFFS= 0
##$CY= 11.3945322036743
##$DATMOD= 1
##$DC= 2
##$DFILT= <>
##$DTYPP= 0
##$F1P= 15.9154993809931
##$F2P= -4.1035820241983
##$FCOR= 0.5
##$FTSIZE= 0
##$FT_mod= 4
##$GAMMA= 1
##$GB= 0.15
##$INTBC= 1
##$INTSCL= 1
##$ISEN= 128
##$LB= 0.24
##$LEV0= 0
##$LPBIN= 0
##$MAXI= 10000
##$MC2= 0
##$MEAN= 0
##$ME_mod= 0
##$MI= 1.114404
##$NCOEF= 0
##$NC_proc= 0
##$NLEV= 6
##$NOISF1= 3.799351
##$NOISF2= 2.8
##$NSP= 1
##$NTH_PI= 0
##$NZP= 0
##$OFFSET= 15.70392
##$PC= 1
##$PHC0= -11115.5
##$PHC1= 7.000938
##$PH_mod= 1
##$PKNL= yes
##$PPARMOD= 0
##$PSCAL= 0
##$PSIGN= 0
##$REVERSE= no
##$SF= 200.130013532006
##$SI= 16384
##$SIGF1= 3
##$SIGF2= 2
##$SINO= 400
##$SIOLD= 16384
##$SREGLST= <1H.CDCl3>
##$SSB= 0
##$STSI= 0
##$STSR= 0
##$SW_p= 3612.71676300578
##$SYMM= 0
##$S_DEV= 0
##$TDeff= 0
##$TDoff= 0
##$TI= <>
##$TILT= no
##$TM1= 0
##$TM2= 0
##$TOPLEV= 0
##$USERP1= <user>
##$USERP2= <user>
##$USERP3= <user>
##$USERP4= <user>
##$USERP5= <user>
##$WDW= 1
##$XDIM= 8192
##$YMAX_p= 0
##$YMIN_p= 0
$$ End of Bruker specific parameters
$$ ---------------------------------
##NTUPLES= NMR FID
##VAR_NAME=  TIME,          FID/REAL,        FID/IMAG
##SYMBOL=    X,             R,               I
##VAR_TYPE=  INDEPENDENT,   DEPENDENT,       DEPENDENT
##VAR_FORM=  AFFN,          ASDF,            ASDF
##VAR_DIM=   8192,          8192,            8192
##UNITS=     SECONDS,       ARBITRARY UNITS, ARBITRARY UNITS
##FACTOR=    0.0002944,     1,               1
##FIRST=     0,             0,               0
##LAST=      2.4114304,     0,               0
##MIN=       0,             -56281,          0
##MAX=       2.4114304,     94571,           0
$$ Real data points
##PAGE= N=1
##DATA TABLE= (X++(R..R)), XYDATA
$$ plain form
0 0 0 0 0 0 0 0 0 0 0 0 0 0 0 0 -8 8 -8 8 -8 16 -16 16 -24 24 -32 40 -41 48 -56 64 -74 88 -96 112 -123 138
36 138 -156 176 -193 216 -240 267 -295 326 -362 398 -439 484 -534 587 -649 713 -785 867 -960
55 -960 1064 -1183 1319 -1483 1673 -1905 2192 -2560 3044 -3715 4706 -6315 9338 -16873 71628
70 71628 94571 -55926 67807 -4821 1262 76712 10592 47001 27716 13553 73323 -12448
82 -12448 22383 55967 17940 72683 26446 -502 42182 5485 41405 52914 7528 20444
94 20444 36078 26540 3370 20039 32982 7518 37832 22003 -16244 8040 13155 22704 7981
107 7981 -1070 18685 -18920 2250 19426 -24477 14586 6665 -17579 10757 -32030 -18946 12089
120 12089 -18136 6342 -7630 -33594 -8294 -17668 -8698 -8352 -21729 893 -20626 -30718 -8497
$$ packed form
0@%%%%%%%%%%%%%%qJ6j6J6j6K4l2L2m0M8n6P2q1Q9j04J20j38J62j84K08k35K61
36A38k94L32l69M09m56N07n62O21o88P60q37R23j018J121j236J362j498J652j827
55i60K024k247K502k802L156l578M097m752N604o759Q421j1021J5653k6211Q8501
70G1628K2943j50497J23733p2628O083P5450o6120L6409j9285j4163N9770q5771
82a2448L4831L3584l8027N4743m6237k6948M2684l6697L5920J1509m5386J2916
94B0444J5634r538k3170J6669J2943k5464L0314j5829l8247K4284N115R549j4723
107G981r051J9755l7605K1170J7176m3903L9063p921k4244K8336m2787J3084L1035
120A2089l0225K4478j3972k5964K5300r374Q970L46j3377K2622k1519j0092K2221
$$ plain form
133 -8497 -25328 -13820 4521 -15429 -17505 -19744 -24262 -11751 -9791 -9304 -8370 -19336 -16058 -12040
147 -12040 -19462 -10359 -4061 -6894 -4408 -15942 -18843 -7917 -9095 -1282 -383 -12190 -8058 -9646
161 -9646 -9909 -2624 -3253 1782 -1912 -7199 -4191 -10689 -4185 3882 606 2083 -4931 -7712 -2263 -2810
177 -2810 4554 3445 808 2418 -5592 -3171 -239 383 8673 4101 1666 1275 -4465 2347 5232 6490
193 6490 10016 1856 1954 1677 539 8312 6847 9372 10194 2537 4724 3201 5980 13700 9692 11193
209 11193 7608 2392 8422 7161 11754 14922 8652 11101 6087 4527 11137 8237 13718 14029 6047
224 6047 8569 4565 5840 12652 8915 11363 8714 2819 5965 3355 5442 9924 5847 6132 2461
239 2461 -1553 1467 1074 3308 4939 -211 -1645 -3685 -5193 -2271 -1355 -959 -2150 -5983 -7732 -8908
$$ packed form
133h497j6831J1508J8341j9950k076k239m518J2511J960M87R34j0966L278M018
147a2040p422R103O298k833K486j1534k901J0926j178P813Q99j1807M132j588
161i646k63P285o29N035l694n287L008o498O504Q067l276J477p014k781N449n47
177b810P364j109k637J610q010K421K932O22Q290m572k435l91n740O812K885J258
193F490L526q160R8k77j138P773j465K525Q22p657K187j523K779P720m008J501
209A1193l585n216O030j261M593L168o270K449n014j560O610k900N481L11p982
224F047K522m004J275O812l737K448k649n895L146k610K087M482m077K85l671
239B461m014L020l93K234J631n150j434k040j508K922R16L96j191l833j749j176
$$ plain form
255 -8908 -8005 -5343 -4622 -6474 -8646 -10751 -11808 -10601 -8116 -7345 -7595 -9855 -12575 -12816 -12060 -9911 -7484
272 -7484 -8029 -8873 -10407 -12246 -10742 -8520 -6527 -5587 -6363 -8693 -9033 -8691 -6242 -3335 -2999 -2745 -3837
289 -3837 -5215 -4108 -2547 -407 1357 750 91 -1287 -1635 1415 3219 4657 5091 3415 2697 2810 3265
306 3265 5420 6597 7189 6416 4283 3721 4899 6056 8132 8147 6646 5592 4348 4817 6129 6369 7162
323 7162 6382 4428 3148 3431 4165 5855 5826 4956 2954 1270 1611 2231 2609 3790 2908 1368 824 -708
341 -708 71 1498 1795 1653 -102 -1547 -1661 -1865 -743 515 12 -601 -1393 -2507 -1572 -1131 -426 502
359 502 -766 -1935 -2671 -2467 -1257 -167 -78 -170 -759 -1664 -1826 -1002 -467 887 -30 -648 -1128 -2073 -531
378 -531 718 173 1273 -182 -1001 -442 -953 -280 770 -289 12 -921 -2144 -692 -644 -91 594 -1056
$$ packed form
255h908R03K662P21j852k172k105j057J207K485P71k50k260k720k41P56K149K427
272g484n45q44j534j839J504K222J993R40p76k330l40L42K449K907L36K54j092
289c837j378J107J561K140J764o07o59j378l48L050J804J438M34j676p18J13M55
306C265K155J177N92p73k133n62J178J157K076J5j501j054j244M69J312K40P93
323G162p80j954j280K83P34J690k9q70k002j684L41O20L78J181q82j540n44j532
341g08P79J427K97j42j755j445j14k04J122J258n03o13p92j114R35M41P05R28
359E02j268j169p36K04J210J090Q9r2n89r05j62Q24N35J354r17o18m80r45J542
378e31J249n45J100j455q19N59n11O73J050j059L01r33j223J452M8N53O85j650
$$ plain form
396 -1056 -1465 -1735 -2289 -939 -1739 -1777 -612 -2535 -2829 -2253 -3291 -1066 -968 -2484 -2442 -3378 -3346 -2430 -2956
415 -2956 -1207 -2337 -3234 -1695 -3036 -3039 -1217 -1800 -932 -1480 -2837 -2345 -2277 -555 45 -989 -313 -306 -340
434 -340 353 -337 1777 1940 1201 2036 578 935 2207 2378 3925 2467 2463 2928 2303 4344 3865 2401 4556
453 4556 3879 3647 3508 2331 4691 4572 3850 4154 2363 3698 3793 2939 3877 2478 3035 2487 1551 2530 1089
472 1089 1521 2424 1022 1528 -796 -877 1487 -723 168 -1116 -2813 520 -2143 -2342 -1045 -3987 -349
489 -349 -2269 -4796 -1133 -4855 -2918 -1264 -5410 -1854 -4107 -5586 -1066 -4328 -3100 -2531 -4503 -1361
505 -1361 -3169 -4558 -1991 -3258 -1626 -1082 -4039 -1977 -1135 -1643 -758 -878 -1280 -167 -513 -589 786
522 786 0 65 2118 358 1250 1410 -489 2891 2637 583 2859 875 2873 3635 -6 3387 2941
$$ packed form
396a056m09k70n54J350q00l8J165j923k94N76j038K225R8j516M2r36L2R16n26
415b956J749j130q97J539j341lJ822n83Q68n48j357M92O8J722O00j034O76Pl4
434c40O93o90K114J63p39Q35j458L57J272J71J547j458mM65o25K041m79j464K155
453D556o77k32j39j177K360j19p22L04j791J335R5q54R38j399N57n48r36R79j441
472A089M32R03j402N06k324q1K364k210Q91j284j697L333k663j99J297k942L638
489c49j920k527L663l722J937J654m146L556k253j479M520l262J228N69j972L142
505a361j808j389K567j267J632N44k957K062Q42n08Q85j20m02J113l46p6J375
522G86p86O5K053j760Q92J60j899L380k54k054K276j984J998P62l641L393m46
$$ plain form
539 2941 1265 3948 992 1893 3614 615 3219 2650 467 2753 782 1033 3017 -118 989 1722
555 1722 142 1189 78 -796 1546 200 -1133 88 -1292 -734 579 -1921 -409 -12 -2493 -226
571 -226 -1620 -2344 273 -2637 -1021 71 -3207 -816 -1866 -2130 841 -2527 -1907 -122 -2511 79
587 79 -1109 -1683 928 -1144 -720 -187 -1095 835 -11 -92 1331 -351 419 817 483 1474 642 812 882
606 882 1064 1428 540 1654 1587 1274 1658 553 1452 2076 679 1600 840 984 1152 46 986 1144 171
625 171 941 63 190 194 -630 42 233 -202 -398 -1392 -563 -760 -983 -909 -1417 -754 -1298 -1905 -1580 -1526 -1304 -1225
647 -1225 -1527 -1013 -2177 -1805 -1106 -1862 -712 -1227 -1711 -758 -1406 -1150 -554 -1051 -60 -498 -1089 124 -523
666 -523 105 727 -194 687 640 184 978 824 1030 1425 1127 1372 1330 1044 1594 1925 1838 1681 1269 1616 2199
$$ packed form
539B941j676K683k956R01J721k999K604n69k183K286j971K51J984l135J107P33
555A722j580J047j111q74K342j346j333J221j380N58J313k500J512L97k481K267
571b26j394p24K617k910J616J092l278K391j050k64K971l368O20J785k389K590
587G9j188n74K611k072M24N33r08J930q46q1J423j682P70L98l34R91q32J70P0
606H82J82L64q88J114o7l13L84j105Q99O24j397R21p60J44J68j106R40J58r73
625A71P70q78J27Mq24O72J91m35j96r94Q29j97k23P4n08O63n44o07L25N4K22P9
647a225l02N14j164L72O99p56J150n15m84R53o48K56N96m97R91m38n91J213o47
666e23O28O22r21Q81m7m56P94j54K06L95k98K45m2k86N50L31q7j57m12L47N83
$$ plain form
687 2199 1743 1725 2068 1812 1785 1621 923 1552 1663 1433 1489 573 744 728 329 429 467 273 389 -244 -642 -241
709 -241 -778 -271 -759 -1379 -1073 -1421 -1527 -1304 -1509 -1310 -1531 -1967 -2024 -2102 -1946 -1359 -1765 -1784 -1871 -2152 -2037 -1864
731 -1864 -1461 -1299 -1580 -1400 -1600 -1571 -1255 -1087 -497 -539 -572 -703 -719 -247 -23 316 494 340 221 203 577 948
753 948 1352 1274 1208 951 993 1057 1275 1647 1845 1698 1816 1174 1289 1779 1682 1949 1937 1521 1163 1201 1169 1471 1569
776 1569 1507 1115 944 460 440 698 634 980 272 169 -208 -384 -375 -111 -186 -201 -1182 -936 -905 -910 -486 -729 -910
799 -910 -1341 -1336 -1351 -1372 -1072 -884 -952 -1222 -1410 -1486 -1133 -836 -876 -751 -691 -980 -996 -784 -260 -315 -54 -216 -212 -849
823 -849 -164 162 440 603 455 323 465 496 660 952 983 872 646 371 627 1168 1058 1093 1125 920 677 385
845 385 1048 898 942 786 477 96 253 224 372 640 145 -65 -212 -667 9 -334 -117 -107 -474 -528 -991 -1123
$$ packed form
687B199m56j8L43k56k7j64o98O29J11k30N6r16J71j6l99J00L8j94J16o33l98M01
709b41n37N07m88o20L06l48j06K23k05J99k21m36n7p8J56N87m06j9q7k81J15J73
731a864M03J62k81J80k00K9L16J68N90m2l3j31j6M72K24L39J78j54j19j8L74L71
753I48M04p8o6k57M2O4K18L72J98j47J18o42J15M90r7K67j2m16l58L8l2L02R8
776A569o2l92j71m84k0K58o4L46p08j03l77j76RK64p5j5r81K46L1nM24k43j81
799i10m31Nj5k1L00J88o8k70j88p6L53K97m0J25O0k89j6K12N24n5K61j62Mo37
823h49O85L26K78J63j48j32J42L1J64K92L1j11k26k75K56N41j10L5L2k05k43k92
845C85O63j50M4j56l09l81J57k9J48K68m95k10j47m55O76l43K17J0l67n4m63j32
$$ plain form
867 -1123 -594 -448 -823 -766 -1277 -1314 -1427 -945 -901 -481 -998 -1351 -1414 -1215 -1170 -794 -326 -384 -854 -793 -930 -703
889 -703 82 -124 -220 -109 -157 -329 163 429 608 831 423 486 493 517 1205 1436 1338 1278 779 885 1033 1279 1749
912 1749 1398 1305 1193 748 1038 1551 1552 1462 978 1126 589 613 759 1042 1147 1006 668 96 119 212 124 115 180 -278
936 -278 -459 -806 -459 -395 -570 -571 -703 -1208 -1213 -884 -1061 -774 -567 -1485 -1304 -1550 -1572 -1241 -1036 -926 -982 -1646 -1399
959 -1399 -1221 -1062 -550 -708 -750 -762 -1158 -903 -675 -569 -201 -518 -395 -190 -168 -258 77 385 428 386 -86 373
981 373 688 709 1100 762 734 826 594 705 1198 997 1291 1222 639 963 334 677 1604 840 820 557 78 888
1003 888 630 374 665 153 622 74 -677 235 290 -38 25 -616 -530 -403 -460 24 -477 -887 -487 -826 -1104
1024 -1104 -782 -1152 -545 -163 -800 -821 -1357 -857 -259 -668 -661 -437 -926 -679 -587 -831 10 -17 -259 25 -475
$$ packed form
867a123N29J46l75N7n11l7j13M82M4M20n17l53o3J99M5L76M68n8m70O1j37K27
889g03P85k06r6J11m8j72M92K66J79K23m08O3PK4O88K31r8o0m99J06J48K46M70
912A749l51r3j12m45K90N13Jr0m84J48n37K4J46K83J05j41l38n72K3R3q8rO5m58
936b78j81l47L47O4j75jj32n05nL29j77K87K07r18J81k46k2L31K05J10n6o64K47
959a399J78J59N12j58m2j2l96K55K28J06L68l17J23K05K2r0L35L08M3m2m72M59
981C73L15K1L91l38k8R2k32J11M93k01K94o9n83L24o29L43R27p64k0k63m79Q10
1003H88k58k56K91n12M69n48p51R12N5l28O3o41Q6J27n7M84n01m10M00l39k78
1024a104L22l70O07L82o37k1n36N00N98m09PK24m89K47R2k44Q41k7k42K84n00
$$ plain form
1045 -475 -175 241 -167 612 300 58 404 31 860 942 288 1111 1001 615 600 23 1066 1610 712 1053
1065 1053 654 986 1118 843 1037 1118 667 1018 666 74 713 342 588 453 11 -94 30 147 261 371
1085 371 -515 -260 -410 -677 -187 -886 -332 -271 -991 -878 -1082 -855 -456 -1112 -707 -659 -1675 -872 -892 -1274 -248
1106 -248 -1231 -1049 -521 -1622 -985 -769 -915 36 -1217 -1000 -623 -729 -22 -429 -616 399 -167 -551 37
1125 37 -136 427 463 382 482 608 170 743 644 947 1036 498 547 870 900 859 933 872 1204 599 560 1034 784 994
1149 994 863 594 913 351 771 917 224 732 642 234 468 290 -141 192 205 70 -70 -535 -175 -153 -492
1170 -492 131 -394 -728 -258 -1037 -569 -227 -824 -581 -684 -1188 -455 -667 -786 -549 -626 -494 -791 -657 -423
1190 -423 -427 -445 -250 -431 -383 -309 -350 46 59 48 188 -16 -104 94 -159 168 455 193 417 490 476 441 581 678
$$ packed form
1045d75L00M16m08P79l12k42L46l73Q29Q2o54Q23j10l86j5n77J043N44q98L41
1065A053l99L32J32k75J94Q1m51L51l52n92O39l71K46j35m42j05J24J17J14J10
1085C71q86K55j50k67M90o99N54O1p20J13k04K27L99o56M05M8j016Q03k0l82J026
1106b48r83J82N28j101O37K16j46R51j253K17L77j06P07m07j87J015n66l84N88
1125C7j73N63L6q1J00J26m38N73r9L03Q9n38M9L23L0m1P4o1L32o05l9M74k50K10
1149I94j31k69L19n62M20J46o93N08r0m08K34j78m31L33J3j35j40m65L60K2l39
1170d92O23n25l34M70p79M68L42n97K43j03n04P33k12j19K37p7J32k97J34K34
1190d23mj8J95j81M8P4m1L96J3j1J40k04q8J98k53L27K87k62K24P3j4l5J40R7
$$ plain form
1214 678 543 445 435 671 525 723 672 739 502 460 611 442 424 391 339 374 172 101 345 246 202 339 -74 63
1238 63 -52 -45 -174 -261 -159 -390 -527 -646 -693 -292 -666 -476 -545 -823 -945 -1027 -437 -339 -765 -651 -728 -726 -695 -752
1262 -752 -310 -562 -487 -655 -529 -497 -439 -312 -212 -168 -322 124 -35 191 87 72 208 180 126 245 229 420 499
1285 499 592 632 558 781 811 595 653 829 834 587 815 849 426 799 625 742 684 560 574 629 405 374 323 148
1309 148 88 51 324 69 -223 82 -91 -365 73 -465 -400 -155 -517 -566 -367 -645 -365 -494 -381 -658 -573 -766
1331 -766 -508 -792 -558 -552 -565 -450 -598 -438 -583 -225 -591 -438 -257 -427 -212 -323 -316 -374 -13 -40 -261 40
1353 40 -21 55 366 111 208 246 241 547 588 387 483 222 353 412 545 481 483 590 547 581 477 611 466 304 363
1378 363 630 451 421 426 372 61 266 449 125 97 -195 39 7 -253 -164 -139 -181 -289 -318 -385 -505 -472 -435 -862
$$ packed form
1214F78j35r8j0K36j46J98n1O7k37m2J51j69j8l3n2L5k02p1K44r9m4J37m13J37
1238F3j15Pj29q7J02k31j37j19m7M01l74J90o9k78j22q2N90R8m26J14p7KL1n7
1262g52M42k52P5j68J26L2N8J27J00M4j54M46j59K26j04j5J36k8n4J19j6J91P9
1285D99R3M0p4K23L0k16N8J76Nk47K28L4m23L73j74J17n8j24J4N5k24l1n1j75
1309A48o0l7K73k55k92L05j73k74M38n38O5K45l62m9J99k78K80j29J13k77Q5j93
1331g66K58k84K34Oj3J15j48J60j45L58l66J53J81j70K15j11Pn8L61k7k21L01
1353D0o1P6L11k55R7L8nL06M1k01R6k61J31N9J33o4KJ07m3L4j04J34j45j62N9
1378C63K67j79l0Nn4l11K05J83l24k8k92K34l2k60Q9K5m2j08k9o7j20L3L7m27
$$ plain form
1402 -862 -407 -406 -653 -203 -642 -652 -583 -586 -437 -626 -594 -513 -817 -613 -427 -452 -241 -270 -247 -311 -138 -133 -147 -65 106
1427 106 -23 74 298 264 155 281 274 378 259 382 383 150 341 780 437 492 145 412 745 542 649 570 386
1450 386 518 500 198 498 481 441 317 181 250 128 -98 247 59 -226 10 -139 75 60 -527 -291 81 -293
1472 -293 -232 -502 -459 -309 -431 -417 -400 -763 -637 -315 -636 -184 -509 -495 -366 -692 -470 -405 -637 -412 -397 -588
1494 -588 -259 -182 -80 154 -417 -284 237 -223 198 220 -140 508 205 3 470 143 429 470 35 662 297
1515 297 264 775 244 411 580 160 501 509 248 460 333 377 582 234 359 598 308 601 454 156 580
1536 580 28 131 273 -26 -87 78 -216 -169 -339 -270 148 -133 -266 -13 -465 -250 -147 -542 -274 -726 -735 -159
1558 -159 -763 -509 -441 -413 -291 -406 -687 -178 -314 -144 261 -315 -328 -605 -239 188 -413 -292 97 -105 -125
$$ packed form
1402h62M55Jk47M50m39j0O9lJ49j89L2Q1l04K04J86k5K11k9K3o4J73Nj4Q2J71
1427A06j29R7K24l4j09J26pJ04j19J23Jk33J91M39l43N5l47K67L33k03J07p9j84
1450C86J32j8l02L00j7m0j24j36O9j22k26L45j88k85K36j49K14j5n87K36L72l74
1472b93O1k70M3J50j22J4J7l63J26L22l21M52l25J4J29l26K22O5k32K25J5j91
1494e88L29P7J02K34n71J33N21m60M21K2l60O48l03k02M67l27K86M1m35O27l65
1515B97l3N11n31J67J69m20L41Qk61K12j27M4K05l48J25K39k90K93j47k98M24
1536E80n52J03J42k99o1J65k94M7j70O9M18k81j33K53m52K15J03l95K68m52rN76
1558a59o04K54O8K8J22j15k81N09j36J70M05n76j3k77L66M27o01J21L89k02k0
$$ plain form
1579 -125 -79 -111 282 207 -40 220 97 288 224 111 452 429 313 507 291 212 703 440 538 742 279 470
1601 470 379 412 723 201 276 484 320 118 77 307 261 -135 128 190 -208 -4 122 -2 61 -171 -243 -270 -329
1624 -329 72 -14 -521 -191 -562 -529 -166 -284 -343 -33 -612 -273 -217 -395 -379 -356 -385 -323 -436 -404 -85 -370 -124
1647 -124 -101 -246 -206 -213 32 45 -46 29 -137 -226 71 306 108 143 17 356 355 89 270 321 287 388 437 597 269
1672 269 233 284 296 541 245 142 476 280 -19 382 281 223 435 95 -9 -144 -20 145 -212 -28 50 -267
1694 -267 -271 -189 -269 -83 -260 -278 -246 -216 -456 -233 -308 -360 -370 -371 -330 -387 -441 42 -394 -278 -367 -463 -360 -196 -273 51
1720 51 124 -362 -112 -55 22 55 -23 -113 29 -44 -36 161 223 40 361 199 125 91 359 245 456 255 204 261 198
1745 198 467 438 243 550 45 260 172 207 355 489 203 63 112 217 154 99 320 305 187 96 -43 -88 7
$$ packed form
1579a25M6l2L93p5k47K60j23J91o4j13L41k3j16J94k16p9M91k63R8K04m63J91
1601D70r1L3L11n22P5K08j64k02m1K30m6l96K63O2l98K04J26j24O3k32p2k7n9
1624c29M01q6n07L30l71L3L63j18n9L10n79L39N6j78J6K3k9O2j13L2L19k85K46
1647a24K3j45M0pK45J3r1P5j66q9K97K35j98L5j26L39jk66J81N1l4J01M9J60l28
1672B69l6N1J2K45k96j03L34j96k99M01j01n8K12l40j04j35J24J65l57J84P8l17
1694b67mQ2q0J86j77j8L2L0k40K23p5n2j0jM1n7n4M83m36J16q9r6J03J64p7L24
1720E1P3m86K50N7P7L3p8r0J42p3QJ97O2j83L21j62p4l4K68j14K11k01n1N7o3
1745A98K69k9j95L07n05K15q8L5J48J34k86j40M9J05o3n5K21j5j18r1j39m5R5
$$ plain form
1768 7 19 85 -209 -267 -109 -48 -314 -251 -87 -216 -347 -298 -364 -235 -289 -89 -344 -446 -443 -404 -184 -350 -333 -242 -297
1793 -297 -435 -645 -212 -50 -228 76 -101 20 -252 -287 -26 -198 23 101 -11 22 -73 114 244 136 349
1814 349 346 221 245 251 224 500 219 92 317 248 391 498 495 575 276 166 25 146 106 359 54 190 400 -68
1838 -68 158 403 -17 -70 43 -54 59 -71 170 -107 151 -216 -242 -320 -145 111 -121 -72 -328 -444 -274 -99
1860 -99 -192 -37 -295 -72 -209 -346 -484 -341 -273 -109 -94 -366 -311 -229 -174 86 67 -67 -127 115 -137 237 82
1883 82 136 307 0 250 100 -9 165 231 518 140 224 75 278 319 509 276 241 528 204 204 304 34 285
1906 285 537 123 220 156 95 -1 127 17 -72 13 305 -44 -67 49 64 -35 12 -287 -296 -328 -304 -138 -448 -334 -127
1931 -127 -168 -177 -390 -399 -39 -350 -493 -349 -222 -104 -217 -361 -214 -442 -200 -153 -58 -233 -254 -179 -26 -241 -91
$$ packed form
1768GJ2O6k94n8J58O1k66O3J64j29j31M9o6J29n4K00k55j02LL9K20j66J7R1n5
1793b97j38k10M33J62j78L04j77J21k72l5K61j72K21P8j12L3r5J87J30j08K13
1814C49lj25K4Ok7K76k81j27K25o9J43J07lQ0k99j10j41J21m0K53l05J36K10m68
1838f8K26K45m20n3J13r7J13j30K41k77K58l67k6p8J75K56k32M9k56j16J70J75
1860i9r3J55k58K23j37j37j38J43O8J64J5k72N5Q2N5K60j9j34o0K42k52L74j55
1883H2N4J71l07K50j50j09J74O6K87l78Q4j49K03M1J90k33l5K87l24%J00k70K51
1906B85K52m14R7o4o1r6J28j10q9Q5K92l49k3J16J5r9M7k99rl2K4J66l10J14K07
1931a27m1rk13rL60l11j43J44J27J18j13j44J47k28K42M7R5j75k1P5J53k15J50
$$ plain form
1954 -91 239 -265 -124 220 123 74 278 214 143 274 77 480 62 131 303 255 312 257 218 150 184 412 459 126
1978 126 131 47 142 119 176 328 75 254 265 122 -33 -3 -39 -34 392 -74 203 -61 -318 -173 -127 -223 -130 11 -137
2003 -137 -210 -161 -173 -235 -296 -361 -324 -380 18 -192 -189 -131 -90 -245 -240 -356 -27 -33 -433 -127 -182 -151 -122 -89 11 125 44
2030 44 10 -67 35 326 205 -22 45 3 399 100 200 203 118 294 115 66 193 253 124 474 244 69 79 29
2054 29 302 233 332 78 300 18 148 178 73 -17 54 48 21 -32 115 -49 70 -10 -204 -82 -43 -235 -72 -165
2078 -165 -172 -143 -275 -210 -97 -290 -220 -192 -85 -164 -280 -369 -366 -133 -319 -232 63 -147 36 -185 -372 -62 11 -125
2102 -125 -171 100 23 27 -191 207 98 306 63 -5 237 47 43 -57 127 385 253 73 292 190 371 52
2124 52 144 294 378 264 -20 431 210 204 248 156 166 40 92 132 173 276 125 185 -126 -233 -16 -145 19 19 -115
$$ packed form
1954i1L30n04J41L44r7m9K04o4p1J31j97M03m18O9J72m8N7n5l9o8L4K28M7l33
1978A26Nq4R5k3N7J52k53J79J1j43j55L0l6NM26m66K77k64k57J45M6r6R3J41j48
2003a37p3M9j2o2o1o5L7n6L98k10LN8M1j55Nj16L29om00L06n5L1K9L3J00J14q1
2030D4l4p7J02K91j21k27O7m2L96k99J00Lq5J76j79m9J27O0j29L50k30j75J0n0
2054B9K73o9R9k54K22k82J30L0j05r0P1ok7n3J47j64J19q0j94J22L9j92J63r3
2078a65pK9j32O5J13j93P0K8J07p9j16q9LK33j86Q7K95k10J83k21j87L10P3j36
2102a25m6K71p7Mk18L98j09K08k43o8K42j90mj00J84K58j32j80K19j02J81l19
2124E2R2J50Q4j14k84M51k21oM4r2J0j26N2M0M1J03j51O0l11j07K17j29J64%j34
$$ plain form
2149 -115 -53 -170 -162 -257 45 -108 -169 -282 -301 -165 -45 -250 -182 -174 -402 -110 -150 -153 -27 -267 -385 -15 -207 -112
2173 -112 45 -123 -112 -180 -16 -47 135 -291 -4 -25 94 223 140 50 81 65 141 133 199 -25 -52 219 338 463
2197 463 105 260 199 105 42 90 -15 268 338 -50 25 -148 17 -239 233 211 44 88 144 -82 69 -95 -104 -56
2221 -56 81 -45 -9 -7 -301 -347 -210 -273 -59 -80 -249 -240 -163 -182 -154 -201 -155 -105 -213 -156 -120 -110 -241 -283 -74 -154 -261
2248 -261 -147 -337 -189 196 20 60 -28 145 -113 40 127 -111 121 10 -145 200 342 150 381 102 550
2269 550 187 90 89 164 200 39 50 310 282 143 457 392 105 505 132 76 21 107 167 28 53 103 127 -20 4
2294 4 -74 -54 123 -84 -13 -258 -17 -116 -364 -255 -165 -204 -32 -412 -193 -190 -295 -157 -236 -245 -246 -333 -295 -358 -237 -283
2320 -283 -21 -156 46 93 -99 31 -210 230 -122 -96 -195 -69 -29 -51 8 -12 197 138 2 54 169 336 161
$$ packed form
2149a15O2j17Qr5L02j53o1j13j9J36J20k05O8Qk28K92m0lJ26k40j18L70j92R5
2173a12J57j68J1o8J64l1J82m26K87k1J19J29q3r0L1j6P6qO6k24k7K71J19J25
2197D63l58J55o1r4o3M8j05K83P0l88P5j73J65k56M72k2j67M4N6k26J51j64rM8
2221e6J37j26L6Kk94m6J37o3K14k1j69RP7j9K8m7M6N0j08N7L6J0j31m2K09q0j07
2248b61J14j90J48L85j76M0q8J73k58J53Q7k38K32j11j55L45J42j92K31k79M48
2269E50l63r7jP5L6j61J1K60k8j39L14o5k87M00l73n6n5Q6O0j39K5N0K4j47K4
2294Dp8K0J77k07P1k45K41r9k48J09R0l9J72l80K19Lj05J38p9rjq7L8o3J21m6
2320b83K62j35K02M7j92J30k41M40l52K6r9J26M0k2N9k0K09n9j36N2J15J67j75
$$ plain form
2343 161 -3 330 -59 140 65 -10 28 221 -52 348 156 151 -101 -1 150 245 88 -150 143 35 44 48 -70
2366 -70 175 -36 -120 -194 60 1 -214 48 63 89 64 -142 -48 -228 -192 -132 83 -160 -243 -207 -215 -181 -183 -118 -74 -104 2
2393 2 -309 -217 -58 -137 -33 70 -73 -230 -72 -83 65 -17 -86 -123 44 32 -34 51 261 217 -14 46 -50 125 164
2418 164 286 88 247 150 269 144 231 447 84 409 96 -60 -44 -124 222 62 90 211 -105 -122 -107 88
2440 88 -27 24 47 -115 -66 170 68 -9 -230 32 -5 -183 -178 -234 -297 -204 -243 -32 -54 -90 -127 -409 -128 32 -15
2465 -15 -327 -89 -241 -232 -342 -204 -71 -326 -171 34 -251 -69 -106 -22 172 -2 179 -146 2 -94 -107 -130 -87
2488 -87 57 96 -127 -137 308 57 418 100 93 113 103 189 292 61 19 116 275 246 119 55 177 125 128 -125 -117 245
2514 245 162 42 -40 234 -41 -156 289 35 121 144 -217 -128 84 -189 -151 -140 -79 7 -320 -136 -98 -56 35 39 -59
$$ packed form
2343A61j64L33l89J99p5p5L8J93k73M00j92nk52J00J51R5j57k38K93j08RMj18
2366g0K45k11q4p4K54n9k15K62J5K6k5k06R4j80L6O0K15k43q3L6qL4kO5M4l0J06
2393Bl11R2J59p9J04J03j43j57J58j1J48q2o9l7J67j2o6Q5K10m4k31O0r6J75L9
2418A64J22j98J59r7J19j25Q7K16l63L25l13j56J6q0L46j60K8J21l16j7J5J95
2440H8j15N1K3j62M9K36j02p7k21K62l7j78Nn6o3R3l9K11k2l6l7k82K81J60m7
2465a5l12K38j52Rj10J38J33k55J55K05k85J82l7Q4J94j74J81l25J48r6j3k3M3
2488h7J44L9k23j0M45k51L61l18pK0j0Q6J03k31m2R7J59k9j27o4J22n2Lk53QL62
2514B45q3j20q2K74k75j15M45k54Q6K3l61Q9K12k73L8J1O1Q6l27J84L8M2R1Mr8
$$ plain form
2539 -59 -101 -218 -119 -251 -123 -384 -386 -150 -122 -470 -162 -104 -64 -282 167 96 -105 -278 -162 212 25 -47 52 22
2563 22 302 -74 60 -78 242 -55 196 145 212 155 351 174 -46 201 153 229 194 -60 148 194 -78 115 -46
2586 -46 129 220 97 49 -29 44 -173 35 238 -123 89 7 -150 -75 -79 -179 -153 173 73 -206 -266 -39 -393 -169
2610 -169 -64 137 -241 -329 3 8 -64 -114 -240 -206 -82 -368 -194 59 -127 -23 -28 60 54 -46 -10 -35 -59 -57 313
2635 313 -101 145 207 127 128 -176 96 69 138 188 27 30 257 290 186 156 227 257 257 347 64 197 95 370 -92
2660 -92 173 395 169 41 217 112 -44 44 284 89 -108 -244 -28 75 25 90 16 97 52 8 -23 220 -12
2683 -12 -17 -53 21 -187 60 83 4 40 -115 -174 -101 -134 -99 -26 -14 -126 -108 -156 -253 -100 9 276 -49 -159 -79 -198
2709 -198 -155 164 166 -24 94 310 117 91 -57 150 93 244 -129 -47 17 73 212 67 24 55 -23 5 -20 196
$$ packed form
2539e9m2j17R9j32J28k61kK36K8l48L08N8M0k18M49p1k01j73J16L74j87p2R9l0
2563B2K80l76J34j38L20k97K51n1O7n7J96j77k20K47m8P6l5k54K08M6k72J93j61
2586d6J75R1j23m8p8P3k17K08K03l61K12q2j57P5mj00K6L26j00k79o0K27l54K24
2610a69J05K01l78q8L32Np2n0j26L4J24k86J74K53j86J04nQ8oj00L6k5k4KL70
2635C13m14K46O2q0Jl04K72k7O9N0j61LK27L3j04l0P1L0%R0k83J33j02K75m62
2660i2K65K22k26j28J76j05j56Q8K40j95j97j36K16J03n0O5p4Q1m5m4l1K43k32
2683a2nl6P4k08K47K3p9L6j55n9P3l3L5P3J2j12J8m8r7J53J09K67l25j10Q0j19
2709a98M3L19Kj90J18K16j93k6j48K07n7J51l73Q2O4N6J39j45m3L1p8K8k5K16
$$ plain form
2733 196 -60 142 -61 -182 136 -273 -46 -72 45 -97 -266 49 147 -77 -4 144 -176 -55 -88 -84 -81 -169 -89
2756 -89 -49 -73 82 73 -32 -222 -18 -203 -150 -27 -140 -335 -37 -152 -4 92 -87 -202 -1 119 -103 74
2778 74 -88 129 -25 -111 -135 152 256 -143 58 114 260 92 63 5 35 80 365 177 -91 140 -41 -146 65
2801 65 263 134 200 74 228 182 -75 78 323 172 -16 157 -55 108 -74 -86 202 -28 -25 -29 -10 -68 114
2824 114 13 46 58 -64 -144 134 -386 -262 -126 -70 -173 -171 -204 -206 40 23 -355 -124 -192 48 -414 91 29 -93
2848 -93 -8 30 60 -46 -158 -49 -12 -160 -55 -334 1 -4 20 145 -77 186 81 129 315 79 -30 67 229
2871 229 155 104 106 104 73 278 109 -83 -27 -13 70 237 135 149 17 103 374 65 77 260 48 -54 11 -153 196
2896 196 8 53 47 -48 -25 38 -30 -17 79 -111 -92 19 -39 -92 -95 -181 -486 -34 -119 -69 12 153 -213 141 -238 -106
$$ packed form
2733A96k56K02k03j21L18m09K27k6J17j42j69L15R8k24P3J48l20J21l3MLq8Q0
2756h9M0k4J55rj05j90K04j85N3J23j13j95K98j15J48R6j79j15K01J20k22J77
2778G4j62K17j54q6k4K87J04l99K01N6J46j68k9n8L0M5K85j88k68K31j81j05K11
2801F5J98j29O6j26J54m6k57J53K45j51j88J73k12J63j82j2K88k30LmJ9n8J82
2824A14j01L3J2j22q0K78n20J24J36N6j03Kl3kK46j7l78K31o8K40m62N05o2j22
2848i3Q5L8L0j06j12J09L7j48J05k79L35nK4J25k22K63j05M8J86k36j09R7J62
2871B29p4n1Kkl1K05j69j92N6J4Q3J67j02J4j32Q6K71l09J2J83k12j02O5j64L49
2896A96j88M5or5K3O3o8J3R6j90J9J11n8n3lq6l05M52q5N0Q1J41l66L54l79J32
$$ plain form
2922 -106 -164 -59 -152 -32 -184 -89 91 -128 -32 -116 203 -143 105 100 227 391 52 -28 272 162 -185 207 88
2945 88 -11 79 73 -216 234 -26 69 -53 53 135 17 46 167 34 -26 3 27 -84 -52 -273 186 144 245 325 24
2970 24 10 -88 -4 -4 4 -216 244 28 -186 -245 55 193 -90 -291 -108 31 -106 98 -161 10 -198 -208 -225 -137
2994 -137 -63 72 -51 57 -46 43 81 -50 -45 -92 138 -137 89 -263 -132 13 -88 184 107 91 48 59 115 -155
3018 -155 175 -8 213 82 -78 329 100 222 58 134 81 76 209 16 308 119 -58 197 218 34 150 -140
3040 -140 -28 289 151 -44 -91 -276 -41 -13 -65 -118 113 -112 -75 -234 -129 -42 -142 -218 -281 -158 -3 -81 -82 58
3064 58 -270 -30 14 -136 -141 -170 -167 14 -244 118 -91 -88 -174 138 -241 -13 -7 74 60 -81 -277 -9 -91 -152 246
3089 246 -24 49 -136 39 101 245 65 -56 45 276 129 -104 66 86 83 137 -105 234 285 15 265 91
$$ packed form
2922a06n8J05r3J20j52R5J80k19R6q4L19l46K48nJ27J64l39q0L00j10l47L92j19
2945H8r9R0ok89M50k60R5j22J06Q2j18K9J21j33o0K9K4j11L2k21M59m2J01Q0l01
2970B4j4r8Q4%Qk20M60k16k14n9L00J38k83k01J83J39j37K04k59J71k08j0j7Q8
2994a37P4J35j23J08j03Q9L8j31Nm7K30k75K26l52J31J45j01K72p7j6m3J1N6k70
3018a55L30j83K21j31j60M07k29J22j64P6n3nJ33j93K92j89j77K55K1j84J16k90
3040a40J12L17j38j95m7j85K35K8n2n3K31k25L7j59J05Q7j00p6o3J23J55p8jJ40
3064E8l28K40M4j50nk9LJ81k58L62k09Lq6L12l79K28OQ1j4j41j96K68q2o1L98
3089B46k70P3j85J75O2J44j80j21J01K31j47k33J70K0lN4k42L39N1k70K50j74
$$ plain form
3111 91 -11 9 98 -76 -28 6 -83 -130 183 236 102 135 9 119 -122 -115 -90 152 -262 140 -131 -272 -145 -47
3135 -47 122 -186 -145 2 16 -5 66 -189 32 -139 95 -21 -193 -21 37 -6 -216 122 -229 -214 24 -77 -58
3158 -58 -59 149 206 -31 78 127 30 -167 -100 -129 288 135 37 -62 112 -51 -181 -89 149 302 -36 267 179 334
3182 334 49 154 376 19 275 -29 -34 22 -40 26 396 -91 46 35 359 142 -49 -233 -19 -142 89 3
3204 3 -131 -161 -27 -234 -96 -65 -63 -207 -33 -47 55 -30 -279 -137 -172 116 -19 -120 -86 -142 -123 -40 -68 -204 -15
3229 -15 -80 -156 -51 76 -25 -13 -27 -138 115 -123 -162 120 -1 -58 310 144 -86 32 146 -3 227 84
3251 84 97 206 243 -17 7 118 34 -4 105 157 18 91 80 175 -51 -47 200 115 113 83 90 -26 -113 -38 -154 71 -164
3278 -164 103 246 -162 -18 -263 -70 -66 122 -275 -100 4 -150 8 -214 -64 -93 -17 113 54 -3 -17 280
$$ packed form
3111I1j02K0Q9j74M8L4q9m7L13N3j34L3j26J10k41PK5K42m14M02k71j41J27R8
3135d7J69l08M1J47J4k1P1k55K21j71K34j16j72J72N8m3k10L38l51J5K38j01J9
3158e8jK08N7k37J09M9r7j97O7k9M17j53r8r9J74j63j30R2K38J53l38L03q8J55
3182C34k85J05K22l57K56l04nN6o2O6L70m87J37j1L24k17j91j84K14j23K31q6
3204Cj34l0J34k07J38L1Kj44J74j4J02q5k49J42l5K88j35j01L4n6J9Q3k8j36J89
3229a5o5p6J05J27j01J2j4j11K53k38l9K82j21n7L68j66k30J18J14j49K30j43
3251H4J3J09L7k60K4J11q4l8J09N2j39P3j1R5k26MK47q5kl0Pj16q7P5j16K25k35
3278a64K67J43m08J44k45J93MJ88l97J75J04j54J58k22J50k9P6J30n9n7j4K97
$$ plain form
3300 280 -48 41 24 218 16 27 55 -31 92 75 -69 -128 125 -172 356 -202 242 93 62 3 -75 51 -78
3323 -78 206 85 172 50 -2 -11 44 23 66 -148 -174 288 -132 101 167 -20 37 -129 81 -9 -191 136 -83 96
3347 96 -184 133 94 -160 -141 -187 82 -181 16 -116 -38 -163 -335 -203 48 -168 -4 -93 140 -169 104 -121
3369 -121 -76 -2 201 49 -124 -115 -105 -27 -51 64 -187 -44 18 3 15 -128 1 -216 -196 105 10 -158 -81 65
3393 65 -260 78 49 169 40 -51 -34 13 161 112 -40 80 -2 -14 132 174 142 14 167 170 -153 -173 -101 -58 -208
3418 -208 18 201 161 -114 -84 -102 -142 -61 60 152 213 -235 -77 -149 -135 -92 123 -95 36 -25 -95 -114 22 24 27 -69
3444 -69 -178 -7 -118 -110 -161 -59 -86 -97 36 -268 -249 17 -67 47 122 -304 51 -255 74 118 -40 80 -139
3467 -139 46 35 10 -32 -2 98 -79 -78 -143 323 49 12 152 101 189 59 128 29 343 -247 112 -64 -219 -15
$$ packed form
3300B80l28Q9j7J94k02J1K8q6J23j7j44n9K53k97N28n58M44j49l1n9p8J26j29
3323g8K84j21Q7j22n2rN5k1M3k14k6M62m20K33O6j87N7j66K10r0j82L27k19J79
3347I6k80L17l9k54J9m6K69k63J97j32P8j25j72J32K51k16J64q9K33l09K73k25
3369a21M5P4K03j52j73RJ0P8k4J15k51J43O2j5J2j43J29k17K0L01r5j68P7J46
3393F5l25L38k9J20j29r1J7M7J48m9j52J20q2j2J46M2l2j28J53Ll23k0P2M3j50
3418b08K26J83m0k75L0j8m0Q1J21R2O1m48J58p2J4M3K15k18J31o1p0j9J36KLr6
3444f9j09J71j11Qn1J02k7j1J33l04J9K66q4J14P5m26L55l06L29M4j58J20k19
3467a39J85j1k5m2L0J00j77Jo5M66k74l7J40n1Q8j30O9r9L14n90L59j76j55K04
$$ plain form
3491 -15 6 207 232 36 -41 -40 -49 -6 -18 -39 54 60 156 6 -52 -141 -23 -75 -146 -71 -53 117 -328 -307 -39 -32 -229 -47
3519 -47 -3 -178 -194 29 -137 146 -227 -120 143 36 -196 94 171 -62 -19 -32 -134 -237 -31 122 -184 -21
3541 -21 166 28 -191 52 224 18 -182 133 177 199 -62 -37 42 63 47 142 -159 281 -115 3 44 45 140 -153
3565 -153 -79 -23 53 114 -23 139 -141 -277 114 54 35 -35 71 103 234 86 68 -3 -199 -34 -96 -215 -178 -36
3589 -36 -171 -225 3 -191 -91 -65 -115 -235 37 23 14 6 137 117 -44 -6 30 -115 -244 114 -132 111 -83 236
3613 236 20 -94 4 84 39 25 93 -131 -15 -88 -26 125 32 -97 56 -47 98 166 16 -185 -51 -26 -162
3636 -162 81 -5 -2 122 -16 113 108 202 39 -135 74 330 272 -226 58 313 -33 26 8 -54 249 -69 -26 137
3660 137 91 -35 -170 -92 29 -199 -29 -65 -246 54 -60 191 -211 -51 -275 -172 -105 -117 -139 26 129 -48
$$ packed form
3491a5K1K01K5j96p7JrM3j2k1R3OR6j50n8q9J18n2p1P5J8J70m45K1K68Pj97J82
3519d7M4j75j6K23j66K83l73J07K63j07k32K90P7k33M3j3j02j03K06J53l06J63
3541b1J87j38k19K43J72k06k00L15M4K2k61K5P9K1j6R5l01M40l96J18M1JR5k93
3565a53P4N6P6O1j37J62k80j36L91o0j9p0J06L2J31j48j8p1j96J65o2j19L7J42
3589c6j35n4K28j94J00K6n0j20K72j4rqJ31k0j61L8L6j45j29L58k46K43j94L19
3613B36k16j14R8Q0m5j4O8k24J16p3O2J51r3j29J53j03J45O8j50k01J34K5j36
3636a62K43q6LJ24j38J29nR4j63j74K09K56n8m98K84K55l46N9j8o2L03l18M3J63
3660A37m6j26j35P8J21k28J70l6j81L00j14K51m02J60k24J03O7j2k2J65J03j77
$$ plain form
3682 -48 -5 95 169 -138 5 260 165 66 112 105 160 -65 -21 57 163 -6 -23 271 -55 186 -11 392 55 -47
3706 -47 66 72 38 57 86 -11 17 203 -177 285 -24 -221 -88 -134 -18 -192 69 -6 20 118 -340 -43 -79 116
3730 116 83 -107 -277 -35 -45 164 47 -101 -203 -87 -167 -207 187 186 -141 -132 58 -82 -144 72 108 -213 55
3753 55 -65 106 -34 -145 10 73 9 168 -35 193 125 -61 45 6 83 -190 -52 22 66 -48 44 269 79
3776 79 -149 -129 47 -60 -106 177 -27 154 16 20 92 115 -61 -35 -172 186 32 240 127 -14 -41 -155 -110
3799 -110 66 -160 185 37 -54 -227 -121 -100 -53 -6 -74 34 -117 -36 -199 89 -66 -52 21 -153 -43 -154 -155
3822 -155 -35 -42 -22 -30 -171 9 292 44 -134 58 -72 -39 -158 13 47 -6 55 -155 -183 114 -117 -101 139 210
3846 210 -175 37 22 44 146 -57 -94 192 -17 327 165 11 282 60 -115 288 -21 -123 -12 84 40 -249
$$ packed form
3682d8M3J00P4l07J43K55r5r9M6pN5k25M4P8J06j69j7K94l26K41j97M03l37j02
3706d7J13Ol4J9K9r7K8J86l80M62l09j97J33m6J16j74K61p5K6R8m58K97l6J95
3730A16l3j90j70K42j0K09j17j48j02J16q0m0L94jl27RJ90j40o2K16L6l21K68
3753E5j20J71j40j11J55O3o4J59k03K28o8j86J06l9P7k73J38P4M4j14R2K25j90
3776G9k28K0J76j07m6K83k04J81j38MP2K3j76K6j37L58j54K08j13j41k7j14M5
3799a10J76k26L45j48r1j73J06K1M7M7o8J08j51Q1j63K88j55J4P3j74J10j11j
3822a55J20pK0qj41J80K83k48j78J92j30L3j19J71L4n3O1k10k8K97k31J6K40P1
3846B10l85K12j5K2J02k03l7K86k09L44j62j54K71k22j75M03l09j02J11R6m4k89
$$ plain form
3868 -249 -95 -220 41 103 109 -73 -157 157 -215 -202 -64 153 116 -30 23 133 -155 -9 -164 236 -100 -105 -31
3891 -31 -199 -289 -63 201 223 -96 -20 -75 -123 -62 101 101 43 132 80 121 59 11 -125 260 88 -6 -188 159 57
3916 57 185 79 -39 -101 88 44 -97 88 154 -119 247 -135 -144 72 31 84 171 71 -84 122 -86 48 64
3939 64 103 -85 130 147 117 -24 -109 263 157 93 33 -78 -172 64 151 -78 -85 -129 -96 -137 -91 212 50 12 -139
3964 -139 -296 -140 -142 -42 60 -153 -164 -75 -112 -98 43 59 -26 102 64 -26 -233 -53 54 57 548 85 126 192 261
3989 261 -73 -111 7 -75 57 104 147 16 158 202 58 31 -7 -73 -11 -92 228 -248 -162 24 36 264 -53 96
4013 96 -123 23 -116 -26 22 97 -35 221 -137 -259 -77 50 -72 80 -106 68 79 -69 -22 -230 81 -88
4035 -88 -155 -233 173 1 0 -138 -66 -202 -17 139 89 -207 90 -323 -22 -154 100 50 35 -181 -54 39 -60 245
$$ packed form
3868b49J54j25K61O2Oj82q4L14l72J3J38K17l7j46N3J10k88J46j55M00l36nP4
3891c1j68r0K26K64K2l19P6n5m8O1J63%n8Q9n2M1o2m8j36L85j72r4j82L47j02
3916E7J28j06j18o2J89m4j41J85O6k73L66l82rK16m1N3Q7j00j55K06k08J34J6
3939F4L9j88K15J7l0j41q5L72j06o4o0j11r4K36Q7k29pm4L3m1M6L03j62l8j51
3964a39j57J56kJ00J02k13j1Q9l7J4J41J6q5J28l8r0k07J80J07LM91m63M1O6O9
3989B61l34l8J18q2J32M7M3j31J42M4j44k7l8o6O2q1L20m76Q6J86J2K28l17J49
4013I6k19J46j39R0M8P5j32K56l58j22J82J27j22J52j86J74J1j48M7k08L11j69
4035h8o7p8M06j72jj38P2j36J85J56n0k96K97m13L01j32K54n0j5k16J27R3r9L05
$$ plain form
4059 245 48 -324 -14 97 68 141 -17 -14 -76 -55 130 186 -94 94 -87 48 201 63 -216 -104 -118 -196 -37
4082 -37 74 79 -70 -304 -146 185 210 52 -260 -138 -115 -97 -2 -83 -156 61 8 -56 142 -113 -124 20 82 2 -237
4107 -237 -156 112 48 140 79 -231 -22 -173 -90 -144 85 -88 -86 19 7 -236 -191 47 -99 201 -142 69 -39
4130 -39 159 -90 28 -59 56 -149 8 -179 -53 108 -183 70 -171 -189 -166 -86 146 328 -237 -46 126 82
4152 82 95 69 -38 -15 239 -284 -65 -190 -20 -17 -48 -119 154 -58 116 48 -24 -147 -85 -105 28 10 -304 -194
4176 -194 -22 87 -21 82 -208 -201 -133 160 -61 141 -164 -27 -96 -61 18 -181 -176 48 -92 -317 40 -16 108
4199 108 -93 -149 46 47 -60 -89 -46 -62 159 -192 -56 78 -300 125 118 -61 31 23 -67 -43 -4 -93 124 -204 -38
4224 -38 21 10 -58 112 49 -319 87 -75 148 -61 51 84 33 75 218 79 120 184 30 23 -44 -55 -219 -15 7
$$ packed form
4059B45j97l72L10J11k9P3j58Lo2K1J85N6k80J88j81J35J53j38k79J12j4p8J59
4082c7J11Nj49k34J58L31K5j58l12J22K3J8R5q1p3K17n3o4J98k55j1J44O2q0k39
4107b37Q1K68o4R2o1l10K09j51Q3n4K29j73KJ05j2k43M5K38j46L00l43K11j08
4130c9J98k49J18q7J15k05J57j87J26J61k91K53k41j8K3Q0K32J82n65J91J72m4
4152H2J3k6j07K3K54n23K19j25J70Ll1p1K73k12J74o8p2j23O2k0J33j8l14J10
4176a94J72J09j08J03k90PO8K93k21K02l05J37o9L5P9j99NK24j40k25L57n6J24
4199A08k01n6J95Jj07k9M3j6K21l51J36J34l78M25pj79R2qr0K4L9q9K17l28J66
4224c8N9j1o8J70o3l68M06j62K23k09J12L3n1M2J43j39M1O4j54po7j1j64K04K2
$$ plain form
4249 7 -60 -58 -152 176 -15 73 113 142 152 -48 51 4 54 -36 -165 -6 -207 86 187 -250 51 176 -99 -84 70
4274 70 -73 109 -117 62 82 1 41 247 312 -160 23 53 -172 50 -109 56 -123 158 -150 254 -95 -66
4296 -66 -272 109 -14 -279 156 19 32 136 -156 237 134 -180 89 77 89 37 94 -137 9 34 -54 -47 98
4319 98 153 -209 -92 -1 -196 -32 216 -120 44 122 -164 -149 -64 -23 10 92 -133 -7 -256 1 227 46 -164
4342 -164 -14 -55 240 71 -277 230 -6 -80 -117 -19 27 25 -179 254 -73 26 82 -57 232 63 9 92 11 -129
4366 -129 156 -66 47 -12 -177 -6 64 84 207 -45 227 198 -88 -46 95 -142 183 -200 -117 -126 -89 172 -219
4389 -219 215 -60 -74 -33 297 -44 -174 158 -191 13 81 90 -81 50 -46 40 -29 -61 202 201 -149 -5 173 15
4413 15 -97 41 87 -28 -26 34 128 161 73 111 -153 -176 -179 43 -235 91 153 23 158 -10 14 170 -115 -22 41
$$ packed form
4249Go7Kr4L28j91Q8M0K9J0k00R9m7N0r0j29J59k01K93J01m37L01J25k75J5J54
4274G0j43J82k26J79K0q1M0K06O5m72J83L0k25K22j59J65j79K81l08M04l49K9
4296f6k06L81j23k65M35j37J3J04k92L93j03l14K69j2J2n2N7k31J46K5q8PJ45
4319I8N5l62J17R1j95J64K48l36J64P8k86J5Q5M1L3Q2k25J26k49K57K26j81k10
4342a64J50m1K95j69l48N07k36p4l7R8M6kk04M33l27R9N6j39K89j69n4Q3q1j40
4366a29K85k22J13n9j65J71P0K0J23k52K72k9k86M2J41k37L25l83Q3rL7K61l91
4389b19M34k75j4M1L30l41j30L32l49K04O8Rj71J31r6Q6o9l2K63jl50J44J78j58
4413A5j12J38M6j15KO0R4L3q8L8k64k3lK22k78L26O2j30J35j68K4J56k85R3O3
$$ plain form
4438 41 82 41 137 -108 148 144 34 32 218 -20 30 -173 94 15 -56 98 5 -71 212 118 -115 20 -103 -27 -6
4463 -6 -187 -53 87 -163 217 -6 -160 -48 18 -179 -92 47 60 -127 61 136 -38 67 68 -147 71 64 106 -106
4487 -106 -14 1 -180 -158 -32 -49 90 -129 6 -91 -132 112 -134 -153 -124 79 111 -190 -51 73 27 153 -215
4510 -215 222 172 115 46 208 -68 62 2 117 231 -21 29 26 -11 81 93 40 -148 126 71 234 201 13 40 -209
4535 -209 223 243 114 -170 136 280 -215 -35 19 -129 121 58 -28 158 175 -131 -56 -400 92 112 103 -181 31
4558 31 52 -146 -20 117 178 -121 55 54 -88 -69 -138 129 -131 48 48 -207 -15 -141 -159 -113 -334 -93 -66 15
4582 15 -157 -148 68 -52 -45 202 197 77 55 -83 332 100 53 216 -63 19 59 -37 50 109 83 132 142 131 40 -127
4608 -127 -119 122 -4 276 -233 244 129 12 -82 -76 138 -173 -33 82 -27 -17 -154 -194 -28 112 215 -158
$$ packed form
4438D1M1m1R6k45K56mj10kJ86k38N0k03K67p9p1J54r3p6K83r4k33J35j23P6K1
4463fj81J34J40k50L80k23j54J12O6j97Q7J39J3j87J88P5j74J05Jk15K18pM2k12
4487a06R2J5j81K2J26j7J39k19J35r7m1K44k46j9K9K03L2l01J39J24m6J26l68
4510b15M37n0n7o9J62k76J30o0J15J14k52N0ll7R2J2n3j88K74n5J63l3j88K7k49
4535b09M32K0j29k84L06J44m95J80N4j48K50o3q6J86J7l06P5l44M92K0rk84K12
4558C1K1j98J26J37O1k99J76jj42J9o9K67k60J79%k55J92j26j8M6k21K41K7Q1
4582A5j72RK16j20PK47nj20k2j38M15k32m7J63k79Q2M0r6Q7N9k6M9J0j1r1j67
4608a27QK41j26K80n09M77j15j17r4OK14l11J40J15j09J0j37m0J66J40J03l73
$$ plain form
4630 -158 104 7 -203 241 57 -163 51 50 152 87 120 -26 65 -85 128 97 -309 139 -96 -80 -38 -12 -92 79
4654 79 28 -1 213 -100 116 -71 152 -105 -222 125 -32 92 49 157 -230 228 135 277 65 -282 -55 146
4676 146 25 201 -162 201 256 -142 -124 -165 -120 -120 102 -8 80 -105 -150 -71 -124 -38 0 60 115 159 -30 -121 6
4701 6 87 191 -162 -139 47 163 180 -42 44 -73 113 -218 14 -82 -132 160 31 -97 -41 -20 -17 176 136 106 -174
4726 -174 -190 -229 78 178 73 174 -76 -76 -159 -99 -9 -229 -3 -120 76 22 128 119 140 300 -22 231 -68 204
4750 204 16 34 57 91 -329 -252 -113 93 -59 -48 84 -52 3 -83 19 48 -122 226 111 119 -23 54 -16 149
4774 149 -138 -53 -203 -183 127 -1 -156 16 -29 22 -110 -35 -124 75 -186 -289 -157 -35 175 -91 23 -218
4796 -218 -93 42 -168 -176 17 234 -98 22 -63 -113 13 -9 -136 139 3 -113 -122 45 -210 -96 29 133
$$ packed form
4630a58K62r7k10M44j84k20K14jJ02o5L3j46R1j50K13l1m06M48k35J6M2K6q0J71
4654G9n1k9K14l13K16j87K23k57j17L47j57J24m3J08l87M58r3J42k12l47K27K01
4676A46j21J76l63L63N5l98J8m1M5%K22j10Q8j85m5P9n3Q6L8O0N5M4j89r1J27
4701FQ1J04l53K3J86J16J7k22Q6j17J86l31K32r6n0K92j29j28N6K1LJ93m0l0k80
4726a74j6l9L07J00j05J01k50%q3O0R0k20K26j17J96n4J06rK1J60l22K53k99K72
4750B04j88J8K3L4m20P7J39K06j52J1J32j36N5q6J02K9j70L48j15Qj42P7p0J65
4774A49k87Q5j50K0L10j28j55J72m5N1j32P5q9J99k61j03J32J22K10k66J14k41
4796b18J25J35k10qJ93K17l32J20q5n0J26k2j27K75j36j16rJ67k55J14J25J04
$$ plain form
4818 133 -89 -78 254 159 -274 64 44 215 24 160 3 -3 -150 -293 68 84 -107 84 36 -52 164 151 155 -276
4842 -276 46 -43 -119 28 -4 -18 -3 -28 11 -247 -131 -190 -94 197 81 -28 -76 -137 0 143 -57 151 -2 -121
4866 -121 135 -139 0 -39 -91 22 -12 -137 -56 -3 111 -33 153 66 -43 -20 -58 -97 54 0 57 -337 39 -96
4890 -96 51 -11 103 73 -12 -77 57 -98 -58 258 -177 198 171 -128 106 -59 26 -103 -103 -68 -44 87 -7 25 32
4915 32 -38 114 -163 -120 204 -220 32 -65 123 -345 -163 85 43 100 6 -36 -44 -146 -252 -46 9 -308 -147 -57
4939 -57 -137 -29 -94 84 -98 -59 -48 -227 -88 -39 -95 56 -71 -98 55 41 -46 -64 -56 -259 37 340 -88 -231
4963 -231 29 74 167 -338 -106 -124 -32 -13 229 53 138 246 -289 -32 139 -57 30 -183 64 281 160 -80
4985 -80 42 219 85 -213 116 89 -118 49 -38 -141 -37 48 -239 -459 -118 -191 115 -46 241 -210 12 138
$$ packed form
4818A33k22J1L32r5m33L38k0J71j91J36j57oj47j43L61J6j91J91m8q8K16j3Mm31
4842b76L22q9p6J47l2j4J5k5L9k58J16n9R6K91j16j09m8o1J37J43k00K08j53j19
4866a21K56k74J39l9n2J13l4j25Q1N3J14j44J86q7j09K3l8l9J51n4N7l94L76j35
4890i6J47o2J14l0q5o5J34j55M0L16m35L75k7k99K34j65Q5j29%L5K4J31r4L2P
4915C2p0J52k77M3L24m24K52r7J88m68J82K48m2N7r4m2qj02j06K06N5l17J61R0
4939e7q0J08o5J78j82L9J1j79J39M9n6J51j27k7J53j4q7j8Qk03K96L03m28j43
4963b31K60M5R3n05K32j8R2J9K42j76Q5J08n35K57J71j96Q7k13K47K17j21k40
4985h0J22J77j34k98L29k7k07J67q7j03J04Q5k87k20L41p3L06j61K87m51K22J26
$$ plain form
5007 138 -77 35 5 -82 -145 -4 -16 -183 -93 -68 -209 -204 -100 -21 -93 106 5 191 7 -39 -40 39 40 59 -98 36
5033 36 -5 -43 150 37 1 -43 -4 -320 175 121 -257 191 153 -99 -54 -7 172 73 -70 45 60 53 213 20 -29
5058 -29 123 93 108 -51 51 63 -111 165 30 -49 180 -94 -42 -95 263 103 -58 -21 0 86 -10 -276 -48 -25
5082 -25 -134 83 -87 158 -16 -109 -64 -110 37 -373 -61 -186 -265 -47 -47 15 171 61 -206 16 -68 71 52
5105 52 -18 -128 176 -158 -28 -87 160 154 134 74 326 -283 133 -40 -71 -16 49 232 223 97 -13 188 132 31
5129 31 -163 -16 127 84 62 127 -178 126 -10 -29 32 -61 73 -116 -45 108 -124 72 -170 -142 -98 -209 -242 0
5153 0 -260 -76 49 -60 -52 50 -189 -32 -43 -45 43 -129 -109 -69 18 -43 291 -43 21 371 -56 -86 -125 54 -7
5178 -7 -136 -148 155 0 88 74 158 9 40 52 -38 45 83 130 68 6 295 113 -92 167 -32 146 261 27 -101
$$ packed form
5007A38k15J12l0q7o3J41j2j67R0K5j41NJ04P9p2J99j01J86j84m6jP9JJ9j57J34
5033C6m1l8J93j13l6m4L9l16M95n4l78M48l8k52M5M7J79r9j43J15J5pJ60j93m9
5058b9J52l0J5j59J02J2j74K76j35p9K29k74N2n3L58j60j61L7K1Q6r6k66K28K3
5082b5j09K17j70K45j74r3M5m6J47m10L12j25p9K18%O2J56j10k67K22q4J39j9
5105E2p0j10L04l34J30n9K47ok0o0K52o09M16j73l1N5O5J83rj26j10K01n6j01
5129C1j94J47J43m3k2O5l05L04j36j9O1r3J34j89P1J53k32J96k42K8M4j11l3K42
5153@k60J84J25j09QJ02k39J57j1kQ8j72K0M0Q7o1L34l34O4L50m27l0l9J79o1
5178gj29j2L03j55Q8j4Q4j49L1J2r0Q3L8M7o2o2K89j82k05K59j99J78J15k34j28
$$ plain form
5203 -101 70 25 35 68 -28 47 63 25 126 71 -176 28 4 -33 -33 -5 -68 -33 -122 36 -44 -42 -38 53 -5 -63 -47 -35 -44
5232 -44 -47 -67 180 -183 -122 -6 -118 34 -32 3 -147 30 6 56 -216 -83 -156 -113 -241 121 -59 191 -132 101
5256 101 -107 -34 94 -46 5 78 160 -39 18 30 7 -160 12 165 55 68 57 -159 138 -23 -144 166 -105
5279 -105 135 -48 192 111 116 83 -112 19 -14 255 -21 -156 -155 74 152 -69 43 162 191 -11 108 152 261
5302 261 -266 -218 87 31 245 31 124 -107 201 -214 54 -195 -26 150 -207 -154 -110 -6 124 -38 108 -4
5324 -4 82 7 250 132 11 90 122 -219 -75 -116 -165 8 34 133 -162 -43 62 -306 56 52 21 -28 154 -33 103
5349 103 163 193 3 176 348 109 40 72 316 -150 -26 -260 4 40 -142 4 -21 17 -121 12 -26 -202 -292
5372 -292 43 -39 18 197 250 108 -220 -38 -172 59 -149 92 52 20 -126 100 157 172 137 77 -50 6 -24 -92
$$ packed form
5203a01J71m5J0L3r6P5J6l8J01n5k47K04k4l7%K8o3L5q9J58q0KMR1n8n8J6J2r
5232d4lk0K47l63O1J16j12J52o6L5j50J77k4N0k72J33p3M3j28L62j80K50l23K33
5256A01k08P3J28j40N1P3Q2j99N7J2k3j67J72J53j10J3j1k16K97j61j21L10k71
5279a05K40j83K40q1Nl3j95J31l3K69k76j35JK29P8k21J12J19K9k02J19M4J09
5302B61n27M8L05n6K14k14R3k31L08m15K68k49J69J76l57N3M4J04J30j62J46j12
5324dQ6p5K43j18j21P9L2l41J44m1m9J73K6R9k95J19J05l68L62ml1m9J82j87J36
5349A03O0L0j90J73J72k39o9L2K44m66J24k34K64L6j82J46k5L8j38J33l8j76r0
5372b92L35q2N7J79N3j42l28J82j34K31k08K41m0l2j46K26N7J5l5o0j27N6l0o8
$$ plain form
5396 -92 -96 -186 -98 -70 -5 -46 7 -114 -102 -28 -129 -66 102 -130 -132 -141 132 -21 -308 -72 -4 37 -106 211 138 12
5422 12 164 120 -8 38 170 -68 -4 194 34 -204 -82 -232 -35 36 146 5 -4 -87 -49 -164 -66 -268 -69
5445 -69 -36 71 331 155 -11 112 101 -117 -177 82 199 -60 -367 -74 255 -22 277 276 80 -2 178 -135
5467 -135 100 59 87 -137 189 -241 117 53 -282 14 90 -182 -164 -111 -203 -51 162 -5 -227 33 50 -14 125
5490 125 255 37 -80 83 44 -56 -32 -49 -14 -190 242 81 -157 11 218 36 98 -39 -40 156 -29 -119 -33
5513 -33 -99 -20 81 104 51 -85 -221 -86 -102 38 111 -218 -218 -157 56 172 115 57 109 90 -173 -215 63 7 12 -22
5539 -22 -305 -77 -302 -72 -75 58 119 -210 89 45 -77 -3 -83 66 -20 -19 -33 -36 99 -202 75 236 308 149 107
5564 107 103 -60 -46 23 -13 -65 133 199 -238 -26 -27 -22 7 -186 -8 -111 -9 -69 197 121 52 -14 119 38 13 80
$$ packed form
5396i2mr0Q8K8O5m1N3j21J2P4j01O3J68k32krK73j53k87K36O8M1j43L17p3j26
5422A2J52m4j28M6J32k38O4J98j60k38J22j50J97P1J10j41rq3L8j15R8k02J99
5445f9L3J07K60j76j66J23j1k18o0K59J17k59l07K93L29k77K99jj96q2J80l13
5467a35K35m1K8k24L26m30L58o4l35K96P6k72J8N3r2J52K13j67k22K60J7o4J39
5490A25J30k18j17J63l9j00K4j7L5j76M32j61k38J68K07j82O2j37jJ96j85r0Q6
5513c3o6P9J01K3n3j36j36J35j6J40P3l29%O1K13J16n7n8N2j9k63m2K78n6Nl4
5539b2k83K28k25K30lJ33O1l29K99m4j22P4q0J49q6Jj4lJ35l01K77J61P2j59m2
5564A07mj63J4O9l6n2J98O6m37K12jNK9j93J78j03J02o0K66p6o9o6J33q1k5O7
$$ plain form
5590 80 -62 56 -72 -93 7 208 43 44 122 113 62 34 -157 8 -149 -97 -247 73 215 -53 -89 -348 -213 -131
5614 -131 -68 32 -84 -167 18 -161 -9 -186 -226 -85 63 -24 93 142 172 113 -127 -3 -301 -13 25 73 301
5637 301 -72 -231 252 -116 20 125 43 -14 37 -14 -38 263 38 111 -5 52 103 -95 24 -306 -91 83 -147
5660 -147 137 -12 10 196 97 -36 148 -117 119 22 -55 -120 95 80 -46 -74 63 219 -154 40 -90 161
5682 161 87 45 -4 -28 35 -6 186 -176 -98 -274 -78 -134 -13 -111 -159 37 1 -6 -154 -242 119 -123 -200 -108 -26 -207
5708 -207 -35 -271 246 171 185 44 -14 -245 -14 141 -58 -81 13 -6 -137 -193 54 25 54 -64 -223 122 126 293
5732 293 -55 -25 88 27 161 -41 63 172 -92 -22 237 112 46 264 -10 65 -163 104 36 142 296 -336
5754 -336 -60 79 -114 -26 -315 66 7 -62 39 115 -110 -34 -141 -252 -236 -104 -205 -302 -139 -107 -128 31 -83
$$ packed form
5590H0j42J18j28k1J00K01j65JP8rn1k8j91J65j57N2j50L20J42k68l6k59J35Q2
5614a31O3J00j16q3J85j79J52j77m0J41J48q7J17M9L0n9k40J24k98K88L8M8K28
5637C01l73j59M83l68J36J05q2n7N1n1k4L01k25P3j16N7N1j98J19l30K15J74k30
5660a47K84j49K2J86r9j33J84k65K36r7p7o5K15j5j26k8J37J56l73J94j30K51
5682A61p4m2m9k4O3m1J92l62P8j76J96n6J21r8m8J96l6pj48q8L61k42p7R2Q2j81
5708b07J72k36N17p5J4j41n8k31K31J55j99k3R4j9j31n6K47k9K9j18j59L45MJ67
5732B93l48L0J13o1J34k02J04J09k64P0K59j25o6K18k74P5k28K67o8J06J54o32
5754c36K76J39j93Q8k89L81n9o9J01P6k25P6j07j11J6J32j01r7J63L2k1J59j14
$$ plain form
5777 -83 204 -20 -138 -123 -340 -142 85 -199 -4 -167 -19 15 -144 126 149 133 -97 135 -147 -155 49 -32 -295
5800 -295 -71 20 -90 -30 154 110 -195 39 -394 7 -135 116 -68 205 67 204 -24 136 148 84 -11 -193
5822 -193 -48 -56 -21 160 70 -75 99 -93 135 -7 -316 19 260 14 160 -22 -42 -17 111 23 -164 127
5844 127 -188 -163 178 -65 21 39 94 -38 81 -11 -169 -96 -2 -62 -280 -48 -154 -10 -176 79 -28 50 -212
5867 -212 -202 104 -118 -64 38 25 128 -69 -179 197 37 194 -16 129 -63 -11 54 9 0 -258 114 -155 106
5890 106 123 91 26 19 84 -42 -168 94 -45 64 -140 48 17 -227 -6 -181 323 -91 11 193 -15 -167
5912 -167 253 71 107 0 26 -79 23 -170 38 -145 -82 -162 -119 -17 -300 -143 174 115 -113 -212 26 -62 -191
5935 -191 40 -254 73 -58 -107 12 116 194 59 123 -43 -32 -68 170 -81 -107 62 115 1 6 -127 -7 10
$$ packed form
5777h3K87k24j18J5k17J98K27k84J95j63J48L4j59K70K3j6k30K32k82qK04q1k63
5800b95K24R1j10O0J84m4l05K34m33M01j42K51j84K73j38J37k28J60J2o4r5j82
5822a93J45qL5J81r0j45J74j92K28j42l09L35K41k46J46j82k0K5J28q8j87K91
5844A27l15K5L41k43Q6J8N5j32J19r2j58P3R4o0k18K32j06J44j66K55j07P8k62
5867b12J0L06k22N4J02j3J03j97j10L76j60J57k10J45j92N2O5m5rk58L72k69K61
5890A06J7l2o5pO5j26j26K62j39J09k04J88l1k44K21j75N04m14J02J82k08j52
5912a67M20j82L6j07K6j05J02j93K08j83O3q0M3J02k83J57L17n9k28r9K38q8j29
5935a91K31k94L27j31m9J19J04P8j35O4j66J1l6K38k51k6J69N3j14Nj33J20J7
$$ plain form
5958 10 138 -137 267 -7 -59 -172 202 -117 -147 127 61 -49 124 -2 -23 125 -67 16 -197 210 -120 111
5980 111 -115 135 -104 -7 69 -161 -124 -27 28 -61 -157 114 15 -211 -14 -62 -311 -266 -13 -267 27 35 37 28 146
6005 146 -50 97 -24 62 -103 -166 -83 -162 39 -46 -67 3 -154 135 -115 127 -147 -31 -18 218 123 -127 207
6028 207 -87 -64 190 -86 150 78 261 -221 -96 203 -5 -78 32 216 19 58 174 102 120 -20 -74 -113 -268
6051 -268 25 291 -36 215 -143 40 19 -67 5 -105 -25 -155 76 -169 -84 -133 109 -81 -146 47 -212 -126 40
6074 40 -81 -91 -45 10 -233 -255 -101 24 52 10 -111 -15 64 -67 -85 -135 -17 31 -291 -145 -74 76 98 -129 106
6099 106 140 -185 -114 51 -1 57 -208 -19 31 51 -32 -162 87 7 263 29 78 43 138 -18 145 35 49 -49
6123 -49 110 85 130 45 -26 -40 -35 66 146 -42 -111 30 -147 75 93 50 48 60 -105 -122 4 -184 13 -156 69
$$ packed form
5958A0J28k75M04k74n2j13L74l19l0K74o6j10J73j26k1J48j92Q3k13M07l30K31
5980A11k26K50k39R7P6k30L7R7N5q9r6K71r9k26J97m8k49M5K53k54K94QKrJ18
6005A46j96J47j21Q6j65o3Q3p9K01q5k1P0j57K89k50K42k74J16J3K36r5k50L34
6028B07k94K3K54k76K36p2J83m82J25K99k08p3J10J84j97L9J16p2J8j40n4l9j55
6051b68K93K66l27K51l58J83k1q6P2j10Q0j30K31k45Q5m9K42j90o5J93k59Q6J66
6074D0j21j0M6N5k43k2J54J25K8m2j21R6P9j31j8n0J18M8l22J46P1J50K2k27K35
6099A06L4l25P1J65n2N8k65J89N0K0q3j30K49q0K56k34M9l5R5j56J63j10J4r8
6123d9J59k5M5q5p1j4NJ01Q0j88o9J41j77K22J8m3kJ2j65j7J26j88J97j69K25
$$ plain form
6148 69 -193 105 -149 -190 175 -203 -124 41 -82 -15 133 122 22 -121 89 -95 -38 92 -60 -211 103 -158
6170 -158 -21 -60 23 125 133 -134 74 -23 -127 134 143 -2 37 -38 -194 66 164 156 118 67 -190 58 -2 -112 7
6195 7 53 107 -375 -128 91 -155 46 -87 32 -67 16 136 68 67 189 -30 -51 241 66 220 24 -13 -27 -65
6219 -65 -169 102 -112 -19 -94 -3 117 -131 25 -4 -81 -27 60 -83 -54 -128 -72 16 14 72 -183 249 -105 -140 99
6244 99 -228 -23 -65 -85 -124 -45 70 64 12 49 97 51 -22 98 156 187 -48 -172 87 -195 3 231 71 179 -131
6269 -131 -189 100 19 -71 63 81 162 45 -146 19 -152 30 -126 106 -11 -14 9 -18 -102 68 -139 -383 -111
6292 -111 -114 -190 -169 -188 46 311 -36 -140 -192 60 -158 41 -86 -137 -252 111 -228 -46 -47 -32 -132 131 -49
6315 -49 158 -361 -140 7 -138 67 26 38 -90 173 -1 -79 -133 -130 46 48 -97 -201 5 11 5 -53 79 177 5
$$ packed form
6148F9k62K98k54m1L65l78P9J65j23O7J48j1j00j43K10j84N7J30j52j51L14k61
6170a58J37l9Q3J02Qk67K08r7j04K61Rj45L9p5j56K60R8ql8n1k57K48o0j10J19
6195GM6N4m82K47K19k46K01j33J19r9Q3J20o8jJ22k19k1K92j75J54j96l7j4l8
6219f5j04K71k14R3p5R1J20k48J56k9p7N4Q7j43K9p4N6Q8kN8k55M32l54l5K39
6244I9l27K05m2k0l9P9J15on2L7M8m6p3J20N8L1k35j24K59k82J98K28j60J08l10
6269a31n8K89q1r0J34J8Q1j17j91J65j71J82j56K32j17lK3k7q4J70k07k44K72
6292a11lp6K1j9K34K65l47j04n2K52k18J99j27n1j15L63l39J82jJ5j00K63j80
6315d9K07n19K21J47j45K05m1J2j28K63j74p8n4LJ76Kj45j04K06Oon8J32R8j72
$$ plain form
6340 5 20 62 27 426 -104 -171 84 0 6 -151 94 1 -128 -73 185 69 -69 -14 -166 178 90 35 -11 142 -22
6365 -22 111 -103 -9 113 67 -138 -137 -64 -153 -167 -96 -16 -54 -31 -33 -110 -141 84 -350 -119 15 -80 -41 -149 71 62 67
6392 67 -70 -225 -30 -46 -63 -37 150 -28 -205 -252 -89 191 26 92 109 -56 -35 18 95 83 56 129 84 -226 31
6417 31 161 -16 -54 13 61 -10 -165 -61 32 20 314 121 -197 -47 144 -208 140 131 234 140 -45 54 -45 229
6441 229 18 10 60 -127 100 129 -124 198 107 10 -47 -95 -243 -112 88 -47 83 -139 -45 199 244 155 -122 -114
6465 -114 -70 -234 86 111 80 -124 75 16 264 -21 -225 -138 274 -273 207 -232 -213 89 -64 -24 78 94 -178
6488 -178 -247 59 2 101 78 2 -139 37 -87 -81 -113 49 -129 -146 -89 4 -7 -136 -7 198 -46 -68 185 -261
6512 -261 -110 216 -22 -119 -14 -95 -96 -56 -49 -148 -5 -59 207 92 -160 179 313 37 -73 -8 206 -69 61
$$ packed form
6340EJ5M2l5L99n30o7K55q4Oj57K45r3j29N5K58j16j38N5j52L44q8n5m6J53j64
6365b2J33k14R4J22m6k05JP3q9j4P1Q0l8K3kp7l1K25m34K31J34r5L9j08K20rN
6392F7j37j55J95j6j7K6J87j78j77m7J63K80j65O6J7j65K1N3P7j2k7P3m5l10K57
6417C1J30j77l8O7M8p1j55J04R3j2K94j93l18J50J91l52L48rJ03r4j85R9r9K74
6441B29k11qN0j87K27K9k53L22r1r7n7m8j48J31K00j35J30k22R4K44M5q9k77Q
6465a14M4j64L20K5l1k04J99n9K48k85k04Q7M12n47M80m39J9L02j53M0J02J6k72
6488a78o9L06n7R9k3p6j41J76j24Ol2J62j78j7N7R3j1j29J29K05k44k2K53m46
6512b61J51L26k38r7J05q1jM0Pr9J43n4K66j15k52L39J34k76j10O5K14k75J30
$$ plain form
6535 61 99 56 39 -113 16 112 97 134 72 179 52 -3 117 -174 -121 -190 -108 -263 133 159 150 -235 -9 -83 85
6560 85 -62 47 1 -151 71 258 -294 286 -21 106 180 222 -20 246 121 -150 203 284 -80 -30 207 -208
6582 -208 -62 57 131 14 6 -45 29 76 -248 -158 45 32 74 -5 -279 38 -12 -288 173 -123 -97 113 -171 -20
6606 -20 -201 -44 87 -91 13 -143 100 -50 42 -142 -122 51 42 -72 -99 97 19 18 62 45 -156 -136 11 8 99
6631 99 -48 79 -254 -75 -127 -29 -59 65 -51 117 57 100 168 49 60 154 112 -155 445 -59 2 29 -13 285
6655 285 -159 -61 128 60 63 18 -273 -119 -67 -64 237 37 41 -33 -222 249 -48 3 -153 41 74 -20 -108 133 -50
6680 -50 -103 -98 155 104 249 163 43 281 54 168 51 140 -28 186 18 -3 -15 -94 -119 30 -44 -82 111 90 47
6705 47 110 139 156 84 -69 -7 34 270 47 -99 -54 90 -85 63 -31 83 187 -115 -327 -112 265 103 81
$$ packed form
6535F1L8m3j7j52J29R6j5L7o2J07j27n5J20k91N3o9Q2j55L96K6rl85K26p4J68
6560H5j47J09m6j52K22J87n52N80l07J27P4M2k42K66j25k71L53Q1l64N0K37m15
6582b08J46J19P4j17qn1P4M7l24R0K03j3M2p9k74L17n0k76M61k96K6K10k84J51
6606b0j81J57J31j78J04j56K43j50R2j84K0J73rj14k7J96p8jM4j7k01K0J47lR1
6631I9j47J27l33J79n2R8l0J24j16J68o0M3O8j19J1R4m2k67O00n04O1K7m2K98
6655B85m44R8J89o8Lm5k91J54N2LL01k00Mp4j89M71k97N1j56J94L3r4q8K41j83
6680e0n3NK53n1J45q6j20K38k27J14j17Q9j68K14j68k1j2p9k5J49p4l8J93k1m3
6705D7O3K9J7p2j53O2M1K36k23j46M5J44j75J48r4J14J04l02k12K15L77j62k2
$$ plain form
6728 81 -112 91 37 326 177 127 70 -109 -168 77 -106 39 -6 166 -209 -104 -5 131 -211 31 41 -54 107
6751 107 -6 -63 -191 115 -80 47 94 -93 -99 61 -225 -48 -9 -289 -34 43 38 -49 -142 -84 153 73 -187 159
6775 159 -270 302 -8 126 159 -70 397 39 28 -71 -108 -307 28 -160 24 -126 158 -132 -93 154 -10 192
6797 192 154 120 295 67 57 -214 -38 99 -7 -148 98 160 -40 -16 104 -57 52 7 -1 195 63 -19 -160
6820 -160 -43 40 34 -53 52 -100 5 24 212 102 -58 -146 -53 -41 -34 131 -315 74 -105 -142 55 44 6 -77 161
6845 161 -186 -123 -100 75 92 93 161 -8 231 -62 52 -52 -76 172 2 -4 -157 128 80 116 -41 -22 77 202
6869 202 214 125 146 -131 23 -156 -105 22 138 -68 50 114 76 -101 67 -50 -7 -226 -92 -12 359 -205 -199
6892 -199 140 63 -73 7 -377 128 -89 -77 62 -116 180 -82 -5 160 -180 -38 -186 -199 21 90 82 -260 -147
$$ packed form
6728H1j93K03n4K89j49n0n7j79n9K45j83J45m5J72l75J05R9J36l42K42J0r5J61
6751A07j13n7j28L06j95J27M7j87oJ60k86J77L9k80K55P7nq7r3N8K37q0k60L46
6775A59m29N72l10J34L3k29M67l58j1r9l7j99L35j88J84j50K84k90L9K47j64K02
6797A92l8l4J75k28j0k71J76J37j06j41K46O2k00K4J20j61J09m5qJ96j32q2j41
6820a60J17Q3oq7J05j52J05J9J88j10j60q8R3J2PJ65m46L89j79l7J97j1l8q3K38
6845A61l47O3K3J75J7JO8j69K39k93J14j04k4K48j70oj53K85m8L6j57J9R9J25
6869B02J2q9K1k77J54j79N1J27J16k06J18O4l8j77J68j17M3k19J34Q0L71n64O
6892a99L39p7j36Q0l84N05k17J2J39j78K96k62P7J65l40J42j48j3K20O9ql42J13
$$ plain form
6915 -147 -35 -189 -224 13 -242 -97 78 50 23 -276 88 80 -62 28 -119 -123 -71 101 78 177 -27 225 45 26
6939 26 11 156 241 212 -117 145 -92 -185 59 107 -44 -132 -300 135 -11 138 131 -102 -119 77 -18 -7 -25 -80 -154
6964 -154 -41 16 268 -178 -56 292 -305 -142 110 97 -58 83 74 -68 -125 -141 -129 -27 -107 -33 -76 -174 -107 -37
6988 -37 95 -30 -174 -159 99 -66 1 -175 19 -16 252 38 -93 32 78 84 -29 100 -98 278 -112 -95 128
7011 128 -72 39 147 -16 -181 -75 208 202 178 292 60 26 4 175 144 51 6 -89 116 -134 -67 138 -88
7034 -88 118 19 -96 -130 -128 -53 11 -101 -125 -318 -121 -145 32 109 83 44 -94 118 68 73 -141 93 49 -30 2 41
7060 41 -137 -244 -146 -135 -143 -80 271 -143 24 2 138 -17 43 397 88 -61 169 72 -84 49 -158 -167 247 133
7084 133 -31 95 110 56 36 -48 -19 -11 -26 -214 -67 -6 -92 44 -99 48 97 -17 149 24 -4 33 -28 -36 -23 120
$$ packed form
6915a47J12j54l5K37k55J45J75k8k7k99L64qj42R0j47mN2J72k3R9k04K52j80j9
6939B6j5J45Q5k9l29K62k37r3K44M8j51q8j68M35j46J49pk33j7J96r5J1j8n5p4
6964a54J13N7K52m46J22L48n97J63K52j3j55J41rj42n7j6J2J02q0P4m3r8O7P0
6988c7J32j25j44J5K58j65O7j76J94l5K68k14j31J25M6Oj13J29j98L76l90J7K23
7011A28k00J11J08j63j65J06K83ok4J14k32l4k2J71l1r3m5r5K05k50O7K05k26
7034h8K06r9j15l4KP5O4j12k4j93J97k4J77P7k6l9j38K12n0Nk14K34m4p9L2L9
7060D1j78j07R8J1qO3L51m14J67k2J36j55O0L54l09j49K30r7j56J33k07rM14j14
7084A33j64J26J5n4k0q4K9Qj5j88J47O1q6J36j43J47M9j14J66j25k8L7o1qJ3J43
$$ plain form
7110 120 -182 -119 -142 -44 107 201 36 -20 7 77 45 -21 142 46 -18 30 91 -183 109 -190 142 117 14 -52 88
7135 88 -22 -120 -64 -36 -94 205 206 116 -136 143 -5 -113 106 9 -54 38 92 115 230 -53 -152 48 16 48 38 147
7161 147 26 -126 21 -101 -22 -73 -98 -94 -146 50 -85 -98 83 13 96 386 -14 -166 252 -97 274 -157 -37
7184 -37 128 -77 -14 -83 62 -74 11 -71 -150 -2 16 136 -60 -28 80 1 43 -52 -196 -18 -147 137 -52 -298
7208 -298 15 58 -59 134 -74 40 -113 -87 49 -129 -100 -127 -15 -10 36 -33 82 145 -267 -13 216 -89 191
7231 191 91 123 249 45 177 209 142 89 -39 153 -16 6 -20 176 -46 -100 108 82 -112 71 167 -8 -88
7254 -88 -59 114 179 -39 -92 89 -79 -113 87 -134 202 -43 39 58 43 60 -44 -22 -85 -67 81 -61 -237 21
7278 21 -32 -113 -290 -250 41 -47 81 -166 90 37 120 160 35 -153 -23 29 42 -85 -34 -11 -107 -107 -91 109 -91
$$ packed form
7110A20l02O3k3R8J51R4j65n6K7P0l2o6J63r6o4M8O1k74K92k99L32k5j03o6J40
7135H8j10r8N6K8n8K99Jr0k52K79j48j08K19r7o3R2N4K3J15k83r9K00l2L2j0J09
7161A47j21j52J47j22P9n1k5Mn2J96j35j3J81p0Q3K90m00j52M18l49L71m31J20
7184c7J65k05O3o9J45j36Q5q2p9J48J8J20j96L2J08p9M2r5j44J78j29K84j89k46
7208b98L13M3j17J93k08J14j53K6J36j78K9k7J12NM6o9J15O3m12K54K29l05K80
7231A91j00L2J26k04J32L2o7n3j28J92j69K2k6J96k22n4K08k6j94J83R6j75q0
7254h8K9J73O5k18n3J81j68l4K00k21L36k45Q2J9j5J7j04K2o3J8J48j42j76K58
7278B1n3q1j77M0K91q8J28k47K56n3Q3M0j25j88J30N2J3j27N1K3r6%J6K00k00
$$ plain form
7303 -91 -64 -70 -40 22 40 160 80 -128 34 -197 63 7 -196 -55 -67 -57 -113 -24 -51 -159 41 116 -60 114 139
7328 139 23 51 -71 -219 -41 -58 42 -53 -38 70 18 4 96 89 -34 -60 -89 -103 -87 -112 -57 6 -196 -13 166
7353 166 65 64 -20 -208 -25 35 -38 55 -90 109 89 -59 -16 -124 -38 9 -118 -148 -67 99 -106 -9 -200 -118 -137
7378 -137 -100 25 -46 135 -41 56 34 112 -11 34 174 42 -28 -158 180 152 199 185 105 -36 -71 17 -22 68 -38
7403 -38 84 14 -40 -178 139 156 -61 30 47 -39 70 161 -186 -97 -102 -107 -43 -20 361 24 -67 53 153 -218 -238 -34
7429 -34 38 68 -95 -209 -49 -102 -86 -41 -140 -3 -67 164 55 -98 10 -7 38 -86 149 3 -73 -323 -90 190
7453 190 -53 -110 80 -7 59 38 -104 -21 19 165 21 -68 -135 128 -32 -2 274 102 -17 -53 -173 35 132 -91
7477 -91 -1 24 56 -116 42 265 -49 115 -17 168 146 4 -74 102 -121 -146 -144 15 61 -14 -12 -67 -44 63 108
$$ packed form
7303i1K7oL0O2J8J20q0k08J62k31K60n6k03J41j2J0n6Q9k7j08K00P5j76J74K5
7328A39j16K8j22j48J78j7J00r5J5J08n2j4R2pj23k6k9j4J6k5N5O3k02J83J79
7353A66j01jq4j88J83O0p3R3j45J99k0j48M3j08Q6M7j27l0Q1J66k05R7j91Q2j9
7378a37L7J25p1J81j76R7k2P8j23M5J40j32p0j30L38k8M7j4q0j41l5Q8l9R0j06
7403c8J22p0n4j38L17J7k17R1J7q6J09R1l47Q9nnO4K3L81l37r1J20J00l71k0K04
7429c4P2L0j63j14J60n3J6M5r9J37o4K31j09j53J08j7M5j24K35j46p6k50K33K80
7453A90k43n7J90q7O6k1j42Q3M0J46j44q9o7K63j60L0K76j72j19l6j20K08R7k23
7477i1R0K5L2j72J58K23l14J64j32J85k2j42p8J76k23k5KJ59M6p5Kn5K3J07M5
$$ plain form
7502 108 -69 -97 184 -16 60 -178 70 102 -39 -248 211 126 -246 11 -29 -132 -107 -164 48 129 -137 -177 -43
7525 -43 -153 196 -143 93 -17 -30 88 106 34 68 145 -64 -87 42 -216 -63 134 14 52 62 104 17 72 -58
7549 -58 80 193 59 -70 -51 78 -8 94 -177 -100 -78 50 -97 -50 -31 -17 -44 -184 28 -76 -132 -94 211 99
7573 99 -99 128 -66 -130 -30 9 221 90 43 -200 46 143 93 -335 -16 -23 93 -153 -108 -237 51 -40 -203
7596 -203 -37 120 -72 -112 -126 -84 243 62 -117 -208 77 -266 187 -123 14 84 159 192 107 272 63 207 -61
7619 -61 -132 -100 160 137 120 129 58 259 -51 130 -165 -106 -64 -10 17 54 58 66 -50 139 -49 33 -49 -46 -14 115 133 -274
7647 -274 81 63 43 -121 -85 -87 135 205 204 164 -114 -31 -56 -407 31 -72 -27 96 -102 -109 280 92 -100 -208 -210
7672 -210 13 -1 35 -111 147 83 -71 -243 149 13 9 29 -75 40 253 65 -2 -25 106 -64 -270 -130 221
$$ packed form
7502A08j77k8K81k00P6k38K48L2j41k09M59q5l72K57m0j03K5n7K12Q1k66m0J34
7525d3j10L49l39K36j10j3J18J8p2L4P7k09k3J29k58J53J97j20L8J0M2q7N5j30
7549e8J38J13j34j29J9J29q6J02k71P7K2J28j47M7J9J4k7j40K12j04n6L8L05j12
7573I9j98K27j94o4J00L9K12j31m7k43K46R7n0m28L19pJ16k46M5j29K88r1j63
7596b03J66J57j92m0j4M2L27j81j79r1K85l43M53l10J37P0P5L3q5J65k09J44k68
7619f1p1L2K60k3j7Rp1K01l10J81k95N9M2N4K7L7MQj16J89j88Q2q2LL2J29J8m07
7647b74L55j8k0j64L6kK22P0jm0k78Q3k5l51M38j03M5J23j98pL89j88j92j08k
7672b10K23j4L6j46K58o4j54j72L92j36mK0j04J15K13j88o7k3J31j70k06J40L51
$$ plain form
7695 221 -84 58 184 -102 31 38 213 98 -14 -203 41 142 -63 17 73 -116 -65 -72 92 -120 -281 25
7717 25 215 -126 119 -371 -64 -95 6 -74 86 107 -70 -96 21 -167 -155 71 68 37 -49 -152 143 144 73 203
7741 203 0 79 148 -50 120 74 -1 -63 108 105 121 9 29 103 -171 32 99 -49 -125 200 -110 43 -38 -12 104
7766 104 31 -1 99 -48 -204 64 129 -158 57 -22 95 121 38 150 10 119 72 6 239 -39 -55 128 6
7789 6 -105 -36 173 -135 -63 133 -253 198 -137 -142 72 -113 -145 171 33 -143 7 -236 -62 5 36 -152 -30
7812 -30 -10 97 45 84 148 -74 315 137 120 -74 -126 104 -6 189 98 49 -216 110 -151 -185 38 87 -102 -105
7836 -105 43 -54 -40 -17 -89 -146 -76 -23 -117 123 4 170 -78 105 42 -91 -213 24 211 -82 10 110 -55
7859 -55 -105 -65 62 138 91 -139 90 30 -11 -305 243 35 -141 71 -26 -27 -148 41 -45 -60 -84 203 50 58 -16
$$ packed form
7695B21l05J42J26k86J33PJ75j15j12j89K44J01k05Q0N6j89N1pJ64k12j61L06
7717B5J90l41K45m90L07l1J01q0J60K1j77k6J17j88J2K26ll1q6j03K95Jp1J30
7741B03k03P9O9j98J70m6p5o2J71lJ6j12K0P4k74K03O7j48p6L25l10J53q1K6J16
7766A04p3l2J00j47j56K68O5k87K15p9J17K6q3J12j40J09m7o6K33k78j6J83j22
7789Fj11O9K09l08P2J96l86M51l35nK14j85l2L16j38j76J50k43J74O7L1j88J22
7812c0K0J07n2L9O4k22L89j78j7j94n2K30j10J95r1m9k65L26k61l4K23M9j89l
7836a05J48r7J4K3p2n7P0N3r4K40j19J66k48J83o3j33j22K37J87k93R2J00j65
7859e5n0M0J27P6m7k30K29o0m1k94N48k08j76K12r7jj21J89q6j5k4K87j53Qp4
$$ plain form
7884 -16 232 -34 -148 31 35 -71 55 79 -72 -247 305 42 135 121 -144 -23 72 71 -182 -233 96 -120 -53 76
7908 76 -162 2 -222 -59 155 -68 65 -29 -410 -211 197 182 -75 -314 20 273 -19 291 102 -131 -31
7929 -31 94 173 35 -162 -116 -26 12 18 205 -160 -126 2 86 159 87 -209 -318 120 69 124 76 101 8 45 -158 -276
7955 -276 -160 28 -141 -117 -66 81 -129 101 -33 28 -199 -39 -29 -29 -2 -232 89 -113 -152 -127 33 -45 -22 -89
7979 -89 94 -67 -298 8 77 -189 -62 51 -258 90 -34 71 27 56 -21 10 157 -21 79 130 143 30 197
8002 197 -187 40 -5 213 -93 -258 -7 -196 139 -84 -142 87 148 -68 66 -65 23 78 -196 -239 -247 43 -84
8025 -84 139 -196 -51 -135 -105 -24 12 25 100 -119 5 -168 33 107 95 59 242 -365 -66 23 163 22 -38 14
8049 14 -21 -36 -23 -78 46 -88 -11 144 -149 7 176 33 -129 346 131 -93 54 12 163 -107 -153 128 210
$$ packed form
7884a6K48k66j14J79Mj06J26K4j51j75N52k63R3j4k65J21R5jk53n1L29k16O7J29
7908G6k38J64k24J63K14k23J33r4l81J99M08j5k57k39L34K53k92L10j89k33J00
7929c1J25P9j38j97M6R0L8OJ87l65L4J28Q4P3p2k96j09M38n1N5m8K5r3L7k03j18
7955b76J16J88j69K4N1J47k10K30j34O1k27J60J0%K7k30L21k02l9K5J60p8K3o7
7979h9J83j61k31L06O9k66J27J13l09L48j24J05m4K9p7L1J47j78J00N1J3j13J67
8002A97l84K27m5K18l06j65K51j89L35k23n8K29O1k16J34j31Q8N5k74m3qK90j27
8025h4K23l35J45q4L0Q1L6J3P5k19J24j73K01P4j2l6J83o07K99Q9J40j41o0N2
8049A4l5j5J3n5J24j34P7J55k93J56J69j43j62M75k15k24J47m2J51k70m6K81Q2
$$ plain form
8072 210 167 121 -88 -35 239 -12 139 83 101 -57 53 31 -9 -68 -6 -50 29 -224 -29 223 -12 114 27 83
8096 83 -83 263 -44 -175 -32 -1 -82 66 82 93 2 10 11 -96 -56 26 37 52 -28 101 -22 -94 -17 -63 13 -31 165
8123 165 28 -60 176 -116 -9 10 -19 24 -99 -382 -34 12 -125 -132 -9 7 62 -89 -157 69 -273 13 -43 -20
8147 -20 65 -103 32 7 -11 13 27 17 91 45 -4 108 -191 -130 64 -154 136 -19 -9 -98 -310 -34 73 105 3
8172 3 -150 -129 -23 -63 28 100 -5 -52 -80 -43 186 -221 -51 -98 -199 176 -91 -175 -275
$$ packed form
8072B10m3m6k09N3K74k51J51n6J8j58J10k2m0n9O2m4P9k53J95K52k35J26q7N6
8096H3j66L46l07j31J43L1q1J48J6J1r1QJj07M0Q2J1J5q0J29j23p2P7m6P6m4J96
8123A65j37q8K36k92J07J9k9M3j23k83L48M6j37pJ23J6N5j51o8K26l42K86n6K3
8147b0Q5j68J35k5j8K4J4j0P4m6m9J12k99O1J94k18K90j55J0q9k12K76J07L2j02
8172Cj53K1J06m0R1P2j05m7k8L7K29m07J70m7j01L75k67q4j00
8191b75
$$ Imaginary data points
##PAGE= N=2
##DATA TABLE= (X++(I..I)), XYDATA
$$ plain form
0 0 0 0 0 0 0 0 0 0 0 0 0 0 0 0 -8 8 -8 8 -16 16 -16 24 -24 32 -35 40 -48 56 -64 75 -88 97 -112 128 -144 163
36 163 -182 205 -229 254 -285 317 -353 389 -432 477 -528 583 -641 706 -777 857 -944 1042
54 1042 -1147 1270 -1407 1564 -1745 1954 -2205 2507 -2877 3352 -3980 4854 -6170 8408 -13316
69 -13316 51891 -34223 15463 49176 -49370 68214 10124 11248 41618 -9472 35365 -15044
81 -15044 -36836 50476 -2337 22238 11092 -50566 2547 -11023 -12255 24717 -26943 -22068 418
94 418 -15806 -34508 -23565 1996 -22298 -15645 -10341 -56281 -28619 -7756 -14993 -18611 -37345
107 -37345 -15468 -32459 -36327 3034 -38550 -23365 -273 -44794 -16933 -28554 -39517 10909
119 10909 -18912 -19519 -7964 -42022 -13596 -5859 -14501 -2139 -19979 -5856 -8674 -28917 1097
$$ packed form
0@%%%%%%%%%%%%%%qJ6j6J6k4L2l2M0m8N6o7P5q8J04j20J39j63J85k09K40k72L07
36A63l45L87m34M83n39O02o70P42q21R09j005J111j224J347j483J634j801J986
54A042k189K417k677K971l309L699m159M712n384O229p332Q834j1024J4578k1724
69a3316O5207q6114M9686L3713r8546J17584n8090J124L0370n1090M4837n0409
81a5044k1792Q7312n2813K4575j1146o1658N3113j3570j232L6972n1660M875K2486
94D18j6224j8702J0943K5561k4294O653N304m5940K7662K0863p237l618j8734
107c7345K1877j6991l868L9361m1584J5185K3092m4521K7861j1621j0963N0426
119A0909k9821o07J1555l4058K8426P737q642J2362j7840J4123k818k0243L0014
$$ plain form
132 1097 -3049 -7841 14470 -6204 -15784 -5175 -7217 4312 8659 1579 2371 -4702 -3519 6147
146 6147 1404 5954 14159 6134 4579 -348 -4034 10782 11897 10140 12641 -139 2415 8054 5336
161 5336 12991 11430 9908 8680 785 5863 5567 7486 17217 9931 6682 4555 941 9531 10640
176 10640 12154 12121 4453 6561 2929 3609 11488 9518 12978 9618 2311 5979 2768 7730 13722 9109
192 9109 10368 3794 1110 6582 4918 10866 10593 6098 7754 581 1818 5784 4980 11285 6187 2004
208 2004 2415 -2935 3063 4920 3494 6795 -1277 -2052 -1431 -5000 2740 1023 -362 1532 -7960 -6719
224 -6719 -4750 -6460 784 -3297 -6516 -6082 -12594 -8609 -7036 -8475 -3438 -8218 -11257 -11112 -14408 -9689
240 -9689 -7781 -8666 -7177 -12078 -14055 -12336 -11985 -8312 -6932 -8600 -9707 -12174 -12381 -10152 -8084 -5297
$$ packed form
132A097m146m792K2311k0674r580J0609k042J1529M347p080P92p073J183R666
146F147m743M550Q205q025j555m927l686J4816J115j757K501j2780K554N639k718
161E336P655j561j522j228p895N078k96J919R731p286l249k127l614Q590J109
176A0640J514l3p668K108l632O80P879j970L460l360p307L668l211M962N992m613
192I109J259o574k684N472j664N948k73m495J656p173J237L966q04O305n098m183
208B004M11n350N998J857j426L301q072p75O21l569P740j717j385J894r492J241
224f719J969j710P244m081l219M34o512L985J573j439N037m780l039J45l296M719
240i689J908q85J489m901j977J719L51L673J380j668j107k467k07K229K068K787
$$ plain form
256 -5297 -5186 -7339 -9096 -9100 -7611 -4999 -1967 -1853 -3030 -4311 -5395 -3581 -752 1551 3045 1866
272 1866 284 -28 540 2976 5769 6272 6275 4847 3249 4248 5878 8111 10216 9056 7647 6694 5958
289 5958 7545 9309 10426 10735 8624 6638 6348 6656 9101 10572 9430 8279 6098 4529 5526 6161
305 6161 7357 7035 5837 4332 2358 2208 3718 4570 4784 3288 807 -107 -885 -48 1187 927 157
322 157 -1023 -3005 -3381 -2376 -1275 -360 -1363 -3146 -4349 -5051 -4029 -2802 -2690 -2248 -2970 -4776 -4731
339 -4731 -4585 -3352 -1760 -2074 -2945 -4167 -5236 -4128 -3032 -1937 -920 -2076 -2572 -2767 -3149 -1931 -821
356 -821 -243 -569 -1806 -2476 -2104 -1412 -267 808 290 -390 -860 -1196 -871 114 314 669 -301 -1387 -1386 -1157
376 -1157 231 1208 -120 -38 -601 -2104 -746 -739 -847 663 -724 -1440 -1418 -2331 -892 -161 -646 234 -1849
$$ packed form
256e297J11k153j757mJ489K612L032J14j177j281j084J814K829K303J494j179
272A866j582l12N68K436K793N03Lj428j598R99J630K233K105j160j409r53p36
289E958J587J764J117L09k111j986k90L08K445J471j142j151k181j569R97O35
305F161J196l22j198j505j974j50J510Q52K14j496k481r14p78Q37J235k60p70
322A57j180j982l76J005J101R15j003j783j203p02J022J227J12M42p22j806M5
339d731J46J233J592l14q71j222j069J108J096J095J017j156m96j95l82J218J110
356h21N78l26j237o70L72O92J145J075n18o80m70l36L25R85K00L55r70j086JK29
376a157J388R77j328Q2n63j503J358Pj08J510j387p16K2r13J439P31m85Q80k083
$$ plain form
395 -1849 -2425 -1419 -1807 -804 -290 -1529 -103 -1257 -2241 -107 -724 291 1100 -969 -784 -453 -545 1205
413 1205 693 1100 1513 -50 1540 1796 1000 3049 2750 2315 2600 1081 2145 2974 3700 4456 2675 2923
431 2923 3370 2849 3646 3256 3935 4346 2886 3148 2501 2146 4266 3574 3450 2620 1210 2518 1791 2225 2844
450 2844 214 1488 1756 -174 642 -539 495 953 -969 -708 -1988 -1898 -458 -2454 -1684 -2538 -3240
467 -3240 -1988 -3602 -2759 -3136 -4081 -2308 -3880 -3703 -4318 -4796 -1813 -3336 -4427 -3160 -5173 -2358 -2625
484 -2625 -4876 -1760 -3848 -2393 -1156 -5076 -1357 -2076 -2936 965 -2745 -1416 -79 -3079 1671 484
500 484 -1416 1855 -555 1344 2026 -950 2370 2451 1790 3325 473 1864 3868 2225 2606 3216 2323
517 2323 3312 3129 2094 3414 3030 2135 3876 2529 1739 3161 1305 2989 3677 324 2204 1639 738
$$ packed form
395a849n76J006l88J003N14j239J426j154r84K134o17J015Q09k069J85L31r2J750
413A205n12M07M13j563J590K56p96K049k99m35K85j519J064Q29P26P56j781K48
431B923M47n21P97l90O79M11j460K62o47l55K120o92j24q30j410J308p27M34O19
450B844k630J274K68j930Q16j181J034M58j922K61j280R0J440j996P70q54p02
467c240J252j614Q43l77r45J773j572J77o15m78K983j523j091J267k013K815k67
484b625k251L116k088J455J237l920L719p19q60L901l710J329J337l000M750j187
500D84j900L271k410J899O82k976L320Q1o61J535k852J391K004j643L81O10q93
517B323R89j83j035J320l84q95J741j347p90J422j856J684O88l353J880n65r01
$$ plain form
534 738 2952 -579 729 2597 -1116 1359 99 -1475 1788 -1202 -693 909 -2599 -638 -661 -2196
550 -2196 424 -2050 -2658 -415 -2272 -1885 -1774 -2637 -742 -1048 -3062 -1711 -1955 -2399 -385 -2427 -2048
567 -2048 151 -2341 -1222 -400 -1924 313 -702 -1414 1364 -1713 -440 1246 -822 2022 268 -1124
583 -1124 2339 -1 979 1900 -266 2396 1447 304 2152 618 1572 1829 618 1885 1017 599 1602
600 1602 1098 1652 838 551 992 737 764 92 538 925 25 4 -537 -380 391 -1012 -686 -322 -1282 -342
620 -342 -1385 -1090 -128 -1847 -1196 -1331 -1827 -1031 -1749 -1574 -802 -1260 -1190 -1677 -1230 -791 -1062 -994 -931 -1017 -635
641 -635 -1097 -662 -390 -268 166 -597 14 -152 -479 1147 236 645 1035 -109 1366 1452 903 2022 1103
660 1103 1644 1979 750 1638 1779 1498 2275 1405 1487 1642 1243 1719 1728 1396 1754 1088 748 1321 726 1036 1063
$$ packed form
534G38K214l531J308J868l713K475j260j574L263k990N09J602l508J961k3j535
550b196K620k474o08K243j857L87J11q63J895l06k014J351k44m44K014k042L79
567b048K199k492J119Q22j524K237j015p12K778l077J273J686k068K844j754j392
583a124L463k340R80R21k166K662r49j143J848j534R54K57j211J267q68m18J003
600A602n04N54q14k87M41k55K7o72M46L87r00k1n41J57P71j403L26L64r60R40
620c42j043K95R62j719O51j35m96P96p18J75P72m58P0m87M47M39k71O8O3q6L82
641f35m62M35K72J22M34p63O11j66l27J626r11M09L90j144J475Q6n49J119r19
660A103N41L35j229Q88J41k81P77q70Q2J55l99M76Rl32L58o66l40N73n95L10K7
$$ plain form
681 1063 654 488 196 -326 232 -57 -439 -244 -778 -818 -1039 -1262 -756 -681 -1403 -1284 -1615 -1606 -1563 -1943 -1615 -1114
703 -1114 -2030 -2026 -2248 -2202 -1661 -1734 -1539 -1551 -2176 -1702 -1506 -1627 -994 -1122 -1051 -1062 -1275 -1304 -754 -509 -62 100 -399
726 -399 -58 -17 316 818 773 1012 978 790 798 1043 1510 1749 1619 1586 1668 1749 1774 1730 2121 1983 1901 1512 1685 1312
750 1312 1591 2045 2062 1659 1150 1191 889 1146 1452 1098 1014 746 519 69 169 266 645 -20 -34 -565 -790 -648
772 -648 -808 -462 -604 -783 -1137 -1359 -1372 -1014 -1044 -1154 -1326 -1432 -1725 -1688 -1516 -1395 -991 -1306 -1357 -1421 -1272 -1328
794 -1328 -863 -698 -875 -811 -789 -813 -684 -196 -54 -142 -466 -171 -308 -189 270 1036 828 426 373 417 560 675
816 675 1051 1048 1299 545 524 876 926 1144 969 1033 914 438 674 521 845 847 568 279 260 51 237 702 277
839 277 461 -75 -503 -459 -401 -211 6 -533 -699 -691 -1195 -798 -674 -465 -150 -939 -984 -1047 -1268 -703 -598 -723
$$ packed form
681A063m09j66k92n22N58k89l82J95n34m0k21k23N06P5p22J19l31RM3l80L28N01
703a114r16Mk22M6N41p3J95j2o25M74J96j21O33j28P1j1k13k9N50K45M47J62m99
726c99L41M1L33N02m5K39l4j88QK45M67K39j30l3Q2Q1K5m4L91j38q2l89J73l73
750A312K79M54J7m03n09M1l02K57L06l54q4k68k27m50J00R7L79o65j4n31k25J42
772f48j60L46j42j79l54k22j3L58l0j10j72j06k93L7J72J21M04l15n1o4J49n6
794a328M65J65j77O4K2k4J29M88J42q8l24K95j37J19M59P66k08m02n3M4J43J15
816F75L76lK51p54k1L52N0K18j75O4j19m76K36j53L24Kk79k89j9k09J86M65m25
839B77J84n36m28M4N8J90K17n39j66Qn04L97J24K09L15p89m5o3k21N65J05j25
$$ plain form
861 -723 -717 -1111 -935 -928 -851 -129 -161 -424 -356 -699 -488 119 239 259 194 -22 -199 321 311 551 789 1076 762 476
885 476 590 962 1106 1646 1455 997 1146 926 947 1479 1566 1403 1309 826 940 1038 824 1321 1452 916 676 -78
907 -78 398 821 779 700 206 -4 19 -604 -400 8 123 -92 -813 -1092 -1037 -992 -785 -468 -728 -1045 -1551 -1707
929 -1707 -1227 -1192 -1201 -1236 -1293 -1438 -1802 -1740 -1222 -820 -996 -1310 -1407 -1331 -1040 -743 -540 -775 -506 -1175 -851 -368 -337
952 -337 63 127 -269 237 -225 -34 417 869 882 642 297 635 346 684 1011 826 1328 1114 776 1118 966
973 966 859 1423 1401 1030 1107 282 814 1408 1275 1219 817 409 660 480 246 868 653 408 355 -266 -96 -230
995 -230 -174 757 -309 -677 -326 -1026 -344 -315 -763 -494 -609 -591 -384 -1571 -563 -166 -910 -600 -1303 -1212 -635
1016 -635 -962 -294 -157 -860 -772 -260 -754 -194 -337 -64 356 -486 -551 -235 70 585 545 -61 519 406 459
$$ packed form
861g23Ol94J76PP7P22l2k63O8l43K11O07J20K0o5k16j77N20j0K40K38K87l14k86
885D76J14L72J44N40j91m58J49k20K1N32Q7j63r4m83J14R8k14M97J31n36k40p54
907g8M76M23m2p9m94k10K3o23K04M08J15k15p21k79N5M5K07L17k60l17n06j56
929a707M80L5rl5n7j45l64O2N18M02j76l14r7P6K91K97K03k35K69o69L24M83L1
952c37M00O4l96N06m62J91M51M52J3k40l45L38k89L38L27j85N02k14l38L42j52
973I66j07N64k2l71P7q25N32N94j33n6m02m08K51j80k34O22k15k45n3o21J70j34
995b30N6R31j066l68L51p00O82K9m48K69j15J8K07j187J008L97p44L10p03R1N77
1016f35l27O68J37p03Q8N12m94N60j43K73M20q42o5L16L05N15m0o06N80j13N3
$$ plain form
1037 459 715 46 1102 1143 91 771 487 583 1295 636 1343 860 156 763 462 842 1085 376 932 754
1057 754 276 327 144 317 1044 49 -366 -75 -200 94 -310 -516 7 -681 -834 -590 -751 -268 -557 -815
1077 -815 -688 -1089 -1594 -1017 -813 -537 -682 -1279 -1321 -829 -1003 -805 -1079 -606 -188 -1213 -1141 -381 -934 -180
1097 -180 -356 -675 -50 -500 -464 332 -166 451 241 -1 759 77 280 816 618 1020 680 37 1006 876
1117 876 973 1448 589 1224 1028 572 1118 962 1070 1118 783 696 1123 359 1028 853 772 626 298 555 872
1138 872 556 558 424 513 235 16 -58 187 109 -295 5 -306 -452 -232 -557 -363 -455 -827 -724 -955 -623 -527
1160 -527 -853 -594 -482 -1054 -714 -1031 -908 -471 -730 -594 -569 -1020 -483 -646 -463 -257 -517 -179 -316 -354 23
1181 23 -370 154 349 -135 95 -9 132 473 532 496 631 221 255 481 272 824 786 352 948 632 519 692
$$ packed form
1037D59K56o69J056M1j052O80k84R6P12o59P07m83p04O07l01L80K43p09N56j78
1057G54m78N1j83J73P27r95m15K91j25K94m04k06N23o88j53K44j61M83k89k58
1077h15J27m01n05N77K04K76j45n97m2M92j74J98k74M73M18j025P2P60n53P54
1097a80j76l19O25m50L6P96m98O17k10k42P60o82K03N36j98M02l40o43R69j30
1117H76R7M75q59O35j96m56N46j56J08M8l35q7M27p64O69j75q1j46l28K57L17
1138H72l16Kj34Q9k78k19p4K45p8m04L00l11j46K20l25J94r2l72J03k31L32R6
1160e27l26K59J12n72L40l17J23M37k59J36K5m51N37j63J83K06k60L38j37l8L77
1181B3l93N24J95m84K30j04J41L41N9l6J35m10L4K26k09N52l8m34N96l16j13J73
$$ plain form
1203 692 719 557 653 536 492 416 315 595 247 361 171 -73 63 20 -60 97 64 -133 -194 -347 -330 -380 -297 -487
1227 -487 -254 -899 -492 -528 -606 -284 -832 -765 -789 -799 -977 -670 -624 -383 -640 -715 -760 -574 -575 -524 -185 -503 -303 -328
1251 -328 -70 -234 -28 -66 -21 101 33 234 285 334 430 496 358 382 457 721 615 660 495 726 622 723 849
1274 849 762 980 652 545 739 436 553 593 691 808 478 501 27 369 471 352 695 656 146 113 -191 -275
1296 -275 11 -16 -140 -589 -379 -352 -411 -295 -460 -597 -629 -867 -602 -732 -744 -509 -804 -544 -590 -755 -710 -719 -733
1319 -733 -466 -596 -683 -657 -738 -517 -325 -515 -311 22 -149 55 48 265 149 71 144 268 361 284 440 514 319
1342 319 338 242 338 582 510 444 636 464 576 580 544 427 664 659 319 564 364 409 659 354 170 364 317 98
1366 98 8 238 271 145 24 -69 -150 -215 -368 41 -198 -169 -343 -376 -438 -406 -377 -509 -423 -644 -617 -493 -454 -440 -625
$$ packed form
1203F92K7j62R6j17m4p6j01K80l48J14j90k44J36m3q0J57l3j97o1j53J7n0Q3j90
1227d87K33o45M07l6p8L22n48O7k4j0j78L07M6K41k57p5m5J86jN1L39l18K00k5
1251c28K58j64K06l8M5J22o8K01N1M9R6O6j38K4P5K64j06M5j65K31j04J01J26
1274H49q7K18l28j07J94l03J17M0R8J17l30K3m74L42J02j19L43l9n10l3l04q4
1296b75K86k7j24m49K10K7n9J16j65j37l2k38K65j30j2K35k95K60m6j65M5rj4
1319g33K67j30q7K6q1K21J92j90K04L33j71K04pK17j16p8P3J24R3p7J56P4j95
1342C19J9r6R6K44p2o6J92j72J12Ml6j17K37nl40K45k00M5K50l05j84J94m7k19
1366I8r0K30L3j26j21r3q1o5j53M09k39K9j74l3o2L2K9j32Q6k21K7J24L9J4j85
$$ plain form
1391 -625 -632 -584 -576 -420 -582 -284 -282 -264 -414 -566 -412 -312 -54 136 -57 -28 132 -239 215 45 424 163 -38
1414 -38 353 412 239 181 519 404 580 396 392 926 520 462 468 302 715 466 523 472 444 456 482 333 556 184
1438 184 166 373 249 53 171 -46 352 77 -56 53 -185 -46 28 -329 -228 -207 -210 -281 -490 -555 -450 -527 -421
1461 -421 -105 -782 -415 -467 -360 -438 -814 -692 -72 -299 -588 -408 -534 -109 -220 -572 -243 -249 -278 -97 -195 29
1483 29 124 -233 27 -1 294 303 127 229 675 81 135 736 221 676 330 110 758 587 377 660 255 470
1505 470 480 369 585 655 132 712 3 549 435 -147 503 406 3 193 32 218 349 -216 -1 211 -222
1526 -222 0 -469 -534 15 -572 -621 -358 -652 -302 -354 -538 -76 -441 -743 -239 -393 -313 -132 -754 -104 -461
1547 -461 -483 -282 -342 -143 -332 -377 -249 48 -382 51 -220 -24 314 -294 15 214 -135 102 250 155 583
$$ packed form
1391f25pM8QJ56j62K98KJ8j50j52J54J00K58J90j93K9J60l71M54j70L79k61k01
1414c8L91N9j73n8L38j15J76j84mN34m06n8Oj66M13k49N7n1k8J2K6j49K23l72
1438A84j8K07j24j96J18k17L98k75j33J09k38J39P4l57J01K1lp1k09o5J05p7J06
1461d21L16o77L67n2J07p8l76J22O20k27k89J80j26M25j11l52L29ok9J81r8K24
1483B9R5l57K60k8K95Rj76J02M46n94N4O01n15M55l46k20O48j71k10K83m05K15
1505D70J0j11K16P0n23N80p09N46j14n82O50r7m03J90j61J86J31n65K15K12m33
1526b22K22m69o5N49n87m9K63k94L50n2j84M62l65l02N04j54Q0J81o22O50l57
1547d61k2K01o0J99j89m5J28K97m30M33k71J96L38o08L09J99l49K37J48r5M28
$$ plain form
1568 583 282 79 226 223 520 236 -51 667 430 501 535 497 352 565 362 464 57 308 577 404 464 709
1590 709 89 240 157 141 440 24 262 73 -425 33 -39 -102 -16 -195 -210 -163 -185 -231 -262 -323 -359 -196 -536 -346
1614 -346 -282 -428 -362 -280 -330 -430 -566 -425 -127 -167 -198 -486 -150 -160 -205 -227 -188 188 -25 -177 -305 172 -2
1637 -2 145 41 -13 177 -77 153 248 180 368 255 438 337 254 494 333 443 413 440 131 377 367 276 467
1660 467 251 327 403 229 116 167 -28 333 156 58 17 -38 91 232 -12 35 -172 -211 -427 -263 -78 -204 -149
1683 -149 -179 -536 -494 -214 -446 -215 -364 -630 -506 -420 -202 -143 -147 -420 -422 -315 -144 -231 -311 -117 -242 115 -235
1706 -235 -480 -103 -108 -4 -63 106 53 255 0 228 425 177 301 230 151 304 239 367 117 348 292 254 328
1729 328 515 338 288 384 370 192 238 264 240 259 218 256 59 -58 156 60 -72 159 65 -7 -169 20 137 -2
$$ packed form
1568E83l01k03J47lK97k84k87P18k37P1L4l8j45K13k03J02m07K51K69j73O0K45
1590G09o20J51q3j6K99m16K38j89m98M58p2o3Q6j79j5M7k2m6l1o1l6J63l40J90
1614c46O4j46O6Q2n0j00j36J41K98m0l1k88L36j0m5k2L9L76k13j52j28M77j74
1637bJ47j04n4J90k54K30R5o8J88j13J83j01q3K40j61J10l0K7l09K46j0r1J91
1660D67k16P6P6j74j13N1j95L61j77r8m1n5J29J41k44M7k07l9k16J64J85j26N5
1683a49l0l57M2K80k32K31j49k66J24Q6K18N9mk73kJ07J71q7q0J94j25L57l50
1706b35k45L77nJ04n9J69n3K02k55K28J97k48J24p1p9J53o5J28k50K31n6l8P4
1729C28J87j77n0R6j4j78M6K6k4J9m1L8j97j17K14r6j32K31r4p2j62J89J17j39
$$ plain form
1753 -2 -60 -307 -203 -380 -322 -63 -302 -223 -324 -532 -467 -382 -187 -370 -339 -215 -478 -279 -400 -528 -111 -273 -365
1776 -365 -279 -338 -236 -206 -177 -195 -295 -223 -21 -213 -42 65 -66 6 67 422 120 263 226 345 366 130 223 218
1800 218 217 349 371 725 421 300 150 316 294 352 473 554 351 279 297 202 192 65 5 114 196 231 300 196 259
1825 259 -152 -194 18 -30 -386 30 -73 -133 105 -142 -321 -227 -356 -290 -191 -207 -313 -328 -273 -402 -220 -263 -278 -195
1849 -195 -318 -15 -156 -285 -240 -91 -194 -300 138 -1 -16 209 57 19 -56 49 375 177 62 129 190 53
1871 53 61 320 65 432 413 42 203 295 390 92 224 239 351 168 302 255 207 189 211 353 32 310 -160 126
1895 126 -16 -115 -56 154 24 109 44 -38 20 259 94 -494 -162 -14 -69 -97 -485 -396 -373 -278 -191 -147 -200 -232 -334
1920 -334 -289 -403 -409 -208 -176 -349 -137 -299 -447 97 -107 -176 191 -23 117 -52 -146 44 8 264 -48 -171
$$ packed form
1753bn8k47J04j77N8K59k39P9j01k08O5Q5J95j83L1J24k63J99j21j28M17j62r2
1776c65Q6n9J02L0K9j8j00P2K02j92J71J07j31P2O1L55l02J43l7J19K1k36R3n
1800B18jJ32K2L54l04j21j50J66k2N8J21Q1k03p2J8r5j0j27o0J09Q2L5O9j04O3
1825B59m11m2K12m8l56M16j03o0K38k47j79R4j29O6R9j6j06j5N5j29J82m3j5Q3
1849a95j23L03j41j29M5J49j03j06M38j39j5K25j52l8p5J05L26j98j15O7O1j37
1871E3QK59k55L67j9l71J61R2R5k98J32J5J12j83J34m7m8j8K2J42l21K78m70K86
1895A26j42r9N9K10j30Q5o5q2N8K39j65n88L32J48n5k8l88Q9K3R5Q7M4n3l2j02
1920c34M5j14oK01L2j73K12j62j48N44k04o9L67k14J40j69r4J90l6K56l12j23
$$ plain form
1942 -171 1 238 -38 396 8 155 342 268 266 451 278 0 403 557 394 192 69 148 23 280 257 103
1964 103 501 197 78 397 -34 321 181 166 63 92 18 163 14 -35 -235 -265 -172 -95 -231 -64 -142 -25 -201
1987 -201 -301 -213 -122 -284 -128 -286 -339 -97 -230 -63 -91 -243 -199 -102 -340 -102 -202 -382 -45 -131 -19 -231
2009 -231 -212 328 108 -109 -167 -36 11 40 -65 341 283 -108 49 173 127 124 92 263 240 382 82 164 251 396
2033 396 188 55 443 -67 385 311 -192 141 148 -91 186 178 14 38 -109 24 -75 -174 37 -102 50 -312 -56
2056 -56 39 -87 -192 -95 -213 -148 -120 -139 -215 -180 -54 -171 -177 -230 1 -54 -207 -248 -30 -152 -189 -2 -47 -205 -41
2081 -41 -34 -114 -34 -217 -44 -64 -27 12 270 -109 210 324 49 202 188 172 76 177 199 256 248 211 332 154 358
2106 358 243 517 375 117 -45 164 213 227 44 171 145 30 19 -96 146 53 -5 124 61 -70 -49 -74 -201
$$ packed form
1942a71J72K37k76M34l88J47J87p4kJ85j73k78M03J54j63k02j23P9j25K57k3j54
1964A03L98l04j19L19m31L55j40j5j03K9p4J45j49m9k00l0R3P7j36J67p8J17j76
1987b01j00Q8R1j62J56j58n3K42j33J67k8j52M4R7k38K38j00j80L37q6J12k12
2009b31J9N40k20k17n8J31M7K9j05M06n8l91J57J24m6ll2J71k3J42l00Q2Q7J45
2033C96k08j33L88n10M52p4n03L33Pk39K77qj64K4j47J33r9r9K11j39J52l62K56
2056e6R5j26j05R7j18O5K8j9p6L5J26j17on3K31n5j53m1K18j22l7J87m5j58J64
2081d1Pq0Q0j83J73k0L7L9K58l79L19J14k75J53j4j6r6J01K2N7ql7J21j78K04
2106C58j15K74j42k58j62K09M9J4j83J27k6j15j1j15K42r3n8J29o3j31K1k5j27
$$ plain form
2129 -201 25 -98 -115 -62 -267 17 -31 -293 -210 38 -105 -315 -73 -283 -258 -344 -302 -269 -407 -212 -87 -32 -82
2152 -82 -405 -106 -104 -66 -133 60 -108 0 -55 -148 21 27 30 231 134 -138 -15 96 -78 332 215 -51 4 90 281
2177 281 196 332 97 136 98 385 152 54 141 39 205 221 138 -155 29 -96 -53 220 -43 27 241 -123 -60
2200 -60 -14 61 164 -67 -153 -141 -284 151 -293 -350 -150 -134 -141 78 -108 -104 -125 -144 -306 5 -188 182 11 -468
2224 -468 -202 -5 -205 -163 -6 -128 205 100 -110 105 -211 15 -39 39 -8 -78 -112 -73 87 28 -31 223 209
2247 209 68 209 -85 73 354 267 336 164 301 220 321 253 254 127 68 -61 226 222 91 211 200 73 -6 207
2271 207 229 218 48 -132 -45 -130 85 82 -39 53 -38 -112 25 -86 -227 -177 -182 -151 -98 -268 -386 -149 -284 -270 -123
2296 -123 -156 -123 0 35 -296 -147 -173 -103 -228 58 -210 4 -112 39 -113 -195 -31 -9 -56 -135 -119 -74 228 5
$$ packed form
2129b01K26j23j7N3k05K84m8k62Q3K48j43k10K42k10K5q6M2L3j38J95J25N5n0
2152h2l23K99KL8o7J93j68J08n5r3J69OLK01r7k72J23J11j74M10j17k66N5Q6J91
2177B81q5J36k35L9l8K87k33r8Q7j02J66J6q3k93J84j25M3K73k63P0K14l64O3
2200f0M6P5J03k31q6J2j43M35m44n7K00J6pK19j86Mk1j9j62L11j93L70j71m79
2224d68K66J97k00M2J57j22L33j05k10K15l16K26n4P8m7p0l4L9J60n9n9K54j4
2247B09j41J41k94J58K81q7O9j72J37q1J01o8Jj27n9j29K87mj31J20j1j27p9K13
2271B07K2j1j70j80Q7q5K15lj21R2r1p4J37j11j41N0nL1N3j70j18K37j35J4J47
2296a23l3L3J23L5l31J49k6P0j25K86k68K14j16J51j52q2J64K2m7p9J6M5L02k23
$$ plain form
2320 5 -100 40 317 -60 77 266 242 -27 10 506 229 58 152 130 179 59 139 198 259 -43 -82 37 209 104
2344 104 254 -14 20 36 50 180 44 -164 223 -67 -120 131 130 37 -208 -31 -214 -67 -168 -158 -102 -114 -238
2367 -238 -333 -232 -418 -177 -168 -79 -44 36 117 -274 -198 -118 -91 -217 47 159 124 36 -263 -159 -240 -72 32 -135
2391 -135 -101 -42 107 128 -78 258 126 87 274 244 -12 189 59 -65 109 79 75 129 69 -43 39 145 137 13
2415 13 9 193 93 101 75 110 -44 -214 -228 -101 62 -16 35 -110 -34 -234 -163 -112 -190 -182 -130 49 53 -218 -183 -228 -83
2442 -83 -319 -224 115 -164 -128 -91 -45 -200 -449 154 -9 -256 -21 13 -298 0 20 -456 -242 53 -37 -34 116
2465 116 107 127 -3 148 -76 -13 316 23 155 163 100 181 91 303 63 212 -128 53 -92 177 203 38 405
2488 405 233 240 -124 319 29 -148 -97 219 41 159 3 146 75 105 21 -48 -54 -152 -200 -29 151 -15 143 -152
$$ packed form
2320Ej05J40K77l77J37J89k4k69L7M96k77j71R4k2M9j20Q0N9O1l02l9J19J72j05
2344A04J50k68L4J6J4J30j36k08L87k90n3K51jr3k45J77j83J47j01J0N6j2j24
2367b38r5J01j86K41RQ9L5Q0Q1l91P6Q0K7j26K64J12l5q8k99J04q1J68J04j67
2391a35L4N9J49K1k06L36j32l9J87l0k56K01j30j24J74l0mN4o0j12Q2J06qj24
2415A3mJ84j00Qk6L5j54j70j4J27J63p8N1j45P6k00P1N1p8QN2J79Mk71L5m5J45
2442h3k36R5L39k79L6L7M6j55k49O03j63k47K35L4l11K98K0m76K14K95r0LJ50
2465A16rK0j30J51k24O3L29k93J32Qo3Q1r0K12k40J49l40J81j45K69K6j65L67
2488D05j72Pl64M43k90j77N1L16j78J18j56J43p1L0q4o9or8m8J71J80j66J58k95
$$ plain form
2512 -152 -103 -47 -76 -436 -208 -197 54 -51 -80 -213 -52 -360 -79 -182 -131 -261 -305 -123 -123 -109 -45 -277 -84 105
2536 105 7 67 -52 -64 -64 18 54 239 73 261 93 -31 15 239 -45 -77 -19 96 120 119 -179 99 28 98 -1
2561 -1 28 162 -153 124 139 -57 -39 86 53 44 268 71 51 -32 98 -77 53 -216 -98 -2 -73 -105 -162 58 -115
2586 -115 162 -234 -46 -92 -198 -138 -65 -90 16 -260 -213 -142 -249 -204 82 -229 -168 24 18 -94 -111 -484 -74 65
2610 65 70 -208 -185 -175 -138 175 42 52 1 -134 104 413 260 153 129 136 208 60 135 177 100 140 140 13 172 87
2636 87 195 1 116 178 226 -56 -178 160 -30 7 201 -157 30 -9 173 5 -217 179 -292 -141 -59 -90
2658 -90 65 269 -305 -7 -347 -245 -159 10 44 -51 13 -24 -105 -116 18 -315 -178 -134 39 -121 52 -87 6
2681 6 57 -44 -138 -310 -102 152 99 -38 59 193 59 -24 -204 43 201 178 145 157 -17 -38 180 36 -77 464
$$ packed form
2512a52M9N6k9l60K28J1K51j05k9j33J61l08K81j03N1j30m4J82%J4O4k32J93J89
2536A05r8O0j19j2%Q2L6J85j66J88j68j24M6K24k84l2N8J15K4jk98K78p1P0r9
2561aK9J34l15K77J5j96J8J25l3rK24j97k0q3J30j75J30k69J18R6p1l2n7K20j73
2586a15K77l96J88m6j06O0P3k5J06k76M7P1j07M5K86l11O1J92oj12j7l73M10J39
2610F5Nk78K3J0L7L13j33J0n1j35K38L09j53j07k4PP2j48P5M2p7M0%j27J59q5
2636H7J08j94J15O2M8k82j22L38j90L7J94l58J87l9J82j68k22L96m71J51Q2l1
2658i0J55K04n74K98l40J02Q6J69L4r5O4l7q1j1J34l33J37M4J73j60J73j39R3
2681FN1j01r4j72K08K54n3j37R7J34j34q3j80K47J58k3l3J2j74k1K18j44j13N41
$$ plain form
2705 464 324 0 163 269 359 419 57 -12 255 341 31 -4 234 83 204 -78 -128 -3 -27 130 -73 -109 47
2728 47 43 126 100 -209 -174 60 157 -63 -48 -56 -61 -184 59 -53 16 -88 35 -44 33 -130 179 -268 -3 -30 -4 -47
2754 -47 -172 -122 -50 59 -395 -147 105 11 -107 -25 -23 -89 163 187 52 8 37 70 361 158 -103 -10 93 321
2778 321 78 270 524 216 20 42 84 200 -45 18 65 -35 61 85 9 116 180 110 15 -8 -5 -154 -20 -82 69
2803 69 87 -72 -118 -51 -147 -221 -30 -8 174 -273 -16 -316 39 -44 -189 -124 -242 -216 -62 -236 -76 -85 -99 -28 -214
2828 -214 -43 -178 50 -25 63 130 48 40 31 -216 109 104 -90 209 -137 -24 122 84 46 266 152 323 -178 233
2852 233 -23 -1 109 -56 252 -20 -91 163 158 120 95 -92 73 67 48 66 73 114 -91 228 105 82 116 101 -203
2877 -203 34 -140 -79 -162 -127 115 53 -146 -155 -135 313 -42 -124 -22 21 -244 -121 -188 -74 -38 16 -256 62 -168
$$ packed form
2705D64j40l24J63J06R0O0l62o9K67Q6l10l5K38j51J21k82n0J25k4J57k03l6J56
2728D7mQ3k6l09L5K34R7k20J5qnj23K43j12O9j04J23p9P7j63L09m47K65k7K6m3
2754d7j25N0P2J09m54K48K52r4j18Q2Ko6K52K4j35m4K9L3K91k03k61R3J03K28
2778C21k43J92K54l08j96K2M2J16k45O3M7j00R6K4p6J07O4p0r5k3Lj49J34o2J51
2803F9J8j59m6O7r6p4J91K2J82m47K57l00L55q3j45O5j18K6J54j74J60rj4P1j86
2828b14J71j35K28p5Q8O7q2qrk47L25nj94K99l46J13J46l8l8K20j14J71n01M11
2852B33k56K2J10j65L08k72p1K54nl8k5j87J65oj9J8PM1k05L19j23k3L4j5l04
2877b03K37j74O1q3L5K42o2j99rK0M48l55q2J02M3k65J23o7J14L6N4k72L18k30
$$ plain form
2901 -168 -236 -60 -191 -16 119 -18 -36 -137 -53 -1 136 -173 -77 -97 9 -85 -53 157 -43 -198 -41 13 129
2924 129 55 110 -27 180 43 201 53 -91 6 72 104 95 9 113 -29 -25 90 65 162 77 29 -23 -187 -3 16
2949 16 -19 -60 180 0 -216 144 -121 -208 -98 -254 70 -80 -151 -257 -193 125 -117 -134 129 -5 -401 -282
2971 -282 -129 -252 -58 -51 -169 3 57 -310 206 100 -46 -184 -171 -178 -130 53 -205 -120 66 -108 -77 68 -20
2994 -20 182 57 243 90 -101 306 -42 11 126 195 160 59 56 -57 106 139 301 3 146 290 246 194 194 133
3018 133 -182 205 -59 232 257 -190 -113 9 -10 -5 237 4 -18 2 31 93 -83 -213 -26 86 -339 -28 197
3041 197 -17 -52 110 -298 33 -40 -347 -132 -38 -189 -61 10 51 -39 -108 -170 -16 5 -97 -185 95 -68 -147 -22
3065 -22 32 -37 -185 -5 -166 -90 236 -144 251 24 153 -42 90 78 85 198 -246 -135 179 168 -36 229 -60
$$ packed form
2901a68o8J76j31J75J35j37j8j01Q4N2J37l09R6k0J06r4L2K10k00j55J57N4J16
2924A29p4N5j37K07j37J58j48j44R7O6L2rq6J04j42MJ15k5R7q5m8n2j64J84J9
2949A6l5m1K40j80k16L60k65q7J10j56L24j50p1j06O4L18k42j7K63j34l96J19
2971b82J53j23J94Pj18J72N4l67N16j06j46j38J3pM8J83k58Q5J86j74L1J45q8
2994b0K02j25J86j53j91M07l48N3J15O9l5j01lj13J63L3J62k98J43J44m4n2%o1
3018A33l15L87k64K91K5m47P7J22j9NK42k33k2K0K9O2j76j30J87J12m25L11K25
3041A97k14l5J62m08L31p3l07K15R4j51J28P1M1r0o9o2J54K1j02q8K80j63p9J25
3065b2N4o9j48J80j61P6L26l80L95k27J29j95J32j2PJ13m44J11L14j1k04K65k89
$$ plain form
3088 -60 38 143 -42 -14 142 159 58 128 -30 -221 94 -52 49 -65 -19 -42 123 -59 -14 26 -38 -138 -15
3111 -15 -10 -81 193 -98 -44 94 4 -216 28 5 -94 -60 45 -88 -196 -101 4 -153 -184 200 -151 -24 -178 -28
3135 -28 -1 -42 194 -74 87 67 77 -76 129 -41 154 -143 91 151 34 87 -21 171 135 268 116 158 59
3158 59 64 86 30 199 215 -59 52 117 88 201 147 -151 349 -221 -191 -22 105 -126 127 156 -66 130 94 -30
3182 -30 147 -49 7 -54 -132 -59 -54 78 -275 70 -117 -131 -101 -55 -51 -361 -254 -85 -74 -317 36 -111 -86 -298 -107
3207 -107 -220 14 -69 38 83 -164 -268 134 -203 130 135 -65 -171 2 181 -125 56 -57 179 -115 -184 -97
3229 -97 160 160 -160 -7 -75 235 -40 4 -30 -91 135 -149 -17 -68 -126 270 142 193 64 57 138 178 276 25 10
3254 10 -70 -21 -48 -45 -161 -93 -12 -6 73 77 108 38 -17 -4 322 -14 -10 -25 87 -3 -281 -75 11 -248 -72 -112 194 55
$$ packed form
3088f0R8J05j85K8J56J7j01P0j58j91L15j46J01j14M6k3J65j82M5M0o4j00J23
3111a5Np1K74k91N4J38r0k20K44k3r9L4J05j33j08R5J05j57l1L84l51J27j54J50
3135b8K7m1K36k68J61k0J0j53K05j70J95k97K34O0j17N3j08J92l6J33j52M2r9
3158E9NK2n6J69J6k74J11O5k9J13n4k98N00n70L0J69J27k31K53K9k22J96l6j24
3182c0J77j96N6o1p8P3NJ32l53L45j87j4L0M6Ml10J07J69J1k43L53j47K5k12J91
3207a07j13K34q3J07M5k47j04M02l37L33Nk00j06J73J79l06J81j13K36k94o9Q7
3229i7K57%l20J53o8L10k75M4l4o1K26k84J32n1n8L96j28N1j29pQ1M0R8k51j5
3254A0q0M9k7Lj16O8Q1OP9ML1p0n5J3L26l36Mj5J12r0k78K06Q6k59J76m0L06j39
$$ plain form
3282 55 -145 -231 -37 16 -183 115 -157 29 12 21 213 86 131 6 114 -14 37 211 -57 167 163 -76 115
3305 115 188 -100 41 171 20 93 175 -27 137 -67 194 255 164 261 151 137 -7 70 -148 58 50 116 -85 189
3329 189 214 -91 -76 41 -129 -76 -269 -160 -27 -127 100 -141 -41 96 -281 -217 44 24 -46 -22 232 66
3351 66 -113 9 93 -138 -219 -229 -172 -282 -260 12 52 -87 1 16 -144 -34 64 44 2 77 147 10 -133 -45 -137
3376 -137 -5 -8 152 -32 49 170 82 15 195 147 216 30 -157 -109 294 62 -223 -162 -19 118 40 326 -118
3399 -118 -112 17 64 -51 40 61 55 218 -61 -59 -55 -170 -68 -100 -122 -90 -106 14 -120 114 -58 -101 -234 36 -49 -261
3425 -261 57 -33 74 72 -86 -81 53 -1 -172 -150 326 224 -5 132 -25 -100 61 1 160 -44 -14 -81 -95 81
3449 81 228 -131 -234 195 78 -77 -100 188 140 159 68 279 269 -204 86 -8 66 227 33 183 40 -172 359
$$ packed form
3282E5k00q6J94N3j99K98k72J86j7RJ92j27M5j25J08j28N1J74k68K24mk39J91
3305A15P3k88J41J30j51P3Q2k02J64k04K61O1r1R7j10j4j44P7k18K06qO6k01K74
3329A89K5l05J5J17j70N3j93J09J33j00K27k41J00J37l77O4K61k0p0K4K54j66
3351F6j79J22Q4k31q1j0N7j10K2K72M0j39Q8J5j60J10R8k0m2P5P0j37j43Q8r2
3376a37J32lJ60j84Q1J21q8o7J80m8O9j86j87M8M03k32k85O1J43J37p8K86m44
3399a18OJ29M7j15R1K1oJ63k79KMj15J02l2k2L2j6J20j34K34j72m3j33K70q5k12
3425b61L18r0J07kj58NJ34n4j71K2M76j02k29J37j57p5J61o0J59k04L0o7j4J76
3449H1J47l59j03M29j17j55k3K88m8J9r1K11j0m73K90r4P4J61j94J50j43k12N31
$$ plain form
3472 359 253 -12 -24 2 -20 -78 -95 -167 -90 113 131 -299 -26 -277 38 -100 -79 -13 -58 -103 -209 -184 -82 -251
3496 -251 -20 108 -40 -80 42 -180 -209 -32 -365 45 -93 51 131 -122 -104 -179 107 -11 -92 -83 140 294 57
3519 57 43 -56 224 -125 -41 58 158 -141 -12 138 57 123 -22 -14 133 58 344 218 47 144 85 208 -70 48
3543 48 154 265 212 225 -98 40 -58 72 31 186 32 -102 -126 -243 81 25 -109 -179 -164 -35 90 -107 -66
3566 -66 11 181 -41 -105 -89 38 -45 57 38 -252 104 60 -246 -165 -1 -179 -50 57 130 -140 -273 -287 -92
3589 -92 78 -43 -125 -78 27 55 15 -91 -14 206 -121 206 229 79 104 133 183 128 72 56 -177 111 -120 1
3613 1 178 127 -121 180 -16 25 259 -194 273 -293 29 235 39 143 72 315 -121 -51 -52 -237 10 -56 72
3636 72 29 107 -78 -97 -105 58 158 236 146 85 -113 -93 -118 -102 7 -54 97 -126 -121 -30 -11 -216 -211 0 -16 -12 -104 74
$$ packed form
3472C59j06k65j2K6k2n8j7p2P7K03J8m30K73k51L15j38K1O6m5m5j06K5J02j69
3496b51K31J28j48m0J22k22k9J77l33M10j38J44Q0k53J8p5K86j18q1RK23J54k37
3519E7j4r9K80l49Q4R9J00k99J29J50q1O6j45QJ47p5K86j26j71R7n9J23k78J18
3543D8J06J11n3J3l23J38r8J30m1J55j54j34k4j17L24n6j34p0J5J29J25j97M1
3566f6P7J70k22o4J6J27q3J02j9k90L56m4l06Q1J64j78J29J07P3k70j33j4J95
3589i2J70j21q2M7J05K8m0j06P7K20l27L27K3j50K5K9N0n5n6j6k33K88k31J21
3613AJ77n1k48L01j96M1K34m53M67n66L22K06j96J04p1K43m36P0jj85K47o6J28
3636G2m3P8j85j9qJ63J00P8r0o1j98K0k5J6J09o1J51k23NR1J9k05NK11j6Mr2J78
$$ plain form
3664 74 135 98 -22 121 209 71 111 1 -144 187 -90 -68 244 -254 75 26 20 -65 -152 102 128 160 124 80 234
3689 234 288 -89 39 62 54 -158 -224 -48 277 158 -84 352 31 -309 -33 -111 -256 36 25 2 5 -22 -79 86
3713 86 -103 169 18 35 291 -154 -146 -193 -121 -39 45 -45 -32 -137 10 63 -72 59 -33 -7 -61 81 63 -15 -9 64
3739 64 -262 -10 246 181 146 76 135 178 22 213 76 -124 178 -19 -160 -117 17 -261 -50 153 -111 91
3761 91 117 -129 213 -110 165 -37 -37 210 86 79 82 86 173 112 62 5 1 19 69 90 179 89 132 108 -258 -23 -119 -57
3789 -57 -245 62 21 -54 31 153 -200 -234 -41 -25 8 260 -212 42 33 -201 110 1 -201 223 -185 -36 -104
3812 -104 141 238 58 73 -19 -94 -41 -82 147 84 -23 -252 -108 -110 157 120 309 174 -18 125 16 147 -90
3835 -90 -12 92 31 5 275 54 70 121 84 128 157 132 -157 -62 12 -178 1 6 118 137 -131 153 -86 81 -221
$$ packed form
3664G4O1l7j20J43Q8j38M0j10j45L31k77K2L12m98L29m9oq5q7K54K6L2l6m4J54
3689B34N4l77J28K3qk12o6J76L25j19k42M36l21l40K76p8j45K92j1k3Lk7n7J65
3713H6j89K72j51J7K56m45Qm7P2Q2Q4r0J3j05J47N3j35J31r2K6n4J42j8p8OP3
3739F4l26K52K56o5l5p0N9M3j56J91j37k00L02j97j41M3J34k78K11K03k64K02
3761I1K6k46L42l23K75k02%K47j24pLMQ7o1n0n7mJ8N0K1Q9r0M3k4l66K35r6O2
3789e7j88L07m1p5Q5J22l53l4J93J6L3K52m72K54rk34L11j09k02M24m08J49o8
3812a04K45R7j80J5r2p5N3m1K29o3j07k29J44kK67l7J89j35j92J43j09J31k37
3835i0P8J04o1k6K70k21J6N1l7M4K9k5k89R5P4j90J79NJ12J9k68K84k39J67l02
$$ plain form
3860 -221 -4 -51 -188 -23 168 -25 -29 76 -85 -118 8 -223 -3 35 108 -7 199 -165 78 -3 -255 -153
3882 -153 -117 -60 42 28 -48 -240 71 111 -132 157 197 59 77 -99 -52 59 94 155 72 -211 -269 -42 -70 -148 -57
3907 -57 25 44 123 -26 78 81 -26 79 177 -48 59 -122 -71 80 37 223 63 165 -6 -38 -79 78 61 161
3931 161 5 32 75 9 104 33 -1 23 121 70 4 -162 -73 -103 51 314 -9 53 91 4 -129 93 -4 -174 28
3956 28 -122 -56 -72 -207 -66 6 -169 -78 -57 -50 111 -132 131 120 6 98 44 -93 -51 8 -58 -19 74 -6 62 -14
3982 -14 -27 116 124 74 -233 5 -49 141 70 82 236 68 -73 -192 -53 -35 4 -64 -75 -48 -185 61 -211 -188 103
4007 103 -83 -206 245 -201 242 -153 -50 149 17 23 -61 -50 196 47 -59 -232 -8 -5 -31 -26 71 20 -153 -142
4031 -142 -34 131 -94 -44 117 -152 -13 100 -64 157 176 196 155 45 45 35 222 243 97 -79 62 27 219
$$ packed form
3860b21K17m7j37J65J91j93mJ05j61l3J26k31K20L8P3j15K06l64K43q1k52J02
3882a53L6N7J02j4p6j92L11M0k43K89M0j38J8j76M7J11L5O1q3k83n8K27k8p8R1
3907e7Q2J9P9j49J04Lj07J05R8k25J07j81N1J51m3J86j60J02j71l2m1J57j7J00
3931A61j56K7M3o6R5p1l4K4R8n1o6j66Q9l0J54K63l23O2L8q7j33K22r7j70K02
3956B8j50O6j6j35J41P2j75R1K1PJ61k43K63j1j14R2n4j37M2N9o6L9R3q0O8p6
3982a4j3J43Qn0l07K38n4J90p1J2J54j68j41j19J39J8L9o8j1K7j37K46k72K3K91
4007A03j86j23M51m46M43l95J03J99j32Oq4J1K46j49j06j73K24Lk6NR7n1j73J1
4031a42J08J65k25N0J61k69J39J13j64K21J9K0m1j10%j0J87K1j46j76J41l5J92
$$ plain form
4054 219 93 -53 231 -80 116 7 138 -2 101 -78 -76 -20 -143 95 -75 65 -200 -44 110 -59 48
4075 48 -68 -49 -154 41 -24 -72 -45 -21 -155 -86 -106 76 -43 51 -10 -98 -202 17 -93 32 -36 17 -111 -24 -228
4100 -228 42 31 151 255 -80 94 -3 -88 62 -119 -311 -101 -41 161 34 43 130 179 -151 -226 47 -98 169
4123 169 -18 40 -62 21 -39 130 26 -6 286 -69 -50 1 233 199 199 -99 -14 177 30 -8 -95 125 -115 -86
4147 -86 83 -16 109 -159 -160 -60 -94 -259 60 -137 7 -93 24 -196 -143 -85 65 -3 -284 -30 -109 -185 -109 -22
4171 -22 -408 122 -194 -64 204 111 -110 141 18 -187 129 0 73 13 83 -23 -253 -114 -37 -101 -35 -166 226
4194 226 54 -195 71 59 -197 49 80 -280 1 396 -150 16 30 135 -43 -260 40 106 -49 -59 215 52
$$ packed form
4054B19j26j46K84l11J96j09J31j40J03j79KN6j23K38j70J40k65J56J54j69J07
4075D8j16J9j05J95o5m8K7K4j34O9k0J82j19R4o1q8j04K19j10J25o8N3j28Q7k04
4100b28K70j1J20J04l35J74r7q5J50j81j92K10O0K02j27RQ7M9l30p5K73j45K67
4123A69j87N8j02Q3o0J69j04l2K92l55J9N1K32l4%k98Q5J91j47l8q7K20k40K9
4147h6J69r9J25k68jJ00l4j65L19j97J44j00J17k20N3N8J50o8k81K54p9p6P6Q7
4171b2l86N30l16J30K68r3k21K51j23k05L16j29P3o0P0j06k30J39P7o4O6j31L92
4194B26j72k49K66j2k56K46L1l60K81L95n46J66J4J05j78k17L00O6j55j0K74j63
$$ [...]
8191h3
##END NTUPLES=NMR FID
##END=
