##TITLE=1H_SR40_oil2
 CDCl3,8 sc, 
 2.03.2021
##JCAMPDX= 6.0         $$ Bruker NMR JCAMP-DX V2.0
##DATA TYPE= NMR FID
##DATA CLASS= NTUPLES
##ORIGIN= UXNMR, Bruker Analytische Messtechnik GmbH
##OWNER= root
$$ XWIN-NMR		Version 3.5
$$ Tue Mar  2 09:56:51 2021 Russian Standard Time (UT+4h)  she@DPX200
##.OBSERVE FREQUENCY= 200.1315066352
##.OBSERVE NUCLEUS= ^1H
##.DELAY= (6, 6)
##.ACQUISITION MODE= SIMULTANEOUS
##.ACQUISITION SCHEME= undefined
##.AVERAGES= 8
##.DIGITISER RES= 18
##SPECTROMETER/DATA SYSTEM= spect
##.PULSE SEQUENCE= zg30
##.SOLVENT NAME= CDCl3
##.SHIFT REFERENCE= (INTERNAL, CDCl3, 0, 15.7039)
##AUDIT TRAIL= $$ (NUMBER, WHEN, WHO, WHERE, WHAT)
$$ ##TITLE= Audit trail, XWIN-NMR		Version 3.5
$$ ##JCAMPDX= 5.01
$$ ##ORIGIN= Bruker BioSpin GmbH
$$ ##OWNER= she
$$ F:/spectra/data/she/nmr/H-F/1/audita.txt
$$ ##AUDIT TRAIL=  $$ (NUMBER, WHEN, WHO, WHERE, WHAT)
(   1,<2021-03-02 09:55:33.37 +0400>,<she>,<DPX200>,
      <created by zg, POWCHK disabled, PULCHK disabled
       configuration hash MD5:
       00 E9 B6 7A A2 85 ED C7 34 08 36 98 17 FE 4E 26
       data hash MD5: 16K
       98 E1 0B 62 76 1E FA 03 D5 79 7D 14 7D 61 E3 16>)
$$ ##END=
$$ 
$$ hash MD5
$$ 3C 9B 67 12 45 F4 B8 56 A0 65 C0 8C 63 6A 97 3C
##$RELAX= 
##$RELAX= 
##$RELAX= 
##$RELAX= 
##$RELAX= 
##$RELAX= 
$$ Bruker specific parameters
$$ --------------------------
##$DU= <F:/spectra>
##$EXPNO= 1
##$NAME= <H-F>
##$PROCNO= 1
##$TYPE= <nmr>
##$USER= <she>
##$AMP= (0..31)
100 100 100 100 100 100 100 100 100 100 100 100 100 100 100 100 100 100 
100 100 100 100 100 100 100 100 100 100 100 100 100 100 
##$AQSEQ= 0
##$AQ_mod= 1
##$AUNM= <au_zg>
##$AUTOPOS= <>
##$BF1= 200.13
##$BF2= 200.13
##$BF3= 200.13
##$BF4= 200.13
##$BF5= 200.13
##$BF6= 200.13
##$BF7= 200.13
##$BF8= 200.13
##$BYTORDA= 1
##$CFDGTYP= 0
##$CFRGTYP= 5
##$CHEMSTR= <none>
##$CNST= (0..31)
1 1 145 1 1 1 1 1 1 1 1 1 1 1 1 1 1 1 1 1 1 1 1 1 1 1 1 1 1 1 1 1 
##$CPDPRG= <>
##$CPDPRG1= <>
##$CPDPRG2= <>
##$CPDPRG3= <>
##$CPDPRG4= <mlev>
##$CPDPRG5= <mlev>
##$CPDPRG6= <mlev>
##$CPDPRG7= <mlev>
##$CPDPRG8= <mlev>
##$CPDPRGB= <>
##$CPDPRGT= <>
##$D= (0..31)
0 1.2 0 0 0 0 0 0 0 0.06 0 0.03 0 0 0 0 0.0002 0 0 0 0 0 0 0 0 0 0 0 0 
0 0 0 
##$DATE= 1614664532
##$DBL= (0..7)
120 120 120 120 120 120 120 120 
##$DBP= (0..7)
150 150 150 150 150 150 150 150 
##$DBP07= 0
##$DBPNAM0= <>
##$DBPNAM1= <>
##$DBPNAM2= <>
##$DBPNAM3= <>
##$DBPNAM4= <>
##$DBPNAM5= <>
##$DBPNAM6= <>
##$DBPNAM7= <>
##$DBPOAL= (0..7)
0.5 0.5 0.5 0.5 0.5 0.5 0.5 0.5 
##$DBPOFFS= (0..7)
0 0 0 0 0 0 0 0 
##$DE= 6
##$DECBNUC= <off>
##$DECIM= 32
##$DECNUC= <off>
##$DECSTAT= 4
##$DIGMOD= 1
##$DIGTYP= 9
##$DL= (0..7)
0 120 120 120 120 120 120 120 
##$DP= (0..7)
150 150 150 150 150 150 150 150 
##$DP07= 0
##$DPNAME0= <>
##$DPNAME1= <>
##$DPNAME2= <>
##$DPNAME3= <>
##$DPNAME4= <>
##$DPNAME5= <>
##$DPNAME6= <>
##$DPNAME7= <>
##$DPOAL= (0..7)
0.5 0.5 0.5 0.5 0.5 0.5 0.5 0.5 
##$DPOFFS= (0..7)
0 0 0 0 0 0 0 0 
##$DQDMODE= 0
##$DR= 18
##$DS= 0
##$DSLIST= <SSSSSSSSSSSSSSS>
$$ [...]
##$SUBNAM2= <"">
##$SUBNAM3= <"">
##$SUBNAM4= <"">
##$SUBNAM5= <"">
##$SUBNAM6= <"">
##$SUBNAM7= <"">
##$SUBNAM8= <"">
##$SUBNAM9= <"">
##$SW= 16.9725356469052
##$SWIBOX= (0..15)
0 0 2 0 0 0 0 0 0 0 0 0 0 0 0 0 
##$SW_h= 3396.73913043478
##$TD= 16384
##$TD0= 1
##$TE= 0
##$TE2= 300
##$TE3= 300
##$TEG= 300
##$TL= (0..7)
0 120 120 120 120 120 120 120 
##$TP= (0..7)
150 150 150 150 150 150 150 150 
##$TP07= 0
##$TPNAME0= <>
##$TPNAME1= <>
##$TPNAME2= <>
##$TPNAME3= <>
##$TPNAME4= <>
##$TPNAME5= <>
##$TPNAME6= <>
##$TPNAME7= <>
##$TPOAL= (0..7)
0.5 0.5 0.5 0.5 0.5 0.5 0.5 0.5 
##$TPOFFS= (0..7)
0 0 0 0 0 0 0 0 
##$TUNHIN= 0
##$TUNHOUT= 0
##$TUNXOUT= 0
##$USERA1= <user>
##$USERA2= <user>
##$USERA3= <user>
##$USERA4= <user>
##$USERA5= <user>
##$V9= 5
##$VALIST= <valist>
##$VCLIST= <CCCCCCCCCCCCCCC>
##$VD= 0
##$VDLIST= <DDDDDDDDDDDDDDD>
##$VPLIST= <PPPPPPPPPPPPPPP>
##$VTLIST= <TTTTTTTTTTTTTTT>
##$WBST= 1024
##$WBSW= 4
##$XGAIN= (0..3)
0 0 0 0 
##$XL= 0
##$YL= 0
##$YMAX_a= 119708
##$YMIN_a= -67497
##$ZGOPTNS= <>
##$ZL1= 120
##$ZL2= 120
##$ZL3= 120
##$ZL4= 120
##$ABSF1= 10
##$ABSF2= 0
##$ABSG= 5
##$ABSL= 3
##$ALPHA= 0
##$AQORDER= 0
##$ASSFAC= 0
##$ASSFACI= 0
##$ASSFACX= 0
##$ASSWID= 0
##$AUNMP= <proc_1d>
##$AZFE= 0.1
##$AZFW= 0.1
##$BCFW= 1
##$BC_mod= 2
##$BYTORDP= 1
##$COROFFS= 0
##$CY= 11.3945322036743
##$DATMOD= 1
##$DC= 2
##$DFILT= <>
##$DTYPP= 0
##$F1P= 15.9154993809931
##$F2P= -4.1035820241983
##$FCOR= 0.5
##$FTSIZE= 0
##$FT_mod= 4
##$GAMMA= 1
##$GB= 0.15
##$INTBC= 1
##$INTSCL= 1
##$ISEN= 128
##$LB= 0.24
##$LEV0= 0
##$LPBIN= 0
##$MAXI= 10000
##$MC2= 0
##$MEAN= 0
##$ME_mod= 0
##$MI= 1.114404
##$NCOEF= 0
##$NC_proc= 0
##$NLEV= 6
##$NOISF1= 3.799351
##$NOISF2= 2.8
##$NSP= 1
##$NTH_PI= 0
##$NZP= 0
##$OFFSET= 15.70392
##$PC= 1
##$PHC0= -10752.29
##$PHC1= 2.800941
##$PH_mod= 1
##$PKNL= yes
##$PPARMOD= 0
##$PSCAL= 0
##$PSIGN= 0
##$REVERSE= no
##$SF= 200.130013532006
##$SI= 16384
##$SIGF1= 3
##$SIGF2= 2
##$SINO= 400
##$SIOLD= 16384
##$SREGLST= <1H.CDCl3>
##$SSB= 0
##$STSI= 0
##$STSR= 0
##$SW_p= 3612.71676300578
##$SYMM= 0
##$S_DEV= 0
##$TDeff= 0
##$TDoff= 0
##$TI= <>
##$TILT= no
##$TM1= 0
##$TM2= 0
##$TOPLEV= 0
##$USERP1= <user>
##$USERP2= <user>
##$USERP3= <user>
##$USERP4= <user>
##$USERP5= <user>
##$WDW= 1
##$XDIM= 8192
##$YMAX_p= 0
##$YMIN_p= 0
$$ End of Bruker specific parameters
$$ ---------------------------------
##NTUPLES= NMR FID
##VAR_NAME=  TIME,          FID/REAL,        FID/IMAG
##SYMBOL=    X,             R,               I
##VAR_TYPE=  INDEPENDENT,   DEPENDENT,       DEPENDENT
##VAR_FORM=  AFFN,          ASDF,            ASDF
##VAR_DIM=   8192,          8192,            8192
##UNITS=     SECONDS,       ARBITRARY UNITS, ARBITRARY UNITS
##FACTOR=    0.0002944,     1,               1
##FIRST=     0,             0,               0
##LAST=      2.4114304,     0,               0
##MIN=       0,             -67497,          0
##MAX=       2.4114304,     119708,          0
$$ Real data points
##PAGE= N=1
##DATA TABLE= (X++(R..R)), XYDATA
0@%%%%%%%%%%%%%Qj6J6j6J6k4L2m0M8n6O4p2Q8j04J20j36J52j71J95k24K55k87
35a52L21l60M02m46M99n56O16o85P59q39R26j022J126j240J368j506J658j827
53i58K016k227K465k737L052l416L844m360M993n790O827q235J0260j3427J9069
68A1376l1956J10172L0116j78314J45900r8041j184Q8812p4598M9315j9361j0938
80B1299O9422j11156L8728L9916l7687O9738n7944l2793M7735m3211M3061J1592
92E8700m9191J7526J5480j1323l0127K2214J7460l2629L9956k0416m8939L0004
104H715N400J5278j6147j5460K5474m6091K6160K2732n6776M9131n341l4040L2444
117A1479n0196J5601L9636l6645K7748j5369l2058L0218j1020R659L513j7451
$$ plain form
0 0 0 0 0 0 0 0 0 0 0 0 0 0 0 8 -8 8 -8 8 -16 16 -24 24 -32 32 -40 48 -56 64 -72 80 -91 104 -120 135 -152
35 -152 169 -191 211 -235 264 -292 324 -361 398 -441 485 -537 589 -651 717 -789 869 -958
53 -958 1058 -1169 1296 -1441 1611 -1805 2039 -2321 2672 -3118 3709 -4526 5734 -7693 11376
68 11376 -20580 89592 119708 -58606 87294 -10747 -11931 76881 2283 51598 32237 21299
80 21299 90721 -20435 18293 58209 20522 90260 32316 -477 47258 4047 47108 58700
92 58700 9509 27035 42515 31192 1065 23279 40739 8110 48066 27650 -21289 8715
104 8715 14115 29393 13246 -2214 23260 -22831 3329 26061 -30715 18416 13075 -20965 11479
117 11479 -38717 -23116 16520 -20125 7623 -7746 -39804 -9586 -20606 -10947 -7434 -24885
129b4885K3969k2156j3240K5287j9085J2004K3187k3194o234j38l889J3759K803
142a1812j315J153j1316K160N964q791J0864Q775o672L295j1520n795J4748l8
156a0300P271K053j5529M084J140r0Q013k27N047l781o604K177n035Q140R681
171F040l768k09p251j704M047K136Q602l076j845M42q393M943J515K039J0093
186A3611p489r92k258o127J0798J213J913L136j0489K501j421j157J0392l425
200A0206L054l14r375M233j877L606Q038n803J761m894n589P982j853N179K167
215A6521p646L231o565o02P582l815O214j743q686L212m791K720O674m794K900
230A0412m917n867M242l180L812L875n682P06n303l470M468n92L002K00n744j298
$$ plain form
129 -24885 -916 -23072 -36312 -11025 -30110 -18106 5081 -18113 -24347 -24485 -28374 -14615 -11812
142 -11812 -13127 -11974 -23290 -21130 -15166 -23957 -13093 -4318 -10990 -7695 -19215 -25010 -10262 -10300
156 -10300 -3029 -976 -16505 -12421 -11281 -11371 -3358 -3585 1462 -2319 -8923 -6746 -11781 -3641 6040
171 6040 2272 2063 -5188 -6892 -2845 -709 7893 4817 2972 3414 -4979 -36 1479 3518 13611
186 13611 6122 5130 2872 -3255 7543 8756 10669 13805 3316 5817 4396 3239 13631 10206
200 10206 13260 12946 3571 7804 5927 9533 17571 11768 13529 8635 3046 11028 9175 14354 16521
215 16521 8875 12106 5541 4939 12521 8706 14920 13177 4491 7703 2912 5632 12306 7512 10412
230 10412 5495 -372 3870 690 4502 8377 2695 3401 -1902 -5372 -904 -1496 1506 1706 -4038 -5336
246e336k528l77L703N47M67k001m508j076p61J789L271L85j773l497j832j78J902
263a1803L160N74q66k317k492N03J322K644K491j150j357j316j285K341K785J510
279e256J486k435j735J15R96L518K530j59l50j748p28J946J828K694J255j534
295B423q10j934Q54L664J657R89l33k231r71P39J203J977R20J65j170k717K00
312D625J552J597J980j265j913j341o64J196J012L08M86j116k250j031J46J109
328D431J834n51j226k347j346Q29P95N87O86j897r16q55j177J119J295K33m72
345A022k081j111J72M61J437J83o81m32j324l67Q30L16J199j5j526q83l55M70
363b685J227Q98k9n50r46n29N27N17P83M49q67k93q94j43J680M97l02P28k009
$$ plain form
246 -5336 -7864 -8241 -4538 -3991 -3524 -5525 -10033 -11109 -11870 -10081 -6810 -6425 -8198 -11695 -13527 -13705 -11803
263 -11803 -8643 -8069 -8935 -11252 -13744 -13241 -11919 -9275 -6784 -7934 -9291 -10607 -11892 -9551 -6766 -5256
279 -5256 -3770 -6205 -7940 -7825 -6829 -3311 -781 -940 -1290 -3038 -3766 -1820 8 2702 3957 2423
295 2423 1613 -321 533 4197 5854 6843 6510 4279 3308 4047 5250 7227 8147 8312 7142 4425 4625
312 4625 6177 7774 9754 8489 6576 5235 4571 5767 6779 7087 7573 6457 4207 3176 3322 4431
328 4431 6265 5714 4488 2141 795 1624 2419 3006 3692 1795 879 24 -1153 -34 1261 1494 1022
345 1022 -1059 -2170 -1998 -1537 -100 83 -598 -1030 -2354 -2721 -1891 -1575 -376 -391 -1917 -2800 -3155 -2685
363 -2685 -1458 -560 -589 -1139 -2085 -2614 -2087 -1570 -787 -338 -1205 -1498 -2392 -2535 -855 -358 -660 68 -1941
382a941l42R18p78J244O78r21K7j381J26Q61n7J095j3k278N24m40K4J600r28M14
402a568K83j772N28M99p89J936j62j237q8p75J184N84m51J326j230kJ172j208
420a770K36J567k58Q08p41p41N15J77J623j00m97O99m57R90k05n72J618m86O27
439C033Jj695J595L42Q13K38k096J511k20p33K517k168j93J784j791P18n06j102
457B048K419j335K70l19k514K091k58n93P92k376Q36O15j526L20j065O92M27r70
475d46j29k382J660Q61j504R04k228O30J352k882K013j284p17L370l443P43K93
492c189k239M227j674j407K521l463K812Q39l065L174j862N01K840l718J823N26
508a354j002L024j669j068J517j30J431n03n76R06J93O41n38R1n2J129Q77j880
$$ plain form
382 -1941 -2283 -1365 -2143 -899 -221 -1142 -1115 -2496 -2370 -1509 -1566 -471 -484 -2762 -2238 -2678 -2654 -1054 -1982 -1568
402 -1568 -1285 -3057 -2529 -2030 -2819 -883 -1045 -2282 -2370 -3145 -1961 -1377 -1828 -502 -1732 -1734 -562 -1770
420 -1770 -1534 33 -225 583 -158 -899 -384 -207 1416 1316 819 1518 1061 2051 1846 1274 2892 2406 3033
439 3033 3034 1339 2934 3276 4089 4327 2231 3742 3522 2789 5306 3138 2945 4729 2938 3656 3150 2048
457 2048 4467 3132 3402 3083 569 2660 2402 1809 2601 225 1061 1676 150 470 -595 97 524 -446
475 -446 -575 -2957 -1297 -436 -1940 -1036 -3264 -2634 -1282 -4164 -2151 -3435 -4152 -782 -4225 -3482 -3189
492 -3189 -5428 -1201 -2875 -4282 -1761 -5224 -2412 -1573 -4638 -1464 -3326 -2825 15 -3703 -1880 -1354
508 -1354 -2356 668 -1001 -2069 -552 -682 749 246 -330 576 769 1410 872 963 911 2040 2917 1037
526A037J010k32m30K629k006QJ351k696K765n17k762L522k017K77J715m038K427
543B043m27j105K998l630K86J680k649J994l53k076J974k93r81J93r76L76J440
560D94j177j050N96j073R33R70k613K080n93j432K937k705K55K578l031K720m31
577e42l036L469j685N52K202l740K764j24j903L182k218M30K168j963R32l51r07
594g70K639j035J62m6n87O08K36j44k42O38K23q03O86p64J36J553j798J007l05
613A394j690J974j208j40J823k771J657l39j922K641j761p1J539k427J181k54
629c74j155J955j368M5M32j417J067j25o64J146q76J25J65n88o0N29J99R6J22
648g46j82o51P12j91N14O41r84N29l8k92R28l17L10Q15j551P61L15o21J587o12
$$ plain form
526 1037 2047 1815 1385 4014 2008 2016 3367 671 3436 2919 157 3679 1662 1939 3654 -384 2043
543 2043 1616 511 3509 -121 165 1845 -804 1190 837 -1239 735 442 -539 -346 -1322 -946 494
560 494 -683 -1733 -1137 -2210 -1277 -307 -2920 -840 -1433 -2865 72 -2633 -2378 200 -2831 -111 -542
577 -542 -3578 -109 -1794 -1242 960 -2780 -16 -140 -2043 1139 -1079 -649 1519 -444 488 137 -770
594 -770 1869 834 996 950 363 971 1207 1063 821 1459 1682 879 1565 801 937 2490 692 1699 1394
613 1394 -296 1678 470 330 2153 -618 1039 700 -1222 1419 -342 -413 1126 -1301 -120 -374
629 -374 -1529 426 -942 -897 -465 -1882 -815 -940 -1604 -458 -1334 -1209 -1044 -1632 -1692 -1163 -964 -868 -746
648 -746 -928 -1579 -867 -1058 -544 97 -887 -358 -396 -688 240 -77 233 1048 -503 258 573 -48 1539 927
668I27j63O83r26O45M60p20J074m49k20J22p38J76O68L8O3n54j30J37l77J83K76
689A175j41l26k45k40k91M70k85J26m20o92L23j88k71P50k13m77j16q47L67N7
709a484O1N88o38l31K97n83L99L74l6J75n39r7P9J69N09L28l92K02l55O8M16L49
731d41J31L32k49j4P6L2M85M38L01k59k78J24j5L98K44K29J78j65m20J85M23J67
753A902o6R8k90m77J71L57J04L25k03l59l90m96L97N21l55K05p60m86O3j52J43
774B52L72k04k12m53n78J04L25K00j91m46l43k24L0K95j34N48l12n79j69K9J77
795a513K03M34j10l45l34j88L98M60M29j36l32r8P7K36L90K26K78l22l88J0K90
816c35N59K04J03l94j11J56P3M23N31l4m08m46K04N8K17M37m3j85m17qj52M66
$$ plain form
668 927 764 1447 521 1166 1626 906 1980 1531 1311 1433 695 871 1539 1577 1640 1086 956 1093 716 899 1175
689 1175 1034 708 463 223 -68 402 117 243 -177 -869 -546 -734 -1005 -255 -468 -945 -1061 -1908 -1541 -1484
709 -1484 -1423 -835 -1473 -1804 -1507 -2090 -1691 -1317 -1353 -1178 -1717 -1814 -1735 -1566 -1057 -729 -1121 -919 -1274 -1206 -790 -441
731 -441 -310 22 -227 -241 -165 -133 352 790 1091 832 554 678 663 1061 1305 1534 1712 1547 1127 1312 1735 1902
753 1902 1836 1934 1644 1167 1338 1695 1799 2124 1921 1562 1172 676 1073 1594 1239 1444 684 198 261 109 252
774 252 624 420 208 -245 -823 -719 -394 -194 -385 -831 -1174 -1398 -1368 -1073 -1207 -659 -971 -1550 -1719 -1690 -1513
795 -1513 -1310 -876 -986 -1331 -1665 -1853 -1455 -995 -566 -702 -1034 -1132 -1055 -819 -429 -203 75 -247 -635 -625 -335
816 -335 224 428 531 137 26 182 255 678 1209 1175 767 321 525 583 800 1237 1194 1009 592 584 432 898
838H98J28K42m00n34k39kk2N43j27j21j75n73k12M99mK22m50j3o04k20P06J23
860c35K6J54m83l17k07L09L6O30J04n12l66l20O04J95N36m59M51o44m78M31P76
881A31O8L14j80k25o28L77O87Q2M55k04n25J58j72L49N12k74L62n04k51L68k38
902F62L43O62l99k13m21k89M29K99p6K4m06l70%k80M88M65k76j57q70m47N02j6
924c46M04j32n21q5k97j99M79P0r2J03o24m73J43R8O36K5l12J43p22Q2N99l4L80
947f75R2n22J29l19m2R64j32J65K28q68J14N31m6Q97k66k65M61q33M68R63m60
968E84O97k32p38M96k69M59O64m29J10l31n71M58M07j25N53q91r7L76q14N52L68
989A227m85L54k11j146P58k27J09P09o64k91j7r31Q72j34j54P03j037Q2m1q38
$$ plain form
838 898 1026 1268 868 334 95 93 71 614 487 366 191 -382 -594 -95 -99 123 -327 -340 -944 -1164 -458 -335
860 -335 -309 -155 -638 -955 -1162 -853 -817 -187 -83 -595 -961 -1281 -677 -482 54 -405 46 -598 -1076 -645 131
881 131 199 513 333 108 -520 -143 544 626 1081 877 352 510 338 687 1199 925 1287 783 532 900 662
902 662 1005 1667 1268 1055 634 345 774 1073 997 1021 615 245 245 -35 453 918 642 485 -385 -832 -330 -346
924 -346 58 -74 -595 -680 -977 -1176 -697 -627 -719 -616 -1240 -1713 -1570 -1472 -836 -811 -1123 -980 -1702 -1620 -1021 -1055 -675
947 -675 -583 -1105 -976 -1295 -1337 -373 -505 -340 -112 -980 -866 -335 -381 516 250 -15 446 -387 81 1044 584
968 584 1281 1049 311 807 538 997 1661 1232 1342 1011 440 898 1305 1180 1733 842 745 1121 307 859 1227
989 1227 742 1096 885 -261 497 270 379 1088 424 133 116 -815 57 -77 -231 472 -565 -483 -524 -1362
1009a362O01O17m41N08j303K77M78l25M84k28j52M4m44K71K57K7K80J99l45k24
1029g81P1K90O82m31o6L49k63j70M67K50j8J57k70M5k56L6P55p9Q6j7m94J65K05
1052G13r6N00k79K6Mm06L06j29J60M74n30m33l87k1O89k13q0J34p58L58k82j83
1074d33L65j48o5j99n17Q6L87j09J60l42j64j26K3J91J58J64m28N24n42J3L04
1095f98k79N13K3n34M04m10J94O05n10N84N0n27Q48n27J24O87l97O71l52m85M44
1116D28k20N19M36n33L49k76N0O56o19L29J10o10M13k28r4M57k44J24j79n31K10
1137E47J85j06J62k16O1j69j45k27K07k30K24j83k72j02j58p2M66k30K8j85k04
1158f19LN1k12N5J34k81J11k00q5M00j56R3J26m70K46K69j81M14j71jNk09N64
$$ plain form
1009 -1362 -761 -144 -585 -77 -1380 -1103 -625 -950 -466 -694 -846 -802 -1246 -975 -718 -691 -411 -212 -557 -781
1029 -781 -710 -420 262 -169 -235 114 -149 -319 148 398 380 537 267 312 56 92 847 768 854 837 343 508 713
1052 713 617 1117 838 864 868 462 768 639 799 1273 743 310 -77 -98 591 378 298 432 -326 32 -250 -433
1074 -433 -68 -216 -281 -480 -997 -911 -524 -633 -473 -815 -979 -1105 -1082 -891 -733 -569 -997 -473 -1015 -1002 -698
1095 -698 -977 -464 -441 -975 -571 -981 -787 -182 -692 -108 -58 -585 263 -264 -140 547 150 821 469 -16 428
1116 428 208 727 1163 630 979 703 753 1409 790 1119 1229 619 1032 804 710 1167 923 1047 868 337 547
1137 547 732 626 788 572 633 464 319 92 299 69 293 110 -162 -264 -422 -494 -28 -258 -230 -415 -619
1158 -619 -616 -565 -777 -722 -588 -869 -758 -958 -1043 -643 -799 -706 -580 -1050 -804 -535 -716 -302 -473 -474 -469 -678 -114
1181a14j05k75P03m71K40J84k87M07j6Q3n4j61J02J75J10o2K33l79M05j00l16
1202C02K02L74k55J60k68j27q6j20M28j71l9j89J22j68J48J37j16k96j7j57J94
1223E8l48M9m2N0Q0n94M69j62j26P9K03l30j31j45R0K29k69J17Q5m5J65n3L2L4
1247e05n3P0K09j75J18O7k6j3K79rj40M20l8m0p3N11k70k32L21K53j28p5K02j82
1271D91K2N0nj09M35j40J96j27q9k4j35J91m34K30j4J28k28n5j49L03q4l49p7
1294B7k60M59pk92rl92K25L4k64K71l34K1p7j31K88k41M1p8K34k41m2J21k65K20
1318f92O0n5j07K27k47R5J08K45NJ5K9n5L64k77K50K91n09J24P3J32K05k03m7
1341C1K41L06k45J12K5l5n1j62K63kR0L10m45O4P6k80J78J62j19j83L5J1r5k65
$$ plain form
1181 -114 -219 -494 209 -262 -22 162 -125 282 266 349 295 134 236 411 521 459 692 313 718 618 302
1202 302 504 878 623 783 515 388 302 182 610 439 400 211 333 165 313 450 334 38 21 -136 58
1223 58 -290 -241 -283 -233 -153 -747 -278 -440 -566 -487 -284 -614 -745 -890 -800 -571 -840 -723 -638 -683 -518 -571 -539 -505
1247 -505 -558 -488 -279 -454 -336 -269 -295 -308 -29 -38 -178 242 204 164 91 602 332 100 421 674 546 471 673 491
1271 491 513 563 558 449 884 744 940 813 724 700 565 756 322 552 538 666 438 383 234 537 453 104 27
1294 27 -233 226 219 -73 -82 -474 -249 -215 -479 -208 -542 -521 -598 -729 -441 -682 -641 -719 -485 -726 -768 -647 -912 -692
1318 -692 -632 -687 -794 -567 -814 -719 -611 -366 -361 -346 -317 -372 -8 -285 -35 256 -253 -129 -56 76 281 78 31
1341 31 272 578 333 445 470 435 384 222 485 483 573 883 438 502 578 298 476 638 519 336 371 382 287 22
1365B2K36j82Q6K28m62O8J1k08K49j17k49J86j94j41K44j79K5j73MJ90k02J15
1387d43J18J76n36R1o3r3M14j69J67R8k77O1K07N2J10k24J42J47l73K66O3J6N26
1410D76n96M44j59k7P5J42M4K79k49K90o0k60N6L29l58kq0J44K68o0J14l87j17
1433C06J61k95J75K70m13K09j46l49K24j80j5K97j85l01J67l39j5L30n21N60j84
1454b44j05P4m84NM40l09J22j22l76L52j37J35K42m09L6K55M4J67j75k47N89l35
1476d82L54k19j08M06j07j33J81J2n3M85j10o9J66j70K20j30k39M81K61l49M14
1497H11m04P4L66o44L13J46m02L78k50J11J47m19M9J74j69L1k2JL28o09R9J17
1519B26n26N20m4l01J26k97J32j36j42J71M7q5J64l57j26N77l83K05n4j50k13
$$ plain form
1365 22 258 76 162 390 -72 -4 7 -201 48 -69 -318 -132 -326 -467 -223 -402 -377 -550 -546 -356 -558 -443
1387 -443 -325 -149 -685 -594 -657 -750 -336 -505 -338 -240 -517 -456 -249 -197 -87 -311 -169 -22 -395 -129 -66 -50 476
1410 476 -120 324 165 138 213 355 399 678 429 719 659 399 455 784 426 424 344 488 756 696 810 423 306
1433 306 467 172 347 617 204 413 267 -82 142 -38 -53 244 59 -242 -75 -414 -429 -99 -620 -60 -244
1454 -244 -349 -275 -759 -754 -314 -623 -501 -623 -999 -647 -784 -649 -407 -816 -780 -525 -481 -314 -489 -736 -147 -482
1476 -482 -128 -347 -455 -49 -156 -289 -108 -96 -149 336 226 157 323 153 373 243 4 485 746 397 811
1497 811 407 481 847 203 516 662 260 638 388 499 646 227 276 450 281 312 290 291 619 10 109 226
1519 226 -300 220 176 -125 1 -296 -164 -300 -442 -271 -224 -309 -145 -502 -628 -51 -434 -229 -283 -433 -646
1540f46M9N7J11O7K9k0j15Q0M2O3m3J43j06J20J01M2K65m05L7K98j20j03L39m18
1564a33N02P9l46L62l21J15K56l63M34k70R6J92m87J21J33r2L71j70k20Mm6n4
1586A63L11l03J68m80KL08j90n4L65n05J10j72J74j05k37K62J15l76J57j32k89
1607g08M05mj37j52K91j12j81K59O5P5l33J98j79P3J03r8J15J11p9j74K77j2Q7
1630a10K57l53PL83r6P6J51O1k31m7K90r6P0J01L00l06Mj48K23J8j76L62n40J02
1654C02J4L03k98j18K13j21M7l38K65j0J4j33L8j23j68n4J05q3K6Q2k4l8k75M2
1678c32R3M5N4k61J79k24m0J46M2nP4k51kJ15j37J26J58K3J06j96K06j34r3L74
1702F6J19k56k20N56k26K42j96K12q8k23M4r8M20N7r8K22l85K64q2J01K9j1k32
$$ plain form
1540 -646 -597 -540 -429 -362 -333 -353 -468 -388 -346 -283 -326 -183 -289 -169 -68 -26 239 -166 -129 169 49 -54 285 -133
1564 -133 369 448 102 464 143 258 514 151 585 315 411 603 116 237 370 278 649 479 259 263 217 163
1586 163 474 171 339 -141 -139 169 -21 -75 290 -215 -105 -277 -103 -208 -445 -183 -68 -444 -287 -419 -708
1607 -708 -303 -307 -444 -596 -305 -417 -598 -339 -274 -199 -532 -334 -513 -440 -337 -435 -320 -209 -288 -462 -185 -197 -110
1630 -110 147 -206 -199 184 88 164 315 376 145 98 388 292 362 463 763 457 461 313 536 554 378 740 200 302
1654 302 316 619 321 203 416 295 342 4 269 259 273 140 178 55 -113 -167 -62 -145 -119 -37 -61 -99 -374 -332
1678 -332 -239 -194 -140 -401 -222 -446 -486 -340 -298 -303 -229 -480 -482 -367 -504 -378 -220 -197 -91 -287 -81 -215 -308 66
1702 66 185 -71 -291 265 39 281 85 297 209 -14 30 -68 352 409 311 533 148 412 330 431 460 449 217
1725B17J39k39o0L93j15l8R7j15J50j20J68l39P7J36k89k1k13L14Q9o3J9l25k61
1748c99R5J47RK99k46l40j82M24j61o8K24n2Np5j74K23l1q0K33k09N7j94K05K06
1772h4j0K3k60J5M7K61j08K57q6k86L23j1mm5K84k44N4q5N04k29J19r4m7L01l72
1797B23r9J17n5m9L64j55j29r4J61o7K19m5Jk66k4j26J51K38k74L50m63J20k77
1820a79N8j00J93mk26j6j6L5n6q3M3N4n0k55L69j09K11l37J22J67l52J61K62l51
1844d59L22m5j8m4k4J26J39L0J3O3j31K03r8Q3Q1k17K75o4j98J15Ll3L73l19J80
1869C56n1J90l88K13P4N4j50j9N0k36J46O9j68K41k35k08J83J03j34J92k12k89
1891b19Q7R7oO7J24l50O9J5p4rj18J26o5p1J75l17K18k04K50K7m3m5k7R3l7q1
$$ plain form
1725 217 356 117 57 450 335 297 394 279 429 309 477 138 215 351 62 41 -172 142 231 168 187 -138 -399
1748 -399 -304 -157 -148 151 -95 -435 -617 -193 -354 -422 -198 -250 -245 -320 -494 -271 -302 -382 -149 -358 -301 -495 -290 -84
1772 -84 -94 -71 -331 -316 -269 -8 -116 141 55 -231 92 81 77 32 316 72 126 41 545 316 435 341 294 595 223
1797 223 124 241 186 137 501 346 217 123 284 217 436 391 392 126 102 -24 127 365 91 441 -22 98 -179
1820 -179 -121 -221 -28 -32 -258 -274 -290 -255 -311 -394 -351 -297 -347 -602 -233 -342 -131 -468 -346 -179 -531 -370 -108 -459
1844 -459 -137 -182 -200 -244 -268 -142 -3 27 40 103 -28 175 77 160 241 24 299 235 37 152 155 122 495 176 356
1869 356 305 495 107 320 394 448 298 279 329 93 239 308 140 381 146 -62 121 224 90 282 70 -219
1891 -219 -132 -35 -41 26 150 -200 -131 -116 -190 -199 -317 -191 -256 -327 -152 -469 -251 -455 -205 -178 -221 -266 -293 -200 -237 -318
1917c18l1J62r3j1J43RJ14j20q5K26m6n6j95L02K41j79l1O0K65q0j84q7L87k87
1941A06r0K70J04l48J36K15K8O5m29J04K98n76K33K79l45K58l16J67J05Ok17L4
1963H7p9J15j3q4J8m06K62j05j19J9J92J13j44q6P9j80q5N4J42l63M75l65J15
1986c58L02r5Q8l01Q3K8j98J90L7j71L54J17j74R9j89L09l24j5J37K43j85R2J70
2009B39J4r9K5j01K98K9j52l8j41J96l8n6P7k7k63L48q7L90m11j55K67j21l0K53
2033D17k33Kj45L31n11K5J95J13l69R7J85k25l4J84j65Q0l4k1L5k25j07L08j58
2056b55K52k53pJ59k37J09J79p1n8Q8l06M08J4pj72L22m94J03R0Q6O2k30J78o3
2080a03K94k0j50M1J64J1jl14N11j51J59l02J73l2j2R9j98J74j26K13k27K83m26
$$ plain form
1917 -318 -349 -187 -280 -291 -148 -139 -25 -145 -230 -4 -50 -106 -301 1 242 63 32 92 357 277 93 6 393 106
1941 106 16 286 390 42 178 393 421 486 57 161 459 -117 116 395 50 308 -8 159 264 270 53 87
1963 87 8 123 110 26 44 -362 -100 -205 -324 -305 -113 0 -144 -230 -151 -331 -416 -362 -220 -583 -108 -473 -358
1986 -358 -56 -151 -63 -364 -281 -253 -451 -261 -224 -395 -41 76 -98 1 -188 121 -203 -218 -81 162 -23 69 239
2009 239 253 154 179 78 376 405 253 215 74 270 232 176 253 226 -37 311 224 614 203 48 315 194 164 417
2033 417 184 186 41 372 -139 -114 81 194 -175 -78 107 -118 -152 32 -133 -53 -87 -108 -73 -298 -405 -97 -255
2056 -255 -3 -256 -263 -104 -341 -232 -53 -124 -182 -94 -400 8 22 15 -157 165 -329 -226 -136 -50 12 -218 -40 -103
2080 -103 191 171 21 62 226 237 236 -78 433 282 441 139 312 280 268 367 169 343 217 430 203 486 60
2103F0q9M15j52J00k17L17m97k99L21n4L34j84Mm3m3k4j33O6lj12mj57L50k7j22
2128a93N5j66K27l17L37j47J86j37o0k37O8j52K50J66J19j22J4j85L89j66J29
2149E8l0l1J4J98n3k05p5K00J19L4k9k3N6R6n8k22L82J3k70L6k30L57j69J95l02
2174F1K22m9N8j83o3J07l5L13l10R7j55j03K23k50o4J31j77J86M3j87m9K5l8M5
2198a52o2N6j23O4N6J03n6kL9n4J00j12K3N5o7K4k27K36J23k45K53k51O3K46N
2223I5j59J24j63N2R0L1r8K9RJ84q3J21K07k52j41L84j65j00J18j25j05L1J72
2246B56j43J61J19n7J06l06l0r3K04J05l10K74j35L8j38k47K53q2J63k81PP0k25
2269b91n5K90pk50J65LJ55k66kj0J31M4l11L37q5q8j2J02R6j09K1O4J16K1j16
$$ plain form
2103 60 -29 386 234 334 117 434 -63 -362 -41 -95 239 55 59 16 -27 -51 -184 -118 -121 -233 -237 -394 -44 -71 -193
2128 -193 -138 -304 -77 -394 -57 -204 -18 -155 -215 -452 -384 -536 -286 -120 -1 -123 -109 -294 95 -71 58
2149 58 28 -3 11 209 156 -49 -124 76 195 229 200 177 233 329 271 49 431 444 174 210 -20 337 168 363 61
2174 61 283 234 292 109 46 153 118 431 121 218 63 -40 183 -67 -131 0 -177 9 52 -135 -184 -159 -197 -152
2198 -152 -214 -158 -281 -217 -161 -58 -114 -116 -77 -131 -31 -143 -120 -65 -132 -108 -335 -99 24 -221 32 -219 -156 90 95
2223 95 -64 60 -103 -51 39 70 -28 1 10 194 111 232 439 187 46 430 265 165 283 158 53 84 256
2246 256 113 274 393 336 442 136 106 13 217 322 12 286 151 189 51 -196 57 -25 138 -143 -136 -66 -291
2269 -291 -346 -56 -63 -313 -148 -145 10 -256 -258 -268 -137 -93 -404 -67 -152 -240 -252 -150 -54 -163 -142 -78 38 59 -57
2294e7k8R5p7J64j11K95k82n3J7O4J82r0P8J97j44j09J2l48K29K41O8J0M4k73
2318A24n3K24K7j75J16k10l4oM07k46k5J40q9k8l29l4O02j96k4j36j55p9p0K85
2342C6o8o6J56j76O6l26N35k44j41J68m32M71l90J64M16l75k3L28l22J33k99L6
2364c53J79K02k27K0j83K10n3O0Q4p6p1K21J01J80Ol04J84j68L5K65l2k73l7K68
2388B38n3k15J87MJ15k87J41N0j13M04j42j78J28j25l1Q3l23P8J56N9m2o3M3l15
2412b01K55n0j83L01j78q5pJ62j65N2J2l01J33J03J62p9K0k25O1K6Q5j16R3J44
2436A9k62K62k31K37k34J21k5p2R7R3n8j34J97P1l55K88K19k83L46j29J05J78
2458D50l94J15J93l9MJ11l55K44j05Q1J11k21J20j17k10j03M21k55o5k6O6o1P8
$$ plain form
2294 -57 -85 10 -67 97 -14 281 -1 -54 -37 27 209 119 197 394 250 141 153 -195 34 275 343 353 397 124
2318 124 71 295 322 147 263 53 19 13 420 174 149 289 200 172 -157 -191 411 215 191 55 -100 -179 -249 36
2342 36 -32 -98 58 -118 -52 -378 157 -87 -228 -60 -492 -21 -411 -247 169 -206 -229 99 -223 -90 -389 -353
2364 -353 -174 28 -199 -179 -362 -152 -205 -145 -61 -137 -208 13 114 294 300 -4 180 12 47 312 280 7 -30 238
2388 238 185 -30 157 161 276 -11 130 180 67 471 329 151 279 154 123 206 -117 -39 117 176 134 71 114 -201
2412 -201 54 4 -179 122 -56 -141 -148 14 -151 -99 -87 -388 -255 -152 10 -69 -49 -274 -213 -187 -102 -218 -125 19
2436 19 -243 19 -212 25 -209 -88 -113 -185 -88 5 -53 -187 10 81 -274 14 233 -50 296 167 272 450
2458 450 56 171 364 325 329 440 85 329 224 305 416 195 315 198 -12 -115 306 51 -14 -40 26 -35 43
2481D3o4n8K09J71l51N5j61N5Q8k00j25mQ6r3J02j51N40j79Kj17j19p3K69J5r9
2506a59l6M7l4R3Q6k40R5j57L66l7k92j6L24j03k32K36l5r8o3K40J64r6k0j8K61
2531B76j69J54k26OJ81k89L14j7J25m33L87m5j96q0L79k13J55q4j20J68M5k83
2553C5j23J36m4R8k8k29J67J23k83K19j46k8J5n2j28L6o1J77j22K09j10l1j94
2576c64J64P1n4J36ml6k16L04j71P2j91j9L06j59j08K64m8R7k8K9J57r2l05K57
2600F2n4k1MJ0P2j4K96j83lJ18j63J52O9k56q1L33l13J30N5r2l2P3L1M2n6k72
2626i3P1O5p8j20L51q9P2m15L64j66j15j08M04k22J80N1k51J21l69K82l52L88
2648b9k58j1K75k36K99R9l09M0N0nO5J91k68J26n1nL0o0J38L9j98J52n8j45K45
$$ plain form
2481 43 -21 -79 130 301 -50 5 -156 -101 -13 -213 -338 -342 -256 -349 -247 -398 142 -37 -35 -152 -271 -344 -75 -60 -159
2506 -159 -195 -148 -182 -89 -3 -243 -148 -305 61 24 -268 -284 40 -63 -295 -59 -94 -192 -255 -15 149 53 33 15 276
2531 276 107 261 35 41 222 -67 247 230 355 -78 309 264 68 -12 367 154 309 225 105 273 318 35
2553 35 -88 48 4 102 74 -155 12 135 -148 71 -75 -103 -88 -140 -268 -232 -293 -116 -238 -29 -139 -170 -364
2576 -364 -200 -129 -183 -47 -51 -87 -303 1 -170 -98 -289 -308 -2 -161 -269 -5 -53 44 16 45 202 110 -195 62
2600 62 8 -13 -9 1 73 59 355 172 169 287 124 276 345 89 8 341 28 158 213 121 89 162 193 235 179 -93
2626 -93 -22 43 -35 -155 196 107 179 -236 128 -38 -153 -261 143 -79 101 152 -99 22 -347 -65 -417 -29
2648 -29 -287 -298 -23 -259 40 139 -170 -130 -80 -85 -20 171 -97 29 -22 -27 3 -57 81 120 -78 74 16 -129 116
2673A16j78K04j35J50j13kQ8PQ7q9lk1n0n3K79m3q1j29J40J12k65K01q0nn4J1
2699I4r7j01J16J57j70l5q1J22P4k3l50L08k34J14J64p0j63m5K94k27J10l63L71
2722c5k26J94l48J70n1J09L8KK03k92Q7J78k24k23L45L4L2q1LM9m8L24j98l1M6
2747E7j48L0K67l01J36J59p0J1j58K10o5k8J55j21J53l38J52J99p9L08l87RP1
2770B22j78K42j91n8o4J50j22L06l62l4K7K39k4k64L53k39k66J43O2l7l3MJ85
2793F1j33Q4j71L07l96J73J7r6J70n30M63Nk47M8J83j18nJ16K7j66P4j62L60k79
2817b15R4J60q2Q8k63L38j23J0J60k06j0k6J57p5oQ3j9R4k2J06q6q1K0q6K53j26
2843A37J48k2j31k32K30J18k21j16M05l15m9K1p6M05k65jn1j18K64j10j17N5j33
$$ plain form
2673 116 -62 142 7 157 44 42 130 137 224 135 132 111 61 8 287 244 163 34 174 286 21 222 142 137 83 94
2699 94 -3 -104 12 169 -1 -36 -117 5 79 56 -294 14 -220 -106 58 -12 -175 -220 74 -153 -43 -406 -35
2722 -35 -261 -67 -415 -245 -296 -187 -149 -147 56 -236 -149 29 -195 -418 -73 -39 -7 -88 -85 -36 -84 240 42 11 57
2747 57 -91 -61 206 -95 41 200 130 141 -17 193 128 100 255 134 287 -51 101 300 221 529 142 151 222
2770 222 44 286 95 37 -27 123 1 307 -55 -89 -62 177 153 -111 242 3 -263 -120 -58 -95 -128 -124 61
2793 61 -72 12 -159 148 -248 -75 -58 -154 16 -514 -51 -46 -293 -245 -62 -180 -185 -69 -42 -208 -134 -296 64 -215
2817 -215 -121 39 -43 45 -218 120 -3 7 167 -39 -49 -75 82 7 1 84 65 159 137 243 157 76 96 10 263 137
2843 137 285 263 132 -100 130 248 27 -89 316 1 -48 -27 -103 302 37 36 -15 -133 131 21 -96 -41 -174
2866a74N6l6O9m2J34j12L17n96K99J30j93Q3k19K99o0k61J94j65R7R2k29L72k60
2889b05l5J51NQJ28M9j1j94K91Q2j55j71J61l00L61m55J86J80J4k4J92q9l5J82
2913C16j17k5M7j22J54oj33J91k45J96j82n9j6OJ48m61L38J66k36j35O9M1j91
2936b56P0Q4J63k53O4Ok01L27j8k10Q3r7R2j68m6L67j78J86q1k02O2o4K63R4j52
2961f5j0K4JM7J14k90J54j16J40R9l0j32K57k02Q7K4Nj39P2J16L8N8k90L23j90
2986I5J16k30J54J86j29k1J43j06l11K24m65N14k31J%R9L9j11n9j11j38K57K48
3009A64l38J26J4k34K02L2k60L70J00j87j62J71n6K76n63J74J57j72K1l8J50J42
3031H9q6j39K5j34O7O9J45l06K92j0l48K61K5P1M3J64k49R8J1M7PJ13M0j37o3
$$ plain form
2866 -174 -118 -154 -85 -127 7 -105 212 -384 -85 45 -148 -65 -284 15 -45 -306 -112 -277 -180 -88 -317 55 -205
2889 -205 -240 -89 -84 -76 52 101 90 -104 187 269 114 -57 104 -196 165 -290 -104 76 90 66 258 169 134 316
2913 316 199 174 221 99 253 247 114 305 60 256 74 15 -1 5 153 -308 30 196 -40 -175 -106 -65 -256
2936 -256 -186 -102 61 -192 -128 -122 -323 4 -14 -224 -141 -238 -146 -314 -360 7 -171 15 -66 -268 -206 -270 -7 87 -65
2961 -65 -75 -51 -50 -3 111 -179 -25 -141 -1 98 68 -64 193 -9 78 102 107 -32 40 156 194 252 -38 285 95
2986 95 211 -19 135 321 192 171 314 208 -103 121 -344 170 -61 -60 -60 39 78 -33 -92 -203 -341 -84 164
3009 164 -174 -48 -34 -268 -66 -34 -294 76 176 -11 -173 -2 -58 218 -345 -171 -14 -186 -165 -203 -53 89
3031 89 3 -136 -111 -245 -178 -109 36 -270 22 12 -336 -75 -50 21 64 228 -21 77 88 135 142 255 295 158 95
3056I5k03M92j94l8K4K0j56J41NJ8j86J26J00j57k40K46k6pJ35m8J39l20k5K1
3080c8j61J15Q5l0M0J11k71L2m0L36j86j12J7K6J52k03J52k31J01J1k39K91m4
3103h6o0O0k5N5j27J34p0p8L7N8K78m21Q2J10R2j54J35K39j42n0k6J37R2k54l9
3128b3J31j41K35k96J12K59k46L6Q3Pj76O2k5P1J34J11k40j41l1J25O8n8qN8l0
3153G7j29q3J50M2k37NK35j59N8L0j07j98K26q4O0q6j13K89k01K67l3r9j09J95
3177dl05J28K7m8L64k40J46l21M13j97j80J13K87p1N0j19p1R4J05j05K7k1j00
3200b8R3J29J2j6j38rK63k11p7PK38j28o4j21O7n1L44j84q9PJ78k64K02j5K3k48
3226h0O6p6j3J52L2J7k79K61J8j59k28j70P76l97j33J39j44M0N4j31K2J76k37
$$ plain form
3056 95 -108 384 190 152 176 196 40 181 186 204 18 144 244 87 -153 93 67 60 195 147 286 -34 -59 -38
3080 -38 -199 -84 1 -29 11 122 -149 -117 -157 179 -7 -119 -102 -76 76 -127 25 -206 -105 -94 -333 -42 -86
3103 -86 -146 -86 -111 -56 -183 -49 -119 -197 -160 -102 176 -245 -163 -53 39 -115 20 259 117 67 41 178 270 16 -23
3128 -23 108 -33 202 -94 18 277 31 67 150 157 -19 43 18 89 223 334 94 -47 -78 47 115 57 49 107 77
3153 77 -52 -135 15 57 -180 -175 60 -99 -41 -11 -118 -316 -90 -174 -114 -200 -313 -24 -225 42 9 -90 -199 -4
3177 -4 -309 -181 -154 -202 162 -78 68 -253 160 -37 -217 -104 183 112 162 43 -28 66 171 66 93 72 -28
3200 -28 65 194 206 190 52 43 306 95 18 25 263 135 71 -50 17 -34 310 126 37 44 222 -42 160 145 168 -80
3226 -80 -14 -90 -103 49 81 98 -181 80 98 -61 -289 -459 317 -80 -213 -74 -218 -178 -124 -255 -233 -57 -294
3249b94K72k77J68K2L9L4j47K12j21N7l1R5j70J53J96j14J73j57N8k35j73L79
3271A39m6N6l18L37Pj00J25r3j66N6N4J87m2j22R3j7j65J27J64j6J5j76L6l11
3295a76K71p2J17j15K6Mm18L87Q8l23M35l70o2M4L5J58o5m34K68J68j14K48j57
3318e7J21j44j4q0lJ18M3j27J8p2J42J56j06k21K03O3r9J20q8j47J26n1J52J10
3342A63rl24K8J23J09J0J87j86m3O9j52J25O9n8m5p1K6J15J71j49J9o3O5j16J97
3367B60Mk89k5n9K2K08j64N5P3j29J34m5J00o4m3j43Q4K2l02K33r0n7J8P2j59
3392b84K77k18LmqL94l97J57j92K88q9k11K64K17o1k52K8r4M7O0K9P6J03j22J49
3417A60q8o6L31l67m5L86k11J60j52K94m56l5K19k78L36n0P0J59q1k43M6K8o6
$$ plain form
3249 -294 -22 -299 -131 -109 -70 -36 -183 29 -92 -35 -66 29 -141 12 208 94 267 110 168 -67 -240 139
3271 139 93 149 -169 168 175 75 200 107 -59 -3 51 238 196 74 167 150 -15 112 276 260 275 99 135 -176
3295 -176 95 23 140 25 51 55 -363 24 112 -211 224 -146 -208 -164 -129 29 -36 -470 -202 -34 -148 100 -57
3318 -57 64 -80 -94 -174 -177 -59 -16 -143 -125 -197 -55 101 -5 -226 -23 40 -59 61 -27 -174 -48 -99 53 163
3342 163 154 -170 -142 -19 90 100 287 101 58 127 -25 100 169 111 66 -5 21 136 307 158 177 114 179 63 260
3367 260 264 -25 -50 -109 -87 121 -43 12 85 -44 90 45 145 81 38 -105 -21 1 -301 -68 -158 -215 -197 -125 -284
3392 -284 -7 -225 -222 -226 -234 160 -237 -80 -272 16 -73 -284 -20 197 136 -116 -88 -182 -135 -75 -46 30 133 11 160
3417 160 72 6 337 -30 -75 311 100 260 108 402 -54 -89 130 -148 188 138 208 367 286 43 89 117 51
3440E1R6k34r0J39J02mj04j9k2O6J49j70J19p4J78j68l29K11O7O4j31j08j9m7
3464b77J42N2j70J66M0j86J19j32L0Q5J94j14j77J05m3Q7n5l0J75j74K38%k35
3487a60K26q3k2J08j11K13j35J33m6J10R8k13J48o5p7j8K0O3J27n5m3k61J34J21
3511B12l09j7K87K9j50j58J60Q0m80L37k24J7M80j94oj25K51l40l7J83O3j72K25
3534A12l05m8K45m18K57j32J0J18k13L16J2j75m2R5L01j20k86J02j7J32k99L97
3556D2J8j50L19l19K12j77Q0j41K6J5j2Q7k5RJ47l9m7K81l71K47L9q5k02K52j74
3581C2K59l34J21k7j21K31j95n5K37J12j97k91L13K2m2k15K38l8l2J28j41R2k41
3604a44L93l88L0O4q8J99L3k18L0J11k34K84j11K60l42Q6M1q7j63K32j28J44r0
$$ plain form
3440 51 147 -87 -177 -38 64 60 -44 -63 -85 -19 130 -40 79 5 183 15 -314 -103 -36 28 -103 -211 -230 -277
3464 -277 -135 -83 -253 -87 -47 -233 -114 -246 -216 -131 63 -51 -228 -123 -166 -79 -134 -164 11 -163 75 75 -160
3487 -160 66 -17 -39 69 -42 171 36 169 123 233 331 118 266 201 124 106 126 189 316 261 218 -43 91 212
3511 212 -97 -114 173 202 52 -106 54 134 -346 -9 -233 -216 264 70 64 -61 190 -150 -187 -4 59 -113 112
3534 112 -193 -241 4 -414 -157 -289 -279 -161 -374 -58 -46 -221 -263 -168 133 13 -273 -171 -188 -56 -355 42
3556 42 60 -90 229 -90 122 -55 25 -116 -90 -75 -87 0 -25 -16 131 92 45 326 -45 202 241 156 -46 206 32
3581 32 291 -43 78 51 -70 161 -34 -89 148 260 63 -228 85 107 65 -150 88 50 18 146 5 97 -144
3604 -144 249 -139 -109 -45 -133 66 99 -119 -89 22 -212 72 -39 221 -121 -35 6 -81 -244 -12 -140 4 -86
3627h6k07K60j54R3l27L70J61k18J70p9k5L1j85M14M2k31q1J95n0J7O5j63k9k7
3651d4J37r0J74r2m3Mj10J15L8M5j69J92QPJ06l68k7J18j29K56k5j60K2J84k8
3676A21mk46K04j59P5K52l77L66q2q5j41l4M9J7n3o3olO1J22k04K12J53j04j72
3701a01j21L8J09Q5J40j50Q2k57K68j84N9j4K68k26j15K02R1p0n8J1J52Qj52J91
3725B56k03j81K39j46J49P5k06k2j12R8J45J09k83j07L49Q0j77J16k3j56J67j93
3747b6R3p2J97j84n6J25j01Q3j80Q9K55l53j53K61q0J03K01m51L48p2k53R7j19
3770b48L4M2K60p6mk13J54J03p2J11m97N42k62p5L51j02K2l7j48K72q1J21j9j61
3794A7J51n32M69j31L28k10p8j24R6J36P4m7J16j77M7j2k12O5J04j11L5J26L0
$$ plain form
3627 -86 -293 -33 -187 -94 -421 -51 110 -108 62 -17 -42 -11 -196 218 260 29 -52 143 93 110 175 12 -17 -44
3651 -44 93 3 177 85 42 46 -64 51 89 134 -35 157 165 172 278 -90 -117 1 -128 128 103 -57 -35 149 121
3676 121 117 -129 75 -84 -9 243 -134 232 150 65 -76 -110 -61 -44 -97 -160 -166 -169 -108 14 -190 22 175 71 -101
3701 -101 -222 -184 -75 10 150 0 82 -175 93 -91 -32 -46 222 -4 -119 83 174 104 46 57 209 217 65 256
3725 256 53 -128 111 -35 114 189 -17 -39 -151 -53 92 201 -82 -189 160 240 63 179 156 0 167 -26
3747 -26 67 -5 192 8 -48 77 -24 59 -121 -32 223 -130 -283 -22 -102 1 202 -249 99 27 -226 -129 -248
3770 -248 -214 -172 88 12 8 -205 -51 52 -20 91 -406 136 -126 -201 150 48 70 33 -115 157 76 197 178 17
3794 17 168 -364 105 -26 302 92 14 -110 -14 122 196 149 265 88 135 123 -89 -24 80 -31 4 130 160
3817A60M3m6j97N4j26J38J4p9M7n1j40j8L16k03P6k4l4j18M6M7k2J0Qn7J42M2
3843B8J0k11J64O0rj12k3j52K03R5j99J00J44j38l02L38o1P7r2J08J5J77J5k08
3867B7K61m20LL16j43k0pJ61j85J48k3j53M0m0J67K6J45k06k0J1J3K01k25J22
3891A99k58N0R1j41K28q9p0R7q5K17j28l90M92j54l3J01j72j27J55n1k5k19O7
3914b45K09r6M7o4J18O5k8j71J72J95k06J27j16j4J24o1J0o8M7j69P5L2Jj12J46
3939A8j29J59J45q7j9O7j03J58N5j18MM0q6J2k18K23j02q4L6J04O0p1J42k15K84
3964B75m73M86l96Q9jj73J69J19j13J56k62K80k06k03J93J51j39k48M36k97J18
3985c9p7QM2j33Q0J12mj66K25k13J44K7o1o3M4J7J14m8j58J33R3pj86lK41j23
$$ plain form
3817 160 203 157 -40 14 -112 26 40 -39 8 -43 -183 -201 115 -88 -12 -36 -70 -188 -142 -95 -117 -107 -99 -156 -14 28
3843 28 38 -173 -9 51 42 -70 -93 -245 -42 53 -146 -46 98 -40 -342 -4 -65 12 -80 28 43 220 235 27
3867 27 288 -132 -129 187 44 24 17 178 -7 141 118 -35 5 -35 132 158 303 97 77 88 101 302 77 199
3891 199 -59 -9 82 -59 169 80 10 107 22 239 111 -279 213 59 26 127 -45 -172 -17 -68 -93 -312 -245
3914 -245 -36 -132 -85 -149 -31 34 6 -165 7 202 -4 123 7 -7 117 56 66 -2 45 -124 -49 -17 -16 -128 18
3939 18 -111 48 193 106 87 154 51 209 264 146 150 190 104 116 -102 121 19 -65 -29 75 135 64 206 -9 275
3964 275 -198 288 -108 -19 -20 -193 -24 95 -18 138 -124 156 -50 -253 -60 91 -48 -296 140 -157 -39
3985 -39 -116 -108 -66 -199 -119 -7 -11 -177 48 -165 -21 6 -55 -118 -74 -57 57 9 -149 -16 77 70 -116 -119 122 -1
4011aJ20j70K78k23k9P2r0M5Q0K37m11K32j30j4K01j25J13r2J47j60m2JR8J94
4035C31m71o5K24m4J91l13L24m38L17k13P1J73M4k29J13J5O3j20k49L42q8J08
4057H6L2j06N5J28j65j67k4J65j52J73j22q5J83J45r2K8r7j80L57r4q8n4J85j97
4081h6K35k37J13k7J74Q2k61n3M9r7K32l4j74K21j26p7J75Q4k78L17j21m2k2K38
4105B85k83K35J15k82J80l13K20J27k57m5j1J40J0j13K28j94J2k16K05M5j77o4
4127a53k5m5K63j62j53J94k19L07J24k55P3j91J25j9P2J07K7k87J98N1k34J74
4149b8J24j5l13J33k5n9J84p8O0J23o4J04p8J00M7r9p3j52J00L31j26j45L09l25
4173C5N2r2K64k67Q3p0j64J4nJ55j03L21k55J84j36k9K84k27k2j59R0r4J02J7
$$ plain form
4011 -1 119 -51 227 4 -25 47 -43 2 82 319 -92 140 10 -4 197 72 185 93 240 80 38 39 137 331
4035 331 -140 -205 19 -25 166 -147 177 -261 56 -157 -86 87 131 -98 15 30 93 -27 -276 66 -22 86
4057 86 118 12 67 195 30 -137 -161 4 -148 25 -97 -182 1 146 54 82 -15 -195 162 68 -20 -74 111 -86
4081 -86 149 -88 25 -2 172 254 -7 -60 -11 -108 124 90 -84 137 11 -66 109 193 -85 232 111 69 47 285
4105 285 2 237 352 70 250 -63 157 284 27 -18 -29 111 121 8 236 42 54 -162 43 88 -89 -153
4127 -153 -178 -223 40 -122 -275 -81 -300 7 131 -124 -51 -242 -117 -136 -64 43 70 -217 -19 32 -202 -28
4149 -28 96 81 -232 -99 -124 -183 1 -77 -17 106 42 146 68 168 215 116 43 -109 -9 322 196 51 360 35
4173 35 87 -5 259 -8 75 5 -159 -145 -150 5 -98 223 -32 152 16 -13 271 44 22 -137 -47 -141 -39 -22
4197b2J94j13n4j34K26o7k73L7L21k06j27P5j9K24k95J31K72l60K19l4p8K20m0
4220I7j68J14J18j27o1j4p8K94j96l6j61L13j03L3J23j28L11l85K93l62J08J20
4242A05o8%J17j7m60L35J85j03k43M6J95k13P2J6J42k84M42o7k82K95j27L6j45
4265b3j33J94j28K11j96K09L1k84M3j46M42k74k9K7R8P3k78K53j72m12N77q3O5
4288F5j94l3J50j06K21J6m9l12L51k00N6j88L61j82o2J09j56J99n0L9j94J99P7
4311A17j60q8p0K12L0n9k74L37q0K69k48Q6J81k70j52K51R8k65J53q1k97L68M
4334F2j97J47J41J3p1o8q0k02K64j04J93j34O3j12Q9k11J17J03J35l18q1K96R
4357E4j92M7j07P8J78j33o2j62K72jNJ72j99K63l01j22K33l4j71j48K20M2Q4J01
$$ plain form
4197 -22 172 59 5 -129 97 30 -243 -206 115 -91 -218 -143 -162 62 -233 -102 170 -190 29 -5 -83 137 97
4220 97 -71 43 161 34 -27 -41 -119 175 -21 -57 -218 95 -8 25 148 20 331 -54 239 -123 -15 105
4242 105 37 37 154 137 -323 12 197 94 -149 -103 92 -121 -49 -33 109 -175 267 200 -82 213 86 122 -23
4265 -23 -156 38 -90 121 -75 134 165 -119 -76 -222 220 -54 -83 -56 42 115 -163 90 -82 -494 83 0 65
4288 65 -129 -162 -12 -118 103 119 70 -242 109 -91 -35 -223 138 -44 -106 3 -153 46 -4 35 -159 40 117
4311 117 -43 -131 -201 11 41 -18 -292 45 -35 234 -14 72 253 -17 -169 82 180 -85 68 -13 -310 58 62
4334 62 -135 12 153 166 95 27 -53 -255 9 -95 98 -36 27 -85 4 -207 -90 13 148 -170 -251 45 54
4357 54 -138 -91 -198 -120 58 -75 -137 -299 -27 -28 -23 149 -50 213 -88 -210 23 -11 -182 -330 -110 -68 16 117
4381A17j24K81m42L05j04l0p7Q6l2l7O1p2J37j38K43j6jj69N8K36k82k5J3jJ30
4406A17j87j3O7P6o5n6j95K76j1j3L5q4p7R3J63k20M0K95k21j80J09l5M6J76k05
4431f9l3J69k2k39L60l72QP9N5j24J21J35o9m1O7k80K64J6L%K1q8on2r0L64l42
4458a65K31n7O6r2K48j70J43k61JK43j82L69l53J27r5o1N2J71n5j08n6p5K35k61
4482a05K07P0l12J27k13J74j6N9L1m9J8M6q0J41p6j38m2J85j37l0mM3k33K94m9
4507h9j98J85K27n7p7k57K1K33j08J59r8p0K22p8k11N8Q3r6L5M01l58O9N7Q1j84
4532e0l2J54J3j41J70K7q8O0N2l6m29K23J8K49o0j2j66R8j54K66j4k21K95k40
4556a8o2K08q2J61j53r0J28j38L9o1J22k57L66p7j34j42K70J57k37j24J72j47
$$ plain form
4381 117 -7 274 -168 137 33 3 -74 12 -20 -57 4 -68 69 -69 174 158 157 -12 46 282 0 -25 -12 -13 117
4406 117 -70 -83 -16 60 -5 -61 -256 20 9 -4 31 -53 -130 -37 126 -94 -54 241 20 -160 -51 -86 -40 136 -69
4431 -69 -102 67 45 -194 166 -206 -198 -119 -64 -188 -67 68 -1 -42 25 -255 9 25 28 28 49 -39 -45 -97 -187 177 -165
4458 -165 66 9 75 -17 231 61 204 -57 -56 187 5 374 21 148 53 -8 44 215 160 52 -4 -79 156 -105
4482 -105 102 172 -140 -13 -226 -52 -68 -9 22 -27 -9 37 -43 98 22 -116 -158 27 -110 -140 -144 -101 -334 -40 -89
4507 -89 -287 -102 125 68 -9 -266 -245 -12 -120 39 -59 -129 93 15 -196 -138 -55 -151 -116 285 -73 -4 53 134 -50
4532 -50 -82 72 85 -56 114 141 53 113 165 129 -300 -77 -59 190 130 118 -48 50 -104 162 148 -73 222 -18
4556 -18 -80 128 46 207 54 -36 92 -46 -7 -68 54 -203 163 86 -48 -190 80 237 0 -124 48 -99
4578i9N2K14N3l98J61M8k16R7J28l43L08k27L4K32j58M7Q2q5o5n7K54j19J27k57
4602a87M62k95p3J2L25m03K00K17k70j39K20J44k23L17l55l2R8q5K00J0k66K13
4624I0m5J15P9j65o5J12J00j44J60k01O7j71J45j14m5J15l3O2j93L4Q7R4k70M43
4648B57m94K85J71l26j17K01L4q2j44J81Ml8J0j57J66k20K5K56J31k54j6J49R7
4671A19m15K82j39K54q9j04Q6k9%mJ02J00k01K24o7Qq3l0J47j45J08Qo9M5N9r6
4697G1j14K04p0j28J03J79k42J72N6j45r9K2J27j47j0k2m9l6J08j7M1j82K11j90
4721a57J78j66K72k98N6J50j52M6J41j18j75J62J12k92K4L02j63m5o2NQ4K74l29
4744a51j1K97k8q8j79K96k25J87j5o3J28r0Q8k52J01Q4J00n5l47L48k27J28j5
$$ plain form
4578 -99 -47 167 220 -178 -17 31 -185 -88 40 -303 5 -222 -188 44 -114 -67 15 -70 -135 -192 62 -57 70 -187
4602 -187 275 -20 -93 -81 244 -159 41 258 -12 -151 69 213 -10 307 -48 -80 18 -67 133 143 -123 90
4624 90 45 160 239 74 9 121 221 77 237 36 103 -68 77 -37 -82 33 0 62 -131 -97 -10 84 -186 257
4648 257 -237 48 219 -107 -224 -23 11 -71 -215 -34 -30 -68 -58 -215 -49 -269 -244 12 143 -111 -127 22 119
4671 119 -296 -14 -153 101 12 -92 -6 -35 -35 -39 63 163 -38 186 119 127 44 14 161 16 124 132 63 108 167 71
4697 71 -43 161 91 -37 66 245 3 175 231 86 -13 9 136 -11 -21 -43 -92 -128 -20 -37 4 -178 33 -157
4721 -157 21 -145 127 -171 -115 35 -117 -71 70 -48 -223 -61 51 -241 -217 85 -78 -123 -185 -180 -96 178 -151
4744 -151 -162 135 107 19 -160 136 -89 98 83 20 148 58 146 -106 -5 79 179 124 -223 125 -102 26 11
4767A1M2Nj79Q3J54k74K65k7J05O8j74o8K4PJ03q4j34j5Ok20J38l0J13q2K39k78
4793b02N4J34N5R6k05M7J37k98j49K95J04M4k27J0j45J91M4k57J56K7j88K89J6
4816B8j00J70o6Q1L2P9k40o1k9M3K89o2q2j06J1LJ01O3j84J09j57L68l39L08j54
4841A05p9p4L10o5kL3l59L86j80J8K72n21L35k87Q7R1Q3l53K86j02J22m21L83
4864F8qk1p3j83J13P7L41l62J62k27L02l14j3O2m9P6j8O6j5M1J20m35P9K48r8
4889f1j5J10k05K51j33j39L41k0j63J72j38J65p5j55K29j46N1k40J35o1J49P9
4911A31J01k43J21k09N3L6P7J06m37M51rq7j81M62k42K3j66O8k53K4K59k54l2
4934b01J18j68M3M82m08K72l75L11n6mj80J58j6q4L1r1K42o6J15m08K10J95j46
$$ plain form
4767 11 53 58 -121 -38 116 -158 107 80 185 253 79 11 35 42 145 61 -73 -88 -82 -302 -164 -194 -81 -163 76 -202
4793 -202 -148 -14 41 137 -68 -21 116 -182 -331 -36 68 112 -115 -105 -250 -59 -15 -272 -116 -89 -277 12 28
4816 28 -72 98 32 113 145 224 -16 -77 -106 -63 226 164 82 -24 -13 -10 91 154 -30 79 -78 290 -49 259 105
4841 105 26 -48 262 197 195 228 -131 255 75 93 365 -156 179 -108 -21 70 153 -200 86 -16 106 -315 68
4864 68 60 39 -34 -217 -104 -27 314 -48 114 -113 189 -125 -138 -76 -125 -49 -67 -1 -16 25 145 -290 -211 37 -61
4889 -61 -76 34 -171 80 -53 -192 149 129 -34 138 0 165 90 -65 164 18 69 -171 -36 -97 52 131
4911 131 232 -11 110 -99 -46 -10 67 173 -264 187 178 91 -90 372 130 153 -13 55 -198 -174 85 -169 -201
4934 -201 -83 -251 -208 274 -134 138 -237 74 18 14 -166 -8 -24 -108 -77 -168 74 8 123 -285 -75 120 -26
4957b6R8j01q0n5Q0J5J85j84l3K04k49L48j13j59l3L42l75J07K6J2P9k4J5j43
4981f4Q3L1J17P1j49p9K56o0j68R8K73l02j15J2k5P8q0O1J33k45J75r5K1n8K83
5006B52k11o0r3L31m8l60J63n8P1LL00j90k5P6m36N12j37j52l9J76k1K5k99N3
5030a67J0l8J43j90J16L41l14J49J78m35M1N6L37l20l9J29l5P5rJ00k36L10k04
5053bm0M18l82J08j82l1K26l2J27k39K65k64L05j31k21N3j86L07p7M2L5n6K31
5076B74j40j16q4M5J55j95L0o6J30k76K11K0l42O30l58K6Q2k56K83j89J77r0K4
5099b5M0p0l6J98r4Q1j32j45K66L3o3Lj65J19j56N3Q9J5m5Q5J4M8O9k15K7K09
5125B03l55J01J16k3O3l37L50k54K32j51K03p7j01MJ06J2N2j30K44l43J72k72
$$ plain form
4957 -26 72 -29 -109 -164 -84 -69 116 -68 -101 103 -146 202 89 -70 -103 239 -136 -29 -3 9 88 64 79 -64
4981 -64 19 50 167 238 89 10 266 206 38 136 409 107 -8 4 -21 57 -23 38 171 -74 101 6 27 -31 252
5006 252 41 -19 -112 219 171 -189 -26 -84 -13 -10 290 100 75 151 -285 227 90 -62 -101 75 54 79 -220 -167
5030 -167 -157 -195 -52 -242 -126 215 -99 50 228 -207 -166 -110 227 -93 -132 -3 -38 37 28 128 -108 202 -2
5053 -2 -42 376 -6 102 -80 -111 115 83 210 -29 236 -28 277 146 -75 -22 -208 99 22 64 99 43 274
5076 274 134 18 -66 -21 134 -61 -31 -97 33 -243 -32 -12 -354 276 -82 -56 26 -230 53 -136 41 -49 -25
5099 -25 15 -55 -91 107 13 94 -38 -183 83 116 53 56 -109 10 -146 -93 -4 11 -34 51 65 113 182 -33 -6 203
5125 203 -152 -51 65 42 105 -232 118 -136 96 -55 148 71 -30 -26 80 92 144 14 258 -85 87 -185
5147a85K59j0n9l0j45j5m7M35k72R8l8l7J27J52j09m65K59K32m56J55N5j66L76
5170A14m7r6l7p2J81Q4k36J19j37p4n9J50J03o6R6P0J37l26k2K7Q6j20J12j65
5194a78K63p2K83n9j39j32j04K57j13L12j63j62k6rL16m18L75k68L5j81M18j93
5216D2R2j14j5K55l08K77l40J07K72k48J31k63J35Q2j05l8M9K84m60L50j89j37
5238a41n2L57j43j19J21j25j6J70r3J44m20J60L45k47k69J52L12k49J60j88N0
5259i1j17J01J29J97k10q5LK34m96L01P1j12K13Q0j31q2L1l6j22L49l03j35K14
5282CQ5k5K3lk33K57n9J06q0Q6k21J45M0j14J7L95k31N6q7l1j90k37K85J81j77
5307iq2j33M25l2l02l1L86n5j49j06J75j23L2O8n7j59J17m3j13L56k67j19K11
$$ plain form
5147 -185 74 64 5 -25 -170 -185 -232 203 -69 29 -9 -46 81 233 124 -341 -82 150 -306 -151 -96 -262 114
5170 114 67 -29 -66 -138 43 127 -109 10 -127 -201 -260 -110 -7 -73 23 93 230 -96 -118 -91 -5 -125 -13 -178
5194 -178 85 13 296 237 98 -34 -138 119 6 318 155 -7 -33 -42 274 -144 231 -37 -2 -183 235 42
5216 42 134 20 5 260 -48 229 -111 -4 268 20 151 -112 23 105 0 -38 11 295 -165 185 -4 -141
5238 -141 -193 164 21 -98 23 -102 -118 52 -41 103 -317 -157 188 -59 -328 -176 136 -113 47 -141 -91
5259 -91 -208 -107 22 219 9 -76 -73 161 -335 -34 37 -75 138 218 87 5 36 0 -122 227 -76 -211 3
5282 3 88 63 86 83 -150 107 48 154 74 160 -61 84 124 10 27 422 191 247 160 129 -61 -298 -13 168 -9
5307 -9 -91 -224 201 169 -133 -164 222 167 18 -88 87 -36 -4 64 7 -152 -35 -78 -191 165 -102 -221 -10
5330a0n1j2p6N6L24l27J0J37n9j34K07n4L6l8rJ58j01J60n8p0L90l12k32L2J88
5355A55o6j14M1j73L62k39p5M6j05J39O5r4N1K30k53K58m40M8J77L2m1J07j40
5378b9k6N6j22J94J33k96J14n3L8j16J30k29l5K74J96j53j84J7M5j82J13L01l75
5401a89M0K30r2l2L9j05n9K51j49K99l2k36jK9J0K67k28j87L91l61J98k98K7J89
5425AK55j68j7n6L15j60k35j34K15P5o1J55l25J11O3R4k26J87j77K39j8J04j71
5448F6J38l52J86j04M48l14J23l13Qp9J45J9k66L22k25K70n1k00K4J20J77k62
5470a20L24l75K40k24r1K85k36J98P4r3l3LLj2M4J66k49K08l49M59j25j41P5O1
5494I2K25l29q2Q3K32n3j13k53J81K48l19J05Q1Mk09J17j44P4J92m0Nr6oJ15k49
$$ plain form
5330 -10 -61 -73 -149 -93 231 -96 -86 51 -8 -142 65 11 47 9 0 158 57 217 159 89 479 167 -65 -33 155
5355 155 89 -25 16 -157 205 -34 -109 -63 -168 -29 36 -58 -7 223 -30 228 -212 -164 13 45 4 111 -29
5378 -29 -55 1 -121 73 206 -90 24 -29 9 -107 23 -206 -241 33 229 76 -108 -91 -46 -228 -115 186 -189
5401 -189 -149 81 -11 -43 -4 -109 -168 83 -66 233 201 -35 -36 -7 3 270 42 -145 246 -115 83 -215 -188 1
5425 1 256 88 71 15 330 170 -65 -199 16 91 30 185 -140 -29 34 128 -98 89 -88 151 133 237 66
5448 66 204 -148 38 -66 382 68 191 -122 -114 -193 -48 -29 -295 27 -198 72 21 -179 -155 -35 142 -120
5470 -120 204 -171 69 -155 -246 39 -197 1 75 -18 -51 -48 -45 -57 -13 153 -96 112 -237 222 97 -44 31 92
5494 92 317 -12 -94 -11 221 168 55 -198 -17 231 -88 17 98 102 -107 10 -134 -60 132 92 97 1 -5 110 -139
5519a39K03Q7j05l60M82k03R2j14J96j15M9J26k45J9J38o1Qk30K17k7J48j06j86
5542a26P6J32m3K9j25o3J06M9p6J34m8j16K16j45j27n6J35J20k66K15R9l7k2k16
5566a55J59k3k2J00k4j67L31j93j11K63j57PR0p6j57K54o1J02p7k21J48J30j77
5589c7j89M48k50p1O0J21m15M06O4J7k43O1K79j86l08J39J28K5J34l82JL49k7
5612A24l36K85k75K3K05o4j69L09k31J76J5l4J35k93kM7L7M1j32J02l3R5n0km4
5637g1n4k9K7K05J13l58J81j93K59J38k71M4l9n8J99K92m22j81K30J50r2M1l2
5660G9o2n0K4j02Q4k8J45K53j09o1k99K77m24K68J82j69O9j5R6J1j0o9k85J67
5684b8L5l31J38K00R3r6p5J42M7j58L8q1Q8j28K47k40k53L37R4j43J16j42J24
$$ plain form
5519 -139 64 151 46 -314 168 -35 57 -57 139 24 73 199 -46 -27 111 50 58 -172 45 18 166 60 -126
5542 -126 -50 82 39 68 -57 -120 -14 35 -41 93 45 -71 145 0 -127 -183 -48 72 -194 21 120 83 61 -155
5566 -155 4 -19 -41 59 35 -132 199 6 -105 158 1 8 98 22 -135 119 58 160 83 -138 10 140 -37
5589 -37 -226 222 -28 -99 -39 82 -333 73 137 154 -89 -28 251 65 -243 -104 24 49 183 -199 -198 151 124
5612 124 -212 73 -202 -179 26 -38 -207 102 -129 47 62 28 163 -130 -132 -85 -48 -7 -139 -37 -70 25 -25 -27 -71
5637 -71 -125 -154 -127 78 191 -167 14 -179 80 218 -53 -9 -48 -106 93 385 -37 -218 12 162 70 111 79
5660 79 17 -33 -9 -111 -27 -55 90 343 234 173 -126 151 -273 -5 177 8 77 62 158 169 159 90 -195 -28
5684 -28 7 -324 -186 14 107 11 -64 78 125 -33 5 -76 12 -116 131 -109 -362 -25 69 -74 42 -100 24
5707B4k3jl68L56K58l36J03Q5q0J66R3j30j87L8n4j55L80j66P8JL5l21M15k28
5731a7N8k65K13o3J86K5P9n43J64K44j42R2m2J83m1l58L2L55k03O7O6j23R5rM
5756E7m1j49R6p1J56k8r4O3j57R3K20k85L9l2K09%o5O2k52l7K74O9j19p3M1k12
5782b36J43kj85K0J63R7K67m43K55P6P3l4k11q5N78n09l7J5p3J12J04j51L89j40
5806A86l9K2R4j22j64N9O2j21K40j73K19n75J31L96l34J96p3j04R6O1k39P4J25
5829A7M4l41K35J65p5l68K10R8p6J13r1P4p7L9j89K05Rm2p9J53k40J37J77J04
5853B02j30j75K29k96J6K98l19L67k06K9r3J1J57j53J82j46o3J35k05L84m45M19
5875A98l77L05j21R9j83r3J14J73p8j9J60N7l19o0K89k42P4j25K73l57M35k58
$$ plain form
5707 24 1 0 -368 -12 246 -90 13 98 18 184 277 147 -40 -2 -56 -211 169 3 81 82 117 -204 211 -17
5731 -17 41 -224 -11 -74 112 137 216 -327 -163 81 -61 31 -11 172 131 -227 -195 160 -43 24 90 -33 62 53 57
5756 57 16 -133 -37 -108 48 20 -74 -11 -168 -75 145 -140 -101 -133 76 76 11 73 -179 -216 58 127 8 -65 -24 -236
5782 -236 -93 -95 -280 -260 -97 0 267 -176 79 155 228 194 -17 -102 476 -33 -70 -55 -128 -16 88 -63 326 186
5806 186 147 169 263 141 -23 36 98 -23 217 44 263 -312 -181 215 -119 77 4 -100 -4 57 -182 -108 17
5829 17 61 -280 -45 120 45 -323 -113 -15 -91 22 -69 5 -72 -33 -222 -17 -8 -50 -129 24 -216 -79 98 202
5853 202 72 -103 126 -170 -154 144 -175 192 -14 15 -78 -67 90 -63 119 -27 -90 45 -160 224 -221 198
5875 198 -179 126 5 104 -79 -172 -58 115 37 18 178 235 -84 -144 145 -97 -23 -148 125 -232 203 -55
5897e5k8J50J33k95J98j17O2j71j35K91O1j19j93J25J30O1J62l82K0K67k05ml30
5920c74M68k56J81j3Q2j85Q3R0N8o18O46m9j83K3p5J42j93L38j52j67Q8RK27l07
5944a37K90l98L04j88J12q3O2K17k43N8N8RJ56j04q6j25M8Q9j1J96j7k44J45m3
5968F5O4q4k61J66m4R8j05j6R0Q5K46j79J86o00K39J72k19K02j42L6k89L09o9
5991e0j75L25m8mJ03k29pj10L09j5k11J4j00J49p6lO3K64j30k02J57J54l57Q4
6015i5M53m97J68j58K20Q8l48L36q4m1J77l35J80P6Qk09J68Q2k95JR2j2J68k75
6039a32K1J73j43J81O7k0j01q2Q3K7q5j61q6M27J8k28j10J1J04J02k25m4J6L16
6063A29j7l75J34l1J54L26k99O7m5n9q6J40j5J06p6m2J36j19j72M3l80O36P1p5
$$ plain form
5897 -55 -83 67 200 -95 103 -14 48 -123 -258 33 94 -25 -218 -93 37 98 260 -122 -102 165 -40 -44 -374
5920 -374 94 -162 19 6 88 -97 -14 76 134 -484 162 113 -70 -47 -122 20 -173 165 13 -154 -66 -57 170 -137
5944 -137 153 -245 59 -129 -17 -100 -38 179 -64 -6 52 61 217 113 27 -98 -50 39 28 224 207 -37 108 65
5968 65 129 45 -216 -50 -94 4 -101 -117 -27 58 304 125 311 -289 -50 122 -97 105 -37 -1 -290 19 -50
5991 -50 -225 100 52 48 151 -78 -85 -195 114 99 -112 -98 -198 -49 -125 -128 -65 199 69 -133 24 178 -179 -95
6015 -95 358 -139 29 -129 91 179 -169 167 83 42 219 -116 64 140 148 -61 107 189 -106 -105 -13 -25 143 -132
6039 -132 -111 62 -81 100 167 147 46 -36 47 74 -11 -172 -258 169 187 -41 -151 -140 -36 66 -159 -203 -187 129
6063 129 112 -263 -129 -160 -6 320 21 88 43 -16 -102 38 23 129 53 11 147 28 -144 -101 -481 155 226 151
6087A51J08k71P9k08K90Q0p5k0N1l07O6K12l94M70j78j14N0l1P0q3n9J95J52p4
6111A60l00J27r4Q3Q9k28M9m9M5N4L57j46k87K0K72j97K24l3r2N2k26J53K9j64
6135a02k4J67k00K09K2l95L71o7r8O0J39%j3k8J40m36L17k2J74k17o5K31J12m22
6159a47J44o3L9PK01k88K20j16J34j55J37q3j41J97k93K26q5J47J27p0M7j9j53
6182A3K17L4j80j53P2L32m85J05K37k55J54q2q3L52j30o9o9J9j83L76l28J80j3
6205F1M2Q8l33J31L8p0k5N2l4j36K72P6k28K16j35n6j02L90j01l05M7j1R4J81
6229A52m46J94P6j35K73j85J57M3l2k78K40L4l2K5j79J15j9J88q6p2J9J00j76
6252b4K12j41K9j53P2J31k26L8J79l7l1N3J33l11M3J81Qk80K02J19j4k7l11L31
$$ plain form
6087 151 259 -12 67 -141 149 229 154 134 185 -122 -56 156 -238 232 54 -60 -10 -41 29 -54 -113 82 234 160
6111 160 -140 -13 -107 -24 65 -163 -114 -163 -118 -64 293 147 -140 -120 152 -45 179 146 54 106 -120 33 62 -102
6135 -102 -126 41 -159 50 72 -323 48 -19 -117 -57 82 82 69 41 181 -255 62 40 214 -3 -68 163 275 -147
6159 -147 -3 -66 -27 -20 181 -107 113 -3 131 -24 113 30 -111 86 -207 19 -66 81 208 138 185 166 13
6182 13 230 264 84 -69 3 335 -150 -45 192 -63 91 9 -74 278 148 79 10 29 -154 222 -106 74 61
6205 61 103 191 -142 -11 27 -43 -68 -16 -50 -186 86 162 -66 150 15 -41 -143 247 146 -159 -112 -123 -29 152
6229 152 -294 -100 -24 -159 114 -71 86 129 97 -181 59 93 61 86 -93 22 3 191 105 33 52 152 -24
6252 -24 188 47 76 -77 -5 126 -100 -62 117 80 49 102 235 -76 -33 148 156 -124 78 197 183 156 -155 176
6276A76j93J32j77k70M57Q7M9m49L41l16Q0j7M36l93K13k11L5q7K06k77N8O8J33
6299H1q7J6Q1q3N4m64M68J1jl2R5j64J65j25j27n4K20j4j5J7r4O6L9O5j33J4R1
6326I0j26p8J80j81J27J51n0n3P5j98j69J71L2p9j5P3L92k59k03o2J78j6M5J28
6350A53j75n1m2J26J74k31p8J40O7K23m50K24k06J03oJ90l34K8K38o8K6j94J55
6373A2K49j65l28L41o8j8J14l73J53j15k6J36J42n4n6K10j74k1j17J58j37J82
6395D5k74Q3J23P7JN7j04j75K47L0j18J5M2Q7K8J1p3J12k65Q8P8r2P4k65K34P1
6421A37j1K27m29Q1M2OJ86k23jq4L32k91J18k84J32o7J81J24o2q2plj62J16j51
6446a75J75j01L8n2J35J11j8j24K33k36P8l6o8q6L10r0k25K7J04N4O1l12rN4M8
$$ plain form
6276 176 -17 115 -62 -332 125 212 261 -188 153 -163 -83 -100 336 -57 156 -55 -20 -107 99 -178 -120 -52 81
6299 81 -6 10 91 8 62 -402 66 77 76 44 139 -25 140 15 -112 -166 54 40 25 42 -52 14 53 118 -15 -1 90
6326 90 -36 -114 66 -115 12 163 113 60 135 -63 -232 -61 -29 -108 -123 -50 342 83 -120 -182 -4 -20 25 153
6350 153 -22 -73 -115 11 185 -46 -124 16 83 306 -144 80 -126 -23 -29 161 -173 -145 93 25 51 -143 12
6373 12 261 96 -232 109 41 23 137 -236 -83 -198 -224 -88 54 0 -56 154 -20 -41 -158 0 -137 45
6395 45 -229 -146 -23 54 55 112 8 -167 80 110 -8 7 49 136 164 175 102 214 -51 37 115 23 97 -168 66 137
6421 137 126 353 -76 5 47 53 239 16 15 -69 263 -28 90 -194 -62 -129 52 176 114 32 25 22 -140 -24 -175
6446 -175 0 -101 -63 -115 20 131 113 -11 222 -14 64 28 -40 -126 184 94 -131 -104 0 54 115 -197 -206 -152 -104
6471a04K17J27J15l72J4R0j05l2RJ43pL25n83J79j84K36J69k68J82k23J57o9j00
6494h4Q0j3L11k61j75L13l26l9O2J18k15J86Q9p6O6r7M3N4K9k01N8M1o2K1o7J38
6520gj91j46K92q7J93j33K66p1k40K60j70m5J17k6J40j66J70k7r5r2K19k03K89
6543B47l98J97j89j12K38j7J05Q9k47l9J45Q3o3j77M68k73j71J8L00k30J02M1
6565A17l79L20j04N3jl7J88k81j73L34j15J00l0J23n0J5Qj21j32l9L32k18j51
6588b41J03J88j96L70j37k52K91l36o8L47J28j59O4k00J11K4j26K1J49n0O9r8
6610BK%j66N1J83l0j02J87k60p6L47N6k81P8n2o7K31j71k4n3K6K12j79J62k70
6635a94L46l1r1K51l7m85K86q4J29j69R7J10j91M8N1Kl20n9J23L49j80m4k61N26
$$ plain form
6471 -104 113 240 355 -17 -3 87 -18 -50 -41 102 95 420 -163 16 -168 68 237 -31 151 -72 85 16 -84
6494 -84 -4 -17 294 33 -142 171 -155 -194 -132 -14 -229 -43 46 -30 36 -61 -18 36 65 -136 -78 -37 -99 -78 -145 -7
6520 -7 -198 -344 -52 -139 54 -79 187 116 -124 136 -34 -79 38 12 152 -14 156 129 34 -58 161 -42 247
6543 247 -151 46 -143 -255 -17 -34 71 160 -87 -126 19 102 39 -138 330 57 -114 -96 204 -26 76 117
6565 117 -262 58 -46 7 6 -31 157 -124 -297 37 -78 22 -8 115 65 80 88 -33 -165 -204 128 -90 -241
6588 -241 -138 50 -146 224 87 -165 126 -210 -278 69 197 38 102 -98 13 37 -89 -68 81 31 100 2
6610 2 4 4 -162 -111 72 42 -60 127 -133 -209 138 194 -87 -9 -61 -128 103 -68 -92 -145 -119 93 -86 76 -194
6635 -194 152 121 30 281 244 -241 45 -39 90 -79 18 128 -63 -15 36 38 -282 -341 -218 131 -49 -93 -354 172
6659A72j92P4j05J18l2k28o8J23M16n5k08j32O5J47j43R7l9Q7j62M0q3K42J40
6682B74j47k28K38O0k59J03j45J39k7O4j02J03J90j79K2k18o2J99K01k73k04L94
6704A43Po7l4MJ31j52q4J71j53o9K69j10P4j66J34J21j11k96J57k71L13L2k13
6727a70J59J14K8k66J25j15L36l13l8l0P6J57j1j19L44k0k70n4j23L62n3j14K47
6750B52l72Q8j06J17K2k0j0K95m76J64Q4k6q3PJ97L4j48q8K47j89k8L38j33j15
6774E1n5j62J75J62k61j11J89Q4q8L53k77J6n1OK1j15Q0r2p8O2j1J54L1k03j15
6799b35K29k53L00j09K66k3j38q9l10N08l80M33l58NK64l58J70J03J38j35j76
6820a48J32PN2p5j24K52j45l0l8K33p9j57J31K4Q6K7p5n6J7m6p0R1J15L1k60L12
$$ plain form
6659 172 -20 54 -51 67 35 -193 -261 -138 278 223 15 -117 -52 95 -48 49 10 97 -65 -25 -108 134 274
6682 274 127 -101 137 197 -62 41 -104 35 8 72 -30 73 263 84 106 -112 -174 25 226 -47 -251 143
6704 143 150 83 49 53 184 32 -52 119 -34 -103 166 56 130 -36 98 219 108 -188 -31 -302 11 43 -170
6727 -170 -11 103 131 -135 -10 -125 211 -102 -140 -170 -94 63 52 -67 277 257 -13 -67 -190 172 119 5 252
6750 252 -120 -32 -138 -21 1 -19 -29 266 -210 -46 38 12 -71 -64 133 167 19 -69 178 -11 -39 299 166 51
6774 51 -4 -166 9 171 -90 -201 -12 72 -16 337 60 76 25 31 52 -63 17 -75 -153 -91 -102 52 83 -120 -235
6799 -235 -6 -259 41 -68 198 175 37 -52 -362 146 -234 199 -159 -154 110 -248 -78 25 163 28 -148
6820 -148 -16 -9 43 -32 -156 96 -49 -79 -117 116 37 -120 11 35 121 148 73 17 34 -12 -82 9 124 155 -105 207
6846B07k33J33M1k81K29j09j46J65J43j45K4k1l6k33L04k01L60j1l51Q2J48j21
6868e2Q8q9M51k90j35k8L0L8p3J92j49j97K44N2k2lK6k46J18N9k93K70L6k0j6
6893iR3k64L69j14J2j13J4N2k39P4Q1L6o1J65r9r0J53m8J1J86m67K68kR4k05J15
6919A2j22J20N7m5K42l05J86j27K14j68N4N7k08p8J19L4l3l7K57l39J34j70J6
6942a30M5J08j93J51Q6j34j72N25l49J00k3r1L3%K11k31nJ60n4J25J14k44m7j94
6966b09K06P3j02L4NRP3j46j34L03k09K63K7n61M83k13l2J14J29L3j41J51j05
6989E1k16O4R8O0K4p3m2P4j13k2rN6j1o6O5K4M5K2K5r1m6L6K1M7J20k9k45K03
7017G2q8j03L22j43r2m8jj00L8K46p8k49Q4N4J18r8M17j20j95K7k11L71q0o6q6
$$ plain form
6846 207 -26 107 148 -133 96 -13 -159 6 149 4 28 7 -29 -262 42 -159 201 190 -161 -79 69 -52
6868 -52 36 -53 398 108 -27 -55 -25 13 -60 132 -17 -214 30 82 60 57 83 -163 -45 14 -279 -9 27 7 -9
6893 -9 84 -180 189 75 87 -26 -12 40 -199 -125 -44 -8 -69 96 -3 -93 60 12 23 209 -258 10 8 102 -103 12
6919 12 -110 10 67 22 264 -41 145 18 232 64 118 175 -33 -111 8 42 9 -28 229 -110 24 -146 -130
6942 -130 -85 23 -170 -19 67 -67 -239 286 -63 37 14 -77 -44 -44 167 -64 -69 91 37 162 276 32 -15 -209
6966 -209 -3 70 -32 2 7 16 89 -57 -191 112 -97 166 193 -368 115 -98 -130 -16 113 146 5 156 51
6989 51 -165 -101 -3 57 81 8 -34 40 -73 -95 -104 -48 -59 -125 -60 -36 9 31 56 -35 -81 -45 -24 23 143 114 -131 72
7017 72 -16 -119 203 60 -32 -80 -81 -181 -143 103 25 -224 -140 -86 32 -66 351 231 36 63 -148 223 143 77 -9
7042ij16L27j41k00L84k23k2n9L2M9J6O1O3j94n3J03R8j7k25L08j73n4J63j95
7066g7n0P5K1J36m7M7P6k14L14m55L17j53K87l47J44K8L51m14Q2k14J61n1j1J26
7090A32m2N2k53J13k6q5j4R3K88n81K26Q5N7m6n3K30j41j2j61K59M3O1l07l1K92
7115A79q6o8L6K7J24l17M1j02m7J06J74j11K96j93k79J21N4K07k59J00P9M5j93
7138f6q4K36j74J26j09L36m2q3n4k46K54j10j30J62J36k78J61J35j60m5K28k20
7160b7N1o0Q1m9J06l1j39J7l3N5J40q0O9J22o2k57L7J04m5j12K44j37jQ3P8n5
7186I9k17K07O7k00j6K34j31j01K37m12J39M5p3L07j73Pn9KN5j72K10LM5q3j79
7211a59J69J45j20K94n17J26M7j75K62J6j33J4l9N4J72j96k1j2OJ13J45j47j10
$$ plain form
7042 -9 -125 202 61 -139 245 22 0 -59 -27 22 38 99 162 -32 -85 18 116 99 -126 182 9 -45 118 -77
7066 -77 -127 -52 -31 105 58 105 181 -33 281 -174 143 -10 277 -70 74 102 453 39 121 -93 68 17 6 132
7090 132 90 142 -111 2 -24 -109 -123 -30 258 -323 -97 -12 45 -1 -54 176 35 23 -138 121 164 225 -82 -113 179
7115 179 93 25 61 88 212 -105 -64 -166 -213 -107 67 -44 252 59 -220 -99 -45 162 -97 3 82 127 -66
7138 -66 -150 86 -88 38 -71 265 223 140 86 -160 94 -16 -146 16 152 -126 35 170 10 -35 193 -27
7160 -27 24 -36 45 -4 102 71 -68 -51 -84 -29 111 31 100 222 160 -97 -60 44 -1 -113 131 -6 -7 76 154 99
7186 99 -118 89 156 -44 -60 174 43 -58 179 -233 -94 -49 -122 185 12 19 -40 -38 17 -155 55 58 103 20 -159
7211 -159 10 155 35 329 -188 -62 -15 -190 72 88 -45 -31 -70 -16 156 -40 -61 -73 -67 46 191 44 -66
7234f6n3J01j1R2Q3k26oJ55j98j06L03M4l8j03M0L8p2r0J09l7n7L4J43j9k40J88
7260Hj92L91l66m0K27O7r4j58J71J8l8n9J0J87q7N6R6j66Q7M9j54QJ49L0j88Q7
7286I9n1l4P6j75K81L7n0l5j90L8J4j18PO1O2m8J65n7J5j64O0J53k54J82k49K71
7312I6j36nJ06j40N8P8J12k69J48K0q4k78N48j57Q7l12j39L11k8J92k93j5m5P1
7336g4R9J04j38l18J65J02K30k61K73l04J76q8J33L3k72J49J36j61Q4p3J85L9
7358B19k12M8O4j47J19j66K57j59j18K02M8N0j65J4K09j52m4q0KP0j24K28j56
7381Gn8L2p0J52j68k2K06m6k40L12k12J24J02j35R8K2k10j01K12%j29N7N3r9L78
7406B65l21LN2KqK8r1J19l6K4j58N8l9J12j90K48R8Q1l92L15j58K3j59K28J13
$$ plain form
7234 -66 -119 -18 -29 63 146 -80 -86 69 -129 -235 68 112 74 -29 11 49 -23 -113 -4 -41 -98 -64 79 60 -180 8
7260 8 -184 207 -159 -199 28 95 1 -157 14 32 -6 -65 -55 132 45 101 197 31 118 167 13 21 170 200 12 99
7286 99 48 14 90 -85 196 233 183 148 -42 -4 10 -108 -101 -40 22 -26 139 82 97 -67 -7 146 -108 74 -175 96
7312 96 -40 -45 61 -79 -21 57 169 -100 48 68 -16 -294 254 97 184 -128 -267 44 16 208 -85 -100 -145 -74
7336 -74 25 129 -9 -327 -162 -60 170 -91 182 -122 54 -34 99 132 -140 9 145 -16 68 -5 180 219
7358 219 7 55 119 -28 91 -75 182 23 -95 107 155 205 40 54 263 111 67 -13 -11 59 -65 163 7
7381 7 -51 -19 -89 63 -105 -127 79 33 -207 105 -107 17 119 -16 82 104 -106 -207 5 5 -124 -67 -14 -113 265
7406 265 -56 -53 -1 1 -7 21 -70 49 13 37 -121 -63 -102 10 -180 68 166 247 -145 170 12 35 -124 104 217
7431B17k77q3K25J53j73O4k54J07K41j43j51L95j58k51L0O2m5J59k04q7L82k19
7453a0k6k01J15Q8J47j9j17Q5m6J94o7m0j46qO6J31l43J26j13J64q6L3M4J71r0
7478E2p3L76l88J67m72M81l32J92L5L6K39k87k63K63r6p0K7J69j6n3j04k0p9R5
7502a21K21l6j26r1K07j71O2J45o6j61J83Q1j97J70J79k31r1P5l6Q3O5l01J19
7525c8R5n2P9j96M7J70j12P4N0j21j01J97N5l16K37O2l76L98j94k3J26o5K9J98
7549B23j74k14K33l4j21L1M2mJ42k40K03n2k03K51o4o3M7J79j33k50Q4l4J56K21
7573B26r9J6m73K16J82J16j30n7K40j05j62l8L9J11k95J13N5o7J48j27J32Kj0
7596C3K35k00Lj29K7n9k1J6Q6j2K1o8J45n1k5j1K98k60R0k38k4L38j96M9j71K66
$$ plain form
7431 217 -60 -143 82 235 62 126 -128 -21 220 77 -74 321 163 -88 -58 4 -41 118 -86 -173 209 -10
7453 -10 -36 -237 -122 -34 113 94 -23 62 16 210 143 103 -43 -51 15 146 -197 -71 -184 -20 -106 -73 -29 142 52
7478 52 -21 355 -33 134 -338 143 -189 3 38 74 313 26 -237 26 -70 -140 -113 56 40 -13 -117 -137 -216 -121
7502 -121 100 64 -62 -153 54 -117 -55 90 24 -137 46 127 -70 100 279 48 -43 32 -4 79 144 -157 -38
7525 -38 57 5 84 -112 -65 105 -7 67 117 -4 -105 92 147 -169 68 130 -246 152 -42 -65 61 -4 25 223
7549 223 49 -165 68 34 -87 -56 -14 -18 124 -116 87 35 -168 83 19 -44 3 182 49 -201 -117 -151 5 226
7573 226 127 143 -330 -114 68 184 54 -3 237 132 -30 -68 -29 82 -213 -100 -45 -112 36 -91 41 43 33
7596 33 268 68 71 -58 -31 -90 -111 -95 -9 -21 0 -68 77 26 1 -10 288 28 118 -120 -144 194 -2 47 -124 142
7622A42Pk4j4M6k28rJ89j66k69L92j76K68l15J75J2j02lO4Qj77K77j32kL7J34
7647A34j85j8J3q4L66j89m3L6lO3J72j77j43K24k10qK23k04J09J8j49n4K16k50
7671a43M0P6K64l05q5L69j52M2Rj86Q3r3R5q9O8O1k1L50k60j55j8j17J60M6J17
7696A56l67K9L25j23j3Q5k4j63J0R2k70L51j0K2p6J23j74j93K81M8j19o7K09k74
7720a42L44j22l47N9N9M79k76k5K7J65m9k05L68j91j44J56k6j00J31j7j6J27j39
7743A16R8m1Ql50J45J10jk53K28J6J46j32q0q5K16k8N2j00j63J36p3j16M62l53
7767d2Q6j18R5L7K5P8j58J76k90J03k0j17K70j67P5P5p3j00oj07O2L67j76n9k76
7792b60L57J22q9l03O2J37q8J2R0R7L2l80L8L95l05K53j87j5J77n6k01k3L07j50
$$ plain form
7622 142 149 125 111 157 -71 -80 109 -57 -326 66 -110 158 -157 18 30 -72 -75 -11 -3 -180 97 -35 -37 0 134
7647 134 -51 -69 -56 -140 226 37 -6 30 27 90 262 85 -58 166 -44 -52 171 -33 76 94 -55 -109 107 -143
7671 -143 -103 -27 237 -68 -153 216 64 106 115 -71 12 -81 14 -75 -7 54 33 383 123 -32 -50 -167 -7 39 156
7696 156 -211 -182 143 20 7 92 68 -95 -85 7 -263 88 78 100 24 147 -27 -220 61 109 -10 -77 132 -142
7720 -142 202 80 -267 -208 -149 330 54 29 56 221 172 -33 335 144 0 156 130 30 161 144 128 255 116
7743 116 214 173 181 -169 -24 86 85 -168 60 76 222 90 10 -75 141 113 165 65 -98 38 -35 -151 311 -42
7767 -42 44 -74 21 58 83 161 3 179 -111 -8 -28 -145 125 -42 33 108 35 -65 -71 -178 -116 251 75 16 -260
7792 -260 97 219 130 -173 -111 26 -62 -50 40 137 169 -211 -173 222 -83 170 -17 -32 145 89 -112 -135 172 22
7816B2J30J44r4j02J21j75n0M67l45j22J04j97J17k3J89j69J41j74q1J23k58K04
7838b8P3p4Q8K19n09M9K34j38m8K81o7O3j63K0k23J40J81j05n0kL49k34j15L6
7862b3l0J19L6k67K42k65K39N6r8m2Q5jj11J6L99j34k34j7n2K18k57M5P0o9K65
7887A90k05j4j18R9O7p4j15J2K39j55P9nK58k16r9L13j50j50K07k96N3L01k15
7910FJJ42j31N4M4j68q3K60j70n6K40l53K42k51K74M3%j73N1q5J20n5l1Po1J01
7936c2j28K33j01j18K26K3l50K33j0k47M62j76M6N6M8k03K65l47J83k0o7j28J19
7959c3o9r0K52j69Q4J68j47K62l44O0J15K2k82K40J89k09J69j0n0m6j27J59k53
7982a09M2N9R0l2j75J42k40L48j16j94j4J03J7n0J75r9J8J28j45J75j01J2J05
$$ plain form
7816 22 152 296 202 100 221 46 -4 463 118 -4 100 -97 20 -3 186 17 158 -16 -97 26 -232 -28
7838 -28 45 -29 59 278 -231 -182 52 -86 -134 147 80 143 -20 0 -223 -83 98 -7 -57 -59 290 56 -59 -23
7862 -23 -53 66 102 -165 77 -188 51 107 9 -33 52 51 -60 -44 355 221 -13 -30 -82 136 -121 -76 -6 -75 190
7887 190 -15 -29 -147 -48 19 -55 -170 -158 81 -74 5 0 258 42 -57 256 106 -44 163 -133 -80 221 6
7910 6 7 149 18 72 116 -52 -135 125 -45 -101 139 -214 28 -223 51 94 94 -79 -28 -113 7 -48 -79 -72 -133 -32
7936 -32 -160 73 -28 -146 80 103 -247 -14 -24 -271 191 15 61 117 165 -38 227 -120 63 43 -24 -152 -33
7959 -33 -102 -192 60 -109 -25 143 -4 258 -86 -26 89 111 -171 69 258 49 218 208 158 112 -15 144 -109
7982 -109 -67 -8 82 50 -125 17 -223 125 9 -185 -199 -96 -79 -129 46 -53 -35 93 -52 123 22 34 139
8005A39k31J14k36R1N3J0J09l42J78J99j73J97j45Q2q6j0q4K22o3n8k7J31j8K2
8029G4r9k3K41l30R7J71j36J52r6J04k85J81R0L0j33k3O9j42K2N7r9P0qJ1J31
8054A26J7j76K9N0j45O0J5k9K88l80J36k%J2l0n8o8K37l79M17k03l9J49p4j66
8079b13P4K13j76n4K92q5RpQ3j25OJ14k87J71P9k29J45j97K35j62J93R4j34r9
8103f0J6K41j21M1O5k66O2J29l87K09Q9K34l05J43j99K00QL0j30j03L24l28k70
8126c78L43M4lq9L10l5j35J2k66K60J60j57j62J35l6o7J46r0P4Oj21m0K03j15
8150aJ18K9k21J73j43L7O5J55k61J63k26K14j50N7j07L7K33j86Q7n0N4q0j25L18
8174A90l00K09j78JJ21j82P7Q7K6j9j57K91j41J06q9N2m0
$$ plain form
8005 139 -92 22 -214 -123 -70 -60 49 -293 -115 84 -89 108 -37 45 -41 -51 -135 87 24 -34 -61 70 52 74
8029 74 -25 -48 193 -137 -40 131 -5 147 51 155 -130 51 141 171 38 15 84 -58 -36 21 -78 -8 -16 -5 126
8054 126 143 -33 -4 46 -99 -39 -24 -53 235 -145 -9 -11 -11 1 -29 -87 -155 82 -297 120 -83 -122 27 -47 -213
8079 -213 -139 74 -102 -156 136 51 60 53 136 11 17 131 -156 15 94 -135 10 -187 48 -114 79 173 39 -60
8103 -60 -44 197 76 117 182 -84 -22 107 -280 -71 18 252 -53 90 -109 91 99 129 -1 -104 220 -108 -378
8126 -378 -35 9 6 -83 227 192 57 69 -197 63 223 66 -96 39 3 -64 82 -8 66 72 -49 -89 114 -1
8150 -1 117 146 -75 98 -45 -8 57 212 -49 114 -112 102 -48 9 -98 -61 172 -14 73 23 77 -3 -128 190
8174 190 -110 99 -79 -78 43 -139 -62 25 51 32 -125 166 25 131 42 94 54
8191E4
$$ Imaginary data points
##PAGE= N=2
##DATA TABLE= (X++(I..I)), XYDATA
0@%%%%%%%%%%%%%Qj6J6j6K1k9L2m0M8n6P0p9Q9j05J24j46J68j92K21k52K86l24
35a72L66m12M65n21N80o48P21q00Q88r84J089j203J327j464J612j775J957k156
53a130K375k619K894l204L556l958M424m975N633o438P451q766J0560j3174J7408
68A0037k5907P7114j01562O5819M5872j15792J38287p9176p603L1076n4279O2246
80D6132o0030k5050J01384o6575K8299j6733o9558O8952j5117k952L6726o1588
92c6110R650K5790j5378k1269J1394L0749l4664R197R542n6398L5417K5160q988
105a5908l839k7634K6972j6660n703M9190n3397J6782L2291n7090L1348j0387
117c4035j2224O0895l6588l377J4881m0583L3871R479j0990J6086k1332J3742
$$ plain form
0 0 0 0 0 0 0 0 0 0 0 0 0 0 0 8 -8 8 -8 13 -16 16 -24 24 -32 38 -41 48 -57 67 -79 89 -103 118 -134 152 -172
35 -172 194 -218 247 -274 306 -342 379 -421 467 -517 572 -631 696 -768 844 -931 1026 -1130
53 -1130 1245 -1374 1520 -1684 1872 -2086 2338 -2637 2996 -3442 4009 -4757 5803 -7371 10037
68 10037 -15870 61244 -40318 25501 71373 -44419 93868 14692 7089 38165 -16114 46132
80 46132 -13898 -38948 62436 -4139 24160 7427 -62131 6821 -8296 -11248 25478 -36110
92 -36110 -26460 -670 -16048 -37317 -25923 4826 -29838 -20641 -11099 -67497 -32080 -6920 -15908
105 -15908 -19747 -47381 -20409 -37069 -42772 6418 -46979 -30197 2094 -54996 -23648 -34035
117 -34035 -46259 14636 -21952 -25329 -10448 -51031 -17160 -7681 -18671 -2585 -23917 -10175
129a0175o28k3473L2750k924o338K6271k2344j4834J4172K58J1577N678r305N58
143A243n823K91J2046m871L905J0994j1272k482j856o430J7510L467l888K681
157A5515j4772J838J0043k774O566r85k425j412q376M436J323L430R815q509n170
172H543k248j881Q628J122K839k336p877K176m792L344P111l316N476o156p486
187C147M149m421Q501M415o441J811r027p97O001l045Q011k005n658K383r151
202b127K833M438j706O810o706m901O14n892Q540J340k131K902r544K40K58l487
218h519R385k921j577J367j0796L130K138j454Q177o011k699j64o628O381J047
233i144n68M749o561k058K98l392O837J629j019J133n831j017K449R60M686K54
$$ plain form
129 -10175 -10803 -34276 -1526 -4450 -10788 15483 -6861 -21695 -7523 -7265 4312 9990 685 1243
143 1243 -4580 -4289 7757 2886 6791 17785 6513 4031 2175 -4255 13255 16722 12834 15515
157 15515 743 2581 12624 9850 16416 15431 13006 11594 3218 7654 8977 12407 22222 13713 8543
172 8543 6295 4414 13042 14164 17003 14667 6790 8966 4174 7518 14629 11313 16789 10633 3147
187 3147 7296 2875 11376 15791 9350 11161 2134 1337 7338 4293 12304 10299 4641 7024 -2127
202 -2127 706 5144 3438 10248 3542 -1359 -745 -6637 1903 3243 1112 4014 -5530 -5290 -5032 -8519
218 -8519 866 -2055 -3632 -2265 -13061 -9931 -7793 -9247 -1070 -7081 -9780 -9944 -16572 -10191 -9144
233 -9144 -9712 -4963 -11524 -13582 -13284 -16676 -9839 -8210 -9229 -8096 -13927 -14944 -12495 -11535 -6849 -6595
249f595j617j139k883J036L124K296K958j009k343j270j74K795L076K905m11k038
265a289j363j83K500L244J891J280k112j840N16L19L145K998m04m69k114j358
281D761J640K035K394J405k368j691j064k5K162J552Q37m49k896j496l58N79L298
298A0316N21j803j808k656m64J128J123O29n66j891j319k182M14J690R46j62k412
315A504k836p28O93J078J063r73p41j461j677k70J398P49R09j449k093r92k50
332f076J775J454j59oj422j273L32K63J472J503o60r00j600l64J846Q15J371K73
350a356j671k03o60L18J484R43O01n68j448n40N02J303J439L15p38j094l93L02
368a464N61R22K60m95m52p97L5J57J801O95j739K65r24q88K130k22L3O61j113
$$ plain form
249 -6595 -8212 -9351 -12234 -11198 -8074 -5778 -2820 -3829 -6172 -7442 -7616 -4821 -1745 1160 749 -1289
265 -1289 -2652 -2835 -335 2909 4800 6080 3968 2128 2644 2963 6108 9106 8702 8233 6119 4761
281 4761 6401 8436 10830 12235 9867 8176 7112 7087 9249 10801 11638 11189 8293 6797 6439 7018 10316
298 10316 10837 9034 7226 4570 4106 5234 6357 6986 6420 4529 3210 1028 1442 3132 4078 3916 1504
315 1504 -1332 -2060 -1367 -289 774 -199 -940 -2401 -4078 -4348 -2950 -2201 -1292 -2741 -4834 -5826 -6076
332 -6076 -4301 -2847 -3006 -3012 -4434 -5707 -5375 -5112 -3640 -2137 -2797 -3697 -5297 -5661 -3815 -3000 -1629 -1356
350 -1356 -3027 -3230 -3890 -3572 -2088 -1145 -544 -1112 -2560 -3100 -2598 -1295 144 459 -279 -1373 -1766 -1464
368 -1464 -903 19 279 -216 -668 -1465 -1430 -1273 528 1223 -516 -251 -1175 -2063 67 -155 -122 539 -574
387e74k04m94JJ495j12K37Q2j953M94J094m92J440m42o93J129j424K09J415m05
406H03Q73M96j621j73K37J063J084n24K74k50q44J727q54l87K092l86n54m47n97
425B012R07P28M88m21j248O65k82N2N97j360J108j30j022M03j585P84J031q97
443A830L55j988NJ438k085J300k21k339K451j793o48J013k112K253l92j935R18
460a950k302J737R57k078J006j455J57J610j891M63k8j1J186j446Pm03O12K150
478a679j684K30O1r89L067k032K03J390j575L260j523j639K986k159K680J036
494A633l605L460j647k2L625l725J673J171k056L486k726j33K607j935J851n09
510C148k410K343oJ99o0j260P49J59j11k97m14K33K67O44j836l42J087j537J770
$$ plain form
387 -574 -778 -1272 -1271 224 112 349 431 -1522 -1028 66 -426 1014 572 -121 1008 -416 -207 1208 803
406 803 1676 2172 551 378 615 1678 2762 2238 2512 2262 1418 3145 2291 1904 3996 3610 3056 2609 2012
425 2012 2919 3647 4135 3714 2466 3131 2849 2901 3498 2138 3246 3116 2094 2497 912 1696 2727 1830
443 1830 2185 197 202 1640 -445 855 634 -1705 746 -1047 -1695 -682 -2794 -541 -933 -2868 -1950
460 -1950 -4252 -2515 -1558 -3636 -2630 -4085 -3928 -2318 -4209 -3746 -3774 -3785 -2599 -4045 -4038 -4441 -3829 -1679
478 -1679 -3363 -3133 -3072 -4061 -994 -3026 -2823 -1433 -3008 252 -1271 -2910 76 -2083 597 1633
494 1633 -1972 1488 -159 -181 3444 -281 1392 2563 507 3993 1267 1134 3741 1806 3657 3148
510 3148 738 3081 3075 3274 3214 1954 2703 2862 2751 2454 2040 2273 2540 3184 1348 1006 2093 556 2326
529B326q05k160K295k116N44J627l762K676k04k521K765l254N19K342k558K012
545b74j270j953L392k090J12J456k911J925R31j953N65K49r5J502p14j290J104
562a314j0J24J516j926L08J809k051K230o31j667L769k494L45J927l680L139N79
579A973k258L050k770J79K697k906J868J61j880K931k064k65J138j509J867q6
595B126j478N57p88L68J40j63k62P1J86j087J09M80j209J995j207q82J029j877
613a892J428N59j940K070j719l51J761k413K058k46j625K438j994k06J747k123
629b448J947K04j412J296j103L59J098q75J078j28n04K87k31L79N84R3k26J22
647E20o7l28Q08J10n33R09o01l8O26n45O11K86r16R28j116kP73n45J032m87j206
$$ plain form
529 2326 1521 -639 1656 -460 84 1711 -2051 625 421 -2100 665 -2589 -2070 272 -2286 -274
545 -274 -1544 -3497 -105 -2195 -2083 -627 -3538 -1613 -682 -2635 -2070 -1821 -1916 -414 -1128 -2418 -1314
562 -1314 -1324 -1200 316 -1610 -1302 507 -1544 686 55 -1612 2157 -337 8 1935 -1745 1394 1973
579 1973 -285 2765 -5 174 2871 -35 1833 1994 114 3045 981 716 1854 345 2212 2126
595 2126 648 1205 417 785 925 762 500 571 757 -330 -221 259 -950 1045 -162 -1044 -15 -1892
613 -1892 -464 95 -1845 225 -1494 -1845 -84 -2497 -439 -685 -2310 128 -1866 -2072 -325 -2448
629 -2448 -501 -297 -1709 -413 -1516 -1157 -59 -934 144 16 -488 -201 -432 -53 531 624 398 520
647 520 453 125 933 1043 510 1419 818 780 1406 861 1472 1758 842 1770 654 652 1425 880 1912 1425 219
668B19R47o56rR12j231N79l8j148N54m12M5N47m89p6m45m26L15J8j16M4k00l94
690a460k89J14Q7M88kj76l53l74j5P82j2L83o4m54o2j20l0Q14j5M86j96p60P52
713d76O2N90M05j66J40k5l59K98N98N1M80m52j08j83J69O30O3J51o3j26o3n1l5
736A530L22N15m08k39n81L8K70K59l6j20k62m83j07j54K66K11l27n29m18p7j33
757d63K43j47K3m12n37N5N2J63L12p5j76p25k96K24K37P5N44l95l56n07J98M65
779a498J24J90l03j65l2J09M29K83M28k06k7l59J87M08K89J88L13l43m08M29m7
800a1L35M80J89o35l9l5M26L83J12L14n18j88m8Q1L94L77kk65l65l10J96j69O37
823A339M7n40k63l54l07M17K63J75l30m85jl46j35L85J55j7n05l86k42M32M84
$$ plain form
668 219 1166 510 501 1413 182 761 723 -425 129 -283 -238 309 -180 -256 -701 -1127 -812 -794 -910 -866 -1066 -1460
690 -1460 -1749 -1635 -1548 -1060 -1062 -1238 -1591 -1965 -1980 -1198 -1210 -827 -891 -1345 -1407 -1527 -1557 -743 -758 -272 -468 -1228 -476
713 -476 -414 176 581 415 555 530 171 469 1067 1118 1598 1146 1038 855 1024 1654 1717 1868 1805 1679 1616 1565 1530
736 1530 1852 2367 1959 1720 1139 1177 1447 1706 1670 1550 1288 805 698 544 810 1021 694 165 -253 -330 -463
757 -463 -220 -367 -344 -756 -1293 -1238 -1186 -1023 -711 -786 -962 -1687 -1983 -1759 -1522 -1447 -903 -1298 -1654 -2161 -1963 -1498
779 -1498 -1374 -1184 -1487 -1652 -1684 -1575 -1146 -863 -435 -641 -668 -1027 -840 -432 -143 45 358 15 -393 36 -11
800 -11 324 804 993 358 319 284 710 1093 1205 1519 1001 813 765 846 1240 1617 1615 1350 985 675 871 702 1339
823 1339 1386 846 583 229 -78 339 602 777 447 -38 -39 -385 -520 -135 20 3 -502 -888 -1130 -698 -214
844b14k57l4l69k19j00J53O76L6j60k70j46%J45M21K15j04j84l29m4M60L82R6
866A54L43j74l80m7J09M40N46N2l02j64l50NN33N18q5Q7j94p02o3K64O41p6k82
889H73j91n30K51qK91K59m88j50l86j48J75jK39J95n90n85J55n04Q00J91l81j18
911f51m66m07M91l1L53M26p07j97j37l03M59L53R0o3o26j16O19l21P85j76m8K47
933d26j73n14O22O1N89L22j012L86j08Q5R86k11j16L73o13k3O01j93Q87o1n20
954I42O0l25l52J259l67M81j15j012N51j39l22P17j34R2j8j152O27j20J55N79
974A407p35m61K11q83N74J96k84K77m78m10L39k17J68M57n34j86l26m72P61j21
994g17j57M93n82l85L28n08P69K32o24O13k41n29N09j99N66O91r77L83p09K21
$$ plain form
844 -214 -471 -505 -874 -1093 -1193 -1040 -364 -328 -488 -758 -904 -904 -759 -338 -123 -227 -411 -740 -784 -324 58 154
866 154 497 323 -57 -104 5 445 991 1043 741 577 227 232 765 1283 1198 1285 1091 389 326 590 1231 1155 873
889 873 682 152 403 395 686 945 457 307 -79 -227 -52 -53 186 381 -209 -794 -639 -1143 -343 -152 -533 -651
911 -651 -1117 -1524 -1033 -1064 -711 -285 -992 -1189 -1326 -1629 -1170 -817 -727 -790 -1416 -1532 -913 -1234 -449 -625 -673 -426
933 -426 -599 -1113 -491 -430 159 481 -531 -145 -253 -168 818 607 491 864 251 228 829 636 1523 1462 942
954 942 1002 677 325 1584 1217 1698 1583 571 1122 983 661 1378 1244 1336 1318 166 793 673 828 1407
974 1407 672 211 422 -461 113 309 25 302 -176 -586 -247 -464 -296 161 -373 -559 -885 -1357 -596 -717
994 -717 -874 -381 -963 -1348 -1020 -1528 -759 -527 -1151 -538 -779 -1308 -799 -998 -432 259 -718 -335 -1044 -823
1014h23P30J2K47K14o32K10J4l70N87K53K87Q8n23m97O26K66N53m8o46qN4n9M39
1037I74L8k92L84p69nJ92R4J66j86j99n8m64J47M74m90L61j21o06M32p70P7L14
1059c07j77M35o57j11J69k63M06J42m75J01l95o3K65l49Q21J4m07o1j08J43M63
1080d14J94o5l27K2j51N48N7J74K19k75K72j78j69N40j98M46J79o00J84K3J45
1101F26N23k18n6Km00N97l41j88P27m51J62j21n34Q01j73l83Q26r54j36K89m20
1122A78O13j46k83L99q40k02N13n65P17l66l70k02j16K57pj13J51l10l30K76j58
1143i04j07J99J38k3q4j30j33J12J96l7J55k55M8mo4M79j56J86K3j80K56k54J10
1166d29P37m55j60N40l27M14P5k58M61l19m4L54j75J00K90j32K86l96j39K38n7
$$ plain form
1014 -823 -93 -81 166 380 -252 -42 -28 -398 189 442 729 817 294 -203 423 689 1242 1194 548 540 594 535 974
1037 974 1012 720 1104 335 330 522 616 782 596 397 339 -125 22 496 6 367 246 -360 72 -698 -621 -307
1059 -307 -484 -49 -706 -817 -648 -911 -505 -363 -838 -737 -1132 -1195 -930 -1279 -458 -444 -851 -912 -1020 -877 -414
1080 -414 -220 -285 -612 -590 -741 -193 -136 38 257 -18 254 76 -93 447 249 695 874 274 458 481 626
1101 626 1149 931 875 877 477 1074 733 545 1272 821 983 862 328 1129 956 573 1399 445 309 598 178
1122 178 791 645 362 761 -79 -281 232 -333 384 18 -352 -554 -670 -413 -420 -533 -382 -692 -1022 -746 -904
1143 -904 -1011 -812 -674 -697 -781 -911 -1044 -932 -736 -773 -618 -873 -825 -829 -893 -414 -570 -384 -361 -541 -285 -539 -429
1166 -429 308 -147 -307 233 -94 320 395 137 598 279 235 589 414 514 804 672 958 562 423 661 604
1187F04P9j7k02j2j42j02M63l35J4n6k6k47O3m0O4J67k26L2l33P8R2j01j57k95
1211f35K05J4k62J36L7O6N1j58k33J25L21l35K68J56j83l31L34j66q8N36q4J21
1233a05m42K11K27o3L07o2j81J45Q0j16L63L4J1J30k43L16j58p2J51K43Pr4k65
1256D24L11K02j84Q5l75L21l66O7J58p4K7R8m17J50j42J45j89k96L37k12J30k83
1278h3r4j83k1K24Kk73j39J73QL6k39J13l44J35p7R3o8J31l07K79j21M9N6k99
1302i49L01o1K0M27l34J33MK5P6M8L1J23%J35K7J16j78K12J41J02Ml5j61K07J64
1327E78J7j05J85J05j85rk6J15Ql6n8P7l99M0L36k84Q4n6m1K4m59M23k58O0J65
1352C01l72j65L06j01nmk35K6j81R9J85m52O9K45k33J12k65K07J01k65P1N8J03
$$ plain form
1187 604 683 666 464 452 310 208 671 336 350 294 268 21 84 44 108 275 49 81 -252 -174 -82 -183 -340 -635
1211 -635 -430 -416 -678 -542 -505 -439 -388 -546 -779 -654 -333 -668 -400 -244 -427 -758 -424 -590 -678 -142 -226 -105
1233 -105 -547 -336 -109 -172 135 73 -108 37 117 1 364 398 409 539 296 612 454 382 533 776 783 689 424
1256 424 735 937 753 838 463 784 418 485 643 569 596 694 277 427 285 430 241 -55 282 70 200 -83
1278 -83 -177 -360 -381 -157 -155 -428 -567 -394 -386 -350 -589 -476 -820 -685 -762 -669 -737 -606 -913 -634 -755 -706 -650 -949
1302 -949 -648 -709 -689 -262 -596 -463 -459 -434 -358 -310 -279 -156 -156 -21 6 122 -56 156 297 399 403 368 207 414 578
1327 578 595 490 675 780 595 586 560 675 683 647 589 666 267 307 643 359 443 387 346 370 -89 334 76 136 301
1352 301 -71 -236 70 -31 -36 -40 -275 -249 -430 -331 -146 -598 -529 -284 -517 -405 -670 -463 -362 -627 -556 -498 -395
1375c95n5n3O5J35j27K60o9j07K10O5J49k19J26j39K44k27K92J47j59J56L22o6
1397E55j33n8n2J51L3J55j4k34J67J25j35N2l52J42J92j66Q0Om37M06l45J09J81
1420D28q2j82J36l67J99p0j26K81k15l84K16n02L98k28K4J14q2j65K27k71r4K50
1442d95O2j32K13m67J73Q9j27O28m73J2P8m47O16P6n06P42m08NJ93q8J38N24n20
1465a14L13M9k61N67n92J50M77p7j19K42n64L67K66j29R8l98L95k0k26M53l56
1486E21N2j88n4J09J19l13J02K18k87M2k11p4L23k40j11J9m05K76J70l62L98p8
1508B6l77L49o22J52L67n29N20l63k09L29j99K92R2o90L50Q0j13L15k22j41L40
1529b53j11p4J14N5K10j55K12j32j94J70J14l5L6K03q3L7K04k93M44l55J80M00
$$ plain form
1375 -395 -450 -503 -438 -303 -430 -170 -239 -346 -136 -71 78 -141 -15 -154 90 -137 155 302 143 299 621 555
1397 555 422 364 312 463 496 651 637 403 570 695 560 612 260 402 594 428 508 514 77 483 138 247 428
1420 428 346 164 300 -67 132 62 -64 217 2 -382 -166 -668 -270 -498 -474 -360 -442 -607 -380 -651 -745 -495
1442 -495 -433 -565 -352 -819 -646 -557 -684 -56 -529 -517 -439 -886 -270 -194 -700 42 -366 -361 -168 -256 -118 406 -114
1465 -114 199 248 -13 554 -38 112 589 512 393 635 71 438 704 575 673 275 670 650 424 877 521
1486 521 573 385 331 440 559 246 348 566 279 321 110 36 359 119 8 27 -378 -102 68 -294 104 26
1508 26 -351 -2 -624 -472 -105 -634 -114 -477 -686 -357 -556 -264 -172 -862 -512 -432 -545 -230 -452 -593 -253
1529 -253 -364 -438 -324 -269 -59 -214 -2 -134 -328 -158 -44 -79 -43 160 77 114 318 25 469 114 294 694
1551F94m02l3K96j96O5J46k27J54J1k83J55j00J93j27j86P6m5PM82p09P1K32l42
1574f8J17j30m1K04k61RK21n97K27k6j66N86m20m04K01Q1NJ15k13M83n57o3L08
1597c89k40K33RP4k3o0j44L00R6j50K10O7k72J94J26m7K87l22J57m0J81j62j51
1620f6L94R3k48K29j34j5J83j70K50K1r0j76Q9k4J22p4J02k24r3p6N52l42M2j87
1644A58m0m5KL3m4O0J03k83J01k38N2K25l50J17l44M7K6kK33k53Q6k1k92NM26
1669b38LN4m0k14J83K5j05K0R7J13J3q2j76J59J49J4K05J0m35K07m7P9J89J04
1693B87K11k70n3M3N9P4L3J06j95j08l0K10l49N46k41n4j80K84Q6k43n0L04n7
1716D13j19j60o2N5q5n1P0m2k4O9o5J3j95J02m6j94j45J73l7J88k75j40n5K17
$$ plain form
1551 694 292 259 555 359 424 570 343 497 508 225 380 280 473 346 160 236 191 198 680 -29 42 274 -68
1574 -68 49 -81 -122 82 -179 -170 51 -546 -319 -345 -511 75 -345 -749 -548 -467 -462 -347 -560 -77 -634 -697 -389
1597 -389 -629 -396 -387 -313 -336 -396 -540 -240 -144 -294 -84 -17 -289 -95 31 -16 271 -51 106 66 247 85 -66
1620 -66 328 421 173 402 268 253 436 266 516 537 447 271 360 336 458 384 486 262 169 93 645 303 345 158
1644 158 118 73 75 108 64 124 227 -56 45 -193 -141 84 -266 -149 -493 -446 -420 -422 -189 -442 -356 -377 -669 -664 -238
1669 -238 -235 -181 -221 -435 -252 -227 -332 -312 -215 -102 -89 -171 -347 -188 -39 -25 180 190 -245 -38 -85 -6 183 287
1693 287 498 228 175 218 277 351 384 490 295 187 157 367 18 564 323 269 89 373 459 216 166 470 413
1716 413 294 134 72 127 42 -9 61 19 -5 64 -1 12 -183 -81 -127 -321 -466 -293 -330 -142 -417 -557 -612 -395
1740c95J44J2J90j04j36j50j52K35O4K03m43K71k21K45J67p2O9Q2k24J1J57r3
1762a40J70J8J10j39r1K45K80l03J13J07J18r9o8j12K99j22n5K13n6Lr2o6J91
1785E24l95J84Q4l07R9K48k98R8n4j88L33k22j37K45k64K24j48j97N3K1j12L10
1807A01k80j96o6MM67k81L4l2P0l98K30R0r8k8J41j79J49q2N7J36j06n0J34J91
1831Hl21K09q8K19P2N7j68j14j15K37L10K8l52R5o5K86k36L63k21J50Q8j46M5
1854C41P6l1r2k4K0j13J74j04K05O0k33L0k42pJ30n4P6ML0j50j92L8J36k24K67
1879A21k60J4j0j15J47P7k36N2J93l07j72L80j03l7k3J26l24K19N9L7j02O0J37
1902f7j52J32Q1k04J25K01k24K48j52J85L1k56J07OQ6K22l58N5N7J94N0k08O0
$$ plain form
1740 -395 -251 -239 -49 -153 -289 -439 -591 -356 -292 -89 -532 -261 -482 -237 -70 -142 -73 9 -215 -204 -47 -140
1762 -140 30 48 158 19 -72 173 453 150 263 370 488 389 321 209 508 386 331 544 488 491 399 333 524
1785 524 129 313 397 90 189 437 139 237 183 -5 328 106 -31 214 -50 174 26 -171 -118 -97 -209 101
1807 101 -179 -375 -441 -437 30 -251 -217 -249 -179 -577 -347 -257 -355 -383 -242 -421 -272 -354 -297 -161 -267 -317 -183 8
1831 8 -313 -104 -192 27 99 156 -12 -126 -241 -4 306 334 -18 77 12 298 62 425 204 354 442 296 341
1854 341 417 386 294 270 290 177 351 247 452 512 279 309 67 60 190 136 212 216 246 96 -96 -58 78 -146 121
1879 121 -139 -125 -135 -250 -103 -26 -262 -210 -17 -324 -496 -116 -219 -256 -279 -153 -477 -258 -199 -162 -264 -204 -67
1902 -67 -219 -87 -6 -210 -85 116 -108 140 -12 173 204 -52 55 61 147 369 11 66 123 317 367 159 219
1925B19M2Q8L9nj46P0j59j75M15j72J00n8K78o15K32J02J71l71K9N5r9o4J08O1
1949A45k07N9j47j32J97k02j01J82J45k49J18M1n1j56q0K42p7J30m68N51j70j12
1971c42O9k4RQ0l40K15j9L35j79L7m5K50j57K62jq0J68J47m39K78j65K58J12k98
1995A31MJ21J76k31J62j31J78l94L50j26l8K4q1K14r4J61l52K57k04J6qP0k03
2018BK1k5R9o9J64k19O3j22K20k46J57m2j17k13Q7J58k22J3J50Ml41J98L4l2J24
2043a54l82K34K33lj24Q6k9k70R7j38J11lK83r2N4k01K79j24J36lJ10k0K84l70
2067fK03j00K64j37P6j0j10O6j00M24j62N6k01K1O0k10J36j68P7q9Q2kq6N3k5
2092A12j65j8K32o5j21K20n57J64QO8k80K3K64k29n9J86r8L2JJ75k22N3j97J42
$$ plain form
1925 219 261 349 388 383 237 307 148 -27 388 216 316 258 536 -79 153 255 426 55 84 139 40 -24 84 145
1949 145 -62 -3 -150 -282 -85 -287 -388 -206 -61 -310 -192 -151 -202 -358 -438 -196 -273 -143 -611 -60 -230 -342
1971 -342 -273 -297 -288 -208 -548 -333 -352 -17 -196 -159 -204 46 -111 151 150 70 238 385 -54 224 59 317 429 131
1995 131 135 256 432 201 363 232 410 16 366 240 202 226 145 359 265 426 74 331 127 143 135 205 2
2018 2 23 -2 97 28 192 -27 36 -86 134 -112 45 3 -114 -327 -240 -82 -304 -291 -141 -137 -478 -280 -246 -278 -154
2043 -154 -536 -302 -69 -72 -196 -110 -139 -409 -312 -450 -339 -342 -59 -151 -97 -298 -19 -143 -7 -10 100 80 364 -6
2067 -6 197 97 361 224 300 290 180 246 146 570 408 464 263 284 344 134 270 102 179 90 172 170 84 137 112
2092 112 -53 -71 161 96 -25 195 -362 -198 -190 -122 -402 -379 -115 -344 -403 -217 -315 -283 -282 -107 -329 -276 -473 -331
2116c31L4jK96j03k33K23n3OK50j51J16k43M4P7K29j2k63K61m87L20j2K23k92
2139a02P5J52L8l54M23P1m1j83K70NJk61K84j39J04p3n9j1Ol22J85M2r6L26j84
2164A57J28j34o5q7l7K21j77m8j06L57l94K67j86j03K6l6M3p4R7m5m3Jmj27L9
2189c30J65m1p9J26j95K96k25L74k1k20p9M0J23j21O5R3j24J83R2k25J57K0l8
2212C6j76L07J50l80K05n8q1J74k00P3L17k50N1J3N6k25L43o7l06J84k51K66k2
2235A59j69J65j25L47j25M7l19L05m4l26O4j18Q5k73L32k27O3Kj47L02k74J96
2257h0l25J49j75J90K75j18j9l42M67l50K83q8K05q4k35M3K1Q2O7J14k00O9l0
2280h1J96J59l00o5J10r1J68r7L01l22K21j08k2L26j53J23R8j78K4J31l73K26
$$ plain form
2116 -331 -297 -298 -2 -105 -338 -115 -168 -162 88 -63 53 -190 -146 -69 160 148 -115 146 -341 -21 -33 190 -102
2139 -102 -27 125 163 -191 232 303 262 79 349 354 355 94 378 239 343 270 211 200 206 -116 69 111 15 341 157
2164 157 285 151 86 -1 -38 183 6 -42 -148 209 -185 82 -104 -207 -181 -217 -174 -248 -151 -196 -239 -238 -242 -369 -330
2189 -330 -165 -206 -285 -159 -354 -58 -283 91 70 -150 -229 -189 -66 -187 -122 -29 -153 30 122 -103 54 74 36
2212 36 -140 167 317 -63 142 84 3 177 -23 50 367 117 168 181 237 12 355 288 -18 166 -85 181 159
2235 159 -10 155 30 377 252 299 -20 285 241 -85 -21 -139 -54 -327 5 -222 -159 -157 -304 -2 -276 -80
2257 -80 -405 -256 -431 -241 34 -84 -103 -445 22 -328 -45 -133 72 -12 -247 -204 -183 -101 -34 80 -120 -51 -81
2280 -81 115 274 -26 -91 19 -72 96 -1 300 -22 199 91 69 395 242 365 463 285 309 440 67 293
2302B93K64m19J77k13j35J18P2J92k74K39r4O5m65L22j66%N3k27K65j49J93j40
2324b9k9K74n14J5P6k08J01J65J11j52J96j07j67J67j51J55j6M1j5o8Q7nn8K3
2348a08k2m1L3j17K44J38r0j60K95l39L74n1j92J75J0l5K9k16K73j53K44j88M1
2371A44L2j58J59K3m8j29L5K68jj21M7p5m0j92K02k20P7m1J83o1J41j95J7j72
2395a25J55j3R2k16L2j4m0m8j17L69k92J9K0Kq1nJ01j25J31j22K48j37J16J56
2419A06k02pJ65k58K12j5j99J82lr6L79l38K0J3n6k06K64L2m9n3K93L7Lk6p0M0
2445A68J8l1n2Q9N4o1j44P1J96j61K26k64l00K47k0N0K38l30O2rJ1N3k20J27r6
2470g8l6R2m5j97L26j76j57K37k92J37mR6k81L50j43k77J35J91L5o2M6j62K04
$$ plain form
2302 293 557 138 315 102 -33 85 157 349 75 314 220 285 -180 142 -24 -24 29 -198 67 -82 111 -29
2324 -29 -58 216 -298 -283 -207 -415 -314 -149 -38 -190 6 -101 -268 -101 -252 -97 -113 -72 -87 -155 -68 -73 -131 -108
2348 -108 -130 -171 -138 -255 -11 127 37 -123 172 -167 207 156 -36 139 149 114 143 -73 200 47 291 103 144
2371 144 176 18 177 200 152 23 58 326 325 204 251 176 136 -56 146 -74 3 -38 145 84 225 30 47 -125
2395 -125 30 17 109 -107 -75 -89 -129 -177 -294 75 -217 -198 -178 -176 -257 -262 -161 -286 -155 -277 -29 -166 -50 106
2419 106 -96 -103 62 -196 16 1 -198 -16 -19 -115 264 -74 -54 -41 -97 -303 -39 -7 -56 -109 184 221 224 198 128 168
2445 168 186 155 103 192 246 185 41 112 308 147 373 109 -191 56 36 86 324 -6 56 47 58 111 -109 18 -78
2470 -78 -114 -22 -67 -264 62 -114 -271 -34 -326 -189 -193 -97 -378 -28 -171 -448 -313 -122 -87 -149 -103 -265 -61
2493f1j32J00J4j85J55K28j32j30J30L9lJ88J3k29j60L69j78K71R6pj15pj75J51
2517B40K3j04J37j13M8j31M1K55l01k3L7M5J78q1k7O5m29L57j44k74J70j28M03
2540B44k99j26J6L17j69R3n1j37J44k20J12P7l12J67Jj59k7L70j27l06L34k7M5
2563d0p4O6l05Q6K58O8m72J20L79k30L0K4q3N6K07j16K30j09M1Nj96J86q7N2k18
2588a22J04J38l0m9J7J97j32L08k71R8n7j31J81j15p0K06j02o3K5k28M64j21j58
2611H9J8j57L5k84M19m94L44Q7L6k2q9Mj24O3j4R8q2r7p5P7j4O0J15l81M88l06
2637b06QL21k13K95m66Q6J06K15l00Q7N1k82L57P8q2j00K0J11j83J04j62L73q0
2660A38M4j14N1j48J52R6j8m0J03O1k15p7J42L7j21J80m0j89Q6n0K86m43J81l27
$$ plain form
2493 -61 -193 -93 -79 -264 -109 119 -13 -143 -13 26 23 211 224 -5 -165 204 26 297 393 386 271 264 89 240
2517 240 263 159 296 183 231 100 141 396 95 72 109 154 332 251 224 289 -140 217 73 -201 -31 -159 244
2540 244 -55 -181 -165 152 -17 76 25 -112 32 -188 -76 1 -311 -144 -143 -302 -329 41 -86 -392 -58 -85 -40
2563 -40 -114 -48 -353 -267 -9 59 -413 -293 86 -144 -114 -90 -173 -117 90 -26 204 95 136 141 -55 131 44 96 -122
2588 -122 -18 120 90 41 58 255 123 431 160 258 201 70 251 136 66 272 170 107 132 -96 368 247 89
2611 89 107 -50 -15 -299 120 -374 -30 57 93 71 -18 -14 -138 -75 -89 9 -73 -170 -245 -168 -182 -122 -7 -388 100 -206
2637 -206 -198 123 -90 205 -261 -175 -69 146 -154 -67 -16 -298 59 137 55 -45 -25 86 -97 7 -155 218 138
2660 138 182 68 119 -29 123 219 201 161 264 325 110 33 175 212 91 271 231 42 128 78 364 -79 102 -225
2684b25L60k48K81k12J28K4k28k42L04o6k3m4R0m0L8ml0p0J09r5Q3K86m30K10
2708d4j14R6r0k1j25K01p1K5r1J12J56k93J55j21J80K53l50K22l9pj93J68j07
2731i8M80j47j51P5j98N7J66m1M8R4j68K02k53l1K00k86J29J2K28j54J2j57K09
2754B28j22k07P9K15l16K11m9j25J13oj22j88K17p7K3k8J31j21j7K51l34J78j29
2777a95J65k5k36K6j01N00k42j60L05r6K41j51j62N0Mj40K10j26Q4J18M6m9J2
2800G8j51J1J51j47K66k26P2j37N14j31P4k40j28J4M8J09k7O6O0m51M62j13n6
2823A18Q5J55m3j59k23M9o6J93J34j62l08L4L57l2j44J51k00K18n31M08k32kJ49
2846e1n5j10J37l94K71J04RK06k40l3k10Q6j57L24M8j02K47k20K07k52K99j47
$$ plain form
2684 -225 135 -113 168 -44 84 108 -120 -362 -58 -124 -147 -191 -101 -141 -103 -107 -137 -207 -98 -193 -110 176 -254 -44
2708 -44 -158 -62 -152 -173 -298 -97 -168 -143 -234 -122 34 -259 -104 -225 -45 208 -142 80 41 34 -159 9 -98
2731 -98 382 235 84 159 -39 18 184 143 191 285 117 319 66 35 235 -51 78 90 318 164 176 19 228
2754 228 106 -101 -22 193 -123 88 39 -86 27 21 -101 -289 -72 -149 -126 -154 -23 -144 -161 90 -244 -66 -195
2777 -195 -30 -55 -291 -265 -366 134 -108 -268 37 -59 182 31 -131 -81 -77 -217 -7 -133 -49 69 115 66 78
2800 78 -73 -62 89 -58 208 -18 54 -83 431 300 374 134 6 20 68 177 150 216 276 -175 287 174 118
2823 118 203 358 315 156 -67 -18 -84 109 243 81 -227 -193 164 132 -12 139 -61 157 -374 34 -198 -200 -51
2846 -51 -106 -216 -79 -473 -202 -98 -89 117 -123 -156 -366 -280 -437 -113 -65 -167 80 -140 67 -185 114 -33
2868c3l14M63J10l37MJ84j24K06n7nL1k31L13k46P1J44j19J43q2K9J17R3j82N6
2892B34j45M0k28K52j13J16M2o9K9R5k15J83m5k26K34j24j93J60j1k49L97l53
2914a89M3J71oj51R0J43k25k6J29m22L25K03k77p5J91K2l7Q1m8k1j49J32j71L14
2938D7l6j27O6J21j75k5l0K57k13K98l56n0J09R9O4j50K17p0q3P0j12R5K52pk3
2963B38m47M80j55j86J03J62L2n0R4j36j49P8K17P5m59L32k05K39o9Jj72Mq9r
2987g1k0J16L6l91L07r9m3J13Q2r7k06J71l0m3O1j34Q8j03M4K10l10J26p2O4q7
3012b88L07k49J85j42K14R6l31K40J17q6j03m2j06J32K16l7q6k7K13j75K6J4J90
3035B78k8k47K42nn0k5M9J39k86k2J07nJ59j31o7M4j83J19j5M1j3k6j3k20M31
$$ plain form
2868 -33 -347 116 226 -111 -107 77 -47 159 102 97 128 -103 210 -36 35 179 60 203 121 150 267 360 178 234
2892 234 89 129 -99 153 40 156 198 129 158 253 38 221 176 -50 184 60 -133 27 16 -233 164 -189
2914 -189 -146 25 19 -132 -42 101 -124 -150 -21 -443 -118 85 -192 -267 -76 -54 -91 -10 -58 -79 -228 -96 -267 47
2938 47 11 -116 -50 71 -104 -129 -159 98 -115 183 -173 -223 -114 -15 49 -101 116 46 -37 33 -79 16 268 261 238
2963 238 -209 271 116 -70 33 195 227 177 271 135 -14 64 281 356 -103 229 24 263 194 195 23 27 -62 -71
2987 -71 -91 25 61 -330 -23 -122 -165 -52 30 -67 -273 -102 -132 -175 -114 -248 -160 -263 -219 -9 -319 -193 -265 -201 -288
3012 -288 19 -230 -45 -187 27 123 -208 32 149 63 -40 -82 -188 -56 160 123 37 10 223 48 74 88 278
3035 278 250 3 245 240 190 165 214 353 67 45 152 147 306 175 108 152 -31 88 73 114 101 75 62 -158 273
3060B73n07K17M6j43K6qJ09n5j1J63k54o3J16J37L3l23P2n4K39m36K74J34R2k58
3084a81J4m1R4J96l12O8K41k57J19k6O9J95k15j09K54M4p2P6j35J33k57j4J42
3107B6O5R8M5r3J26j26kR0N7O3k42J51k60K27p9l21N54k74J61l44J75M2j49m4
3131e4k6j85M77M5l29j44M6p9J23K34l64L81l98L98j76r3O7P1j75j08K85JK7k13
3155a89k28K94j5o0K30k48K0J54R2j7j66O5K8L0j9J34N6j74j12M17k27J82j78
3178F9N3k50R7N5k37L30P6m6J08j41j37Q8J94k58J02K6j67K03n6j8k9N0O5k1p6
3203H0k17J80K65q7l91K55j24K35j96L7Lj0j61L8J45j32L17k94N0M5p7J3p6J29
3227B7j84J69R5k03j17J11R9j51k5l0L30j80N4mk59J99j1J06p2m7J27o7k60L09
$$ plain form
3060 273 -234 -17 29 -114 -88 -96 13 -42 -53 110 -144 -207 -91 46 79 -244 -172 -226 13 -423 -149 -15 77 -181
3084 -181 -167 -208 -114 82 -230 -162 79 -178 -59 -85 -16 179 -36 -145 109 153 81 157 22 155 -102 -116 26
3107 26 91 189 234 141 267 141 139 229 286 349 107 258 -2 225 146 -175 379 105 266 -78 97 139 -10 -54
3131 -54 -80 -265 212 257 -72 -216 -170 -249 -126 108 -256 125 -273 125 -51 -144 -77 -6 -181 -289 -4 -3 24 -189
3155 -189 -417 -123 -138 -198 32 -216 -196 -42 50 33 -133 -68 -40 -10 -29 105 161 -13 -125 292 65 247 69
3178 69 122 -128 -31 24 -213 117 193 147 255 114 -23 65 259 1 103 129 -38 165 109 91 62 112 177 156 80
3203 80 -137 43 308 221 -170 85 -39 196 0 37 40 30 -131 -93 52 -80 237 -57 -7 38 -39 -26 -102 27
3227 27 -157 12 107 -96 -213 -102 -3 -154 -179 -209 121 -59 -5 -9 -268 -69 -80 26 -46 -93 34 -33 -293 16
3251A6J04j4k32J00m8N56k28Nm2k46K29k66K87qJ04k93J34m8K2p6QJ3M4K6q4p3
3277a0K16l51L41l26L03m1m76M59qk51j30K42r9R6n4m8J84o4q4j23qq3L28L5k0
3302B8n6k34L56l08J55j02o7K68j06K7k5k09K77j79J16Lj04R6J90k19J03k36L44
3325A18K8j10J92r5j6m3m3j08K47p3K7O1j37K46j08j10j17K02K17k34j96K11n1
3348A08Q4k91K13J49j76q1o2K3K2j00Q5k3n6QJ47l05K34r8L62k66K54n08K70k4
3372c1l83K32J68o4Q1j92K5k4J31M3n2j47K64k43O5J70k33J02K23k67J94j2o8
3395a8q0l5Q8J20p8j29K40n7J88j83L53m68L09k74r1J78k14L29L4j4k4j50J02
3418A26J33k44k8L37j45K28k64k8Q6j7k02N7N3Q7j14j00Q0m48M68p9j80J89L7
$$ plain form
3251 16 120 106 -126 -26 -74 482 254 259 217 -29 200 -66 221 213 317 24 158 110 132 56 64 77 121 147 63 -10
3277 -10 206 -145 196 -130 173 132 -344 115 107 -144 -274 -32 -131 -35 -89 -137 47 -17 -101 -224 -232 -315 13 48 28
3302 28 -28 -262 94 -214 -59 -161 -228 40 -66 -39 -64 -273 4 -175 -59 -56 -160 -64 126 -93 10 -226 118
3325 118 146 36 228 133 117 74 31 -77 170 97 124 185 48 294 186 76 -41 161 378 144 -52 159 108
3348 108 192 -99 114 263 87 6 -56 -33 -11 -111 -26 -49 -105 -97 50 -255 -21 -119 243 -23 231 -277 -7 -31
3372 -31 -414 -182 -14 -78 3 -189 -164 -188 -57 -14 -66 -213 51 -192 -127 43 -190 -88 135 -132 62 50 -18
3395 -18 -98 -133 -45 75 -3 -132 108 51 239 56 409 -59 250 -24 -115 63 -151 178 212 198 174 24 126
3418 126 259 15 -13 324 179 407 143 115 201 184 -18 39 92 179 65 -35 45 -403 65 -14 -194 -5 32
3441C2l54L99l13J02J1Nj4Q7p7J21j96R7rL0L1k66J68l8O9J07l6n5K1M0P1j38
3467a05n9M89l93r8K14j4j6k1J95o7k78K12Q3k15L60n25N4L36j72o7J81n2K06
3490B48j72k01P6k9L38l67K34L5k01N6O2j79J43k0j34J11m3l5R2J36j3j31j89
3513a83L13l5q0J05l25K23o1j26J85n7P4k99J19j55K98j84N0j04M13k10k29J62
3535a06l6J76j23J11k00K13L4m3k5K5q5J28n9J88l54K22r1J9P8n1J12j62J39k46
3559a36K03q4K08j40q9J76Q6m53K36J29k51J10P8j09K41j15n1j69J25j04J37N6
3581H4l67L77j18j65J19J76l7j6R3k38J09O2k52K39k1k45J97J01o7j17J3r2J1
3604a54K3N7M3M07n00P0O0l5nl65O31l33k9K2J62J00m9JJ66k43Jj3PL7J98j76
$$ plain form
3441 32 -322 77 -236 -134 -123 -118 -132 -45 -122 -1 -197 -100 -109 -79 -48 -314 -146 -184 -115 -8 -44 -99 -78 -38 33 -105
3467 -105 -164 325 -68 -166 48 34 18 -3 192 125 -153 59 142 -73 287 -238 -184 152 -20 -87 94 42 248
3490 248 76 -125 -49 -78 260 -107 127 162 -39 17 79 -100 43 23 -111 0 -43 -78 14 150 137 6 -183
3513 -183 130 95 15 120 -205 18 -43 -169 16 -41 33 -266 -147 -302 -4 -188 -138 -242 171 -39 -268 -106
3535 -106 -142 34 -89 22 -178 35 69 26 1 26 -59 69 10 198 -156 66 -25 -6 72 21 133 -29 110 -136
3559 -136 67 -17 191 51 -38 138 224 -229 7 136 -115 -5 73 -36 205 90 39 -130 -5 -109 28 84
3581 84 -283 94 -24 -189 -70 106 69 53 146 -92 17 79 -173 66 45 -200 -3 98 31 -86 -73 -165 -154
3604 -154 -131 -74 -31 376 -124 -54 6 -29 -34 -399 232 -101 -130 -108 54 154 105 106 272 29 30 17 24 61 259 83
3630H3J9N0r0j33M5Q0K8o9j2K67R1k71j20J22K03k53p3K73j00k1n6R6J39k89K9
3655C8nQ5j33J40j20l9n3l5J33j16N8Q7O6k83J17J66l29L24j77Q9K0j80K82Kj38
3680aK2Kj04J10o0r5P5L02j72J40j07o9L9J18m55L81N4l19Q7J45k76M2M57l48
3704c2J90j40K0k59K43R2L4r2P0j61J14Q1J6j44K00l83M2K31q7K7j77JK33R3j21
3729I1k16K59j20q4K0O5M4k47O7k1l8K9J08J11o1j37J52J31k19k40J01J52J81
3752A28k54L9o2j5jP1j32K99r4K52j79k69J86Q9k31O1K0J11J40j63N3J27r8l3
3776D5Q9K8j14J13l22L45k93K38rj0jk9lK07k77J50j56j3Q4j11J48j68J37p7o6
3801f5R5n8P1L3J11l59LpN9k7J37l1K06j09J22m55p2N06k11O6K18k80RQ7o8j00
$$ plain form
3630 83 102 152 62 -71 -26 54 82 13 1 268 359 88 -32 90 293 40 -33 240 140 119 63 159 298 9 38
3655 38 33 118 -15 125 5 -34 -87 -122 11 -105 -47 40 106 -177 -60 106 -223 101 -76 13 33 -147 135 137 -1
3680 -1 21 23 -81 29 -31 -126 -51 251 79 219 112 43 82 200 -255 126 180 -139 -52 93 -183 -141 316 -32
3704 -32 158 18 38 -221 22 114 148 56 126 -35 79 160 176 32 232 -151 -109 122 35 62 -115 -114 119 212 91
3729 91 -125 134 14 -70 -50 15 59 -188 -121 -142 -180 -151 -43 68 7 -130 22 153 -66 -306 -205 -53 128
3752 128 -126 -87 -149 -164 -165 -94 -226 73 -21 231 52 -217 -31 58 -173 -112 -92 19 159 -4 49 176 78 45
3776 45 134 162 48 161 -161 184 -109 129 120 110 109 80 77 284 7 157 1 -12 72 -39 109 -59 78 1 -65
3801 -65 30 -28 43 76 187 -172 -169 -176 -117 -144 -7 -38 168 59 181 -274 -346 160 -51 15 233 -47 -38 49 -19 -119
3827a19J13k56L23k52J90l65K41R6q5R2q4J31q2j37J22J00j15K27k51K12R5j98
3849bL26m90N47m35j02L05P2o7j23J13q1J91m46L61J04k29j37MK37j36pl27K29
3872i3J68j1p3R4Q4RJ3J34l91L8J5M1j91M3L4j1R2O1q3o6Q8j46j76O6J07j56N49
3899B39k78M9j92J91l65J49K03J20l67K72j13j30N1J60Q5kk0j48J40o4J94o0k8
3922H6k05J75L1j17n2K05j27l7mK2N4q4P6J23Jr8j10J25qL7l4m4J04k50K32q8
3948A3J08j90J04j24JK88n41J12J10K72l12K38j77J66q5p7l17L94J26k62n0j52
3970c55K95j97J57Q5L3j18J1L4K25k85lKJ95j11K40j97P2n1p9M5q9K19j37j35
3994a44K53l7j38P8M9RJ64r7M0K9q3k91M50l21J22l0m5K13n2l63L47j41N5K3N2
$$ plain form
3827 -119 -6 -262 61 -191 -1 -366 -125 -29 -114 -22 -106 25 -57 -194 -72 28 -87 140 -111 101 196 -2
3849 -2 324 -166 381 -54 -156 149 221 154 31 144 63 254 -192 169 273 44 -93 -89 148 12 5 -322 -93
3872 -93 75 64 -9 85 169 178 191 325 -66 -28 -13 28 -163 -120 -86 -97 -5 56 -27 -93 -5 -151 -327 -261 -154 -310 239
3899 239 -39 10 -182 9 -356 -207 -4 116 -251 21 -92 -222 -171 -11 74 72 52 -96 44 -20 174 114 86
3922 86 -119 56 87 -30 -82 123 -4 -41 -45 -23 31 -53 23 146 147 49 -61 64 56 93 59 15 119 -131 101 13
3948 13 121 -69 35 -89 -88 200 -341 -229 -119 153 -159 79 -98 68 -17 -94 -411 -17 109 -153 -203 -355
3970 -355 -60 -257 -100 -15 18 -100 -89 -55 170 -115 -118 -116 79 -32 208 11 83 32 -47 -2 -91 128 -9 -144
3994 -144 109 72 -66 12 61 70 234 137 177 206 123 -168 282 -39 83 53 8 221 169 -194 153 12 67 90 142
4019A42k24L24j11j11R3j47N5R1j40J97k49l08M19j43J05P4j27l4M6L5J77k45
4041h1n9J29O0j60M0Q9J78j6l22k6j0J66j23K39j8n2j82K4N9K78j20j03J2j0j05
4066a13K16q4JO9J12k76K51Pj66P1q5j37M9J34qK03j07k70o4K44J38q8j41J27
4090H3j18J68q8p3J04J0q1r7O5J05J11j66o8N81n89K10M8j22M1j83J22Rk35r9
4114b62J21j0n2K4J95k29J07N4q4k44K04O9j51K20k2J04j7O0j23j84l3p4K18J78
$$ plain form
4019 142 -82 242 131 20 113 -34 21 112 -28 169 -80 -388 31 -112 -7 67 -60 -94 -48 -13 164 -81
4041 -81 -140 -11 49 -111 -71 18 196 180 -142 -168 -178 -12 -135 104 86 34 -148 -124 -65 213 93 -10 2 -8 -113
4066 -113 103 19 20 89 201 -75 176 183 17 88 3 -134 -85 49 41 244 137 -133 -197 47 185 97 -44 83
4090 83 -35 133 45 -28 76 86 5 -92 -27 78 189 23 -45 536 -53 157 205 83 124 -59 63 72 -163 -262
4114 -262 -141 -151 -203 -179 16 -213 -106 -52 -136 -380 -176 -107 -258 -38 -60 44 27 87 -36 -220 -253 -327 -109 69
$$ [...]
8191A6
##END NTUPLES=NMR FID
##END=
