##TITLE=1H_SR40_k2
 CDCl3,8 sc, 
 1.03.2021
##JCAMPDX= 6.0         $$ Bruker NMR JCAMP-DX V2.0
##DATA TYPE= NMR FID
##DATA CLASS= NTUPLES
##ORIGIN= UXNMR, Bruker Analytische Messtechnik GmbH
##OWNER= root
$$ XWIN-NMR		Version 3.5
$$ Mon Mar  1 11:27:47 2021 Russian Standard Time (UT+4h)  she@DPX200
##.OBSERVE FREQUENCY= 200.1315066352
##.OBSERVE NUCLEUS= ^1H
##.DELAY= (6, 6)
##.ACQUISITION MODE= SIMULTANEOUS
##.ACQUISITION SCHEME= undefined
##.AVERAGES= 8
##.DIGITISER RES= 18
##SPECTROMETER/DATA SYSTEM= spect
##.PULSE SEQUENCE= zg30
##.SOLVENT NAME= CDCl3
##.SHIFT REFERENCE= (INTERNAL, CDCl3, 0, 15.7039)
##AUDIT TRAIL= $$ (NUMBER, WHEN, WHO, WHERE, WHAT)
$$ ##TITLE= Audit trail, XWIN-NMR		Version 3.5
$$ ##JCAMPDX= 5.01
$$ ##ORIGIN= Bruker BioSpin GmbH
$$ ##OWNER= she
$$ F:/spectra/data/she/nmr/H-F/1/audita.txt
$$ ##AUDIT TRAIL=  $$ (NUMBER, WHEN, WHO, WHERE, WHAT)
(   1,<2021-03-01 11:26:47.01 +0400>,<she>,<DPX200>,
      <created by zg, POWCHK disabled, PULCHK disabled
       configuration hash MD5:
       00 E9 B6 7A A2 85 ED C7 34 08 36 98 17 FE 4E 26
       data hash MD5: 16K
       E8 55 9B 03 C8 3A B7 8D A8 EA D7 43 52 D9 A6 78>)
$$ ##END=
$$ 
$$ hash MD5
$$ FE 77 F9 F9 2C 0D BC 91 66 3A 71 97 F5 AB 3D 39
##$RELAX= 
##$RELAX= 
##$RELAX= 
##$RELAX= 
##$RELAX= 
##$RELAX= 
$$ Bruker specific parameters
$$ --------------------------
##$DU= <F:/spectra>
##$EXPNO= 1
##$NAME= <H-F>
##$PROCNO= 1
##$TYPE= <nmr>
##$USER= <she>
##$AMP= (0..31)
100 100 100 100 100 100 100 100 100 100 100 100 100 100 100 100 100 100 
100 100 100 100 100 100 100 100 100 100 100 100 100 100 
##$AQSEQ= 0
##$AQ_mod= 1
##$AUNM= <au_zg>
##$AUTOPOS= <>
##$BF1= 200.13
##$BF2= 200.13
##$BF3= 200.13
##$BF4= 200.13
##$BF5= 200.13
##$BF6= 200.13
##$BF7= 200.13
##$BF8= 200.13
##$BYTORDA= 1
##$CFDGTYP= 0
##$CFRGTYP= 5
##$CHEMSTR= <none>
##$CNST= (0..31)
1 1 145 1 1 1 1 1 1 1 1 1 1 1 1 1 1 1 1 1 1 1 1 1 1 1 1 1 1 1 1 1 
##$CPDPRG= <>
##$CPDPRG1= <>
##$CPDPRG2= <>
##$CPDPRG3= <>
##$CPDPRG4= <mlev>
##$CPDPRG5= <mlev>
##$CPDPRG6= <mlev>
##$CPDPRG7= <mlev>
##$CPDPRG8= <mlev>
##$CPDPRGB= <>
##$CPDPRGT= <>
##$D= (0..31)
0 1.2 0 0 0 0 0 0 0 0.06 0 0.03 0 0 0 0 0.0002 0 0 0 0 0 0 0 0 0 0 0 0 
0 0 0 
##$DATE= 1614583606
##$DBL= (0..7)
120 120 120 120 120 120 120 120 
##$DBP= (0..7)
150 150 150 150 150 150 150 150 
##$DBP07= 0
##$DBPNAM0= <>
##$DBPNAM1= <>
##$DBPNAM2= <>
##$DBPNAM3= <>
##$DBPNAM4= <>
##$DBPNAM5= <>
##$DBPNAM6= <>
##$DBPNAM7= <>
##$DBPOAL= (0..7)
0.5 0.5 0.5 0.5 0.5 0.5 0.5 0.5 
##$DBPOFFS= (0..7)
0 0 0 0 0 0 0 0 
##$DE= 6
##$DECBNUC= <off>
##$DECIM= 32
##$DECNUC= <off>
##$DECSTAT= 4
##$DIGMOD= 1
##$DIGTYP= 9
##$DL= (0..7)
0 120 120 120 120 120 120 120 
##$DP= (0..7)
150 150 150 150 150 150 150 150 
##$DP07= 0
##$DPNAME0= <>
##$DPNAME1= <>
##$DPNAME2= <>
##$DPNAME3= <>
##$DPNAME4= <>
##$DPNAME5= <>
##$DPNAME6= <>
##$DPNAME7= <>
##$DPOAL= (0..7)
0.5 0.5 0.5 0.5 0.5 0.5 0.5 0.5 
##$DPOFFS= (0..7)
0 0 0 0 0 0 0 0 
##$DQDMODE= 0
##$DR= 18
##$DS= 0
##$DSLIST= <SSSSSSSSSSSSSSS>
$$ [...]
##$SUBNAM2= <"">
##$SUBNAM3= <"">
##$SUBNAM4= <"">
##$SUBNAM5= <"">
##$SUBNAM6= <"">
##$SUBNAM7= <"">
##$SUBNAM8= <"">
##$SUBNAM9= <"">
##$SW= 16.9725356469052
##$SWIBOX= (0..15)
0 0 2 0 0 0 0 0 0 0 0 0 0 0 0 0 
##$SW_h= 3396.73913043478
##$TD= 16384
##$TD0= 1
##$TE= 0
##$TE2= 300
##$TE3= 300
##$TEG= 300
##$TL= (0..7)
0 120 120 120 120 120 120 120 
##$TP= (0..7)
150 150 150 150 150 150 150 150 
##$TP07= 0
##$TPNAME0= <>
##$TPNAME1= <>
##$TPNAME2= <>
##$TPNAME3= <>
##$TPNAME4= <>
##$TPNAME5= <>
##$TPNAME6= <>
##$TPNAME7= <>
##$TPOAL= (0..7)
0.5 0.5 0.5 0.5 0.5 0.5 0.5 0.5 
##$TPOFFS= (0..7)
0 0 0 0 0 0 0 0 
##$TUNHIN= 0
##$TUNHOUT= 0
##$TUNXOUT= 0
##$USERA1= <user>
##$USERA2= <user>
##$USERA3= <user>
##$USERA4= <user>
##$USERA5= <user>
##$V9= 5
##$VALIST= <valist>
##$VCLIST= <CCCCCCCCCCCCCCC>
##$VD= 0
##$VDLIST= <DDDDDDDDDDDDDDD>
##$VPLIST= <PPPPPPPPPPPPPPP>
##$VTLIST= <TTTTTTTTTTTTTTT>
##$WBST= 1024
##$WBSW= 4
##$XGAIN= (0..3)
0 0 0 0 
##$XL= 0
##$YL= 0
##$YMAX_a= 39838
##$YMIN_a= -27621
##$ZGOPTNS= <>
##$ZL1= 120
##$ZL2= 120
##$ZL3= 120
##$ZL4= 120
##$ABSF1= 10
##$ABSF2= 0
##$ABSG= 5
##$ABSL= 3
##$ALPHA= 0
##$AQORDER= 0
##$ASSFAC= 0
##$ASSFACI= 0
##$ASSFACX= 0
##$ASSWID= 0
##$AUNMP= <proc_1d>
##$AZFE= 0.1
##$AZFW= 0.1
##$BCFW= 1
##$BC_mod= 2
##$BYTORDP= 1
##$COROFFS= 0
##$CY= 11.3945322036743
##$DATMOD= 1
##$DC= 2
##$DFILT= <>
##$DTYPP= 0
##$F1P= 15.9154993809931
##$F2P= -4.1035820241983
##$FCOR= 0.5
##$FTSIZE= 0
##$FT_mod= 4
##$GAMMA= 1
##$GB= 0.15
##$INTBC= 1
##$INTSCL= 1
##$ISEN= 128
##$LB= 0.24
##$LEV0= 0
##$LPBIN= 0
##$MAXI= 10000
##$MC2= 0
##$MEAN= 0
##$ME_mod= 0
##$MI= 1.114404
##$NCOEF= 0
##$NC_proc= 0
##$NLEV= 6
##$NOISF1= 3.799351
##$NOISF2= 2.8
##$NSP= 1
##$NTH_PI= 0
##$NZP= 0
##$OFFSET= 15.70392
##$PC= 1
##$PHC0= -10766.84
##$PHC1= 18.80094
##$PH_mod= 1
##$PKNL= yes
##$PPARMOD= 0
##$PSCAL= 0
##$PSIGN= 0
##$REVERSE= no
##$SF= 200.130013532006
##$SI= 16384
##$SIGF1= 3
##$SIGF2= 2
##$SINO= 400
##$SIOLD= 16384
##$SREGLST= <1H.CDCl3>
##$SSB= 0
##$STSI= 0
##$STSR= 0
##$SW_p= 3612.71676300578
##$SYMM= 0
##$S_DEV= 0
##$TDeff= 0
##$TDoff= 0
##$TI= <>
##$TILT= no
##$TM1= 0
##$TM2= 0
##$TOPLEV= 0
##$USERP1= <user>
##$USERP2= <user>
##$USERP3= <user>
##$USERP4= <user>
##$USERP5= <user>
##$WDW= 1
##$XDIM= 8192
##$YMAX_p= 0
##$YMIN_p= 0
$$ End of Bruker specific parameters
$$ ---------------------------------
##NTUPLES= NMR FID
##VAR_NAME=  TIME,          FID/REAL,        FID/IMAG
##SYMBOL=    X,             R,               I
##VAR_TYPE=  INDEPENDENT,   DEPENDENT,       DEPENDENT
##VAR_FORM=  AFFN,          ASDF,            ASDF
##VAR_DIM=   8192,          8192,            8192
##UNITS=     SECONDS,       ARBITRARY UNITS, ARBITRARY UNITS
##FACTOR=    0.0002944,     1,               1
##FIRST=     0,             0,               0
##LAST=      2.4114304,     0,               0
##MIN=       0,             -27621,          0
##MAX=       2.4114304,     39838,           0
$$ Real data points
##PAGE= N=1
##DATA TABLE= (X++(R..R)), XYDATA
$$ [...]
1744E4L9K21k27o5J54j31Q2j57j55L07J07r2l48J34J51J11k80J72J46m77q1K79
$$ 54 93 314 87 22 176 45 127 -30 -185 122 229 137 -211 -77 74 185 -95 77 223 -254 -335 -56
1766e6K80l82J07O3q7J14o8r7J97j36J69k69l5Q1p6K67n0l08n6RK24M0J52j51
$$ -56 224 -158 -51 12 -75 39 -29 -126 71 -65 104 -165 -200 -119 -195 72 22 -286 -342 -333 -109 -69 83 -68
1790f8p7J10j04L6J95r6k34Q7L30Q1l92J32j98K60j22L8m87M13J37j15J78p1P05
$$ -68 -145 -35 -139 -103 92 -4 -238 -151 179 260 -132 0 -198 62 -60 -22 -509 -96 41 -74 104 33 738
1813G38o87l60L7Q8J15pJ0Mp7K6J58m6j16l4K15j25k5l14K49O9k66M21KO7k37
$$ 738 51 -309 -272 -184 -69 -76 -66 -62 -139 -113 45 -1 -117 -151 64 -61 -86 -400 -151 -82 -348 73 75 142 -95
1838i5J53j21l8r8K27j74N6M8J48j73J87l5KJ27j61J96j10j02J32j75K98k67M7
$$ -95 58 -63 -101 -199 28 -146 -90 -42 106 -67 120 85 87 214 53 249 139 37 169 -6 292 25 72
1861G2R6L7L5o2O1J83j88o6K16j68K4j39K88l83L07m57m9J42J00j18N62n16J5
$$ 72 168 205 240 178 239 422 234 168 384 216 240 101 389 6 313 -144 -193 -51 49 -69 493 -23 -8
1884hJ46kj71K32r5J92j79k75K42k75L62M0j89j07pO2j56j70J27N9j3J8l7qo0
$$ -8 138 136 -35 197 102 294 115 -160 82 -193 169 209 20 -87 -94 -32 -188 -358 -231 -172 -185 -167 -204 -212 -272
1909b72K97l42j15L60m40L68N4l15L7P3M3J56J46j69K9q0k8K04J25j77k17K80
$$ -272 25 -317 -432 -72 -512 -144 -90 -405 -368 -295 -252 -96 50 -119 -90 -170 -198 6 131 -46 -263 17
1931A7j39K97j54k78J91pK03O8k24K85R7k11l27J51J44M1j12J23K15k50O0j34
$$ 17 -122 175 21 -257 -66 -73 130 198 -26 259 356 145 -182 -31 113 154 42 165 380 130 190 56
1953E6J62k34K07J01k51K10L0k93J43M0J83l86J5J33J9j19K11Lj70K6l6Qj72L05
$$ 56 218 -16 191 292 41 251 281 -12 131 171 354 -32 -17 116 135 16 227 230 60 86 50 58 -114 191
1977A91l80J76L30m81J71mJ44j68K12k07j64M02j62r8O2j69MP8J46j91L7K8Q8
$$ 191 -189 -13 317 -164 7 3 147 -21 191 -16 -180 222 60 -38 24 -145 -141 -63 83 -108 -71 -43 45
2000D5L7k26K9K24k5M0J53k86r8j25N43k35o4j82ln9q7K91L34m46K94l96L56Q1
$$ 45 82 -144 -115 109 84 124 277 -9 -107 -232 311 76 12 -170 -173 -232 -319 -28 306 -140 154 -242 114 195
2024A95o20N31J0NJ22p0j45J00Jl34M02m32j05L36j2j95J20M74o02M64J6n32N4
$$ 195 -425 106 116 121 243 173 28 128 129 -205 197 -235 -340 -4 -16 -211 -91 383 -219 245 261 -271 -217
2047b17k24K5M78k53k3j03K5M79m19K84J76l93L04k67K7P2o1O2j98K35J44j13
$$ -217 -441 -416 62 -191 -214 -317 -292 187 -232 52 228 -165 139 -128 -101 -29 -90 -28 -226 9 153 40
2069D0j98K18j21j08K22j50K21k2R9j28J44j53k32K44k07K04L2o1J87k35J81j70
$$ 40 -158 60 -61 -169 53 -97 124 102 201 73 217 64 -168 76 -131 73 105 44 231 -4 177 7
2091GK04j29J66J6Q0l25J72O8J23k54J91j66p1M2q0P4kj90jL02j38j2j43J73O8
$$ 7 211 82 248 264 344 19 191 259 382 128 319 153 82 124 44 118 116 -74 -75 227 89 77 -66 107 175
2116A75n5r9K1P7k35J84r0j52P5L2J76m7k17J04Lj66MM7J76o7j0j79J96j77L26
$$ 175 120 21 42 119 -116 68 -22 -174 -99 -67 109 62 -155 -51 -48 -214 -210 -163 13 -54 -64 -243 -47 -224 102
2141A02l57J18Q0k20J1Q3L14k36n5M1J14r0Q0J28j59j30K59p2n9J4J01j26K9j48
$$ 102 -255 -137 -57 -277 -266 -183 131 -105 -160 -119 -5 -95 -15 113 -46 -176 83 11 -48 -34 67 -59 -30 -178
2165a78K12J20j54Q5j92K2K22j25K26j93n8q7N4L3n3m2L81j49J2o3J46p0j06R4
$$ -178 34 154 0 85 -107 -85 137 12 238 45 -13 -100 -46 -13 -66 -108 273 124 136 73 219 149 43 137
2189A37k07L6J09n3m2r0Q4J17j46l3R4l22K15J83k99M35l22RJ72k57K18L2j44
$$ 137 -70 -34 75 22 -20 -110 -26 91 -55 -88 6 -316 -101 82 -217 218 -104 -95 77 -180 38 70 -74
2212g4q9L95k20Q7K8J19l77K83j77P4J29k08n3J54k87q4K80K62j25j63O4L8j90
$$ -74 -163 232 12 99 127 246 -131 152 -25 49 178 -30 -83 71 -216 -300 -20 242 117 -46 18 56 -134
2235a34J73R5j43J01ll39K89J32j0L7j19k4J88r2l52K82j77K31n7m0J65j67j61
$$ -134 39 134 -9 92 89 -250 39 171 161 198 79 55 243 151 -201 81 -96 135 78 38 203 36 -125
2258a25l9J88J03j11l8l5J68j52j9j51K85j21k2K29J16k66j51l1K9j08N2J5J08
$$ -125 -164 24 127 16 -22 -57 111 -41 -60 -211 74 -47 -69 160 276 10 -141 -172 -143 -251 -199 -184 -76
2281g6On9N8Mo6O5j41K07j44j16K27L1k0l3J16j06o2m4J70J09q8J47k38p3Q8o4
$$ -76 -70 -129 -71 -67 -133 -68 -209 -2 -146 -262 -35 -4 -24 -57 59 -47 -109 -153 17 126 38 185 -53 -126 -38 -102
2307a02J76L5MN3j85J09N1n0o1J79N5p5m2k0L0M4K13j61j54j01k2K79l9j19N4
$$ -102 74 109 113 166 -19 90 141 91 30 209 264 189 147 127 157 201 414 253 99 -2 -24 255 216 97 151
2332A51k12QJ65Pj39J92k88K93j70l6K25l99P2K09k15K1P8J53m33K13n2K28k48
$$ 151 -61 -53 112 119 -20 172 -116 177 7 -29 196 -203 -131 78 -137 -116 -38 115 -318 -105 -157 71 -177
2355a77J95j29n9L63l92Q4o2K03R1j04Qo6j58Q4p0J46O4j33Q3p7J33n2J18K3j02
$$ -177 18 -111 -170 193 -199 -115 -177 26 117 13 21 -45 -203 -119 -189 -43 21 -112 -29 -106 27 -25 93 116 14
2380A4k2j04J41j52L2K28r9j75K71k26J98j13k4J18k23M92k54n9O2j4k11J78Q0
$$ 14 -8 -112 29 -123 -91 137 38 -137 134 -92 106 -7 -31 87 -136 356 102 43 105 91 -120 58 138
2403A38j15R1j00Q9k15J65j01L16j57r6o9J1M4Q1j83J13r0J87j25j10P9OJ64j90
$$ 138 23 114 14 103 -112 53 -48 268 111 15 -54 -43 1 82 -101 12 -78 109 -16 -126 -47 -41 123 -67
2427f7M2p1L0j30J02R7J17k63L9j01L3O3j17K62k00J3J51j59K3J78j73J34N5p8
$$ -67 -25 -96 -66 -196 -94 3 120 -143 -104 -205 -172 -109 -226 36 -164 -151 0 -159 -136 42 -131 3 58 -20
2451b0N1j9r4K74n7k79J54O2K23j72k15J8J38J19k16J85j61K09J12l19K03r8Q7
$$ -20 31 12 -82 192 135 -144 10 72 295 123 -92 -74 64 183 -33 152 -9 200 312 -7 196 98 185
2474A85Qq2j28j66L20J93k84p5P8j38R9P1n6J19k05q1q0m3K56J42j74j28K52l47
$$ 185 193 111 -17 -183 137 330 46 -29 49 -89 10 81 25 144 -61 -142 -222 -265 -9 133 -41 -169 83 -264
2498b64J76M6O0l92J78J42q0K5o4R8K4n8pJ04K27k87k0K62j08m7j05Oj4nJ12j27
$$ -264 -88 -42 18 -374 -196 -54 -134 -109 -173 -75 -51 -109 -116 -12 215 -72 -92 170 62 15 -90 -84 -98 -103 9 -118
2524a18O7O5Q7K4k57K57j82L05k63K07k52K74k4m2j99K00j50K87j25k39K99j81
$$ -118 -51 14 101 125 -132 125 -57 248 -15 192 -60 214 190 148 -51 149 -1 286 161 -78 221 40
2546D0J7J79o0q6j42K93J39m01N4K69j62o3K2j1J21k20j10J10J31K9J1l35K90
$$ 40 57 236 176 90 -52 241 380 -21 33 302 140 77 99 88 209 -11 -121 -11 120 149 160 -175 115
2569A15J2j96K04n3P0j05k08J32N6k87K62o3L1L7l4k4k48J42J68J9K05j47j82
$$ 115 127 -69 135 82 152 47 -161 -29 27 -260 2 -61 -30 7 -27 -51 -299 -157 11 30 235 88 -94
2592i4k1q9J5J18o2R2J37n0q2O5m7l2P2K99j44j31N1K7l1J46j54j28K70j93K43
$$ -94 -115 -204 -189 -71 -133 -41 96 46 -36 29 -18 -50 22 321 177 46 97 124 93 239 85 -43 227 34 277
2617B77r3j21J67k56P7J52k75K33j89M8N0m8j09J48J58o7l29K78k43P4Q8J04j41
$$ 277 184 63 230 -26 51 203 -72 161 -28 20 70 22 -87 61 219 152 -177 101 -142 -68 20 124 -17
2640a7qp6j14R6l9j09J10L33k15p2J9q7JL16m05L85j46p1k2j54M02l44J49K01
$$ -17 -25 -101 -215 -119 -158 -267 -157 176 -39 -111 -92 -179 -178 138 -267 118 -28 -99 -121 -275 127 -217 -68 133
2664A33j27JK6o1J44m08M65j0j87K43k37K19j91j42L94j41%l62L44j73R9j94L28
$$ 133 6 7 33 -28 116 -292 173 163 -24 219 -18 201 10 -132 262 121 121 -241 103 -70 29 -165 163
2687A63N1j07k51M0J58kj57J57jJ2J30k45m2J81J0J03j39P9k20j01K29jK3r1j
$$ 163 214 107 -144 -104 54 52 -105 52 51 63 193 -52 -94 87 97 200 61 140 -80 -181 48 47 70 -21 -22
2712b2R6j56j08L19j66j1J3J37K3j16N2j81O2m2J07k34K74m96M85j28j2J22p5
$$ -22 74 -82 -190 129 -37 -48 -35 102 125 9 61 -120 -58 -100 7 -227 47 -449 36 -92 -104 18 -57
2735e7M8N4J32l95k7MK86l92K45lK13m51N46n76L17J25k20l20Q8k54Q19K57p53
$$ -57 -9 45 177 -218 -245 -241 45 -347 -102 -105 108 -343 203 -373 -56 69 -151 -471 -383 -637 182 439 -314
2758c14N31j31j40O2j37J26q2J65kq9J17l07K70o0K5j22J75jp0Q2m2j55M30m56
$$ -314 217 86 -54 8 -129 -3 -85 80 78 -11 106 -201 69 9 34 -88 87 86 16 98 56 -99 331 -125
2782a25P7k23K48q1J64q7K6R8l72M62l76L53k27J64k12J4q7L42j24j45o7J71L3
$$ -125 -48 -271 -23 -104 60 -27 -1 97 -275 187 -189 164 -63 101 -111 -97 -184 158 34 -111 -178 -7 26
2805B6j30L91l59L2j08P7j06J28J54r2K88k56j17k17K27J04K38k24J39n0k26Q3
$$ 26 -104 287 -72 -40 -148 -71 -177 -49 105 13 301 45 -72 -289 -62 42 280 56 195 145 -81 2
2827BM8n8K9P9j80K18k34J78J16r9J49k24j05k3J85L8k01R1N1r8K73q8N3m69P4
$$ 2 50 -8 21 100 -80 138 -96 82 198 99 248 24 -81 -104 81 119 -82 9 60 -38 235 147 200 -269 -195
2852a95J8n6L61j73J1j11j19J51Q0p3n1K78l39J46J74k11k1J25K7k04J37L3J71
$$ -195 -177 -233 128 -45 -34 -145 -264 -113 -33 -106 -157 121 -218 -72 102 -109 -130 -5 22 -182 -45 -12 159
2875A59m15M92m08J71j48JM04m43P1K83j78k92L85j01k09J59j78J93j67J5n5M66
$$ 159 -256 236 -172 -1 -149 -148 256 -187 -116 167 -11 -303 82 -19 -228 -69 -247 -54 -221 -206 -261 205
2897B05k01j22K95k85K78k50L63l54R1R0J33j25q6p3m5P3L25j68N4p4K06m65j38
$$ 205 4 -118 177 -108 170 -80 283 -71 20 110 243 118 32 -41 -86 -13 312 144 198 124 330 -135 -273
2920b73N32l81J23J28k96O97n16K24L65n62j34n60K01K32L66k37k04K28m13L33
$$ -273 259 -122 1 129 -167 530 14 238 603 41 -93 -653 -452 -220 146 -91 -295 -67 -480 -147
2940a47jR6L4L74k23l12L56p73J052j136O75l3L7k14n9K29J11Po9m13K72o8j78
$$ -147 -148 -52 -18 356 133 -179 177 -596 456 -680 -5 -38 -1 -215 -274 -45 66 73 4 -409 -137 -205 -383
2963c83O17k17k50Q1J59j29Pj61M75q36M29M6K40n85P41k68P2l01M70k15M8m74
$$ -383 234 17 -233 -152 7 -122 -115 -276 199 -637 -208 -162 78 -507 234 -34 38 -263 207 -8 40 -434
2985d34R34k89j117P53L70j2l89L30M71m21o05L79o3J38j7n9q1m14O45J28k31
$$ -434 500 211 -906 -153 217 205 -184 146 617 196 -409 -30 -93 45 28 -31 -112 -526 119 247 16
3006A6K56m04K21j30K2J48pP2j39j55J45J5J61k30j83J70j60Q5Oj47N00k41J4
$$ 16 272 -132 89 -41 -19 129 122 194 55 -100 45 60 221 -9 -192 -22 -182 -97 -91 -238 262 21 35
3029C5p7K0j70N1J57j82J91k5N3J14j4l93L04j2k44J33m0K16P5l07N8J81l9j1
$$ 35 -42 -22 -192 -141 16 -166 25 0 53 167 153 -240 64 52 -192 -59 -99 117 192 -115 -57 124 85 74
3053G4j53Q1P9j34lK16j28q4J54J5j33J03K46m71K07J12j23J15K8j83j46M8J26
$$ 74 -79 2 81 -53 -56 160 32 -52 102 117 -16 87 333 -138 69 181 58 173 201 18 -128 -80 46
3076D6j92J74p9J39q9j14J26K22m41J75m6l1J96j78J59j90R0J53r1p8j08LJ01
$$ 46 -146 28 -51 88 -1 -115 11 233 -208 -33 -79 -110 86 -92 67 -123 -33 120 29 -49 -157 -154 -53
3099e3ml0O2m5j05K43j64j80J93k7j8J1K13l50K83n2o5qp9K74J06k24J30Q2l06
$$ -53 -57 -87 -25 -70 -175 68 -96 -276 -83 -110 -128 -117 96 -254 29 -23 -88 -96 -175 99 205 -19 111 193 -113
3124a13J27l3J35j05Np8J92q4j4p0J20j16K75p7%p6j64L63j58j43J07j47K17j69
$$ -113 14 -19 116 11 16 -62 130 46 32 -38 82 -34 241 164 164 88 -76 287 129 -14 93 -54 163 -6
3148fk79K67nj61J56L17k89l94N60j00K38J76M9p1n83l18O49l01k97O09n70M75
$$ -6 -285 -18 -23 -184 -28 289 0 -394 166 66 304 480 529 458 -125 -443 206 -95 -392 217 -353 122
3170A22r83R51L09n31J8n7j4m19P83n39K67l51L28L88j2n69M42l65J32o5K83j51
$$ 122 -861 90 399 -132 -114 -171 -185 -604 179 -360 -93 -444 -116 272 260 -309 133 -232 -100 -165 118 -33
3192c3L0j01R4l2k53K94j11JJ95Mj95mJ77m8K64m96L13j74J96j65M5O6Q1k4L0
$$ -33 -3 -104 -10 -42 -295 -1 -112 -111 84 88 -107 -111 66 18 282 -214 99 -75 121 -44 1 67 148 124 154
3217A54m4rm5k2K36l16J94j97O3Rj0J78k08l8J46N6j51N7kk44K79j02O9n6j74
$$ 154 110 101 56 34 270 -46 148 -49 14 23 13 191 -17 -55 91 147 -4 53 51 -193 86 -16 53 -3 -177
3242a77J59j3j38L95p3j68Q0k09J70j3r5K0j23J89j88q7K52N8p1l4M9K7J4n4L2
$$ -177 -18 -31 -169 226 153 -15 65 -144 26 13 -82 -62 -185 4 -184 -271 -19 39 -32 -66 -17 10 24 -30 2
3267B%J30j37k94N35k88J70rk92L16k80L45k24%K0o7L22j40k38J12J76kk29K27
$$ 2 2 132 -5 -299 236 -52 118 109 -183 133 -147 198 -26 -26 -6 -73 249 109 -129 -17 159 157 -72 155
3291A55k61K92l29K84k5r4K23k86m5J01j83P2J19k8J38j88j7L2R5k46K70q7k8
$$ 155 -106 186 -143 141 116 22 245 -41 -86 15 -168 -96 23 -5 133 -55 -72 -40 55 -191 79 -8 -36
3314c6K22k65Q1M8J8k09J07M8J00q4j44Q6%j28J00o0M5q9K42k11q1L13j25O7m6
$$ -36 186 -79 2 50 68 -141 -34 14 114 30 -114 -28 -28 -156 -56 -116 -71 -160 82 -129 -210 103 -22 45 -1
3339aJ7J79l4l13N6j0p3K54M0kJ1j28P3k29J58jJ38m8q3k03J56K99k67K26m5l5
$$ -1 16 195 161 -152 -96 -106 -179 75 115 113 124 -4 69 -160 -2 -3 135 87 4 -199 -43 256 -11 215 170 135
3365A35Qj07N1J15j79N6q1J53o7K87l50N2m9K5q3p6Q8lJ79k47L24k5J8p0k92K43
$$ 135 143 36 87 202 23 79 -2 151 84 371 21 73 24 49 -34 -110 -22 -25 154 -93 231 206 224 154 -138 105
3391A05lk52j3N0K11M1k34R1K6j39j48M20J03m25M59n22J84L7J9R0k45J44m6l9
$$ 105 102 -150 -163 -113 98 139 -95 -4 22 -117 -265 155 258 -167 292 -230 -46 -9 10 100 -145 -1 -47 -86
3415h6J53J99j73j28J62J9j05j67J95OR6j93J12j20j20J10J78J07l39Q9P3M7j16
$$ -86 67 266 93 -35 127 146 41 -126 69 75 171 -22 90 -30 -150 -40 138 245 -94 -5 68 115 -1
3438aM8k9qJ30p4O6k36R5K13k28L5J4J43l27K53k7k03J65k07J32q5K86o7pj04
$$ -1 47 18 10 140 66 132 -104 -9 204 -24 11 25 168 -159 94 67 -136 29 -178 -46 -131 155 88 81 -23
3463b3k8OM0j03J80k02k29K62J08r9J68k06J17J50l08J62N6j10MQ9M4p4M6l8k45
$$ -23 -51 -45 -5 -108 72 -130 -359 -97 11 -88 80 -126 -9 141 -167 -5 51 -59 -55 34 78 4 50 12 -233
3488b33L85o6k18R5Jk7O8Q3n5J0q6J40k63K32q7RK6n1p7R6l1J23N8j63J08l6k05
$$ -233 152 86 -132 -37 -36 -63 5 88 33 43 -43 97 -166 66 -21 -12 14 -37 -114 -18 -49 74 132 -31 77 41 -164
3515a64L12o6o7P6j55J1J49l1K7n9J5k6K47m24N0K3L26l04J85l64L38k58k3N0
$$ -164 148 82 15 91 -64 -53 96 65 92 33 48 22 269 -155 -105 -82 244 -60 125 -239 99 -159 -182 -132
3539a32R9N2l7K6L0J28j56Or4J43j80k7J20l0P2k30J1K42k9J4p4N9J26j53m2J59
$$ -132 -33 19 -18 8 38 166 10 16 -78 65 -115 -142 -22 -52 20 -210 -199 43 14 28 -46 13 139 -14 -56 103
3565A03k11j3K7K92j98p5o7j6L64k09q5J33K44k84j63J59J12r6J70k25J02n7R6
$$ 103 -108 -121 -94 198 0 -75 -142 -158 206 -3 -88 45 289 5 -158 1 113 17 187 -38 64 7 103
3588A03m5P4k99K62r4P1J11k04K29l80L66j75j77J81l18L02O5j03J63pj66rJ25
$$ 103 58 132 -167 95 1 72 183 -21 208 -172 194 19 -158 23 -295 7 72 -31 132 125 -41 -50 75
3611G5o6n0j7ON7m0j23K17k65P9oM2K70j33J23l43J85l7J2o6O9J2m4K83m49K1
$$ 75 9 -41 -58 -52 5 -35 -158 59 -206 -127 -133 -91 179 46 169 -174 11 -26 -14 -80 -11 1 -43 240 -209 -188
3637a88K93K0k3j32o7M9K97k15m6J46k85j7M2K6K08R9k64j04J55N7J83k32K61
$$ -188 105 125 102 -30 -97 -48 249 34 -12 134 -151 -168 -126 -100 108 207 -57 -161 -6 51 234 2 263
3660B63l37O8k17J62o3J37J12N4j49j6M92r88M80k32M1K56j34o20N82j5j40L62
$$ 263 -74 -6 -223 -61 -124 13 125 179 30 14 506 -482 -2 -234 -193 63 -71 -691 -109 -124 -264 98
3682I8k33j56M17m32J96J25j57Q6k01k6M94l08j25J13k29Q44m01n94M54k35L22
$$ 98 -135 -291 126 -306 -110 15 -142 -56 -257 -283 211 -97 -222 -109 -338 506 105 -489 -35 -270 52
3703E2RN5j39J59m70L08j87K40O4m08L14j94K14l1J51m07M88l57j82P5J95K61
$$ 52 61 116 -23 136 -334 -26 -213 27 91 -317 -3 -197 17 -14 137 -270 218 -139 -321 -246 -51 210
3725B10k48J40O8O3k69J5J59p3L8k28K88k63m0J33N7r2j6K42O3k48m4K85m20M86
$$ 210 -38 102 170 233 -36 -21 138 65 103 -125 163 -100 -140 -7 50 -42 -58 184 247 -1 -45 240 -180 306
3749C06k10n2j75L35r2J04l05j34J33n4J71R0k61L70j46j98j7K96k08o9k2L5r3
$$ 306 96 44 -131 204 112 216 -89 -223 -90 -144 27 117 -144 226 80 -118 -135 161 -47 -116 -138 -103 -196
3772a96M09k73OqMk58J08J58J1O6l59J73M3J2J64j68M8J64l2m9Q8r8J89p0k56
$$ -196 213 -60 -54 -62 -58 -316 -208 -50 -39 27 -332 -159 -116 -104 60 -108 -60 104 72 23 111 13 202 132 -124
3797a24R2q1K08j67J58k22J61N4J03j87J8j7J67j27K0K0k6j57L5J57J55k33K3
$$ -124 -32 -113 95 -72 86 -136 25 79 182 -5 13 -4 163 36 56 76 50 -107 -72 85 240 7 30
3820C0Q4P4j95J68l3k34j21N9%L28l18P1k2J7p8J06Q3J08l00J58j42q9J62p9J83
$$ 30 114 188 -7 161 128 -106 -227 -168 -168 160 -158 -87 -109 -92 -170 -64 19 127 -173 -15 -157 -246 -84 -163 20
3845B0r5J8K25k30O2J06j91J6o5m6n5K13P4l77O81l01MOR9o0o8J34M7k54K5K61
$$ 20 -75 -57 168 -62 0 106 -85 -69 -134 -180 -235 -22 52 -325 356 55 59 65 164 104 36 170 217 -37 -12 249
3871B49l47O0K12l3l28L24j44j55R5J54J9r5p0m9J2K19n6J6q3J81P9j84M1P0j68
$$ 249 -98 -38 174 141 -187 137 -7 -162 -67 87 106 11 -59 -108 -96 123 67 83 0 181 260 76 117 187 19
3896A9RN0j60n2K98k4j54P8j54P9N9q3J69j19j3l0j2j92J57j15J22k4m0J69J30
$$ 19 28 78 -82 -134 164 140 -14 64 -90 -11 48 -35 134 15 2 -28 -40 -232 -75 -190 -68 -92 -132 37 167
3921A67p1m0N8j54R7j44K00m46L35j6l2J52q8k88K25P3j14K49j96J45J1k91O3
$$ 167 96 56 114 -40 57 -87 113 -333 2 -14 -46 106 18 -270 -45 28 -86 163 -33 112 123 -168 -105
3944a05Q5O4j52J30r7J20j46L06j11j15K48l17m9J0M9J33M4j32o0J90P1k76K91
$$ -105 -20 44 -108 22 -75 45 -101 205 94 -21 227 -90 -139 -129 -80 53 97 -35 -95 95 166 -110 181
3967A81k51J00k29J83k9J15m0p2J33j88K10o3j29J87L7Ll20K57r3n2K8j42j5j0
$$ 181 -70 30 -199 -16 -45 70 30 -42 91 -97 113 50 -79 108 145 148 -172 85 -8 -60 -32 -174 -189 -199
3991a99j16K41J38n0K5j10j5j74K24r1K70j38k53K00j26J01K36l7l67K43j08Q
$$ -199 -315 -74 64 14 39 -71 -86 -260 -36 -127 143 5 -248 -48 -174 -73 163 126 -241 2 -106 -98
4013i8J01l6J43Mk24J34l6m8O4j16J01j23J19K44k80r5P3J33L5N2rk70J14pK8
$$ -98 3 -33 110 114 -110 24 -12 -60 4 -112 -11 -134 -15 229 -51 -146 -73 60 95 147 138 -132 -18 -25 3
4038Ck3j9J76Q8l13R0J03j39Q4l14K12KqQ6j77q6J30J35j16M0j9O8o4J37p0J0
$$ 3 -20 -39 137 225 -88 2 105 -34 50 -264 -52 -50 -58 28 -149 -235 -105 30 -86 -46 -65 3 -61 76 6 16
4064A6Pp0K17q6k07L7P8K44k75o9K80k68N8k6j5N3J58j30L1q9lO7Q2p1k53L11
$$ 16 23 -47 170 84 -123 -86 -8 236 -39 -108 172 -96 -38 -64 -79 -26 132 2 33 -56 -59 8 90 19 -234 77
4090G7o6l5K00j75O6j61PJ9l3J62k2p6M7o6J58n6j63J27PJ47k71l1l2J22K01M3
$$ 77 11 -24 176 1 67 -94 -87 -68 -101 61 39 -37 10 -56 102 46 -117 10 17 164 -107 -138 -170 -48 153 196
4116A96k80O4K11m85L43j45K41j16j35JJ62j04j55N3K67q3QJ12j92K45j89p2r2
$$ 196 -84 -20 191 -294 49 -96 145 29 -106 -105 57 -47 -202 -149 118 35 43 155 -37 208 19 -53 -145
4139a45N6J30j17J37k60K09k40J34K2K6Q4k2P0j17j07j29K11K09l39J87K31l71
$$ -145 -89 41 -76 61 -199 10 -230 -96 -74 -48 36 14 84 -33 -140 -269 -58 151 -188 -1 230 -141
4161a41R5Q0m6j92J61J26P9r8n0N5j12j9J02N0l5o8K44j22r2J18o3N5K2q3L1p
$$ -141 -46 34 -12 -204 -43 83 162 64 14 69 -43 -62 40 90 55 -13 231 109 17 135 72 127 149 66 97 90
4187I0p4J27k2j57n8j86L96j64K11k54K57j59j49J97j78p5K55j67L1J01o8Q7m7
$$ 90 16 143 121 -36 -94 -280 116 -48 163 -91 166 7 -142 55 -123 -198 57 -110 -79 22 -46 41 -6
4210fK33j34j73k1J0N1j82J56j65o4L53m6K01LJ8k20K36k19j40N8J06Qn7k1p6
$$ -6 227 93 -80 -101 -91 -40 -222 -66 -231 -295 58 12 213 216 234 14 250 31 -109 -51 55 63 6 -15 -91
4235i1K37L7j10j22L08j08l42P3K85k67J15k06L0J33J72q8j1J10k64J74k46K10
$$ -91 146 183 73 -49 259 151 -191 -118 167 -100 15 -191 -161 -28 144 56 45 155 -109 65 -181 29
4257B9n5O5p5R7j15K12k15j17L49k31J8l8K82l05K1J05k82N76k69j6O9R0k56J16
$$ 29 -26 39 -36 61 -54 158 -57 -174 175 -56 -38 -76 206 -99 -78 27 -255 321 52 36 105 195 -61 55
4281E5Q9j73K37l21j72K09K12j65j13k1L8j9K23p7J68j32j6j82k9M1J10K55j35
$$ 55 144 -29 208 -113 -285 -76 136 -29 -142 -163 -125 -144 79 2 170 38 22 -160 -189 -148 -38 217 82
4304H2l3j70nK62j69Q8l4QN2j51L2J69K6p8Nn2l6J93l57K01J30k92L04k00r9%
$$ 82 49 -121 -126 136 -33 55 21 29 81 -70 -38 131 157 79 84 32 -4 189 -168 33 163 -129 175 -25 -124 -124
4330a24J89R8N6j94oK3J76J03l71LL46k25k31K95j42j0k38L40j16rK1l8J53j07
$$ -124 65 163 219 25 19 42 218 321 -50 -47 299 74 -157 138 -4 -14 -252 88 -28 -37 -16 -54 99 -8
4354hr5J6n6K85k11J86j62R3j49J64j28J61J16k02J1N0m25L21P4J71k40k98K21
$$ -8 -103 -87 -143 142 -69 117 -45 48 -101 63 -65 96 212 10 21 71 -354 -33 41 212 -28 -326 -105
4377a05K9k1q7O1K60j40j20K2L61m81K72N4n2q5J61j03j5K1k00K50J14j85J5N1
$$ -105 -76 -97 -184 -123 137 -3 -123 -101 260 -221 51 105 53 -32 129 26 11 32 -168 82 196 11 26 77
4401G7n1n3K34l22K60k32R0Kq5L14k64K83m7k72J54l27L69r2k62N3J98o8M4Q4
$$ 77 26 -27 207 -115 145 -87 3 5 -80 234 -30 253 206 -66 88 -239 130 38 -224 -171 27 -41 3 87
4425H7qp1k06M11m78K50P2j46k3J68K5j98o5J01k5N3j4l1K17j75r7l0K66l80L36
$$ 87 79 8 -198 213 -265 -15 57 -89 -112 56 81 -117 -182 -81 -106 -53 -67 -98 119 -56 -153 -183 83 -297 39
4450C9n7Jl1L1J28o9q0qJ87O4l58P3O5r2R1k5K14j51m0J07O5k0j03J66j33j20
$$ 39 -18 -17 -48 -17 111 42 -38 -46 141 205 -153 -80 -15 -107 -16 -41 173 22 -18 89 154 134 31 197 64 -56
4476e6L2P0j81Q2J33j10J56j25J28m0l3m0J71l41J63R9l64K90J3N5q1K31qj67
$$ -56 -24 46 -135 -53 80 -30 126 1 129 89 56 16 187 -154 9 108 -256 34 47 102 21 252 244 77
4500G7m5k81K82J17k93L21k14J0j94K10N5o8l2N7j25j67M30l5k08K05j33J37j13
$$ 77 32 -249 33 150 -143 178 -36 -26 -220 -10 45 -23 -55 2 -123 -290 140 105 -103 102 -31 106 -7
4523gk92J05J35K01P2j21m0J90l57K78j00J5j50K10k22K41k22N5J30q1J37l21
$$ -7 -299 -194 -59 142 214 93 53 243 -114 164 64 79 -71 139 -83 158 -64 -9 121 40 177 -144
4545a44N6J60O3k08K4jJ77J05r6J04j86Q0j40K4j18p2M77k78n4K33k91K30K0K9
$$ -144 -88 72 135 -73 -49 -50 127 232 136 240 54 134 -6 18 -100 -172 305 27 -27 206 -85 145 165 194
4569A94j14l9J98k34k1L1n2n4K70k67K62J05k65k2J01k24K79j13K9k35J9J50j80
$$ 194 80 41 239 5 -16 15 -37 -91 179 -88 174 279 14 -8 93 -131 148 35 64 -171 -152 -2 -182
4592a82J42j4Q7Q4j05j32L05q9j95M19j98k03N7Q1m5J32k7J31j61j14Q9p9K11
$$ -182 -40 -54 33 117 12 -120 185 96 -99 320 122 -81 -24 57 12 144 117 248 87 -27 62 -17 194
4615A94j12J37l30J74j81j44L27k53Q8K57k09JK62j59j74l7J69J3M7L6k16K16
$$ 194 82 219 -111 63 -118 -262 65 -188 -100 157 -52 -51 211 52 -122 -159 10 23 70 106 -110 106
4637A06k2j13J28l2j34J1J38QN1j92K3j89J25j27L38j25L02k76J3kO0j41P9J36
$$ 106 84 -29 99 67 -67 -56 82 90 141 -51 -28 -217 -92 -219 119 -6 296 20 33 31 91 -50 29 165
4661A65j94K7K23k28L5j59l3J35o0j11K90k0k42j01L27P4p4o8l5j61RR5k24L01
$$ 165 -29 -2 221 -7 28 -131 -164 -29 -89 -200 90 70 -172 -273 54 128 54 -14 -49 -210 -201 -106 -330 -29
4685b9L8J4J6k4%j04P9Q7j01j13N3K5q2K09p0O2l8j09J00K24n43L71j24K34m8
$$ -29 9 23 39 15 15 -89 -10 77 -24 -137 -84 -59 -141 68 -2 60 22 -87 13 237 -306 65 -59 175 127
4710A27k43J66j76L71L5j57j10J20p4o0o2j36K89j39M8R8j79J36l8n9K22k21J44
$$ 127 -116 50 -126 245 280 123 13 133 59 -1 -63 -199 90 -49 -1 97 -82 54 16 -43 179 -42 102
4733A02r0K01k11p6k5O0M0n4j41K93k02nJ26j68K19j46K14k79mJ86L4o2K24o9
$$ 102 12 213 2 -74 -99 -39 1 -53 -194 99 -103 -108 18 -150 69 -77 137 -142 -146 40 74 12 236 167
4757A67l13J9K9j26K79j61N2M8M9J40j17j57N20l51k16L19l10J10Q2j5l1N7j14
$$ 167 -146 -127 -98 -224 55 -106 -54 -6 43 183 66 -91 429 78 -138 181 -129 -19 63 48 17 74 -40
4780d0R4q5P1O7nJ64n11J61J91k97K75k64K94l28K18j63K66j07L1q5J31j56R6
$$ -40 54 -31 40 107 102 266 -245 -84 107 -190 85 -179 115 -213 5 -158 108 1 32 -53 78 -78 18
4803A8p5N6L0m1q5J89k53J44L1j57J43J36j52L7J53M4r1j24m4P6p1K03j87l5j5
$$ 18 -57 -1 29 -12 -97 92 -161 -17 14 -143 0 136 -16 21 174 218 127 3 -41 35 -36 167 -20 -55 -70
4828g0J5j08K11L2l15J70K51j24j89K71J1j42J52j26k9J08N5j03O8o4n8n2j20
$$ -70 -55 -163 48 80 -235 -65 186 62 -127 144 155 13 165 39 10 118 173 70 138 74 16 -36 -156
4851a56J77J29j75j69L81j94J12r3M6L4j81j05M9n0L19L4j4j40m7q7Q7O6K0n4
$$ -156 21 150 -25 -194 187 -7 105 12 58 92 -89 -194 -145 -195 124 158 144 4 -43 -130 -43 23 43 -11
4875a1k18K60J5J6k36K69r3J10r5k25J33j8O6J76k26J44q3j29K30Jk39NJ59j13
$$ -11 -229 31 46 62 -174 95 2 112 17 -208 -75 -93 -27 149 -77 67 -16 -145 85 86 -153 -148 11 -102
4899a02J62o1R6j12J06l53J75J37m7J20j27J68q5m9J78j61J17j40Po1K33l25N4
$$ -102 60 -1 95 -17 89 -264 -89 48 1 121 -6 162 77 28 206 45 162 22 29 -32 201 -124 -70
4922g0n1L04k84J59j01K16k24n9O0J32Nl30J95l9K24k13P5k8j8oj84J57q4J58
$$ -70 -121 183 -101 58 -43 173 -51 -110 -50 82 87 -243 -48 -87 137 -76 -1 -29 -47 -53 -237 -80 -164 -6
4946fL2J02nj06J73m20L52j25J4J4M2o9j7m7P5j17Q1j28O6J10j39J1L62k63R5
$$ -6 26 128 123 17 190 -230 122 -3 11 25 67 -2 -19 -66 9 -108 -27 -155 -89 21 -118 -107 255 -8 87
4971H7p6j27J38N6l0rk33M7K25N6j50O7j6Qj4J4l9J6J22j66K44K6m66K7K31Jn2
$$ 87 11 -116 22 78 48 39 -194 -147 78 134 -16 51 35 43 29 43 4 20 142 -24 220 246 -220 -193 38 39 -13
4998a3j09O1J15l2J02K2k07K4J57j16j0q2o8J25m9M9j09J27n1M1k3N3j23J15j31
$$ -13 -122 -61 54 22 124 146 -61 -37 120 4 -6 -88 -156 -31 -80 -31 -140 -13 -64 -23 -46 7 -116 -1 -132
5023a32K80P9j10m70L72on8J99k47J88J3k44j29L63k46L6O5L2j85Q5J44r6J64
$$ -132 148 227 117 -353 19 13 -45 154 -93 95 108 -136 -265 98 -148 -112 -47 -15 -200 -115 29 -67 97
5046I7k52L09j69j10j43J45M9j32M98m59J28n4R1Q7j8P7q6N6j30j63K79j35N6
$$ 97 -155 154 -15 -125 -268 -123 -74 -206 292 -167 -39 -93 -2 85 67 144 58 114 -16 -179 100 -35 21
5069B1m4o1L60m34J62p9J98k13N4M0k4j13L55q8j66J61l66K53J02j29P0p5j40
$$ 21 -23 -84 276 -158 4 -75 123 -90 -36 4 -20 -133 222 134 -32 129 -237 16 118 -11 59 -16 -156
5092a56MJ37J64j59J44k25j16j77K20P4J30qo3k16J97J19j14l3J59Qj89N6P9l9
$$ -156 -152 -15 149 -10 134 -91 -207 -384 -164 -90 40 32 -31 -247 -50 69 -45 -78 81 89 -100 -44 35 -4
5116dR2o9o8J20o0l0N3j84J72l46K55J03rR6j86l5M4j89L20K50m58L29k47J0R3
$$ -4 88 19 -49 71 11 -19 34 -150 22 -324 -69 34 25 121 -65 -100 -56 -245 75 325 -133 196 -51 -41 52
5141E2J45j93j39L24k77J55N1o3J28m48K98J95n5q7l01K05K5Q9j45J6j75J91P8
$$ 52 197 4 -135 189 -88 67 118 55 183 -265 33 228 173 86 -215 -10 15 104 -41 -25 -200 -9 69
5164F9j85L69l18j75L06M3j51J20p6N4j19N9m3m0K8JJ57l63K44m1J50l12J55J7
$$ 69 -116 253 -65 -240 66 109 -42 78 2 56 -63 -4 -47 -87 -59 -58 99 -264 -20 -61 89 -223 -68 -51
5188e1J47j86M0J47o0r1n9K58k07N6j09L16l22J04l0J2L6l8J48p8J33q0k8n6K00
$$ -51 96 -90 -50 97 37 -54 -113 145 -62 -6 -115 201 -121 -17 -47 -35 1 -37 111 33 166 86 58 2 202
5213B02k03N1J52k8j66oM9j98O3P7J01J12l02Q7M0P3j5j03Nj11k38N01j49N4j2
$$ 202 -1 50 202 174 8 2 51 -147 -84 -7 94 206 -96 -9 31 104 89 -14 -9 -120 -358 143 -6 48 36
5238C6K40m5l85L67j71N5l60M41j73l6k42L20q8n4m0J5J93l79J63L35j90R1n7
$$ 36 276 231 -154 213 42 97 -263 178 5 -31 -273 47 -41 -95 -135 -120 73 -306 -143 192 2 93 36
5261C6j7K7k77K10l5k34M96k44ON5k9J27l4j21K06j33n4L0j01J49j39r3K12j39
$$ 36 19 46 -231 -21 -56 -290 206 -38 -32 23 -6 121 87 -34 172 39 -15 15 -86 63 -76 -169 43 -96
5285i6M0L1J3J98k70J76j32K96l80L12j68O1j30J01j8n0J49l19M02n82M12k00
$$ -96 -56 -25 -12 186 -84 92 -40 256 -124 188 20 81 -49 52 34 -16 133 -186 216 -366 46 -154
5307a54p4L48j99J69q2Q6q8N5L0M9k43N9J29l76L29k7j68rJ57K99j04o2l20K64
$$ -154 -228 120 -79 90 8 94 6 61 91 140 -103 -44 85 -291 38 11 -157 -166 -9 290 186 124 -196 68
5331F8j04O9J82k4k64M86m19Q9O7j59j59J75j6k45J61J37k07J67l88L58m60N69
$$ 68 -36 33 215 191 -73 413 -6 83 150 -9 -168 7 -9 -254 -93 44 -163 4 -384 -26 -486 83
5353H3J4j97j75L00j35L13o0J82o22N47K1m66k37J001j49l98p9k1mr3N58n56L49
$$ 83 97 -100 -275 25 -110 203 143 325 -297 250 271 -195 -432 569 420 22 -57 -78 -82 -175 383 -173 176
5376A76j00P1O25l21r54O01N48m33k76q8O04l73q20J238m67J54j91J20m2j73Q5
$$ 176 76 147 772 451 -503 98 646 213 -63 -151 453 80 -740 498 31 185 -6 114 72 -101 -16
5397a6q5K1J10j80L55l11j02K51j36n4K01j02%L10j58k40J7J82O1l25K14k8ml2
$$ -16 -101 -80 30 -150 205 -106 -208 43 -93 -147 54 -48 -48 262 104 -136 -119 63 124 -201 13 -15 -19 -51
5421e1j8J97k53J41j21L1kK27O8m30M10j56O3k79L34jj6r0n0j80J36Q2J42n3J36
$$ -51 -69 128 -125 16 -105 -74 -76 151 219 -211 199 43 106 -173 161 160 144 54 4 -176 -40 42 184 131 267
5446B67k8k00K69l20j76J50%J4J38p1l7k0j09Q4%j39K04m6J9K2j9N6p2p4O7J2
$$ 267 239 39 308 -12 -188 -38 -38 -24 114 43 6 -14 -123 -39 -39 -178 26 -20 -1 21 2 58 -14 -88 -21 -9
5472iL6k52K90n1l9J74j92R8L3j55r1J5K74k02NK10l05K30j9k63K34L1k03RJ55
$$ -9 27 -225 65 14 -25 149 -43 55 88 -67 -158 -143 131 -71 -66 144 -161 69 50 -213 21 52 -151 -142 13
5497A3k78K21J04j00j22K4K09k34Q2J48j78N3J69q3p0J9q4J29j45O1J8L42m19
$$ 13 -265 -44 60 -40 -162 -138 71 -163 -81 67 -111 -58 111 28 -42 -23 -107 22 -123 -62 -44 298 -121
5520a21Q8Q7R6Q5j75j77J40rn4L8j01J35o6m6L72o0k79N0J16O7j76J18R0r9o8
$$ -121 -33 54 150 235 60 -117 23 14 -40 -2 -103 32 -34 -80 292 232 -47 3 119 186 10 128 218 119 51
5545E1j50J08P9k61J00K09k85r3J76J29k45J26rr1j51J44J32LOn9LJ23n1l81M00
$$ 51 -99 9 88 -173 -73 136 -149 -242 -66 63 -182 -56 -65 -156 -307 -163 -31 -28 -22 -81 -78 45 -6 -387 13
5570A3O5j97J26p5r1K12r8OJ71j47K6q5%j05L41m07J06l3J06J54j00K24k16J41
$$ 13 78 -119 7 -68 -159 53 -45 -39 132 -15 11 -74 -74 -179 162 -245 -139 -172 -66 88 -12 212 -4 137
5594A37j65J05K1L0p8Q9p2P7k93K62k29J20L7p2j36J10r5J85j88N1L84m09J90
$$ 137 -28 77 98 128 50 139 67 144 -149 113 -116 4 41 -31 -167 -57 -152 33 -155 -104 280 -129 61
5617F1m6J05k67K68j0Oq6j11K35k70O2p0R7M3L5J87k25j88J26K78j72j16l8P4
$$ 61 15 120 -147 121 111 117 31 -80 155 -115 -53 -123 -26 17 52 239 14 -174 -48 230 58 -58 -96 -22
5641b2j28NJ98p9k5j09J19j58K64j01Q1n1R7j48j19L02k7j63P5O2j20J20K5j29
$$ -22 -150 -145 53 -26 -51 -160 -41 -199 65 -36 45 -6 91 -57 -176 126 99 -64 11 73 -47 73 98 -31
5665c1P8l82L29J16J50k97o3K28L3j29P7K7m4k31L4K10m7j11O6k3J97j91k74J52
$$ -31 47 -335 -6 110 260 -37 -100 128 161 32 109 136 92 -139 -105 105 58 -53 13 -10 187 -4 -278 -126
5689a26J46L0q2Q4k31L40j25j35j06K49n1q7L83k62K6J2l2j18K64l97J80J41j26
$$ -126 20 50 -32 52 -179 161 36 -99 -205 44 -7 -94 289 27 53 65 33 -85 179 -218 -38 103 -23
5712b3K98l34J08j72O2k5K49k38J71P3j42k07L6J96j92J01J53j72K82m2Rj95k0
$$ -23 275 -59 49 -123 -61 -86 163 -75 96 169 27 -180 -144 52 -140 -39 114 -58 224 182 191 -4 -24
5735b4J81j94r8J12n1J43j86J22kq3l5J41nJ40o4j11J40k06Q8J15k44J67o6Q6
$$ -24 157 -37 -135 -23 -74 69 -117 5 3 -80 -115 26 21 161 97 -14 126 -80 8 123 -121 46 -20 66
5759F6m2j74J24L8LNK13j60j57m4j2J17P2m5j01K26m9r4O7J25k8j32l11M23ql51
$$ 66 24 -150 -26 12 15 20 233 73 -84 -128 -140 -23 49 4 -97 129 80 -14 53 178 150 18 -293 130 122 -229
5785b29M31l1j86o2J75j47K56J99m03r8j54L74k29J66p5J66j42J34k97J60K6n4
$$ -229 202 171 -15 -77 98 -49 207 406 3 -95 -249 125 -104 62 -13 153 11 145 -152 8 34 -20
5807b0J8M4K4q8J01j90J92q4j41L07kj26M6k4R5n4j13J39k12J0Jj30K58j2J77
$$ -20 -2 42 66 -22 79 -111 81 -3 -144 163 161 35 81 57 152 98 -15 124 -88 -78 -77 -207 51 39 216
5832B16k96K14n2p6L1Mr5QK50r4j51J04l31J62K80j34Kj76J46o9n5J84J00l12
$$ 216 -80 134 82 6 37 41 -54 -46 204 110 -41 63 -268 -106 174 40 42 -134 12 -57 -112 72 172 -140
5856a40J42lQmj26P1J19j70R4m17M13J0J00j84j82M22k2j09k63o1J66O5J27J88
$$ -140 2 -1 7 3 -123 -52 67 -103 -9 -426 -13 -3 97 -87 -269 153 131 22 -241 -302 -136 -71 56 244
5880B44l98J55L15m49M23j84n26P39k09k46N02m20k32N62j28j37m39K86O9j29
$$ 244 -154 1 316 -133 290 106 -420 319 110 -136 366 -54 -286 276 148 11 -428 -142 -73 -202
5900b02J01J05k72L55N3m49M03J62l07N15o78j48N50j40r1m38K67j2J72J79m32
$$ -202 -101 4 -268 87 140 -309 94 256 -51 464 -214 -362 188 48 -43 -481 -214 -226 -54 125 -307
5921c07J39l89J164o22m0L86k26L93q71R55k69j68j13Rk67K13L84k18k41N5k72
$$ -307 -168 -557 607 -15 -55 331 105 498 -373 582 313 145 32 41 -226 -13 371 153 -88 -33 -305
5942c05k60J035k63o08L20K84k02K67p12L18J27n47M84n5l03K32K36j72K63J7
$$ -305 -565 470 207 -401 -81 203 1 268 -444 -126 1 -546 -62 -117 -420 -188 48 -124 139 156
5962A56j96J64k38J52K00j00J6R7k4j02P3k26k03J05K09J46k47Q5j08K73m12K07
$$ 156 -40 124 -114 38 238 138 154 251 227 125 198 -28 -231 -126 83 229 -18 67 -41 232 -180 27
5984B7j47K39j65l7P7N3k52J47L04l78J26m3J45l09N0%Q4k26J93L4J10k33N4J12
$$ 27 -120 119 -46 -83 -6 47 -205 -58 246 -132 -6 -49 96 -213 -163 -163 -79 -305 -112 -78 32 -201 -147 -35
6008c5K62l13R0N8M2J09k13J36o5o8M6m6k0n2L9N3j06j59K57k98L01m4l6J3M3
$$ -35 227 -86 4 62 104 213 0 136 71 3 49 3 -17 -69 -30 23 -83 -242 15 -283 18 -26 -62 -49 -6
6033fk8N4J00k08j20K81k72M18j40J84j18k42K51j80N7k63L23j30J29j21p6P6
$$ -6 -34 20 120 -88 -208 73 -199 219 79 263 145 -97 154 -26 31 -232 91 -39 90 -31 -107 -31
6055c1Q8M0r7j72J42J90j92k9m8o9K07P2J6j62M7K53k70Q0j33k00O30k81N2k8
$$ -31 57 97 0 -172 -30 160 -32 -61 -109 -178 29 101 117 -45 2 255 -15 65 -68 -268 362 81 133 105
6079A05j33K1q4o3J02K35p9J21j78k69J10j36L20l09M88k91J42L2r3j13L0j02
$$ 105 -28 -7 -91 -154 -52 183 104 225 47 -222 -112 -248 72 -237 251 -40 102 134 41 -72 -42 -144
6101a44R8M2K02j53R5p2J9J0J18j43k98K72n7k12L38j78J74k22J21q0q1l6J05
$$ -144 -46 -4 198 45 140 68 87 97 215 72 -226 46 -11 -223 115 -63 111 -111 10 -70 -151 -187 -82
6124h2M3j1J46k91L11l7o1j13J78k4m2j11N3Q1j38K60j43K8jj70p7P9J12N5n5
$$ -82 -39 -50 96 -195 116 79 18 -95 83 59 17 -94 -41 40 -98 162 19 47 46 -124 -201 -122 -10 45 -10
6149a0KjlJ11l3L0k11MQL03m35K42n8M6j04J94L9j16Q8K7J54n37L21Q8k13P7J5
$$ -10 -8 -9 -12 99 66 96 -115 -111 -103 200 -235 7 -51 -5 -109 85 124 8 96 123 277 -260 61 149 -64 13 28
6176B8k5Q0k09J96j26J0n8LL0K04j73j8j48l1L14m3k32N07k55O8r4K7q3Q8P3p3
$$ 28 3 83 -126 70 -56 -46 -104 -101 -71 133 -40 -58 -206 -237 77 34 -198 309 54 122 28 55 -28 60 133 60
6202F0o9O7o8J9L3L3J95k96RJ65k2k11J68P7j21j25p7L35m03J45j93K57n7O2n2
$$ 60 -9 58 -10 9 42 75 270 -26 -17 148 126 -85 83 160 39 -86 -163 172 -231 -86 -279 -22 -79 -17 -69
6227f9K81q9r5J22q7O4m6rk88j6K57Q7j26k6K0R4J45k22l1L3j72J8R7M5m7o8J07
$$ -69 212 123 28 150 63 127 81 72 -216 -232 25 112 -14 -40 -20 74 219 -3 -34 -1 -173 -155 -58 -13 -60 -128 -21
6254b1M9j71M04r0k02j02M8J58L4J74k76j3j58M28j5j89j4J75k24Q6m5m5K10j29
$$ -21 28 -143 261 171 -31 -133 -85 73 107 281 5 -8 -166 262 247 58 44 219 -5 81 36 -9 201 72
6278G2o2q0J28N5J27k07N2Rk06J54j25P1j14q0P1J7P8l2J11k9q9j18M59k70k18
$$ 72 10 -70 58 113 240 33 85 94 -112 42 -83 -12 -126 -206 -135 -118 -40 -72 39 10 -79 -197 262 -8 -226
6303b26M2J85J41r1o8J00J7k06J29o7O5Qq0k5M1j17L92k02R3j88L4j64J93j60
$$ -226 -184 1 142 51 -17 83 100 -106 23 -44 21 29 -51 -76 -35 -152 240 38 131 -57 -23 -187 6 -154
6327a54J26m4L2K4K4j8m7J26l04o2M9P2K33j60J49O1n1n4R7k58j01J33n2K29L3
$$ -154 -28 -72 -40 -16 8 -10 -57 69 -235 -297 -248 -176 57 -103 46 107 56 2 99 -159 -260 -127 -179 50 83
6352H3o4k54K37N9k08K05j67L5J62k51K0O1J26j02L91j17l09j39N6j13L59p4l
$$ 83 19 -235 2 61 -147 58 -109 -74 88 -163 -143 -82 44 -58 333 216 -93 -232 -176 -289 70 -4 -7
6375gN58K02o11m14L78o83N62Q5J20m67L7P27p02j5K14j24O07p64O74j94o21k10
$$ -7 551 753 142 -272 106 -577 -15 70 190 -277 -240 487 -215 -230 -16 -140 467 -297 377 183 -438 -648
6397f48K59K6N23K4J46q74M9J054m14k12o33R72M06o10n65J082j024N18N25n49
$$ -648 -389 -363 160 184 330 -544 -495 559 145 -67 -700 272 678 68 -497 585 -439 79 604 55
6417E5k17J64K46l73L7N06o69Q86n39K12J55n98j30k20K4M49k50N44n11J45j22
$$ 55 -162 2 248 -125 -88 418 -251 635 96 308 463 -135 -265 -485 -461 -12 -262 282 -229 -84 -206
6438b06K92j8k03R1J38rj0q8j61J9K13m5k90j50L95k76L99m52N36l82K47L00k87
$$ -206 86 68 -135 -44 94 85 75 -13 -174 -155 58 13 -277 -427 -32 -308 91 -361 175 -207 40 340 53
6461E3K22m30J04O08n76o6R42n68j122J181j49j14j61l34K89j74j39Q65o14p4
$$ 53 275 -155 -51 557 -19 -85 857 289 -833 348 199 85 -76 -410 -121 -295 -434 431 -183 -257
6481b57J05L12K7l90JJ76K5lK0R9j14J73l67M9L45r1j44k1k8K86m9j92J75k6k02
$$ -257 -152 160 187 -203 -202 -26 -1 -4 16 115 1 174 -193 -144 201 110 -34 -55 -83 203 154 -38 137 111 -91
6506i1J15J38j93J9k6j96M68k04j9n1K10j86K00q7j07O5P4l95L81k18J41O4m1
$$ -91 24 162 -31 -12 -38 -234 234 30 11 -40 170 -16 184 97 -10 55 129 -266 115 -103 38 102 61
6529F1RQ1k45N5P8K61k55N1lj5j88o0J66J95M7n33Q4L72j0j59j95K28J21l26K27
$$ 61 70 151 -94 -39 39 300 45 96 93 78 -110 -170 -4 191 238 -295 -211 161 151 -8 -203 25 146 -180 47
6554D7n3J8j89N0K21J3k05L2J5mk38J69j76K50n0J69j91N7L86l02r3No1L05j06
$$ 47 -6 12 -177 -127 94 107 -98 -66 -51 -55 -293 -124 -300 -50 -100 69 -122 -65 321 19 -74 -69 -130 175 69
6579F9mj25K34j23k14L80k42J23k0j53M9L1O1k13Q3J14L8O9k61K62o3j05M3j13
$$ 69 65 -60 174 51 -163 217 -25 98 78 -75 -26 5 66 -147 -64 50 88 157 -104 158 95 -10 33 -80
6603h0KN7Lo9n6LL01k37l2O9n4K03j77O3OJ06L3j13J63l26J17j40M2J60Q5k4k9
$$ -80 -78 -21 -18 -87 -143 -140 161 -76 -108 -39 -93 110 -67 -4 2 108 141 28 191 -135 -18 -158 -116 44 129 105 76
6630G6j29o0R2J70q1k21J72pj36J82k7j50J22P0j6J17j57k25L10l6o1J61l34K25
$$ 76 -53 -113 -21 149 68 -153 19 12 -124 58 31 -119 3 73 57 174 17 -208 102 66 5 166 -168 57
6654E7k50J22J6o5K72k80R2O0j67K40j69J57k02J80l9Q0o8kQ3L5n0l2j41Q3j22
$$ 57 -193 -71 -55 -120 152 -128 -36 24 -143 97 -72 85 -117 63 24 104 36 34 117 152 102 70 -71 12 -110
6679a10K81k69K62j05R3j92Lj71J14L92j97j08K4J56j54j65J15k35L93k3m3m2
$$ -110 171 -98 164 59 152 -40 -37 -208 -94 298 101 -7 17 173 19 -146 -31 -266 127 104 61 19
6701A9L5qj47K53l07Q2j0j78K23J55N5Nk54L8R0J10j61m6j46K63k07K50Mk47K17
$$ 19 54 46 -101 152 -155 -73 -83 -261 -38 117 172 177 -77 -39 51 161 0 -46 -192 71 -136 114 118 -129 88
6726H8j29M8o9q5J84RO7j03j26j48K54p4N4J96j71o2J05m5j66L0M8Q6Q9l2J7j80
$$ 88 -41 7 -62 -147 37 46 113 10 -116 -264 -10 -84 -30 166 -5 -67 38 -7 -173 -143 -95 -9 80 48 65 -115
6752a15R6r5O7M1j7K16k83N4P8q1j46n3K68k02R7J77P1j18j02q1L00j52K88k71
$$ -115 -19 -114 -47 -6 -23 193 -90 -36 42 -39 -185 -238 30 -172 -75 102 173 55 -47 -128 172 20 308 37
6776C7oj6k7J63j23j37J27%l0n0K84k09o1K82k00n3K7j59M59j40n1p6j51J6J85
$$ 37 31 15 -12 151 28 -109 18 18 -12 -62 222 13 -48 234 34 -19 8 -151 308 168 117 41 -110 -94 91
6801I1j31n6K16Q0k37P3PqK0K14k22q4J46o8R7p4r1r9L13k62o7J37j15J59l9K2
$$ 91 -40 -96 120 200 -37 36 43 35 55 269 47 -37 109 41 138 64 -27 -126 187 -75 -142 -5 -120 39 0 22
6827B2L31l52Q1l6m4N0j07lJ00p0QL7j49J51Ko2N3l8q0K14o2q3J12J24k79M9J99
$$ 22 353 1 82 46 2 52 -55 -58 42 -28 -20 17 -132 19 21 -41 12 -26 -106 108 46 -37 75 199 -80 -31 168
6854A68k5l53J71L09k79r9l4R1j42J25M6J7R2j36M1J54Lj17o0Q1o7k6k38N17l40
$$ 168 143 -210 -39 270 -9 -108 -142 -51 -193 -68 -22 -5 87 -49 -8 146 149 32 -28 53 -14 -40 -278 239 -101
6879a01j03K46J04N8j31J9k07R2j77J40K53l15K08L1J5qk33K23k04K46k48O1Q6
$$ -101 -204 42 146 204 73 92 -115 -23 -200 -60 193 -122 86 117 132 124 -109 114 -90 156 -92 -31 55
6902E5k07J72n9L3J21rl91L68j9K2j13m4M9P0J04l92M64k77J50m7l1J2N7p2K08
$$ 55 -152 20 -39 -6 115 106 -285 83 64 86 -27 -71 -22 48 152 -240 224 -53 97 50 19 31 88 16 224
6927B24l94K39k87L05K4k73J91M7j00M6Q7k86J13J8n7N2J09j67J20j78J56R7j88
$$ 224 -170 69 -218 87 111 -162 29 76 -24 22 109 -177 -64 -46 -103 -51 58 -109 11 -167 -11 86 -102
6950a02J87l5j84K4P6j17K39k1j15r8K03O6m6k62J03K63j08j3k4m0M06j90l85
$$ -102 85 50 -134 -110 -34 -151 88 67 -48 -146 57 123 77 -185 -82 181 73 60 36 -4 402 212 -173
6973a73J90L7J06r0j32Pj5L21k46K18k08K30N7o01R0j74P19k95M5J38j60n1J34
$$ -173 17 54 160 70 -62 -55 -70 251 5 223 15 245 302 -299 -209 -383 336 41 86 224 64 13 147
6996A47k02K33PK66m89K22j37R3l16K02J65K3l52q0J6l4L39R0k77K42l13K17m
$$ 147 -55 178 185 451 -38 184 47 140 -176 26 191 214 -138 -218 -202 -236 103 193 -84 158 -155 62 58
7019E8o5J65l05L9k20N33l23K16j05K0r5P2J59k87J01Q4k3J32k72J19q6J24K9
$$ 58 -7 158 -147 -108 -328 205 -118 98 -7 13 -82 -10 149 -138 -37 47 24 156 -116 3 -83 41 70
7042G0l85M99m5l77M80j61N9j54J60m40L31j59K21q2L1L3k71J00K22j36j40L0
$$ 70 -315 184 139 -238 242 81 140 -14 146 -294 37 -122 99 17 48 81 -190 -90 132 -4 -144 -114
7064a14K7R0J85k0k67M78m85j43M16q3J47l45J69o1k28J96J8J0J69n1J0k95K46
$$ -114 -87 3 188 168 -99 379 -106 -249 167 84 231 -114 55 -6 -234 -38 -20 -10 159 108 118 -177 69
7087F9j64L18k08j07j10K23j50J26N9r5J2k6J3K49l27J8J68j56K84j02L5K0j71
$$ 69 -95 223 15 -92 -202 21 -129 -3 56 -39 -27 -53 -40 209 -118 -100 68 -88 196 94 129 149 -22
7110b2Q5J23nml0k36j02K07K8Q1j35p4J21k1m3J1l01L21J40k12m9M4p2K85j55
$$ -22 63 186 181 177 147 -89 -191 16 44 125 -10 -84 37 16 -27 -16 -317 4 144 -68 -117 -73 -145 140 -15
7135a5J91m08K83n4j43o6J32J76J42l46J96j17J05j11O5nq2J16P5R4l01J72o0
$$ -15 176 -232 51 -3 -146 -212 -80 96 238 -108 88 -29 76 -35 30 25 -57 59 134 228 -73 99 39
7158C9n6N9k4K03k26m1L42m23K04k5Q7j58J40J4m9N4j82K46k42K13j6k07o9j4
$$ 39 -17 42 18 221 -5 -46 296 -127 77 52 139 -19 121 135 86 140 -42 204 -38 175 159 -48 -117 -131
7182a31l9K89q2p3J0M9j36J04J41k59J13K58k39m7J38l3k61kM47k27N5k15J30
$$ -131 -170 119 37 -36 -26 23 -113 -9 132 -127 -14 244 5 -42 96 63 -198 -200 247 20 75 -140 -10
7205a0j11J20o2m1J33O1J96l36N7K9n1N1m7ON9rl9O4j09N1R4j51L6R4np9l0j72
$$ -10 -121 -1 -63 -104 29 90 286 -50 7 36 -15 36 -11 -5 54 45 6 70 -39 12 106 -45 -9 85 80 1 -29 -201
7233b01L32j4k28J45K04k82k4K42n0l3P9k85L1J47k8l96J96K20O2n0j52J48j38
$$ -201 131 117 -111 34 238 -44 -68 174 124 91 170 -115 -84 63 35 -361 -165 55 117 67 -85 63 -75
7256g5p6M51l92m6J83pk3J23m06K12O0K0J26l08P5m2J56l2K6Oj18K55k54KJ64
$$ -75 -151 300 -92 -138 45 38 15 138 -268 -56 4 24 150 -158 -83 -125 31 -1 25 31 -87 168 -86 -84 80
7281H0p8%N0j75J50P7q8L7j86K66L2l61K19J67k43N8J55k96m0K57K2m2l12J40
$$ 80 2 2 52 -123 27 104 16 53 -133 133 165 -196 23 190 -53 5 160 -136 -176 81 103 61 -251 -111
7305a11P2J04J85k19R8j5r8k39K21j09J10o2J50N3k68M4K07m27M72l6J02j92K76
$$ -111 -39 65 250 31 129 114 16 -223 -2 -111 -1 -63 87 140 -128 -84 123 -304 168 132 234 42 318
7328C18k69j08J61J06j07J84m97L32k40J6N16j37o56N21r0j32N48k31j81n59N48
$$ 318 49 -59 102 208 101 285 -212 120 -120 -104 412 275 -381 140 50 -82 466 235 54 -505 43
7349D3k61J20L05l23j04o0j20N10m03N45k3m83j9L33m59k51M33Q6k46P71n12K53
$$ 43 -218 -98 207 -116 -220 -280 -400 110 -293 252 229 -254 -273 60 -399 -650 -217 -131 -377 394 -118 135
7371A35k19N79o56K0J56j34l45J001j172R76m34L62k79K70k5j27P40j261L06k40
$$ 135 -84 495 -161 -141 15 -119 -464 537 -635 341 -93 269 -10 260 235 108 848 -413 -107 -347
7391c47P5m90J135o84O98M56m40M61l01p45K20j34n8O61K80r31q8L65j82J92J17
$$ -347 -272 -762 373 -311 387 843 403 864 563 -182 38 -96 -154 507 787 -144 -232 133 -49 143 260
7412B60J3q31J004o32k39N55k56M15o17J036k79m27J16p5l02K89l19O48m77j6
$$ 260 273 -558 446 -186 -425 130 -126 289 -328 708 429 2 118 43 -259 30 -289 359 -118 -134
7432a34j02J81L99m58L64j45K3k3m6l5k04K00O4j54j42M04j12j48M4K28k85J18
$$ -134 -236 -55 344 -114 250 105 128 105 59 24 -180 20 84 -70 -212 192 80 -68 -24 204 -81 37
7454C7Q5j04Q6k22L62j79M4k64Q2p1J10J64k18J34j22J74R9l15k5K71Rk88L38
$$ 37 122 18 104 -118 244 65 109 -155 -73 -144 -34 130 -88 46 -76 98 197 -118 -143 128 137 -151 187
7477A87k53O8r5Q5p9m7J54N0j05q2J06jok18J26P8L0j31J27j46K83q2l74J78J65
$$ 187 -66 2 -93 -8 -87 -134 20 70 -35 -117 -11 -12 -18 -236 -110 -32 -2 -133 -6 -152 131 49 -325 -147 18
7502A8k40Q4p3L88m4KQ7j09p6k9k17Q3K22j62J12k62K04Q9l42K50j02J61j31J83
$$ 18 -222 -138 -211 177 133 135 222 113 37 8 -209 -126 96 -66 46 -216 -12 77 -265 -15 -117 44 -87 96
7526I6p2J27l6O9j67o9P3M3j75k39K68Q8L3k31L31o7o4M6r9j87K50M0L9O5k20
$$ 96 24 151 115 184 17 -52 21 64 -111 -350 -82 6 39 -192 139 72 8 54 -45 -232 18 58 97 162 -58
7551e8j38K18k1K9k07M76k16n7k05R6J48o1r1o3q0J29L16m41N4J32Q4J45o9j40
$$ -58 -196 22 1 30 -177 299 83 26 -179 -83 65 4 -87 -150 -230 -101 215 -226 -172 -40 44 189 120 -20
7575b0l8K23o2j03%O2j55l1J98j22O5K39m83K9K66R3L7j86RL4O8o0P6k18j8K11
$$ -20 -58 165 103 0 0 62 -93 -124 74 -48 17 256 -227 -198 68 161 198 12 21 55 123 63 139 -79 -97 114
7601A14R4J23k32M6k50J58j27K6L7j4p5%O1rR1K0k28M60j75k23J05o0M9K72k44
$$ 114 208 331 99 145 -105 53 -74 -48 -11 -25 -100 -100 -39 -48 43 63 -165 295 120 -103 2 -58 -9 263 19
7626A9L1J27k87M8K15k3q2P1o3k40L74l92J52K6q0K93j27q0o3j13K93o5j1k92
$$ 19 50 177 -110 -62 153 130 48 119 56 -184 190 -202 -50 -24 -104 189 62 -18 -81 -194 99 34 23 -269
7650b69K51R8k06nj5K22J1P3m16M48l09J51r9M3L08m46J81K00k15j48J22j39K37
$$ -269 -18 80 -126 -131 -146 76 87 160 -256 192 -117 34 -65 -22 286 -160 21 221 6 -142 -20 -159 78
7673G8n3Q8o0J11Q0j17P4j21j16K0R2K9k28L66j70p8q5J16Q9k13P8k5q6J16n4
$$ 78 25 113 53 164 244 127 201 80 -36 -16 76 105 -123 243 73 -5 -90 26 115 -98 -20 -45 -131 -15 -69
7698f9k6K20k67R2L0M3J53q4j23J25j07Q6j76O4J27n2j51J64k16K01J8oJ90j94
$$ -69 -95 125 -142 -50 -20 23 176 92 -31 94 -13 73 -103 -39 88 36 -115 49 -167 34 52 46 236 42
7722D2p1r6L09l9P5l76jK29n8k06J41L1J12k47LK69J40l82Q7K3pM7M9k49J00K21
$$ 42 -29 -125 184 145 220 -156 -157 72 14 -192 -51 -20 92 -155 -152 117 257 -125 -38 -15 -22 25 74 -175 -75 146
7748A46k29J94n5M7J4l0j5k7r8n7K80j24K3nj36QJ67p0m7k6M16m18N0n0K45j55
$$ 146 -83 111 56 103 117 87 72 45 -53 -110 170 46 69 64 -72 -64 103 33 -14 -40 376 -42 8 -42 203 48
7774D8l43K78j09J9J04K56l5m70J28l3Q0J48M6j70O6n6K33q7J66j62j26l4o2J18
$$ 48 -295 -17 -126 -107 -3 253 218 -252 -124 -157 -77 71 117 -53 13 -43 190 103 269 107 -19 -53 -115 3
7798CJ7kj75K37p4J45j6k41p3J66P2J18j02k84J95P0m1j03K39j69L6r9j5K07k38
$$ 3 20 18 -157 80 6 151 135 -106 -179 -13 59 177 75 -209 -14 56 15 -88 151 -18 18 -81 -96 111 -127
7823a27Q9J46r3j31K3P8J11jj36j71J00J21P8r6j03k9J47j36J79m4R1J3k4j35
$$ -127 -38 108 15 -116 -93 -15 96 95 -41 -212 -112 9 87 -9 -112 -141 6 -130 49 5 96 109 85 -50
7847e0m3J08Q1m5Jq5K9K4k10M37j64l33J02J26K01k1j67k3rQ2k19j1K6L32j11
$$ -50 -93 15 96 51 52 -33 -4 20 -190 247 83 -250 -148 -22 179 158 -9 -32 -41 41 -178 -189 -163 169 58
7872E8k56J29P4lK59m85L38r1j6K4j67O6P6o3K3O8N3l05K26m5K3l5j19K93j03
$$ 58 -198 -69 5 2 261 -224 114 23 7 31 -136 -70 6 -57 -34 34 87 -218 8 -37 -14 -49 -168 125 22
7897B2PJ1J50R9k43J90m45M87k22j02k2J39M1p5j15n2K45L6j31R3j40j11K46q6
$$ 22 29 40 190 289 46 236 -209 278 56 -46 -68 71 112 37 -78 -130 115 151 20 113 -27 -138 108 22
7921B2k2K0r3K19j37Q0j84L9K19pj06k22R4N21m97J1l2M02k93p8J45k45j02Q4
$$ 22 0 20 -73 146 9 89 -95 -56 163 156 50 -172 -78 443 -54 -43 -75 327 34 -44 101 -144 -246 -162
7945a62K1K06Qj54K23j86L5l8J61k25J8o9J90j0j14J48J85l63K99j00k39L42j65
$$ -162 -141 65 73 -81 142 -44 -9 -47 114 -111 -93 -162 28 18 -96 52 237 -126 173 73 -166 176 11
7968A1Qj27l5K44P2k0l45L10l41L84q9k85K81R6O3k37J5k15j6L39j54p4K39l03
$$ 11 19 -108 -143 101 173 153 -192 118 -223 161 72 -213 68 164 227 -10 5 -210 -226 113 -41 -115 124 -179
7992a79J33J77o9p0P3j83K5J28J07m00K15j63K01pL4R8J2j32q1O8o9R6LK20j55
$$ -179 -46 131 62 -8 65 -118 -93 35 142 -258 -43 -206 -5 -12 22 120 132 0 -81 -13 -82 14 17 237 82
8017H2l1p3n2o0K51J29j61r1Q7Q1l04k8KL00l72K16J86R7r3k03M7O6j94K01p3
$$ 82 51 -22 -74 -134 117 246 85 -6 81 162 -142 -170 -168 132 -240 -24 162 259 166 -37 10 76 -118 83 10
8042A0mK06k48Q6K03m16J67R9k31J09M5p5k04J73J06K0j55Q4J3l5J17J6k03K14
$$ 10 6 212 -36 50 253 -163 4 103 -128 -19 26 -49 -253 -80 26 46 -109 -25 -12 -47 70 86 -117 97
8066I7o0j92K86l18J35N7K02k41j08K20j13O1nJ1nJ1j33j0J31j77J67J64k64K25
$$ 97 37 -155 131 -187 -52 5 207 -34 -142 78 -35 26 21 32 27 38 -95 -105 26 -151 16 180 -84 141
8090A41k15j03K47j16O7L4j40p7j2J25r1K38j35J45o1r3Q0lP4l03K95j67k4M1
$$ 141 -74 -177 70 -46 21 55 -85 -162 -174 -49 -140 98 -37 108 47 -46 34 31 105 -198 97 -70 -94 -53
8114e3J47k98K54K8j26J14J4m8k1J14j64J09j9Q0j00l9J0O4Lj93M18m21L1O0k6
$$ -53 94 -204 50 78 -48 66 80 32 11 125 -39 70 51 131 31 -8 2 66 69 -124 294 -127 -96 -36 -62
8139f2L31j86j0k28K65l04K72O8o2k24L5mJ0K40k31Q2M5k31M25j70Pl6r7j08K24
$$ -62 269 83 73 -155 110 -194 78 146 84 -140 -105 -109 -99 141 -90 -8 37 -194 231 61 68 32 -65 -173 51
8164E1J01j34kQ9q3j79L8P4m8K27k89K11m1k02J22r1K16j28k03N5O3J83j6K25
$$ 51 152 18 16 105 22 -157 -119 -45 -93 134 -155 56 15 -187 -65 -156 60 -68 -271 -216 -153 30 14 239
8188B39l14L1P4
$$ 239 -75 -44 30
8191C0
$$ Imaginary data points
##PAGE= N=2
##DATA TABLE= (X++(I..I)), XYDATA
0@%%%%%%%%%%%%%%%%%%qJ6j6J6j6J6k2L0l2L4m2M8n6O5p3Q2r1J05j20J35j50J68
$$ 0 0 0 0 0 0 0 0 0 0 0 0 0 0 0 0 0 0 0 -8 8 -8 8 -8 8 -14 16 -16 18 -24 24 -32 33 -40 42 -49 56 -64 71 -79 89
40H9j87K08k30K54k82L12l45L81m19M60n07N61o18O80p51Q29r17J019j137J271
$$ 89 -98 110 -120 134 -148 164 -181 200 -219 241 -266 295 -323 357 -394 435 -482 537 -600 671
60F71j428J619j854K150k538L070l853N160p920K8901k5063Q711K518k0264L8654
$$ 671 -757 862 -992 1158 -1380 1690 -2163 2997 -4923 23978 -1085 7626 10144 -10120 28534
75B8534j6217Q977p643k3471J6905j4638P482K0548k0832R456j5914o035J3608
$$ 28534 12317 21294 13651 -9820 7085 -7553 -71 20477 -355 9101 -6813 -12848 760
88G60j4428J9516k019j8905J3320j5667N581N660o944J5103j8976K42R677k0541
$$ 760 -13668 5848 3829 -15076 -1756 -17423 -11842 -6182 -13126 1977 -16999 -16757 -7080 -27621
102b7621J9149J930r656Q429j4793N287n83k083J7606j3510K819Q42j4065J3234
$$ -27621 -8472 -6542 -16198 -7769 -22562 -17275 -17858 -19941 -2335 -15845 -13026 -12184 -26249 -13015
116a3015n559P856R351j7215J1332r639p501J9339q121R592J226j2895J0059j2833
$$ -13015 -18574 -10718 -1367 -18582 -7250 -16889 -24390 -5051 -13172 -3580 -2354 -15249 -5190 -18023
130a8023O707J2948j1029J2797o341q827Q077p164J2166J613m858Q730j4582L471
$$ -18023 -11316 1632 -9397 3400 -2941 -11768 -3691 -10855 1311 2924 -1934 6796 -7786 -4315
144d315O142n088J3402o787o42K771j2513J2757J68k697J1680j2203J088N32m600
$$ -4315 1827 -3261 10141 3354 2712 5483 -7030 5727 5895 3198 14878 2675 3763 4295 -305
159c05J2428m626K500K745j2551O728j617PR629o783L411m727n888Q819n081O270
$$ -305 12123 7497 9997 12742 191 6919 5302 5309 14938 8155 11566 6839 951 9770 4689 10959
175A0959L478q480L991o714M83O478m491P988m044o406M714p078N134L508l161
$$ 10959 14437 5957 9948 3234 3717 10195 5704 13692 9648 3242 7956 878 6012 9520 6359
190F359M673p717p57K269n020P989m05k996J807p499K551L42q66O968n624j063
$$ 6359 11032 3315 2558 4827 -193 7796 7391 4395 6202 -1297 1254 1596 730 7698 2074 1011
206A011k01n896N231j52J066J759o519J350k588j741O785k842J332o97n799K456
$$ 1011 810 -5086 145 -7 1059 2818 -3701 -2351 -4939 -6680 105 -2737 -1405 -2102 -7901 -5445
222e445k652K490M101m099J834l519l370L784j492L684M24l325J096m304R03L489
$$ -5445 -8097 -5607 -1506 -5605 -3771 -7290 -10660 -6876 -8368 -4684 -4260 -7585 -6489 -10793 -9890 -6401
238f401j007L132j983k274M85k491M010J665o51K121l849o21R07J31L909K33l37
$$ -6401 -7408 -4276 -6259 -8533 -8048 -10539 -6529 -4864 -5515 -3394 -7243 -7864 -6957 -6826 -2917 -2684 -3021
255c021k03l659K154J388R81L689j867q31q13j182L329R20J594J034k612n6p6
$$ -3021 -3224 -6883 -4729 -3341 -2360 1329 -538 -1369 -2182 -3364 -35 885 2479 3513 901 845 769
272G69N97L002L20J017j026k495J121K46J441K299n29l01j768q65J341M91J987
$$ 769 1366 4368 4688 5705 4679 2184 3305 3551 4992 7291 6762 6461 4693 3828 5169 5660 7647
289G647M51j792q62j279M98J623P45P72j403j513q38l89J426J344j90o68k150
$$ 7647 8098 6306 5444 4165 4663 6286 7031 7803 6400 4887 4049 3660 5086 6430 6240 5572 3422
306C422r38K8L21J775J3j212j365j465k64P99Q33O95q34j730j108o21P65J023
$$ 3422 2484 2512 2833 4608 4621 3409 2044 579 315 1114 1947 2642 1808 78 -1030 -1651 -886 137
324A37K59o27j364j364j87M88J106O96p64j025j107r09J288O82N49J99j569n33
$$ 137 396 -231 -1595 -2959 -3146 -2658 -1552 -856 -1620 -2645 -3752 -4661 -3373 -2691 -2142 -1943 -3512 -4045
342d045r89L07K085j14J63m04j663J26J69R71J680r94l1j102r33J306K32J515
$$ -4045 -5034 -4727 -2642 -2756 -2593 -2997 -4660 -4534 -4365 -3394 -1714 -2708 -2739 -3841 -4774 -3468 -3236 -1721
360a721N75j383K50j451M48J612l65J465p96j494O65j094J996R97m78J047j875
$$ -1721 -1146 -2529 -2279 -3730 -3282 -1670 -2035 -570 -1366 -2860 -2195 -3289 -1293 -296 -774 273 -1602
377a602l23Q96n03K379j11n51L22k514J395R33k62K560j854l62K76j767K576p2
$$ -1602 -1925 -1029 -1532 847 736 185 507 -2007 -612 321 59 2619 765 403 679 -1088 1488 1416
395A416L21J346k649R30m93l49K943j447J012j83k373K032j253J415J818k152
$$ 1416 1737 3083 434 1364 871 522 3465 2018 3030 2847 474 2506 1253 2668 4486 2334
411B334J771k061r93K482j710K479j42k081J572k681J314J488j425K224j825r59
$$ 2334 4105 2044 1051 3533 1823 4302 4160 2079 3651 970 2284 3772 2347 4571 2746 1787
427A787J358k837L096k46j312K531l824O53M64j443L417k324r5N33l572K877j051
$$ 1787 3145 308 3404 3158 1846 4377 553 1206 1670 227 3644 1320 1225 1758 -1814 1063 12
444A2j39K485l510J133o91k102L536k353J348N45l576K421j957m3K457k723K348
$$ 12 -127 2358 -1152 -19 -710 -2812 724 -1629 -281 264 -3312 -891 -2848 -2891 -434 -3157 -809
461h09j281k346K457k331J978Q29k594K754l151L70J976k740L736j681r41J590
$$ -809 -2090 -4436 -1979 -4310 -2332 -1503 -4097 -1343 -4494 -4124 -2148 -4888 -1152 -2833 -3774 -2184
477b184l335K799M77j344L381l585R18J153k715M239j882J86K057m005L323j132
$$ -2184 -5519 -2720 -2243 -3587 -206 -3791 -2873 -1720 -4435 -196 -2078 -1892 165 -3840 -517 -1649
493a649o13M110l669K607l20l099M205k234J377J859l375L092k210m59L481l009
$$ -1649 -2262 1848 -1821 786 466 -2633 1572 -662 715 2574 -801 2291 81 -378 3103 94
509I4K881p9k768K888k670J657J641k421L070k616m50J822k369L005j200o56J816
$$ 94 2975 2896 128 3016 346 2003 3644 1223 4293 1677 1227 3049 680 3685 2485 1829 3645
526C645k948J498M25j660L438k861L81O23k838L127j328M9K217l799J940j267
$$ 3645 697 2195 2620 960 4398 1537 1918 2541 -297 2830 1502 1551 3768 -31 1909 642
542F42j008L093k610J582o9l075L413k661R11J710k993K649k060j262K553k374
$$ 642 -366 2727 117 1699 1630 -1445 1968 -693 218 1928 -1065 1584 -476 -1738 815 -1559
558a559K483k69k348K238l214J584J541k279L033j982j222K110l028L225k13j455
$$ -1559 924 655 -1693 545 -2669 -1085 456 -1823 1210 -772 -1994 116 -2912 313 100 -1355
574a355K270k575O95P81j994K726j556l04P19k720K875r12p22K464k108M36K97
$$ -1355 915 -1660 -965 -184 -2178 548 -1008 -1312 -593 -3313 -438 -1350 -2072 392 -1716 -1280 -983
591i83j959L181j413K90J285k690K395k173Q4K351k319J333p56n57K078k199J024
$$ -983 -2942 239 -1174 -884 401 -2289 106 -2067 -1983 368 -1951 -618 -1374 -1931 147 -2052 -1028
608a028Q32j677K573k591j6J858k202K576o74n45R79j734J639j1j007K134j750
$$ -1028 -196 -1873 700 -1891 -1907 -49 -2251 325 -349 -894 85 -1649 -10 -21 -1028 1106 -644
625f44O86L76j840K780j038r9J188k138J564k22p85K326j594P17M27j757K097
$$ -644 42 418 -1422 1358 320 221 1409 -729 835 613 -172 2154 560 1277 1704 -53 2044
642B044j433O04J645k159J309l87r01J526j270J403j09j551J505j345N94J043
$$ 2044 611 1215 2860 701 2010 1623 722 2248 978 2381 2272 721 2226 881 1475 2518
658B518j474J488j136m35R70j196J328k93o11R43j616L55L85q91J184p98l96P37
$$ 2518 1044 2532 1396 961 1931 735 2063 1770 1159 2102 486 841 1226 335 1519 721 325 1062
676A062j590R77r9m35J000j404J06J85r70J182o43J40K82j401P50l49j89Q50q35
$$ 1062 -528 449 350 -85 915 -489 -383 -198 -1168 14 -629 -489 -207 -1608 -858 -1207 -1396 -546 -1381
695a381K78m12o30J069o16M08K29r06N62n21k16J129o87O57k77o48Q92r37Q70
$$ -1381 -1103 -1515 -2145 -1076 -1692 -1284 -1055 -1961 -1399 -1920 -2136 -1007 -1694 -1037 -1314 -1962 -1070 -2007 -1137
714a137L90o40O80p15J64L31n02J169m26j21N04o15N29J83l10Q91l77j81M21o58
$$ -1137 -747 -1387 -707 -1422 -1258 -927 -1429 -260 -686 -807 -303 -918 -389 -206 -516 375 -2 -183 238 -420
734d20Q19p6l04Q15o49K22j85R2O38n70O29L2o73M92k18PO33m64K67l72k37M56
$$ -420 399 323 19 834 185 407 222 314 952 382 1011 1043 370 862 644 651 1284 820 1087 715 478 934
756I34K9M00k54l30j8m4J99j98l29N85j88J8l01j56L03J10k57m87O24k52K79J18
$$ 934 963 1363 1109 779 761 717 916 718 389 974 786 804 503 347 650 760 503 16 640 388 667 785
778G85N13p13j02Lj70J03K64k24K40m15M5N3k91K9l4M35j26n24M93k64mL9P1k34
$$ 785 1298 585 483 486 316 419 683 459 699 284 329 382 91 120 86 521 395 -129 364 100 96 135 206 -28
802b8N6J40j42j02M79l80j14j81j38O02l08l47J37J60j24p28K48L12O0l77Q14
$$ -28 28 168 26 -76 403 23 -91 -272 -410 192 -116 -463 -326 -166 -290 -1018 -770 -458 -398 -775 39
823C9o01l63L56k38k6L84K19o66Q1r66P80L52l45k06P12k09j4m65N42n07J294
$$ 39 -562 -925 -569 -807 -833 -449 -230 -896 -815 -1781 -1001 -649 -994 -1200 -488 -697 -711 -1176 -634 -1141 153
844A53l48j146O15J5k42J208n16l06K87m27j56R76p15L68M91Q7o45m81J726l11
$$ 153 -195 -1341 -726 -711 -953 255 -261 -567 -280 -707 -863 113 -602 -234 257 344 -301 -782 944 633
864F33p51J143m33n3L74k53M28o98J207o68r09Q43m55J24O38n02J30m26L40P83
$$ 633 -118 1025 592 539 913 660 1088 390 1597 929 20 863 408 532 1170 668 798 372 712 1495
884A495j119k43J448j172J399m85J81r0j290J562r31p88J760j370J056o93q16
$$ 1495 376 133 1581 409 1808 1323 1504 1414 124 1686 755 -33 1727 357 1413 720 -96
901i6J040M34q45K47m55K00J42m05K44j425O78P47o45O50r64M14j99o62P55m49
$$ -96 944 1378 533 780 325 525 667 262 506 -919 -241 506 -139 511 -453 -39 -238 -900 -145 -594
921e94O40l90m92N65m30l00R55j235J185m38q69J583j222P45K19j364J293j097
$$ -594 46 -344 -836 -271 -701 -1001 -46 -1281 -96 -534 -1403 180 -1042 -297 -78 -1442 -149 -1246
939a246K30O60m62N43J5j099J010p55J185j49p93J660j262NL37n17P57m33J88
$$ -1246 -1016 -356 -818 -275 -260 -1359 -349 -1104 81 -68 -861 799 -463 -458 -121 -638 119 -314 -126
958a26L43j570J215K32p85J335m66q8R2q64J232p63M18L08q77J136n87o83J405
$$ -126 217 -1353 -138 94 -691 644 178 90 182 -682 550 -213 205 513 -364 772 185 -498 907
977I07j156N94m2p45J155o90J22L54r32J186r76O8P02j126J075j00m07P89j013
$$ 907 -249 345 303 -442 713 23 145 499 -433 753 -223 -155 547 -579 496 396 -11 778 -235
996b35N29L49r27J204r27l6P80r20P65n5n65Q57r45O20l5m80J016q99K12M69q26
$$ -235 294 643 -284 920 -7 -43 737 -183 582 527 -38 819 -126 494 459 -21 995 96 308 777 -49
1017d9Q75n80J57N89r41P68l34l97Q38q17N13K66r75J000p28Q0N07o32N25l31
$$ -49 826 246 403 992 51 819 485 88 926 109 622 888 -87 913 185 265 772 140 665 334
1037C34m24O71r43P80q7n70P57j021M16L58r66Q89m36l41Q27r43M92o9n42R26
$$ 334 -90 581 -362 418 331 -239 518 -503 -87 271 -695 194 -242 -583 244 -699 -207 -276 -818 108
1057A08r34L81L73r67O61m97PN27q23P46m50k25P60m73L16o9o31R81p79L23J89
$$ 108 -826 -445 -72 -1039 -378 -875 -868 -341 -1164 -418 -868 -1093 -333 -806 -490 -559 -1190 -209 -988 -665 -476
1078d76o93P82m07o4M41l31M71j45k45P74q57M50M81o84Q64p86M27O4l82Q67l66
$$ -476 -1169 -387 -794 -858 -417 -748 -277 -422 -667 107 -750 -300 181 -503 361 -425 2 66 -316 551 185
1099A85mM35p11L65K98o60P18l88J41L73p33Q20m31P2N79p46K54N1l44Q22o43
$$ 185 181 616 -95 270 568 -92 626 238 379 752 19 839 408 480 1059 313 567 618 274 1096 453
1120D53M76r0o33N66m58r7M23m33M68j16m24M61n35O47k0p81O43n10J45J05k28
$$ 453 929 839 206 772 314 217 640 207 675 559 135 596 61 708 688 -93 550 40 185 290 62
1141F2L59k89k65M10n64J76L47n72N27l46J17j24r9L02k30o7K39l36K5J29j67
$$ 62 421 132 -133 277 -287 -111 236 -336 191 -155 -38 -162 -261 41 -189 -256 -17 -353 -328 -199 -366
1162c66N56p67N05m9n64O67k03P7l0k49J33N3k38L58m91M47k7l58O14n86L93K57
$$ -366 190 -577 -72 -121 -685 -18 -221 -144 -174 -423 -290 -237 -475 -117 -608 -161 -188 -546 68 -518 -125 132
1184A32o43N57q2j88L1q7J66Q9k67K85l29j20L57l36L92k6n8j36j80J49J81k12
$$ 132 -511 46 -36 -224 -193 -280 -114 -25 -292 -7 -336 -456 -99 -435 -43 -69 -127 -263 -443 -294 -113 -325
1206c25K98k57J01j86J31L72l10N5k3l35M03k01L91k37j83K89kK2k1k7L30l45
$$ -325 -27 -284 -183 -369 -238 134 -176 -121 -144 -479 -76 -277 114 -123 -306 -17 -19 3 -18 -45 285 -60
1228f0L4K52j37L6K85l76K20J18j65j0J02Op5j4J43k6R4J03l67J92J83K2R7j38
$$ -60 -26 226 89 125 410 34 254 372 207 197 299 305 230 216 359 333 427 530 163 355 538 560 657 519
1252E19r7J02k35J93l2j07K12n35O12l13J27j20j58J3J85j78J58l42L00P5k87
$$ 519 422 524 289 482 450 343 555 20 632 319 446 326 168 181 366 188 346 4 304 379 92
1273I2QQk09L42m77K96q1j37J38j26K10m29J25k14J93j81K25j53k30O0L07m79
$$ 92 100 108 -101 241 -236 60 -21 -158 -20 -146 64 -365 -240 -454 -261 -442 -217 -370 -600 -540 -233 -712
1295g12L92n3k70J73k82J09J49j03K33l38M86j35n5q8K50j02p5j07P2L17j81J20
$$ -712 -320 -373 -643 -470 -752 -643 -494 -597 -364 -702 -216 -351 -406 -494 -244 -346 -421 -528 -456 -139 -320 -200
1317b00k2O5o6K43r7j15L2N2K89o1J13k21nK44n0K7N4K47m83J72J67k90J58N9
$$ -200 -222 -157 -223 20 -77 -192 -160 -108 181 120 233 12 7 251 201 228 282 529 46 218 385 95 253 312
1341C12L7J43l88L8J52P7k1j88j24J19J80Q4j44N6j98q5N9n1j9K61l70M06k98
$$ 312 349 492 104 142 294 371 350 162 38 157 337 421 277 333 135 50 109 58 39 300 -70 336 38
1364C8Q8P0k50J61j4m8J69k51OJ74k32K13j41J36j20k30K27j70r2L92k29O5L9
$$ 38 126 196 -54 107 93 45 214 -37 -31 143 -89 124 -17 119 -1 -231 -4 -174 -266 126 -103 -38 1
1387Ao7L05m57K74N8l78J08p8K90j0k26K70j85KJ3l8J96j62Q1N2j24N2j65j9J76
$$ 1 -66 239 -218 56 114 -264 -156 -234 56 46 -180 90 -95 -93 -80 -118 78 -84 -3 49 -75 -23 -188 -207 -31
1412c1j22k8J45j65J77J52l28K95k44j37J11j48K02k26N4L05l00J76L0l13L16
$$ -31 -153 -181 -36 -201 -24 128 -200 95 -149 -286 -175 -323 -121 -347 -293 12 -288 -112 -82 -395 -79
1433g9k69K47L5m26M27j34m9r4j08M20j71l15O21m34K54L9n10O39l28J62R1k90
$$ -79 -348 -101 -66 -492 -65 -199 -248 -342 -450 -30 -201 -516 105 -329 -75 -36 -546 93 -235 -73 18 -272
1455b72N27l57K46J30n60M14j22j24L24m6O7L17m27J67j75J63j06r3K03o9K5M99
$$ -272 255 -102 144 274 -286 128 6 -118 206 160 227 544 117 284 109 272 166 73 276 207 232 731
1477G31p85M80J77l84M27m33J61J41l18K58j88n9J83k85N38m85j49M40m14J50
$$ 731 -54 426 603 219 646 213 374 515 197 455 267 208 391 106 644 159 10 450 36 186
1497A86N6k18J24k06o8J02K0L06m28K85K42p77L58l88j27N49m27L21j95j20K83
$$ 186 242 24 148 -58 -126 -24 -4 302 -126 159 401 -376 -18 -406 -533 16 -411 -90 -285 -405 -122
1518a22q9j07P0n05P67m02n5K21j08Q4j47K2J76j05J08K13o56N42j62k50M21l36
$$ -122 -211 -318 -248 -753 14 -388 -443 -222 -330 -246 -393 -371 -195 -300 -192 21 -635 -93 -255 -505 -84 -420
1540d20K11L0j94L84l08M06k35K9%R0j47K35j71K38k4l96L23j00J59K2k79M05
$$ -420 -209 -179 -373 11 -297 109 -126 -97 -97 -7 -154 81 -90 148 124 -272 51 -49 110 132 -147 258
1562B58l46P7J45j9k4m5%K41l61K41j55k3K53j87K85l9m00K15Lj40K12k84LK36
$$ 258 -88 -11 134 115 91 46 46 287 -74 167 12 -11 242 55 340 301 -99 116 119 -21 191 -93 -90 146
1586A46j08L36j18j75M8j22J20o8P7K03k70nn5J9L58o48K34J56k55L52j57JM1
$$ 146 38 374 256 81 129 7 127 59 136 339 69 64 9 28 386 -262 -28 128 -127 225 68 69 110
1609A10j88N20k94k35J0L7J02J16j10K40k63J15Q0p0K75l04J6q0n1R5Q6k60J92
$$ 110 -78 442 148 -87 -77 -40 62 178 68 308 45 160 240 170 445 141 157 77 26 121 207 -53 139
1632A39j79P6J50j56J85k51J70j00j68K04l30L5K01k36L66q1k88J67p1P2n5j45
$$ 139 -40 36 186 30 215 -36 134 34 -134 70 -260 -225 -24 -260 106 25 -263 -96 -167 -95 -150 -295
1654b95J23k16L0J27j97j9M25l50N23m93j9J69p4R6j58J98J2l77K43q1J73J57
$$ -295 -172 -388 -358 -231 -428 -447 -22 -372 151 -342 -361 -192 -266 -170 -328 -130 -118 -495 -252 -333 -160 -3
1676cm07L39j02J40J01n9k3j42o9K43j10J86jp3n4K84l38K41K45j96Oj07K74l17
$$ -3 -410 -71 -173 -33 68 9 -14 -156 -225 18 -92 94 93 20 -34 250 -88 153 398 202 208 101 375 58
1700E8J41K11j80p3j9J5J26mo1k0j20K09n7L08m20K3P5J83m20K92j52R1r2Q5j50
$$ 58 199 410 230 157 138 153 279 275 214 194 74 283 226 534 114 137 212 395 -25 267 115 206 114 199 49
1725D9Q7J69k47J36j46K94k47P0k13L5M0k1j43LJ28o1j47J03k04J78J36k20J91
$$ 49 136 305 58 194 48 342 95 165 -48 -13 27 6 -137 -134 -6 -67 -214 -111 -315 -137 -1 -221 -30
1748c0k19K67l32J20K25j10p8j23J20k9k0N9n3m0J23j4KJ84j22l8L14k47J9o0
$$ -30 -249 18 -314 -194 31 -79 -157 -280 -160 -189 -209 -150 -203 -243 -120 -134 -132 52 -70 -108 206 -41 -22 -82
1772h2J15j55j95L28K2k07K74p1p6n9J27k30L66l1m3j26r4P2J45r5Q4l70M61r6
$$ -82 33 -122 -317 11 33 -174 100 29 -47 -106 21 -209 157 126 83 -43 -137 -65 80 -15 69 -301 160 64
1796F4j20j70K03J60q1p6Q2k13M33l89N3O39l68m62L81j13P5M79n62j73Q4J22
$$ 64 -56 -226 -23 137 56 -20 62 -151 282 -107 -54 585 217 -245 136 23 98 577 15 -158 -74 48
1818D8j92J62k37M36j94J05j83J34k49K32J04l07%L74J5o1j36J65q0j5J4N8R5
$$ 48 -144 18 -219 217 23 128 -55 79 -170 62 166 -141 -141 233 248 187 51 216 136 121 135 193 288
1841B88j87R6j14J11q2j36M03m51K99k83J83L3K23j22j91P2N1q0M8J70l41kP0
$$ 288 101 197 83 194 112 -24 379 -72 227 -56 127 160 383 261 70 142 193 113 161 331 -10 -12 58
1864E8k22L30k76J35L8j39J26k55K18L0l7l12K19Q7r8l46K77l7Q7J34k82J3n5
$$ 58 -164 166 -110 25 63 -76 50 -205 13 43 6 -306 -87 0 -98 -444 -167 -204 -117 17 -265 -252 -307
1887c07J0K2J19O9k31J22K75l50L4m3k2L24k86K11r3j93K15P5k4p6Q0K06ql87
$$ -307 -297 -275 -156 -87 -318 -196 79 -271 -237 -280 -302 22 -264 -53 -146 -339 -124 -49 -73 -149 -69 137 129 -258
1911b58J78M56k94O0j72J14k1N6j89J84K33j71k2K19k90K38J21l52L8J02k44J85
$$ -258 -80 376 82 142 -30 84 63 119 -70 114 347 176 154 373 83 321 442 90 128 230 -14 171
1933A71M5JP2j34K38l70O8P5QK38J31l07k56J14P4M5K2j97O4J26o0j55K88m94
$$ 171 216 217 289 155 393 23 91 166 174 412 543 236 -20 94 168 213 235 38 102 228 168 13 301 -193
1957a93L38p5q8LK15l68L11k07O4j47J06J57j9k76J45J7p9j26Q6N3q6N6R1J39
$$ -193 145 70 -18 -15 200 -168 143 -64 0 -147 -41 116 97 -179 -34 -17 -96 -222 -136 -83 -169 -113 -22 117
1981A17K7k03P3O8k63K02k92L58K4m10M84m54K79k8KR2r4k0o2J76j36o7J33j03
$$ 117 144 -59 14 82 -181 21 -271 87 111 -299 185 -269 10 -18 -16 76 -18 -38 -100 76 -60 -127 6 -97
2005i7K95k33J80j15p7J23j35J78jl7q7K62k79J21l89K81Q7n0j31K6j60J52K24
$$ -97 198 -35 145 30 -47 76 -59 119 118 81 -6 256 -23 98 -291 -10 77 27 -104 -78 -238 -86 138
2028A38j29L0q3r9J61K45l92L21j28j93O4k21k92N90J23j78r2j30o3M32O78o91
$$ 138 9 39 -44 -143 18 263 -129 192 64 -129 -65 -286 -578 12 135 -43 -135 -265 -328 104 782 91
2050I1l69J05K13J13n4m4P8k34j71O9K67jj05O7K38k1N2j61o1K1j29%K55L8k3
$$ 91 -278 -173 40 153 99 55 133 -101 -272 -203 64 63 -42 25 263 242 294 133 72 93 -36 -36 219 257 234
2075B34j5p0L9j77K59k12K41k02o9o3K20k95KK69k34J96q8kj35m5J50j81J42j22
$$ 234 219 149 188 11 270 58 299 97 28 -35 185 -110 -108 161 -73 123 35 33 -102 -147 3 -178 -36 -158
2099a58O8K16j84J31m5k17J67j84J13J47k37q0O2p8L82k91L69j92j69K04k68R2
$$ -158 -90 126 -58 73 28 -189 -22 -206 -93 54 -183 -263 -201 -279 103 -188 181 -11 -180 24 -244 -152
2121a52J48kk77Q4n1L23j79mK8JK73k03j39K44Q0n41j9K23M57l72J6P3p9K36J4
$$ -152 -4 -6 -283 -199 -250 73 -106 -110 -82 -81 192 -11 -150 94 174 -367 -386 -163 294 -78 -62 11 -68 168 182
2146A82j03m6JO8k77J87J38k33K6O0J73r9l2J37q8L1k0N5j4P6j9j44K23k02L6
$$ 182 79 33 34 102 -175 12 150 -83 -57 3 176 77 45 182 94 125 105 160 146 222 203 59 282 80 116
2171A16l57J89J15o5N4j13J2J43j87K24j93M5l8p7M28m57N9R0o9J36j64J13m6
$$ 116 -241 -52 63 -2 52 -61 -49 94 -93 131 -62 -17 -55 -132 296 -161 -102 -12 -81 55 -109 4 -42
2194d2l7J4Rj71K03K22l15P9K7j32L6j41J44R4j8K43k09j07o0j82L72p5K16l3
$$ -42 -79 -65 -56 -227 -24 198 -117 -38 -11 -143 -107 -248 -104 -10 -28 215 6 -101 -161 -343 29 -46 170 137
2218A37k74K84M6n4m3o6J26k05K48p9k23J65j55J97nj70J59j26J45j71m5J13n4
$$ 137 -137 147 193 139 96 30 156 -49 199 120 -103 62 -93 104 99 -71 88 -38 107 -64 -109 4 -50
2241e0R7j5K42m68J67j67J18l3J99j02R8j89l6O2o9j21L20k44K32n07K26K26m0
$$ -50 47 32 274 -194 -27 -194 -76 -109 90 -12 86 -103 -139 -77 -146 -267 53 -191 41 -466 -240 -14 -54
2264e4j51K9L17k89J8J64n7J5j23j58K79q0Q8j59K40l46J69K79m5j68J90l34K22
$$ -54 -205 -176 141 -148 -130 34 -23 -8 -131 -289 -10 -90 -2 -161 79 -267 -98 181 136 -32 158 -176 46
2287D6J91j1j49pQ3K18l11K36r4j11J26j30j9J00m09L63j15K00j28j34J57K9o6
$$ 46 237 226 77 70 153 371 60 296 202 91 217 87 68 168 -241 122 7 207 79 -55 102 131 65
2310F5n9rQ6k55J53k05J12K03j34o8j3j33J43J01j32J94N9j88Q1l35J83J65k57
$$ 65 6 -3 83 -172 -19 -224 -112 91 -43 -111 -124 -257 -114 -13 -145 49 108 -80 1 -334 -151 14 -243
2333b43L26j17K5J64Q4l49Q1Jj3k05K12L5L6J6k06J18n2j45J30J13p1N1m2j8p
$$ -243 83 -34 -9 155 239 -110 -29 -28 -41 -246 -34 1 37 53 -153 -35 -87 -232 -102 11 -60 -9 -51 -69 -76
2358g6K09k14K48l41J38O1k23K91j09K76l30J77j99R3J67j4J1k68J95P8P3k46
$$ -76 133 -81 167 -174 -36 25 -198 93 -16 260 -70 107 -92 1 168 154 165 -103 92 170 243 -3
2380cN7k1K11l9j19J98j99n7q7M2J03K13m47J51m4R7j46j26J80K96j49j77o7o4
$$ -3 54 33 244 205 86 284 85 28 -59 -17 86 299 -148 3 -41 56 -90 -216 -36 260 111 -66 -133 -197
2404a97K78j13Pk9j70K27p0r3n4Q2o2j00J74O6KO8l10K41L3q1NL05k53r9J66J20
$$ -197 81 -32 -25 -54 -224 3 -67 -160 -214 -132 -194 -294 -120 -54 -52 16 -294 -53 -20 -101 -96 209 -44 -143 23 143
2430A43M4k43j6j65M23k83J69J14j85k19L90k00L66m52O8J74j95Q6r2L70k13L3
$$ 143 187 -56 -72 -237 186 -97 72 186 1 -218 172 -28 338 -114 -46 128 -67 19 -73 297 84 117
2452A17j23k5lL09k22j5j39J05j62J99o6Q2j67J00R5k41L06J1j71q7P9J02j85
$$ 117 -6 -31 -34 275 53 38 -101 4 -158 41 -25 57 -110 -10 85 -156 150 161 -10 -97 -18 84 -101
2475a01K4O8j71K02j23r3j33M45k03L4n2M6J44j56P4j35K34j11j35J70j00J0j06
$$ -101 -77 -9 -180 22 -101 -194 -327 118 -85 -51 -103 -57 87 -69 5 -130 104 -7 -142 28 -72 -62 -168
2498a68m3J9M3J40O1l91K49j40J74p6R8K47j32k52N58n21M18l08R1k2j08k7J19
$$ -168 -211 -192 -149 -9 52 -339 -90 -230 -56 -132 -34 213 81 -171 387 -134 284 -24 67 45 -63 -90 29
2521B9JK64o7k94J61J43j76J98k35K16L2k26J22k10l6J24J02L2pl58K07J92k96
$$ 29 30 294 227 -67 94 237 61 259 24 240 272 46 168 -42 -78 46 148 180 173 -185 22 214 -82
2544h2J58j17N7q5j41M6L49n6j64lK7K07o2j33m9J0j15J40Pk6J55j05j58j4K19
$$ -82 76 -41 16 -69 -210 -164 185 129 -35 -38 -11 196 134 1 -48 -38 -153 -13 -6 -32 123 18 -140 -154 65
2569F5l9k2J04k16J98k25J17K51k38J15R5l51J28j30J11N9l9l36L25q1K66k09
$$ 65 26 4 108 -108 90 -135 -18 233 -5 110 205 -146 -18 -148 -37 22 -17 -353 -28 -109 157 -52
2591e2L4J94O1k77K28j23k40L92j36j02l6P7J47k92K37j33J42j54j02K41k74K51
$$ -52 -18 176 237 -40 188 65 -175 217 81 -21 -57 20 167 -125 112 -21 121 -33 -135 106 -168 83
2613H3j48J55n5m8j79K64j06n6j61J62j16J21MQL0N6J28k96L60j72k35J24j36
$$ 83 -65 90 35 -13 -192 72 -34 -90 -251 -89 -205 -84 -80 -72 -42 14 142 -154 206 34 -201 -77 -213
2636b13N1L4J97r2Qo9J0L3J00Ql39J78J05r1K78j17k45J90P9n6M5J6j46J52O9
$$ -213 -162 -128 69 -23 -15 -84 -74 -41 59 67 -272 -94 11 -80 198 81 -164 26 105 49 94 110 -36 116 185
2661A85j58K60l16L9K42j65J2k73J89L4QL7j33P8P8j06K77j15M6k28J51k24p6
$$ 185 27 287 -29 10 252 87 99 -174 15 49 57 94 -39 39 117 11 288 173 219 -9 142 -82 -158
2684a58L15j35J33m2m5k08K1J85j39m5K58k04K40l42R7R2l00J38n7oK33j99K8
$$ -158 157 22 155 113 68 -140 -119 66 -73 -118 140 -64 176 -166 -69 23 -277 -139 -196 -202 31 -168 -140
2707a40L95l41j16J20J8K9o4K35k62J4K00Q7l41J39j12Q4J8j54Q6J93j36j02P7
$$ -140 255 -86 -202 -82 -64 -35 -99 136 -126 -112 88 175 -166 -27 -139 -55 -37 -191 -105 88 -48 -150 -73
2730g3J53Q9k06K4K89j26k20K35k0r8k0k33L47Rk94K60o3L15l94P6l94J78k8M89
$$ -73 80 169 -37 -13 276 150 -70 165 145 47 27 -206 141 150 -144 116 53 368 -26 50 -344 -166 -194 295
2754B95K32j209P56N52l85k80O7j34L53k78K98l50J59N0j58N8n2R2K16m82K92
$$ 295 527 -682 74 626 241 -39 28 -106 247 -31 267 -83 76 126 -32 26 -26 66 282 -200 92
2775I2M2j13L3J10k19P1J27k4k61L6J1Q5m4J54j80K4L4j29j02J82Q2k41K36K3
$$ 92 134 21 54 164 -55 16 143 119 -142 -106 -95 -10 -54 100 -80 -56 -22 -151 -253 -71 11 -230 6 29
2799B9mJ0k13J32k7M3j05K66k02M7J32k1j67J98k02o2L92j12J7j19j59O5K7j1
$$ 29 25 35 -178 -46 -73 -30 -135 131 -71 -24 108 87 -80 118 -84 -146 246 134 151 32 -127 -62 -35 -46
2823d6K34r2j26J64j34m6K19mk32P8j16J10L2k59L81o1j19J5j60L23j00o6r5j27
$$ -46 188 96 -30 134 0 -46 173 169 -63 15 -101 9 41 -218 163 102 -17 -2 -162 161 61 -5 -100 -227
2847b27J38J02%k54K14Q7J34m46J72K14k53L4L56k38j41J22n4l29N04k44K32j17
$$ -227 -89 13 13 -241 -27 60 194 -252 -80 134 -119 -85 271 33 -108 14 -40 -369 135 -109 123 6
2869Fk08K79O7l32L16n0r3K5p0K50j79J3K07Lj25%R1o4N4l83J66J25j11j4LJ46
$$ 6 -202 77 144 -188 128 78 -15 10 -60 190 11 24 231 234 109 109 200 136 190 -193 -27 98 -13 -27 -24 122
2895A22j20j84J55K89k76%mK60j52r8K36L7l4l56K84l28J40J0l20N20l91K15K5
$$ 122 2 -182 -27 262 -14 -14 -18 242 90 -8 228 265 231 -125 159 -169 -29 -19 -339 181 -210 5 30
2918C0l5k98J49N33o36M75l05R8K65j26k30l4J05K53n65J96k8N77p90J97K98k56
$$ 30 -5 -303 -154 379 -257 218 -87 11 276 150 -80 -114 -9 244 -321 -125 -153 424 -366 -169 129 -127
2940a27j61N4K19O63o06l43Q0L18Pm81P46o38m3M60q52O72j87L99l56k07M22L0
$$ -127 -288 -234 -15 648 42 -301 -221 97 104 -377 369 -269 -312 148 -704 -32 -219 180 -176 -383 39 69
2962F9L41l42L5p0L01K61p14l91P99l71M03r7m03L52m36L51P8l68K73J47J10j76
$$ 69 410 68 103 33 334 595 -119 -510 289 -82 321 224 -179 173 -263 88 166 -202 71 218 328 152
2984A52m51Q11j616O60O46k18q64J332k65l69J98L72n61K25J10l80j90O51l57
$$ 152 -299 512 -1104 -444 202 -16 -880 452 187 -182 16 388 -173 52 162 -218 -408 243 -114
3003a14Q5l2k3J8R4N9L0r1j8R2j09j8J04j57j36J61m7L39j57r9q8P7J42m73M68
$$ -114 -29 -61 -84 -66 28 87 117 26 8 100 -9 -27 77 -80 -216 -55 -102 237 80 -19 -107 -30 112 -361 107
3028A07j7J45l02QK7J08O9k29J71j83J08l9n5L27m05J97K46j53k88J29k4J32j27
$$ 107 90 235 -67 -59 -32 76 145 -84 87 -96 12 -27 -82 245 -160 37 283 130 -158 -29 -53 79 -48
3051d8P9k1L2Q1m28L82l01K92j44l0m0m5LO0K0K13k09K05j05Rj56K54p1j96K03
$$ -48 31 10 42 123 -305 77 -224 68 -76 -106 -146 -191 -188 -128 -108 105 -104 101 -4 5 -151 103 32 -164 39
3076C9j81J43j55J10J10k6r9q2m1L7J24N4L5j89j4j1l3K73lJ08r6k64m1K76k4
$$ 39 -142 1 -154 -44 66 40 -59 -141 -182 -145 -21 33 68 -121 -135 -146 -179 94 91 199 103 -161 -202 74 50
3101E0j97K66k10n0K02lJ06l18J12J00j26K60k53J75o6n9j1J57k6j04J96nr5n6
$$ 50 -147 119 -91 -141 61 58 164 -154 -42 58 -68 192 -61 114 48 -11 -22 135 109 5 201 196 101 45
3125D5J12J1j73L8L00j97j27P7P6j40k71L50J3j9l14QQ7J00RJ68j0j53K5P0l4
$$ 45 157 168 -5 33 333 136 9 86 162 22 -249 101 114 95 -219 -211 -124 -24 -15 153 143 -10 15 85 51
3150E1P1n42M26J16r7O9l45L54p1Lj4j15Q16q80m32K52K97r22N61K61M78q55J49
$$ 51 122 -420 6 122 25 94 -251 103 32 35 21 -94 722 -158 -590 -338 -41 -963 -402 -141 337 -518 -369
3173c69K58L30o08M23j48M55l35rL61n94M7J70rm5j53L94n0l8N1j36J21j84nJ60
$$ -369 -111 219 -389 34 -114 341 6 -3 358 -236 -189 -19 -28 -73 -226 168 118 80 131 -5 116 -68 -73 87
3197H7n8j27Q4k7J28n1K28k81k4J84k92P7N8m5M0K76l94L81k76P8m37M62J8J01
$$ 87 29 -98 -14 -41 87 36 264 -17 -41 143 -149 -72 -14 -59 -19 257 -137 244 -32 46 -391 71 89 190
3221A90k70j46J13j8L07j99M8j15J90k1n4q9K84l15K81k72J18j1J08j21k9j65
$$ 190 -80 -226 -113 -131 176 -23 25 -90 100 79 25 -64 220 -95 186 -86 32 21 129 8 -21 -186
3243a86M14N6l95K36l%j87J75m7M2k4p9j18Q9k8O1j07P3r2J67k61L10M7k40j9
$$ -186 228 284 -111 125 122 122 -65 110 63 105 81 2 -116 -27 -55 6 -101 -28 -120 47 -214 96 143 -97 -116
3268a16l9J24r4J93J55l90K72l6j07j49K19j08MJ01r3J0J45Q6r1j7j08J43L9j15
$$ -116 -155 -31 -125 68 223 -167 105 69 -38 -187 32 -76 -72 29 -64 -54 91 177 86 69 -39 104 143 28
3292B8n3k7J43q0M3k49L10N3j10j01n9Oq4J56k77J19K18l24L78k70K50j24m8J03
$$ 28 -25 -52 91 11 54 -195 115 168 58 -43 -102 -96 -180 -24 -301 -182 36 -288 90 -180 70 -54 -102 1
3316Aj43O7J10l2j45K05M3O7L6l84K60l09L46p4l10L96k00P1J31R0m35N14k12
$$ 1 -142 -75 35 3 -142 63 106 173 209 -175 85 -224 122 48 -262 134 -66 5 136 226 -209 305 93
3339I3JJ37k13j06J63R4j34q6J56R8q5OK9j61J33L0j72O9k7R5k47K38j21o5j9
$$ 93 94 231 18 -88 75 169 35 -51 105 203 118 124 153 -8 125 155 -17 52 25 120 -127 111 -10 -75 -94
3364i4O9J80j90j37K60l7p4j21o8L46j51J69m12J07Q1k9J70Q6p5k13kK40J35m09
$$ -94 -25 155 -35 -172 88 51 -23 -144 -212 134 -17 152 -260 -153 -72 -101 69 155 80 -133 -135 105 240 -169
3388a69J09j01K03J19k34o1J84R8j54k0j76R1O0J52j33Q3M0j22L29k59k10Q7K63
$$ -169 -60 -161 42 161 -73 -134 50 148 -6 -26 -202 -111 -51 101 -32 51 91 -31 298 39 -171 -84 179
3411A79j03N6l43L30k55K52r1j7K46m12K17N8K4p4K50l87n5k4J21J64j57o0O5
$$ 179 76 132 -211 119 -136 116 25 8 254 -158 59 117 141 67 317 -70 -125 -149 -28 136 -21 -81 -16
3434a6n7N5J8k0L4k45K07j85J78j8K08j12j4J13k52p9J88P1p7L1m4PJ07j90q1
$$ -16 -73 -18 0 -20 14 -231 -24 -209 -31 -49 159 47 33 146 -106 -185 3 74 -3 28 -16 -9 98 -92 -173
3459a73Q5P6j51J64J38k34K0l02L50N1m1o5L33l10LJ66k6n2L7j33J81q2N3m2J76
$$ -173 -88 -12 -163 1 139 -95 -75 -377 -27 24 -17 -82 251 -59 -56 110 84 32 69 -64 117 35 88 46 222
3484B22k2j60q2J95k16J73L6j74l2K48j20p5P5j30K20j99K0l0Q2QK2n9Q4J27k14
$$ 222 200 40 -42 153 -63 110 146 -28 -60 188 68 -7 68 -62 158 -41 -21 -51 31 39 61 2 86 213 -1
3509aO0j86J56oJ56k54Q4j13J14p6k16L59l18L52k75Q1J41P8k57L6j81K01P3J82
$$ -1 59 -127 29 23 179 -75 9 -104 10 -66 -282 77 -241 111 -164 -83 58 136 -121 -85 -266 -65 8 190
3533A90K4o7R0k75N7j28J00J09k62L46m5m42L10J3O8j72J39p2j9K45K5N8j01j89
$$ 190 214 147 237 -38 19 -109 -9 100 -162 184 139 -303 7 20 88 -84 55 -17 -36 209 234 292 191 2
3557BP9J1j02n3q9J09j8M33l65O7q1K35j09p1K2n2M0k7N4L5k27l3k5K43J50j60
$$ 2 81 92 -10 -63 -152 -43 -61 372 7 74 -7 228 119 48 70 18 58 31 85 120 -107 -140 -165 78 228 68
3583F8Q2j96J07l38K29P5k33L50k27k56L09J65j39J41K7j10m3J2j38l7J78k24
$$ 68 150 -46 61 -277 -48 27 -206 144 -83 -339 -30 135 -4 137 164 54 11 23 -115 -152 26 -198
3605a98R6l7K74j91J93j36O5q3j01Q1J71l46L43j48Q6k19J54M2q2j68K67J22m28
$$ -198 -102 -139 135 -56 137 1 66 -17 -118 -37 134 -212 131 -17 69 -150 4 46 -36 -204 63 185 -243
3628b43J54J0k6M64l82J17k03J98ql2j1j44J75m7N1J63j65k0Jj16n4J24K00j43
$$ -243 -89 -79 -105 359 -23 94 -109 89 81 49 38 -106 69 22 73 236 71 51 52 -64 -118 6 206 63
3652F3j92M6n5RK51k92J7M9rN16l30q5l1J28p1n2J79l14N2L22j04o12P96r3n24
$$ 63 -129 -83 -138 -129 122 -170 -153 -104 -113 403 73 -12 -43 85 14 -38 141 -173 -121 201 97 -515 281 188 -336
3677c36J43j28N5M47o6j0p5k45K48J07m66P16n12P69p82L6p5M61k8k36m1l21L42
$$ -336 -193 -321 -266 181 115 105 30 -215 33 140 -326 390 -122 647 -135 -99 -174 287 259 23 -18 -339 3
3700Cm82M84K93n54L54Q7O7k74k1m3p6R5K9K8k2k0J41j47O3N9nJ57l18K19mq1
$$ 3 -479 5 298 -256 98 185 252 -22 -43 -86 -162 -67 -38 -10 -32 -52 89 -58 5 64 59 216 -102 117 113 32
3726C2o7J40K76m09J1J10J4j08J39o3m7n5K7j69J56o2j19J46j55J70j6k16L63
$$ 32 -35 105 381 -28 -17 93 107 -1 138 75 28 -27 0 -169 -13 -75 -194 -48 -203 -33 -49 -265 98
3749I8k34O8K12P5n28K86j13q8J43P6n2j6j4J03j21K33j11J34qj65J5j05MJ50
$$ 98 -136 -68 144 219 -309 -23 -136 -224 -81 -5 -57 -73 -87 16 -105 128 17 151 143 -22 -7 -112 -108 42
3773D2QJ93k06m7j1J37qk28L12k22OJ68ol38K37N3m5Q6N3j6l99K27P8r6o5J87
$$ 42 50 243 37 -10 -21 116 108 -120 192 -30 -24 144 138 -200 37 90 45 131 184 168 -231 -4 74 -22 -87 100
3799A00l50L35J23k57N1J50J08k15p1R4k50r8K92J0m1O3o4j70J69o7K79k06j36
$$ 100 -250 85 208 -49 2 152 260 45 -26 68 -182 -280 12 22 -19 44 -20 -190 -21 -88 191 -15 -151
3822a51L31p0m2j49j18J49j21K09j60q6K25q1l7J58k12L11l06K5M12m35J46PJ83
$$ -151 180 110 68 -81 -199 -50 -171 38 -122 -208 17 -64 -101 57 -155 156 -150 -125 287 -148 -2 5 188
3845A88j64k16L41L6k46L85j14Q8j99jk62K17k10OM00r0m96N78j12jj71K48k53
$$ 188 24 -192 149 185 -61 324 210 298 99 98 -164 53 -157 -151 249 159 -337 241 129 128 -43 205 -48
3868d8K82k87m2Q3j5j41J98L7q7j61K56J8jk8j68J67K92k94J4m23J75j74J37K68
$$ -48 234 -53 -95 -12 -27 -168 30 67 -20 -181 75 93 92 64 -104 63 355 61 75 -348 -173 -347 -210 58
3892E8j34N0QK85m56J67M8Mj82L1J81l1K2m7kp3J7J44j59R3J26k24J39k7M1q5
$$ 58 -76 -26 -18 267 -189 -22 26 30 -152 -121 60 29 51 4 2 -71 -54 90 -69 24 150 -74 65 38 79 -6
3918fk6J43m9q8j50M54k70pJ65q8q3L5r2J64j22j8m4k1K23q2K41j21m1J3oJ52
$$ -6 -32 111 62 -26 -176 278 8 1 166 78 -5 30 -62 102 -20 -38 -82 -103 120 38 279 158 117 130 124 276
3944B76k88O4J99o44K48K19m1Nj47J97n3j90L56k64J32l6Q3r3O9O7m07L40j70
$$ 276 -12 52 251 -393 -145 74 33 38 -109 88 35 -155 201 -63 69 33 116 23 92 159 -248 92 -78
3967g8J01j45L40j85r6K14r0P8r7j49j08J15r0L11lk55p7oL34j54n6M0L44l22
$$ -78 23 -122 218 33 -63 151 61 139 42 -107 -215 -100 -190 121 118 -137 -214 -220 114 -40 -96 -56 288 -34
3991c4k8Q4J02k63Q6n6J67k0L5q1P7k6j19M7l8K19k55Q9J90o8l18K78k41K43m7
$$ -34 -62 22 124 -139 -53 -109 58 38 73 -8 69 43 -76 -29 -67 152 -103 -14 176 108 -210 68 -173 70 23
4016B3o0J32r9k43K87Kj39K78j81j15J17J32j66J49k94k6K06m5r8K14R3j69k3
$$ 23 -37 95 -4 -247 40 42 -97 181 0 -115 2 134 -32 117 -177 -203 3 -42 -140 74 167 -2 -25
4039b5m6N3Q5p2Q3j00j9J0k59K8L22Lq2R5O0l86K44PO9k47J45L11k65K40k21J76
$$ -25 -71 -18 67 -5 78 -22 -41 -31 -290 -262 60 63 -19 76 136 -250 -6 1 70 -177 -32 279 14 254 33 209
4065B09j90M1j60L1K3J58n3j68L14q7M9n5l35Q2L2J12k50M22m8j91J22j08J22
$$ 209 19 60 -100 -69 -46 112 59 -109 205 118 167 112 -223 -141 -109 3 -247 175 127 -64 58 -50 72
4088G2J9L9Q6k38n4k4o2K64m76M55n2Pn1J90P9k90J24nq7L9P2K07l99K20Jj81
$$ 72 91 130 216 -22 -76 -100 -162 102 -374 81 29 36 -15 175 254 -36 88 83 -4 35 107 314 -85 135 136 -45
4114d5J46q0j82K50J03j83N1j73L05l23J1J10N1P8O8n3j87Q4n5j09J13J68l16
$$ -45 101 21 -161 89 192 9 60 -113 192 -131 -120 -10 41 119 187 134 -53 31 -24 -133 -20 148 -168
4137a68J26J9PK46k47K6r0Qj68P0N8J98j11R2L18l25m7J6J34Lj82K09j0l69K81
$$ -168 -42 -23 -16 230 -17 9 -81 -73 -241 -171 -113 85 -26 66 384 59 12 28 162 165 -17 192 182 -187 94
4162I4l5j23R7O8j87R7L6p5J4j0J23j19QJ04m9K15k51KJ13l00K74m2q8j13J6K46
$$ 94 59 -64 33 101 -86 11 47 -28 -14 -24 99 -20 -12 92 43 258 7 9 122 -178 96 54 -34 -147 -131 115
4188A15j97K7L1R2j9m0J2k99M66l37N7J25m6R4n8j51L49k64J04M5j14q2p0k8J46
$$ 115 -82 -55 -24 68 49 9 21 -278 188 -149 -92 33 -13 81 23 -128 221 -43 61 106 -8 -90 -160 -188 -42
4213d2j9K46Qj28j66J65j53j4L10n1O2k45J42m91J89K28K59l78N3n3J79J6P4j92
$$ -42 -61 185 193 65 -101 64 -89 -103 207 156 218 -27 115 -376 -187 41 300 -78 -25 -78 101 117 191 -1
4237aM6K17l09r0L20j78j41K51l09K17k04l4K42J70j41j28j8J52J8j24m9J83k
$$ -1 45 262 -47 -137 183 5 -136 115 -194 23 -181 -215 27 197 56 -72 -90 62 80 -44 -93 90 88
4260H8k0oQj26L4q8K6N6R7l7J7np0K32l45k3J62K1J99j2l27K63l17K76j35j43
$$ 88 68 62 70 -56 -22 -110 -84 -28 69 32 49 44 -26 206 -139 -162 0 21 220 208 -119 144 -173 103 -32 -175
4286a75M5J84pj38K66n1j39q4L76k46q4n6Nj2L52k24J08J12l18J18l9J53j02n8
$$ -175 -130 54 47 -91 175 124 -15 -99 277 31 -53 -109 -104 -116 236 12 120 232 -86 32 -7 146 44 -14
4310a4J66m4j66K07j95K37l73O8J98k13J9J63j39K6K56Q9l87qp2K1j2K43n9K9
$$ -14 152 108 -58 149 -46 191 -182 -114 84 -129 -110 53 -86 -60 196 285 -102 -110 -182 -161 -173 70 11 40
4334D0J04k74J79k48L36l03K81l43n4K40O2k68J53J17J9n8L2k75J68Mj15K54J8
$$ 40 144 -130 49 -199 137 -166 115 -228 -282 -42 20 -248 -95 22 41 -17 15 -260 -92 -88 -203 51 69
4357F9l22J87J44K7J48k79J76j95J8J68j98J65k07J05l0J62m6r7q0L35k84j9J11
$$ 69 -253 -66 78 105 253 -26 150 -45 -27 141 -57 108 -99 6 -24 138 92 -5 -85 250 -34 -53 58
4380E8O9k00K42q8j92L68j40j49J04K07j39k93L42l3NJ51k03k13K58k45J61o1
$$ 58 127 -73 169 81 -111 257 117 -32 72 279 140 -153 189 156 161 312 109 -104 154 -91 70 9
4402Iq1L27k87J48o2j00J39j37J94k87P0j25J37j07K75r9k12L36l17OK65n4J48
$$ 9 -72 255 -32 116 54 -46 93 -44 150 -137 -67 -192 -55 -162 113 14 -198 138 -179 -173 92 38 186
4425A86l33J86k07J51Q8L4n6l9k97K22K43k56J46o8J14j56K4k16N00k52j03J24
$$ 186 -147 39 -168 -17 71 105 49 10 -287 -65 178 -78 68 0 114 -42 -18 -234 266 14 -89 35
4447C5r6p3J93L8j60j3K32o0r6P5K1%kj28k3k4j5l0J92J35j77M5J23K6l25L3J65
$$ 35 -61 -134 59 97 -63 -76 156 96 0 75 96 96 94 -34 -57 -81 -96 -126 66 201 24 69 192 218 -107 -74 91
4474I1nk84J20r7L3K58j64J40j62J6L0J95k95L9K34k40Q4r9J59r6J04J27k3j76
$$ 91 86 -198 -78 -175 -142 116 -48 92 -70 -54 -24 171 -124 -85 149 -91 -7 -106 53 -43 61 188 165 -11
4498a1j2N8J76p4r0j54R1k6r4L3r0J68K3j11L76l16J53j44p9J57j37J35n3K2j75
$$ -11 -23 35 211 137 47 -107 -16 -42 -136 -103 -193 -25 -2 -113 263 -53 100 -44 -123 34 -103 32 -21 1 -174
4523a74J01Q9L8j25J9PO4J55j42m6j7L4l9Q8O2lr2p6O4N1K4N3j27j10K48k77K57
$$ -174 -73 16 54 -71 -52 -45 19 174 32 -14 -31 3 -36 52 114 111 19 -57 7 58 82 135 8 -102 146 -131 126
4550A26jj88K9m9p2L11l98M65m5l21J56K0j19l5J01j34K34n7k28J57m4Q4r2K71
$$ 126 125 -63 -34 -83 -155 156 -242 223 178 -143 13 33 -86 -121 -20 -154 80 23 -205 -48 -92 -8 -100 171
4574A71j94P2LL9k20m9J18N1O4j89M9j04J65J04k22Q4J2N4O0q7J20m3l1j22K51
$$ 171 -23 49 52 91 -129 -178 -60 -9 55 -134 -85 -189 -24 80 -142 -58 -46 8 68 -19 101 58 27 -95 156
4599A56k68N1p4K40J72j99j05K5R7n0p7K39k70J81J85k32P1mqK20k10j18j5J70
$$ 156 -112 -61 -135 105 277 78 -27 -2 95 45 -32 207 -63 118 303 71 142 138 130 350 140 22 7 177
4623A77k04R9k07J71k4J04m4K25j42r6M5k20J44p5J10m8n1O5L6J06l5O3k23K01
$$ 177 -27 72 -135 36 12 116 72 297 155 59 104 -116 28 -47 63 15 -36 29 65 171 136 199 -24 177
4647A77k60K9J74j11L6m5j28J59k1l2J56k90K59n4P1k20K51o2j04K05J21l45J17
$$ 177 -83 -54 120 9 45 0 -128 31 10 -22 134 -156 103 49 120 -100 151 89 -15 190 311 -34 83
4670H3K1j19O4Q0q7j75j5L44k75J19nl4O0R0j45J11j55Q1L4j94K37q2P6j73l6
$$ 83 104 -15 49 129 42 -133 -148 196 -79 40 35 1 61 151 6 117 -38 43 77 -117 120 38 114 -59 -95
4695i5J56j42K20n4j64p2R2J62k1j75K64n3pk75L54m28O7J99j60p8K88k90L18
$$ -95 61 -81 139 85 -79 -151 -59 103 82 -93 171 118 111 -164 190 -238 -171 28 -132 -210 78 -212 106
4718A06l13Q1J07p5O0J69j79N6lm6J28j13M9j40J43J13ql20L77j69J00j61J38
$$ 106 -207 -126 -19 -94 -34 135 -44 12 9 -37 91 -22 27 -113 30 143 135 -185 192 23 123 -38 100
4741A00L0j67j28K67k25l6K39k53O8p5J41N8j43q6J96K20N7j95j06L24j09j40
$$ 100 130 -37 -165 102 -123 -159 80 -173 -105 -180 -39 19 -124 -210 -14 206 263 68 -38 286 177 37
4763C7k4j31O8J0M8k82R62l54l30r5L7K69l92Q0k6J0j31L60j43j20K72l7l11L20
$$ 37 13 -118 -50 -40 8 -274 688 334 4 -91 -54 215 -177 -97 -123 -113 -244 116 -27 -147 125 88 -223 97
4787I7Mr2j4P5k5J9j18L7p2J70L0k33J13J1j27J95J24k99J47PJ39j79k7J29N3
$$ 97 101 9 -5 70 45 64 -54 -17 -89 81 111 -122 -9 2 -125 70 194 -105 42 49 188 9 -18 111 164
4812A64mj33j69L32j41o1j59J42OJ6J26M3k58K95j30q9J44p4kQ2k15J13K7LJ26
$$ 164 160 27 -142 190 49 -12 -171 -29 -23 -7 119 162 -96 199 69 -20 124 50 48 130 -85 28 55 58 184
4837A84j49j72K27j99R3Q4M1r5J01l40N5O6L13j90LJ2l8K83l29J8j21jk79M69
$$ 184 35 -137 90 -109 -16 68 109 14 115 -225 -170 -104 209 19 22 34 -4 279 -50 -32 -153 -154 -433 36
4861C6j63P5q8J03j40J72J27j19L1j47J71q5J53n13M07j58K52mk72j00M7L02O5
$$ 36 -127 -52 -140 -37 -177 -5 122 3 34 -113 58 -27 126 -387 20 -138 114 110 -162 -262 -215 87 152
4884A52NL3q2K7j77K6Q2J15lk38J86oj64J29J06r1j4j10l1P2q3K56l16J35J99
$$ 152 157 190 108 135 -42 -16 66 181 178 -60 126 120 -44 85 191 100 86 -24 -55 17 -66 190 -126 9 208
4909B08k48J79k0pqk78N2K41M0k05n8J55j38J36J81k37J08j43J31j82l3K22k86
$$ 208 -40 139 119 112 104 -174 -122 119 159 -46 -104 51 -87 49 230 -7 101 -42 89 -93 -126 96 -190
4932a90j4K27M8l07K15J27m4P6j33K19j90Q5J21j28j78Q0Jj19N0N7Q0k72k8K34
$$ -190 -204 23 71 -236 -21 106 62 138 5 224 34 119 240 112 -66 14 15 -104 -54 3 83 -189 -217 17
4956A7q6J49j51m6J24n8J85J12k78O1J0K1r4p2j66M21k19j7J13j12J1J63l00K66
$$ 17 -69 80 -71 -117 7 -51 134 246 -32 29 39 60 -34 -106 -272 149 -70 -87 26 -86 -75 88 -212 54
4980E4k15QM4K77j29p1M2j48J08J9l2K32p2j86M2K46j36j64J22n6J89j52o5K7
$$ 54 -161 -153 -109 168 39 -32 10 -138 -30 -11 -43 189 117 -69 -27 219 83 -81 41 -15 174 22 -43 -16
5004a6K24k40J57m8j54K83n5j68J65j17M7j52m0J66k21L10l57R9J07J21p0o8j30
$$ -16 208 -32 125 77 -77 206 151 -17 148 31 78 -74 -114 52 -169 141 -216 -117 -10 111 41 -27 -157
5027a57M98l28j21M6J07j55R8o1J77l0n7j37j8P8r7P0L4J21O9j29o8R8nlm6mm3
$$ -157 341 13 -108 -62 45 -110 -12 -73 104 74 17 -120 -138 -60 -157 -87 -53 68 137 8 -60 38 33 30 -16 -20 -63
5054f3L8%J50J4j20J87k90N7J17j00Q4j8J64k24M5j5m1j21k7L88l10k47K34RJ28
$$ -63 -25 -25 125 139 19 206 -84 -27 90 -10 74 56 220 -4 41 26 -15 -136 -163 225 -85 -332 -98 -89 39
5079C9J16k27M5j15K81m0j81j33M79k60J10k11n1P8J31k28KL61k76Q6j6q5j17
$$ 39 155 -72 -27 -142 139 99 -82 -215 264 4 114 -97 -148 -70 61 -167 -165 196 -80 6 -10 -95 -212
5102b12K46qj16K24n7J0j91N5M7j83K49j44Pl3J60j78L79k00Lk75J89L0o2N5l2
$$ -212 34 26 -90 134 77 87 -104 -49 -2 -185 64 -80 -73 -106 54 -124 255 55 58 -217 -28 2 -60 -5 -37
5127c7J62j57j41K90o6p7Q5M8k41K49%m7J75m19L06j58J40n8J43j55j72m6J94
$$ -37 125 -32 -173 117 51 -26 59 107 -134 115 115 68 243 -176 130 -28 112 54 197 42 -130 -176 18
5150A8K3K39l66oo5J30K66j20Nj57L0J7J46r1Oj40j10Q2J67k19P6p9K05j84k4
$$ 18 41 280 -86 -92 -157 -27 239 119 124 -33 -3 14 160 69 75 -65 -175 -93 74 -145 -69 -148 57 -127 -151
5175a51J22l0K27r9N7k39K9K33P1o4k95K80l33J72L9Q0k16J33k0j7j00J65K15
$$ -151 -29 -59 168 69 126 -113 -84 149 220 156 -139 141 -192 -20 19 99 -117 16 -4 -21 -121 44 259
5198B59j74L9r8p5L45m53K7K00k50j9M2K13l5m4r6J27j44K17O1j12N6j9M5o2j25
$$ 259 85 124 26 -49 296 -157 -130 70 -180 -199 -157 56 21 -23 -119 8 -136 81 142 30 86 67 112 50 -75
5223g5J80k62K92j14Pk09K99j60m3J28R2k28J29k02K15q2Mj5Q2J3q1pk0K00k07
$$ -75 105 -157 135 21 28 -181 118 -42 -85 43 135 -93 36 -166 49 -33 -29 -44 38 51 -30 -37 -57 143 -64
5248f4L24l28m2J11L0JJ83j40p3j51R2L3R0j33l6J12o7j22K5K52l84N36j46k51
$$ -64 260 -68 -110 1 31 32 215 75 2 -149 -57 -24 66 -67 -103 9 -58 -180 -155 97 -287 249 103 -148
5272a48J36M1j51Q0J56j41j7L70k44m3L4J3J68k77q2J1K75l01K45j00K7k25J85
$$ -148 -12 29 -122 -42 114 -27 -44 326 82 39 73 86 254 -23 -105 -94 181 -120 125 25 52 -173 12
5295A2j25j4K89l7j99p8J48O9k81J66l0J23m2K44j02j4Ok14j19P1J27k5j35L19
$$ 12 -113 -127 162 125 -74 -152 -4 65 -216 -50 -80 43 1 245 143 129 135 -79 -198 -127 0 -25 -160 159
5319A59k42KK07k53N09m11L53n58J44L54n69K07K01k32K17J05l96J58J23q5Q6
$$ 159 -83 -81 126 -127 382 -29 324 -234 -90 264 -305 -98 103 -129 88 193 -203 -45 78 -7 79
5340G9K6k65L58j36r2K34k07k7O9J89l00L03p0k51P1L28M32o32P8j05Q5L69j003
$$ 79 105 -160 198 62 -30 204 -3 -30 39 228 -72 231 161 -90 -19 309 741 109 187 82 167 536 -467
5363d67J0J001j015Q97j70J21q38J78M96l20j35P62l16p42p4O97m16J51Q1J20
$$ -467 -457 544 -471 426 256 377 -461 -283 213 -107 -242 520 204 -538 -612 85 -331 -180 -99 21
5383B1L95p6j31j12j10O2M3n17L72L52m18K12l0k26R8J0LM0j44lJ35j49K65K6
$$ 21 416 340 209 97 -13 49 92 -425 -53 299 -119 93 63 -163 -65 -55 -52 -12 -156 -159 -24 -173 92 118
5407A18r0pK25l19N6J7j93L7J32J23O6m84L55M8K5j47L67j47k04R5N6o0l26J79
$$ 118 28 21 246 -73 -17 0 -193 -156 -24 99 165 -319 36 84 109 -38 329 182 -22 73 129 69 -257 -78
5431g8J42m2K86n17J72L36l86L16l00P1R2m6j2j27M9O3%ok78L57J98k92M4q8j9
$$ -78 64 22 308 -209 -37 299 -87 229 -71 0 92 46 34 -93 -44 19 19 13 -265 92 290 -2 42 -46 -65
5456f5Q3l9R7L9j50k45J42K55m1m0m5K9r7R9r6K2m3P1J6M3L2q8M2nj35K57JJ9
$$ -65 18 -21 76 115 -35 -280 -138 117 76 36 -9 20 -77 22 -74 -52 -95 -24 -8 35 67 -21 21 16 -119 138 139 158
5484A58l23L5J13J79k73K22l12M45j39l63L40l4J32k96K58j67k7J07P2o9kj15
$$ 158 -165 -130 -17 162 -111 111 -201 244 105 -258 82 48 180 -116 142 -25 -52 55 127 58 56 -59
5506e9K96k52k2o1L8J51k1J26j43J95j96Q3N2l08K75k36J85m43M61k65R2j71L64
$$ -59 237 -15 -37 -98 -60 91 70 196 53 248 52 135 187 -121 154 -82 103 -340 121 -144 -52 -223 141
5529A41j1m18K30R3p4K6l1LJ55n2n6K4jk6J05k50J63k06N9M85l62p0J43k14J85
$$ 141 130 -288 -58 35 -39 -13 -44 -41 114 62 6 30 29 3 108 -142 21 -185 -126 359 -3 -73 70 -144 41
5554D1k41j06K89q5J61k02J87m4q1K25l22N3L31k84K49j49J25o4J01j6j20P3r9
$$ 41 -200 -306 -17 -102 59 -143 44 0 -81 144 -178 -125 206 -78 171 22 147 83 184 168 48 121 22
5577B2n3rP6K3l0J67K53l22k92K46J25j56j25J3O3k79M34rk74k1K67J0l3k98J50
$$ 22 -31 -40 36 59 29 196 449 127 -165 81 206 50 -75 -62 1 -278 156 147 -127 -148 119 129 96 -202 -52
5602e2j07kM09k13j59j11J86J04m83L65J52k66J78j73J31J7o0L50l77P2l4Q8m3
$$ -52 -159 -161 248 35 -124 -235 -49 55 -428 -63 89 -177 1 -172 -41 -24 -84 266 -111 -39 -73 15 -28
5625b8P4P1O4k02K2J91j29J8jJ1j1M4M4l82L55k27J29L8Q1J25m51kK64j56l2M1
$$ -28 46 117 181 -21 1 192 63 81 80 91 80 124 168 -214 141 -86 43 81 162 287 -164 -166 98 -58 -90 -49
5651d9LJ12k27N3o0J52J4jj40J49p0j6J33j0J4m6j47n8J93J66k25J5p1K71o6J2
$$ -49 -46 66 -161 -108 -168 -16 -2 -3 -143 6 -64 -80 53 43 57 11 -136 -194 -1 165 -60 -45 -116 155 89 101
5677A01j82K41J15k99L4j59J20j56R2p7k1Q6L13k37M7N3l11K22n2j12k8L76j20
$$ 101 -81 160 275 -24 10 -149 -29 -185 -93 -170 -191 -105 208 -29 18 71 -240 -18 -70 -182 -210 166 46
5700D6j45O2pJ00j26Ln2R1j23p1R5K57k52J04J71k22J42l6l99K84o3J60j15J68
$$ 46 -99 -37 -44 56 -70 -67 -119 -28 -151 -222 -127 130 -122 -18 153 -69 73 37 -362 -78 -141 19 -96 72
5724G2k91J99P9Q4r8J46j74j41J49m3j26MK72J6j48N6N9K9j83p4J21k75K06J6
$$ 72 -219 -20 59 143 45 191 17 -124 25 -18 -144 -140 132 148 0 56 115 144 -39 -113 8 -267 -61 -45
5748d5k6P5k07J72l1J36M6j94J68p1j7J1l1l3O5K1P5lOj32J34r2J14q3r7o7K33
$$ -45 -71 4 -203 -31 -62 74 120 -74 94 23 6 17 -14 -47 18 39 114 111 117 -15 119 27 141 58 -39 -106 127
5775A27j28K2j35j00J53P0J44J83k88Lj14J81l4J24j01j5j01Jl1L73l07j23K5
$$ 127 -1 21 -114 -214 -61 9 153 336 48 51 -63 118 84 208 107 92 -9 -8 -39 334 27 -96 -71
5798g1Q8J67p0j70M9K57l42K19j33j28o9R8n3N1J29K0L7L79m74j91J87k08L15
$$ -71 17 184 114 -56 -7 250 -92 127 -6 -134 -203 -105 -158 -107 22 42 79 458 -16 -207 -20 -228 87
5821H7K0P5L7j75K77l50n8K55l24P3r9K33o0q7L6r5J34k5j3J2N4j08l3J0J55j50
$$ 87 107 182 219 44 321 -29 -87 168 -156 -83 -182 51 -9 -96 -60 -155 -21 -46 -59 -47 7 -101 -134 -124 31 -119
5847a19J96q6Kj3Q7J69j79Kj52K55k02M3J58k37J86j5Q2j97m3Q1r4k52J69K86
$$ -119 77 -9 -7 -20 67 236 57 59 -93 162 -40 3 161 -76 110 95 177 -20 -63 18 -76 -328 -159 127
5871A27Ol25j63J76L89l43M61l46J88k01j40J1O1K80k37J52k03k1L8J23P7l79
$$ 127 133 -192 -355 -179 210 -133 328 -18 170 -31 -171 -160 -99 181 -56 96 -107 -128 -90 33 110 -269
5893b69L05R9M91p77J25j70J69L26k79j66j5J89Q0j75n5L67j73L3J44k82l21N43
$$ -269 36 135 626 -151 -26 -196 -27 299 20 -146 -161 28 108 -67 -122 245 72 105 249 -33 -354 189
5915A89j01J2j54N20o05M53J3J46l42m8j79M25k06m99J15j87J079n49k31K57m26
$$ 189 88 100 -54 466 -139 314 327 473 131 83 -96 329 123 -376 -261 -448 631 82 -149 108 -318
5936c18J51l03O63j71l64R1J94j46O44n9l44l89O44o60J81P37m76j20L22o35k2
$$ -318 -167 -470 193 22 -342 -251 -57 -203 441 382 38 -351 293 -367 -186 551 75 -45 277 -358 -380
5957c80J01K20k70K28m2O6P7P2j4L5K6M3k84O1J32j1j0P1k3j08K8J6J32j28o5
$$ -380 -279 -59 -329 -101 -143 -77 0 72 58 93 119 162 -122 -61 71 60 50 121 98 -10 18 34 166 38 -27
5982b7M1P0j57qQ4M8j28J79j30J04p4j71J51j30L09J2r1k77K47m6k16J91J37N6
$$ -27 14 84 -73 -81 3 51 -77 102 -28 76 2 -169 -18 -148 161 173 82 -195 52 6 -210 -19 118 174
6006A74n1j62J05j29l1J10M1Q9m8k73r2K80j05j27K43o8n4q8K64j15J47k05M07
$$ 174 123 -39 66 -63 -94 16 57 146 98 -175 -267 13 -92 -219 24 -44 -98 -186 78 -37 110 -95 312
6029C12k97P7j34J6L0K9m7K01k49L62m34L32l47K67j55L0J73l08N4o8L24j54J38
$$ 312 15 92 -42 -26 4 33 -14 187 -62 300 -134 198 -149 118 -37 -7 166 -142 -88 -156 168 14 152
6052A52n1jj81L48j99j12j10M22j55j19P5l20L30l22M42o3k09k2Q6J7n2K3j4K17
$$ 152 101 100 -81 267 68 -44 -154 268 113 -6 69 -251 79 -243 199 136 -73 -95 -9 8 -44 -21 -35 182
6076A82m58J06K40k66L50k22j41K20np5J9j68K59o2Q6J10k27L7P6J66r2k82K51
$$ 182 -276 -170 70 -196 154 -68 -209 11 6 -69 -50 -218 41 -21 65 175 -52 -15 61 227 135 -147 104
6099A04j54L75k27l0j6Q6j32J80m5j82n3kQ1J3K86m04K18r8J04j81p8k7J53L47
$$ 104 -50 325 98 68 52 138 6 186 141 -41 -94 -96 -15 -2 284 -120 98 0 104 -77 -155 -182 -29 318
6123C18j60j79N7m0j67L76M9l26K9J0j08J95k40J95j06M5l0O7J81j32J0Mnj33
$$ 318 158 -21 36 -4 -171 205 254 -72 -43 -33 -141 54 -186 9 -97 -52 -82 -15 166 34 44 48 43 -90
6147i0M8N8m5m3N7Mo9M2M4Rj54K01k6n3j65P9J02J17j90P3R0k02Q8m1k3K91k65
$$ -90 -42 16 -29 -72 -15 -11 -80 -38 6 15 -139 62 36 -17 -182 -103 -1 116 -74 -1 89 -113 -25 -66 -89 202 -63
6174f3n8k3Q0LJ31j05P7j29l7J5J28o9l4kP6j19J20K44j73m6Nj45j43J8J59J19
$$ -63 -121 -144 -64 -61 70 -35 42 -87 -124 -109 19 -50 -84 -86 -10 -129 -9 235 62 16 21 -124 -267 -249 -90 29
6200B9k04K10N7k07P6m6O3j99L19j07J11J63k69j03k0J52p7J02k24J92K4Q0k81
$$ 29 -175 35 92 -115 -39 -85 -22 -221 98 -9 102 265 -4 -107 -127 25 -52 50 -174 18 42 122 -159
6223a59J15K94l90M35j54j96J75l16M04l31J72k01K96l65J84J0O4j19m8KJ90J14
$$ -159 -44 250 -140 295 141 -55 120 -196 208 -123 49 -152 144 -221 -37 -27 37 -82 -130 -128 62 176
6245A76l08L14j28P8k65J56k02J46M0rR8j16K4j34m6K78o3P3n1j72J45Q3k52J58
$$ 176 -132 182 54 132 -133 23 -179 -33 7 -2 96 -20 4 -130 -176 102 39 112 61 -111 34 117 -135 23
6269B3J9p3j08K13j51m9n6K34q5k2M0L3M5m4j79J92j36M8m8J6J39J39j35j60J82
$$ 23 42 -31 -139 74 -77 -126 -182 52 -33 -55 -15 18 63 19 -160 32 -104 -56 -104 -88 51 190 55 -105 77
6294G7j70K66k88J90j49J94j06n0k11J51L6O2j03J86O2k90L05n6k51J44p7K13
$$ 77 -93 173 -115 75 -74 120 14 -36 -247 -96 -60 2 -101 85 147 -143 162 106 -145 -1 -78 135
6316A35j20O4j45J23n7J29l26K80O0j97K8q4N2J02K15m30J36j04j6J89k0J4K56
$$ 135 15 79 -66 57 0 129 -197 83 143 -54 -26 -110 -58 44 259 -171 -35 -139 -155 34 14 28 284
6339B84m1j68j5J86m80J32J68l1k8J51j19J51l84K89k26L6j7J25k24J18J83j51
$$ 284 243 75 60 246 -234 -102 66 35 7 158 39 190 -194 95 -131 -95 -112 13 -211 -93 90 -61
$$ [...]
8191D0
##END NTUPLES=NMR FID
##END=
