##TITLE=1H_SR3_rmo
 CDCl3, 8 sc, 
 14.10.2019
##JCAMPDX= 6.0         $$ Bruker NMR JCAMP-DX V2.0
##DATA TYPE= NMR FID
##DATA CLASS= NTUPLES
##ORIGIN= UXNMR, Bruker Analytische Messtechnik GmbH
##OWNER= root
$$ XWIN-NMR		Version 3.5
$$ Mon Oct 14 14:24:32 2019 Russian Standard Time (UT+4h)  she@DPX200
##.OBSERVE FREQUENCY= 200.1315
##.OBSERVE NUCLEUS= ^1H
##.DELAY= (6, 6)
##.ACQUISITION MODE= SIMULTANEOUS
##.ACQUISITION SCHEME= undefined
##.AVERAGES= 8
##.DIGITISER RES= 18
##SPECTROMETER/DATA SYSTEM= spect
##.PULSE SEQUENCE= zg30
##.SOLVENT NAME= Acetone
##.SHIFT REFERENCE= (INTERNAL, Acetone, 0, 15.7039)
##AUDIT TRAIL= $$ (NUMBER, WHEN, WHO, WHERE, WHAT)
$$ ##TITLE= Audit trail, XWIN-NMR		Version 3.5
$$ ##JCAMPDX= 5.01
$$ ##ORIGIN= Bruker BioSpin GmbH
$$ ##OWNER= she
$$ F:/spectra/data/she/nmr/H-F/1/audita.txt
$$ ##AUDIT TRAIL=  $$ (NUMBER, WHEN, WHO, WHERE, WHAT)
(   1,<2019-10-14 14:23:26.43 +0400>,<she>,<DPX200>,
      <created by zg, POWCHK disabled, PULCHK disabled
       configuration hash MD5:
       00 E9 B6 7A A2 85 ED C7 34 08 36 98 17 FE 4E 26
       data hash MD5: 16K
       B7 BE F3 FC 91 FE 74 9D 28 C2 22 5A 17 FD FE 54>)
$$ ##END=
$$ 
$$ hash MD5
$$ 01 60 D7 27 D9 69 6A D7 FF 5A 05 4F 67 30 3F 67
##$RELAX= 
##$RELAX= 
##$RELAX= 
##$RELAX= 
##$RELAX= 
##$RELAX= 
$$ Bruker specific parameters
$$ --------------------------
##$DU= <F:/spectra>
##$EXPNO= 1
##$NAME= <H-F>
##$PROCNO= 1
##$TYPE= <nmr>
##$USER= <she>
##$AMP= (0..31)
100 100 100 100 100 100 100 100 100 100 100 100 100 100 100 100 100 100 
100 100 100 100 100 100 100 100 100 100 100 100 100 100 
##$AQSEQ= 0
##$AQ_mod= 1
##$AUNM= <au_zg>
##$AUTOPOS= <>
##$BF1= 200.13
##$BF2= 200.13
##$BF3= 200.13
##$BF4= 200.13
##$BF5= 200.13
##$BF6= 200.13
##$BF7= 200.13
##$BF8= 200.13
##$BYTORDA= 1
##$CFDGTYP= 0
##$CFRGTYP= 5
##$CHEMSTR= <none>
##$CNST= (0..31)
1 1 145 1 1 1 1 1 1 1 1 1 1 1 1 1 1 1 1 1 1 1 1 1 1 1 1 1 1 1 1 1 
##$CPDPRG= <>
##$CPDPRG1= <>
##$CPDPRG2= <>
##$CPDPRG3= <>
##$CPDPRG4= <mlev>
##$CPDPRG5= <mlev>
##$CPDPRG6= <mlev>
##$CPDPRG7= <mlev>
##$CPDPRG8= <mlev>
##$CPDPRGB= <>
##$CPDPRGT= <>
##$D= (0..31)
0 1.2 0 0 0 0 0 0 0 0.06 0 0.03 0 0 0 0 0.0002 0 0 0 0 0 0 0 0 0 0 0 0 
0 0 0 
##$DATE= 1571048605
##$DBL= (0..7)
120 120 120 120 120 120 120 120 
##$DBP= (0..7)
150 150 150 150 150 150 150 150 
##$DBP07= 0
##$DBPNAM0= <>
##$DBPNAM1= <>
##$DBPNAM2= <>
##$DBPNAM3= <>
##$DBPNAM4= <>
##$DBPNAM5= <>
##$DBPNAM6= <>
##$DBPNAM7= <>
##$DBPOAL= (0..7)
0.5 0.5 0.5 0.5 0.5 0.5 0.5 0.5 
##$DBPOFFS= (0..7)
0 0 0 0 0 0 0 0 
##$DE= 6
##$DECBNUC= <off>
##$DECIM= 24
##$DECNUC= <off>
##$DECSTAT= 4
##$DIGMOD= 1
##$DIGTYP= 9
##$DL= (0..7)
0 120 120 120 120 120 120 120 
##$DP= (0..7)
150 150 150 150 150 150 150 150 
##$DP07= 0
##$DPNAME0= <>
##$DPNAME1= <>
##$DPNAME2= <>
##$DPNAME3= <>
##$DPNAME4= <>
##$DPNAME5= <>
##$DPNAME6= <>
##$DPNAME7= <>
##$DPOAL= (0..7)
0.5 0.5 0.5 0.5 0.5 0.5 0.5 0.5 
##$DPOFFS= (0..7)
0 0 0 0 0 0 0 0 
##$DQDMODE= 0
##$DR= 18
##$DS= 0
##$DSLIST= <SSSSSSSSSSSSSSS>
$$ [...]
##$SUBNAM2= <"">
##$SUBNAM3= <"">
##$SUBNAM4= <"">
##$SUBNAM5= <"">
##$SUBNAM6= <"">
##$SUBNAM7= <"">
##$SUBNAM8= <"">
##$SUBNAM9= <"">
##$SW= 24.0689530833862
##$SWIBOX= (0..15)
0 0 2 0 0 0 0 0 0 0 0 0 0 0 0 0 
##$SW_h= 4816.95568400771
##$TD= 16384
##$TD0= 1
##$TE= 0
##$TE2= 300
##$TE3= 300
##$TEG= 300
##$TL= (0..7)
0 120 120 120 120 120 120 120 
##$TP= (0..7)
150 150 150 150 150 150 150 150 
##$TP07= 0
##$TPNAME0= <>
##$TPNAME1= <>
##$TPNAME2= <>
##$TPNAME3= <>
##$TPNAME4= <>
##$TPNAME5= <>
##$TPNAME6= <>
##$TPNAME7= <>
##$TPOAL= (0..7)
0.5 0.5 0.5 0.5 0.5 0.5 0.5 0.5 
##$TPOFFS= (0..7)
0 0 0 0 0 0 0 0 
##$TUNHIN= 0
##$TUNHOUT= 0
##$TUNXOUT= 0
##$USERA1= <user>
##$USERA2= <user>
##$USERA3= <user>
##$USERA4= <user>
##$USERA5= <user>
##$V9= 5
##$VALIST= <valist>
##$VCLIST= <CCCCCCCCCCCCCCC>
##$VD= 0
##$VDLIST= <DDDDDDDDDDDDDDD>
##$VPLIST= <PPPPPPPPPPPPPPP>
##$VTLIST= <TTTTTTTTTTTTTTT>
##$WBST= 1024
##$WBSW= 4
##$XGAIN= (0..3)
0 0 0 0 
##$XL= 0
##$YL= 0
##$YMAX_a= 459046
##$YMIN_a= -957037
##$ZGOPTNS= <>
##$ZL1= 120
##$ZL2= 120
##$ZL3= 120
##$ZL4= 120
##$ABSF1= 10
##$ABSF2= 0
##$ABSG= 5
##$ABSL= 3
##$ALPHA= 0
##$AQORDER= 0
##$ASSFAC= 0
##$ASSFACI= 0
##$ASSFACX= 0
##$ASSWID= 0
##$AUNMP= <proc_1d>
##$AZFE= 0.1
##$AZFW= 0.1
##$BCFW= 1
##$BC_mod= 2
##$BYTORDP= 1
##$COROFFS= 0
##$CY= 11.3945322036743
##$DATMOD= 1
##$DC= 2
##$DFILT= <>
##$DTYPP= 0
##$F1P= 20.1720416913024
##$F2P= 0.152960286110954
##$FCOR= 0.5
##$FTSIZE= 0
##$FT_mod= 4
##$GAMMA= 1
##$GB= 0.15
##$INTBC= 1
##$INTSCL= 1
##$ISEN= 128
##$LB= 0.24
##$LEV0= 0
##$LPBIN= 0
##$MAXI= 10000
##$MC2= 0
##$MEAN= 0
##$ME_mod= 0
##$MI= 1.114404
##$NCOEF= 0
##$NC_proc= 0
##$NLEV= 6
##$NOISF1= 3.799351
##$NOISF2= 2.8
##$NSP= 1
##$NTH_PI= 0
##$NZP= 0
##$OFFSET= 15.70392
##$PC= 1
##$PHC0= -9569.072
##$PHC1= 10.00093
##$PH_mod= 1
##$PKNL= yes
##$PPARMOD= 0
##$PSCAL= 0
##$PSIGN= 0
##$REVERSE= no
##$SF= 200.130013532006
##$SI= 16384
##$SIGF1= 3
##$SIGF2= 2
##$SINO= 400
##$SIOLD= 16384
##$SREGLST= <1H.CDCl3>
##$SSB= 0
##$STSI= 0
##$STSR= 0
##$SW_p= 3612.71676300578
##$SYMM= 0
##$S_DEV= 0
##$TDeff= 0
##$TDoff= 0
##$TI= <>
##$TILT= no
##$TM1= 0
##$TM2= 0
##$TOPLEV= 0
##$USERP1= <user>
##$USERP2= <user>
##$USERP3= <user>
##$USERP4= <user>
##$USERP5= <user>
##$WDW= 1
##$XDIM= 8192
##$YMAX_p= 0
##$YMIN_p= 0
$$ End of Bruker specific parameters
$$ ---------------------------------
##NTUPLES= NMR FID
##VAR_NAME=  TIME,          FID/REAL,        FID/IMAG
##SYMBOL=    X,             R,               I
##VAR_TYPE=  INDEPENDENT,   DEPENDENT,       DEPENDENT
##VAR_FORM=  AFFN,          ASDF,            ASDF
##VAR_DIM=   8192,          8192,            8192
##UNITS=     SECONDS,       ARBITRARY UNITS, ARBITRARY UNITS
##FACTOR=    0.0002076,     1,               1
##FIRST=     0,             0,               0
##LAST=      1.7004516,     0,               0
##MIN=       0,             -957037,         0
##MAX=       1.7004516,     459046,          0
$$ Real data points
##PAGE= N=1
##DATA TABLE= (X++(R..R)), XYDATA
0 0 0 0 0 -8 16 -16 16 -24 32 -40 55 -64 85 -104 128 -151 183 -216 258 -303 352 -414 480 -552 634 -727
26 -727 833 -946 1069 -1208 1364 -1534 1717 -1921 2146 -2392 2661 -2955 3277 -3635 4028 -4458
42 -4458 4933 -5464 6055 -6712 7456 -8306 9279 -10405 11732 -13328 15276 -17727 20916
55 20916 -25256 31545 -41517 59819 -104514 435474 310413 -525846 169829 459046 -10486
66 -10486 -218247 327455 362201 41013 134031 436977 205588 33106 206528 126210 -275569
77 -275569 -97116 402743 342310 625 170561 307453 -76985 -229141 231086 319991
87 319991 -166952 -229651 233557 275008 -20806 53582 175574 -153780 -289814 110322 217471
98 217471 -175635 -146155 294411 168171 -336312 -209170 249281 86272 -351455 -252999
108 -252999 53814 28881 -12447 105803 -26263 -307720 -229523 -17854 -129129 -226146 -12694
119 -12694 23060 -255034 -221778 118928 56939 -309020 -284825 -63813 -215711 -375212 -70291
130 -70291 176823 -69603 -285931 -151424 -103329 -229220 -152694 -45313 -262476 -401623
140 -401623 -95211 121604 -114990 -262092 -62351 -49352 -325553 -335295 -71547 -45575 -202580
151 -202580 -161848 -66853 -139419 -137912 -2761 -82827 -317103 -278888 -69163 -78233 -147944 -18290
163 -18290 22343 -195112 -256197 -35620 7216 -200038 -214410 -39776 -53824 -145113 -13607
174 -13607 101684 -61683 -205123 -117367 -76248 -144041 -37378 134267 22865 -174891 -73909
185 -73909 107429 21136 -119384 -62784 -20372 -98687 -48002 128192 133876 6900 -6137
196 -6137 9456 -81711 -82599 78368 110598 -27643 -19169 134029 129253 27345 74469 115909
208 115909 -44657 -137254 43545 196358 119630 65750 138945 116579 10882 48846 139763
219 139763 65415 -31175 44070 136822 115634 134962 217134 157694 -1838 -11870 94909
230 94909 110981 84208 134567 152771 78842 82561 185443 179907 57514 18362 62156 56071
242 56071 68815 180939 230186 122767 42775 84687 99240 53812 80049 134195 81220 21398
254 21398 101213 198641 159747 79754 62260 34259 -13912 31993 135929 143466 77688 65284
266 65284 84154 63186 55798 83472 50965 -29671 -23563 65243 107049 97371 103335 76396 -18866
279 -18866 -63542 3609 55484 21434 -1955 26958 34812 23664 53240 66636 -6480 -86837
291 -86837 -81020 -36658 -6331 35963 67462 21180 -54214 -55236 -13989 -22701 -58608 -62360 -58870
304 -58870 -64982 -31971 30174 33404 -31562 -89195 -111346 -116452 -85053 -27799 -16209 -62145 -79862
317 -79862 -45405 -31033 -55990 -73874 -90279 -134257 -151381 -88959 -11662 -2634 -39180 -73145
329 -73145 -104393 -124194 -104470 -74928 -86464 -111845 -98228 -63797 -45244 -32642 -32183 -81582
341 -81582 -153678 -163879 -104806 -55978 -46984 -46039 -49679 -73822 -88557 -69511 -56378 -82629 -115392
354 -115392 -114536 -86394 -45239 -2778 4964 -43832 -98942 -103712 -76670 -60895 -51455 -36746 -35607
367 -35607 -48098 -38481 -4139 6101 -28779 -74956 -92641 -71773 -23669 22055 33888 12175
379 12175 -13743 -26316 -27976 -20928 -9454 -10229 -26491 -24391 18382 67313 74136 37106 -7729
392 -7729 -32760 -31519 -5983 31025 56892 58348 45337 37603 47009 60542 52573 17919 -12932
405 -12932 -5390 37626 83416 105622 99581 72133 40053 24030 33587 52963 59027 49061 44640
418 44640 62995 95462 115208 103884 67685 30313 15496 31414 65472 95860 103828 87855
430 87855 65895 61464 74251 82043 64040 34772 25633 47862 82867 106274 107684 85847 48441
443 48441 20001 22370 47492 68488 69547 57852 50853 59041 77026 79537 52002 11489 -7967
456 -7967 4250 34947 67548 85638 73642 37522 9507 8680 18845 17781 7598 -890 1893
469 1893 21686 51911 65374 42483 -2148 -35895 -43339 -28535 -1751 19787 19298 2015 -7101
482 -7101 1965 10847 -733 -30508 -58520 -65979 -44956 -6818 19039 16033 -9627 -38680 -56287
495 -56287 -55433 -41514 -33173 -41986 -54772 -49072 -24277 -2720 -6268 -35440 -73054 -92949 -83647
508 -83647 -54668 -26452 -15541 -26866 -48851 -61256 -53613 -42683 -50906 -73743 -85586 -71594
520 -71594 -42816 -18313 -10511 -24512 -56434 -85525 -91816 -72024 -43333 -29111 -39360 -54674
532 -54674 -47946 -23998 -17040 -41730 -70695 -80222 -74378 -59213 -30208 135 2839 -25885 -54403
545 -54403 -57569 -43398 -33295 -37913 -51489 -52799 -29326 2014 14265 5131 -13928 -40082 -67363
558 -67363 -65888 -25111 13460 11787 -9723 -11238 4056 8544 -2437 -16076 -28183 -34353 -24830
571 -24830 792 28904 46221 39729 6139 -26941 -22676 8424 20985 5756 -493 16713 32430
584 32430 35107 37293 34786 13292 -12548 -13743 12001 41584 55557 48441 29798 22504 32791
597 32791 36204 22870 14019 20859 23952 23863 47275 81773 77223 31399 -2613 4279 25829 39205
611 39205 44953 45142 41986 47592 57864 54218 40221 31924 22080 2878 5414 46327 84837 78808
625 78808 47842 29838 25460 22993 26235 31547 27582 22471 31559 47020 58462 63140 50840 14380
639 14380 -14374 587 33454 38486 29291 39282 48468 31077 16094 27400 31950 7430 -14198
652 -14198 -5002 18157 39735 53138 40529 4681 -14176 -1202 8479 -776 -296 11639 8655
665 8655 2392 18987 34715 15011 -17982 -30070 -29608 -23626 2234 28470 17547 -10744 -14708
678 -14708 -9428 -21766 -25833 -10155 -18649 -50575 -40420 12526 29078 -5995 -29984 -28838 -42910
691 -42910 -57107 -35408 -7687 -13363 -27086 -21507 -18990 -25565 -20627 -20841 -52332 -77268 -53795
704 -53795 -19059 -12798 -13783 -9115 -28853 -61073 -54901 -27207 -34360 -56568 -46405 -27997 -32442
717 -32442 -26000 392 -8964 -57456 -75544 -50341 -39113 -41531 -20280 -3624 -29179 -50630 -28525
730 -28525 -11362 -33125 -51287 -45087 -46957 -46519 -12120 18617 -1371 -34863 -36973 -35069 -45538
743 -45538 -31823 -2935 -10622 -35710 -19977 10369 1320 -17069 -9741 -17930 -53156 -46275 7950
756 7950 27499 683 -3395 10177 -7342 -26896 -1578 18034 -11384 -30686 1115 27190
768 27190 21469 25852 34605 4492 -29959 -12336 20435 16887 11180 30558 31620 8947 16911
781 16911 45836 32479 -5771 -6673 14652 17670 29539 62664 61606 19859 5406 27162 27189
794 27189 11598 26687 44226 24253 14470 50199 71429 40964 13806 17933 14664 6551 31544
807 31544 61565 50293 29262 36868 40819 25012 26797 42612 24710 -3597 17210 57789 57610
820 57610 38812 40839 33549 3140 -61 30001 35379 16675 22155 37305 26560 21814 44825
833 44825 40135 -6874 -21916 11982 26640 14579 29215 49935 21623 -14688 775 24626
845 24626 6564 -12766 -220 6892 68 17112 36967 14354 -18586 -15179 -8164 -24009 -14934
858 -14934 22904 21064 -18474 -19774 14016 10206 -22316 -23873 -13471 -29678 -33478 388 17936
871 17936 -3732 -17412 -13769 -29510 -44343 -21685 -3327 -29412 -44571 -12779 7357 -14534
883 -14534 -23431 -9863 -26376 -61069 -51106 -13196 -7015 -18400 -13556 -15130 -34373 -31671 -12582
896 -12582 -25451 -54173 -43882 -17547 -20823 -24425 550 4351 -36477 -58225 -34038 -18588 -30631
909 -30631 -26761 -11218 -19130 -29449 -9977 918 -22319 -39501 -31423 -32587 -38808 -12698 16937
922 16937 -992 -31840 -23422 -7253 -21014 -30739 -13748 -10668 -27695 -19963 9076 12894 -3424
935 -3424 -8195 -15278 -34523 -28572 5416 14439 -7459 -7958 11347 5803 -11329 -1029 9346 -14268
949 -14268 -30463 -6914 18261 17833 18257 20602 524 -18956 -3922 13834 2726 -4437 13451
962 13451 19677 6038 15139 37825 23554 -13289 -15763 5903 10824 12897 31690 34735 11119
975 11119 4273 21122 21300 5675 8014 15799 4398 5169 37058 51795 25348 5256 12529 11705
989 11705 435 13476 34783 26161 9614 19217 33197 25926 19325 21385 6985 -9660 6837
1002 6837 36712 36289 22581 26343 25771 5230 233 21353 26227 6253 3267 21673 28279 24726
1016 24726 30292 26054 471 -12553 3533 17400 15198 20903 29001 16310 1722 12063 22712
1029 22712 7466 -7765 -1652 5025 4789 18080 33718 20681 -4546 -6887 765 -4288 -5037 9049
1043 9049 10026 -5297 -3188 16694 17800 -412 -9103 -10621 -18652 -16599 4514 14918 3368 -4479
1057 -4479 -331 -5289 -15036 -9417 -3636 -16315 -25667 -10261 6964 5232 -1654 -5566 -18430 -31500
1071 -31500 -24744 -9420 -8468 -12381 -7877 -7427 -15405 -13810 -5000 -14123 -33875 -34092 -18604 -11002 -9601
1086 -9601 -3341 -3641 -19501 -30400 -24523 -18002 -19331 -20951 -20965 -22100 -15499 -1790 -1405 -18104 -29333
1101 -29333 -26703 -26777 -28474 -17065 -1797 -5015 -18091 -19147 -11864 -11434 -17460 -23132 -28010 -26940 -12990
1116 -12990 1414 1344 -6319 -9870 -16403 -26312 -24345 -9450 -3131 -11754 -15186 -4734 4180 1673
1130 1673 -4784 -10917 -17348 -19313 -12575 -1738 7088 10464 5427 -6244 -10189 -381 6182 -1950
1144 -1950 -11494 -6602 5388 11461 13000 14918 11914 327 -9289 -6823 5149 15074 15258 9489
1158 9489 7928 14249 19634 15235 6326 2297 2411 3271 9642 23619 32930 26171 10395 2930 9269
1173 9269 16559 14985 9745 10005 17321 23261 24277 24362 23642 17423 4077 -2374 8514 25837 30867
1188 30867 21940 14332 17203 21843 18909 12590 10207 10299 8522 9978 20094 31024 30482 16697 3019
1203 3019 1193 8913 14856 13096 10450 12568 16762 16034 14149 15661 14004 1617 -9746 -4029 12733
1218 12733 21142 16020 9017 5889 3069 1183 1019 1061 -559 -1790 -1817 2200 10605 17007 8550 -9718
1234 -9718 -17688 -10151 -2358 -2675 -1768 2597 1842 -5131 -6470 -1839 -2247 -12024 -20286 -19382 -9488 2164
1250 2164 6144 -1657 -11373 -14223 -14329 -16679 -16055 -9601 -7804 -13652 -15595 -6122 1477 -4975 -17507
1265 -17507 -24152 -23478 -18827 -12025 -6508 -5384 -7724 -12011 -15944 -15804 -11693 -12198 -19735 -24917 -17505
1280 -17505 -4974 -1288 -3933 -8786 -14235 -20934 -22130 -16310 -9816 -8045 -9421 -11256 -8551 -3552
1294 -3552 -2791 -10341 -19510 -20214 -15261 -10321 -3964 3274 2843 -6553 -14204 -11788 -6498 -6441 -9814 -10985
1310 -10985 -7151 -1301 3947 4480 879 -4518 -9673 -13329 -10255 147 7147 4007 -2161 -562 4809
1325 4809 4764 349 -3072 -5306 -6220 -2179 6523 13524 13175 6583 -773 -3121 -175 3634 4126 2956
1341 2956 4754 8320 10733 12256 12867 8457 -509 -5794 -1481 9063 15954 14765 11363 9420 8851
1356 8851 7577 6436 6009 5747 3769 4154 10717 19179 21043 13613 3837 898 4025 7803 9066 9981
1372 9981 11629 12557 11242 11700 14289 14141 5950 -3102 -1650 9019 16843 16820 13075 11288 8180 4908
1388 4908 4203 6573 7290 4892 3230 6002 13646 19169 15108 3832 -2868 -1095 2998 5081 7955
1403 7955 11846 11047 4651 2203 6664 8979 2889 -5038 -6297 350 8197 11581 9364 4394 425
1418 425 -3202 -5900 -3297 2867 4498 -1372 -4080 2272 9673 7349 -2458 -9067 -9438 -7730 -5326
1433 -5326 -246 5346 5320 -1769 -8896 -7975 -1788 -2006 -9714 -14640 -9418 -898 2588 862 -1674 -4621
1449 -4621 -10619 -16185 -14346 -6899 -1009 -3317 -9930 -10120 -3427 -691 -7093 -14615 -15856 -14188 -13335
1464 -13335 -9506 -963 1787 -4486 -13214 -15063 -10990 -8444 -9827 -13104 -12728 -8341 -3808 -4095 -5380
1479 -5380 -6348 -10644 -19082 -20588 -10847 -459 -1650 -8941 -10454 -6233 -4717 -8189 -11254 -11600 -10769
1494 -10769 -10472 -8180 -2334 4059 3062 -6980 -14512 -11853 -4485 -3514 -6919 -5766 -1342 82 -398
1509 -398 -281 949 -2683 -9201 -12187 -6975 3991 8636 4784 -429 -78 2728 404 -2812 -1363
1524 -1363 1342 633 248 5477 12608 12183 4742 -2082 -4025 464 6247 7884 6165 6952 10019 9769
1540 9769 7151 7419 8989 5140 -912 1242 11115 16961 14963 10535 8634 7480 6348 6616 7329 8270
1556 8270 8648 9041 9771 13616 17711 14352 4048 -884 4035 10275 11304 11194 13337 13639 10156 8004
1572 8004 8701 9024 6244 2671 2092 7446 14764 16951 11692 4795 2651 3334 3101 3602 6626 8408
1588 8408 6265 4996 7414 10334 8515 2353 -3364 -4150 740 6175 7473 5734 4539 3135 -423
1603 -423 -1930 -262 445 -3179 -6314 -3325 2735 6038 4481 -475 -6274 -9022 -7424 -4128 -2488
1618 -2488 -1580 -457 -2272 -4338 -2395 -470 -4407 -11709 -13499 -9042 -4685 -1802 222 -1762 -7083
1633 -7083 -11298 -10623 -8842 -7956 -7162 -7757 -9260 -8057 -2357 227 -5497 -12079 -13802 -12385 -10968 -7718
1649 -7718 -3007 -2894 -6614 -9016 -8092 -7354 -7263 -8000 -12013 -14675 -9627 -606 1077 -3357 -5973 -6930 -11022
1666 -11022 -13323 -8379 -2217 -3107 -7132 -6363 -2009 -411 -1132 -5497 -10454 -12063 -7549 -2683 -839
1681 -839 715 2170 -1452 -7978 -7285 -1174 43 -5327 -7158 -2644 2041 3751 4567 2807 -2447 -5873
1697 -5873 -5313 -3200 468 4763 5631 381 -1298 3839 6329 1152 -3495 -2537 -169 520 4024 9739
1713 9739 10177 4309 -517 -1409 840 3650 5100 2542 1190 5137 9931 8313 4667 4760 3512 -1854
1729 -1854 -2838 5145 11586 9640 5448 5202 5346 5399 5918 4594 1673 1461 5489 7819 8300 11060 11347
1746 11347 4645 -2696 -70 6924 7585 4725 5461 8178 7831 6937 7342 5855 1898 460 1388 2531
1762 2531 7282 12758 10576 3110 429 5119 5817 1497 1228 4432 3919 3009 6276 10624 7878 2314
1778 2314 -934 -1960 -237 4005 6802 4308 2397 4646 6006 1951 515 2467 413 -4596 -3071
1793 -3071 5424 9217 5393 1303 -157 -2455 -2746 -835 -207 -1575 -147 2178 823 0 2919 1786
1809 1786 -6220 -10064 -4629 994 630 -673 759 -182 -3971 -4409 -2530 -3701 -5948 -6040 -5423 -3879
1825 -3879 363 3378 -1263 -8174 -8260 -5723 -6222 -7327 -4059 -1759 -4850 -5985 -2957 -1128 -4690 -8922
1841 -8922 -10650 -10606 -8050 -3144 -115 -2915 -5895 -6400 -8024 -9329 -7288 -5716 -8123 -9856 -5824 -896
1857 -896 -1513 -4253 -6201 -8254 -11243 -9937 -5364 -2481 -3027 -4008 -5025 -5442 -3908 -3006 -5180 -9319
1873 -9319 -9464 -5573 -2024 -915 569 -581 -4781 -7692 -6023 -3196 -2977 -3195 -2819 -2286 -1096 1394
1889 1394 2391 -389 -4339 -5735 -5000 -2646 1659 5520 3697 -510 -854 1738 1600 -407 -141 137
1905 137 -204 1093 5650 8583 6745 1964 -1033 -1112 1200 4495 5687 4944 4366 5568 5963 5892 6073
1922 6073 5586 2639 -626 1923 8321 11569 9233 6474 5369 5335 4699 4335 5331 6236 5575 5253 7320
1939 7320 10270 11110 8091 3318 730 3077 6841 8199 8039 8241 8266 6579 4910 5539 6664 4536
1955 4536 783 1142 6661 9972 8801 6237 4306 3084 1466 1569 3348 4882 5208 3402 2270 4352
1971 4352 7202 5608 -782 -3510 -1293 1802 1960 2319 4655 4737 694 -2767 -1387 983 41 -2738
1987 -2738 -4080 -1154 3114 3626 215 -2430 -2691 -3482 -6045 -5599 -708 1765 -1804 -4866 -2693 135
2003 135 -1424 -5386 -8195 -7371 -4460 -2604 -2619 -2257 -981 -2340 -7029 -9310 -5630 -2194 -5473 -9042
2019 -9042 -6068 -840 -843 -3746 -4939 -5444 -7946 -9357 -7461 -4246 -1660 -1493 -4764 -6850 -4566 -1820
2035 -1820 -4810 -10012 -8553 -3491 -3048 -5060 -2689 1129 -2404 -8497 -8841 -4714 -2435 -3476 -4243 -5167
2051 -5167 -3012 225 11 -3517 -5062 -3457 -4308 -6727 -4239 2901 3465 -2600 -5373 -1188 600 -2596
2067 -2596 -4486 -3215 -2177 -974 857 1765 2277 1886 -528 -5482 -5434 770 4856 915 -2135 1668
2083 1668 4641 2211 -814 664 998 -1785 -2676 1157 4890 5916 4208 648 -1273 739 3256
2098 3256 1696 -391 2048 4145 2962 1956 6013 7314 2358 -2650 -1378 2850 4849 4777 4310 3678
2114 3678 3760 4193 2853 2215 2654 3076 184 -199 4645 10225 7640 1673 578 2634 2302 1453 3381
2131 3381 4889 4294 3965 3678 4314 5567 5136 1185 -2583 117 6000 6758 3660 3345 4928 2986 -47
2148 -47 1370 4281 3119 136 536 3074 5447 6473 4525 479 -1523 538 1822 1116 2121 4558
2164 4558 3701 723 1000 3758 3262 -607 -2748 -1402 1214 2493 3950 3356 1126 -287 -1136 -1729
2180 -1729 -987 1408 1074 -1432 -904 1974 3277 777 -1870 -2669 -3316 -3428 -1422 694 1002 249 -846
2197 -846 -2792 -2580 -1354 -1304 -4395 -5459 -2831 -340 181 -256 -754 -2752 -5477 -5623 -3683 -3005 -2584
2214 -2584 -2313 -3066 -3915 -2148 -1009 -3396 -6954 -6453 -4934 -4290 -3478 -1119 -907 -3581 -5149 -4620 -3999
2231 -3999 -4852 -4280 -4348 -4987 -4066 -1145 -650 -2733 -4867 -5069 -5863 -5963 -3680 -1728 -2106 -3349 -2861 -2108
2249 -2108 -2514 -3098 -3258 -4937 -5561 -3251 -471 105 -69 -610 -2325 -4328 -4102 -1547 -1584 -2393 -2024 -528
2267 -528 -2 840 1363 -910 -2826 -3012 -1493 -264 592 2627 2512 478 -325 1295 1952 -145 -828
2284 -828 -202 519 1358 4329 5406 2960 1150 1140 777 399 2737 4574 3090 1740 4020 6029 4486
2301 4486 2679 2523 2056 679 2795 6069 6489 5316 4829 3819 1846 2627 4795 4045 1922 2397 5209
2318 5209 6256 5604 5510 4848 2291 664 2572 4417 4747 4718 4552 3199 3268 4424 4753 2657 440 1387
2336 1387 2218 2739 4524 6370 4254 1064 422 1700 1926 1382 1695 2205 1490 2375 3359 3012 1199 15
2354 15 -1529 -2484 -691 2855 3345 1046 -652 -486 -146 -895 -1203 -1250 -2058 -2471 -1113 564 1028 623
2372 623 -1100 -3793 -4598 -2432 -1207 -1844 -2255 -1956 -1770 -2244 -1770 -1071 -2502 -5097 -5546 -3987 -2452
2389 -2452 -1023 -487 -2289 -3889 -4414 -3275 -3784 -4126 -3356 -3334 -3644 -2604 -754 -906 -3142 -4607 -5362
2406 -5362 -5303 -4041 -1935 -1234 -2298 -3157 -3177 -2558 -2743 -2922 -3446 -4639 -4405 -1933 -232 -511 -821 -1603
2424 -1603 -2972 -4264 -3165 -1335 -1344 -2143 -1644 -1107 -316 -42 -432 -1712 -3168 -2998 -1799 -716 758
2441 758 970 400 -1265 -1188 -220 -262 -1304 -1289 -658 429 1239 2026 2269 1022 -817 -1276 -661 393 1566
2460 1566 1645 1044 1292 2231 2253 724 736 943 -41 -363 1186 3547 4006 2349 1104 769 1285 1458 1001
2479 1001 778 1503 2467 2924 2740 2701 2848 1607 -568 -550 1979 3628 2966 2165 2184 2950 2649 1410 1406 1571
2499 1571 1148 741 1263 3160 4800 3826 1379 401 1354 2255 1404 1185 1887 2735 2882 2280 2843 3235 2350
2518 2350 -11 -1351 1036 2931 3413 2353 1196 2336 2186 896 156 945 1580 403 129 2146
2534 2146 4012 3313 714 -845 -445 998 538 240 1305 2190 1487 43 84 1826 1771 -779 -2453
2551 -2453 -1189 1606 2329 1085 -46 275 223 -1092 -1836 -773 422 -374 -2334 -1130 1182 2171 -188
2568 -188 -2763 -2749 -1780 -1405 -1519 -732 608 -17 -1927 -2620 -1680 -238 -1691 -4273 -4111 -1293 187 -334
2586 -334 -1767 -1530 -1513 -3646 -4844 -2891 -602 -974 -3150 -3730 -1784 -220 -1503 -3627 -4012 -3107 -3041
2603 -3041 -3214 -2559 -637 -250 -2825 -4592 -3680 -1266 -1583 -4167 -4497 -2269 -889 -1497 -2046 -1642 -1886
2620 -1886 -3080 -4821 -3686 -1711 91 -1339 -3004 -2297 -279 -478 -2444 -3601 -2367 -1234 -2206 -1736
2636 -1736 277 1666 -108 -2653 -2993 -918 405 -583 -1828 -759 812 1275 20 -162 670 81
2652 81 -1569 -1660 670 2692 2298 436 123 1872 1865 1071 249 655 1622 1454 1458 2649 4406 3230 892
2671 892 -19 1397 2504 2564 1825 2416 3663 3586 3034 2442 3164 2766 1570 984 2462 4431 5119 3355
2689 3355 2432 3028 3595 2620 1605 1865 3173 3189 2430 3455 4395 4427 2762 1083 1073 2701 3283 2638 2739
2708 2739 3350 3226 2966 1735 1803 2427 1387 140 783 2755 3693 2809 916 806 1118 1104 -12 762
2726 762 1214 1100 607 841 1855 1850 317 -1304 -1606 -757 -87 454 292 200 -227 -453 -1052 -1159 -597 -1287
2746 -1287 -2559 -2256 -330 339 -431 -1305 -1583 -2158 -2888 -2739 -1461 -1532 -1686 -1952 -2101 -1632 -1210 -1527 -3052
2765 -3052 -4044 -3388 -2188 -1439 -1717 -1659 -1656 -2622 -3349 -2591 -2269 -2486 -3206 -2741 -2368 -1790 -872 -1347 -2374 -3615
2785 -3615 -3368 -3257 -2296 -1804 -1612 -1800 -2095 -1802 -1658 -1538 -2298 -2718 -3135 -2317 -1551 -647 -203 -982 -2256
2804 -2256 -2339 -1888 -1632 -1227 -1532 -1075 -969 -516 -331 240 -195 -1328 -2577 -1640 -445 620 673 348 -199
2823 -199 -340 -373 53 -176 -314 -277 -270 -188 861 2157 1641 244 -440 -119 242 472 958 1529 1216 765 1234
2844 1234 1761 1568 617 12 -59 195 1480 2684 2038 1070 1498 988 209 529 1825 1908 941 477 2332
2863 2332 3124 2294 1187 878 611 767 1097 1838 2135 2377 2227 1544 1032 1539 2220 1311 -65 588 2303
2882 2303 2415 2004 2370 1735 1084 477 1100 1282 1435 1541 1397 1382 1695 2726 1549 184 -161 838 843 794
2902 794 1521 2588 2119 452 359 1036 764 797 401 302 1134 1957 2246 666 598 703 -48 -1025 119 1409
2922 1409 1478 135 228 969 901 97 48 -466 -529 -453 718 525 802 1275 690 -1144 -1345 146 398 -1026
2942 -1026 -1446 -281 648 -106 -524 -201 -571 -1670 -1509 -1088 -459 -315 -181 -1017 -1697 -1017 -319 -1420 -2804
2961 -2804 -1739 -1087 -1171 -1250 -285 -283 -1798 -2451 -2140 -2182 -1822 -1306 -1481 -2374 -1608 -850 -694 -1978 -2222 -1908
2981 -1908 -2427 -2846 -1309 -297 -972 -1987 -1868 -1767 -2032 -1553 -1767 -2591 -2864 -1683 -576 -1312 -1394 -815
2999 -815 -1694 -3132 -2601 -1003 -539 -1486 -1398 -782 -973 -1045 -826 -986 -1845 -1658 -1152 -861 -579 613 737 -1073
3019 -1073 -2167 -613 406 -1028 -1141 -412 153 -40 292 916 616 -23 11 -621 -662 1036 2345 1097
3037 1097 -205 896 2059 1197 -453 626 1331 628 282 1506 2768 2339 1544 987 899 1079 2297
3054 2297 2184 1219 1347 2694 2591 1475 1839 2806 1846 -45 592 2567 2924 2639 2014 1965 2081 1727 1694
3073 1694 1496 1215 1830 2184 1549 1765 3581 3119 807 -36 1289 2134 1274 1127 1784 2092 1260 874 1048
3092 1048 1242 1079 810 -159 26 2088 2460 662 -170 847 1114 -88 -614 741 1444 302 -781
3109 -781 307 1072 1114 -164 -1282 -1339 -354 322 -568 -913 58 714 -557 -1940 -1070 297 -1176 -2226
3127 -2226 -1425 -248 331 -658 -1306 -1419 -1537 -1598 -1793 -2140 -1116 -290 -1251 -2337 -1449 -324 -994 -2824
3145 -2824 -2720 -1079 -656 -1474 -1434 -846 -726 -1410 -2413 -2167 -1073 -1007 -1739 -2291 -1478 339 -305 -1940 -2042
3164 -2042 -1027 -1030 -2353 -2279 -762 305 -766 -1817 -998 3 -530 -1601 -2094 -1306 -12 208 -782 -735
3182 -735 384 220 -1618 -2031 -43 646 -504 -1645 -29 1268 641 -628 -1145 -444 39 -551 -781
3199 -781 276 1228 1201 10 -681 585 1095 34 -885 -522 700 763 547 684 1229 657 -205 -798 135
3218 135 1217 841 339 -158 1005 1761 1044 72 22 826 281 -199 665 2015 1525 420 -160 574 1462
3237 1462 898 139 -236 1089 1489 716 538 1196 1411 491 -633 -92 1260 1746 603 435 1074 1235
3255 1235 935 200 232 301 438 191 490 1449 1801 940 49 -240 786 979 323 438 923 1210 777 657
3275 657 804 1184 422 -274 -41 237 1188 1003 519 509 360 671 203 480 436 658 98 -147 716 1590 939
3296 939 -134 -210 -331 -35 133 311 436 697 371 146 345 689 -59 -570 -773 -128 554 648 427 102
3316 102 -249 -184 -628 -401 -106 -380 -646 -726 -45 285 330 -446 -532 -926 -1059 -471 -431 -120 -315 -285 -640 -633 -651
3339 -651 -573 -851 -1185 -1137 -706 -647 -259 -550 -492 -1160 -1379 -1245 -815 -817 -1318 -721 -829 -523 -380 -1077 -957 -1281
3361 -1281 -1859 -1404 -972 -163 -480 -1183 -1041 -1181 -1136 -880 -1498 -1296 -878 -808 -1223 -608 -211 -197 -1333 -1700
3381 -1700 -1338 -304 -579 -786 -307 -410 -207 -594 -324 -348 -458 -897 -548 -342 389 243 -256 -284 -77 -54
3401 -54 -77 -513 -179 261 298 297 453 942 523 -73 -352 572 656 816 557 891 986 1127 525 575 803 1109 648
3424 648 40 689 1709 1866 1363 407 661 1021 1212 658 1010 1528 1534 1146 893 1848 1810 1163 103 600
3444 600 1520 1946 1387 792 1498 1476 1062 572 1087 1456 1211 521 718 1123 1822 1458 389 22 971 780
3464 780 663 448 1290 1346 274 -45 698 1252 595 112 -177 575 729 590 466 -95 180 47 -510 -661
3484 -661 81 137 -659 -825 -309 820 408 -878 -1002 -455 -687 -563 -798 -55 103 -451 -1000 -855 -236 -239
3504 -239 -1101 -1304 -1311 -287 -479 -780 -930 -577 -729 -1553 -1793 -970 -498 -789 -1537 -1487 -697 -265 -816 -1287 -1298
3525 -1298 -964 -1102 -1250 -772 -337 -224 -1029 -1626 -1140 -366 -424 -1456 -1326 -1132 -145 -549 -761 -522 -315 -831
3545 -831 -1569 -894 -137 453 -469 -710 -416 -354 -260 -522 -551 -675 -97 -350 -498 264 640 82 -833 -754 444
3566 444 511 -372 -378 99 310 263 208 338 774 158 -135 -245 227 1239 910 265 30 733 492 494 -4 174
3588 174 592 207 486 707 932 1019 479 -355 557 777 752 212 482 900 1009 257 41 815 553 294 -131
3609 -131 356 967 980 600 325 391 639 611 -56 -96 332 764 686 143 860 1158 274 -282 18 525 718 180
3631 180 282 555 810 384 370 -152 234 550 113 -234 256 1339 551 -363 20 434 420 -427 -236 157
3651 157 325 398 120 512 489 357 22 -343 118 700 699 -85 -172 448 591 -226 -620 305 456 -63 -450 188
3673 188 882 611 -50 -459 -402 280 84 -220 -204 165 325 -95 -496 264 554 -248 -948 -502 526 501 41
3694 41 -40 -211 -182 -235 -690 -566 -276 -121 -570 -1084 -180 466 -328 -989 -577 -281 -693 -662 -349 -174 -261 -554
3716 -554 -543 -523 -220 -123 -777 -1052 -734 28 -286 -711 -1208 -322 -564 -1270 -860 -126 -221 -924 -1097 -297 -148
3737 -148 -165 -628 -1242 -1041 -393 -404 -1157 -355 -284 -140 -1217 -1297 -290 15 -581 -1103 -479 -343 -313 -531 -669
3758 -669 -347 -420 -867 -698 -60 153 269 -331 -722 -156 629 -485 -516 -274 -98 -95 -275 365 713 264 -187
3779 -187 -463 -118 330 531 -145 54 360 1022 508 229 233 746 21 -221 336 1258 909 341 247 1004 776
3800 776 743 578 476 762 798 748 649 982 1248 806 335 164 1245 1288 731 446 812 1211 776 484 1060
3821 1060 735 734 463 460 1050 1104 1172 649 251 969 871 425 469 772 1062 325 742 1088 1245 282 341 527 594
3844 594 387 380 189 288 276 364 155 -336 -24 -19 -235 -325 238 750 134 -549 95 135 -471 -481 -327 -70 -474
3867 -474 -573 -266 -403 -109 -259 -556 -1043 -230 -397 -299 -675 -452 -269 -812 -1204 -389 -429 -692 -1145 -623 -717
3888 -717 -468 -609 -624 -642 -902 -867 -1102 -1050 -877 -607 -951 -1108 -603 -198 -713 -1039 -892 -697 -753 -537 -439 -541
3910 -541 -155 -1271 -585 -506 -545 -355 -382 -747 -561 -154 -300 -404 -334 -104 -768 -669 -482 90 -83 -370 -519
3931 -519 -68 99 77 -224 -625 -221 -62 -245 -8 279 236 -114 -168 -141 365 441 -88 -311 412 567 249 326
3953 326 294 262 139 -189 124 748 790 253 212 75 714 535 187 101 126 283 119 159 752 898 207 -138
3975 -138 43 608 683 334 -247 130 536 394 -4 93 860 198 -267 -304 526 770 306 -14 539 619 378
3996 378 -88 247 701 557 109 119 214 859 440 -180 -227 8 789 80 273 1 463 242 -405 137 578
4017 578 259 -88 -228 -132 472 643 54 -229 518 308 64 -209 40 433 113 -522 226 613 515 -225 -325
4038 -325 91 385 -32 -16 192 434 180 -197 -282 135 328 225 -185 -56 301 166 21 -235 -75 408 -195
4059 -195 -685 -236 277 309 -374 52 227 289 -272 -440 -178 -428 84 -144 23 394 327 -284 -183 -520 28
4080 28 -194 -619 -446 -90 -26 -117 -608 -429 90 -226 -739 -690 -29 -153 -601 -1070 -473 -143 -248 -724 -696 -434
4102 -434 -183 -482 -709 -464 -221 -202 -747 -629 -625 -320 -715 -822 -388 145 72 -510 -328 -285 -366 -981 -724 -206
4124 -206 -450 -327 -446 -771 -171 -119 -476 -465 -262 -297 -75 -227 66 -278 -293 -416 -413 33 337 -393 -360 -161
4146 -161 -49 325 -307 199 -247 -39 -29 80 197 175 605 -145 -183 197 406 418 -82 139 274 540 191
4167 191 490 506 623 293 -146 311 580 535 374 363 542 692 328 223 533 445 468 581 573 1148 880 645
4189 645 611 609 884 979 709 417 501 719 514 424 831 568 370 534 591 57 571 353 300 242 508 477 357
4212 357 325 316 410 601 243 194 720 483 188 -146 147 422 198 274 29 275 104 75 18 228 75 -72 -420
4235 -420 -227 153 487 16 -288 -317 -130 -102 -314 -370 -348 -218 -379 -545 -587 -32 -209 -839 -607 -276 -177 -151
4257 -151 -667 -289 -272 -489 -679 -717 -454 -427 -604 -1017 -724 -330 -348 -472 -837 -790 -233 -493 -906 -446 -99 -532
4279 -532 -618 -235 74 -217 -334 -563 -278 -294 -231 -277 -285 -502 -261 -279 -493 -121 0 -195 -630 -510 153 15
4301 15 -267 -439 -136 -143 -164 66 -176 166 -79 -29 75 100 51 97 80 -229 116 403 169 104 292 193 68 53
4325 53 183 306 136 117 29 331 490 498 109 -259 269 522 314 -19 267 389 93 85 245 557 1 132
4347 132 39 236 424 729 212 389 341 53 48 280 335 475 493 99 334 224 453 186 3 226 16 291
4369 291 521 209 357 62 194 233 396 335 -313 0 -13 -42 46 -83 359 103 204 53 98 304 292 92
4391 92 -97 2 -146 224 77 37 -175 -258 -207 115 288 70 30 -170 38 48 -91 -186 208 143 -26 84 166
4414 166 81 122 -59 -166 203 80 279 15 -252 11 221 -176 -166 -110 290 -44 -253 1 410 -10 -109 -156
4436 -156 -129 -85 -67 173 282 70 -70 -133 -241 -97 183 -118 -623 -159 9 -76 -82 29 -131 184 -36 -584
4458 -584 -124 168 -377 -2 -123 -252 50 -191 -353 -433 -159 -522 -412 -173 -28 -51 -668 -280 -13 -70 -246
4479 -246 -617 -343 -45 -255 -452 -290 174 -133 -474 -725 -231 -115 -44 -501 -727 -415 -255 27 -408 -252
4499 -252 -127 -473 -586 -405 96 -7 -533 -656 -102 233 8 -206 -438 -249 -116 -270 -376 -112 162 64
4519 64 -501 -420 457 365 -385 -234 34 125 80 -20 -135 502 386 -287 -364 310 462 67 -303 99 611 791
4541 791 -19 73 85 593 186 312 547 704 405 -92 -149 457 881 246 33 187 545 387 186 345 424
4562 424 350 207 228 651 655 738 212 81 619 959 720 -95 443 875 428 292 59 653 946 186 -215 290
4584 290 943 579 -5 -219 574 624 46 -39 70 691 67 -110 22 624 688 22 -338 69 307 47 -38
4605 -38 -140 447 80 -388 -114 95 185 -263 -527 -123 124 124 -206 -408 -547 217 -56 -590 -258 -83 -158 -678
4627 -678 -599 -304 8 -271 -717 -534 -389 -235 -338 -590 -370 -445 -597 -709 -491 -131 -328 -744 -1010 -271 53
4648 53 -579 -533 -439 -35 -556 -355 -493 -483 -134 -443 -748 -423 -104 -203 -378 -494 -249 -150 -236 -250 -201 7 -116
4671 -116 -654 -336 97 54 -367 -312 -487 -174 48 -98 2 134 176 -359 -180 129 170 164 -468 -270 306 292
4693 292 -247 156 107 185 192 -190 -98 362 557 -261 93 -49 417 81 66 40 -109 599 192 106 193 275 -55
4716 -55 -6 9 460 341 244 29 169 298 274 148 -119 213 383 -20 263 310 270 119 177 -92 293 415 22
4739 22 181 -37 311 133 -72 50 476 262 -128 -125 -67 303 3 200 251 262 264 235 34 -86 104 172 -17
4762 -17 -117 254 541 140 -53 432 579 162 78 395 378 107 16 25 238 299 51 53 84 150 121 24 67 190 243
4787 243 285 -220 -96 2 274 91 140 -232 324 -84 -501 -49 158 140 -184 -302 116 -90 -32 -7 161 -229
4809 -229 -202 113 -75 205 87 149 -150 -296 -275 208 508 -221 -188 -24 91 48 -391 -11 7 -96 -211 102
4831 102 -58 -204 163 -227 -40 106 69 -107 -291 -273 -111 -329 -213 -144 -37 -342 -525 -639 133 -7 -617
4852 -617 -403 -203 -242 -456 -350 -73 -191 -564 -266 -255 15 -256 -7 -394 -344 -34 -319 -84 -331 -159 -324
4873 -324 -369 -494 -29 -122 -275 -226 -774 -362 -103 -351 -427 -146 -108 132 212 -159 -114 73 -149 59 -21 106 -50
4896 -50 -99 -34 -191 -189 -67 -334 228 63 -4 -122 -11 9 515 253 -20 -151 130 205 136 195 233 104 29 207
4920 207 24 365 471 111 -71 -40 28 360 274 220 506 44 139 722 130 461 448 315 111 352 238 429
4942 429 324 390 543 626 578 416 196 296 715 236 632 594 238 329 -17 374 297 559 86 188 361 360 497
4965 497 99 458 62 288 149 -215 545 391 96 -4 -75 -47 164 -116 -167 -26 105 10 -191 -115 46 -2
4987 -2 -23 -124 -38 -87 48 64 -328 -406 -254 184 109 -225 -118 -194 -376 -347 -209 -244 -569 -459 -151 -305 -199 -338
5011 -338 -261 -89 -255 -450 -662 -370 -15 -483 -554 -670 -124 -78 -374 -386 -326 -62 -377 -164 -628 -318 -226 -239
5033 -239 -283 -5 -156 -176 -310 -358 -149 -49 -564 -447 -47 235 -130 -197 -30 30 -132 -176 -184 -86 -270 60 -482
5056 -482 -233 -43 58 -252 -231 -62 -237 -291 29 -321 151 295 -361 -172 119 216 254 -158 151 348 26
5077 26 2 -137 125 251 143 11 -4 518 253 -232 -46 269 242 -16 11 133 190 -162 -113 -87 121 234 154
5100 154 119 43 531 210 46 -30 224 310 106 -95 171 270 26 -53 -84 601 398 211 -261 348 183 467
5122 467 -190 -40 398 188 -187 -136 220 436 -100 -395 -304 149 -69 107 -213 -67 315 289 -317 -346 135
5143 135 291 88 -347 -69 231 -6 -140 153 167 565 231 -129 305 338 279 -302 -44 265 172 -42 -131 493
5165 493 155 -207 -260 344 350 311 73 31 185 590 223 -175 57 63 157 -35 -71 159 398 43 -25 69 238 325
5189 325 12 -235 -87 325 128 -276 -288 420 -35 -317 -191 -59 -8 -137 -160 -231 199 476 -383 -125 127
5210 127 102 -346 -89 16 217 -81 -404 -387 -10 171 -375 -181 7 31 264 -202 -268 389 -22 -123 -343
5231 -343 -269 6 -177 -206 -125 -46 16 -457 -289 -71 3 -122 -89 -500 -85 21 -401 -438 197 40 -261 -422 -497
5254 -497 -218 -129 -208 -521 168 -53 -126 -287 -1 -124 -120 -292 -381 -36 -135 17 7 -29 16 239 -193 21 -101
5277 -101 103 8 -121 -66 19 -216 -229 -163 271 355 254 93 -61 278 135 -150 60 113 -103 138 26 163
5299 163 214 55 51 85 230 267 240 -25 -80 131 157 -185 105 335 352 154 26 201 396 83 297 86 211
5322 211 410 349 146 421 243 -5 50 32 304 384 129 -172 216 257 212 331 208 143 5 145 -14 -246
5344 -246 647 -7 -7 -57 36 102 134 39 81 36 -71 379 208 345 37 462 -48 -160 -277 220 112 -45 -294
5367 -294 261 -31 -122 -79 36 -177 -243 -59 -92 -122 -16 -60 -266 -321 -133 123 42 -93 -171 -173 -248 -51 -377 -559
5391 -559 -46 -62 -348 -272 -257 -165 57 -118 -401 -58 115 -132 -83 -174 -220 -241 -174 30 59 -79 -402 -555 -199
5414 -199 -18 -338 -256 -17 -217 -134 -276 -57 -83 -359 -128 54 -29 -252 -20 -227 -7 -71 -27 -329 89 68
5436 68 -69 -51 16 -443 4 153 242 61 -242 138 3 207 -221 -74 -175 -124 181 155 94 149 -31 17 -64
5459 -64 99 -88 -70 -50 170 136 -97 -164 231 190 -108 107 129 398 -89 70 39 279 38 69 274 -12 130
5482 130 35 0 -104 72 238 202 157 81 103 -109 228 78 41 412 44 -254 -25 -163 -58 148 266 -146
5504 -146 -39 -120 264 127 -288 -140 -296 197 130 -55 -19 -156 219 46 -66 -148 -73 -16 104 -33 -122 58
5526 58 260 119 -54 176 -40 248 24 -77 -84 149 -43 -23 22 292 39 -199 177 21 45 -116 -290 120
5548 120 320 243 -251 -11 237 154 89 13 266 237 -16 108 80 49 125 -368 -160 -122 27 26 -157 -35 -252 129
5572 129 -11 -68 117 8 -113 -204 263 144 85 -299 -182 38 -215 86 280 -118 90 19 -148 -106 -93 -53
5594 -53 -122 -30 3 65 45 -55 -41 -79 -148 -196 -74 -275 -135 -152 -31 -423 -148 10 -280 -327 -262 -78 -86 -205 -393
5619 -393 -122 -216 188 -20 225 -195 132 -187 -243 -200 -113 -44 -57 -90 -53 -388 78 -358 50 -64 -42 -87 -255
5642 -255 -84 242 -264 -248 -198 -7 -65 -158 -111 -235 -76 -376 193 -184 -55 117 -248 19 41 266 133 -297
5664 -297 -211 -147 14 81 -146 321 76 -335 -92 188 257 -74 122 79 242 167 16 -3 35 230 437 56 29
5687 29 335 189 36 -50 216 698 185 -113 -36 33 254 169 176 -14 394 280 -128 33 279 498 187 125 57
5710 57 305 180 -54 -144 161 113 80 25 191 326 112 -1 290 -119 274 -190 -81 244 277 7 -218 10
5732 10 130 319 101 -240 87 248 17 47 -14 78 -76 106 -90 168 107 162 -186 30 -13 32 -358 -92 252
5755 252 0 -249 -322 63 -60 -252 -244 -15 -164 -30 12 -301 -289 87 -11 -79 -455 -90 -217 66 -542 -111
5777 -111 -41 -305 181 -597 -77 -247 8 -294 -49 67 -419 -167 -172 21 -209 -261 -19 -34 58 10 -401 8
5799 8 0 -109 3 -34 -95 -55 14 -282 16 26 159 -179 -202 36 14 215 -134 33 56 -161 -33 158 -197 70
5823 70 -41 -162 33 328 22 43 298 72 227 -269 -26 95 46 -10 -96 235 -46 250 -184 -127 209 216 98
5846 98 -39 127 -86 -6 -139 66 216 -86 -203 89 -22 157 72 -265 -217 -74 -129 -141 -234 160 -95 40
5868 40 -23 -351 125 38 118 -330 -237 180 163 -318 -294 70 267 291 -44 71 110 171 -135 63 4 110 -126 80
5892 80 89 -165 62 84 -46 77 35 21 47 143 -202 100 191 54 -18 -313 390 127 -70 -109 309 174 102 190
5916 190 -258 -93 31 198 1 -46 -65 -32 351 -188 9 -51 139 -20 56 224 89 -152 -123 -75 81 150 -6
5939 -6 213 176 -37 16 -45 133 -41 97 -16 83 -40 203 154 69 -117 154 -165 139 38 -277 146 -169 -108
5962 -108 -133 -88 81 -220 12 -138 69 35 -233 -11 -71 -324 -106 -10 70 -68 -279 -160 148 -116 -34 57 -141
5985 -141 -56 335 94 -96 -176 192 -39 -291 50 16 -29 -203 -119 -210 -198 -68 -118 -193 -138 -21 -176 -400 31
6008 31 -28 53 -370 -425 -241 12 -442 11 90 3 201 -110 -317 -127 -53 -118 -200 -181 48 -6 30 -68 -286 -106
6032 -106 167 225 -169 210 105 -22 -127 376 259 -276 -10 -28 78 -242 -157 -112 42 -79 -150 -88 41 333
6054 333 -102 -86 188 225 -72 259 48 67 75 44 153 327 84 486 -188 119 50 -86 351 260 164 361 333
6077 333 -12 -8 278 267 74 -99 -153 248 90 350 135 -32 297 -40 141 113 135 88 -22 -148 64 152 10
6100 10 -149 100 206 -101 -7 92 -64 51 208 8 -23 12 -57 84 119 -28 -73 134 -177 -94 369 52 -5
6123 -5 -120 -31 -21 -30 -111 -130 105 -17 46 -212 130 164 120 -4 13 7 -291 -56 -33 242 179 -4 -72 -97 -80 -44 -140
6150 -140 11 47 -103 -103 63 -74 278 298 47 -81 98 143 -8 -227 -243 -173 -80 104 151 -275 139 135 -383 -158
6174 -158 18 -35 -307 39 253 -65 -8 -62 114 217 294 -187 -144 107 106 159 -171 -271 369 -99 -121 30 187
6197 187 227 189 412 173 70 128 -214 109 75 37 -19 -355 167 204 192 -117 70 25 129 -53 -11 -257 209
6220 209 138 -236 130 -20 86 -80 -435 238 53 -121 -207 -25 298 62 -29 133 -46 96 13 -133 -204 -258
6242 -258 371 -157 -32 -15 86 210 -281 7 29 -109 195 -314 12 -354 245 -338 -101 31 25 -72 -265 -163
6264 -163 -15 275 -150 -113 169 -95 56 -294 29 241 -309 -170 -45 190 -3 67 32 -35 194 23 250
6285 250 162 165 186 78 -102 -28 -45 -38 199 -10 108 104 277 102 154 49 245 -157 -72 122 -9 -129 59 -35
6309 -35 187 257 39 -331 24 60 -160 163 -74 151 58 104 -230 374 252 26 96 -99 36 21 91 108 8
6332 8 -154 -149 -25 -206 -118 -30 5 -271 100 -191 -157 -63 206 275 196 -157 11 -234 -164 -127 -28 -62 -111 111 144 -104
6358 -104 116 -91 -55 -90 -271 -27 43 37 -121 88 120 -481 -65 -180 70 -138 -317 -72 -95 150 -229 -88
6380 -88 -200 -138 -37 -101 -275 221 29 17 -175 85 -106 49 -186 -96 -161 -142 -84 -39 259 95 -59 70 93
6403 93 154 246 137 -207 -95 -208 -118 280 57 26 -173 254 -88 -70 229 102 8 26 65 -4 -102 -54 112 81
6427 81 200 -191 -70 48 -268 100 54 -11 -308 134 121 288 30 -118 -56 75 157 -23 50 333 94 -30
6449 -30 -53 -33 245 -49 294 38 102 176 -224 141 324 72 -15 123 314 98 245 -123 84 -39 -115 251
6471 251 269 -119 329 28 201 280 205 -60 15 134 -38 -41 127 -15 -86 -77 -397 -12 -170 155 46 -55 111
6494 111 119 22 -8 -201 19 -160 -47 27 -157 185 -98 -167 -245 -190 -183 -8 -251 -260 100 -245 12 -263 -11 231
6518 231 128 -210 28 -160 -135 -90 -289 202 83 21 152 -57 208 23 -164 -310 -320 -30 -238 -43 -125 -37
6540 -37 99 45 -261 -311 16 9 -109 -351 114 92 -200 166 96 -157 -95 144 8 169 -56 -44 -136 -62 -275 388
6564 388 -75 -78 109 -24 -107 -9 575 222 -281 127 -164 133 -54 -147 -225 262 51 -35 -229 -93 129 136 -178
6587 -178 -244 169 -233 377 -44 135 11 261 235 -30 186 227 -66 -40 57 -69 -133 31 -57 236 282 -35 -70
6610 -70 249 100 209 -142 -247 -53 322 27 98 47 266 -185 -70 -2 -87 101 16 -49 -285 166 -60 64
6632 64 -167 121 -138 -78 -429 92 139 188 158 127 131 152 200 -339 159 -20 -30 -197 130 30 34 83 -248 -293 179
6657 179 -244 -213 135 319 55 -19 -168 -140 115 131 -228 -64 101 421 66 -26 90 68 -146 -267 -223 247
6679 247 254 -24 78 106 -223 -235 102 -341 477 -170 30 136 180 30 -54 -163 -177 26 166 263 88 189 -113
6702 -113 151 -13 251 87 96 72 192 87 101 -127 264 -277 263 -158 62 45 -217 251 -44 -46 -31 107 -252
6725 -252 141 53 146 -102 75 -81 -203 -26 -46 -247 -157 -88 -72 33 46 -150 -11 -24 -180 -267 -79 152 -21
6748 -21 -74 -117 206 -14 137 -79 -9 104 -89 -326 -305 -1 151 161 -78 -53 112 -244 -121 -178 -15 56 -228
6771 -228 -238 -305 -142 -49 -304 192 -80 52 209 86 60 72 -188 -80 -120 -6 221 95 36 38 184 -176 162
6794 162 35 454 97 -131 186 -80 110 245 40 7 -65 154 -332 90 -216 -106 202 15 -8 -8 -157 -50
6816 -50 -210 -35 -353 -58 -47 9 208 99 67 151 -174 37 -42 49 -162 121 -157 150 153 -77 400 114 85
6839 85 -63 -22 -127 193 203 275 117 -62 -72 -44 -23 399 79 33 297 23 -146 -268 -10 -122 -153 123 -18
6862 -18 -52 160 40 -145 139 -117 150 235 -61 -2 103 21 -54 28 -159 -137 49 -101 84 -58 110 -188 20
6885 20 152 233 -38 -349 -93 23 78 -30 -274 106 -226 219 -150 -80 261 29 92 -112 2 12 -246 104
6907 104 -407 112 31 -284 128 -95 124 132 -19 -65 -248 -314 272 -88 329 347 105 -38 -196 61 -84 -96
6929 -96 -142 97 -1 159 -60 -38 132 324 -18 83 107 10 -56 20 -87 247 15 116 -15 -29 34 90 44 80
6953 80 -82 -144 -225 475 76 202 206 59 122 -35 -135 -137 -19 -238 345 -18 64 105 -259 -6 -61 -323 -94 232
6977 232 239 53 6 -90 145 6 249 260 -362 -97 53 -37 -95 69 55 -41 -141 6 -232 -97 235 -57 -332
7000 -332 368 -150 87 -11 26 -197 -226 -238 11 265 -38 -25 -184 -142 16 -4 152 157 -21 -79 55 126 -124 119
7024 119 77 115 -6 -222 77 100 -216 309 23 21 -99 -104 95 158 211 402 -30 77 -285 94 101 -107 -154 85
7048 85 60 394 60 171 96 202 -210 -461 -174 34 -48 -146 294 -42 -93 113 185 67 -9 44 -108 -228 38
7071 38 -41 210 -170 -240 -121 43 -117 -216 -33 51 150 18 -332 178 160 136 89 -109 -115 266 157 0 -120 343
7095 343 320 -103 -156 -125 213 -418 -201 68 17 -25 -132 73 302 -12 -40 -184 156 -115 51 -86 -226 76
7117 76 134 27 -209 -333 -29 -3 -255 -42 342 -153 -283 32 -25 361 138 -185 -18 -182 317 -27 -16 -31
7139 -31 131 -276 -49 121 81 -52 -102 -95 219 -138 263 -144 242 77 61 67 -177 506 74 283 -278 196 -8
7162 -8 106 -216 74 73 -191 -6 -400 19 6 -72 223 -41 -20 -168 -138 130 -88 46 -36 66 74 86 86 -582 -58
7187 -58 478 101 87 66 -115 119 36 195 -154 -247 144 36 -204 183 3 -191 -311 -439 131 63 321 205
7209 205 9 158 196 28 101 228 295 -169 -6 126 -49 133 -6 -35 -67 -49 -345 -34 -88 76 27 143 199
7232 199 101 -11 -125 -302 -11 41 -101 -185 -32 83 -65 130 -344 -42 311 -28 6 229 184 -67 -371 -34
7254 -34 197 110 -134 98 -189 -298 214 -219 -209 -100 258 -126 -299 -96 130 -206 -44 -168 92 157 101 -76
7276 -76 -43 -28 -266 -321 -232 333 113 -161 -325 -50 -13 -244 -123 62 -87 178 129 -177 73 134 -26 -5 -195
7299 -195 119 19 54 105 109 -63 -141 -53 177 17 -72 138 -59 -169 -51 47 234 64 -64 -21 89 -3 -264
7322 -264 -104 -49 -164 -35 -35 30 -134 -62 120 -114 -93 111 39 -5 -63 -273 371 52 6 94 -72 -172 -80 11
7346 11 -95 -303 241 266 -515 182 40 -132 194 65 138 297 149 22 -16 -19 -147 145 127 -202 -228 92 -21
7369 -21 14 -46 -63 -64 373 31 -222 62 -222 -19 24 -211 -220 167 -12 -59 -91 27 -266 121 9 63 -51 1
7393 1 4 -124 -84 -120 -19 90 204 -9 -55 70 -36 24 -120 204 211 44 -199 -33 -226 127 2 48 -5 187
7417 187 -194 66 -365 -138 -1 -35 -17 -105 166 323 404 244 -97 231 -88 6 -239 -175 -2 122 -143 83
7439 83 137 -95 -76 -158 -101 -126 -43 16 147 1 87 -98 -8 69 220 -192 38 -86 -39 -239 173 170 -272 32 -155
7464 -155 252 -44 -60 -124 -270 299 -249 67 81 70 -134 152 100 40 -111 -122 -154 -5 50 114 131 249 -255 123
7488 123 -114 78 183 -4 -132 -189 -17 -161 -190 26 35 -198 -264 -90 272 17 -191 -27 227 -198 -269 -6
7510 -6 -1 193 -354 -4 -221 132 -41 106 -40 194 -139 -89 268 279 16 77 49 -215 -53 46 -219 522 -277
7533 -277 170 -74 -107 10 -289 -59 -115 -124 49 -66 15 -180 159 106 26 3 -151 43 -159 -166 179 60 38 191
7557 191 553 154 29 30 449 -42 194 -136 -107 51 239 203 66 -251 53 16 319 138 145 302 -68 104
7579 104 -23 -6 253 -255 -435 359 88 240 -461 187 81 171 -212 173 3 264 68 -84 6 -9 239
7600 239 42 6 262 268 -87 -48 123 -89 97 -213 6 -47 55 -133 106 168 140 -3 -147 -127 233 278 -88
7623 -88 18 -105 43 106 -208 159 260 60 -121 -217 -16 117 -37 -301 -429 104 -69 26 -295 -237 -222 240
7645 240 162 126 251 38 130 -221 39 -125 85 -31 -124 -28 -129 -113 -76 220 204 74 -300 -29 159 51 -53
7668 -53 -228 -138 165 356 -117 -38 -33 347 89 126 -178 358 -158 -42 80 -221 -165 -361 -156 291 247 -65 -388
7691 -388 -75 101 83 -125 -52 -148 261 41 -9 -38 32 35 -203 56 -130 -175 -186 -218 53 281 374 167 -78 265
7715 265 131 -67 -177 347 -34 149 126 -129 65 251 175 -230 -93 -40 -67 191 -171 89 185 158 -35 -84
7737 -84 -48 -31 68 -96 -46 -121 85 67 -214 28 180 -50 -398 83 245 49 -155 52 268 166 -144 -117 225
7760 225 87 -189 -331 112 110 395 47 -168 90 -34 78 -174 1 76 200 -236 -161 162 186 48 87 -188
7782 -188 117 -42 48 -160 -62 -207 21 -95 -153 109 84 3 28 73 -123 -145 -57 127 329 254 151 84 -5 334
7806 334 131 -58 176 129 -148 64 -129 -108 -14 -238 -285 11 63 -137 -198 -171 -13 162 244 366 203 125 56
7829 56 -195 -277 157 102 -41 -246 -221 -125 350 -199 94 122 -198 100 -7 -78 -74 202 -45 -27 83 13 125 -26
7853 -26 -91 241 -93 -117 -3 -285 -88 -24 -76 -147 -112 -79 126 5 118 -177 -113 -53 -289 209 -15 14 -108 238
7877 238 101 -94 -236 -50 -110 -123 -128 -180 15 47 -238 -405 42 -58 27 142 -234 -164 -346 24 -27 -322 -146
7900 -146 -261 -172 -237 56 -167 198 171 -43 -141 130 38 -162 -109 -37 206 6 -299 144 53 -260 -157 256 -46
7923 -46 -136 38 152 -79 76 -36 42 36 169 134 -138 27 -38 -37 62 109 -88 -51 -247 -23 169 -66 -25 -115 239
7948 239 79 95 305 128 57 -275 84 -97 120 21 209 -123 -96 -136 16 88 59 -45 109 -200 -354 137
7970 137 323 60 -36 118 232 -87 206 -9 160 29 -26 -50 211 -111 -161 -159 83 -188 204 -35 147 54
7992 54 -106 -284 29 381 -100 122 115 75 215 -53 -138 127 240 85 -109 17 14 40 87 -166 -54 27 162
8015 162 -123 -208 147 68 78 38 -41 -51 77 -94 32 176 -92 0 -149 -30 201 286 -255 -168 -229 105 -79
8038 -79 -278 395 68 -84 -205 -40 57 -95 -2 56 69 -291 109 -269 -100 195 -60 -28 60 208 -178 -37
8060 -37 -90 -112 57 83 -144 -8 118 132 -298 -265 -249 238 58 172 227 54 197 -165 6 -104 69 104 -213
8083 -213 -18 114 52 -69 -74 295 -249 2 -46 20 99 -292 -89 135 -184 -94 159 64 9 46 -8 -109 2 79
8107 79 96 4 22 -232 74 -100 166 23 -27 0 68 258 -238 71 115 39 15 283 135 88 -131 -217 -81 91
8131 91 -11 -86 -44 -76 -3 -118 -243 140 39 118 -6 -98 -50 -189 -22 40 -24 10 209 -72 -52 168 22 -163
8155 -163 -121 189 54 -90 -47 24 178 391 -209 -10 61 107 70 -252 49 174 113 113 -122 -20 420 237 -103
8178 -103 -318 -125 -77 -105 120 -44 -22 208 -89 73 168 160 -94
8191i4
$$ Imaginary data points
##PAGE= N=2
##DATA TABLE= (X++(I..I)), XYDATA
0 0 0 0 0 8 -8 0 -8 14 -16 16 -22 26 -33 40 -48 58 -72 85 -100 114 -135 157 -181 207 -238 273 -309 349 -395
29 -395 449 -505 561 -631 703 -786 873 -970 1074 -1194 1323 -1462 1617 -1794 1986 -2202
45 -2202 2443 -2723 3038 -3403 3832 -4349 4972 -5754 6757 -8105 10008 -12904 17801 -27641
59 -27641 54970 -281548 -957037 -118236 414076 -112785 -414103 74690 138222 -296610 -264015
70 -264015 87577 -64885 -293704 -115327 -93478 -413500 -283217 175044 68246 -354617
80 -354617 -231359 13348 -258622 -411998 -4231 83417 -416297 -493926 13324 98352 -264004
91 -264004 -252499 -60039 -286469 -429406 -66731 58416 -332137 -355923 78407 9694 -463888
102 -463888 -340754 126832 -42455 -507084 -365214 40145 11910 -146373 -84506 -157462
112 -157462 -382244 -281756 -22816 -103642 -244296 -65041 19124 -213150 -206354 98869 29581
123 29581 -353702 -324738 -18680 -72683 -219364 46083 259808 -34939 -295956 -124426
133 -124426 2849 -123354 -99163 31950 -95572 -190871 99295 287491 888 -209121
143 -209121 -12540 59809 -168038 -151572 151519 191230 -13212 -7461 113519 49025 -5103
154 -5103 92527 47407 -131996 -50855 201047 197730 59331 115222 152665 -32856 -82224 150700
166 150700 216443 10836 -10704 190046 197671 66654 134676 225461 62612 -72695 63732
177 63732 177642 120953 163985 279491 154567 -44393 59625 252799 158778 -4830 67781
188 67781 167352 112950 129673 260592 225829 53846 27231 93966 62198 67785 206464 226759
200 226759 73908 57780 201425 189451 50802 62748 123316 17981 -38179 151873 287676
211 287676 156390 38725 96397 98580 1659 29878 127891 70797 -20137 63862 168591
222 168591 123068 78046 111213 48861 -87901 -64175 80354 105399 44406 60169 75822
233 75822 5461 -8049 71875 54029 -72345 -94118 -3642 26738 24404 86757 93842 -36266
245 -36266 -119355 -52952 -5022 -44106 -35102 16299 -22720 -78270 -10448 64352 -9267 -116642
257 -116642 -119384 -95508 -100938 -48530 37486 16861 -78974 -101354 -67815 -76911 -93130 -72062
269 -72062 -86109 -136933 -107594 -11258 11491 -45307 -80522 -107293 -168014 -174954 -82105 -21665
281 -21665 -65956 -102829 -71990 -58084 -81762 -78563 -77041 -138621 -186785 -137149 -57026 -29651
293 -29651 -26297 -32699 -90610 -155003 -136748 -75137 -74721 -109442 -102474 -74934 -67314 -46417 -12338
306 -12338 -36953 -114307 -152863 -129548 -90216 -47514 -5284 -12022 -66646 -84318 -45690 -30906
318 -30906 -63983 -82815 -78047 -83783 -69299 390 56393 28096 -40206 -73572 -76671 -66151 -30944
331 -30944 4277 -3002 -24066 -4909 30780 34515 17726 -674 -40028 -76819 -46196 36716
343 36716 81620 63771 37780 24963 7072 -462 21850 37549 16688 -1300 21940 64598
355 64598 93519 101554 76816 20044 -18164 5880 56271 77680 77132 79768 75917 62011 66303
368 66303 87255 82295 41732 11521 26148 72620 118118 136266 114899 70701 41318 40789 53735
381 53735 66693 78307 78196 69214 76540 110125 131649 104435 48413 11910 15552 46116 83708
394 83708 111460 114617 93223 66646 55354 60496 65195 51252 23951 14597 44095 91430 115765
407 115765 101674 64102 25224 2012 4782 28074 50090 51889 38997 34716 48972 65179
419 65179 58813 25252 -13939 -33492 -20298 14314 46709 57395 39920 7680 -15813 -16288 -2427
432 -2427 614 -17606 -37034 -28817 2474 27579 26274 246 -34589 -64154 -70670 -47516 -14435
445 -14435 -634 -12235 -31187 -39168 -32175 -24411 -34409 -64041 -89794 -83289 -48939 -14689 -187
458 -187 -10292 -42923 -80917 -95718 -79524 -57681 -53651 -61233 -61516 -50674 -33702 -21298 -30844
471 -30844 -68267 -106923 -114610 -90573 -55813 -29357 -21143 -35843 -59401 -68459 -58291 -52538 -66473
484 -66473 -87869 -94112 -74886 -39160 -8031 -4278 -30193 -65732 -85346 -82510 -63303 -41837 -32736
497 -32736 -39560 -46530 -35301 -14249 -7462 -26997 -59477 -79708 -71144 -38123 -1779 14710 6028
510 6028 -17810 -38732 -41501 -26033 -11642 -17852 -32136 -28720 -2464 24745 32216 18406 -8574
523 -8574 -34724 -42591 -23652 10512 36990 38457 19059 3020 10647 29271 27024 -18 -19524
536 -19524 -8531 17718 39959 58827 67614 48951 11781 -8867 3551 28261 39533 33971
548 33971 26341 32354 55959 74642 66189 38467 14474 1380 288 22832 66936 91747 70950
561 70950 37392 32991 47915 48231 32156 21825 22411 30641 49201 71719 82945 74108 48319
574 48319 14062 -2615 18151 55796 64572 43085 34232 50656 60872 51141 39136 30408 14463
587 14463 2549 17485 50416 70231 64207 40944 18133 12689 24138 28748 16225 10609 22639
600 22639 31837 31861 42369 55179 32987 -16317 -34832 -7177 26211 34566 28631 21051 13202 12540
614 12540 15869 6138 -11004 -16742 -15100 -16906 -4515 30857 48836 19108 -24917 -39225 -28989
627 -28989 -20587 -14470 -7881 -9706 -13383 -5334 5180 2823 -9448 -29017 -55089 -63865 -32959 4249
641 4249 3774 -16831 -17711 -13494 -31646 -47081 -35249 -27744 -46271 -57064 -34996 -7340 601 -7425
655 -7425 -31576 -63036 -69548 -43830 -25761 -33414 -35786 -24598 -25272 -34568 -26584 -19325 -42677 -70943
669 -70943 -66719 -45019 -29160 -10720 -46 -21905 -55144 -55824 -40139 -42823 -45501 -29524 -28822
682 -28822 -49184 -35333 9999 11732 -38132 -65002 -49420 -42420 -44207 -19352 6556 -6067 -27724
695 -27724 -24058 -17268 -25058 -25778 -23544 -41310 -49333 -14993 21995 17095 -2644 -7920 -22626 -43051
709 -43051 -27254 6495 3335 -18380 -6931 17087 12313 6241 18858 6157 -35117 -38106 4371
722 4371 26412 18712 26032 34351 8189 -12635 10635 30290 8696 -8291 8670 22360 25407
735 25407 47244 62018 29417 -8901 -2245 17335 17265 28303 52315 43065 15947 27933 55264
748 55264 40598 12696 17767 22576 5114 18967 70307 79070 35641 19175 35563 27429 10626
761 10626 33796 54970 28437 11104 44509 69382 49661 34846 36224 13457 -9189 18767
773 18767 58231 50946 31746 41593 42341 18407 19851 43063 29674 -5377 1857 35727 42598
786 42598 39973 52494 39593 -4443 -15775 15368 24255 7688 16532 33472 16168 2132 28765
799 28765 40502 1294 -27930 -12226 1452 54 18511 38432 17353 -12869 -8076 1807 -11950
812 -11950 -14319 690 -9267 -30075 -8035 28701 16722 -18520 -23807 -22856 -40750 -36360 -2648
825 -2648 3421 -20308 -20961 -5559 -15131 -27791 -14309 -18169 -55635 -59422 -14714 5402 -15662
838 -15662 -17855 -5679 -32462 -64621 -43191 -11430 -27363 -47610 -30556 -15167 -23151 -18336 -7760
851 -7760 -32504 -62888 -50533 -27999 -32387 -27235 1664 -4950 -46267 -47947 -11890 -14491 -49033
864 -49033 -48208 -25382 -28786 -31516 -3242 7709 -23456 -43720 -33303 -33882 -40205 -17390 2176
877 2176 -20115 -35213 -4403 13403 -14636 -32168 -17627 -22028 -43322 -24408 17438 19011 -6137
890 -6137 -9037 -7021 -20575 -18531 1666 -5246 -27063 -11359 20675 17261 2507 14555 14439 -21859
904 -21859 -35044 1213 24083 9532 5941 20208 14343 1439 14410 23463 -245 -15476 2554
917 2554 14553 12339 29479 47470 22521 -10998 700 24424 14475 3578 21159 29322 14276
930 14276 18677 42939 38831 11706 4385 7832 2297 13300 44488 47635 18721 11840 31004
943 31004 26391 6906 13977 27118 10535 162 27675 51367 39209 24076 20698 6344 -5254
956 -5254 13590 35513 23978 12155 27250 34136 17470 17015 32217 16698 -15559 -8437 23811
969 23811 32113 24780 30558 27981 2898 -4667 14641 18233 1514 3422 15571 10730 8927 30802
983 30802 35420 1342 -20653 -5729 4941 -1359 8082 25509 13533 -7519 67 14214 3618
996 3618 -8811 -6072 -10364 -17900 790 26822 18124 -6632 -8839 -5617 -19428 -21070 754 6962
1010 6962 -12769 -16280 3118 7889 -4405 -8565 -12735 -30801 -34521 -10455 6205 -1055 -5536
1023 -5536 -3022 -15019 -28748 -18146 -6341 -20068 -32792 -19947 -6442 -7447 -3782 1816 -15617
1036 -15617 -39861 -36136 -18215 -17147 -18997 -8038 -6642 -21869 -21647 -5105 -6992 -28842 -35676
1049 -35676 -26812 -24046 -18232 -705 4050 -14420 -26335 -20627 -20008 -26679 -20707 -11994 -19299 -25341
1063 -25341 -8908 5758 -3928 -18580 -22944 -27623 -31041 -17943 33 -744 -9890 -8789 -7584 -14601
1077 -14601 -14550 -7089 -13448 -26355 -19520 1922 9153 2534 867 -2656 -15784 -22190 -9912 1556
1091 1556 275 -2521 -175 1435 5786 12618 7808 -9980 -17095 -6072 2435 4127 12643 22412
1105 22412 14560 -1111 -1698 7719 8411 1703 108 2464 9105 21381 29627 21709 7784 2981
1119 2981 2690 262 7156 22525 26665 15599 10942 20487 26381 18083 8822 5741 5951 10277 20467
1134 20467 29428 31020 26126 16450 6692 6473 17503 23568 15529 7880 16225 28898 29755 23510 18830
1149 18830 13070 4325 1623 10689 24162 29384 23686 14567 12094 17053 19279 12030 3563 3220 8876
1164 8876 14085 19178 26454 25380 11793 -4155 -6150 5128 13152 10255 4956 5842 12359 14904
1178 14904 10673 5500 1475 -4463 -10970 -9245 5146 18869 15793 817 -8534 -5041 140 -3525
1192 -3525 -9821 -9966 -6383 -4475 -2011 4001 7489 -578 -16664 -25825 -19899 -7211 -1418 -4951 -9629
1207 -9629 -8460 -5569 -8279 -12570 -13686 -15028 -22994 -26777 -15032 1254 3251 -9009 -19350 -20859
1221 -20859 -19633 -19446 -17213 -15364 -15348 -15243 -13169 -9847 -5906 -6342 -17505 -32047 -31989 -17003 -6105
1236 -6105 -7892 -11344 -9044 -11048 -17676 -18775 -13684 -13256 -20645 -23545 -15701 -4106 3252 -277 -12193
1251 -12193 -21569 -20252 -14501 -12786 -10610 -4485 -2485 -8744 -9919 -1827 1938 -7708 -18660 -18689 -10393
1266 -10393 -1520 4174 5723 2563 -2655 -6323 -7653 -5219 -884 -158 -5559 -6082 3937 14284 12481
1281 12481 3578 -2795 -5982 -6986 -2488 6088 12162 11377 7128 5547 7316 9700 7770 600 -4656
1296 -4656 634 10095 15582 17732 18267 13046 2829 -2182 3929 11330 11770 7896 8494 13154 17910
1311 17910 18103 13997 7555 3062 2145 3918 10394 19203 22094 14745 7161 8899 13669 12108 6785
1326 6785 4274 6151 8783 13843 19754 20850 14727 5886 170 1687 7578 12380 11678 9940 10872
1341 10872 13297 13192 10753 7769 3194 -2313 -2204 6709 16749 18388 11977 4552 2254 2281 2495 1929
1357 1929 2190 3193 3555 5083 9471 13118 9331 -1078 -8769 -7211 -19 4852 5280 4070 3737 2833
1373 2833 616 -241 564 -1503 -7786 -12023 -5482 5899 10342 4153 -3362 -6219 -7518 -8829 -7501
1388 -7501 -3830 -3069 -4640 -5126 -1812 2358 2614 -5213 -15682 -18148 -10667 -3116 -1971 -1672 -1013 -4426
1404 -4426 -11145 -12746 -7720 -5809 -11381 -16435 -13191 -3886 1730 -119 -6687 -12850 -15340 -14862 -13324
1419 -13324 -8605 -3317 -3595 -9720 -11377 -5563 -1365 -6997 -16773 -19433 -14677 -8683 -5024 -2107 -728
1434 -728 -4124 -12171 -16787 -12908 -5735 -5899 -12474 -14246 -5823 1874 1626 -4510 -8922 -11673 -14046 -14304
1450 -14304 -8471 36 3478 -2078 -8688 -7692 -1477 43 -7616 -13224 -9930 -3688 -785 2647 6743
1465 6743 5411 -4003 -10912 -8150 -761 1989 310 -1828 -114 4520 7060 4352 537 -1432 -3682
1480 -3682 -6469 -2890 8213 15728 10446 987 -274 5139 6697 3333 1158 3027 5760 7800 9905
1495 9905 12990 14630 9594 -261 -4133 3324 12094 12477 8290 8278 12372 12456 9621 8250 8242 5306 1768
1512 1768 3469 11722 19900 19923 11431 4855 6052 9395 8044 5300 7870 11228 11157 10146 13465 15991
1528 15991 11850 2968 -1843 1662 9097 14248 13399 9618 8654 10148 8888 4757 4162 6077 3367
1543 3367 271 4421 13403 15422 7849 1455 -358 -19 623 2011 3234 3400 3832 3273 3829 4779 4926
1560 4926 -198 -8793 -9517 -1064 5820 4634 1441 931 -439 -4313 -6653 -5094 -3972 -6303 -7690
1575 -7690 -5317 -267 3826 1147 -6798 -13422 -12534 -8619 -6850 -5768 -3586 -2774 -5938 -7487 -5973
1590 -5973 -4922 -8162 -13791 -15647 -12023 -5274 -1164 -2975 -7844 -9954 -10758 -12291 -12730 -9622 -7880
1605 -7880 -10352 -11374 -7097 -1770 -1869 -7242 -12421 -15628 -14273 -9224 -5023 -3783 -4158 -5248 -7540 -9169
1621 -9169 -7723 -6042 -9346 -13929 -11845 -4538 171 328 -1846 -4935 -10107 -11354 -7734 -3700 -2182
1636 -2182 -2000 -2476 -3229 -1698 1905 1747 -4903 -10542 -7787 -2375 384 2839 5401 3508 -1923 -3255
1652 -3255 -955 412 223 -66 -1431 -1237 4600 11214 9394 1930 -1679 -737 -1095 -460 5086 9950
1668 9950 7644 2939 3413 7631 7345 3895 900 -1300 904 6909 11807 11325 8896 7756 4223 -417
1684 -417 1883 8826 9731 4074 3332 9237 12491 10933 8284 5082 1266 196 4024 8123 10582 11877
1700 11877 9685 4439 2679 7024 8943 3621 -370 3349 7667 8437 9457 11658 9193 1863 -2221
1715 -2221 723 4525 6876 7359 4687 3390 6618 9803 5614 449 322 1303 -963 431 8022 12077
1731 12077 6956 321 -100 1379 1518 1442 963 -573 309 4793 6352 3960 2801 1485 -4230 -8455
1747 -8455 -3384 4818 4895 -401 -444 2027 587 -1380 -1877 -2974 -5397 -4885 -1787 376 2606 4511
1763 4511 225 -7785 -9185 -2877 -910 -5015 -5220 -1249 -634 -3067 -1317 443 -3417 -9378 -9782 -7226
1779 -7226 -3920 -414 626 -2924 -6080 -4319 -3448 -7248 -8615 -5772 -5757 -8576 -5829 1286 2316 -4339
1795 -4339 -9904 -9880 -8939 -7746 -5030 -4175 -5147 -4204 -2679 -4105 -6228 -5054 -5412 -11215 -12109 -4811 1535
1812 1535 -1034 -4565 -4325 -5486 -8088 -7660 -4654 -5037 -6802 -5860 -3642 -1967 -139 17 -5285 -10719
1828 -10719 -8865 -3614 -2509 -3400 -1185 152 -2660 -4532 -1579 -419 -4348 -7337 -5762 -2951 241
1843 241 3983 3963 -364 -3953 -3589 -2776 -2366 220 1631 210 -904 2709 6421 3856 -742 -2191
1859 -2191 -1937 -1639 1382 6252 7510 4836 2558 2065 2238 3283 4170 2297 -60 1980 6637 9200
1875 9200 8163 6950 4846 1053 -110 3859 7383 6965 6079 6504 7264 7419 8527 7733 4160 1158
1891 1158 2111 5772 8564 11235 11540 7965 3462 3519 6341 6542 4705 4966 6287 6785 7787 10074 10215
1908 10215 6082 1425 201 3146 6084 8733 8512 6164 4889 5314 5260 4450 3366 2942 1271 381
1924 381 3744 9104 9400 4064 -192 -600 776 665 718 2246 2767 2036 1353 2513 3809 2230 -1689
1941 -1689 -5625 -5284 -1006 2817 3177 608 -753 -1563 -3013 -4249 -3587 -2455 -3890 -6087 -4371 488
1957 488 2268 -1745 -5624 -6731 -7019 -6881 -5717 -3537 -2209 -2928 -4967 -5537 -4133 -2740 -5479 -10696
1973 -10696 -11032 -6206 -2618 -2840 -4112 -3542 -4557 -8508 -10445 -7199 -4465 -5092 -7569 -7280 -3968 -1158
1989 -1158 -2357 -6695 -9661 -7834 -6852 -7703 -6057 -1596 -448 -4650 -7906 -5185 -2534 -4400 -7866
2004 -7866 -8584 -5501 -1928 -391 -1327 -2203 -2200 -4114 -7149 -7231 -2337 896 -2084 -5176 -1518 3045 922
2021 922 -3128 -4012 -3124 -3474 -3195 -112 3447 3699 1940 -1157 -2549 -411 2483 -125 -3775 -1250
2037 -1250 4628 5367 1849 2624 4703 1253 -3825 -1903 3726 5500 3503 2165 2803 4173 5456 4529
2053 4529 718 -371 2349 3283 1919 4481 9879 8444 1073 -1127 3933 6121 2472 1199 3682
2068 3682 5690 6185 6195 6091 4730 3434 1271 -736 1197 7256 10217 4973 1051 4629 7117 3865
2084 3865 613 2222 3862 1843 2071 5973 8574 6733 2689 71 -248 2567 4945 3337 1484
2099 1484 3466 5439 3799 2009 4162 4961 -413 -3962 -609 5037 6077 4124 2134 1614 1153 1455
2115 1455 462 -604 811 1631 145 -332 4093 6787 2173 -4081 -4183 30 560 -112 1273 2372
2131 2372 1056 -479 -275 -284 -394 -1231 -3771 -5205 -1199 4156 3483 -1271 -2802 -890 -2369 -4454 -2652
2148 -2652 171 -902 -3434 -2629 530 830 -313 -2856 -6173 -6643 -3150 -634 -1347 -1606 -156 -1545
2164 -1545 -4894 -4600 -1815 -2264 -5883 -6638 -3233 -653 -157 -510 -2578 -5137 -6316 -5306 -4661 -3447
2180 -3447 -1766 -1905 -4364 -4101 -1545 -936 -4270 -6803 -6241 -4886 -3640 -1771 -512 -1190 -3424 -4354
2196 -4354 -5002 -4157 -3034 -2610 -4654 -4622 -1456 662 -674 -2510 -3277 -4655 -5926 -4394 -1271 -498 -800
2213 -800 -1322 -1724 -2285 -1237 -416 -2748 -5124 -3191 -22 1079 819 1783 974 -1920 -3275 -1298 50
2230 50 -155 36 441 401 1315 3058 2934 -447 -2405 -1133 -37 932 3187 4594 3415 1455 1631 2645
2248 2645 1899 1361 1599 1485 1833 3976 6315 5560 3552 2256 1515 592 2157 4500 4514 3574 3941 5072
2266 5072 5354 4824 4008 2502 921 2382 4979 5776 5744 6230 5174 2606 2501 4356 4551 2493 2322
2283 2322 3497 4173 5294 6251 5754 2522 755 1507 2472 2763 4453 5534 3768 2380 3688 4862
2299 4862 2478 -178 189 1032 1125 2502 5068 4229 1375 -32 -568 -1130 -101 2243 1364 -1363 -417
2316 -417 2459 2671 49 -1012 -1114 -3026 -3192 -600 1424 934 -684 -1125 -2113 -2700 -1650 -1370 -3349
2333 -3349 -4787 -3260 -1237 -1035 -588 -189 -3044 -5939 -5762 -2852 -1981 -2828 -2907 -2766 -2962 -2874 -2300 -3036
2351 -3036 -5324 -6088 -5783 -4713 -2688 -368 -1125 -4094 -5609 -4767 -3952 -4409 -4199 -4234 -3925 -3735 -2252 -1163
2369 -1163 -1945 -3611 -5124 -5795 -5317 -2794 -686 -1816 -2806 -2721 -2293 -2674 -2872 -2445 -3163 -4817 -3890 -1209
2387 -1209 327 644 -461 -2019 -3657 -2776 -1212 -862 -849 -685 -316 -93 595 1532 542 -1745 -2893 -1786
2405 -1786 -360 982 2378 2804 761 -324 152 873 1002 353 692 455 1172 3349 3963 2827 1314
2422 1314 334 150 167 1536 3372 3400 2019 1771 3112 3345 2413 1831 919 276 1657 3490 4138 4289
2440 4289 4133 2823 1088 1327 2381 2943 1796 2085 2875 3777 4081 3748 2741 1862 -108 697 1965
2457 1965 3638 4055 3321 2635 2028 2757 2437 1242 759 1465 1616 1720 2791 4622 3382 990 -388
2474 -388 332 1202 1225 1005 1477 1865 2047 2302 1719 1061 824 -537 -1525 -712 2312 3189 1853 254 744
2493 744 698 202 -503 -506 -320 -46 -253 764 1749 1685 264 -2399 -2394 -655 221 -474 -562 51 812 47 -327
2514 -327 -858 -775 -2019 -3017 -2851 -491 1482 1074 -981 -1903 -1413 -1184 -2390 -2767 -1337 -783 -1767 -1926
2532 -1926 -289 1022 -561 -3818 -4405 -2721 -1103 -1200 -1568 -1288 -527 -1560 -2764 -2705 -1548 -1645 -3760
2549 -3760 -4499 -1979 599 12 -1977 -3340 -2896 -2342 -3414 -3452 -2186 -757 -1756 -3209 -2315 -224 -251
2566 -251 -2825 -5053 -4051 -1767 -910 -1254 -1173 -609 -1049 -3061 -3234 -1606 -554 -2174 -3644 -2496 -27
2583 -27 1430 -574 -2459 -2090 -1673 -2588 -2914 -700 1129 444 -1793 -1724 62 740 -337 -2340 -2021 -482
2601 -482 841 315 166 1429 1500 -1006 -2247 -634 1970 1506 -708 -1007 1867 3196 2071 660 619
2618 619 1069 -82 -351 1356 3734 3965 1878 682 1568 3049 2658 551 433 2170 3473 2807 2439
2635 2439 4064 4402 2039 -235 644 3559 4425 2591 1852 2889 4457 3788 2455 2331 2793 2271 1319
2652 1319 1644 4017 5271 4067 1723 1764 3254 3233 2040 1180 2508 3463 3080 2795 3565 3907 2364 29
2670 29 -144 1802 3389 2509 1595 2117 2646 1904 794 460 1094 799 -227 -237 1418 3199 2245 -194
2688 -194 -1053 -449 346 -158 -875 -319 815 393 -554 -431 504 -287 -2262 -3272 -1774 -292 -138 -797
2706 -797 -1430 -1368 -1317 -1925 -2627 -2427 -2148 -2400 -3225 -2133 -542 -672 -2383 -3552 -3492 -2999 -2720 -3169 -2617 -1774
2726 -1774 -2089 -2742 -2589 -1811 -2606 -3826 -4454 -3870 -2563 -1932 -1634 -2454 -2841 -2922 -2908 -3346 -3026 -2786 -2883 -3325
2746 -3325 -2462 -832 -748 -2287 -3225 -3357 -3009 -3082 -1921 -1183 -764 -1407 -1674 -1585 -1480 -1185 -1853 -2564 -2612 -1107
2766 -1107 158 137 -451 -980 -932 -1711 -1954 -1011 -200 -21 -598 -323 696 906 736 70 -763 -939 -547 757
2786 757 1461 1714 1440 1136 859 739 1319 914 245 354 599 1579 2343 2956 2245 1182 -68 308 1292
2805 1292 2083 2039 1903 2150 2135 2206 2147 2442 1409 778 431 1580 2763 3539 2854 1876 1191 1266 1613 1902
2825 1902 1548 1723 1869 1743 2292 2796 3075 1994 608 104 1013 2142 2148 2043 1971 2116 1346 1016 1759 1391
2845 1391 262 100 720 1639 2310 2861 1824 418 153 357 287 460 1692 1795 750 745 1895 2156 433
2864 433 -482 -695 120 460 1224 998 1216 646 245 -341 -642 221 777 -347 -1073 -292 1075 1411 49
2883 49 -404 -355 -985 -1272 -770 429 254 52 -489 -754 -199 -325 -812 -2287 -1744 -202 -157 -520 98 465
2903 465 -674 -2126 -1965 -1192 -890 -961 -1161 -1116 -591 -74 -378 -1581 -2289 -1681 -1499 -2320 -1317 -25 -526
2922 -526 -2046 -1819 -852 -1243 -1794 -1856 -1512 -1819 -1464 -218 -861 -1481 -988 -1559 -2659 -2472 -1143 -720 -2042
2941 -2042 -2083 -674 -279 -1486 -2009 -1776 -1996 -2371 -1602 -746 -717 -416 -608 -1528 -2212 -1157 -885 -1715 -2357
2960 -2357 -1623 -207 -675 -1173 -348 -608 -1875 -1825 -1349 -565 -580 -395 -460 -820 -351 636 241 -1144 -1201 -501
2980 -501 -34 -125 949 1389 505 -396 -515 164 -9 234 531 276 60 1275 2018 1024 422 676 487 -295
3000 -295 532 2275 2542 1302 1199 1705 1719 1387 1448 1275 429 1200 2144 2065 2014 2880 2343 702 63 2177
3020 2177 2976 1731 1038 2206 2731 2160 2168 2542 1993 987 1222 1521 1850 3010 3324 2186 581 1438
3038 1438 2312 2001 600 1315 2666 1526 1202 2377 3050 1712 629 416 543 1243 2003 2079 628 557
3056 557 1515 1596 421 450 874 185 -912 -242 1904 1782 383 -222 -281 -495 -445 -102 -305 -584 307 339
3076 339 -954 -379 661 232 -2214 -2598 -456 53 -879 -1706 -851 -951 -1673 -1899 -1488 -1416 -1286 -1802 -1971
3095 -1971 -1222 -157 -438 -1947 -2907 -1872 -1324 -1947 -2628 -1420 -319 -1793 -2415 -1744 -729 -1261 -2180
3112 -2180 -2899 -2618 -1159 -635 -1363 -2144 -1096 -688 -2044 -2990 -1495 -185 -1420 -2657 -1456 -11 -205
3129 -205 -1421 -2045 -1856 -1213 -1328 -1605 -1422 -378 72 -940 -1900 -1084 398 -557 -2208 -1294 347 801
3147 801 -84 -683 409 91 -413 -1126 -282 419 579 -55 -570 455 1717 1140 -418 -514 717 733 -77
3166 -77 -77 1349 2152 691 226 717 1114 865 -80 -238 1047 2244 1988 796 744 1556 1079 -88 -150 1734
3186 1734 2349 782 -73 1269 2279 1345 130 3 1002 1459 1030 949 1141 1974 1601 324 -179 1069
3204 1069 1497 712 -219 697 1934 1672 622 746 1148 608 -193 -87 1103 1645 1250 607 325 1113 1636
3223 1636 591 -423 -18 751 680 207 1009 1723 835 -432 -475 609 855 487 -808 -17 701 1140 405
3242 405 170 157 143 -351 -973 -66 1311 981 -104 -544 149 559 149 -554 -439 -182 -69 -356 475 623
3262 623 921 -373 -1450 -986 -83 348 -383 -190 213 75 -399 -526 -73 -29 -1077 -1374 -835 199 617
3281 617 312 -788 -727 -447 2 -616 -877 -620 -340 -673 -754 267 409 -807 -1278 -1456 -634 -239 -300 -454
3301 -454 -427 -494 -918 -599 -644 -590 -874 -1422 -1450 -1052 372 246 -778 -1000 -1085 -1437 -1307 -860 -454 -598 -1083
3322 -1083 -945 -827 -467 -824 -1011 -1373 -1238 -669 -578 -256 -47 -560 -728 -692 -903 -353 -538 -885 -967 -656 -407
3343 -407 27 112 -679 -850 -783 -1052 -100 129 335 35 -275 -256 142 -432 -494 -296 -726 -315 101 661 658 82
3365 82 -234 -78 416 487 246 133 502 913 779 677 582 889 1096 -30 90 1009 1473 1286 634 987 984
3386 984 1086 864 827 890 934 822 693 1462 1766 1563 1020 274 924 1222 920 794 1139 1573 1739 1076 1104
3407 1104 1392 1093 127 314 900 1551 1578 861 1138 1026 1256 873 682 704 1436 956 435 1135 1612 1201
3427 1201 229 -29 239 729 534 10 438 864 677 163 147 243 377 -465 -1100 -509 807 699 70 -389
3447 -389 287 125 -863 -807 -425 -174 -410 -716 -784 4 216 -483 -1668 -1695 -860 -532 -1035 -1102 -550 -407 -1128
3468 -1128 -1308 -888 -490 -959 -1734 -1528 -868 -431 -738 -1122 -1323 -1210 -1298 -1789 -1475 -1017 -821 -1250 -1872 -873
3488 -873 -434 -777 -1755 -1726 -982 -803 -1036 -884 -166 -258 -1113 -1466 -1082 -616 -321 -1172 -1703 -734 176 151 -602
3509 -602 -873 -609 -435 -756 -642 -69 527 80 -836 -602 337 524 -733 -483 -270 -91 -54 -112 664 742 105
3530 105 -255 -536 -4 815 533 -260 -138 650 1192 674 617 638 799 308 -181 808 1569 1137 511 419 791
3551 791 1303 615 406 319 814 1162 771 766 1079 1197 530 69 122 1291 1147 375 433 1180 1167 721 495 742
3573 742 508 477 388 483 1130 1368 1207 285 264 655 801 107 189 523 1073 721 440 572 961 203 -188 -573
3595 -573 454 723 810 191 50 537 517 15 -220 83 177 225 -93 55 505 750 -6 -539 -273 287 95
3616 95 -666 -579 455 310 165 76 22 178 -591 -1109 -562 367 210 -33 -209 -41 -258 -278 -322 -786 -165 106
3638 106 -434 -551 -74 618 -107 -1042 -641 -32 -181 -814 -535 -18 -241 -285 -449 -271 -63 -23 -754 -927 -184
3659 -184 167 151 -1002 -822 53 -36 -390 -909 -366 216 -553 -827 -138 313 -76 -939 -730 -663 -258 -260 -535
3680 -535 -585 -326 -163 -570 -738 -178 75 -356 -1036 -391 421 182 -599 -644 -445 -346 -386 -860 -633 -108 29
3701 29 -835 -761 48 561 -568 -1242 -861 -39 -64 -496 -273 -166 -245 -737 -454 -452 169 -153 -733 -780 128 603
3723 603 -15 -548 -749 -92 239 -849 -23 351 607 -432 -316 405 687 342 -270 -557 86 380 849
3742 849 59 289 697 352 -417 -315 1174 1156 134 -84 547 1284 966 607 318 511 463 380 319 989 989
3763 989 1166 331 447 1128 1232 605 24 561 807 865 197 774 1359 621 183 573 1025 1285 913 635
3783 635 710 1099 910 874 73 829 796 260 319 783 1506 1109 389 160 767 673 613 307 105 768 634 485
3805 485 164 526 489 102 -472 -108 434 488 -152 -195 352 84 -532 -675 62 -1 -250 -431 48 -64 217
3826 217 -286 -583 -550 -336 -351 -704 -761 -288 -224 -730 -819 -531 -154 -1011 -1263 -734 -526 -681 -745 -825 -734 -608 -975
3849 -975 -648 -1044 -947 -677 -740 -969 -588 -462 -885 -1253 -580 -475 -1000 -938 -895 -164 -682 -676 -559 -785 -667 -548
3871 -548 -1112 -1106 -292 -273 -530 -893 -581 -78 -558 -734 -295 -25 -486 -548 -391 226 -51 -223 -212 -259 -298 89
3893 89 262 -186 135 28 -13 72 262 617 300 -211 -13 621 354 179 508 340 295 -53 226 659 335
3914 335 175 258 398 461 707 838 416 127 536 300 322 633 1062 621 117 456 866 657 413 497 577 596
3936 596 745 671 713 505 850 336 -85 366 806 771 102 288 493 926 547 221 649 245 -53 189 468
3957 468 788 717 215 -147 79 761 213 -306 -286 560 398 235 206 695 392 -209 -530 -20 398 379 157
3978 157 -237 -8 248 -53 -164 162 259 -219 -813 -284 262 838 -101 -364 -401 121 -164 -564 -75 -32 -117
3999 -117 -455 -206 -158 67 -125 -636 -633 -138 182 -285 -459 -113 -53 -125 -371 -379 156 -66 -891 -464 253 386
4021 386 116 -564 -169 -160 106 -265 -318 -264 102 5 -532 -366 80 331 -771 -643 -32 419 10 -34 -286 161
4043 161 -291 -614 -415 -305 -62 -107 -509 -334 236 -28 -892 -540 -241 -138 -439 -710 -74 235 -410 -651
4063 -651 -420 201 -120 -796 -874 -352 -223 -127 -536 -664 74 -164 -578 -762 -728 -122 -91 -477 -389 -273 -88 -407
4085 -407 -343 -447 96 -224 -460 -72 -86 415 -475 -581 -179 378 -224 -599 -302 243 584 287 -45 334 -29
4106 -29 -29 -330 2 176 328 139 114 285 368 661 -129 -198 387 301 -250 -47 470 650 244 -45 134 610
4128 610 182 96 47 253 1059 694 435 160 370 412 245 103 646 913 464 236 172 896 653 468 459 501
4150 501 762 719 316 523 857 691 420 383 622 808 449 432 414 645 696 378 341 255 584 247 305 307 935
4173 935 661 150 84 315 438 199 350 216 282 249 317 316 129 225 90 -179 -429 -8 514 273 -269 -277 54
4196 54 20 -374 -43 -158 -395 -439 -350 -9 195 -237 -347 -664 -434 58 -533 -691 -253 -227 -360 -813 -419 27
4218 27 -403 -720 -915 -587 -167 -353 -452 -807 -343 -536 -799 -622 -605 -446 -737 -799 -690 -557 -31 -494 -1106
4239 -1106 -731 -315 -488 -444 -704 -652 -391 -276 -618 -34 -33 -566 -684 -491 -53 1 -347 -283 -276 -124 -229 -227 -228 -154
4263 -154 224 -512 -164 -113 376 -200 -364 -740 -21 421 114 -122 181 299 -18 -187 126 136 318 -51 62
4284 62 566 375 78 -47 255 547 248 282 388 194 617 449 62 401 702 595 55 55 494 475 311 253
4306 253 899 638 832 287 576 348 716 532 5 162 607 761 169 121 374 338 470 87 387 713 203
4327 203 446 319 591 452 217 158 -247 353 159 204 230 203 185 58 -10 398 288 -88 -296 -118 243 370
4349 370 -48 126 132 -52 -65 -461 -23 272 102 209 0 -167 197 -38 -245 -100 -136 -197 -86 -317 -118 -9
4371 -9 141 -363 -225 163 33 -255 -156 -81 -9 -44 -199 79 -300 -233 -66 -142 72 -88 -3 -331 -40 -51 50
4394 50 -77 1 -153 -397 -99 175 54 154 -299 -20 -259 38 199 -325 -120 -120 46 -347 145 121 -145 -368
4416 -368 -453 -157 78 305 -216 60 197 91 -148 -352 -105 -143 -350 -411 -250 -136 140 -414 -196 -108 -111 -263
4438 -263 -81 -142 -165 -46 -176 -94 107 -46 -264 -494 -393 -30 34 -223 -357 -38 -503 -356 -388 -1 22 -251
4460 -251 -433 -34 233 -7 -96 -125 -179 -219 21 -104 -148 279 -92 -273 -377 82 -15 -207 -497 86 -151 4
4482 4 -188 147 224 122 -236 -106 163 292 74 -93 -149 94 362 -48 -305 -49 122 64 -155 426 593 443
4504 443 386 -14 314 248 575 -14 309 312 649 148 193 691 694 274 1 267 563 629 446 189 600 730 284
4527 284 221 438 833 431 27 284 681 759 355 -44 142 836 618 202 154 185 632 540 88 238 709 297
4549 297 -121 -205 460 463 120 -272 416 541 98 -175 -107 335 350 -215 -148 436 305 287 -410 -368 222 420 -180
4572 -180 -449 -233 123 55 -440 -284 126 -86 -439 -422 111 76 -177 -725 -509 25 -13 -575 -647 -305 -9 -420
4594 -420 -741 -467 -33 -314 -554 -821 -312 -133 -510 -505 -390 -246 -328 -578 -716 -156 -7 -560 -852 -425 5
4615 5 67 -468 -871 -462 -250 -390 -798 -254 -21 -225 -1058 -432 2 258 -6 -695 -406 160 -64 -341 -434
4636 -434 24 -7 -244 -356 20 692 28 -514 -447 315 190 -4 -108 -36 347 185 169 18 153 377 -49
4657 -49 -345 -7 308 377 -253 -49 469 633 -14 -47 437 246 294 -45 120 312 460 246 131 374 681
4678 681 677 17 2 408 121 184 242 414 542 611 -297 476 836 631 277 345 139 807 381 55 381 507
4700 507 632 -96 49 53 518 -27 -191 91 219 341 58 22 430 208 -67 130 329 419 454 -3 -133 -123
4722 -123 299 213 87 65 94 59 -33 101 272 72 97 -300 -113 10 93 -61 -240 -70 103 -75 -24 144 112
4745 112 -118 -282 184 212 365 19 -224 173 150 -69 -176 74 -315 178 61 -171 -102 337 65 -71 -158
4766 -158 -74 22 50 -155 -116 -291 -183 -96 -141 -43 -127 -49 -152 -243 319 11 119 -167 45 31 -129 -110 -347 -17
4790 -17 15 -134 -34 -216 -184 124 -327 -255 -263 162 -73 -242 168 202 -263 -60 -367 -159 168 -53 -206 92
4812 92 17 -122 -136 -312 -260 -118 -180 -233 -279 91 87 -112 -337 -15 -113 -455 -77 -124 -42 47 -265 -400 -414 246 -179
4837 -179 -508 -448 -181 -120 -55 78 13 157 -227 -354 -301 114 -41 -196 -291 84 -16 13 64 136 129 26 184 -147
4861 -147 -256 -1 114 -263 -105 34 228 -21 -105 -121 -17 -15 244 240 287 103 164 282 132 390 335 337 55 212
4885 212 226 154 281 362 339 328 297 164 274 416 34 126 382 617 379 47 453 159 368 111 372 226
4907 226 528 251 255 393 450 245 452 144 60 501 357 242 159 276 621 670 38 73 532 156 -33 172
4929 172 66 92 309 387 182 269 -100 212 100 287 70 104 -44 394 24 -46 -1 -28 156 -251 -38 -57 -149
4952 -149 -87 80 -329 -285 -559 -61 -154 -237 -177 -404 -96 -53 -409 -390 -81 -307 -172 -427 -326 -49 -370 -277 -540
4975 -540 -264 -284 -483 -375 -483 -146 -282 -205 -129 -183 -295 -363 -382 -382 -336 -544 -372 -443 -411 -48 -446 -751 -336 -123
4999 -123 -301 -608 -157 -414 -155 -268 -28 -266 -150 -32 -366 -52 -43 -70 -188 -266 -18 85 -226 -319 -242 98
5021 98 133 -300 -179 238 499 97 18 264 29 289 436 -5 8 72 201 52 107 508 456 103 -172 443
5043 443 440 218 -155 272 457 227 143 95 155 471 256 -88 323 251 319 81 28 261 558 158 -90 339 336
5066 336 -38 -61 180 634 667 464 166 316 369 304 328 124 368 342 104 101 -54 509 426 -148 -40 519 213
5089 213 109 -174 -62 265 238 -176 -187 1 489 -136 -467 280 209 -55 -118 -60 -40 486 49 -138 202 172
5111 172 58 -234 -169 41 -137 -90 -436 290 143 109 39 -226 134 174 -190 -266 15 330 213 -219 -79 38
5133 38 127 -482 -141 -157 146 29 -150 -93 87 22 -69 -453 107 661 187 43 -104 111 318 -347 -55 144
5155 144 171 -359 -184 -311 42 212 -246 -347 54 470 51 -393 -259 -179 -146 -230 -568 -171 342 -229 -214 -57
5177 -57 20 33 -405 -416 136 8 -161 -285 46 90 -172 -361 -279 36 115 -162 -311 156 -184 -221 -146 -38 -55
5200 -55 -124 -122 -410 -261 47 -121 -338 -220 17 -129 -124 7 -89 -120 -101 -370 -246 190 79 -323 -262 56 355
5223 355 -60 -381 74 -15 -236 -445 -189 -59 113 -222 -566 -13 77 176 -141 -400 -90 21 -78 -129 -25 339
5245 339 131 -127 198 213 233 97 -149 -14 312 92 93 112 132 252 19 159 101 494 205 124 8 189 336
5268 336 49 -62 319 390 281 270 291 430 303 126 152 179 416 -5 353 239 70 258 132 260 -110 304
5290 304 172 264 175 -16 248 26 -137 105 272 152 131 -85 201 461 214 -16 189 168 138 87 -70 362
5312 362 116 -220 269 185 395 -93 -73 -62 -13 187 -23 -73 -218 -53 -93 129 -90 -15 35 -127 -245 -141 -203
5335 -203 -118 -150 -290 40 -166 -486 -142 13 -165 -49 -233 -258 -230 -209 -269 -115 -361 -651 -189 -473 -166 -183
5357 -183 -403 -462 -138 -319 -378 -401 -439 -313 -247 -470 -27 -353 -363 -319 -57 -83 -220 -178 -68 -311 -502 -316 -54
5380 -54 -217 -57 -398 -442 -87 -290 -114 1 -84 -76 -119 120 -135 -3 -27 -74 75 27 -159 32 45 -57 -40 18
5404 18 -86 50 134 338 -53 53 -359 -30 32 302 -142 87 181 246 184 149 66 -116 248 -77 -126 -163 79
5427 79 67 -91 264 489 26 220 140 447 116 265 -155 468 131 314 226 -95 207 353 128 165 68 280
5449 280 407 -73 208 364 63 -267 51 309 429 35 -2 202 295 3 19 -285 233 98 -96 -101 270 149
5471 149 231 71 153 133 108 -3 -78 11 -98 77 147 216 17 291 -230 -242 -106 185 111 282 -102 119 42 51
5495 51 -194 134 215 -54 -173 -50 235 -230 80 -211 -114 -24 -27 -132 -69 -41 -64 26 24 -91 127 275 91 -89
5519 -89 -24 159 -568 -279 -173 -86 1 65 -124 -54 12 -26 80 68 85 304 209 -93 -31 11 185 123 -79 399 16
5544 16 30 79 -163 -44 -177 -190 -17 230 9 94 85 -193 -72 84 -118 152 13 -284 -21 -196 -235 4 -244
5567 -244 -239 -367 91 -239 -243 -29 -62 50 -241 -340 -28 -22 -208 -77 -201 -177 204 335 -135 -270 -63 -142 -7
5590 -7 -132 56 114 -48 -325 -197 107 104 44 -185 -7 199 1 -163 -162 -156 147 -131 -324 -131 148 4 12 -192
5614 -192 185 554 -190 -346 -278 243 -68 -247 -42 200 -40 -1 -11 196 271 -5 142 -137 153 379 21
5635 21 -4 -114 268 419 131 70 73 158 -15 -145 255 207 50 69 -110 157 93 308 529 83 156 212 131 108
5659 108 302 88 -110 16 242 259 167 203 186 388 325 -90 -125 178 284 53 1 50 354 214 -52 -95 88
5682 88 483 88 114 219 170 114 -244 9 -32 174 249 -62 -183 365 330 3 10 -41 106 -81 -144 43 444 387
5706 387 -46 41 23 -3 -111 -388 -313 -45 -142 -322 -198 -173 121 11 -249 -134 -38 -69 -174 -100 -124 -11 98
5729 98 -441 22 150 1 -336 -511 99 165 -396 -350 -35 -45 -204 -321 -258 -102 193 -70 -126 -119 -204 -46 -326
5752 -326 -54 -53 182 -270 -292 -373 143 79 -141 -66 -141 -19 -77 -288 -168 -126 133 -106 -126 108 -3 -297 -347 -42
5776 -42 -60 57 161 -17 5 388 -145 -103 174 178 -190 -232 87 -53 -13 -45 182 383 90 -73 -114 48 147 -13
5800 -13 134 -104 -9 -34 -18 203 77 166 247 173 -28 -44 19 -173 -297 411 242 249 86 -114 111 159 -153 -241
5824 -241 33 128 159 246 -139 218 88 66 19 -78 94 66 -75 -223 123 146 254 -120 168 44 -65 -76 190
5847 190 23 -14 84 14 185 -238 -28 -91 -246 215 -232 -164 38 -94 -157 -18 95 -27 40 198 94 241
5869 241 -69 91 70 -133 -40 -237 217 -398 -122 -24 -55 126 -57 -1 138 -81 275 -182 184 -9 278 129
5891 129 6 -239 23 57 65 -22 -26 128 -75 84 -46 -382 -258 20 -255 112 148 221 132 249 -18 89 131
5914 131 -16 177 7 109 132 -79 158 -259 -54 -31 11 42 99 -173 -65 189 -243 16 -159 -187 201 191
5936 191 -166 -48 -45 -211 112 -165 -161 -86 -94 220 -7 -381 -277 411 161 -117 -348 -64 -87 -77 -267 -49 -333
5959 -333 -221 -264 -93 46 -230 -197 -67 -107 -210 -58 -81 -195 -42 -84 -150 118 -240 -106 -173 -448 188 -125
5981 -125 -113 1 137 94 -49 -370 78 -175 18 -43 -102 -50 17 78 -210 126 183 48 10 -145 -53 12 -82 -26
6005 -26 58 -275 34 -82 43 -22 122 72 56 86 309 33 30 -93 -183 277 30 -46 237 74 153 155 218 290 111
6030 111 322 232 48 299 247 -29 -70 -254 172 259 16 115 211 69 -62 351 179 -50 14 -74 90 171 282
6053 282 -177 360 -140 271 0 197 -47 -16 41 292 -105 -176 8 136 -239 226 86 334 -22 81 176
6074 176 12 -129 59 9 45 -36 -41 -21 108 177 -24 -89 -297 -353 -1 307 -552 66 -158 -55 -231 35 15
6097 15 75 -90 -280 16 -23 129 6 -243 143 252 316 230 -207 135 4 -347 22 -47 -221 8 -331 -15
6119 -15 24 -132 -253 -99 36 38 -138 -37 -58 -128 31 -278 135 158 155 0 -98 118 -57 104 -193 -200 109 23
6143 23 -168 34 247 19 -43 -266 -173 49 83 -80 -77 -122 34 -230 -292 -311 166 171 -166 -113 44 -143 55 0
6167 0 187 61 49 54 46 219 164 118 -290 23 409 139 139 -216 -4 -107 -94 -34 -31 317 -113 128 -129 -55 265
6192 265 -94 96 -189 93 141 11 -320 -109 144 24 -243 249 40 184 -161 50 62 17 127 9 -18
6213 -18 12 -74 16 -8 97 266 139 278 158 94 99 -177 -85 -108 -94 -243 88 204 337 -54 -16 -284 -22 -239
6237 -239 55 -189 -66 80 -45 57 -307 16 16 124 -392 281 -103 206 -228 -83 -221 51 -88 89 117
6258 117 86 -68 126 116 184 -116 53 -327 -56 132 375 -4 59 -151 221 287 41 -179 97 -9 212 45
6280 45 195 309 351 -128 34 190 269 -176 -404 -97 154 128 -128 183 157 54 -106 20 -227 -19 -327 -117
6302 -117 19 21 -50 62 36 -96 -57 -54 45 -152 -2 16 -84 -245 -17 121 -256 -34 -41 -66 -87 173 -10 -270
6326 -270 97 -160 -281 115 11 -109 -200 -268 82 -185 -14 -87 -7 -409 11 -370 -61 -70 307 -66 68 -132
6348 -132 -238 139 -211 -204 39 -33 -41 -136 207 -121 -110 -75 9 263 79 -246 -263 5 -167 -190 76 37 -2 -119
6372 -119 -53 172 18 -144 -144 -60 171 90 63 59 -198 -29 80 71 -83 17 -49 204 90 36 202 -206 74 148
6396 148 -257 22 128 204 286 -96 -31 58 496 -35 -115 185 -36 -297 -156 -169 -1 -193 60 -252 284 121
6418 121 -173 -293 80 27 14 -131 3 207 -12 193 -6 -310 -4 -103 188 -21 -181 186 72 157 90 150
6440 150 -91 -145 -77 -138 216 253 7 -5 27 106 309 270 219 190 35 312 36 202 308 -192 114 -37 -142
6463 -142 108 24 -350 22 114 232 16 57 114 24 -396 -60 295 129 126 143 -231 57 -5 204 -133 -79 -94 -345
6487 -345 -71 -402 117 -260 -119 -90 -179 -188 -178 -128 -161 -120 201 124 -83 52 81 -95 -382 233 63 59 40 -14 128
6512 128 15 -30 14 -472 273 121 18 114 300 283 -71 -117 147 270 -115 -49 148 207 129 -164 -84 127 131 -274
6536 -274 115 -135 -126 337 -43 -65 199 73 -348 -215 -8 143 157 -300 84 -32 161 -115 -100 70 308 360
6558 360 186 -49 166 -109 70 44 68 -57 103 -100 -63 50 64 -17 -278 -147 70 167 -165 39 267 -9
6580 -9 -199 -202 -294 116 52 -179 226 174 184 -172 -109 -180 50 14 -43 198 18 -167 257 122 157 254 -220 -194 -90
6605 -90 214 301 -46 68 46 48 181 -291 -34 264 -233 69 -73 28 262 149 -210 -241 -3 105 -179 -313
6627 -313 5 137 251 10 -47 56 91 -123 -99 272 176 -284 -100 19 16 229 -51 -115 -70 -68 -174 -55 -32 259
6651 259 -125 -63 -279 56 172 16 118 -123 -119 299 -181 -37 -3 -139 229 -349 -143 -33 23 135 140 208 -19
6674 -19 31 -38 269 137 224 -73 -49 215 -63 33 53 118 -81 -3 -64 -5 31 -273 208 -122 -153 147 -67 229
6698 229 27 9 -173 7 -227 -211 86 5 -86 -245 160 234 253 -122 107 -22 238 -90 -133 -101 -51 56 -265
6721 -265 78 39 -269 -73 83 -201 174 -356 -124 -114 11 167 36 -62 293 -95 -62 -215 33 134 -139
6742 -139 -139 135 -214 -195 -188 14 -16 141 56 113 -176 175 12 151 225 -26 -134 -17 -44 -132 154 -9 -139 7
6766 7 107 -71 76 -14 255 -81 224 -216 -147 -33 -170 188 85 118 158 267 136 -10 112 113 34 -105 -262
6789 -262 231 573 1 30 -58 143 192 14 -76 -189 2 -36 155 -14 209 232 101 -175 8 254 28 239
6811 239 259 -132 -77 -174 -38 -67 219 313 79 147 -153 200 39 -12 -321 -88 31 -53 114 45 -54 -237 -204 113
6835 113 226 12 -350 -131 44 -404 -44 -148 -248 -182 -111 -356 -88 131 30 19 -137 35 232 -8 -80
6856 -80 -224 67 106 -299 -25 120 151 19 138 125 -45 -87 70 -111 107 123 -121 -122 244 30 -177 -54 -129
6879 -129 -87 143 -60 127 -336 -342 82 60 -110 -104 32 -172 40 101 187 -229 243 276 134 85 -410 250 -61
6902 -61 10 -189 -140 -152 24 -100 -4 68 -1 -104 66 139 -22 105 -78 35 250 -80 -48 267 -62 52 364
6925 364 -50 12 511 -263 -131 270 139 61 193 2 -50 164 168 113 356 -66 -114 -257 -214 309 -75 -66 291
6948 291 -42 -35 -28 -97 8 -274 -90 -28 -113 -115 9 23 58 47 -129 -204 -275 -41 -107 -196 1 94 -35 -262 137 -36
6974 -36 -6 55 -7 -89 235 67 -32 -194 -160 -199 -32 -15 131 163 81 -182 191 -62 -76 -40 -147 119 247 -221
6998 -221 -273 59 204 -153 -151 85 41 -233 -139 -282 139 159 -47 74 -226 61 -312 -169 137 94 -55 64
7020 64 -96 -104 -27 -289 33 85 243 -102 123 92 159 -15 -5 178 -16 -311 21 143 106 141 308 163 157 162 -115
7045 -115 57 67 -4 -43 -141 -21 173 -122 -108 123 49 18 371 -233 1 -139 56 187 -238 -117 34 -9 125
7068 125 -222 -223 215 -92 -279 57 186 -195 -208 -106 152 440 39 -107 -278 53 92 -125 -50 -34 57 -124
7090 -124 -136 4 108 -115 -381 -388 -160 37 -32 -31 -24 -140 -109 -46 -109 24 -55 273 7 -124 -267 415 -232 -128
7114 -128 -362 216 50 -30 -63 119 -169 -138 45 -118 266 -113 -174 149 259 -248 48 -33 137 0 13 63
7136 63 16 32 -344 65 241 -29 34 173 -55 -56 185 -18 27 -144 15 22 -259 74 335 52 132 -51 -3 146
7160 146 -71 -75 -291 -51 0 -169 -11 -110 -90 9 -20 -198 -42 92 134 3 -150 31 -77 136 69 157 38
7183 38 207 -128 -33 85 -210 108 -1 199 396 42 -258 -53 137 218 -361 -127 33 193 47 -101 514
7204 514 141 -190 0 -17 -218 210 -70 -245 123 96 132 -24 -192 -247 49 -380 -28 190 282 -153 30 -57
7226 -57 361 43 -58 -328 -144 -290 -216 25 -207 188 58 -424 -181 -143 235 -93 -190 -218 -142 -127 -125 16 49
7249 49 142 -192 -137 -143 -184 -81 117 -167 -219 -80 -30 10 -131 53 154 292 -196 31 128 143 -24 -43 -196 -310
7273 -310 -92 157 19 86 -54 -29 -177 -111 76 -41 51 69 109 126 -75 -19 -103 -186 142 11 -106 70 133 -61
7297 -61 70 -159 32 217 107 64 61 95 -27 90 -41 214 -24 74 -20 49 129 -281 73 -54 -79 -45 -6 227
7321 227 -33 -17 26 -19 -168 216 -29 10 -309 326 4 108 -222 94 212 51 6 175 268 -258 37 179
7343 179 183 303 232 74 -40 188 -48 -243 7 54 -21 -8 96 -53 245 -29 6 347 -251 26 132 -88
7365 -88 -94 -74 -23 -94 -2 96 66 -241 -117 56 -17 24 -126 -47 248 171 -154 -60 -10 83 152 -303 79 183 -138 -67
7391 -67 -156 241 -3 69 -149 -176 -245 -74 -306 218 -61 261 -44 -268 -16 271 -74 -232 108 -167 154 -80
7413 -80 275 39 0 271 42 224 -209 155 -130 -342 -65 -68 -70 -19 152 -43 70 -157 -58 49 -225 -466 -82
7436 -82 180 157 43 -179 227 -53 -406 -53 1 -121 -18 5 145 -270 -134 -3 -218 76 130 -346 64 272
7458 272 174 35 -69 -184 -133 -5 -176 78 52 208 67 -2 71 44 38 -16 -80 106 -33 -32 167 84 -57 -7 -122
7483 -122 -227 47 -257 -112 184 -166 -59 294 92 -88 -10 56 -408 -21 157 29 -244 26 135 150 -5
7504 -5 126 181 155 33 -6 168 -6 90 -17 -117 2 38 -323 104 75 -112 -16 172 42 -147 1 170 -185
7527 -185 57 -117 115 134 -62 -25 258 27 -113 106 68 -81 137 35 -29 107 28 329 190 -61 101 329
7549 329 -70 -313 187 2 -45 -91 -94 271 170 232 -20 53 -110 317 9 120 -220 34 -97 -111 111 -30
7571 -30 301 -172 210 15 190 -117 50 -189 -166 291 -60 139 -211 182 -162 -78 -367 71 -60 9 -115
7592 -115 91 -54 22 -110 -67 67 -136 -123 7 -50 8 -176 182 123 -57 52 -91 -129 140 -137 -124 -99 -76
7615 -76 309 182 -242 -26 -25 -95 268 -142 -214 91 -123 -89 -130 59 -251 -145 169 -35 -157 -29 -181 -63
7637 -63 157 58 172 68 48 -17 110 36 -49 141 -196 71 -43 79 183 291 -50 -156 -4 243 -27 -276
7659 -276 82 149 293 38 -278 125 109 -150 230 82 173 -191 -350 -34 -7 -222 -35 -132 1 71 33 42 -192
7682 -192 170 -4 -14 -220 -71 -29 65 -279 -48 137 121 296 78 -22 10 -336 5 -299 106 35 77 -58
7704 -58 141 146 194 -12 31 -45 -67 -70 -205 -35 201 125 -209 -97 328 365 31 -213 44 155 -60 22 183 247
7728 247 -16 17 269 -127 177 38 -18 197 181 -27 -258 372 104 -75 -238 -228 -303 -51 -20 -249 105 109 157
7751 157 -153 -34 31 9 -236 -39 -88 -39 88 -19 -283 -356 84 -213 -61 -95 4 -111 67 98 32 -6 104
7774 104 39 149 160 -27 38 -110 -46 -127 198 -210 -130 -139 -225 62 -95 39 -55 -95 -157 199 -117 161 -19 -5
7798 -5 22 145 242 14 -26 117 60 292 -60 74 160 -16 14 -82 -88 217 237 10 28 156 176 -66 29 61 -9 152
7824 152 -57 -99 -151 -37 -87 53 235 -185 0 4 135 -128 18 -146 121 75 -30 -187 -51 -6 -5 31 -25 -238
7848 -238 -51 308 -55 -321 -207 113 288 122 -122 -151 306 208 -265 295 149 5 139 236 2 32 -197
7869 -197 -77 238 116 186 -3 32 72 -52 17 157 26 -141 12 -28 94 -113 71 3 71 -154 -147 -41 -101
7892 -101 123 133 -66 91 3 80 -10 205 -28 43 -2 2 43 -195 -58 -60 49 -4 -29 -212 199 14 -90 32
7916 32 -176 -108 -217 135 -36 241 134 -182 -74 -209 149 -25 130 145 278 64 240 -23 160 -185 42
7937 42 -44 -189 -96 -144 61 36 -194 -104 -8 100 -404 87 185 -133 130 -190 109 154 -69 172 -118 -345 171
7960 171 -81 -88 382 -126 27 81 33 141 124 -102 -175 -94 75 140 -121 85 313 -46 -82 -92 69 138 18 -4
7984 -4 80 -287 12 30 35 52 245 -203 -98 -287 -210 23 77 -226 138 57 -46 60 -181 -66 -263 -7 184
8007 184 -131 -131 -166 -115 -77 -168 128 62 -72 195 159 17 10 179 135 -169 -183 -135 -19 14 343 -99 -92 185 170 112
8033 112 -51 -89 68 136 -18 115 -32 -114 -60 170 -171 -246 1 -93 55 -225 -4 185 84 236 -247 -66
8055 -66 -40 9 58 -299 -159 12 322 -137 204 -186 210 -70 -290 292 196 -156 155 25 69 -75 78 42
8077 42 -64 42 -163 -180 -50 -58 24 100 231 52 10 163 -276 -109 -153 -109 239 -69 -83 -201 131 -127 -88 -17
8101 -17 222 33 15 -216 -25 -66 -130 58 -282 -148 83 -2 -127 -17 252 40 -128 249 -136 84 -23 -184
8123 -184 -198 97 228 143 8 -315 99 12 -237 -18 -94 -63 -62 -72 476 -87 14 -117 -68 147 -115 42 -118
8146 -118 -30 -161 93 74 102 163 -100 -170 -213 -24 174 -259 -232 144 137 -61 8 -126 100 -72 -3 -401 419 193
8170 193 344 -199 -183 41 126 40 20 -44 -78 55 -205 -53 145 146 -183 103 46 151 0 -128 147
8191A47
##END NTUPLES=NMR FID
##END=
