##TITLE=1H_SR3_OSue
 CDCl3, 8 sc, 
 22.10.2019
##JCAMPDX= 6.0         $$ Bruker NMR JCAMP-DX V2.0
##DATA TYPE= NMR FID
##DATA CLASS= NTUPLES
##ORIGIN= UXNMR, Bruker Analytische Messtechnik GmbH
##OWNER= root
$$ XWIN-NMR		Version 3.5
$$ Tue Oct 22 14:50:38 2019 Russian Standard Time (UT+4h)  she@DPX200
##.OBSERVE FREQUENCY= 200.1315
##.OBSERVE NUCLEUS= ^1H
##.DELAY= (6, 6)
##.ACQUISITION MODE= SIMULTANEOUS
##.ACQUISITION SCHEME= undefined
##.AVERAGES= 8
##.DIGITISER RES= 18
##SPECTROMETER/DATA SYSTEM= spect
##.PULSE SEQUENCE= zg30
##.SOLVENT NAME= CDCl3
##.SHIFT REFERENCE= (INTERNAL, CDCl3, 0, 15.7039)
##AUDIT TRAIL= $$ (NUMBER, WHEN, WHO, WHERE, WHAT)
$$ ##TITLE= Audit trail, XWIN-NMR		Version 3.5
$$ ##JCAMPDX= 5.01
$$ ##ORIGIN= Bruker BioSpin GmbH
$$ ##OWNER= she
$$ F:/spectra/data/she/nmr/H-F/1/audita.txt
$$ ##AUDIT TRAIL=  $$ (NUMBER, WHEN, WHO, WHERE, WHAT)
(   1,<2019-10-22 14:49:17.17 +0400>,<she>,<DPX200>,
      <created by zg, POWCHK disabled, PULCHK disabled
       configuration hash MD5:
       00 E9 B6 7A A2 85 ED C7 34 08 36 98 17 FE 4E 26
       data hash MD5: 16K
       AA 92 D7 2E 8A 7C 1A 84 84 F0 56 D1 36 E8 5E F3>)
$$ ##END=
$$ 
$$ hash MD5
$$ 39 A8 00 7A E5 2A FC EB 5D FA 68 B0 44 35 E5 E7
##$RELAX= 
##$RELAX= 
##$RELAX= 
##$RELAX= 
##$RELAX= 
##$RELAX= 
$$ Bruker specific parameters
$$ --------------------------
##$DU= <F:/spectra>
##$EXPNO= 1
##$NAME= <H-F>
##$PROCNO= 1
##$TYPE= <nmr>
##$USER= <she>
##$AMP= (0..31)
100 100 100 100 100 100 100 100 100 100 100 100 100 100 100 100 100 100 
100 100 100 100 100 100 100 100 100 100 100 100 100 100 
##$AQSEQ= 0
##$AQ_mod= 1
##$AUNM= <au_zg>
##$AUTOPOS= <>
##$BF1= 200.13
##$BF2= 200.13
##$BF3= 200.13
##$BF4= 200.13
##$BF5= 200.13
##$BF6= 200.13
##$BF7= 200.13
##$BF8= 200.13
##$BYTORDA= 1
##$CFDGTYP= 0
##$CFRGTYP= 5
##$CHEMSTR= <none>
##$CNST= (0..31)
1 1 145 1 1 1 1 1 1 1 1 1 1 1 1 1 1 1 1 1 1 1 1 1 1 1 1 1 1 1 1 1 
##$CPDPRG= <>
##$CPDPRG1= <>
##$CPDPRG2= <>
##$CPDPRG3= <>
##$CPDPRG4= <mlev>
##$CPDPRG5= <mlev>
##$CPDPRG6= <mlev>
##$CPDPRG7= <mlev>
##$CPDPRG8= <mlev>
##$CPDPRGB= <>
##$CPDPRGT= <>
##$D= (0..31)
0 1.2 0 0 0 0 0 0 0 0.06 0 0.03 0 0 0 0 0.0002 0 0 0 0 0 0 0 0 0 0 0 0 
0 0 0 
##$DATE= 1571741356
##$DBL= (0..7)
120 120 120 120 120 120 120 120 
##$DBP= (0..7)
150 150 150 150 150 150 150 150 
##$DBP07= 0
##$DBPNAM0= <>
##$DBPNAM1= <>
##$DBPNAM2= <>
##$DBPNAM3= <>
##$DBPNAM4= <>
##$DBPNAM5= <>
##$DBPNAM6= <>
##$DBPNAM7= <>
##$DBPOAL= (0..7)
0.5 0.5 0.5 0.5 0.5 0.5 0.5 0.5 
##$DBPOFFS= (0..7)
0 0 0 0 0 0 0 0 
##$DE= 6
##$DECBNUC= <off>
##$DECIM= 24
##$DECNUC= <off>
##$DECSTAT= 4
##$DIGMOD= 1
##$DIGTYP= 9
##$DL= (0..7)
0 120 120 120 120 120 120 120 
##$DP= (0..7)
150 150 150 150 150 150 150 150 
##$DP07= 0
##$DPNAME0= <>
##$DPNAME1= <>
##$DPNAME2= <>
##$DPNAME3= <>
##$DPNAME4= <>
##$DPNAME5= <>
##$DPNAME6= <>
##$DPNAME7= <>
##$DPOAL= (0..7)
0.5 0.5 0.5 0.5 0.5 0.5 0.5 0.5 
##$DPOFFS= (0..7)
0 0 0 0 0 0 0 0 
##$DQDMODE= 0
##$DR= 18
##$DS= 0
##$DSLIST= <SSSSSSSSSSSSSSS>
$$ [...]
##$SUBNAM2= <"">
##$SUBNAM3= <"">
##$SUBNAM4= <"">
##$SUBNAM5= <"">
##$SUBNAM6= <"">
##$SUBNAM7= <"">
##$SUBNAM8= <"">
##$SUBNAM9= <"">
##$SW= 24.0689530833862
##$SWIBOX= (0..15)
0 0 2 0 0 0 0 0 0 0 0 0 0 0 0 0 
##$SW_h= 4816.95568400771
##$TD= 16384
##$TD0= 1
##$TE= 0
##$TE2= 300
##$TE3= 300
##$TEG= 300
##$TL= (0..7)
0 120 120 120 120 120 120 120 
##$TP= (0..7)
150 150 150 150 150 150 150 150 
##$TP07= 0
##$TPNAME0= <>
##$TPNAME1= <>
##$TPNAME2= <>
##$TPNAME3= <>
##$TPNAME4= <>
##$TPNAME5= <>
##$TPNAME6= <>
##$TPNAME7= <>
##$TPOAL= (0..7)
0.5 0.5 0.5 0.5 0.5 0.5 0.5 0.5 
##$TPOFFS= (0..7)
0 0 0 0 0 0 0 0 
##$TUNHIN= 0
##$TUNHOUT= 0
##$TUNXOUT= 0
##$USERA1= <user>
##$USERA2= <user>
##$USERA3= <user>
##$USERA4= <user>
##$USERA5= <user>
##$V9= 5
##$VALIST= <valist>
##$VCLIST= <CCCCCCCCCCCCCCC>
##$VD= 0
##$VDLIST= <DDDDDDDDDDDDDDD>
##$VPLIST= <PPPPPPPPPPPPPPP>
##$VTLIST= <TTTTTTTTTTTTTTT>
##$WBST= 1024
##$WBSW= 4
##$XGAIN= (0..3)
0 0 0 0 
##$XL= 0
##$YL= 0
##$YMAX_a= 52680
##$YMIN_a= -95229
##$ZGOPTNS= <>
##$ZL1= 120
##$ZL2= 120
##$ZL3= 120
##$ZL4= 120
##$ABSF1= 10
##$ABSF2= 0
##$ABSG= 5
##$ABSL= 3
##$ALPHA= 0
##$AQORDER= 0
##$ASSFAC= 0
##$ASSFACI= 0
##$ASSFACX= 0
##$ASSWID= 0
##$AUNMP= <proc_1d>
##$AZFE= 0.1
##$AZFW= 0.1
##$BCFW= 1
##$BC_mod= 2
##$BYTORDP= 1
##$COROFFS= 0
##$CY= 11.3945322036743
##$DATMOD= 1
##$DC= 2
##$DFILT= <>
##$DTYPP= 0
##$F1P= 20.1720416913024
##$F2P= 0.152960286110954
##$FCOR= 0.5
##$FTSIZE= 0
##$FT_mod= 4
##$GAMMA= 1
##$GB= 0.15
##$INTBC= 1
##$INTSCL= 1
##$ISEN= 128
##$LB= 0.24
##$LEV0= 0
##$LPBIN= 0
##$MAXI= 10000
##$MC2= 0
##$MEAN= 0
##$ME_mod= 0
##$MI= 1.114404
##$NCOEF= 0
##$NC_proc= 0
##$NLEV= 6
##$NOISF1= 3.799351
##$NOISF2= 2.8
##$NSP= 1
##$NTH_PI= 0
##$NZP= 0
##$OFFSET= 15.70392
##$PC= 1
##$PHC0= -9575.701
##$PHC1= 20.80086
##$PH_mod= 1
##$PKNL= yes
##$PPARMOD= 0
##$PSCAL= 0
##$PSIGN= 0
##$REVERSE= no
##$SF= 200.130013532006
##$SI= 16384
##$SIGF1= 3
##$SIGF2= 2
##$SINO= 400
##$SIOLD= 16384
##$SREGLST= <1H.CDCl3>
##$SSB= 0
##$STSI= 0
##$STSR= 0
##$SW_p= 3612.71676300578
##$SYMM= 0
##$S_DEV= 0
##$TDeff= 0
##$TDoff= 0
##$TI= <>
##$TILT= no
##$TM1= 0
##$TM2= 0
##$TOPLEV= 0
##$USERP1= <user>
##$USERP2= <user>
##$USERP3= <user>
##$USERP4= <user>
##$USERP5= <user>
##$WDW= 1
##$XDIM= 8192
##$YMAX_p= 0
##$YMIN_p= 0
$$ End of Bruker specific parameters
$$ ---------------------------------
##NTUPLES= NMR FID
##VAR_NAME=  TIME,          FID/REAL,        FID/IMAG
##SYMBOL=    X,             R,               I
##VAR_TYPE=  INDEPENDENT,   DEPENDENT,       DEPENDENT
##VAR_FORM=  AFFN,          ASDF,            ASDF
##VAR_DIM=   8192,          8192,            8192
##UNITS=     SECONDS,       ARBITRARY UNITS, ARBITRARY UNITS
##FACTOR=    0.0002076,     1,               1
##FIRST=     0,             0,               0
##LAST=      1.7004516,     0,               0
##MIN=       0,             -95229,          0
##MAX=       1.7004516,     52680,           0
$$ Real data points
##PAGE= N=1
##DATA TABLE= (X++(R..R)), XYDATA
0 0 0 0 0 0 0 0 0 0 0 -8 8 -8 8 -8 16 -16 20 -24 30 -32 40 -47 53 -61 71 -79 89 -103 117 -133 149 -167
32 -167 187 -208 235 -260 291 -323 357 -396 438 -485 537 -595 659 -732 813 -905 1012 -1134
50 -1134 1278 -1451 1665 -1932 2280 -2756 3445 -4541 6567 -11590 52680 43942 -40901 11215
64 11215 33359 2823 -14300 27885 26117 -1635 6981 39930 29056 16072 26373 21230 -11080
77 -11080 -1274 34563 33889 8843 12960 10492 -21153 -23296 20070 25687 -12564 -10254 33214 34981
91 34981 9281 16711 22210 -17631 -36629 -460 11505 -24597 -20294 26473 20425 -25891 -14437
104 -14437 30775 17427 -27669 -25128 1176 797 -1133 10400 -4831 -36219 -31138 -6828 -12454
117 -12454 -21696 -36 8124 -16369 -16076 16818 14294 -23150 -28641 -13732 -32118 -48175 -13479
130 -13479 18116 -4671 -28024 -13164 -5516 -19438 -9108 8552 -16221 -43439 -17276 11733
142 11733 -10661 -32426 -12531 -6151 -36554 -41050 -5287 8258 -9486 -9866 806 -9898 -18446
155 -18446 -3574 -3655 -31309 -39281 -17596 -10066 -15156 -1603 8288 -12738 -26236 -3595 8305
168 8305 -12973 -20326 -2910 -6004 -24430 -13027 9284 -3620 -26412 -18557 -6600 -15063 -8732
181 -8732 18802 16314 -14433 -17070 6074 4977 -14145 -13358 -6793 -18167 -20891 1823 15186 4886
195 4886 834 5166 -4297 -12800 2804 14330 -1674 -14292 -2279 3016 -6366 -655 13508 411
209 411 -20342 -7789 16140 13548 3855 12219 12926 -5500 -9525 7041 6974 -9029 -8951 3293 2389
224 2389 1909 17995 25055 6891 -5478 2924 7883 2604 5913 11706 1908 -6855 4981 16368
238 16368 8179 1413 6572 5058 -2016 8785 25858 20525 4591 3808 7317 -480 -1828 9846
252 9846 10588 -2927 -1079 16215 21618 15991 15846 14623 1103 -5094 7003 15328 9131 5186 8882
267 8882 7313 3319 10327 17695 9084 -315 5330 12930 13166 16001 20483 11530 -3916 -3633 6328
282 6328 6468 3370 8031 10878 6136 8693 19899 20131 6977 -97 1345 -63 -13 9657 14668 5496
298 5496 -1326 3382 7314 4887 5465 7562 2594 -1965 5090 13920 11192 3456 -576 -5446 -10556
313 -10556 -5989 4991 6214 610 922 4950 4428 3372 4741 399 -10466 -13817 -6059 616 696
328 696 1061 -441 -7156 -10583 -4740 514 -2515 -6168 -5662 -4988 -5302 -1038 150 -6754 -16363 -17339 -13045
345 -13045 -9201 -4616 -375 -2358 -8301 -8670 -4341 -4442 -9421 -12763 -14723 -16745 -13496 -5015 -1488
360 -1488 -6373 -11996 -12934 -12316 -10775 -6927 -4629 -8240 -11891 -10499 -6743 -6718 -8256 -11541 -16387 -18434
376 -18434 -13261 -4861 -858 -2165 -4714 -7774 -9535 -7788 -6120 -7462 -11760 -13451 -10452 -5989 -2060
391 -2060 62 -2087 -7575 -10776 -7731 -2730 -649 -1085 -2644 -4816 -5172 -2123 -95 -2565 -6368 -8254
407 -8254 -6204 -1785 4556 7517 5666 934 -1973 -2109 -344 865 94 -2060 -2649 -224 5066 8390
423 8390 7955 4401 79 -1408 1344 5981 8269 6957 4004 2588 3547 5314 5825 4983 2142 648
439 648 2923 7888 12929 14073 10463 4977 1732 2245 4875 6357 5452 3994 4150 6918 10713 11883
455 11883 10125 6459 2602 1484 4150 9409 10985 8678 5283 3785 4470 5835 6388 5288 2946
470 2946 2412 5330 9627 12794 11387 6495 1014 -1542 568 3921 4877 4363 4029 4457 5616 7280
486 7280 8283 6045 781 -2578 -1235 3476 7335 7946 4564 499 -667 507 1603 1276 1071 1141
502 1141 1189 2697 6454 8099 4850 -1084 -5988 -5752 -3148 886 3180 3118 1109 665 1838 2295 1890
519 1890 -721 -4713 -5726 -3020 2268 5063 2780 -968 -3294 -5013 -4800 -2454 419 582 -1403 -1344
535 -1344 425 2335 2327 -1654 -7115 -9936 -7179 -1993 1124 1572 1054 -384 -2773 -3600 -2062 -1991 -4680
552 -4680 -6592 -5427 -2356 398 1716 -402 -4442 -7944 -7738 -5300 -2080 -437 -688 -2331 -3542 -1989
568 -1989 -102 -2861 -7800 -9906 -8265 -5800 -2448 1177 2200 -1559 -5459 -6633 -5660 -4472 -3950 -4577
584 -4577 -6293 -6368 -2512 993 -648 -4598 -7154 -8744 -8179 -4472 -16 864 -2328 -4058 -3886 -4553 -4443
601 -4443 -4466 -5611 -7922 -7108 -2604 572 1499 868 -2088 -6451 -7560 -4334 -1252 -2885 -3732 -2494 -1106
618 -1106 -1876 -69 468 -2799 -6459 -5455 -1618 450 2755 3676 1114 -2663 -3470 -516 -122 -2057
634 -2057 -2532 -1159 -572 1712 6307 6800 2096 -1508 -1688 -1282 143 3330 5380 2519 506 2747
650 2747 4847 3706 2861 2872 562 -990 3447 9041 8543 4560 3723 3514 525 756 5221 6563 3205
667 3205 2666 5798 8193 7640 7588 6323 1896 -116 3496 6223 6553 6850 7273 4540 2687 5795 8294
684 8294 4712 1497 3638 5663 5345 6737 9901 7151 1102 393 3136 3430 3485 5837 5943 2572 2756
701 2756 8031 8148 2667 215 1272 57 -765 4363 7603 4377 520 1692 1780 513 1906 3065
717 3065 -263 -2735 1233 4731 2818 1069 1997 -990 -6347 -4280 2491 2717 -1420 -949 1535 -597
733 -597 -1669 555 166 -5299 -6923 -2915 -1123 -1634 736 2111 -3666 -7370 -3496 -316 -3471 -5106
749 -5106 -2612 -2296 -4849 -2373 1586 -1535 -7211 -7152 -5571 -5995 -3860 875 -249 -5303 -4756 -1142
765 -1142 -3076 -6386 -4467 -3347 -7281 -7643 -744 2325 -1921 -4599 -3298 -5264 -7317 -3690 -51
780 -51 -3229 -5874 -2304 -525 -3063 -2960 -691 -4015 -8912 -5903 370 463 -1344 75 -503 -4557 -4804
797 -4804 -725 -1236 -5019 -3942 -786 -1767 -1909 3159 3372 -3603 -6296 -1675 -177 -2607 -650 3104
813 3104 561 -3689 -727 3091 115 -3411 -1496 -1306 -2651 341 5289 3664 -913 -821 474 -2326
829 -2326 -2192 2289 2389 -2590 -2047 4137 4590 366 863 1771 -2812 -4435 1698 4734 1310 164 2996
846 2996 1515 -2248 368 4137 376 -3712 -206 3834 2833 2261 4810 2353 -3401 -2244 2237
861 2237 1870 -129 2155 3299 311 526 5222 4231 -1098 -1672 1587 854 -588 4057 6789 1719
877 1719 -1980 1299 3220 203 532 3239 1478 -1183 2788 7098 4017 454 1296 1338 -1801 -428
893 -428 4730 4887 670 1298 4034 2725 1030 3627 3288 -1812 -1990 3495 4825 2229 3379 4349 277
910 277 -2256 2140 4820 1122 -367 3328 3715 1049 3026 5617 2107 -2652 -1062 2184 1435 1510
926 1510 4746 3899 -600 42 3854 2537 -1025 42 1515 -653 -984 4234 4719 247 -943 426
942 426 -214 -2339 900 3392 -79 -2528 1289 2564 57 -738 271 -1941 -5120 -2025 2834 1469
958 1469 -1273 -3 423 -3045 -3218 90 -327 -4370 -3905 -479 -533 -1384 374 263 -4661 -6127 -2815
975 -2815 -1474 -2704 -1808 -454 -2715 -4622 -1899 -198 -3597 -6090 -4374 -3319 -4340 -2243 1343
990 1343 -833 -5227 -4676 -2414 -4019 -4547 -2221 -2006 -4770 -3985 53 -290 -2968 -3805 -3262 -5020 -5070
1007 -5070 -1375 198 -2077 -2943 -1818 -2153 -3488 -2644 -991 -3600 -5066 -2411 642 54 -510 325
1023 325 -1743 -4814 -3628 -20 -401 -1705 -695 624 -433 -338 1623 728 -2575 -3036 -802 45 242
1040 242 2434 2953 134 -1450 26 1287 -115 -317 1193 859 479 3153 4775 2228 49 -115
1056 -115 -44 -448 1402 3919 3380 1161 1941 3497 2586 1579 2170 1820 -425 562 3947 5207 3611
1073 3611 2867 2190 733 246 2185 3599 2169 1449 2841 3516 3421 3389 3359 831 -1005 622 2433 3004
1091 3004 3067 3711 2667 770 1171 2396 2307 422 574 1365 1668 2539 4019 3458 897 -757 -22 462
1109 462 677 1671 2227 1254 522 1457 2316 1120 53 -587 -1166 -884 989 2780 2125 789 -118 -540
1127 -540 -848 145 949 59 -1283 -648 1185 1715 953 541 -439 -2204 -2359 -441 1234 739 397 96
1145 96 -465 -602 51 -11 -1195 -2163 -1933 -976 489 1468 1354 -397 -1972 -2076 -1088 -706 -582 -690 -832
1164 -832 -805 -365 610 196 -1077 -1959 -2143 -2197 -720 612 1390 -150 -1433 -1140 -679 -756 -1225 -1735 -1696 -1741
1184 -1741 -358 485 956 -127 -1303 -2438 -2375 -1324 -663 -540 -516 -685 -896 -375 -207 -543 -1458 -2574
1202 -2574 -2697 -1448 -196 818 423 -747 -2157 -1947 -1587 -1496 -1303 -1824 -1652 -1003 -447 151 -3 -1032
1220 -1032 -2611 -3242 -2856 -1177 -282 -440 -932 -1293 -1384 -1416 -996 -804 -2051 -2652 -2533 -537 611 508 -249
1239 -249 -1389 -2081 -2047 -1369 -1068 -735 -924 -840 -799 -133 597 183 -1385 -2348 -2031 -1007 -299 923 918 187
1259 187 -821 -437 -123 61 -248 -609 -852 -107 1471 2156 1962 458 36 -513 -810 267 1776 1767 1168
1278 1168 1050 1524 1651 1838 1401 454 -363 250 1473 2849 2884 2325 1719 852 830 1481 2206 1636 1190 1660
1298 1660 2507 2808 3228 2979 2054 443 252 1342 2318 3153 3092 2612 1536 1875 2946 2190 1276 775 1124
1317 1124 1509 2271 3606 3473 2348 810 754 1110 1240 1944 2043 1282 1090 1526 2375 2289 1570 368 -356
1336 -356 -405 891 2484 2271 1143 723 927 212 8 392 383 -725 -538 431 923 1070 870 -12 -1384
1355 -1384 -2270 -622 212 -157 -398 -576 -369 -696 -466 -157 -942 -2525 -2207 -1408 -573 -471 166 -586 -2048
1374 -2048 -2210 -1979 -1525 -1933 -1582 -1519 -2097 -1630 -390 -201 -1376 -2606 -2836 -2514 -1823 -959 -701 -1306 -1841
1393 -1841 -1286 -1506 -1514 -1885 -1855 -2421 -2983 -1660 -290 -149 -945 -1326 -1799 -2071 -2272 -809 -852 -1076 -1475 -1001
1413 -1001 -646 -460 -163 -1055 -1710 -2375 -1569 -259 -68 57 -147 -674 -1349 -659 -270 -739 -1309 -830 -761 -425
1433 -425 651 1085 439 -928 -1163 -913 -204 180 501 456 105 12 524 870 -28 -566 -589 -733 -325 986
1453 986 1516 1082 675 361 -51 -140 258 762 447 -242 353 1106 1607 1163 670 -203 -934 -385 584 1645
1473 1645 1018 1031 788 805 632 781 416 175 -595 -86 886 1369 1579 1414 514 -595 -510 737 899 589
1493 589 779 730 554 1014 1220 1165 123 -834 -227 -143 827 1355 1532 740 107 152 718 343 215 37 -15
1514 -15 384 1123 1978 1639 550 -209 -357 -211 584 902 1218 569 847 1039 1191 798 726 505 -505 -403
1534 -403 960 1682 2028 1384 993 132 -139 358 843 655 152 303 636 1320 1515 1286 744 -485 -722
1553 -722 349 1022 1127 1316 1316 269 10 856 820 -19 -585 -165 128 438 1123 1417 507 -447 -545 -227 -396
1574 -396 105 448 208 -519 56 809 478 -475 -752 -877 -1266 -622 730 702 -109 -483 -674 -716 -1206 -681
1594 -681 -599 -1579 -1383 -505 101 -170 -410 -602 -1518 -2303 -1629 -535 -506 -1205 -1096 -1081 -1359 -1197 -658 -1429 -2389
1615 -2389 -2310 -1577 -839 -813 -14 -433 -1898 -2153 -1147 -1105 -1582 -1339 -991 -1383 -1450 -544 147 -1017 -2127 -2106
1635 -2106 -1955 -1776 -818 -199 -574 -1255 -1207 -652 -1028 -1221 -913 -1227 -1746 -852 105 549 -429 -801 -863 -1594
1655 -1594 -1138 -200 249 -381 -402 400 134 -154 534 561 -518 -1317 -319 586 984 768 1201 335 -421 185
1675 185 997 493 93 391 1062 864 1092 1710 1212 337 -75 695 809 556 1519 1674 1175 743 1816 1712
1695 1712 867 361 638 357 743 1866 2185 1853 904 1011 633 625 564 1499 1514 729 1492 1801 1638 1173 1453
1716 1453 800 -126 -13 1237 1433 1180 1285 1197 563 347 775 760 -117 -137 598 1100 801 875 1494 353
1736 353 -772 13 711 419 346 514 604 74 265 633 390 -476 -474 -154 -377 -66 1042 1125 -268 -504 -17
1757 -17 21 -856 -111 50 -889 -696 175 733 67 -244 -645 -1044 -1031 -480 338 -232 -402 -205 98 -653 -343
1778 -343 -126 -505 -1296 -864 -48 221 356 106 -147 -1069 -884 -316 -198 -394 -755 -209 -102 -332 201 339
1798 339 -425 -1291 -541 -476 -71 276 536 -183 -704 -683 70 -212 -918 -260 -558 -705 -353 680 325 -285
1818 -285 -586 -823 -645 -633 -24 121 -303 -127 -226 18 -177 -570 -583 -1259 -954 -200 591 191 -181 -387 -878
1839 -878 -789 -622 53 -408 -520 -622 -299 33 264 -99 -194 -608 -1347 -915 -467 -316 -96 -322 -612 -671 -120
1860 -120 -102 -573 -1159 -849 -712 -180 323 438 -116 -503 -837 -756 -731 -453 -107 -509 -775 -292 371 283 -329
1881 -329 -985 -768 -653 -341 381 391 307 -144 -192 -40 -129 -144 81 -531 -546 285 599 833 579 302 -34 -541
1903 -541 35 484 527 355 369 586 879 890 1230 469 -193 -14 446 837 1177 1284 1240 495 653 652 594 608 680
1926 680 670 767 599 1467 1786 1102 436 91 -27 595 1225 972 1281 861 1159 1067 1154 968 784 428 444 674
1948 674 1298 1501 1417 928 705 264 632 608 807 719 612 640 673 777 795 540 310 -169 -317 407 539 996
1970 996 624 -81 185 283 -43 -57 -331 -257 -327 259 528 579 -14 -234 -534 -798 -773 -98 -350 -247 -458 -569
1992 -569 -373 -609 -272 -1137 -1140 -1432 -1068 -346 -268 -139 -518 -1114 -1195 -1017 -832 -906 -1132 -888 -981 -720 -301 -759
2014 -759 -591 -1228 -1314 -1537 -1211 -483 -392 -508 -763 -772 -571 -552 -851 -975 -1014 -979 -938 -21 -121 -475 -706 -1064 -952
2037 -952 -951 -378 -567 -741 -512 -87 -110 -219 -36 -183 -967 -989 -256 143 31 -8 189 -343 -357 -300 -22 -95 -325
2060 -325 -48 36 387 547 979 277 -271 -263 -111 47 130 346 515 -131 -55 534 706 436 -2 -20 -214 182
2082 182 670 952 454 150 37 81 10 269 513 312 129 334 579 768 375 571 -13 -239 -84 585 742
2103 742 479 261 467 21 12 312 343 -184 -454 201 378 583 902 656 135 -332 151 107 98 119 505 429 239
2126 239 790 791 354 28 -169 44 112 145 470 616 249 139 126 320 111 -218 22 26 -347 704 694 184
2148 184 -12 83 -307 -146 410 466 320 279 671 396 309 252 272 -53 -489 -60 409 736 793 427 397 223 -285
2171 -285 673 355 85 80 100 500 602 1096 588 -168 -251 -74 245 270 490 683 415 112 187 679 154 -376
2193 -376 -37 79 97 204 709 559 -192 -206 -27 -231 -301 -50 83 15 -87 327 10 293 33 -422 -545
2214 -545 -487 -118 42 168 -57 -261 -421 -500 -351 -224 -559 -893 -602 -148 -330 -400 -375 -527 -1082 -824 -716
2235 -716 -376 -601 -348 -743 -698 -917 -97 -365 -678 -872 -1032 -769 -483 -120 -244 -687 -876 -753 -903 -725
2255 -725 -886 -468 -932 -719 -749 -76 -296 -682 -729 -817 -1154 -687 -509 116 -403 -675 -208 -423 -562 -150 -483
2276 -483 -462 -621 -371 193 148 -255 -153 -208 -713 -339 -46 77 48 161 39 180 131 328 290 -196 -119 142
2298 142 675 586 797 464 428 94 492 362 281 410 377 468 590 1043 874 649 385 295 181 550 428 942
2320 942 654 702 609 930 858 700 491 72 473 577 963 1264 661 292 124 467 722 553 599 381 163
2341 163 520 679 890 952 223 133 -50 421 522 427 494 691 559 233 141 622 -16 368 56 64 195 516
2363 516 280 682 333 -360 92 -102 53 103 -316 -246 99 76 160 -248 -433 -327 -383 -237 454 145 311 -445
2385 -445 -128 -138 -207 -65 -199 -375 -586 -482 -37 245 -259 -402 -326 -843 -240 -130 -287 -10 -105 -437 -2
2406 -2 -124 -335 -167 -628 -645 -582 -275 -84 -233 -40 -416 -562 -271 64 146 -319 -607 -353 -21 -236 244 -153
2428 -153 -365 -602 59 -220 -66 189 441 -17 -229 -269 -317 -218 -263 -647 -389 244 -14 19 207 -219 -475 -91
2450 -91 -162 32 -52 -125 -70 -257 -66 344 -130 94 -329 -528 -194 -250 156 240 -122 -304 -122 23 -277 -331 -66
2473 -66 32 -555 -56 196 34 93 -369 -672 -611 -316 -241 91 -178 -249 61 -45 7 -81 -507 -556 -241 -374 -43
2496 -43 17 338 -32 -118 -660 -113 -142 -246 -335 -258 -203 51 256 488 -89 -285 -248 -126 -304 315 403 151 -150
2519 -150 -203 227 31 -242 -75 92 17 -257 211 423 316 193 107 187 69 327 478 299 536 647 416
2540 416 507 668 163 34 314 312 698 762 787 754 479 267 455 452 492 234 289 583 387 774 1125 750 693 129
2564 129 457 616 702 773 407 354 362 652 565 723 340 395 -94 517 800 649 465 258 216 201 445 179 275
2587 275 592 -121 182 585 150 307 162 15 -38 -153 255 306 436 158 -190 81 -387 -349 -196 -347 -265
2608 -265 -162 -37 -47 59 -404 -511 -603 -474 -346 -86 -349 -458 -181 -389 -121 -4 -269 -528 -422 -483 -487 -169
2630 -169 -256 4 -643 -652 -401 -766 -492 -555 -618 -796 -456 -432 -629 -346 -472 -935 -577 -630 -653 -266 -139 -527 -517
2653 -517 -390 -477 -385 -262 -815 -685 -355 -319 -99 162 -112 -96 -524 -390 -465 -178 -192 -551 -344 -180 -117 76
2675 76 173 -474 -280 -268 -89 233 -101 127 161 41 187 -74 116 65 -143 -49 21 491 269 287 290 327 -137 39
2699 39 67 231 288 78 22 235 269 320 246 19 -10 202 378 437 381 145 295 107 155 26 25 406 221 17
2723 17 -15 682 550 399 535 -87 59 319 42 245 124 36 186 435 53 414 29 -204 -83 -68 -3 219
2745 219 513 9 -125 3 252 328 469 -111 -286 -19 30 249 151 157 -412 -205 -21 -366 48 120 235 336
2767 336 129 72 173 64 -195 340 -42 56 346 -93 425 51 -353 -374 -180 195 208 314 227 253 358 131
2789 131 253 108 284 79 -16 461 166 348 487 118 226 211 -49 76 94 181 239 175 259 24 328 78
2811 78 -139 -271 42 -149 486 414 203 141 229 247 374 -48 -285 -77 212 201 372 462 -248 -212 -80 -161 -21
2834 -21 320 38 -96 -84 266 211 39 52 -222 -145 -220 -122 246 163 38 -6 82 -510 -154 -258 -322 -181 -311 -51
2858 -51 145 -54 26 -470 -339 -502 -390 -67 -509 -191 -487 -437 -464 -421 -316 -548 -506 -518 -523 -364 -454 -162 -279
2881 -279 -533 -446 -384 -305 -583 -484 -292 -456 -417 -256 -580 -200 -456 -513 -638 -114 -184 157 -96 -183 -85 -352 -215
2904 -215 -27 -269 -411 -148 -35 246 -2 -160 -248 79 -242 -303 -51 51 -68 150 -38 201 191 138 -39
2925 -39 -26 -92 96 241 11 189 295 38 18 380 356 415 361 479 281 535 528 813 446 38 203 541 388
2948 388 180 385 266 203 309 390 402 226 229 100 301 -24 617 805 414 268 207 344 155 660 360 159
2970 159 29 171 455 156 344 -69 376 202 261 372 149 542 471 -19 7 58 529 219 -347 59 26 99
2992 99 58 -90 30 -126 -316 62 218 -349 -156 147 -192 -413 122 -23 50 -374 -430 -291 28 -82 -62 -32
3014 -32 -314 2 -381 -143 -30 -48 -432 -319 -215 19 99 -141 -92 -443 -435 -336 -124 5 -138 62 -222 -243 56
3037 56 40 145 -84 -426 -18 13 -155 55 -83 -60 152 -200 -140 58 -202 21 -338 -7 249 240 90 8 -409
3060 -409 -218 39 -157 443 30 -155 94 -69 250 -23 86 -221 -53 228 311 258 -143 126 -163 4 -217
3081 -217 -109 33 -93 -77 42 87 280 240 -105 217 51 -72 180 148 46 -46 348 39 -255 -5 -104 -474
3103 -474 -166 -153 -188 71 -151 81 -145 -355 -265 -175 -197 -393 -180 42 -409 -255 -211 -186 -119 -183 -294 -18 -405
3126 -405 -113 305 -237 -204 -351 147 -332 -385 -107 -230 -186 -33 -52 29 46 -331 -296 -438 -139 98 -81 380
3148 380 -176 24 -398 42 -44 -267 -106 108 137 -164 -59 -13 343 0 150 41 157 189 131 -105 73 307
3170 307 18 -81 141 57 131 140 240 326 159 -42 81 349 42 136 366 58 23 47 31 474 369 361 192 355
3194 355 47 161 66 328 187 487 138 209 116 196 435 19 22 326 507 335 197 294 -105 166 54 269
3216 269 252 -8 231 392 271 93 67 325 -113 -164 65 120 229 156 275 -187 113 349 35 -105 -195 42
3238 42 10 121 1 215 -7 -136 -59 -259 -121 -187 -96 -253 -449 -251 -309 -361 -71 -433 -662 -313 12 -78 -23
3261 -23 -252 -362 -352 -181 -415 -28 -167 -325 -357 -229 32 -3 46 -421 -357 -598 -515 -171 -264 -131 -258 -458 -188
3284 -188 -224 -417 -129 -593 -338 -410 82 405 -175 5 -106 -133 -438 -14 195 120 34 -217 203 -89 18 -99
3306 -99 -57 57 -95 157 -193 418 -21 85 153 -28 -39 99 387 107 141 145 -57 -21 374 291 25 86 86 38
3330 38 396 30 367 98 494 335 163 -5 100 224 63 34 99 166 237 -169 -32 155 -352 -76 295 188
3352 188 -207 291 234 89 414 1 -41 -111 428 231 -125 6 61 194 236 -35 64 -216 -211 -172 43 31 114 147
3376 147 -158 -239 -13 121 146 -127 -185 -238 -138 343 62 -25 -254 -145 -107 -136 -48 302 9 -65 -315 -100 68
3399 68 -30 -100 -184 -151 -274 110 108 80 -98 -151 -208 61 -46 130 166 -131 82 81 -84 172 394 150 -154 204
3423 204 45 185 60 124 147 -115 62 117 341 227 194 214 24 203 345 -69 24 -110 -94 -73 244 220 389
3446 389 -112 -18 -5 -161 -61 -72 56 -157 55 -94 119 -91 163 -207 58 82 -9 263 258 154 96 198 -10
3469 -10 -49 -143 -127 22 -172 -112 41 28 21 -108 13 196 26 -52 111 8 -270 37 100 159 130 -57 -320 -286
3493 -286 -121 -635 152 -146 -546 -23 -318 -360 -85 52 -25 -135 -258 -199 -29 -174 -309 -349 -292 -406 264 -322
3515 -322 -12 -422 -57 -339 32 -77 -168 -103 -491 -218 -160 -210 -222 15 -196 77 -354 -9 -222 150 -54 -237
3537 -237 -235 -97 -64 53 137 -192 -268 -289 181 -14 45 -356 189 188 29 27 30 130 80 -170 -21 229 103 125 -155
3562 -155 73 174 372 292 -88 76 97 55 97 358 190 312 304 22 387 492 157 229 -142 190 135 297 344
3585 344 445 41 -132 242 312 274 418 248 234 92 85 -108 112 36 -111 85 135 114 75 227 65 -280 92
3608 92 125 71 292 -28 11 328 -122 136 175 -205 111 27 315 -62 149 55 -13 189 -332 -165 -77 14 -210
3631 -210 -36 -217 -127 -104 163 -261 -87 -310 -280 -117 -43 139 62 -163 -201 -27 -67 172 -218 -50 -359 -253
3653 -253 -145 -212 -262 -281 -48 3 -231 170 -70 -379 -261 -362 -139 114 -440 -374 -111 -90 -11 65 -28 -17 152
3676 152 100 234 -13 -169 54 65 -77 127 52 344 121 133 -226 21 79 -20 76 -93 -152 19 48 268 368
3699 368 -58 83 -38 88 -121 43 13 217 40 76 224 137 122 372 -33 -116 147 -23 127 123 21 -275
3721 -275 33 -51 357 83 -178 282 183 -132 -97 -100 -148 -126 -163 -146 55 58 -396 -40 -109 -39 0 -63 -268 -221 -255 -155
3747 -155 -146 -80 55 -217 -64 -457 -217 70 -74 -33 -122 -32 22 -52 75 -144 171 77 -325 -95 -372 158 93
3770 93 -106 -79 -171 -238 61 -92 114 -177 -208 -145 90 -136 8 115 -311 -65 -191 142 -40 203 -78 -94
3792 -94 -150 -52 17 -14 95 -287 -113 319 150 250 251 101 -208 231 -47 111 11 -107 109 117 100 -41 176
3815 176 272 249 -162 -110 94 257 141 143 -142 153 175 385 265 138 197 -88 465 375 22 38 63 -33 -27 209
3839 209 66 121 102 48 -47 -40 104 84 64 -126 138 82 95 -98 -63 137 -213 103 -22 -167 56 115 156 -96
3863 -96 -21 -9 -56 -166 -95 -216 115 190 142 -33 -34 -80 -93 -69 3 -164 -265 -73 22 50 -83 205 77 -391 -238
3888 -238 -336 -189 -153 -71 -140 -306 -109 -92 -161 3 -233 47 150 -41 -244 -178 -167 -191 -202 -153 -207 -23 25 -47 -24
3913 -24 33 -109 -118 -33 -162 189 -179 -131 -103 -9 42 -162 -63 16 29 -42 184 301 147 -95 32 -16 90 -118 -71
3938 -71 -85 117 -96 139 -25 -12 -48 -69 -28 92 -27 -71 69 -19 126 93 6 196 216 17 -115 -126 228 -52
3962 -52 -148 182 53 33 139 -45 -63 229 83 -84 241 119 -121 193 73 -110 -98 122 -75 -168 330 261
3984 261 -126 231 32 -13 -30 10 120 -87 51 3 -133 -96 -39 -22 131 27 64 -243 -84 135 21 -46 -147
4007 -147 -218 -83 -37 -89 -109 -68 48 -62 -226 165 -261 248 -115 -233 -82 -259 -57 -13 -50 -223 -44 176
4029 176 -156 -20 -245 -137 35 224 -79 -33 -20 288 -121 -31 -130 -21 53 -87 -11 -112 60 13 8 22 135
4052 135 16 38 -73 145 349 41 -63 -279 -182 -56 -146 -248 -19 -120 167 206 370 85 222 188 -96 -133
4074 -133 188 61 264 276 98 -52 167 292 -85 167 138 47 -28 277 73 -8 169 -150 255 150 -191 75
4096 75 -46 -9 -66 161 118 25 -121 -262 -178 151 -49 4 -52 -159 51 -36 -92 -98 3 -279 5 41 177 151 -99
4121 -99 -110 89 -44 -205 -238 -17 -22 -276 13 277 175 -133 -357 -345 -158 34 -137 52 -29 23 136 -116 -104
4144 -104 -185 -363 -31 146 12 0 -4 -173 -250 127 -314 -209 -9 178 -30 -218 -86 -93 27 -77 82 93 -44
4167 -44 -77 22 29 325 219 172 195 151 -82 94 -20 66 87 -31 303 135 119 -82 58 244 -18 -202 -283 -17
4191 -17 192 207 -167 -116 120 -52 243 351 105 -17 -179 164 66 -49 -10 282 138 178 94 108 215 -99 -109
4214 -109 152 -61 32 80 217 58 12 217 -47 69 35 174 233 -105 -245 236 151 17 -145 -198 -153 390 -227
4237 -227 -218 80 -50 -179 -87 57 -157 -132 64 -25 -221 59 -53 -31 59 -68 -145 -111 -267 -66 -190 62 -40
4260 -40 -439 -91 119 -59 85 149 -235 -79 -206 27 -309 -356 -126 -152 -46 93 186 51 -160 -77 -61 -228
4282 -228 122 141 73 -31 -75 -214 -23 179 228 201 -251 123 -59 181 -389 -18 -137 -167 -121 -77 -172 79 80 241
4306 241 -235 -31 -384 -55 266 28 -80 -81 -95 79 -20 -38 -31 123 46 1 99 334 -76 6 150 164 246 303 62
4331 62 -25 312 48 207 -26 -174 -105 259 -132 109 -87 158 -45 -40 -17 31 61 145 194 106 -41 -107 -114 -47 -111
4356 -111 -28 -138 -327 13 270 -29 124 210 130 -246 26 129 13 -72 110 43 193 -308 -265 -16 -357 -161
4378 -161 -178 -161 -265 -191 -222 -42 -33 -138 -51 -267 -376 -66 77 19 -23 -156 -383 -158 53 -212 53 -70 35
4401 35 -141 27 6 7 236 -149 -31 114 -82 -291 -175 -249 -154 -99 -164 35 238 -145 310 -126 4 144 -257
4424 -257 -238 180 -262 92 306 234 52 246 189 -109 86 273 60 -39 454 34 -111 -197 48 -250 -166 -83
4446 -83 262 164 -2 146 -2 -134 99 139 -115 54 -188 -295 185 187 -15 43 129 278 189 93 8 -149 305
4469 305 35 -339 329 62 97 -115 -18 45 228 236 -116 -208 -179 333 -133 -18 366 -99 93 -129 203 19
4491 19 -198 -155 -243 253 -114 -116 -131 -352 -134 -127 -105 -156 129 -291 -226 -51 -191 55 -38 -109 -5 -8 -169 -297 -228
4516 -228 -448 -200 -168 148 55 -157 -274 -219 -96 -232 -96 -16 -44 -277 -34 -361 -33 135 -104 -60 -58 -124 155
4539 155 -51 -170 -109 -283 95 -17 125 -123 -128 -48 121 -50 -4 91 273 256 142 29 49 -52 20 40 -460
4562 -460 67 240 -172 100 -101 80 34 164 12 -210 -104 227 53 161 11 -87 14 -318 72 142 -198
4583 -198 24 251 260 13 220 109 386 321 497 -177 77 386 -97 306 113 181 -67 -47 140 -86 -56 67
4605 67 97 36 428 422 86 79 258 -123 -171 179 185 267 111 -214 144 -69 52 -192 29 26 -47 -103 111 -127 -64
4630 -64 -518 -261 -150 58 119 236 -136 -132 73 -258 -521 -35 131 173 -143 -63 95 48 -98 103 -188 235
4652 235 -161 -219 -168 57 -318 16 -52 -322 88 -159 0 238 -41 25 -195 11 187 103 -220 140 290 43
4674 43 13 126 -102 -156 -164 -182 -34 59 151 147 -80 -39 -92 -95 223 -101 361 -163 107 -166 6 17 -56 -43 -48 -76 43
4701 43 -60 -27 66 12 20 -109 33 92 -107 367 35 -40 70 27 126 -28 -218 -41 230 -80 152 161 114 -404
4725 -404 89 31 -191 160 119 31 99 -13 106 86 -221 142 75 -98 38 -149 173 -108 -220 41 -141 -28
4747 -28 -158 -149 -20 41 -58 -160 7 87 -1 -172 -91 -262 -59 -53 -250 -249 -174 123 -275 -218 -63 201 -172 -351 -41
4772 -41 -272 1 -174 -195 -119 51 -65 111 -459 -276 -166 -39 24 -32 -115 213 19 60 128 -242 -190 -196 -37 284
4796 284 -30 -243 116 -8 -32 -194 98 -143 92 220 -23 59 -241 364 37 189 10 272 -305 -91 106
4817 106 -61 314 -67 425 -231 224 101 129 -98 -75 81 187 269 -173 4 357 102 -36 167 221 101
4838 101 127 71 -60 155 -12 92 48 104 370 67 331 -123 161 -189 67 35 78 32 -53 27 38 81 -83 122
4862 122 6 -42 1 -57 171 -160 -139 -85 -190 -106 203 57 166 -78 180 -366 275 -48 -329 150 -12 -48
4884 -48 -144 -43 246 3 -69 139 -325 116 -36 83 80 -15 72 -317 49 -55 138 315 -397 112 -275 -255 -46
4907 -46 -145 -313 -48 -162 -157 79 66 -132 -116 -62 -209 -170 -57 -196 -286 -156 -157 75 -108 157 189 27 42 165
4931 165 149 -10 -66 -40 60 237 -102 -125 -68 110 -5 -98 -3 187 33 -49 274 -106 164 -77 106 -47 229
4954 229 89 -180 -86 131 125 -82 -8 200 332 -69 232 -20 42 215 -199 -254 114 118 242 14 -84 309 -2
4977 -2 114 -30 -13 43 4 59 305 -105 24 -320 39 -134 56 355 212 73 -3 54 85 272 143 -101 -26
5000 -26 -65 -92 -3 83 -166 -52 -150 4 -16 -147 56 47 -1 319 -112 -160 -22 -202 -145 -173 22 -154 121 -388
5024 -388 -112 12 -383 169 -68 -326 -249 90 -94 105 55 -115 -101 156 -174 -210 161 149 -174 -76 -18 -137
5046 -137 219 20 335 69 81 -39 -16 4 53 -96 -63 -273 -113 -27 246 36 -52 47 -51 89 -164 -29 77
5069 77 -193 -154 270 179 269 131 -102 119 -98 65 -31 59 122 61 283 -67 25 336 229 207 -9 6 -120 73
5093 73 -226 -100 63 -152 -216 -83 225 36 -10 126 94 86 125 -48 -212 -89 59 65 -223 -11 -72 274 -66
5116 -66 154 -242 231 170 -289 -123 -241 92 36 -35 65 89 -41 9 -110 -46 -314 3 101 -31 53 -102 -323
5139 -323 -70 -147 -89 204 -97 -167 -44 -28 132 -91 -37 -44 -225 -61 -178 306 16 -2 -206 10 245 62 -68
5162 -68 -53 23 -100 15 -248 -110 10 85 43 55 3 -101 21 -346 -6 -29 -146 -80 -115 -144 -58 171 143 221 -126
5187 -126 -191 49 60 -123 -39 -76 -112 143 14 -32 -55 360 -99 -126 -183 51 237 170 6 -6 53 9 43 40 66 -216
5213 -216 197 124 158 -67 205 167 -244 -82 238 61 37 261 82 197 133 50 -149 204 169 -193 23 -83
5235 -83 24 -7 116 231 -300 -220 28 155 -225 -74 -19 133 -12 27 36 -236 20 32 -75 -119 147 65 -35
5258 -35 -112 -122 9 -198 -14 -189 -106 -108 -140 -129 -7 162 211 -401 43 -67 -115 11 -16 -330 101 33 -90 -43
5282 -43 183 91 -135 88 -277 -115 -219 -180 -3 -38 -37 27 168 109 50 55 88 111 -91 129 -37 13 -117 -23 142
5307 142 102 162 -82 176 -168 -36 -33 -103 -112 -201 72 240 81 101 -79 -138 -22 -46 48 -11 -132 41 195 -195
5331 -195 -168 208 -21 427 89 189 -42 211 295 -47 -92 101 -135 -116 -174 -98 56 -19 145 93 178 182 163 52
5355 52 35 186 132 50 3 143 -162 -22 258 -216 182 -99 -73 153 -12 -165 -211 -169 87 -89 -137 -225 -209 -281
5379 -281 -3 -22 66 -26 -177 -72 288 11 130 -12 -99 -447 -34 -190 -223 88 -284 201 -253 -90 -145 -52
5401 -52 -35 95 346 87 51 136 -327 -20 208 -113 186 -25 145 -26 24 90 -134 103 -102 -55 -119 38 -137
5424 -137 -87 264 43 259 -169 159 48 196 24 -89 175 184 -252 -334 16 22 -38 143 35 -107 44 -87
5446 -87 238 51 159 23 134 -47 65 -33 -53 150 81 -34 262 239 -274 101 -97 117 90 169 -13 143
5468 143 255 193 59 106 220 16 220 53 31 -105 103 -123 156 133 -44 -95 -26 149 157 160 17 -49 -88 100
5492 100 33 -88 -181 -32 3 164 104 3 14 245 25 21 279 -159 -23 -101 5 118 -206 -31 98 239 -228
5515 -228 -70 -45 -180 -99 -17 -23 -21 -124 -265 -76 -106 100 -142 29 7 128 53 31 171 -21 -71 -41 -236 234
5539 234 -287 -285 -72 -112 79 -116 -112 -138 16 254 78 91 6 34 94 -211 21 206 167 143 -67 -110 -28 -69 -114
5564 -114 -163 12 -35 109 -146 79 54 -182 57 323 97 68 158 66 -11 183 -86 147 -157 -20 17 115 410
5587 410 -128 -225 455 -82 -148 194 -35 192 65 2 -201 236 -257 68 -85 116 107 7 -153 -53 -156 -42
5609 -42 -15 -78 102 45 4 -43 97 88 -16 295 -94 -82 -83 -197 -83 -65 -342 55 136 -81 -116 -133 -127 69 -108 11
5635 11 -245 13 -45 141 80 -42 -23 24 -72 17 -163 201 -258 -58 48 -53 -99 -145 -132 193 -19 -41 -56 -193
5659 -193 166 137 -83 -4 48 -37 -56 45 99 34 -40 63 130 10 35 -116 4 -51 -73 100 -55 -27 -167 -19
5683 -19 -208 108 8 256 -229 138 139 -101 214 352 -44 118 77 -17 350 510 186 56 -277 -368 605 -47
5705 -47 183 20 181 147 -230 90 -162 25 -83 -315 19 27 -50 143 111 -15 184 -228 -78 281 -9 247
5727 247 -106 -210 -124 72 -2 49 226 171 105 -217 158 -114 70 -34 -304 -71 88 19 74 97 61 -129 -99
5750 -99 -159 -231 82 83 -52 48 -105 -151 98 -19 -231 33 45 -330 -32 12 -165 1 -184 -102 -131 -103 -103 199
5774 199 16 -370 -167 -39 81 -14 -357 -89 -180 -247 -278 -46 -60 85 47 79 -33 -141 -200 -278 -80 -54 -162
5797 -162 -71 -26 239 -246 89 101 29 152 -97 8 -47 -171 259 -103 -83 -258 -123 -37 -74 -112 49 41 200 -31
5821 -31 -89 222 284 412 109 -68 44 -101 -90 125 21 -41 18 86 61 -381 28 72 37 -89 -30 148 95 -13
5845 -13 -181 107 135 30 150 -71 190 283 -85 -55 -88 -186 -227 27 67 28 0 -266 -153 -143 79 39 22 -24 175
5870 175 27 -20 -40 261 35 -263 -21 12 16 78 30 -79 -225 -48 33 -98 205 -1 -96 -182 200 -167 -51
5893 -51 22 177 0 -59 47 74 -51 26 -159 -148 190 -100 -37 -280 -29 -22 -204 -308 166 10 54 -44 -40 -273
5917 -273 86 166 34 200 319 -303 39 78 -186 -125 -382 -59 248 -28 -198 93 -21 275 -49 -102 -68 199
5939 199 137 48 -51 103 77 17 -63 -50 68 120 -106 289 78 -111 210 -169 -168 -110 -160 165 179 26 -45 0 -33
5964 -33 -41 102 -201 153 103 144 19 73 135 -16 62 21 42 26 -312 174 -218 90 -328 -41 -27 111 41 -61
5988 -61 -51 -176 36 -52 92 138 27 -216 -54 416 -32 -20 -93 -67 15 -162 -211 10 295 -167 115 155 83 -137
6012 -137 414 -10 -128 -207 97 -305 75 351 146 -292 -201 -17 -231 -105 -14 -171 -124 -99 -51 -40 10 26 117
6035 117 -231 -293 102 225 41 81 20 2 156 -352 -109 226 -227 -109 -17 -159 -161 -28 28 -55 -138 30 132
6058 132 77 -30 -262 98 202 -80 -69 -58 35 122 203 161 -83 178 94 -25 61 61 -72 27 -111 -32 121 -375
6082 -375 -72 20 -133 71 248 -59 -76 150 -122 -135 229 -191 -57 -11 47 85 -130 122 -124 251 183 84 49
6105 49 195 86 170 -47 51 50 -88 35 -29 -128 -216 212 -86 -93 156 165 -71 -186 -77 49 -88 -282 8 -145
6129 -145 -173 242 -93 -200 -172 73 -179 -218 -49 44 153 -75 21 -147 -105 -164 58 -157 -191 -287 32 -290 214
6152 214 59 7 -201 -152 23 -404 -139 69 155 48 -102 -175 -163 -164 -117 103 -208 81 48 399 -74 -236 83
6175 83 -18 -309 18 -174 197 58 -51 45 1 -147 -291 -229 -69 -40 58 -65 -57 -85 83 83 -45 66 133 -197
6199 -197 110 45 -16 193 232 -437 -80 124 1 123 86 91 -38 -281 12 24 46 -43 -61 -249 169 -102 -160 -79
6223 -79 305 204 87 -102 298 -43 431 80 -18 -60 -120 115 58 -237 -197 -197 -92 424 -22 -38 78 104 -129
6246 -129 204 23 -110 -165 -389 -195 -27 134 -13 166 -181 -93 -290 -110 -162 -163 77 -264 137 -52 -63 -114
6268 -114 -139 305 5 291 -74 -134 124 -434 140 204 129 -281 -6 -53 -35 -65 -70 -334 -15 51 216 187 52 -320
6292 -320 -58 -239 46 27 -200 -116 126 42 -78 91 -61 79 260 -72 -35 153 -333 101 -139 -187 -179 71
6314 71 -35 -190 143 136 -178 -208 52 -160 120 10 55 51 9 423 2 185 45 207 98 -266 -224 -80 20
6337 20 -5 198 -412 -345 241 -137 61 385 87 120 247 -170 114 -152 146 -165 -483 65 194 -94 325
6358 325 45 97 25 155 129 151 178 -120 -130 -24 -20 130 -35 -140 203 112 -198 101 -38 -153 -232 -133 -61 -78
6382 -78 54 137 -49 -172 -96 28 127 131 -51 115 -36 -268 -100 306 320 -2 -262 -237 35 55 -374 -206 97
6405 97 26 -63 -75 106 50 -71 -36 -79 -60 -80 38 310 117 21 91 -75 108 258 -163 -150 -100 -20 -32 102 -32
6430 -32 -141 282 -178 120 154 103 -91 121 -231 -217 -61 -124 295 162 -133 -9 109 48 33 147 143 -198 -132
6453 -132 -15 310 99 42 -169 116 -97 -27 44 53 21 -351 -72 -111 -232 -67 -219 -229 -106 155 -37 117 31
6476 31 65 -28 -61 37 326 51 187 -233 5 -48 195 -18 -294 13 4 201 24 -28 -54 173 2 65 250 -54
6500 -54 80 399 -143 80 -212 50 140 -285 153 209 304 266 86 -236 -72 -5 -225 88 87 89 -265 -84 241
6523 241 -165 -121 -25 45 165 156 -13 77 1 -259 83 -39 -405 149 -163 -218 157 0 93 -137 136 -163 -187
6546 -187 235 15 -242 25 12 81 111 -139 -279 -295 -172 -433 70 127 -56 -3 128 -113 -148 105 76 0 14
6569 14 38 72 -141 202 16 -28 50 346 128 67 63 175 -51 161 -149 97 32 -136 82 -53 -113 73 -183
6592 -183 -341 44 159 -44 281 128 -46 317 3 -147 -525 125 99 -60 -184 -111 -85 78 -288 398 -18
6613 -18 249 -104 123 142 121 81 -35 -172 -246 176 85 32 -31 236 81 -82 -75 83 73 -123 -103 207 -12 271
6637 271 -10 -87 22 28 -285 -171 336 47 106 -62 159 -59 -335 122 -226 106 -54 76 -136 -58 151 283
6659 283 -182 317 -142 -306 -93 -141 9 133 -271 43 -43 -62 95 -49 73 -103 70 -147 193 -38 175
6680 175 129 104 -72 260 -37 -30 34 153 147 -45 -194 -12 322 -31 -138 -50 -98 197 69 250 -70 138 176
6703 176 189 110 -248 -22 29 171 79 -10 -11 139 -39 223 243 60 54 13 -399 164 9 243 48 102 106 57 340
6728 340 -209 -20 14 231 -121 243 -46 242 -119 180 89 77 113 -342 -198 47 68 -55 169 186 -48 -138
6750 -138 -42 -100 -155 -74 80 -23 270 -117 149 0 -64 21 -158 -197 -251 -284 -123 31 20 271 113 116 -257 83
6774 83 54 19 450 57 -235 158 66 -139 81 137 28 -545 -280 37 -128 -50 97 -85 -47 -139 -48 -103 121
6797 121 47 -118 -146 149 -181 38 204 -32 160 -95 -122 -142 29 61 58 -97 96 68 -53 -348 87 101 -190
6820 -190 -166 -502 29 -58 -132 -5 148 -93 -132 -238 -44 46 -31 133 85 205 -21 86 24 13 50 70 169 90
6844 90 -165 103 -169 -95 -56 -32 103 -193 83 44 209 89 186 146 -108 94 120 -64 -182 56 -397 74 22
6867 22 30 113 157 -20 69 -262 -111 -217 -349 -47 -65 -57 -95 -149 -128 327 -192 189 7 -34 121 85 -126 99 146
6892 146 -81 -133 -185 -86 -5 -90 61 -12 -186 -128 115 -149 26 -5 185 -41 79 66 -10 -17 81 -113 -261 -238 -112
6917 -112 63 37 96 -137 253 104 178 46 240 -79 209 245 126 89 35 -226 54 34 43 130 91 136 81 98 147
6942 147 79 -165 55 -284 166 54 -84 82 147 82 -185 437 243 -195 84 19 162 -146 -4 14 42 -104
6964 -104 32 -77 100 -118 11 58 -26 -202 -3 -66 -70 34 34 77 211 -327 -73 515 -39 55 230 138 13
6987 13 416 23 -232 41 -53 -371 -5 17 11 -103 154 -66 -267 13 -126 -77 146 -71 206 -217 -203 33
7009 33 151 -15 94 44 -93 -125 -201 79 -278 153 128 44 250 -24 -142 -102 -198 25 99 192 -236 -139 -314 30
7033 30 -372 39 -21 42 87 -92 70 -93 -5 145 209 -240 -94 225 -105 86 -112 -19 236 205 171 -71 11
7056 11 -95 82 -21 60 240 138 -12 -83 -164 -231 -72 4 25 -39 277 -41 112 202 -84 154 -160 -46 20
7079 20 -38 -151 -127 -10 107 -185 211 34 123 -60 -224 -49 -19 73 157 11 145 -55 148 -38 -108 -173 -80
7102 -80 97 43 117 68 47 -12 133 -30 20 -116 285 -116 -269 -34 117 224 -41 360 206 198 -369 72 -71
7125 -71 131 -238 -61 94 179 -59 98 -297 -186 285 -1 127 83 -52 -8 -165 -79 -128 101 241 -225 151
7147 151 -171 -126 -11 -132 488 13 74 -58 154 194 -17 77 -271 271 -59 -133 -126 59 27 -143 -119 59 27
7170 27 -52 82 20 225 -218 52 163 -163 -394 -49 -138 164 -100 228 117 77 -129 -23 105 -44 32 -69
7192 -69 -83 -215 -67 -66 -191 12 163 30 13 -36 -78 194 79 114 59 -90 -28 46 59 88 247 -4 -11 -345 -138
7217 -138 -156 -284 -46 5 -95 288 118 -42 125 -229 59 166 -143 124 -241 -82 158 316 -15 -160 63
7238 63 246 -38 180 -201 98 247 -92 -141 -156 -81 155 -155 -31 -25 -15 -1 -67 84 178 37 -138 -80 -192 155
7262 155 -231 -26 136 -77 85 25 -334 -34 -184 -30 10 108 -111 82 428 66 -11 290 154 -126 -133 3
7284 3 -139 -16 -255 10 -143 -106 -174 175 16 -185 21 -13 90 81 -34 -144 108 11 -74 -59 356 -111 60
7307 60 -81 -71 53 -24 96 -21 62 -36 -231 384 -173 78 123 -26 -163 138 140 -266 110 204 -93 253 -21
7330 -21 -195 -149 -67 -123 149 205 101 -44 29 -49 193 -21 -154 242 216 -147 -151 106 -192 50 280 -170 9
7353 9 12 49 -17 172 -75 -155 -36 -234 -180 -142 -298 -286 339 81 171 52 -164 -177 -18 327 180 -8 106 238
7377 238 225 43 88 -109 -180 27 93 9 28 -144 69 -42 -303 35 -149 32 -20 318 180 -42 -81 18 1
7400 1 93 -44 73 169 24 -37 139 132 -163 -127 -13 18 -315 426 -66 23 -113 102 102 -119 -72 273 -87 -180 -2
7425 -2 -120 138 151 239 76 55 -90 -122 -206 136 -120 67 171 69 -147 6 -18 -176 -282 -97 102 -197 -9
7448 -9 0 112 113 145 -86 57 346 119 -12 333 191 149 -191 -26 16 98 -365 102 1 -131 -17 -31 170 181
7472 181 -79 37 350 -113 -5 220 110 3 203 -142 -198 371 310 -270 144 138 121 103 -388 137 108 -103
7494 -103 -24 -21 -110 178 260 257 299 416 -3 -79 -12 -76 2 -2 -137 -82 -40 -121 14 -136 192 -58 -97 43 -219 -108
7520 -108 174 -53 13 150 318 36 5 -6 -96 -167 -28 48 210 -200 427 -37 162 -161 277 203 62 286
7542 286 97 -76 133 -65 -149 88 112 -80 65 7 70 208 307 151 -86 43 160 -146 -41 206 219 -376
7564 -376 -167 140 1 163 50 314 -41 -208 55 92 60 -139 -119 41 104 57 53 87 -155 17 126 -20 62
7587 62 -198 -121 -250 2 116 -75 445 207 289 -40 -339 -53 136 23 -136 10 -110 -74 264 -213 204
7608 204 104 149 182 -237 -89 9 -219 -227 308 30 44 -106 169 135 -469 250 91 267 -100 195 -212 -262 -111
7631 -111 -104 165 -199 97 -37 -231 214 23 -167 215 148 85 -48 46 -119 -25 -11 148 106 76 -187 168 -17
7654 -17 198 116 44 -106 -117 -139 39 -200 218 29 157 -69 -62 -138 61 40 -191 -114 123 80 -85 -57 -8 -47 -241
7679 -241 183 275 -21 -188 102 -268 -210 -50 -234 374 -34 -288 198 156 -263 312 -131 48 89 -4 96 -104
7701 -104 153 323 60 41 282 199 64 179 170 -187 -75 -186 4 -228 131 -112 78 361 337 -11 114 141
7723 141 144 -164 200 56 -117 58 36 24 -1 -49 -48 263 2 -36 -8 29 58 -61 50 -141 -50 87 -189 -44
7747 -44 -5 -31 -27 -26 -55 -157 166 323 -306 158 -103 58 -79 -323 82 -71 -18 35 -67 108 160 218 -194 308
7771 308 -147 38 -139 -9 32 -214 -66 -37 54 -135 36 -144 231 -130 -25 9 40 100 -112 274 215 66
7793 66 44 -112 50 -115 -192 135 227 -57 -127 -100 86 -10 -57 -78 -75 97 -206 392 -154 -178 306 92 158 -23
7817 -23 64 46 -96 72 -111 -439 -155 -77 -308 106 -30 -55 -4 216 -34 -200 -103 -194 -155 -64 -39 -368 107 149
7841 149 -174 154 -108 99 74 160 -2 -112 26 -65 -123 -109 171 137 135 -81 107 27 -25 -67 -17 146 34 -77
7865 -77 223 -161 -173 200 -330 -89 -200 166 257 8 -13 -141 -249 114 23 -40 -254 -185 -162 12 22 -37 -41 60
7889 60 74 -11 103 -106 109 149 -78 -22 -30 8 -1 11 -89 307 111 -9 241 156 -39 -250 207 -25 115 180
7913 180 105 -32 100 122 315 20 -158 214 -12 -33 310 59 -44 -246 -213 39 25 -319 94 85 -185 86
7935 86 75 44 224 79 -53 -21 59 -43 -15 -79 -50 50 16 -119 162 -38 52 -22 196 -59 56 -321 -181 61
7959 61 -172 -273 173 121 205 -111 212 -246 -47 -1 7 55 186 58 -198 127 241 -262 -129 54 35 1 217
7982 217 181 -67 438 -327 104 -85 -37 -59 8 36 -56 6 -193 -49 -271 -201 -11 80 -90 68 -254 29 158
8005 158 49 336 -154 47 50 349 -277 86 112 -88 362 300 120 -145 26 -40 -192 -230 -100 -8 -251 -191 126
8028 126 29 -146 -199 81 -214 39 8 10 -333 40 -113 152 -138 -157 -58 453 -32 -11 -251 -142 136 136 -87
8051 -87 -118 208 159 192 -48 -24 181 -164 -266 -92 -26 -113 85 -95 -68 -110 -42 28 -71 -5 114 -57 -266 210
8075 210 26 125 -230 33 -151 -151 177 70 52 -55 -275 158 -121 110 242 35 37 -194 182 -247 -179 -164 385
8098 385 -241 -65 -119 -34 281 204 0 -164 -66 48 -8 -88 81 -169 -59 65 -240 -113 115 145 -129 -89 33
8121 33 27 56 -108 -150 -15 80 -226 -10 -64 -295 197 -113 -6 -130 264 184 101 12 301 -142 -109 72 -362 -135
8145 -135 213 117 88 -141 102 -107 142 175 47 87 -205 211 169 -287 -184 -244 13 -210 102 -7 256 -148
8167 -148 -126 253 -129 80 44 112 -60 -140 -139 -89 169 -192 100 -252 6 -107 -118 63 -227 353 -77 23 -13
8190 -13 35
8191C5
$$ Imaginary data points
##PAGE= N=2
##DATA TABLE= (X++(I..I)), XYDATA
0 0 0 0 0 0 0 0 0 0 0 0 0 0 0 2 -8 8 -8 8 -8 8 -16 16 -16 19 -24 24 -32 32 -39 43 -48 55 -61 69 -77 85 -94
37 -94 104 -116 128 -142 158 -174 193 -213 236 -262 294 -329 369 -422 481 -556 650 -780 963 -1240
57 -1240 1706 -2642 5236 -26014 -95229 -31245 15650 -16931 -35919 5007 11097 -21305 -16621
70 -16621 14666 1639 -23187 -16433 -14625 -36449 -27116 7632 2533 -31904 -32610 -23155 -39375 -36254
84 -36254 5156 12042 -27547 -28752 12189 9723 -29305 -31454 -20298 -46195 -56970 -14602 4996
97 4996 -27706 -29042 12744 6753 -40749 -32918 11709 -2354 -49180 -41264 -3371 -3014 -17057 -12914
111 -12914 -22286 -45145 -32432 -29 -1251 -15373 -1248 7504 -16789 -22115 4920 634 -37996
124 -37996 -40970 -13568 -16160 -26156 5381 31524 1744 -27607 -10208 5244 -8158 -6848 7794
137 7794 -10928 -32790 -5601 23770 160 -26345 -5588 8848 -14229 -16174 20933 31497
149 31497 4096 -4892 6951 -131 -11045 1495 4700 -16572 -17828 11083 22959 11270 14206
162 14206 20378 797 -11762 10359 23125 838 -9378 9811 12311 -4809 3374 24588 11612
175 11612 -11509 -54 20033 14442 13089 30877 23856 -8379 -10377 15887 16851 -4241 -3267 10166
189 10166 6455 5127 24563 33460 15508 4114 8758 4929 -1252 12166 22311 5868 -6831
202 -6831 7069 17379 7328 8090 19738 9727 -7644 6802 31061 23610 4882 8297 10984
215 10984 -4355 -6913 12036 14690 -1335 -27 16248 17253 11867 20178 21092 1101 -10171 2328
229 2328 11621 5376 5110 10142 3360 -3382 8242 18892 8470 -1045 4505 7945 2873 9624 21180
244 21180 11339 -7913 -7954 1346 -1309 -2640 8574 10598 -1646 95 16074 17893 4273 -1063
258 -1063 -1726 -9850 -11560 2610 11449 2299 -4687 137 919 -2617 2275 7437 -1460 -10187 -2858
273 -2858 6628 3976 4 159 -7668 -19361 -14370 -254 2178 -3454 -893 2087 -2829 -3340 3681
288 3681 425 -14316 -19554 -12255 -8073 -7294 -193 1443 -8473 -15278 -8585 -2954 -6353 -8326 -6319
303 -6319 -9211 -11953 -5888 129 -6060 -16350 -18430 -16851 -16090 -8352 923 -238 -8756 -9822 -5719
318 -5719 -6774 -10827 -11139 -13954 -19938 -18213 -7064 -632 -3887 -7133 -9268 -13661 -14310 -7034 -2194
333 -2194 -6398 -11288 -9611 -7101 -7272 -6395 -6228 -12542 -18121 -13891 -5015 -172 1555 1732 -2592 -8812
349 -8812 -8402 -4025 -4046 -8949 -10465 -8247 -5414 -1217 5165 5723 -1825 -7026 -5423 -1740 435 3432
365 3432 3795 -207 -3533 -804 3127 2158 -779 -2409 -3047 -923 6196 12961 12716 7115 2464 245
381 245 808 3154 5175 3878 1041 2433 7408 11706 12673 10812 6842 2282 1504 6753 11959 11989 9049
398 9049 6244 4612 5475 8386 10034 7194 3966 4760 8942 13582 16307 15069 9548 4078 2462 4500
414 4500 7227 8387 7730 6419 6420 9936 13284 13744 9874 5040 2167 2912 7140 10962 11212 6953 3631
431 3631 3047 4900 6503 6614 4802 3107 3281 6571 10447 11364 7958 2427 -2704 -3361 375 3659
447 3659 4431 3393 2060 2761 5099 6542 4526 1027 -2867 -4699 -2862 1615 5149 4404 -210 -3750
463 -3750 -3655 -1861 -53 -291 -1384 -2552 -1973 1195 3778 2758 -1232 -6856 -9885 -8512 -4048 -408
479 -408 17 -1655 -2079 -1776 -1537 -1348 -2196 -5229 -8914 -9022 -5330 -314 1525 -959 -5417 -8384 -7760
496 -7760 -4754 -3011 -3601 -4061 -3342 -2998 -2057 -647 -1290 -6182 -11210 -12174 -7994 -2940 77 543 -1325
513 -1325 -4169 -5057 -4122 -3362 -5157 -7215 -8604 -6613 -2933 1519 1099 -2908 -7337 -8353 -7091 -4850
529 -4850 -2150 -359 -1029 -3269 -3567 -2218 -1746 -3491 -7213 -10058 -9115 -3500 1809 3202 918 -1811
545 -1811 -3774 -5299 -5204 -3601 -2878 -4852 -5307 -2798 846 1948 211 -3230 -6230 -7531 -4757 9
561 9 1996 2172 185 -2113 -3275 -1431 -575 -3081 -6895 -5656 -1243 2321 4035 4555 2812 -2090 -5144
578 -5144 -4104 -1295 430 494 307 -786 65 3278 4761 1618 -2836 -3505 -1695 845 4239 7433
594 7433 5644 855 -1248 -341 442 544 993 825 694 2790 6895 8471 5989 3444 379 -2074 -858
611 -858 4148 6604 4770 3226 4437 5590 4847 4586 4738 2220 45 2780 7654 8805 7707 6319
627 6319 3680 307 1190 4842 5461 3914 4018 5725 6945 7768 9172 7356 1497 -1136 1417 3953
643 3953 5527 7658 7921 4500 1898 4552 6384 4421 2483 3038 2174 1813 6001 10073 7137 870
659 870 -257 1136 214 927 5157 6041 2053 1321 4167 5589 2921 1025 -640 -3216 -3136 1414 4810
676 4810 3128 1293 995 -992 -2871 267 2026 -1860 -4433 -1686 1824 52 -65 583 -2330 -7404
692 -7404 -6505 -1540 -772 -1762 -557 -873 -3973 -4040 -335 -993 -6726 -8974 -5615 -4610 -4292 -708 1272
709 1272 -3668 -7679 -6210 -4019 -5061 -4636 -3199 -5494 -7303 -3389 -249 -3741 -6913 -5836 -6954
724 -6954 -9775 -6087 248 184 -5336 -5801 -2993 -4049 -6336 -4623 -4198 -7837 -8022 -2634 80 -2067
740 -2067 -1784 -1733 -6313 -8603 -3749 292 -3143 -5544 -2124 -959 -3659 -2347 790 -2162 -7292 -5837
756 -5837 -1321 -652 340 3064 428 -4368 -3651 598 -535 -4061 -2130 879 -2009 -1920 4340 6165
772 6165 -315 -3608 -1204 -612 -1891 1511 4844 1429 -1825 1478 4162 802 -242 1726 252
787 252 -3003 1268 7256 6050 1667 1948 2322 -1238 -1099 3711 3582 -165 749 4536 3955 2631 5275
804 5275 4898 -1874 -3459 2605 5604 2377 2824 5509 3195 -1129 1850 5587 2122 -1269 1091 3571
820 3571 2521 4266 7282 4162 -1298 -1174 1985 847 232 4715 5237 -26 561 6198 5883 75
836 75 -479 1631 -300 -1104 4241 7201 2493 -604 2349 2139 -1303 835 4653 1477 -2159 1518
852 1518 5748 3747 1141 2059 531 -3517 -1704 3584 3621 446 1961 3491 326 12 3734 2845
868 2845 -2895 -2504 1981 2488 215 3408 5419 -579 -4265 159 2798 23 -779 2418 1500 -1341
884 -1341 1535 4984 931 -3451 -1784 -111 -1847 -382 4150 3159 -1910 -1688 2131 522 -2180 -115
900 -115 303 -3261 -3006 2477 3647 -297 -1509 53 -2713 -4418 -138 2909 -936 -3508 266 1299
916 1299 -2111 -1404 844 -2261 -6524 -4042 955 -185 -1395 423 -303 -4420 -4341 30 -732 -4554
932 -4554 -3956 -1271 -2322 -2698 532 711 -4186 -6191 -2923 -2352 -4007 -1536 391 -2733 -5087 -2406
948 -2406 -89 -3418 -5116 -3150 -3517 -5727 -2694 2021 -59 -4510 -3444 -2164 -4620 -4671 -938 -1483
964 -1483 -4747 -3869 -71 -101 -2222 -1692 -1824 -5278 -5790 -1015 1294 -1039 -1645 -72 -1594 -3577 -1276
981 -1276 634 -2506 -4440 -1667 823 -361 661 2822 215 -4050 -2675 499 -262 -1126 804 1731
997 1731 -666 -279 3419 2871 -1271 -1853 268 177 417 3546 5004 1449 -507 1309 1900 373 1432
1014 1432 2921 1323 189 3503 5807 4075 1822 2113 1103 -698 1260 5156 4404 1868 2864 4205
1030 4205 2861 2031 3803 3049 45 222 3828 5140 4144 4251 4075 1302 -62 2131 3577 2473
1046 2473 2149 3484 3361 2847 4124 4733 1861 -919 128 1870 2092 2965 4646 3430 186 895 2888
1063 2888 1565 12 753 1133 -79 1160 3878 4024 752 -656 -244 -875 -779 1287 2106 704 -65
1080 -65 972 1270 605 -205 -680 -2088 -2882 -720 1845 1440 397 324 -1300 -2588 -1947 -84 -440 -2293
1098 -2293 -1421 -297 -226 76 479 -640 -3387 -3895 -1935 -905 -485 -312 -232 -1553 -2147 -1274 -762 -2162
1116 -2162 -3264 -2715 -2286 -1411 140 886 -360 -2383 -2989 -2723 -2087 -1470 -612 -1319 -2218 -1487 143 -125
1134 -125 -1446 -2286 -2703 -3283 -2308 25 951 -148 -965 -1314 -1691 -1481 -1379 -1093 -1999 -2187 -1455 182 592
1153 592 588 -435 -2099 -3178 -2031 -635 -53 -282 -572 -888 -870 -194 -142 -826 -2101 -2371 -1498 -550 337
1172 337 1432 619 -1154 -2256 -1238 -1035 -760 -976 -833 -1010 -432 719 964 562 -1316 -2374 -2400 -1255
1190 -1255 477 755 268 -182 -290 -559 -239 4 -252 -1312 -1403 -960 789 1809 1593 123 -1114 -1639
1208 -1639 -886 -468 567 227 -140 54 364 1048 1154 456 -836 -1422 -918 540 1401 1815 1464 604 206
1227 206 375 331 553 383 -44 -336 898 2758 2966 1609 618 -477 -205 511 1482 1951 1974 1628 1289
1246 1289 1720 1950 2015 1144 -110 -192 1047 2138 3152 3167 2558 1286 395 1158 1868 1873 1605 1455 1650 1959
1266 1959 3420 3166 1726 562 231 642 948 2141 3349 2943 1517 1091 2084 1814 1711 952 631 115
1284 115 1126 2744 2926 2089 1231 513 -89 377 706 1425 1180 410 1079 1652 1295 826 631 -692 -1414
1303 -1414 -806 890 1460 1030 783 -616 -931 -565 456 -497 -1838 -1407 -325 -43 80 756 14 -1803
1321 -1803 -2594 -1921 -1363 -875 -411 -619 -1025 -1404 -927 -895 -1288 -2470 -2689 -2532 -2070 -978 100 -1144 -2410
1340 -2410 -2599 -2588 -2623 -2488 -1737 -1988 -2406 -2086 -1039 -853 -1415 -2059 -2532 -4075 -3175 -1275 -901 -1217 -1828
1359 -1828 -1590 -2140 -2150 -1741 -1400 -2287 -2759 -2076 -935 -209 -137 -494 -1503 -2394 -2761 -1275 -792 -1060 -877
1378 -877 -777 -801 -477 463 -78 -1541 -2018 -1614 -461 -46 826 860 78 -543 -382 -165 -218 -149 103 -336 -250
1399 -250 478 1717 1441 275 -244 -431 -743 558 1444 1458 735 496 1254 1626 920 825 229 -510 274 1281
1419 1281 2001 2260 1710 1195 -25 -42 809 1784 1205 534 932 1543 1764 1793 1983 947 -196 23 911
1438 911 1552 1820 1643 1611 794 771 1401 1432 526 -199 -82 740 1388 2023 2047 932 97 -30 41 615 1192
1459 1192 1079 425 461 1231 1437 1254 479 -158 -576 -671 383 1458 1879 834 238 303 348 237 387 134
1479 134 -372 -191 199 1195 1574 941 352 -668 -1119 -302 492 951 617 168 567 593 472 550 -260 -549
1499 -549 -877 84 475 1160 1202 882 -151 -694 -188 337 276 122 108 -28 392 873 1180 559 -839 -1395
1519 -1395 -484 134 651 768 792 168 -273 -89 433 -260 -589 -691 -991 -491 741 1462 641 -330 -755 -1005
1539 -1005 -1109 -233 247 -371 -488 -368 152 160 -369 -410 -1154 -1823 -1227 -153 557 -232 -266 -592 -1629 -1855
1559 -1855 -663 -543 -1075 -1561 -1226 -466 -239 -61 -427 -1659 -2569 -1833 -1205 -833 -690 -459 -779 -1471 -743
1578 -743 -803 -953 -1798 -1933 -1647 -1446 -996 410 -109 -1531 -1596 -1598 -1271 -1469 -908 -960 -1229 -1089 -19 250 -607
1599 -607 -1138 -1477 -1708 -1733 -790 324 169 -552 -612 -488 -549 -456 -98 -771 -1140 -741 323 441 589 486 8
1620 8 -946 -977 285 418 -46 -2 665 436 376 920 1275 -149 -529 110 580 760 1468 2039 1300 15 492
1641 492 1168 964 575 1022 1476 762 1457 2285 2177 958 734 752 695 1070 1820 2053 1501 1237 1725 1693 1047
1662 1047 1291 1208 537 282 1588 2402 2080 1423 1404 1090 358 730 1772 1302 847 983 1662 1808 1484 1637
1682 1637 1120 -49 -193 847 1266 1148 1338 1266 195 176 717 963 -50 -454 87 351 80 1134 1053
1701 1053 228 -640 -518 -30 -347 -105 567 303 -572 -164 742 235 -574 -746 -1025 -1146 -790 521 482 56
1721 56 -778 -530 -756 -1149 -525 -460 -1037 -1199 -122 351 -315 -143 -557 -1175 -1941 -1258 -234 -446 -765 -306
1741 -306 -471 -1007 -923 -88 -871 -1739 -1260 -516 -518 -139 53 -128 -1422 -1417 -795 -227 -624 -748 -117 -758 -428
1762 -428 -175 361 -438 -1437 -950 -1009 -1065 -19 527 -20 -741 -231 -25 -294 -629 -499 -466 -673 -395 407 300
1783 300 154 -266 -447 -695 -963 135 544 -216 -299 164 431 -290 63 -147 -877 -861 -485 333 218 407
1803 407 131 -59 -522 -235 -49 -252 -390 -171 -128 50 471 1132 229 -562 -955 -684 -109 32 393 480 -22
1824 -22 -382 352 236 -207 -272 -408 -657 -489 402 1129 389 -518 -114 -498 -483 -245 524 97 -536 -283 616
1845 616 675 398 157 -589 -879 -406 259 732 515 447 357 57 103 499 354 191 -239 293 554 1022 1023 445
1867 445 151 -314 -72 242 418 655 745 438 696 684 1206 717 134 42 -44 584 1025 1401 1487 571 118 411
1889 411 528 759 479 494 533 411 1018 1253 990 419 157 197 374 738 1290 835 814 705 795 611 808 925
1911 925 216 154 301 708 924 1027 847 525 -7 47 305 597 96 365 39 284 344 414 464 -87 -424 -574
1933 -574 -355 79 454 737 56 -496 -385 -220 -42 -606 -705 -714 -567 -128 63 -187 -353 -1197 -1131 -976 -642
1954 -642 -205 -367 -456 -476 -510 -345 -408 -1053 -1330 -1310 -1484 -801 -489 -427 -398 -983 -1294 -1372 -1138 -1002 -1151 -955 -1070
1977 -1070 -964 -841 25 -544 -1221 -1435 -1465 -1337 -693 -546 -357 -464 -996 -1028 -632 -410 -1048 -1231 -1087 -820
1997 -820 -538 -10 118 -437 -807 -727 -807 -606 -287 -415 -396 -226 57 43 295 302 -450 -846 -102 -184 -42 582
2019 582 503 98 18 -39 138 40 -121 -181 252 510 696 855 591 -94 -131 -124 387 566 533 1001 566 700 576
2042 576 898 641 239 -29 219 87 822 1277 999 838 451 435 50 517 839 557 483 719 892 1035 1080
2063 1080 958 447 -34 57 582 752 579 781 597 686 234 853 788 -7 -81 129 338 574 884 1019 406
2084 406 -310 -90 198 402 399 120 423 73 397 703 516 286 -404 -493 -170 82 657 394 97 5 338
2105 338 233 -279 -185 203 -243 -404 365 474 365 173 59 -391 -519 109 231 144 66 204 227 -159 -93 140
2127 140 -403 -505 -333 82 374 14 511 145 -386 -364 121 -8 -49 60 -26 36 122 610 543 -204 -494 -378
2149 -378 -98 -69 337 276 217 -182 111 282 -8 -10 -4 -380 -368 144 330 366 -149 -112 -518 -702 -515 -8 -250
2172 -250 -366 40 -92 -43 -211 -106 -348 -915 -612 -457 64 -214 -46 -101 -456 -795 -474 -488 -334 -716 -725 -323
2194 -323 -145 -363 331 -176 -964 -837 -454 -759 -387 -274 -37 -566 -623 -421 -80 -707 -1061 -947 -936 -213 6
2215 6 -98 -391 -722 -688 -1000 -831 -379 -363 -539 -940 -367 -41 -53 -278 -390 -761 -935 -674 207 61 -462 -316
2237 -316 -113 -367 -252 -47 -82 -562 -546 -136 109 43 272 427 -62 -74 4 46 291 85 328 96 220 510
2259 510 691 699 111 -355 177 309 832 958 727 304 285 710 388 554 417 515 425 541 1097 1075 634 551
2281 551 410 387 121 688 835 953 863 688 603 1096 925 530 138 64 528 1061 1105 1146 1151 345 642 557 773
2304 773 869 465 310 533 423 781 959 756 66 -1 63 383 513 595 477 493 169 25 365 238 -362 29
2326 29 10 50 304 525 268 -76 -486 -304 -404 -153 -208 -192 -214 -242 -143 54 -280 -323 -559 -806 -437 -254 -22
2349 -22 15 -536 -822 -688 -623 18 -351 -658 -776 -449 -33 -288 -139 -110 -641 -932 -681 -681 -452 -465 -229 -155 -515
2372 -515 -461 -273 -462 -948 -956 -815 -814 -245 66 -162 -315 -646 -728 -559 -217 -341 -670 -33 -361 5 -227 -213
2394 -213 -352 -539 -694 -664 -50 107 31 -167 -70 -253 -66 -201 -165 -128 -261 -220 -157 41 98 50 -239 -33 -114
2417 -114 -242 -108 215 -14 -247 263 271 312 462 -136 -350 -481 -134 138 387 -97 301 -81 -55 -286 296
2438 296 -132 115 -50 -67 114 493 378 128 -313 -365 -248 65 10 157 -8 -45 -208 191 69 47 -357 28
2460 28 -231 -283 252 283 200 -191 29 188 67 46 187 -3 218 156 226 89 226 65 -223 -126 19 513 247
2483 247 333 282 -85 -87 13 153 154 304 -46 156 439 427 452 532 148 -160 -5 -39 -60 35 188 127 248 230 -33
2508 -33 562 69 -170 200 284 322 889 615 199 74 317 632 505 665 343 258 407 670 515 579 340 196
2530 196 -169 262 133 775 562 427 466 373 223 281 264 67 238 223 521 508 370 362 301 83 -78 372 21
2553 21 46 118 110 98 0 179 192 -187 -492 -246 201 18 41 -7 -40 -199 -379 -138 -220 -304 -352 -496 -185 -224 -113
2578 -113 37 -289 -567 -410 -710 -568 -393 -657 -533 -338 -354 -274 -555 -664 -748 -659 -652 -601 -139 -235 -264 -472 -647
2601 -647 -673 -641 -307 -246 -917 -721 -442 -259 -456 -488 -758 -654 -912 -488 -265 -40 -453 -520 -535 -352 -117 -467
2623 -467 -461 -864 -477 -162 15 219 -306 -121 -360 -831 -315 -411 -243 -386 -205 248 -360 -49 400 -238 -436
2644 -436 -226 81 29 130 271 88 120 33 -182 206 58 283 26 458 339 592 540 528 558 123 63 184
2666 184 347 523 507 -34 274 501 231 363 302 97 352 441 126 524 491 660 386 357 373 215 543 546 450
2689 450 396 792 541 439 210 226 21 -33 -65 367 278 363 49 77 449 794 393 -29 21 117 228 492 185
2712 185 320 20 134 -292 -81 -84 240 156 76 -88 18 193 101 -141 1 71 -54 364 100 283 -96 28
2734 28 247 -50 64 -98 5 -521 -101 -17 -37 107 -112 -212 -63 -313 -139 3 179 -143 -216 283 158
2755 158 -220 62 12 -347 -155 -219 78 367 49 -200 -56 -221 151 249 -287 -35 -5 -173 -67 -100 526 128
2777 128 16 -390 -155 304 239 197 -268 -23 -202 131 -84 -14 -261 -106 -162 -152 221 316 146 -97 -181 -354
2799 -354 -284 -281 36 91 -185 -81 -52 -88 57 -75 -134 -468 -261 -2 316 -35 -206 -286 -234 -136 25 -299 -390 -224
2823 -224 -549 -187 -302 189 -209 -425 -468 -157 -230 -224 -439 -332 -318 -506 -220 -34 -207 -529 -656 -428 -451 -123
2845 -123 -64 -126 -567 -353 -67 -140 -511 -76 -71 -524 -294 174 -280 -216 -424 -360 -425 -428 58 -116 -366 -405 -41 -128
2869 -128 17 -91 -48 -367 -154 -83 122 -125 85 -38 -77 -188 -122 -33 338 178 -146 250 12 160 446 384
2891 384 -281 150 339 -140 346 331 512 145 14 432 289 292 581 393 277 339 393 886 701 384 31 444
2913 444 178 629 377 365 119 294 594 421 207 458 196 126 494 603 477 402 484 533 225 256 184 37
2935 37 205 263 444 145 564 498 247 -140 114 11 233 331 124 312 127 -172 -12 111 1 -357 -74
2956 -74 180 -159 -301 -38 82 -295 -188 -243 70 -140 -100 129 -108 -9 -276 275 -24 -189 -430 -344 -511 -221
2978 -221 93 -206 8 -212 -482 -295 -390 -85 -326 -533 9 -123 6 216 -189 -349 -803 -646 -479 -56
2998 -56 -166 -258 -96 -504 -103 -175 -73 -295 -267 -479 -186 -312 -215 195 -123 -280 -364 -374 -475 -130 10 -312
3020 -312 -194 -91 -214 264 60 -356 23 -124 -9 -84 204 -79 159 -170 164 97 94 -99 -109 8 232 304
3042 304 120 194 17 -40 -268 199 291 41 -60 150 120 24 -41 -51 -75 -411 -365 118 170 39 -114 273 12
3065 12 45 -135 -103 -210 5 -140 246 -95 59 3 237 1 -27 184 -222 72 149 118 -30 3 197 145 85
3088 85 -308 194 2 -55 -144 12 -131 -185 -49 -73 -237 -172 35 78 -55 92 247 -270 11 -167 -250 -125 60
3111 60 -30 225 -50 104 -137 -287 -29 210 52 -242 31 179 1 185 -13 91 -146 57 -169 112 -7
3132 -7 129 194 261 143 414 289 72 68 -95 177 208 192 395 213 124 -168 4 73 286 320 -59 79 229 392
3156 392 240 260 256 72 258 498 245 446 62 378 322 459 -110 37 430 87 81 124 322 313 53 191 205
3179 205 -240 245 88 105 75 -88 309 119 354 109 -10 56 -217 14 -275 79 72 333 157 -294 11 26
3201 26 12 -189 92 -313 77 -99 -99 -131 -16 -460 -561 -266 -7 67 -236 -533 -106 -300 -391 -111 -286 35
3223 35 -404 -647 -449 -50 129 -329 -102 -196 -316 -244 -152 -72 -630 -327 -137 -228 -343 -324 -311 -341 157 -291 -106
3246 -106 -329 -101 -242 -124 -9 -80 -325 -306 -642 -85 -75 -18 269 146 -300 -465 -273 -142 102 -101 -150 -90
3268 -90 10 87 34 129 116 127 -165 -41 181 103 135 15 50 9 394 17 98 289 209 -124 -62 15 271 539 11
3293 11 -59 274 294 361 189 389 158 220 -98 295 240 143 -30 168 255 706 369 229 205 65 166 262 181 158
3317 158 441 133 325 -117 166 250 206 -74 -201 73 196 219 21 -390 88 30 -62 62 -48 -45 15 -117 -189
3340 -189 255 -72 57 46 -261 -16 -93 110 85 -114 -157 249 -434 161 24 51 -27 -168 -110 -168 10 -60 -23
3363 -23 -244 -179 163 -325 5 -15 -231 107 29 175 243 71 -130 -385 -127 -160 -43 -63 -139 -325 46 -178 -38
3386 -38 -191 -76 -101 -129 47 135 3 177 -3 107 -151 35 100 -96 347 50 32 77 38 59 -49 94 -68
3409 -68 -60 -37 104 192 183 215 -117 123 -32 208 43 34 60 34 237 30 197 8 -75 -66 -64 191 243 78 241 -156
3435 -156 126 193 78 33 -166 -51 204 243 54 100 298 -7 -112 112 29 -89 -238 -98 -52 -376 -106 32
3457 32 -60 -369 -121 -402 -452 175 -330 -88 -79 -49 -202 -99 -159 -501 -385 -96 -59 -495 -49 -62 -326 -263 -343 -203
3481 -203 -215 -193 -117 -355 -167 -52 178 -118 32 -385 -247 -178 -4 2 56 -64 -335 -22 65 -304 -203 56 -26
3504 -26 -77 -73 91 264 -162 -318 -195 -178 4 302 111 -115 247 277 246 -19 183 -108 -156 -69 264 267 131 429
3528 429 267 604 70 334 271 237 144 358 237 113 422 334 263 215 231 111 82 178 191 165 242 1 384 17
3552 17 179 -150 -61 429 290 289 365 364 59 -24 42 3 214 122 113 261 177 269 -126 80 -118 210 205 -17 355 193
3578 193 57 314 -20 -110 -56 -305 7 -220 -50 115 -287 30 -188 -140 -300 -169 -77 78 -271 -105 73
3599 73 44 -241 133 -83 -79 -219 -367 -48 -22 -20 -249 -99 -129 -295 53 -229 -344 -56 -173 -206 -154 -322 20
3622 20 -217 -32 -194 -359 68 -91 -114 -15 -173 25 -269 -13 67 -323 -338 -371 -148 -294 -134 -113 -232 -318 4
3645 4 -418 -75 -275 -115 -81 38 47 515 76 4 43 -137 -22 131 196 -54 -67 -42 -185 -30 84 3 19 5
3669 5 -1 277 158 45 439 164 268 242 193 -32 162 -136 151 328 121 139 -228 75 256 11 49 -210 263
3692 263 -83 149 -71 36 111 64 93 -136 -287 -187 -217 21 160 -60 43 81 -158 -291 246 9 222 117
3714 117 118 132 -53 -51 -12 -120 55 -113 -367 -5 -102 -100 -73 -43 -317 68 233 -41 42 79 144 -154 46 -140 -159
3739 -159 -234 -150 308 -93 -73 -20 -85 -138 -48 57 -3 29 -117 -34 -309 -13 -128 -35 82 -23 132 -50 1 -313
3763 -313 192 -9 247 362 223 -37 -71 116 181 -62 201 15 19 165 74 311 -163 -251 -243 115 33 270 41
3786 41 72 18 74 181 81 39 -81 514 120 104 106 61 154 234 107 -32 264 50 196 -72 38 -76 58 347
3810 347 344 27 290 203 -229 235 -92 26 115 223 182 155 87 -92 -57 205 80 62 -235 -284 -156 212 174 -141
3834 -141 -154 -18 -289 -61 -224 -115 206 -363 -281 -30 -315 -147 -59 -268 1 -279 -92 -140 -172 -201 -328 -27
3856 -27 -190 -206 -204 79 -69 22 58 -127 -290 -168 -364 -52 -41 -39 -340 -231 -261 -139 -326 -145 255 -75 119
3879 119 -39 -32 137 -218 -159 -193 -46 -61 138 66 38 21 -325 -281 33 -160 -154 100 313 136 -135 71 315 74
3903 74 285 92 -49 6 76 237 81 233 132 19 300 202 201 -37 79 -60 -81 76 -8 -11 136 -3 27 256
3927 256 225 -78 15 28 214 71 -100 -49 76 186 109 -15 257 208 159 119 -26 53 17 -96 30 56 47 243
3951 243 -396 -45 141 -14 111 -36 93 -8 -149 232 109 -9 -131 -11 -138 -283 -157 47 118 -65
3971 -65 -120 -178 146 39 -266 41 26 4 48 119 108 -136 212 205 -296 -278 -359 -160 -98 34 -89 -3 0 -305 -208 -12
3997 -12 -1 -47 37 -221 -98 -127 388 31 -141 -5 170 46 112 24 -129 -80 104 5 -276 77 143 317 20
4020 20 124 336 114 -180 42 339 -74 36 -53 293 263 146 9 159 119 230 15 -64 -5 194 -7 185
4042 185 -43 367 -61 224 57 -43 68 87 231 -89 338 -15 184 -36 -127 -14 -42 89 159 63 -231 57
4064 57 133 -103 215 -99 -123 205 -107 114 -71 -179 -66 137 -113 -116 -84 -46 -34 -108 -11 -339 167 -137 -119 -115
4088 -115 -340 77 -266 -308 -213 -223 -329 -139 48 30 -17 96 -13 67 -136 -227 12 -223 63 -483 -414 -255 -97
4111 -97 -36 -131 -396 -138 -62 -360 31 14 24 -108 -123 -196 -147 97 101 -111 119 -264 -18 -193 -68 -195 61 204
4135 204 -111 -44 -124 -42 -130 -13 -173 91 -31 0 -174 119 210 7 100 -132 -244 -83 200 238 50 146 567
4158 567 357 -143 141 50 181 26 -21 23 28 -21 84 172 179 15 148 -139 454 316 56 376 252 272 45
4181 45 181 279 -103 -147 134 -186 -10 -49 175 -28 -16 137 57 -24 -95 162 49 219 308 10 -258 2 49
4204 49 177 -129 -41 -112 -71 -11 -140 -208 -308 195 -130 -4 -60 -262 44 188 -119 -68 -241 -220 -181 173 -142
4227 -142 164 -108 139 -247 -85 -241 58 -289 162 -61 -108 -172 -212 -153 -221 39 -161 -244 -118 84 -66 -296
4249 -296 -135 59 10 -23 355 143 -293 38 -181 112 35 -64 -152 -304 -195 -228 35 -37 301 -115 139 114 -36
4272 -36 -8 -209 41 38 10 -60 21 27 41 -145 196 257 -4 139 163 -91 119 316 261 226 190 256 27 176 3
4297 3 -233 -29 73 329 -155 21 118 39 0 12 -50 375 116 -245 78 190 -39 -205 75 -386 236 185 155
4320 155 164 -7 141 123 57 -77 8 -118 -143 48 -200 63 -67 -27 -181 -54 -356 -102 -267 -57 -324 -39
4342 -39 -79 -116 -27 23 114 -180 -94 -344 -281 -247 -115 37 141 180 250 -115 -151 -3 -364 107 -98 -143 14 -30 169
4367 169 -466 10 -56 -113 -149 151 118 -141 197 66 268 -8 -121 5 133 54 13 3 135 -341 83 -277
4389 -277 33 -185 -204 -185 64 325 227 219 -72 95 174 202 -242 171 145 -74 42 32 -28 -83 -62 -13 50 166 323
4414 323 27 360 355 160 268 139 35 227 316 499 -34 115 33 262 270 310 -19 70 -170 11 111 188 -135
4437 -135 36 -26 299 18 -95 80 -83 257 74 -312 136 161 -18 58 -251 2 318 -60 78 -16 89
4458 89 -68 80 -61 70 -5 -160 235 47 31 -50 -90 -152 -254 -314 -161 -315 31 -292 153 8 -127 -324
4480 -324 -255 62 -137 -26 -130 -174 164 -253 -97 -106 -121 67 -14 -314 -127 -21 -77 -211 -329 -99 -224 114
4502 114 -68 -127 258 131 -100 -77 -93 -164 -8 -71 10 -14 5 94 5 6 193 28 -104 -93 -26 21 301 264 410
4527 410 170 -66 86 72 -80 99 100 146 38 279 165 -105 -109 12 291 -155 211 48 -36 184 -212 253
4549 253 -17 58 96 -49 166 8 132 -80 39 83 -62 -33 -26 119 -201 322 1 276 17 -48 -172 115
4571 115 279 89 153 152 241 106 146 -156 66 -53 -200 29 -99 151 148 0 235 178 -93 -187 13 132 -127
4594 -127 -124 135 -188 -245 -163 -83 26 -62 -42 136 64 -9 247 22 -41 -50 -74 106 460 142 -25 239 -105 -148 188
4619 188 317 86 -184 38 -223 -268 -276 -14 127 -112 -13 -134 -90 383 40 -12 -48 403 -203 212 -52 -18 148
4642 148 -52 69 161 148 17 -159 40 7 377 11 144 292 -66 -116 -118 -32 31 151 185 -104 -59 365 -173
4665 -173 -97 -159 132 -95 -79 -196 17 321 164 52 337 165 185 12 160 19 102 -37 222 -128 -228 -71
4687 -71 -72 184 35 163 196 155 189 189 178 184 -506 -6 -27 -251 -32 87 115 20 110 180 62 -72 -1 -271 232 -19
4713 -19 -197 -58 -19 258 196 -8 16 211 -208 183 -140 -206 -33 -14 59 -353 -272 -2 -172 -150 77 260 -33
4736 -33 135 32 104 -176 63 -123 -119 -101 259 242 -21 58 30 -75 149 -248 -61 -42 39 287 -35 240 -100
4759 -100 -219 99 214 165 85 -68 -142 -135 45 10 -110 202 55 230 -128 41 -100 40 -171 -19 -9 -107 313
4782 313 -2 237 98 -262 25 221 284 127 -139 240 -142 181 -157 60 227 111 132 88 271 -18 116
4803 116 146 100 -118 -31 82 218 118 -31 129 56 121 -17 -85 155 155 -162 160 -129 108 84 106 -42 -311
4826 -311 197 77 -11 -179 -154 85 -1 273 11 -11 172 -41 -150 -243 14 160 -164 -71 -47 103 -159 25
4848 25 83 -63 14 -114 -96 -117 -94 128 -71 -286 -46 -108 -365 99 -257 -41 -117 -9 374 232 366 -2 3
4871 3 67 433 -159 -124 90 -214 -22 9 -201 279 171 -36 -43 -81 9 -204 -103 64 -29 -376 -304 -95 85 -184
4895 -184 -143 207 101 -58 48 3 -51 439 -211 -88 99 35 -270 -26 -96 72 142 -143 -69 -142 67 -60 -55
4918 -55 154 29 -57 -8 65 97 -21 181 -111 390 157 20 -59 -53 226 -33 -72 104 209 -39 -112 -82 51 278
4942 278 144 -1 -75 235 -60 131 89 -109 -16 -2 32 123 177 -221 -200 28 161 237 -161 -96 88 100 28 -149
4966 -149 -98 19 12 180 125 -293 -380 124 141 134 50 129 -187 -96 -135 207 74 -187 -48 -144 160 104 -83 254 -152
4991 -152 -9 -66 6 169 -83 -139 -28 21 -83 -264 -71 21 -52 134 -214 88 529 -133 22 -147 -168 -237 -83
5014 -83 -10 -61 -138 -30 121 -71 179 106 187 207 -161 116 278 69 -31 156 123 24 82 -55 125 163 40 112
5038 112 444 30 -12 46 131 142 114 176 5 -130 -163 126 1 152 284 21 242 134 356 81 -32 -74 -97
5061 -97 36 -41 -33 31 -164 231 -105 -249 158 -186 80 -97 168 -43 -100 -345 116 46 162 47 -239 -23
5083 -23 -72 -60 -10 -19 -82 -73 8 115 -331 -155 -60 -179 170 -175 -231 -171 -51 -188 -72 5 -395 -2 -78 -118 105
5108 105 134 -115 22 -45 -22 86 -171 43 -137 -101 95 -279 -204 118 -146 -163 -168 69 25 93 119 3 -147 -116
5132 -116 -191 -253 -3 -228 12 76 -25 -350 -53 64 -37 -108 -92 -61 54 -187 85 175 -244 -174 33 -77 -36
5155 -36 115 105 0 -49 -257 20 11 147 101 98 -96 85 52 -82 461 105 -85 117 -33 -83 -16 121 79 -32
5179 -32 133 268 97 25 -57 125 20 33 54 58 232 -150 180 326 136 15 153 13 224 -236 -146 137 -1
5202 -1 66 -36 87 -184 -120 -102 -158 -74 29 50 -84 -74 33 106 -84 -128 147 -101 308 165 -25 48 103 -217
5226 -217 -134 131 333 -2 180 -220 -25 -30 -28 1 164 -52 -293 75 -35 -278 -207 -38 -274 -147 -13 -437
5248 -437 -70 -107 -187 7 -279 -117 -40 70 -113 215 -8 56 -269 -22 -81 31 -72 97 -152 -98 -224 118
5270 118 127 15 69 122 29 -104 145 -182 73 227 265 -275 135 269 -272 115 -188 40 288 -7 337 -56
5292 -56 12 113 227 26 53 233 91 -88 -172 -107 -268 56 193 -146 116 -90 -107 -78 250 -63 -20 187 -338
5315 -338 157 213 -59 105 -137 272 -230 -98 28 57 404 -193 -218 -101 -10 96 -89 -94 -61 -178 127 -170
5337 -170 -32 -44 -113 101 -114 187 88 -230 -32 -49 -186 -135 213 -72 99 107 52 -147 -356 141 -93 -164 305
5360 305 -194 76 -168 -362 176 -117 143 1 -61 31 66 111 -265 -42 166 -53 51 -176 102 81 85 92 -28
5383 -28 -204 -74 94 -77 165 46 -156 -51 83 -218 210 -13 26 118 198 2 416 12 369 13 -34 82
5405 82 49 275 317 224 -60 191 59 106 4 -12 -5 -133 -10 21 172 -174 -98 140 -27 169 -66 96 118 -187
5429 -187 148 157 -111 -239 28 99 -12 103 472 60 112 131 -121 6 -28 292 -183 -107 -143 -54 -58 -120 143 32
5453 32 -7 203 -131 126 -139 -19 -160 39 -218 -1 13 -70 -76 -112 51 -217 101 -20 -229 -379 33 15 175
5476 175 -331 14 -150 -209 244 258 317 -388 25 -172 16 -73 130 -198 -174 -36 -201 7 29 -17 -47 38 77
5499 77 -46 0 -186 -152 -211 -308 -333 83 -122 -98 11 0 103 -183 179 -90 14 -17 -18 214 141 85 -26 91
5523 91 -342 -169 152 -102 -217 154 248 116 -118 237 -51 104 -61 -140 69 -111 118 225 -54 164 -289
5544 -289 136 80 -267 -161 219 -77 -64 136 -213 301 -104 -156 -99 85 393 498 39 -206 205 15 -69 119
5566 119 118 127 -59 -49 -193 -127 57 44 -133 119 186 182 -241 94 -168 -344 -100 -432 148 -39 76 -27 198
5589 198 40 28 93 -148 149 -191 -73 -592 -6 -32 -108 -213 -83 12 -399 -35 -12 -37 8 -40 122 -117 -31
5612 -31 -111 52 259 -207 52 156 55 -52 209 -105 156 72 -122 21 -48 -223 117 -14 431 -199 -9
5633 -9 203 14 -89 -106 111 163 -102 -37 261 356 135 243 45 66 146 -13 -44 -86 87 -87 126 174 -337 -133
5657 -133 208 -155 53 104 146 7 54 -158 105 18 -218 -192 64 -253 215 299 217 19 -73 164 149 134 -45
5680 -45 45 -380 38 -2 -272 245 -366 140 -33 116 -25 186 -114 170 150 -228 171 -213 220 30 203
5701 203 176 -200 -147 114 89 52 79 23 134 -14 -133 -55 -362 -158 257 46 -27 -96 202 274 2 19 -229 -40
5725 -40 -92 -123 -80 88 108 96 94 52 -127 -33 63 102 -294 -39 119 -8 -20 -187 52 85 -50 -268 -276 95 83 -139
5751 -139 -112 -115 -294 -84 153 347 10 -25 0 -130 -50 18 -36 11 -45 -189 22 1 -180 -88 259 -132 -119 114
5775 114 144 35 -32 -148 109 25 131 83 54 17 168 -280 -72 94 -39 -192 18 203 16 -48 279 -82
5797 -82 -173 -33 -82 215 183 -4 91 169 208 100 106 275 35 79 108 385 164 399 0 145 -65 219 -115 31
5821 31 -53 336 -125 100 -93 -21 180 206 -40 17 -115 191 -156 -25 -145 -50 -36 -56 48 82 220 73 -110
5844 -110 -152 -231 -3 146 93 208 -266 185 162 73 -133 4 134 22 315 -44 3 66 -169 -47 -284 -183
5866 -183 100 -59 34 -138 -126 -73 -120 191 117 -196 -22 -72 105 -19 112 136 196 -213 11 161 -80 180 -34
5889 -34 -128 -104 84 22 -180 -20 83 106 -213 16 120 -43 78 -122 307 215 -287 -130 181 276 10 -21 129
5912 129 296 -64 -111 -6 388 14 146 144 -72 -65 -49 26 93 -13 -187 -33 10 135 322 -38 237 -40 -68
5935 -68 31 -243 166 50 211 -54 -49 285 -75 -52 -167 -71 66 -38 -198 -107 139 6 -238 192 -50 17 285
5958 285 -113 -75 100 -299 19 -67 -43 -96 -146 -2 89 32 26 190 -124 -172 -291 217 -73 168 186 -101 -103 101
5982 101 -13 68 -193 148 28 -32 -258 -333 110 88 57 -200 -47 -38 -231 -108 -79 36 7 120 -60 -97 35
6005 35 148 101 25 -311 73 -161 -99 -111 -68 -158 -252 155 -73 -228 58 -132 114 -19 -209 -27 -52 217 267
6028 267 63 251 141 448 -111 33 45 -157 124 50 243 327 175 -112 21 -161 117 81 172 -81 141 -64
6050 -64 87 16 7 57 -148 -63 89 185 56 110 -361 -96 125 7 -94 150 29 243 -137 -24 -160 89 -165
6073 -165 -113 -181 349 253 26 47 -169 -63 -36 63 130 374 -43 -32 216 27 156 66 57 392 -143 126 -117 154
6097 154 119 139 52 -67 -307 11 26 -52 141 -25 -54 -53 56 353 37 80 -102 -49 66 -43 -258 -198 305 177
6121 177 -225 -134 -183 -57 -98 -241 82 -73 -250 -186 9 22 -160 -88 240 -28 -32 -41 20 122 -87 193 16 -54
6145 -54 -126 104 165 -78 -67 -1 -237 343 42 222 132 7 -207 134 121 315 -85 213 116 -9 -328 -92 257
6168 257 -117 287 -125 -213 -29 45 -212 -34 104 214 -45 39 -60 191 -173 -77 243 166 167 -335 -70 -5 167
6191 167 126 88 -77 -190 -78 91 80 -24 -142 295 -84 80 182 -41 -96 -113 -104 -161 145 -1 34 68 -111
6214 -111 -191 -256 -43 140 -352 279 128 -74 250 -9 -23 -2 -42 1 72 3 233 -197 -135 -15 -90 -177 1 54
6238 54 126 -146 -151 253 -113 -28 272 -98 -391 -86 126 227 -115 -217 5 16 271 -210 -159 -156 -62 -235 -71
6261 -71 96 8 -111 -147 -187 139 -35 52 24 106 297 -41 16 278 -256 -39 -21 308 79 16 -53 394 1 305
6285 305 -132 -57 -176 -22 -187 114 -131 125 402 -84 201 -75 -10 102 -197 155 -15 -146 47 -134 -142
6306 -142 -296 26 -46 124 92 -39 0 60 182 -29 63 -65 -89 87 118 22 -132 0 252 69 221 132 179
6329 179 288 -49 -46 67 -32 83 53 -105 44 -30 333 318 -105 47 209 -207 -199 -65 224 117 -294 64 -40
6352 -40 112 -70 187 -157 -93 -68 17 43 -354 -167 -347 -14 -265 -72 -121 -90 -10 173 100 117 30 -165 217 16
6376 16 -106 2 -233 -26 -25 3 324 140 42 180 100 -179 -53 83 -113 -25 71 41 -89 -43 -46 308 -53 5
6400 5 126 14 -14 -40 371 128 -299 230 69 109 114 171 -6 -194 29 300 212 -243 35 -93 132 -348 196
6423 196 8 54 152 -2 -213 57 -151 146 61 -153 -151 -130 283 -122 86 283 159 120 140 151 54 37 -11 49
6447 49 -261 123 131 68 226 -50 -41 73 83 -132 130 -70 -165 91 -151 134 280 165 114 6 -247 -21 -59
6470 -59 -48 -176 -115 -142 -16 -197 32 -43 58 -122 -71 -94 379 162 -206 66 -118 59 -167 104 -66 170
6492 170 205 355 55 -181 22 -186 -116 60 63 -121 -225 -129 276 -40 116 -80 -20 -22 -59 -92 90 -31 -25 95
6516 95 134 -246 -90 95 -104 -184 -20 -83 84 185 -91 37 -95 -366 -39 83 -182 -142 -132 -144 75 -206
6538 -206 -20 58 -158 -214 -3 152 -4 -198 106 -121 200 -25 19 -137 -148 101 127 202 -248 89 65 26 37
6561 37 -60 -176 175 73 83 -140 150 49 -21 2 113 -83 111 -241 -116 12 -193 -38 70 75 -39 -55 -180
6584 -180 223 195 -151 -13 288 112 90 43 -90 -109 -221 -220 87 -256 121 -225 -383 -41 -34 38 290 12 -125
6607 -125 -60 -212 109 -35 -138 377 -184 -140 -266 -147 -16 -20 111 -265 150 373 155 54 -225 -41 -186
6628 -186 -187 174 -54 225 -55 -289 -154 -200 -61 115 114 146 31 321 23 -151 -58 164 119 -153 -170 -27 -52
6651 -52 -147 -97 -342 9 -43 -28 -176 -24 91 243 79 -102 44 94 104 51 28 17 -96 -270 109 59 -252 93
6675 93 292 67 331 232 64 32 -153 -27 12 -232 -173 262 -46 -82 39 95 -60 -19 -186 -30 75 -124 -228
6698 -228 192 -138 39 -35 -42 209 -149 86 -384 104 -196 140 -9 152 -193 -66 60 76 164 -147 10 181
6720 181 27 -150 -196 11 53 -158 5 -77 207 -47 -38 -76 86 226 -86 -118 -128 -32 75 193 158 62 145 -131
6744 -131 -59 97 46 -234 6 -83 -246 -254 -211 -160 -55 29 102 7 -103 121 122 -125 -187 114 59 -149 5 185 57
6769 57 -288 -88 33 -21 -13 236 -63 56 138 -209 48 -9 49 -111 214 199 120 98 23 -154 91 369 178 99
6793 99 -178 -4 -214 177 47 35 88 222 2 112 57 106 58 -157 20 309 53 -1 29 -140 158 14 -80
6816 -80 125 40 0 158 86 184 80 -10 118 57 -132 94 117 -83 -262 144 -9 180 2 128 121 14 -125
6839 -125 73 126 112 -308 -19 103 -17 35 222 176 95 169 96 -60 93 12 -108 254 407 -88 -35 50 -234
6862 -234 -82 -289 280 54 103 59 12 -115 -275 -12 34 62 -97 18 -34 276 -101 -208 205 100 -34 90
6884 90 43 -30 -65 11 110 352 -147 222 -45 -221 74 480 -193 225 314 10 98 -173 -147 -304 -108 -292 -3
6907 -3 149 3 57 130 -104 -78 -20 55 -199 6 -142 102 49 156 229 -174 -82 29 130 28 93 -32 214 191
6931 191 150 188 -204 -46 -59 71 327 -72 94 53 -167 100 11 143 -163 -141 76 176 423 -225 7 -97
6953 -97 -379 -158 57 -74 127 24 -16 10 -163 -36 -23 -212 -139 -194 81 148 -23 -265 -81 -19 -163 76 -233
6976 -233 86 -50 82 174 56 47 115 -119 109 303 -254 -153 17 -134 130 -63 -129 147 356 -26 -82 23
6998 23 91 72 -27 -233 95 -189 -322 -28 -27 164 -31 -249 113 -43 -36 219 -298 76 -125 128 44 -50 330
7021 330 -11 104 -28 173 -108 199 -25 -1 21 -165 11 7 -62 -85 102 72 138 -165 81 164 -281 96 -262
7044 -262 -83 -66 296 -65 -211 -241 -50 80 -183 22 -33 -4 -44 -65 -186 -8 -28 -251 -98 346 62 7 199
7067 199 26 -116 156 189 27 -127 -107 -150 13 -64 129 -114 -14 103 -136 -52 221 67 59 38 45 -155 -92 251
7091 251 -115 -22 209 -37 44 -201 -107 36 -65 -325 109 178 39 -279 -335 40 154 -101 -10 -176 59 156
7113 156 142 -226 -231 27 -174 209 87 -45 -20 126 142 -281 255 -6 -305 -115 79 -183 51 180 32 230
7135 230 -6 122 185 -175 -122 -5 -86 40 -87 -57 -309 -136 39 -187 -96 77 -79 46 -70 -115 305 -281
7157 -281 -13 -281 -290 135 -229 -73 450 137 -99 -49 -159 95 36 -39 -201 134 -136 -13 200 -96 -116 -155
7179 -155 129 -72 217 244 40 -209 124 -83 -68 172 30 -90 278 91 -7 48 303 44 59 -119 -128 -63 -182
7202 -182 35 32 32 130 -143 -178 177 46 84 -53 -122 222 20 -72 -449 -84 140 159 429 -360 217 -66 1 43
7226 43 39 -81 -239 31 -124 -42 -303 109 303 167 181 -214 73 -105 64 122 -238 -89 -71 -173 -40 133
7248 133 -73 10 -49 -68 -115 226 -279 152 95 264 -2 -153 -64 -130 260 403 161 -62 -260 48 335 127
7270 127 105 403 -241 -149 62 117 84 102 276 -40 -153 -117 -82 -35 -25 156 -8 64 10 -120 -116 -119 -25 -142 37
7295 37 -326 343 143 -117 18 14 -192 -168 18 -26 -176 65 202 280 217 -71 241 146 63 -11 142 47 -97 102
7319 102 -310 59 46 -7 -110 -91 44 129 -17 -81 59 72 48 -91 92 -73 -102 -147 119 -31 -65 -374 62
7342 62 215 -56 144 -105 235 23 -48 -34 -206 198 153 280 114 -50 -19 258 216 -309 92 -281 168 86
7364 86 -95 -14 -215 -13 79 155 18 -53 -265 46 225 -3 -119 -3 -123 8 8 -31 35 -284 102 39 208
7387 208 69 138 79 -163 87 -76 -237 -185 -54 178 -344 123 -35 153 -156 -73 -214 -25 262 235 49 -215
7409 -215 -10 213 20 -221 81 29 313 -152 20 -72 -91 -3 -60 -131 206 314 145 3 -132 178 -372 -78
7431 -78 -14 -56 -62 81 -73 137 -156 228 163 214 -158 191 127 415 204 -66 44 -23 -230 6 149 -104 3
7454 3 -154 320 -188 272 42 -233 84 -159 72 -135 -241 236 -24 -58 76 -78 -172 352 -200 -153 -24 91
7476 91 255 217 -15 53 2 38 202 -60 -174 -192 114 334 83 -235 -85 170 -13 -369 -98 141 -3 180
7498 180 109 -215 215 341 -5 -206 4 -110 -79 349 114 -71 95 121 258 -213 11 -29 -33 -1 98 106 112 -221
7522 -221 -397 319 119 230 -46 -274 -169 -208 -42 -74 -14 -138 26 19 -93 60 -76 -409 -109 141 82 -143
7544 -143 0 42 -27 317 108 -147 71 -182 -103 108 62 -186 223 -6 -237 -109 -45 -106 -216 27 49 -138
7566 -138 96 65 -96 118 -182 262 -154 -5 -10 145 235 -165 -154 390 -135 -6 217 101 -292 -107 -86 91
7588 91 268 -86 -25 -53 151 -101 125 68 -53 -231 -324 91 327 190 -172 -1 -65 125 -173 107 68 -65
7610 -65 121 98 -211 -66 -252 -46 153 9 28 -148 -58 -72 2 -214 215 118 -78 -213 123 60 -303 -391 -44
7633 -44 -54 110 22 175 -23 62 -185 -77 49 78 20 -160 -137 -138 -158 199 -98 -245 -74 -78 156 134 -16 174
7657 174 167 -314 92 -185 -122 2 132 -115 -13 72 136 -157 52 30 86 38 86 -37 493 -84 -414 -26 -49
7680 -49 -101 143 -146 96 -64 164 -37 -232 4 -61 -58 -301 -70 -49 -155 74 -91 170 153 -27 -124 -437 1
7703 1 -84 65 161 54 212 258 130 115 -295 -88 214 130 -67 -154 88 -265 -66 151 -21 -436 173 36 121
7726 121 202 77 -168 26 -299 -131 -120 88 -177 23 21 156 -84 -48 118 -173 260 -100 -115 264 -81 178
7748 178 -53 -205 203 -126 30 -188 265 -206 259 224 7 89 105 447 42 32 -353 145 -42 -6 -33 -27 97
7771 97 192 208 154 -107 -46 72 133 -3 -138 -90 109 -134 -295 -68 3 -50 -49 253 228 -74 -35 187 26 187
7795 187 44 -111 -107 132 176 -205 -97 -58 146 50 106 51 -116 -40 47 82 87 38 114 393 -169 -69 91 -63 -70
7820 -70 46 -94 112 -77 68 -45 149 -22 147 -331 -4 -107 -103 15 -55 -25 90 452 -196 -44 139 -56
7842 -56 -79 197 -10 -67 -189 -147 64 15 -41 -13 106 148 17 10 67 -27 -470 -78 -178 -21 -166 -120 -65 -177 46
7867 46 89 410 -139 20 118 255 431 89 -81 10 -88 -94 129 -74 282 -91 -66 155 -185 161 -2 82 318
7890 318 62 -19 -67 102 194 -84 36 78 85 -123 -8 -334 -74 -6 -66 -92 -159 41 113 18 -30 4 -35 326 179
7915 179 199 311 175 -13 -77 1 -257 -28 48 -271 -30 -41 96 -143 -54 -64 -33 108 -13 88 -126 82 -92
7938 -92 -30 7 -68 -60 -204 3 40 -52 346 -52 197 239 -176 -29 -114 128 268 53 210 -115 373 139 136 222
7962 222 168 309 -267 -98 -216 125 176 -218 -243 151 -84 -77 41 209 40 71 -106 11 454 133 180 73
7984 73 26 -203 98 23 146 94 -102 -23 -153 -12 -127 15 119 -282 246 -159 -190 85 -9 271 -189 -194 -187 250
8008 250 90 -140 132 -28 -143 268 71 -470 -7 68 48 38 -101 188 -11 181 159 19 106 -97 40 210
8030 210 -38 -34 251 -126 127 33 13 237 132 205 -330 -36 -115 80 227 77 -84 -171 -181 114 -128 -16 129
8053 129 160 -108 150 -79 -84 284 150 53 9 412 322 -152 264 -93 68 81 -106 65 -9 -67 -153 -184 84 209
8077 209 -4 430 106 -114 524 -141 231 -113 93 -114 -185 -111 180 30 -199 262 142 -153 -77 -202 -102
8098 -102 2 -83 158 -48 -240 167 184 -11 220 33 8 41 5 163 -188 46 246 22 20 124 121 147 -76
8121 -76 -151 -4 54 406 -179 2 148 -81 49 -23 329 19 15 11 25 85 333 -211 -228 -39 121 93 61 -63
8145 -63 -68 0 -21 -67 -41 -84 204 82 -143 -149 -210 -54 -71 -175 11 149 -191 176 -254 -118 159 -27 -157 168
8169 168 505 -20 -169 -142 -9 16 -11 -49 203 152 67 287 48 -243 70 30 -41 58 -107 136 52 66
8191F6
##END NTUPLES=NMR FID
##END=
