##TITLE=1H_SR3H
 D2O, 8 sc, 
 8.04.2021
##JCAMPDX= 6.0         $$ Bruker NMR JCAMP-DX V2.0
##DATA TYPE= NMR FID
##DATA CLASS= NTUPLES
##ORIGIN= UXNMR, Bruker Analytische Messtechnik GmbH
##OWNER= root
$$ XWIN-NMR		Version 3.5
$$ Thu Apr  8 14:25:08 2021 Russian Standard Time (UT+4h)  she@DPX200
##.OBSERVE FREQUENCY= 200.131506
##.OBSERVE NUCLEUS= ^1H
##.DELAY= (6, 6)
##.ACQUISITION MODE= SIMULTANEOUS
##.ACQUISITION SCHEME= undefined
##.AVERAGES= 8
##.DIGITISER RES= 18
##SPECTROMETER/DATA SYSTEM= spect
##.PULSE SEQUENCE= zg30
##.SOLVENT NAME= DMSO
##.SHIFT REFERENCE= (INTERNAL, DMSO, 0, 15.7039)
##AUDIT TRAIL= $$ (NUMBER, WHEN, WHO, WHERE, WHAT)
$$ ##TITLE= Audit trail, XWIN-NMR		Version 3.5
$$ ##JCAMPDX= 5.01
$$ ##ORIGIN= Bruker BioSpin GmbH
$$ ##OWNER= she
$$ F:/spectra/data/she/nmr/H-F/1/audita.txt
$$ ##AUDIT TRAIL=  $$ (NUMBER, WHEN, WHO, WHERE, WHAT)
(   1,<2021-04-08 14:24:07.35 +0400>,<she>,<DPX200>,
      <created by zg, POWCHK disabled, PULCHK disabled
       configuration hash MD5:
       00 E9 B6 7A A2 85 ED C7 34 08 36 98 17 FE 4E 26
       data hash MD5: 16K
       D2 BA AF D2 D9 9C 20 08 B2 B8 B8 9F 74 5F D7 B4>)
$$ ##END=
$$ 
$$ hash MD5
$$ C6 3B 89 F2 64 0D B6 CF 21 61 54 CD F2 7B 63 CB
##$RELAX= 
##$RELAX= 
##$RELAX= 
##$RELAX= 
##$RELAX= 
##$RELAX= 
$$ Bruker specific parameters
$$ --------------------------
##$DU= <F:/spectra>
##$EXPNO= 1
##$NAME= <H-F>
##$PROCNO= 1
##$TYPE= <nmr>
##$USER= <she>
##$AMP= (0..31)
100 100 100 100 100 100 100 100 100 100 100 100 100 100 100 100 100 100 
100 100 100 100 100 100 100 100 100 100 100 100 100 100 
##$AQSEQ= 0
##$AQ_mod= 1
##$AUNM= <au_zg>
##$AUTOPOS= <>
##$BF1= 200.13
##$BF2= 200.13
##$BF3= 200.13
##$BF4= 200.13
##$BF5= 200.13
##$BF6= 200.13
##$BF7= 200.13
##$BF8= 200.13
##$BYTORDA= 1
##$CFDGTYP= 0
##$CFRGTYP= 5
##$CHEMSTR= <none>
##$CNST= (0..31)
1 1 145 1 1 1 1 1 1 1 1 1 1 1 1 1 1 1 1 1 1 1 1 1 1 1 1 1 1 1 1 1 
##$CPDPRG= <>
##$CPDPRG1= <>
##$CPDPRG2= <>
##$CPDPRG3= <>
##$CPDPRG4= <mlev>
##$CPDPRG5= <mlev>
##$CPDPRG6= <mlev>
##$CPDPRG7= <mlev>
##$CPDPRG8= <mlev>
##$CPDPRGB= <>
##$CPDPRGT= <>
##$D= (0..31)
0 1.2 0 0 0 0 0 0 0 0.06 0 0.03 0 0 0 0 0.0002 0 0 0 0 0 0 0 0 0 0 0 0 
0 0 0 
##$DATE= 1617877446
##$DBL= (0..7)
120 120 120 120 120 120 120 120 
##$DBP= (0..7)
150 150 150 150 150 150 150 150 
##$DBP07= 0
##$DBPNAM0= <>
##$DBPNAM1= <>
##$DBPNAM2= <>
##$DBPNAM3= <>
##$DBPNAM4= <>
##$DBPNAM5= <>
##$DBPNAM6= <>
##$DBPNAM7= <>
##$DBPOAL= (0..7)
0.5 0.5 0.5 0.5 0.5 0.5 0.5 0.5 
##$DBPOFFS= (0..7)
0 0 0 0 0 0 0 0 
##$DE= 6
##$DECBNUC= <off>
##$DECIM= 32
##$DECNUC= <off>
##$DECSTAT= 4
##$DIGMOD= 1
##$DIGTYP= 9
##$DL= (0..7)
0 120 120 120 120 120 120 120 
##$DP= (0..7)
150 150 150 150 150 150 150 150 
##$DP07= 0
##$DPNAME0= <>
##$DPNAME1= <>
##$DPNAME2= <>
##$DPNAME3= <>
##$DPNAME4= <>
##$DPNAME5= <>
##$DPNAME6= <>
##$DPNAME7= <>
##$DPOAL= (0..7)
0.5 0.5 0.5 0.5 0.5 0.5 0.5 0.5 
##$DPOFFS= (0..7)
0 0 0 0 0 0 0 0 
##$DQDMODE= 0
##$DR= 18
##$DS= 0
##$DSLIST= <SSSSSSSSSSSSSSS>
##$DSPFIRM= 0
$$ [...]
##$SUBNAM2= <"">
##$SUBNAM3= <"">
##$SUBNAM4= <"">
##$SUBNAM5= <"">
##$SUBNAM6= <"">
##$SUBNAM7= <"">
##$SUBNAM8= <"">
##$SUBNAM9= <"">
##$SW= 16.9725357007746
##$SWIBOX= (0..15)
0 0 2 0 0 0 0 0 0 0 0 0 0 0 0 0 
##$SW_h= 3396.73913043478
##$TD= 16384
##$TD0= 1
##$TE= 0
##$TE2= 300
##$TE3= 300
##$TEG= 300
##$TL= (0..7)
0 120 120 120 120 120 120 120 
##$TP= (0..7)
150 150 150 150 150 150 150 150 
##$TP07= 0
##$TPNAME0= <>
##$TPNAME1= <>
##$TPNAME2= <>
##$TPNAME3= <>
##$TPNAME4= <>
##$TPNAME5= <>
##$TPNAME6= <>
##$TPNAME7= <>
##$TPOAL= (0..7)
0.5 0.5 0.5 0.5 0.5 0.5 0.5 0.5 
##$TPOFFS= (0..7)
0 0 0 0 0 0 0 0 
##$TUNHIN= 0
##$TUNHOUT= 0
##$TUNXOUT= 0
##$USERA1= <user>
##$USERA2= <user>
##$USERA3= <user>
##$USERA4= <user>
##$USERA5= <user>
##$V9= 5
##$VALIST= <valist>
##$VCLIST= <CCCCCCCCCCCCCCC>
##$VD= 0
##$VDLIST= <DDDDDDDDDDDDDDD>
##$VPLIST= <PPPPPPPPPPPPPPP>
##$VTLIST= <TTTTTTTTTTTTTTT>
##$WBST= 1024
##$WBSW= 4
##$XGAIN= (0..3)
0 0 0 0 
##$XL= 0
##$YL= 0
##$YMAX_a= 289493
##$YMIN_a= -300938
##$ZGOPTNS= <>
##$ZL1= 120
##$ZL2= 120
##$ZL3= 120
##$ZL4= 120
##$ABSF1= 10
##$ABSF2= 0
##$ABSG= 5
##$ABSL= 3
##$ALPHA= 0
##$AQORDER= 0
##$ASSFAC= 0
##$ASSFACI= 0
##$ASSFACX= 0
##$ASSWID= 0
##$AUNMP= <proc_1d>
##$AZFE= 0.1
##$AZFW= 0.1
##$BCFW= 1
##$BC_mod= 2
##$BYTORDP= 1
##$COROFFS= 0
##$CY= 11.3945322036743
##$DATMOD= 1
##$DC= 2
##$DFILT= <>
##$DTYPP= 0
##$F1P= 15.9154993809931
##$F2P= -4.1035820241983
##$FCOR= 0.5
##$FTSIZE= 0
##$FT_mod= 4
##$GAMMA= 1
##$GB= 0.15
##$INTBC= 1
##$INTSCL= 1
##$ISEN= 128
##$LB= 0.24
##$LEV0= 0
##$LPBIN= 0
##$MAXI= 10000
##$MC2= 0
##$MEAN= 0
##$ME_mod= 0
##$MI= 1.114404
##$NCOEF= 0
##$NC_proc= 0
##$NLEV= 6
##$NOISF1= 3.799351
##$NOISF2= 2.8
##$NSP= 1
##$NTH_PI= 0
##$NZP= 0
##$OFFSET= 15.70392
##$PC= 1
##$PHC0= -11128.08
##$PHC1= 16.40092
##$PH_mod= 1
##$PKNL= yes
##$PPARMOD= 0
##$PSCAL= 0
##$PSIGN= 0
##$REVERSE= no
##$SF= 200.130013532006
##$SI= 16384
##$SIGF1= 3
##$SIGF2= 2
##$SINO= 400
##$SIOLD= 16384
##$SREGLST= <1H.CDCl3>
##$SSB= 0
##$STSI= 0
##$STSR= 0
##$SW_p= 3612.71676300578
##$SYMM= 0
##$S_DEV= 0
##$TDeff= 0
##$TDoff= 0
##$TI= <>
##$TILT= no
##$TM1= 0
##$TM2= 0
##$TOPLEV= 0
##$USERP1= <user>
##$USERP2= <user>
##$USERP3= <user>
##$USERP4= <user>
##$USERP5= <user>
##$WDW= 1
##$XDIM= 8192
##$YMAX_p= 0
##$YMIN_p= 0
$$ End of Bruker specific parameters
$$ ---------------------------------
##NTUPLES= NMR FID
##VAR_NAME=  TIME,          FID/REAL,        FID/IMAG
##SYMBOL=    X,             R,               I
##VAR_TYPE=  INDEPENDENT,   DEPENDENT,       DEPENDENT
##VAR_FORM=  AFFN,          ASDF,            ASDF
##VAR_DIM=   8192,          8192,            8192
##UNITS=     SECONDS,       ARBITRARY UNITS, ARBITRARY UNITS
##FACTOR=    0.0002944,     1,               1
##FIRST=     0,             0,               0
##LAST=      2.4114304,     0,               0
##MIN=       0,             -300938,         0
##MAX=       2.4114304,     289493,          0
$$ Real data points
##PAGE= N=1
##DATA TABLE= (X++(R..R)), XYDATA
$$ [...]
$$ plain form
1779 168 115 387 416 -397 275 -132 252 424 -235 63 38 -424 220 -79 173 -54 -330 365 -382 437 36
1800 36 -157 137 -462 293 102 -119 196 -458 -41 -127 -43 158 38 -104 -58 -289 261 268 -365 -342 -121 149
1822 149 62 165 180 -423 -231 -114 183 340 -103 -104 -286 57 297 151 81 96 -181 72 -126 283 80 125
1844 125 -34 -241 398 234 -78 64 -111 -93 -20 12 37 -43 -370 -138 68 287 195 -65 -218 -94 40 224
1866 224 289 -40 -436 -226 224 84 71 -119 -367 -271 121 253 118 113 -245 -267 -4 163 126 -90 -450 -340
1888 -340 -51 133 304 375 -276 -433 73 16 229 -77 244 -48 63 420 10 179 34 22 -49 173 164 88
1910 88 -382 -71 142 -140 230 78 -185 -197 -72 48 128 362 -170 -262 153 -83 -171 59 -119 31 3 102
1932 102 436 372 118 -476 158 76 145 190 -229 31 -122 167 381 176 -223 -129 -125 68 177 111 21 -453 -182
$$ packed form
1779A68n3K72K9q13O72m07L84J72o59K98k5m62O44k99K52k27k76O95p47Q19m01
1800C6j93K94n99P55j91k21L15o54M17q6Q4K01j20j42M6k31N50Po33K3K21K70
1822A49q7J03J5o03J92J17K97J57m43jj82L43K40j46p0J5k77K53j98M09k03M5
1844A25j59k07O39j64l12J42j75J8P3L2K5q0l27K32K06K19r2k60j53J24J34J84
1866B24O5l29l96K10M50j40j3j90k48R6L92J32j35nl58k2K63J67l7k16l60J10
1888c40K89J84J71P1o51j57N06n7K13l06L21k92J11L57m10J69j45j2p1K22rp6
1910H8m70L11K13k82L70j52k63j2J25J20Q0K34n32r2M15k36q8K30j78J50k8R9
1932A02L34o4k54n94O34q2O9M5m19K60j53K89K14k05l99R4MJ93J09o6r0m74K71
$$ plain form
1955 -182 -61 238 251 268 -145 25 46 276 117 77 -195 -276 104 14 247 465 -158 0 -10 303 544 -113
1977 -113 -105 11 34 168 91 -152 -75 -106 56 392 234 -79 53 -306 -175 264 210 8 -152 -174 -204 185 98
2000 98 -235 -190 16 -57 70 323 344 5 41 96 77 217 -93 -21 -39 -46 -77 331 -64 4 -209 -142 266 307 6
2025 6 -321 -126 -378 101 325 120 -173 -394 -223 182 16 496 -130 -352 -265 101 348 280 -221 -328 -333 121
2047 121 219 112 64 -399 8 50 115 178 -181 -151 141 -175 325 -23 207 -178 -194 111 10 96 -151 -464 -16
2070 -16 119 90 65 -241 -86 -361 -102 483 187 70 -213 9 1 147 386 -63 -317 -226 -183 218 61 -7 -70
2093 -70 -258 275 70 377 284 -351 -247 -4 145 408 -4 -121 -148 -251 246 168 195 -139 -375 -51 64 342
2115 342 13 -343 73 -272 29 275 -224 109 -212 -53 156 138 171 12 -135 -29 -151 421 63 -110 -95
$$ packed form
1955a82J21K99J3J7m13J70K1K30j59m0k72q1L80r0K33K18o23J58j0L13K41o57
1977a13QJ16K3J34p7k43P7l1J62L36j58l13J32l59J31M39n4k02j60k2l0L89q7
2000I8l33M5K06p3J27K53K1l39L6N5j9J40l10P2j8pl1M08l95O8k13O7M08M1l01
2025Fl27J95k52M79K24k05k93k21J71M05j66M80o26k22Q7L66K47o8n01j07nM54
2047A21R8j07m8m63M07M2O5O3l59L0K92l16N00l48K30l85j6L05j01Q6k47l13M48
2070a6J35k9k5l06J55k75K59N85k96j17k83K22qJ46K39m49k54R1M3M01j57o8o3
2093g0j88N33k05L07r3o35J04K43J49K63m12j17k7j03M97p8K7l34k36L24J15K78
2115C42l29l56M16l45L01K46m99L33l21J59K09j8L3j59j47J06j22N72l58j73J5
$$ plain form
2136 -95 -274 -11 350 107 -21 -394 258 -125 133 94 -83 -111 -130 24 266 297 14 -252 -215 -256 107 226
2158 226 -82 6 -27 -71 213 282 -131 -188 -149 23 307 305 -13 202 -316 -136 116 114 -160 -148 -108 -3 175 327
2182 327 45 -268 -273 -89 45 170 170 -124 -128 32 180 205 83 -302 -103 -123 390 35 162 58 -382 -138 234
2205 234 231 179 87 181 -15 -587 97 100 -543 -364 -256 258 347 222 -266 284 -779 298 827 111 182 -485
2227 -485 195 225 451 -91 -263 -156 -95 80 339 51 -95 -266 -23 58 31 174 96 -411 174 70 400 155
2249 155 -377 -379 -286 126 116 -83 37 -257 -15 178 294 408 -25 -243 -367 -85 316 237 -115 1 -70 25
2271 25 219 222 -98 -172 -155 318 254 370 -166 -298 -223 -66 290 207 11 -220 -138 236 -82 322 194 -238 -236 92
2295 92 363 483 -254 -107 -254 -80 447 232 166 -241 -259 320 116 391 -224 -223 36 -89 143 86 -123 29
$$ packed form
2136i5j79K63L61k43j28l73O52l83K58l9j77k8j9J54K42L1k83k66L7m1L63J19
2158B26l08Q8l3m4K84O9m13n7L9J72K84kl18K15n18J80K52kk74J2M0J05J78J52
2182C27k82l13nJ84J34J25%k94mJ60J48K5j22l85J99k0N13l55J27j04m40K44L72
2205B34ln2r2R4j96n72O84Lo43J79J08N14Q9j25m88N50j063J077N29p16P1o67
2227d85O80L0K26n42j72J07O1J75K59k88j46j71K43Q1k7J43p8n07N85j04L30k45
2249A55n32kR3M12j0j99J20k94K42J93J16J14m33k18j24K82M01p9l52J16p1R5
2271B5J94Ll20p4J7M73o4J16n36j32P5J57L56q3j96k31Q2L74l18M04j28m32KL28
2295I2K71J20p37J47j47J74N27k15o6m07j8N79k04K75o15JK59j25K32n7k09J52
$$ plain form
2317 29 -123 114 225 -1 -171 -378 -208 -231 228 298 -132 93 -46 -399 450 193 28 -66 -274 88 36 199
2339 199 489 -440 -168 -202 -35 255 -76 -170 -142 -4 276 283 -4 -282 -489 -84 -13 153 210 -74 -43 -403 113
2362 113 130 -121 155 -195 -55 -86 191 69 11 -215 -15 -73 280 50 27 -351 -320 176 286 -95 293 -325
2384 -325 -11 249 213 118 -35 -221 -271 -149 329 202 87 -139 -150 189 139 304 -82 25 -122 -2 45 213
2406 213 11 -88 -54 -73 194 124 45 -158 -166 177 154 296 -65 -311 -17 -18 109 -36 223 308 -291 -194 337 206
2430 206 111 -389 -217 60 -56 225 127 -74 -113 -268 371 176 33 -92 -32 -137 106 14 -102 -121 -356 -142
2452 -142 193 278 277 -200 -255 -42 137 -4 224 -95 -241 227 24 194 89 69 -105 -51 131 121 -15 5 -147
2475 -147 128 54 200 -41 -236 -196 155 65 338 338 59 -50 -198 287 141 22 -89 9 -49 42 184 62 71
$$ packed form
2317B9j52K37J11k26j70k07J70k3M59P0m30K25j39l53Q49k57j65r4k08L62n2J63
2339A99K90r29K72l4J67K90l31r4K8J38K80Pk87k78k07M05P1J66N7k84L1l60N16
2362A13J7k51K76l50J40l1K77j22n8k26K00n8L53k30k3l78L1M96J10l81L88o18
2384c25L14K60l6r5j53j86n0J22M78j27j15k26j1L39n0J65l86J07j47J20M7J68
2406B13k02r9L4j9K67p0p9k03qL43k3J42l61k46K94jJ27j45K59Q5n99R7N31j31
2430B06r5n00J72K77j16K81r8k01l9j55O39j95j43j25O0j05K43r2j16j9k35K14
2452a42L35Q5jm77n5K13J79j41K28l19j46M68k03J70j05k0j74N4J82j0j36K0j52
2475a47K75p4J46k41j95M0L51r0K73%k79j09j48M85j46j19j11R8n8R1J42j22R
$$ plain form
2498 71 -399 6 108 40 122 6 -472 -234 71 69 187 -15 -59 -131 -199 144 200 141 -384 -395 -34 7 252 13
2522 13 -244 -116 70 197 258 -75 -242 -53 60 331 -74 -108 51 -182 -43 141 295 22 -138 -341 52
2543 52 35 310 -77 -35 127 -136 -207 209 -58 -280 -178 43 127 78 167 -119 113 -9 139 -41 28 -102 -92
2566 -92 -322 144 232 67 31 -193 -359 8 240 137 -160 -239 -3 -11 6 -108 -364 83 168 241 24 17 105 -178
2590 -178 -188 -237 274 176 -58 -117 -2 -158 117 236 33 -278 -134 191 211 -41 106 -238 -60 -248 94 45
2612 45 149 90 -194 -200 165 331 182 -185 280 -216 120 258 -4 -19 -149 -32 -61 249 7 -90 53 22 89
2635 89 65 -299 -176 -72 -72 -12 294 -75 11 47 73 117 94 299 -252 -120 -195 23 24 15 -263 11 -50 -39 -26 103
2661 103 -318 -303 -51 196 55 121 -123 -127 -171 123 203 29 14 -403 -1 -162 307 198 -128 -141 -22 8 -105
$$ packed form
2498G1m70M05J02o8Q2j16m78K38L05kJ18k02m4p2o8L43N6n9n25j1L61M1K45k39
2522A3k57J28J86J27O1l33j67J89J13K71m05l4J59k33J39J84J54k73j60k03L93
2543E2j7K75l87M2J62k63p1M16k67k22J02K21Q4m9Q9k86K32j22J48j80O9j30J0
2566i2k30M66Q8j65l6k24j66L67K32j03k97p9K36qJ7j14k56M47Q5P3k17pQ8k83
2590a78j0m9N11r8k34n9J15j56K75J19k03l11J44L25K0k52J47l44J78j88L42m9
2612D5J04n9k84oL65J66j49l67M65m96L36J38k62j5j30J17k9L10k42r7J43l1O7
2635H9k4l64J23J04%O0L06l69Q6L6K6M4k3K05n51J32p5K18Jrk78K74o1J1J3J29
2661A03m21J5K52K47j41O6k44mm4K94Q0j74j5m17M02j61M69j09l26j3J19L0j13
$$ plain form
2684 -105 172 -196 -13 -61 83 50 -55 -42 -103 80 74 106 58 -118 25 -134 268 447 54 134 -262 -124 113
2707 113 25 113 64 -186 -150 29 295 -77 66 -69 -208 251 84 126 -4 -277 -22 199 172 179 -85 -58 -223
2730 -223 -177 -100 221 -1 98 -180 141 137 53 60 -199 211 -146 154 337 9 78 69 -245 146 -146 361 -279 125
2754 125 51 9 20 -181 -74 84 -112 126 414 -140 -422 -194 -199 109 -188 322 -218 77 -37 -78 212 -336
2776 -336 74 -92 46 49 100 67 197 -141 -80 -2 -52 235 40 -146 -189 25 374 11 44 -302 64 68 135 -137
2800 -137 -34 -33 -89 257 268 -31 53 -113 96 89 -133 132 -65 -183 198 173 19 81 231 6 -22 162 341
2823 341 163 -78 -290 40 158 199 363 -246 -251 -246 235 27 85 -75 -216 -104 300 37 91 158 -97 44 -56
2846 -56 -78 252 59 28 -14 -211 -4 -82 39 -71 -216 162 132 -13 -20 -47 -1 100 -70 157 118 -108 23 214
$$ packed form
2684a05K77l68J83m8J44l3j05J3o1J83oL2m8j76J43j59M02J79l93Q0l96J38K37
2707A13q8Q8m9k50L6J79K66l72J43j35j39M59j67M2j30k73K55K21k7Pk64K7j65
2730b23M6P7L21k22R9k78L21mq4Pk59M10l57L00J83l28O9rl14L91k92N07o40M04
2754A25p4m2J1k01J07J58j96K38K88n54k82K28nL08k97N10n40K95j14m1K90n48
2776c36M10j66J38LN1l3J30l38O1P8n0K87j95j86m3K14L49l63L3l46L66MO7k72
2800a37J03Jn6L46J1k99Q4j66K09pk22K65j97j18L81k5j54O2J50k25k8J84J79
2823C41j78k41k12L30J18M1J64o09nNM81k08N8j60j41J12M04k63N4O7k55J41j00
2846e6k2L30j93l1m2j97K07p8J21j10j45L78l0j45pk7M6J01j70K27l9k26J31J91
$$ plain form
2870 214 -2 155 86 -126 8 -78 82 -25 43 -13 -179 232 129 70 -133 228 -223 14 109 7 -35 -371
2892 -371 -19 -86 -73 15 178 -186 -239 -35 205 103 41 -71 -12 172 80 29 121 -32 -54 -99 1 205 345 -81
2916 -81 -188 -97 141 -37 22 -196 -91 -158 -67 171 8 23 2 -54 -193 130 89 200 -53 -227 -180 48 -149
2939 -149 76 -97 -53 129 130 165 -14 32 -81 49 65 -20 -97 44 84 139 187 -129 -47 -2 -299 139 294 51
2963 51 12 -122 -239 120 119 84 26 145 -407 121 20 113 182 -162 -319 -30 54 -93 -127 113 -160 49 83 -159
2987 -159 -122 86 -111 18 46 29 118 -79 -234 -99 -3 9 168 -208 -139 -89 70 -88 3 -292 -114 16 14 93
3011 93 88 -153 -106 -85 13 283 14 -61 128 -168 59 106 145 31 -140 51 212 197 -307 -194 19 -182 -83 359
3035 359 -129 -116 19 -41 -82 -84 177 54 -84 60 45 186 72 -288 58 156 384 3 -80 -316 -159 -122 -157
$$ packed form
2870B14k16J57o9k12J34q6J60j07O8n6j66M11j03n9k03L61m51K37R5j02m2l36
2892c71L52o7J3Q8J63l64n3K04K40j02o2j12N9J84r2n1R2j53k2m5J00K04J40m26
2916h1j07R1K38j78N9k18J05o7R1K38j63J5k1n6j39L23m1J11k53j74M7K28j97
2939a49K25j73M4J82JL5j79M6j13J30J6q5p7J41M0N5M8l16Q2M5k97M38J55k43
2963E1l9j34j17L59jl5n8J19n52N28j01R3O9l44j57K89Q4j47l4K40k73K09L4k42
2987a59L7K08j97J29K8j7Q9j97j55J35R6J2J59l76O9N0J59j58R1k95J78J30kP9
3011I3nk41M7K1R8K70k69p5J89k96K27M7L9j14j71J91J61j5n04J13K13k01R9M42
3035C59m88J3J35o0m1kK61j23j38J44j5J41j14l60L46R8K28l81q3k36J57L7l5
$$ plain form
3058 -157 345 -61 141 -360 -126 -125 -194 165 -24 -128 12 8 54 127 25 67 -65 8 125 76 -199 -244 -301 -222
3082 -222 76 202 -122 -47 -55 11 28 99 8 -121 127 8 111 135 52 148 -72 152 120 52 246 48 -37 -347
3106 -347 405 52 5 -158 169 -156 113 169 3 -157 201 -229 33 135 17 -79 -35 58 -113 78 92 -92
3128 -92 -6 4 -194 10 45 46 -38 30 -110 -140 -47 68 -402 219 203 -25 121 -184 -87 -208 22 -34 -19 76 -9
3153 -9 -219 37 -140 29 -196 -13 146 -76 178 207 176 -130 -115 202 -161 -12 14 -13 -372 -128 249 60
3175 60 -140 -24 -168 232 -11 -11 26 -351 28 2 172 -79 29 -33 43 128 84 393 132 50 -159 55 91 -49
3199 -49 14 -174 -58 175 171 205 -172 -336 201 -373 171 81 -104 -32 -53 18 357 48 103 -93 -238 63 -21 98
3223 98 -33 -185 -16 11 5 239 -61 -138 -115 120 74 -108 109 -29 -11 -222 -35 100 31 -24 -87 -147 -54 -101 272
$$ packed form
3058a57N02m06K02n01K34Jo9L59j89j04J40mM6P3j02M2j32P3J17m9k75m5n7P9
3082b22K98J26l24P5qO6J7P1r1j29K48j19J03K4q3R6k20K24l2o8J94j98q5l10
3106c47P52l53m7j63L27l25K69N6j66j60L58m30K62J02j18r6M4R3j71J91J4j84
3128i2Q6J0j98K04L5Jq4O8j40l0R3J15m70O21j6k28J46l05R7j21K30n6J5R5q5
3153ik10K56j77J69k25J83J59k22K54K9l1l06J5L17l63J49K6k7l59K44L77j89
3175F0k00J16j44M00k43%L7l77L79k6J70k51J08o2P6Q5m4L09k61q2k09K14L6j40
3199d9O3j88J16K33mL4l77j64N37n74N44r0j85P2k1P1L39l09N5j96j45L01q4J19
3223I8j31j52J69K7oK34l00p7K3K35m6j82K17j38J8k11J87J35o9n5o3o0R3m7L73
$$ plain form
3248 272 -70 -111 -299 20 130 81 158 106 -133 95 192 164 81 -199 -31 115 75 66 140 -193 -106 103 117 204 94
3273 94 10 -15 -84 35 -185 -94 -62 -4 107 271 -72 -12 -81 -77 39 155 -96 -106 -207 61 -114 231 -48 -88
3297 -88 -70 -74 112 -94 36 -139 81 112 8 40 -37 84 -143 61 40 104 230 4 -36 1 159 311 241 37
3321 37 158 -74 -90 191 123 46 52 -116 123 192 -111 179 -74 -72 -5 -150 -117 61 -22 70 11 39 45 -78 254 -102
3347 -102 30 169 99 -173 49 -127 -8 -58 78 95 -223 -195 -70 219 -166 -119 -153 -103 -160 -2 47 -14 -48 20
3371 20 -77 152 -111 55 -176 -208 -117 -106 -44 -3 118 130 -133 71 -75 64 -197 24 102 -9 122 -58 90
3394 90 8 6 29 58 92 18 -26 202 86 287 -87 24 42 -231 -78 300 -265 205 -115 37 -10 243 75 0
3418 0 -231 -276 2 -98 68 -192 41 -27 -15 282 62 256 -63 188 -4 151 79 42 -88 63 -59 -122 134
$$ packed form
3248B72l42m1j88L19J10m9P7n2k39K28R7k8q3k80J68J46m0rP4l33Q7K09J4Q7j10
3273I4q4k5o9J19k20R1L2N8J11J64l43O0o9MJ16J16k51j0j01K68j75L45k79m0
3297h8J8mJ86k06J30j75K20L1j04L2p7J21k27K04k1O4J26k26m0L7J58J52p0k04
3321C7J21k32j6K81o8p7Oj68K39O9l03K90k53KO7j45L3J78q3R2n9K8Oj23L32l56
3347a02J32J39p0k72K22j76J19n0J36J7l18K8J25K89l85M7l4N0n7J58M9o1l4O8
3371B0r7K29k63J66k31l2R1J1O2M1J21J2k63K04j46J39k61K21P8j11J31j80J48
3394I0q2kK3K9L4p4m4K28j16K01l74J11J8k73J53L78n65M70l20J52m7K53j68p5
3418@k31m5K78j00J66k60K33o8J2K97k20J94l19K51j92J55p2l7j30J51j22o3K56
$$ plain form
3441 134 -64 49 -167 -64 -33 131 105 37 -35 -97 -228 281 122 -82 199 -56 227 -124 -105 -267 -1 89
3463 89 -156 51 23 -20 -198 -21 -56 2 36 -91 -9 21 19 179 72 -46 -133 70 131 195 -110 103 -15 -110 180
3488 180 152 138 -168 -243 -89 152 107 -104 -146 -246 121 -203 118 -4 62 -52 -38 120 125 301 -123 -159 -151 22
3512 22 15 -24 23 -347 187 -172 176 -28 37 -16 -199 -55 -115 -81 -68 -16 128 124 235 118 -287 -261 52 -29 -11
3537 -11 -44 -139 161 57 58 52 -15 33 -150 -162 253 70 64 86 -26 -29 -39 151 186 -290 92 55 -63 100 94 116 -82
3564 -82 -183 -235 -2 -339 84 -50 71 21 93 154 -57 -133 -181 -79 -66 453 130 -130 -67 -11 -92 -92 215 44
3588 44 -54 150 233 45 91 -148 -225 -158 -116 -153 -46 132 -91 -31 -111 20 143 71 -202 -283 -165 142 -109 37
3612 37 -11 133 -239 57 115 185 -27 17 -27 181 -44 55 -11 78 66 -11 145 56 -235 18 95 -27 -96 -58 -329
$$ packed form
3441A34j98J13k16J03L1J64k6o8p2o2j31N09j59k04K81k55K83l51J9j62K66R0
3463H9k45K07k8m3j78J77l5N8L4j27Q2L0kJ60j07j18q7K03O1O4l05K13j18r5K90
3488A80k8j4l06p5J54K41m5k11m2j00L67l24L21j22O6j14J4J58NJ76m24l6QJ73
3512B2pl9M7l70N34l59L48k04O5n3j83J44o0L4J3N2J44mJ11j17m05K6L13q1J8
3537a1l3r5L00j04Joo7M8j83j2M15j83oK2j12lj0J90L5m76L82l7j18J63oK2j98
3564h2j01n2K33l37M23j34J21n0P2O1k11p6m8J02J3N19l23k60O3N6q1%L07j71
3588D4r8K04Q3j88M6k39p7O7M2l7J07J78k23O0q0J31J23p2k73q1J18L07k51J46
3612C7m8J44l72K96N8P0k12M4m4K08k25R9o6Q9j2p7J56q9k91K53P7j22o9L8k71
$$ plain form
3637 -329 -87 -72 -175 7 -14 -8 -151 -34 -41 -12 165 44 59 -90 -176 122 -184 -55 -275 79 16 41 -100 -233
3661 -233 100 -23 44 117 -93 -42 200 6 -90 -137 -36 4 241 103 -143 254 194 -70 -182 1 6 -95 -4
3684 -4 -431 -212 -58 -25 -50 -264 15 106 54 -199 -180 65 -124 -259 21 -152 203 90 -220 -239 -93 64 47
3707 47 113 78 26 46 98 110 76 -197 -188 -68 -55 181 167 -129 -289 -11 141 33 97 -129 -49 281 39 -103 -246
3732 -246 -36 -106 258 208 -63 171 135 -1 -164 -204 231 65 -69 -85 29 12 -236 -40 112 45 -48 -53 53
3755 53 -68 134 108 -74 -147 116 94 25 119 -98 -114 49 147 18 -116 -70 41 -70 18 -29 50 -8 -190 -210 32
3780 32 -299 -125 68 23 218 -18 -242 -91 -24 -77 144 259 -39 8 158 -263 170 53 127 -196 -91 174
3802 174 -188 -30 187 -290 -96 -77 28 -226 -45 4 4 -217 249 87 2 154 -301 -19 326 -27 106 -228
$$ packed form
3637c29K42J5j03J82k1Oj43J17pK9J77j21J5j49q6K98l06J29k20L54o3K5j41j33
3661b33L33j23O7P3k10N1K42j94r6m7J01M0K37j38k46L97o0k64j12J83Nj01R1
3684dm27K19J54L3k5k14K79R1n2k53J9K45j89j35K80j73L55j13l10j9J46J57j7
3707D7O6l5n2K0N2J2l4k73RJ20J3K36j4k96j60K78J52j08O4k26Q0L30k42j42j43
3732b46K10p0L64n0k71K34l6j36j63m0M35j66j34j6J14j7k48J96J52o7r3nJ06
3755E3j21K02k6j82p3K63k2o9R4k17j6J63R8j29j34M6J11j11Q8m7P9n8j82k0K42
3780C2l31J74J93m5J95k36k24J51O7n3K21J15k98M7J50m21M33j17P4l23J05K65
3802A74l62J58K17m77J94J9J05k54J81M9%k21M66j62q5J52m55K82L45l53J33l34
$$ plain form
3824 -228 -68 -64 -224 -166 -118 6 -229 -83 112 -38 -167 -81 2 -125 -111 192 -52 -198 -84 -88 156 -6 -116
3847 -116 -11 -317 -184 -185 294 29 -61 -12 193 44 -28 -98 -24 135 63 -50 32 -273 224 70 109 94 -51 -109
3871 -109 -96 -105 19 37 -139 -11 -9 148 -244 50 -216 -631 -155 -97 -291 -148 164 45 37 59 -161 241 98
3894 98 142 -114 -186 -193 63 -3 38 -24 -160 -181 79 -243 21 144 150 -160 0 -139 63 -133 -147 16 -31 155
3918 155 167 0 -126 80 -32 -158 73 -58 5 -77 -159 165 -147 29 -15 -168 -33 -79 -34 68 -281 -99
3940 -99 -99 -121 29 -93 -153 -59 -55 257 -6 195 -118 18 84 24 230 10 86 89 73 190 164 15 9 27 -76 -73 -69
3967 -69 179 -67 -151 -358 94 18 -172 -154 -113 -180 -40 70 40 -10 29 1 134 242 -7 -34 -6 -128 -85 48
3991 48 -55 -79 -52 114 104 -147 -70 -85 -141 -89 -73 -116 -102 5 36 -164 -120 -40 29 -20 123 -296 33 -81 181
$$ packed form
3824b28J60Mj60N8M8J24k35J46J95j50j29Q6Q3j27J4L03k44j46J14mK44j62j10
3847a16J05l06J33jM79k65r0M9K05j49p2p0P4J59p2j13Q2l05M97j54L9j5j45n8
3871a09J3rJ24J8j76J28KJ57l92K94k66m15M76N8j94J43L12j19qK2k20M02j43
3894I8M4k56p2pK56o6M1o2j36k1K60l22K64J23Ol10J60j39K02j96j4J63m7J86
3918A55J2j67j26K06j12j26K31j31O3q2q2L24l12J76m4j53J35m6M5J02l49J82
3940i9%k2J50j22o0R4ML12k63K01l13J36O6o0K06k20P6Lj6J17k6j49oJ8j03LM
3967f9K48k46q4k07M52p6j90J8M1o7J40J10l0n0L9k8J33J08k49k7K8j22M3J33
3991D8j03k4K7J66j0k51P7j5n6N2J6m3J4J07L1k00M4Q0O9m9J43m19L29j14K62
$$ plain form
4016 181 112 -85 -91 130 41 84 111 -78 112 39 -42 -20 13 117 -152 -44 -52 95 -4 300 -33 -53 -11 35 67 0
4042 0 305 -43 -169 50 -81 181 50 29 34 101 -73 -11 327 -96 -197 -114 62 2 168 -5 -41 62 -65
4065 -65 88 389 40 317 -64 -112 -5 119 -113 185 295 67 -108 -4 -294 -231 39 19 -35 -198 19 -71
4087 -71 -131 66 113 190 270 136 -28 -31 -77 -96 -42 55 -165 -3 -25 -14 65 10 -93 -85 62 -99 7 48 -138 228
4113 228 128 -213 -244 83 183 -50 -341 -50 -21 35 -8 123 14 79 14 63 58 -269 103 100 -135 44 283 22
4137 22 -38 31 -21 80 35 40 -80 -122 51 -27 -49 199 -50 -174 41 157 -123 123 174 171 13 -63 -97 3 -116
4162 -116 24 152 -13 69 -43 -3 -16 -78 145 141 131 -26 -131 219 -14 -128 190 -24 -86 -90 -285 29 -38 305
4186 305 161 78 70 -92 96 -184 223 96 -161 99 -89 180 195 -76 18 -82 41 -93 -168 -73 -46 35 -14
$$ packed form
4016A81o9j97oK21q9M3K7j89J90p3q1K2L3J04k69J08qJ47r9L04l33k0M2M6L2o7
4042@L05l48j26K19j31K62j31k1NO7j74O2L38m23j01Q3J76o0J66j73l6J03j27
4065f5J53L01l49K77l81m8J07J24k32K98J10k28j75J04k90O3K70k0n4j63K17r0
4087g1o0J97M7P7Q0j34j64lm6j9N4R7k20J62k2J1P9n5j03QJ47j61J06M1j86L66
4113B28j00l41l1L27J00k33k91K91K9N6m3J31j09O5o5M9nl27L72lk35J79K39k61
4137B2o0O9n2J01m5Nj20m2J73p8k2K48k49j24K15J16k80K46N1lj58p6l4J00j19
4162a16J40J28j65Q2j12M0j3o2K23mj0j57j05L50k33j14L18k14o2mj95L14o7L43
4186C05j44q3qj62J88k80M07j27k57K60j88K69J5k71R4j00J23j34p5R5K7Q1m9
$$ plain form
4209 -14 -150 8 74 -18 37 -89 -65 229 -33 102 -88 196 -129 -69 23 163 61 -219 35 196 -4 -284
4231 -284 -26 -13 31 33 -234 159 -116 158 -4 -46 -83 127 93 85 158 -100 -118 -81 123 134 152 -36 29 54 -156
4256 -156 -203 161 46 57 122 -46 119 191 182 -168 92 -122 -85 -117 -42 55 -3 36 -128 -86 -5 195 123 -69 262
4281 262 270 52 34 -42 -135 198 3 6 -91 -28 57 -78 5 21 120 -114 247 -43 -175 -49 10 22 -144 -66 145
4306 145 -166 66 -45 101 -91 -16 116 174 37 -26 63 100 94 46 -140 -15 -16 -19 189 197 -250 -186 125 129 128 -269
4332 -269 37 -94 215 -10 -22 -97 -54 -47 198 -17 -55 -346 64 -30 111 123 283 -62 -289 -48 -9 73 170 -66
4356 -66 84 -338 -40 124 -49 195 -190 -68 150 -11 -143 -158 -178 -50 169 163 -10 26 -3 -109 158 202 -40
4379 -40 -102 173 -66 -20 -273 229 -109 120 -28 8 -199 181 -157 32 -163 -208 134 -178 40 -53 32 -96
$$ packed form
4209a4j36J58O6r2N5j26K4K94k62J35j90K84l25O0R2J40j02k80K54J61k00k80
4231b84K58J3M4Kk67L93k75K74j62m2l7K10l4qP3k58j8L7K04J1J8j88O5K5k10
4256a56m7L64j15J1O5j68J65P2rl50K60k14L7l2P5R7n8L9j64M2Q1K00p2j92L31
4281B62Qk18j8p6r3L33j95Lr7O3Q5j35Q3J6R9k34L61k90j32J26N9J2j66P8K11
4306A45l11K32j11J46j92P5J32N8j37o3Q9L7om8j86J25jlK08Qm47O4L11Mjl97
4332b69L06j31L09k25j2p5M3PK45k15l8k91M10r4J41J2J60l45k27K41L9Q2R7k36
4356f6J50m22K98J64j73K44l85J22K18j61j32j5k0J28K19oj73L6k9j06K67M4k42
4379d0o2K75k39M6k53N02l38K29j48L6k07L80l38J89j95m5L42l12K18r3Q5j28
$$ plain form
4401 -96 40 -27 -31 126 105 -39 43 111 174 -126 -56 119 -153 37 -10 6 99 -62 -132 39 250 -135 102 9 -218
4426 -218 -71 115 89 -201 53 116 -116 135 235 373 -102 214 95 81 206 141 -174 16 45 68 -62 -182
4448 -182 171 235 146 -50 56 -235 54 -28 -236 -67 -180 187 98 -108 -29 76 -319 -21 17 136 44 -94
4470 -94 36 -137 93 138 46 -21 -43 -165 73 81 71 136 76 -26 -147 -59 19 19 15 -7 -266 -20 76 99 130 -8 -42
4497 -42 -125 210 -54 -90 -50 137 129 -40 -2 -11 -30 -104 81 103 25 238 -206 406 -51 -69 -33 99 33 -11 95 61
4523 61 -167 106 255 -114 76 -99 46 37 164 -47 -78 -17 96 15 243 -226 129 25 201 -4 142 63
4545 63 -186 236 -138 -275 -61 64 84 50 49 225 0 155 34 -16 -135 51 61 -17 -176 -109 -49 31 201 -40
4569 -40 -90 -96 22 -121 52 167 31 -178 186 125 -184 -75 71 -305 -240 -84 25 -79 -121 -74 -9 145 -77
$$ packed form
4401i6J36o7mJ57k1j44Q2O8O3l00P0J75k72J90m7J6R3j61p0J71K11l85K37r3k27
4426b18J47J86k6k90K54O3k32K51J00J38m75L16j19j4J25o5l15J90K9K3j30j20
4448a82L53O4q9j96J06k91K89q2k08J69j13L67q9k06P9J05l95K98L8J19r2j38
4470i4J30j73K30M5r2o7k2j22K38Qj0O5o0j02j21Q8P8%mk2k59K46R6K3L1j38l4
4497d2q3L35k64l6M0J87qj69L8rj9p4J85K2p8K13m44O12m57j8L6J32o6m4J06l4
4523F1k28K73J49l69J90j75J45rJ27k11l1O1J13q1K28m69L55j04J76k05J46p9
4545F3k49M22l74j37K14J25K0l4jJ76k25J55j21n0j19J86J0p8j59O7O0Q0J70k41
4569d0n0oJ18j43J73J15j36k09L64o1l09J09J46l76O5J56J09j04m2M7O5J54k22
$$ plain form
4592 -77 -147 -206 55 156 -242 118 0 -69 -35 121 -68 -148 -133 -51 -194 -144 -55 -62 3 320 105 -248 53 63 129
4617 129 -126 -19 63 -91 -117 162 -223 98 3 -61 -40 97 -154 -79 236 -142 -56 -183 -13 -149 -50 -215 16
4640 16 39 -22 168 51 -76 9 176 66 -192 90 38 119 266 -35 198 96 -131 -137 -131 -308 27 19 -22 88
4664 88 -64 -37 30 -104 114 181 119 163 -183 128 58 128 -139 341 -330 384 -253 236 309 786 -139 206 1055
4687 1055 933 -168 -578 -164 -502 -5 -160 106 55 298 -62 11 -85 -10 -77 69 -54 -199 -39 29 -67 -117
4709 -117 -276 299 74 67 -60 188 -45 21 -21 174 -154 394 -34 -87 164 24 108 123 178 11 6 240 -68
4732 -68 -155 157 -68 203 -80 49 37 -111 -49 -169 71 112 -155 53 19 21 70 -203 47 13 51 0 -174 -89
4756 -89 -198 -6 185 -55 -14 -80 -15 -18 -323 -61 123 -65 -99 171 -66 -172 -89 -50 -61 -145 85 154 -248 168
$$ packed form
4592g7p0n9K61J01l98L60j18o9L4J56j89q0J5Q2j43N0Q9pO5L17k15l53L01J0O6
4617A29k55J07Q2j54k6K79l85L21r5o4K1J37k51P5L15l78Q6j27J70j36R9j65K31
4640A6K3o1J90j17j27Q5J67j10k58K82n2Q1J47l01K33j02k27oOj77L35qm1J10
4664H8j52K7O7j34K18O7o2M4l46L11p0P0k67M80o71P14o37M89P3M77r25L45Q49
4687A055j22j101m10M14l38M97j55K66n1K43l60P3r6P5o7J46j23j45J60O8r6n0
4709a17j59N75k25pj27K48k33O6m2J95l28N48m28n3K51j40Q4J5N5j67nK34l08
4732f8q7L12k25K71k83J29j2j48O2j20K40M1k67K08l4KM9k73K50l4L8n1j74Q5
4756h9j09J92J91k40M1o6O5ll05K62J84j88l4K70k37j06Q3L9j1q4K30O9m02M16
$$ plain form
4780 168 72 -88 77 -76 -108 -31 -30 -101 2 -125 90 228 28 -53 -216 2 143 -5 31 -152 69 -218 34
4803 34 -77 154 53 -113 125 -150 18 -68 -140 10 179 52 -12 -72 181 80 -70 141 -257 126 -143 -9
4825 -9 171 -72 -162 -79 -42 4 -168 -152 46 148 155 -118 -67 111 112 -79 20 -42 -167 121 -49 -143 -104 -31 119 -55
4851 -55 297 -40 -222 4 19 1 27 77 3 -133 -39 -106 -219 153 66 104 -123 14 -254 241 -40 -71 -16 -70
4875 -70 -170 -77 122 -16 280 -29 221 -130 7 -13 -126 49 57 80 -111 75 0 -113 -182 -101 82 84 -233 -243
4899 -243 -56 154 -223 -102 139 -177 -52 -68 63 64 32 -62 201 131 20 74 258 127 171 193 -104 36 85
4922 85 -58 -98 43 41 228 72 118 -16 -99 -173 18 -146 102 121 34 -113 58 0 126 183 -268 -5 269 -125
4946 -125 209 -46 92 59 230 -189 -6 154 -215 -134 1 -27 -58 -79 -159 1 160 -19 117 168 67 359
$$ packed form
4780A68r6j60J65j53l2P7Jp1J03j27K15J38k00q1j63K18J41j48L6j83K21k87K52
4803C4j11K31j01j66K38k75J68q6p2J50J69j27o4o0K53j01j50K11l98L83k69J34
4825iJ80k43r0Q3L7M6j72J6J98J02Pk73N1J78Jj91R9o2j25K88j70r4L9P3J50j74
4851e5L52l37j82K26J5j8K6N0p4j36R4o7j13L72q7L8k27J37k68M95k81l1N5n4
4875g0j00R3J99j38K96l09K50l51J37k0j13J75QK3j91J86p5j13o9Q1J83Kl17j0
4899b43J87K10l77J21K41l16J25j6J31Jl2r4K63p0j11N4J84j31M4K2k97J40M9
4922H5j43m0J41kJ87j56M6j34q3p4J91j64K48J9q7j47J71n8J26N7m51K63K74l94
4946a25L34k55J38l3J71m19J83J60l69Q1J35k8l1k1q0J60J59j79J36N1j01K92
$$ plain form
4968 359 57 -39 177 86 45 -42 -142 187 -106 -176 -216 130 18 -174 241 -226 45 -228 70 -21 203 -123
4990 -123 -54 217 86 67 -189 90 14 41 24 97 283 -136 36 287 130 -116 21 220 -127 103 -30 34
5012 34 128 -57 -23 16 29 -3 119 147 -48 -127 -15 15 -63 -83 -368 -146 9 -137 77 112 -70 -48 61 -187
5036 -187 -85 -13 -128 269 -96 -57 -77 155 129 22 -27 150 76 -335 91 -107 18 124 115 151 142 13 -68 144
5060 144 -199 -13 54 -14 143 140 156 -195 -57 156 165 -186 27 -22 8 -123 129 31 -53 127 -76 292 -46 -288
5084 -288 -171 -17 107 -227 -185 24 16 271 -202 28 203 -118 37 -14 76 -27 62 -23 -74 -63 122 141 -170
5107 -170 126 92 143 -16 55 142 149 -95 175 89 -68 -151 -149 45 308 99 -109 -240 -75 68 38 51 47 -35 23
5132 23 -108 91 -185 57 -99 359 6 62 12 60 80 58 175 -39 195 -159 114 26 115 231 -26 -205 160
$$ packed form
4968C59l02r6K16r1m1q7j00L29k93p0m0L46j12j92M15m67K71k73K98r1K24l26
4990a23O9K71j31j9k56K79p6K7j7P3J86m19J72K51j57k46J37J99l47K30j33O4
5012C4R4j85L4L9J3l2J22K8j95p9J12L0p8k0k85K22J55j46K14L5j82K2J09k48
5036a87J02P2j15L97l65L9k0K32k6j07m9J77p4m11M26j98J25J06rL6rj29q1K12
5060A44l43J86O7o8J57lJ6l51J38K13Rl51K13m9L0j31K52r8q4J80k03L68l38k42
5084b88J17J54J24l34M2K09qK55m73K30J75l21J55n1R0j03Q9q5n1J1J85J9l11
5107a70K96l4N1j59P1Q7Pk44K70q6j57q3KJ94K63k09k08j31J65J43l0J3mq2N8
5132B3j31J99k76K42j56M58l53N6n0M8K0k2J17k14K34l54K73q8Q9J16k57j79L65
$$ plain form
5155 160 -200 -63 22 162 75 -167 57 2 10 -148 183 174 -99 77 -71 -14 55 177 -152 -192 158 -7 160
5178 160 174 -149 -183 -73 191 62 52 29 221 101 -193 11 128 61 13 -167 -84 181 -21 90 -44 -178
5200 -178 160 55 -48 -37 248 306 -7 223 105 73 -171 -229 -123 -238 -8 -16 24 76 8 119 -50 -113 98
5223 98 -109 11 -49 73 212 13 -56 8 35 -22 53 -212 -38 90 -86 182 -202 -101 12 -41 61 -119 -122
5246 -122 -160 -36 39 226 273 59 32 -42 -114 -15 99 -115 -102 -45 90 -121 40 19 -226 275 -41 69 -79
5269 -79 -109 -271 -297 44 -31 -234 -2 -32 176 115 -142 -167 212 53 -146 111 -114 56 -191 -36 57 -102 87
5292 87 8 256 19 91 -189 90 28 -44 -177 9 -141 -31 -136 -231 79 35 89 86 69 -57 89 43 -146 91
5316 91 106 -63 237 41 -313 -92 -74 -152 -128 -208 -39 -100 91 -101 27 27 5 87 41 75 53 -4 50 211 -231
$$ packed form
5155A60l60J37Q5J40q7k42K24n5Qj58L31rk73J76j48N7O9J22l29m0L50j65J67
5178A60J4l23l4J10K64j29j0k3J92j20k94K04J17o7m8j80Q3K65k02J11j34j34
5200a78L38j05j03J1K85N8l13K30j18l2k44n8J06j15K30qM0N2o8J11j69o3K11
5223I8k07J20o0J22J39j99o9O4K7n7P5k65J74J28j76K68l84J01J13n3J02j80l
5246a22l8J24P5J87M7k14k7p4p2R9J14k14J3N7J35k11J61k1k45N01l16J10j48
5269g9l0j62k6L41p5k03K32l0K08o1k57k5L79j59j99K57k25J70k47J55R3j59J89
5292H7p9K48k37P2k80K79o2p2j33J86j50J10j05r5L10m4N4lj7j26J46m6j89K37
5316I1J5j69L00j96l54K21J8p8K4q0J69o1J91j92J28%k2Q2m6L4k2n7N4J61m42
$$ plain form
5341 -231 112 -118 188 109 -153 -68 -163 -88 23 52 -48 -22 47 -50 -98 88 -230 -28 6 -12 -46 199 200 -285 14
5366 14 48 51 -189 130 -38 -97 64 -100 -40 -38 10 165 -47 -125 226 67 -14 52 64 281 -63 49 -27 89 132
5391 132 27 -47 -89 189 -101 31 -119 -213 86 -122 77 -6 103 68 90 56 -20 94 -129 16 31 -122 -153
5414 -153 -19 -128 -96 -198 18 35 199 30 84 -55 6 -31 -194 132 79 -204 -112 -56 118 129 -31 121 208
5437 208 147 150 -85 14 -12 -238 -6 -11 166 -47 108 -53 -82 72 -19 226 174 47 -5 -147 -118 145 -314 -161
5461 -161 -5 48 64 181 96 -81 -66 89 -37 -196 -80 146 -6 -165 215 -132 -80 -144 82 -1 273 -198
5483 -198 -8 13 -20 -203 -20 37 -64 103 252 50 8 153 -67 47 -119 248 -59 77 34 110 -154 258
5505 258 -41 162 12 -24 158 -163 -164 27 -133 -58 65 88 33 -208 -261 88 -108 137 34 -62 -128 -24 -146
$$ packed form
5341b31L43k30L06p9k62Q5r5P5J11K9j00K6O9r7m8J86l18K02L4j8l4K45Jm85K99
5366A4L4Lk40L19j68n9J61j64O0KM8J55k12p8L51j59q1O6J2K17l44J12p6J16M3
5391A32j05p4m2K78k90J32j50r4K99k08J99q3J09l5K2l4p6J14k23J45J5j53l1
5414a53J34j09L2j02K16J7J64j69N4j39O1l7j63L26n3k83R2N6J74J1j60J52Q7
5437B08o1Lk35R9k6k26K32nJ77k13J55j61k9J54r1K45n2j27n2j42K9K63m59J53
5461a61J56N3J6J17q5j77J5J55j26j59J16K26j52j59L80l47N2o4K26q3K74m71
5483a98J90K1l3j83J83N7j01J67J49k02m2J45k20J14j66L67l07J36m3P6k64M12
5505B58k99K03j50l6J82l21jJ91j60P5J23K3n5k41n3L49j96K45j03r6o6J04j22
$$ plain form
5528 -146 -80 -75 32 12 3 -141 115 34 -21 -9 -108 -86 42 -47 98 32 -53 75 159 36 -69 162 117 104 199 209
5554 209 12 54 -116 -52 -47 -9 161 -25 200 -48 98 20 66 -163 -358 140 -161 19 92 -78 -165 189 221
5577 221 35 -94 -180 -138 -6 57 -48 -52 15 51 8 -126 24 392 178 237 -257 14 56 60 156 103 93 69 -167
5602 -167 188 -44 65 106 422 238 -144 1 -30 119 14 6 -35 77 21 138 -60 41 -194 68 21 155
5624 155 127 -176 22 -79 -45 150 161 -122 46 -51 253 -59 112 -160 -101 105 211 124 -293 275 157 -135
5646 -135 87 -91 239 -118 88 -242 2 154 30 -18 181 66 76 -18 30 70 -47 -352 -93 -206 -54 -120
5668 -120 -31 109 -139 213 6 -77 115 220 57 44 -25 86 -26 218 -74 -169 79 232 -149 57 106 -49
5690 -49 22 -103 125 34 122 -126 -178 61 -52 -17 -4 154 52 -63 -36 -50 81 190 35 -242 18 -119 -26
$$ packed form
5528a46O6NJ07k0rj44K56q1n5J2r9K2J28q9J45o6q5J28Q4j23j05K31m5j3R5J0
5554B09j97M2j70O4NL8J70j86K25k48J46p8M6k29j95M98l01J80P3j70q7L54L2
5577B21j86j29q6M2J32O3j05mO7L6m3j34J50L68k14N9m94K71M2MR6n3j0k4k36
5602a67L55k32J09M1L16j84l82J45l1J49j05qm1J12n6J17j98J01k35K62m7J34
5624A55k8l03J98j01L4J95J1k83J68r7L04l12J71k72N9K06J06q7m17N68j18k92
5646a35K22j78L30l57K06l30K44J52j24m8J99j15J0r4M8M0j17l05K59j13J52o6
5668a20Q9J40k48L52k07q3J92J05j63j3o9J11j12K44k92r5K48J53l81K06M9j55
5690d9P1j25K28r1Q8k48n2K39j13L5J3J58j02j15K7j4J31J09j55k77K60j37R3
$$ plain form
5713 -26 95 -55 -7 -27 -61 -30 -177 -98 116 -84 -64 110 208 51 -213 -10 -297 -80 -57 -131 -142 114 52 42
5737 42 -182 -79 -53 77 -21 65 70 109 -52 -154 111 128 5 7 -174 -124 -42 -39 83 -265 -15 -104 11 -118 122
5762 122 -159 -85 50 41 390 78 -64 -79 -82 237 201 78 -89 28 -34 153 -26 -86 4 -155 67 44 -161 212
5786 212 11 -169 170 -201 -169 -180 46 -86 -258 74 50 225 42 137 -183 -288 -127 138 -343 210 277 -97
5808 -97 -26 158 -35 -30 -111 -56 42 170 62 -79 -93 -151 140 82 -268 -79 -236 193 -29 -52 202 58 -210 -294
5832 -294 -45 -147 -79 278 -73 -224 -28 178 -18 112 41 52 54 -33 -47 -49 -193 40 -8 -209 -1 86 -147 109
5856 109 -171 33 -164 -139 146 63 -82 -84 -67 -101 182 31 -164 -140 44 108 8 -397 34 -285 -267 -22 59
5879 59 81 -106 -154 67 211 92 -202 -39 -51 -23 -1 -40 147 -37 201 66 -8 1 -369 -211 198 -121 204
$$ packed form
5713b6J21j50M8k0l4L1j47P9K14k00K0J74R8j57k64K03k87K17K3p4j1K56o2j0
5737D2k24J03K6J30r8Q6NL9j61j02K65J7j23Kj81N0Q2LJ22l48K50q9J15j29K40
5762A22k81P4J35rL49l12j42j5lL19l6j23j67J17o2J87j79o0R0j59K22k3k05L73
5786B12k01j80L39l71L2j1K26j32j72L32k4J75j83R5l20j05J61K65m81N53O7l74
5808i7P1J84j93Nq1N5R8J28j08j41j4n8K91n8l50J89j57M29k22k3K54j44k68q4
5832b94K49j02O8L57l51j51J96K06j96J30p1J1Kq7j4kj44K33m8k01K08Q7k33K56
5856A09k80K04j97K5K85q3j45kJ7l4K83j51j95K4J84O4j00m05M31l19J8K45Q1
5879E9K2j87m8K21J44j19k94J63j2K8K2l9J87j84K38j35p4Rl70J58M09l19L25
$$ plain form
5902 204 103 -137 -17 -85 74 -53 93 57 20 230 166 30 -69 49 58 -68 65 -25 -42 202 -36 -28 -66 -106
5926 -106 -240 73 20 146 -77 -234 -262 110 -50 -65 45 284 95 -135 -45 84 -96 -54 -124 45 46 101 28
5949 28 66 37 49 231 57 21 63 98 -8 -71 -52 128 -168 34 -162 42 -187 -74 69 234 -20 171 69
5972 69 119 -47 -29 194 164 144 11 -35 -169 113 -39 72 195 -120 -48 12 -117 35 -117 -31 -113 -46 -43 -142 -143
5997 -143 221 -67 -64 -237 -83 13 -47 49 280 94 1 149 57 -99 -188 198 75 -233 331 -30 157 63 -151
6020 -151 -39 -144 176 143 79 148 -86 43 -27 110 97 -52 38 -33 159 -63 -26 -101 151 -455 18 80 30 -32
6044 -32 77 38 26 -19 -189 6 161 88 109 40 -159 58 159 -17 -186 -80 -110 -55 -30 168 179 -63 -16 52
6068 52 154 213 -97 96 -5 -32 -211 -125 -63 154 -196 -5 -58 -27 7 -262 -133 133 47 60 -302 -88 9 63
$$ packed form
5902B04j01k40J20o8J59j27J46l6l7K10o4j36r9J18Rj26J33r0j7K44k38Ql8m0
5926a06j34L13n3J26k23j57k8L72j60j5J10K39j89k30R0J29j80M2p0J69JN5p3
5949B8L8k9J2J82j74l6M2L5j06o3J9J80k96K02j96K04k29J13J43J65k54J91j02
5972F9N0j66J8K23l0k0j33m6j34K82j52J11J23l15P2O0j29J52j52Q6q2O7Lr9j
5997a43L64k88Lj73J54R6o0R6K31j86r3J48r2j56q9L86j23l08N64l61J87r4k14
6020a51J12j05L20l3o4O9k34J29p0J37j3j49R0p1J92k22L7p5K52o06M73O2n0o2
6044c2J09l9j2m5j70J95J55p3K1o9j99K17J01j76j69J06l0N5K5J98J1k42M7O8
6068E2J02N9l10J93j01k7j79Q6O2K17l50J91n3L1L4k69J29K66q6J3l62K14R7N4
$$ plain form
6092 63 -53 -118 -104 -173 -102 15 85 -17 99 137 -11 -51 245 -39 -18 -87 -217 36 22 102 118 160 175 72 -111
6117 -111 258 -154 -41 -54 -133 186 270 -16 -18 -240 -139 36 91 -37 158 37 -51 -137 -184 34 85 1 128 198
6141 198 26 185 -145 -24 337 49 -62 196 -212 142 163 -9 82 205 -31 1 -50 -29 -84 -9 60 -74 -97
6164 -97 41 -162 -76 73 -86 -29 176 4 -111 53 -181 -162 42 -122 85 -71 83 -45 -87 130 -102 -104
6186 -104 32 -235 -95 -68 -44 -134 67 -35 -411 1 -83 -34 118 218 -26 -21 -85 -25 -25 -94 -34 141 -49 124
6210 124 39 -48 -31 198 -9 160 11 243 111 81 -35 -171 -319 -106 192 -233 -107 114 -152 44 304
6231 304 208 -262 -91 -100 55 163 255 10 149 -49 109 138 -12 25 -48 185 -69 -214 1 -133 143 2
6253 2 -138 132 -191 96 -147 67 -212 -171 68 -40 16 77 -127 -292 -43 -113 -72 56 -40 -30 -20 -240 -17
$$ packed form
6092F3j16o5J4o9P1J17P0j02J16L8j48m0K96k84K1o9j30K53j4Q0J6M2J5j03j83
6117a11L69m12J13j3p9L19Q4k86kk22J01J75N5j28J95j21q8q6m7K18N1q4J27P0
6141A98j72J59l30J21L61k88j11K58m08L54K1j72R1J23k36L2n1K1n5P5O9j34k3
6164i7J38k03Q6J49j59N7K05j72j15J64k34J9K04j64K07j56J54j28m2K17k32k
6186a04J36k67J40K7K4r0K01j02l76M12q4M9J52J00k44No4O0%o9O0J75j90J73
6210A24q5q7J7K29k07J69j49K32j32l0j16j36j48K13K98m25J26K21k66J96K60
6231C04r6m70J71rJ55J08R2k45J39j98J58K9j50L7p3K33k54j45K15j34K76j41
6253Bj40K70l23K87k43K14k79M1K39j08N6O1k04j65K49p0M1J28r6J0J0k20K23
$$ plain form
6276 -17 42 -129 -39 12 -211 -170 117 109 96 178 54 -119 -38 -24 -74 162 177 -195 161 2 246 166 -39 -13 22
6301 22 -57 85 -111 -119 -191 -21 123 -111 -147 -6 -44 -139 67 187 58 28 -73 -40 225 3 -146 -30 122
6324 122 -107 -138 162 -85 331 -86 179 -86 85 -45 -4 10 47 -75 366 -187 178 220 77 202 -113 -71
6346 -71 108 -81 125 133 -6 -40 66 -108 132 -21 -14 81 -215 -144 -59 86 84 48 97 -10 14 -74 -126 -104 155 -105
6372 -105 38 147 -210 47 -1 182 -112 14 -33 144 -128 -104 -20 169 -105 -54 -112 37 100 38 -24 -18 0 20
6396 20 165 -48 64 -19 -159 -158 -115 -98 36 -32 -168 130 -158 67 22 133 -85 131 71 141 -86 -56 64 -122
6420 -122 83 -29 -96 -100 -17 89 125 -436 179 -60 87 -134 185 191 164 53 113 123 -19 57 192 129 25 -88
6444 -88 -128 -25 66 80 -64 -109 -147 -40 -155 51 180 30 119 5 -80 -160 -90 20 -139 -139 129 -49 97 60
$$ packed form
6276a7N9j71R0N1k23M1K87qj3Q2j24j73Q1J4n0K36J5l72L56j59K44q0k05K6L5
6301B2p9J42j96qp2J70J44k34l6J41l8r5K06J20j29l0j01L3K65k22j49J16J52
6324A22k29l1L00k47M16m17K65k65J71j30M1J4L7j22M41n53L65M2j43J25l15M2
6346g1J79j89K06Qj39l4J06j74K40j53PR5k96P1Q5J45kl6M9j07K4q8n2K2K59k60
6372a05J43J09l57K57m8J83k94J26m7J77k72K4Q4J89k74N1n8J49O3o2o2OJ8K0
6396B0J45k13J12q3j40JM3J7J34o8j36K98k88K25m5J11k18K16o0P0k27L0J20j86
6420a22K05j12o7mQ3J06L6n61O15k39J47k21L19Ok7j11O0J0j42P6J35o3j04j13
6444h8m0J03R1J4j44m5l8J07j15K06J29j50Q9j14q5q0P0J10j59%K68j78J46l7
$$ plain form
6468 60 -83 -87 -118 133 -69 -127 -177 -126 -39 -19 -3 -67 241 11 59 -79 -89 55 290 155 301 -75 -175 226
6492 226 -253 -183 -54 45 340 -20 -93 44 -24 -119 215 -158 32 -210 50 182 9 -92 -169 71 83 -73
6514 -73 67 166 -92 -177 111 271 57 296 10 -82 -97 -116 -4 -100 207 -5 -176 -143 282 -127 -14 119 105
6537 105 -102 -46 -115 103 -40 -88 -129 -50 -30 109 -23 88 -45 82 -119 182 157 -91 14 153 -71 -89 109
6560 109 77 93 -93 26 -28 -38 135 -39 30 39 -136 -120 -31 133 223 -51 -126 86 -166 210 69 18 59 -81
6584 -81 75 35 2 -203 -69 21 223 14 169 -181 -153 -238 47 220 120 151 -50 -43 -134 192 -163 88 220
6607 220 49 -35 -100 -87 -77 24 -265 -212 5 140 -256 -161 -121 104 81 -26 -69 -65 -96 8 -58 12 -218 55 -131
6632 -131 132 350 68 -80 25 43 -130 186 -55 175 -6 -12 97 216 285 220 80 25 60 46 73 124 31 43
$$ packed form
6468F0j43ml1K51k02n8n0N1Q7K0J6o4L08k30M8j38j0J44K35j35J46l76j00M01
6492B26m79P0J29R9K95l60p3J37o8r5L34l73J90k42K60J32j73j01p7K40J2j56
6514g3J40R9k58q5K88J60k14K39k86r2j5j9J12r6L07k12j71L3M25m09J13J33j4
6537A05k07N6o9K18j43m8m1P9K0J39j32J11j33J27k01L01k5k48J05J39k24j8J98
6560A09l2J6j86J19n4j0J73j74O9Rj75J6Q9J64R0k74p5K12k52L76j41n1M1j40
6584h1J56m0l3k05J34R0K02k09J55l50K8q5K85J73j00L1k01Pr1L26l55K51J32
6607B20j71q4o5J3J0J01k89N3K17J35l96R5M0K25k3j07m3Ml1J04o6P0k30K73j86
6632a31K63K18k82j48J05J8j73L16k41K30j81oJ09J19O9o5j40n5L5j4K7N1r3J2
$$ plain form
6656 43 171 8 -105 66 56 -8 -53 284 -237 -176 -90 52 8 -90 36 196 -242 -69 -340 -121 3 -2 -111
6679 -111 58 -81 -74 -99 93 -48 -56 -125 -75 -5 -168 138 -148 -21 95 56 44 175 130 260 -69 -163 58 42
6703 42 131 -220 67 30 -29 38 -27 -36 48 80 330 79 -87 -81 -26 143 37 -52 245 158 298 -21 94 -22 -70
6728 -70 -88 14 26 -99 -34 41 34 -64 -99 140 -167 40 166 -9 151 78 49 -51 -72 250 -146 63 -13 102
6752 102 22 124 25 -37 -20 108 159 64 -6 -33 -34 -20 -263 -31 74 331 193 95 -466 135 -557 74 254 310
6776 310 297 330 -148 -207 11 193 243 -421 209 -267 -96 20 143 29 -136 -304 -308 -175 273 -103 465 195
6798 195 -55 43 -616 239 -9 -78 274 -122 -108 129 81 -38 122 716 275 -145 240 481 -172 -381 -154
6819 -154 -87 88 159 122 205 38 -144 -75 -103 91 -173 139 -76 264 2 156 -91 107 86 7 -99 14 -26
$$ packed form
6656D3J28j63j13J71j0o4m5L37n21O1Q6J42m4r8J26J60m38J73k71K19J24nj09
6679a11J69j39Pk5J92j41qo9N0P0j63L06k86J27J16l9j2J31m5J30l29r4K21j6
6703D2Q9l51K87l7n9O7o5rQ4L2K50k51j66ON5J69j06q9K97q7J40l19J15j16m8
6728g0j8J02J2j25O5P5pr8l5K39l07K07J26j75J60p3k9j00k1L22l96K09p6J15
6752A02q0J02r9o2J7J28N1r5p0k7jJ4k43K32J05K57j38r8n61O01o92O31J80N6
6776C10j3L3m78n9K18J82N0o64O30m76J71J16J23j14j65j68mJ33M48l76N68k70
6798A95k50R8o59Q55k48o9L52l96J4K37m8j19J60N94m41m20L85K41o53k09K27
6819a54O7J75P1l7Q3j67j82O9k8J94k64L12k15L40k62J54k47J98k1p9j06J13m0
$$ plain form
6842 -26 148 11 -82 205 -106 -16 103 4 30 25 -53 -9 -3 -126 -63 57 -203 -97 -57 -132 8 -81 440 253 141
6867 141 1 -134 -86 -77 73 -103 60 -201 348 -38 -35 175 73 95 -142 78 16 52 182 284 135 197 59
6890 59 332 58 5 0 59 111 -34 -168 61 -19 -39 -141 203 27 82 -57 -135 123 11 181 -60 -7 -58 -93
6914 -93 -65 -9 -207 -107 -255 58 285 96 87 209 33 187 -76 -238 125 -104 22 8 24 -10 100 -235 84
6937 84 -292 -11 150 -47 173 292 177 -29 -169 -409 46 -46 176 27 -182 -174 -44 117 60 -126 -237 28
6959 28 -29 157 13 56 276 81 163 3 216 -80 -108 223 -181 42 -36 117 -125 -116 -134 -33 33 312 -91
6982 -91 35 -24 -22 -38 113 234 -82 -54 12 -152 111 278 -79 -16 176 -42 -126 50 -35 -1 79 74 179 -217 40
7007 40 66 -68 -139 -9 96 -11 119 -18 177 -167 -16 -187 31 30 74 133 -128 -266 -11 58 -73 82 -392
$$ packed form
6842b6J74j37r3K87l11R0J19r9K6np8M4Oj23O3J20k60J06M0p5J40q9N21j87j12
6867A41j40j35M8RJ50j76J63k61N49l86LK10j02K2k37K20o2L6J30J02j49O2j38
6890E9K73k74n3nN9N2j45j34K29q0k0j02L44j76N5j39p8K58j12J70k41N3n1l5
6914i3K8N6j98J00j48L13K27j89rJ22j76J54k63j62L63k29J26j4J6l4J10l35L19
6937H4l76K81J61j97K20J19j15k06j40k40M55r2K22j49k09QJ30J61n7j86j11K65
6959B8n7J86j44M3K20j95Q2j60K13k96k8L31m04K23p8J53k42Rj8J01O6K79m03
6982i1J26n9Kj6J51J21l16K8O6j64K63J67l57O3J92k18q4J76q5L4Q0nJ05l96K57
7007D0K6j34p1J30J05j07J30j37J95l44J51j71K18jM4N9k61j38K55O9j31J55m74
$$ plain form
7030 -392 125 -29 133 -8 72 -118 -48 -66 102 36 9 236 -208 -43 -156 -133 183 -140 -33 18 -199 83
7052 83 -8 -149 -148 52 -74 -133 38 39 -133 -208 48 137 86 -32 84 -129 -86 129 21 -202 -102 -18 -202 151
7076 151 18 -170 293 7 -78 223 109 -20 -28 310 56 103 20 -23 314 -200 76 -115 -167 -174 -176 -240 -241 222 135
7101 135 -49 -76 219 -76 -21 26 166 -46 -26 -231 92 -23 -124 103 98 35 10 -116 -78 115 -125 135 -69
7124 -69 107 18 -36 -319 150 -240 -102 -10 -77 -140 -271 26 -164 -93 220 -151 30 -152 100 136 131 66 -30 118
7148 118 -56 157 -18 -15 -55 -44 260 291 -26 -228 -100 129 176 -60 -67 115 15 -68 177 -108 49 -27 60 138
7172 138 -117 71 177 80 -28 -155 -37 -52 206 365 -129 -119 -57 -18 -87 64 121 259 164 -190 -37 51 -41
7195 -41 -18 42 -80 100 -129 32 96 18 -61 16 56 -80 -163 -197 150 -97 230 -42 131 61 -178 60 -158 -87
$$ packed form
7030c92N17j54J62j41Q0j90P0j8J68o6k7K27m44J65j13K3L16l23J07N1k17K82
7052H3r1j41JK00j26n9J71Jj72p5K56Q9n1j18J16k13M3K15j08k23J00Q4j84L53
7076A51j33j88M63k86q5L01j14j29qL38k54M7q3m3L37n14K76j91n2pko4jM63q7
7101A35j84k7K95k95N5M7J40k12K0k05L23j15j01K27no3k5j26L8J93k40K60k04
7124f9J76q9n4k83M69l90J38R2o7o3j31K97j90P1L13l71J81j82K52L6no5r6J48
7148A18j74K13j75Lm0J1L04L1l17k02J28K29M7k36pJ82j00q3K45k85J57p6Q7P8
7172A38k55J88J06r7j08j27J18j5K58J59m94J0O2L9o9J51N7J38r5l54J53Q8r2
7195d1K3O0j22J80k29J61O4p8p9P7M0j36q3l4L47k47L27k72J73p0k39K38k18P1
$$ plain form
7219 -87 189 254 7 -129 88 29 14 36 -101 -44 -26 -125 130 -118 160 90 112 32 -96 -37 -149 74 -20 43 105
7244 105 -248 -13 41 38 -150 272 -36 -110 91 -48 112 -68 -31 26 -65 136 -65 -99 -20 192 -16 51 251
7267 251 49 124 136 -222 247 -154 -68 162 -248 105 29 -221 -324 36 -59 -163 -130 -228 104 8 -92 -95 -135 -212
7291 -212 196 -53 22 200 -38 13 -206 -26 12 -77 74 -218 73 53 18 74 211 -139 -159 32 -258 -1 82
7314 82 -99 33 -34 81 83 26 28 -49 -239 94 -207 -41 143 -120 -342 -137 13 -200 -167 -72 37 8 -82 -257
7338 -257 48 55 149 175 -93 -110 131 -97 -52 3 -215 -15 -27 -245 165 73 -132 59 80 434 -41 135 1
7361 1 66 62 30 -48 -84 5 -108 211 129 -2 25 155 3 97 -170 158 32 7 105 -337 217 66 53 87 -204
7386 -204 192 -7 5 71 -162 154 31 209 230 -268 265 241 -67 167 88 -1 -69 -81 289 144 13 -292 -153
$$ packed form
7219h7K76O5k47j36K17n9j5K2j37N7J8r9K55k48K78p0K2q0j28N9j12K23r4O3O2
7244A05l53K35N4lj88M22l08p4K01j39J60j80L7N7r1K01k01l4P9K12k08O7K00
7267B51k02P5J2l58M69m01Q6K30m10L53p6k50j03L60r5j04L3r8L32r6j00lm0p7
7291b12M08k49P5J78k38N1k19J80L8q9J51k92K91k0l5N6J37l50k0J91k90K57Q3
7314H2j81J32o7J15Kn7Kp7j90L33l01J66J84k63k22K05J50k13L3R5J09k9r0j75
7338b57L05PR4K6k68j7K41k28M5N5k18K00j2k18M10r2k05J91K1L54m75J76j34
7361AO5ml2p8l6Q9j13L19q2j31K7J30j52R4k67L28j26k5R8m42N54j51j3L4k91
7386b04L96j99J2O6k33L16j23J78K1m98N33k4l08K34p9q9o8j2L70j45j31l05J39
$$ plain form
7409 -153 122 251 31 -237 56 83 6 -52 -161 -33 -91 24 -77 270 -88 -67 84 -77 -23 -180 184 -418
7431 -418 51 149 -82 -114 33 -44 -110 -3 -124 -158 -186 1 112 26 -74 -57 -67 -78 -210 123 51 -259 -18 92
7455 92 -45 -38 -229 97 93 -244 16 175 -169 94 -67 -340 -64 -123 -28 -214 -265 -191 47 -226 -39 -14 330
7478 330 26 -24 -254 -67 93 80 84 -3 1 -30 -266 -151 -154 4 -77 -54 -279 -137 316 -173 276 -81 -92 -22 17
7503 17 -240 -89 -213 -118 -194 -10 -42 184 68 -203 156 -124 -194 -60 102 -140 39 52 -15 -60 -233 43 220
7526 220 -54 -154 -36 -74 151 19 15 -135 -50 -243 -141 10 9 -79 -68 -209 -60 -171 -52 -116 -192 146 -243
7549 -243 -90 60 23 12 229 -13 -71 -70 -14 -84 -247 112 0 51 53 -106 -278 142 251 -162 -114 -226 147 27
7573 27 -24 265 -25 -192 10 -116 -75 160 -100 39 -29 -167 -20 42 -88 102 -13 -125 -55 -34 141 16
$$ packed form
7409a53K75J29k20k68K93K7p7n8j09J28n8J15j01L47l58K1J51j61N4j57L64o02
7431d18M69R8k31l2J47p7o6J07j21l4k8J87J11q6j00J7j0j1j32L33p2l10K41J10
7455I2j37Pj91L26ml37K60J59l44K63j61k73K76n9R5j86n1P4K38k73J87K5L44
7478C30l04n0k30J87J60j3Mq7Ml1k36J15lJ58q1K3k25J42M53m89M49l57j1P0L9
7503A7k57J51j24R5p6J84l2K26j16k71L59k80p0J34J62k42J79J3o7m5j73K76J77
7526B20k74j00J18l8K25j32mj50Q5j93J02J51jq8J1j41J49j11J19o4p6L38l89
7549b43J53J50l7j1K17k42n8JN6p0j63L59j12N1Kj59j72M20J09m13M8j12L73j20
7573B7n1K89k90j67K02j26M1K35k60J39o8j38J47O2j30J90j15j12P0K1J75j25
$$ plain form
7595 16 26 8 20 80 148 -233 -134 -207 -77 -85 -122 100 -20 120 -98 86 27 7 54 68 -154 86 240 54 51 -128
7621 -128 -19 -239 252 -208 -114 57 -79 -1 -170 -259 -111 95 -79 -32 -83 -227 -108 -2 146 67 190 -42
7643 -42 91 244 88 56 -81 115 218 -271 25 94 144 249 -181 -85 -36 -106 -48 -9 21 75 -142 123 -104 118
7667 118 28 -193 230 -55 67 -322 -54 64 -43 -1 -230 156 -29 -28 6 -48 84 -61 -120 -114 -84 -14 -34 -56
7691 -56 -114 10 -70 26 -291 -123 -253 75 27 -65 118 32 21 234 -39 -47 155 198 155 22 -43 57 97 156 5
7716 5 -154 40 -4 89 -32 -101 -305 -85 150 -249 -135 -41 -187 6 -99 -81 -85 -188 -131 50 -8 -20 135 32
7740 32 -182 74 49 -54 103 100 -58 130 19 -179 -87 -91 13 -8 104 216 -80 126 91 122 191 34 -52 -20
7764 -20 -166 253 18 19 -74 7 303 77 48 -15 220 68 23 -363 99 23 181 112 -203 193 52 -132 -10
$$ packed form
7595A6J0j8J2O0O8l81R9p3J30ql7K22j20J40k18J84n9k0M7J4k22K40J54j86lj79
7621a28J09k20M91m60R4J71j36P8j69q9J48K06j74M7n1j44J19J06J48p9J23k32
7643d2J33J53j56l2j37J96J03m89K96O9N0J05m30R6M9p0N8L9L0N4k17K65k27K22
7667A18r0k21M23k85J22l89K68J18j07M2k29L86j85JL4n4J32j45n9OL0P0k0k2
7691e6n8J24q0R6l17J68j30L28m8r2J83q6j1K13k73qK02M3m3j33o5J00M0N9j51
7716Ej59J94m4R3j21o9k04K20K35l99J14R4j46J93j05J8mj03N7J81n8j2J55j03
7740C2k14K56k5j03J57lj58J88j11j98R2mJ04k1J12J12k96K06l5L1O9j57q6L2
7764b0j46M19k35Jr3Q1K96k26k9o3K35j52m5l86M62p6J58o9l15L96j41j84J22
$$ plain form
7787 -10 -76 -22 104 63 43 -138 -65 -229 -51 -89 -112 -293 223 -3 -177 3 52 -110 -243 43 -5 100 -290
7810 -290 164 49 110 40 -86 -123 -24 68 -54 -124 95 -71 -3 54 22 18 139 82 125 -53 -4 -154 166 -94 -86
7835 -86 56 144 -240 -92 -224 -201 -49 -106 -45 192 -201 -219 7 110 -425 49 -60 -14 69 -105 -101 9 -1 11
7859 11 -85 -170 -203 -102 277 -192 -278 -51 -75 -16 -58 -107 -140 -64 191 -53 127 -43 -67 -209 82 92 -45 -33 40
7884 40 186 94 -131 -76 39 75 16 -91 108 26 27 115 175 -94 43 -37 -239 -326 -43 119 -159 -45 -90 29
7908 29 68 -82 124 -169 70 -59 139 106 94 233 116 19 40 -126 -67 124 112 47 102 11 38 189 42 156
7932 156 -188 15 181 63 -153 -53 280 323 138 88 206 -80 199 72 77 -179 -208 -129 -80 -241 181 20
7954 20 49 8 -42 -178 -145 64 -47 -245 -26 294 -48 -128 151 -18 14 -9 1 59 159 18 -12 -135 246 -72
$$ packed form
7787a0o6N4J26m1k0j81P3j64J78l8k3j81N16k26j74J80M9j62j33K86m8J05l90
7810b90M54j15O1p0j26l7R9R2j22p0K19j66O8N7l2mJ21n7M3j78M9j50L20k60Q
7835h6J42Q8l84J48j32K3J52n7O1K37l93j8K26J03n35M74j09M6Q3j74MJ10j0J2
7859A1r6q5l3J01L79m69q6K27k4N9m2m9l3P6K55k44J80j70k4j42K91J0j37J2P3
7884D0J46r2k25N5J15L6n9j07J99q2JQ8O0k69J37q0k02q7K83J62k78J14m5J19
7908B9L9j50K06k93K39j29J98l3j2J39j17r7K1j66N9J91j2o5N5r1K7J51j47J14
7932A56l44K03J66j18k16J00L33M3j85n0J18k86K79j27Nk56k9P9M9j61M22j61
7954B0K9m1n0j36L3K09j11j98K19L20l42q0K79j69L2k3J0N8J00j41l0j23L81l18
$$ plain form
7978 -72 258 -214 -129 157 69 294 -51 -5 -105 -197 -129 -60 118 44 -40 71 -16 -110 -36 -76 -252 149 -17 -75 -133
8003 -133 -38 -43 6 240 -82 -207 -182 8 105 -19 -105 167 -85 81 24 84 -17 -84 -174 115 -169 -114 103 274
8027 274 263 19 11 121 30 64 -118 108 55 -136 15 -187 182 68 -146 -89 -107 -265 285 -114 -40 -1 -124
8050 -124 -133 305 13 -38 140 -180 -134 178 140 59 128 -149 -13 142 -38 26 56 101 -177 12 10 68 85 102 122
8075 122 32 148 198 97 -16 3 69 8 193 -213 308 88 201 -72 73 -3 -31 -60 -145 -42 25 139 91 12
8099 12 -87 -105 -52 376 245 1 -123 -327 -183 -83 125 0 -217 33 -313 -225 -213 62 82 111 42 -21 -114 182
8123 182 -68 166 64 83 -314 -93 -105 85 5 -189 6 -186 114 227 0 -56 100 -160 180 -229 -29
8144 -29 44 -24 39 230 -92 26 225 138 297 -25 -154 101 94 -18 55 -299 -11 17 -42 -29 9 -109 -56 -235
$$ packed form
7978g2L30m72Q5K86q8K25l45M6j00r2O8O9J78p4q4J11q7r4P4m0j76M01j66n8n8
8003a33R5nM9K34l22j25K5J90R7j24q6K72k52J66n7O0j01o7r0K89k84N5K17J71
8027B74j1k44qJ10r1L4j82K26n3j91J51k02L69j14k14N7j8j58N50l99P4L9j23
8050a24rM38k92n1J78l20M6L12l8q1O9k77J36J55j80O4L0M5k78J89kN8J7J7K0
8075A22r0J16N0j01j13J9O6o1J85m06N21k20J13k73J45p6k8k9q5J03O7J14m8p9
8099A2r9j8N3M28j31k44j24k04J44J00K08j25k17K50l46Q8J2K75K0K9o9o3r3K96
8123A82k50K34j02J9l97K21j2J90q0j94J95j92L00J13k27n6J56k60L40m09K00
8144b9P3o8O3J91l22J18J99q7J59l22j29K55pj12P3l54K88K8n9J3L8j18N3j79
$$ plain form
8168 -235 105 -127 -128 -155 -172 35 9 57 140 -11 -160 -123 -61 39 85 233 230 -151 89 111 -17 -140 -55
$$ packed form
8168b35L40k32jk7j7K07k6M8Q3j51j49L7O2J00M6J48ll81K40K2j28j23Q5
8191e5
$$ Imaginary data points
##PAGE= N=2
##DATA TABLE= (X++(I..I)), XYDATA
$$ plain form
0 0 0 0 0 0 0 0 0 0 0 0 -8 8 -8 8 -14 16 -24 24 -32 40 -48 56 -64 78 -90 106 -123 145 -168 194 -221 253
32 253 -289 328 -371 418 -471 529 -592 661 -738 823 -913 1012 -1121 1239 -1367 1508 -1665
49 -1665 1834 -2018 2224 -2450 2700 -2978 3291 -3644 4044 -4504 5039 -5672 6428 -7358 8528
64 8528 -10057 12149 -15211 20198 -30287 99928 -248746 -127560 -28525 -118140 279041 107625
76 107625 -1700 -187716 -170193 75356 103485 198756 -31550 -200629 -82472 -87235 253403
87 253403 126970 -87682 -9853 -251685 -13905 229142 95810 41940 -204139 -85466
97 -85466 4593 26706 269159 -27043 -181040 -74225 -72461 149106 134724 38481 -121258
108 -121258 -198772 56414 56088 139775 95961 -184938 -81835 -76121 96731 225405 -76449
$$ packed form
0@%%%%%%%%%%qJ6j6J6k2L0m0M8n6P2q8J04j20J42j68J96k29K68l13L62m15M74
32B53n42O17o99P89q89J000j121J253j399J561j736J925k133K360k606K875l173
49a665L499l852M242m674N150n678O269o935P688q548R543j0711J2100j3786J5886
64H528j8585K2206k7360L5409n0485J30215l48674J21186R9035q9615L97181j71416
76A07625j09325j86016J7523K45549K8129R5271k30306j69079J18157m763L40638
87B53403j26433k14652P7829k41832K37780K43047j33332n3870k46079J18673
97h5466R0059K2113K42453k96202j53997J06815J764K21567j4382r6243j59739
108a21258p7514K55186l26Q3687m3814k80899J03103N714J72852J28674l01854
$$ plain form
119 -76449 -43682 -98290 -129862 146716 133105 45962 -100709 -143312 -16469 31084 183907
130 183907 51952 -125699 -71505 -98706 90056 143443 24260 -11512 -184076 -54851 115126
141 115126 69919 91953 -63936 -132639 -58651 30307 167250 44429 -62822 -90545 -104005
152 -104005 71697 113491 67992 -29190 -140300 -42298 17014 109520 113375 -80391 -92462
163 -92462 -74333 14358 137680 48961 -10647 -101122 -111188 54646 94151 79352 -13443 -111074
175 -111074 -68854 2772 111539 83509 -29450 -73245 -105590 13831 109860 64515 8401
186 8401 -102300 -89758 18208 71130 98194 17 -94428 -78691 -8633 89838 84470 3849
198 3849 -76315 -95176 -299 74002 86766 18817 -87469 -82265 -14619 68418 96615 9503
$$ packed form
119g6449L2767n4608l1572K76578j3611q7143j46671m2603J26843M7553J52823
130A83907j31955j77651N4194k7201J88762N3387j19183l5772j72564J29225J69977
141A15126m5207K2034j55889o8703P3988Q8958J36943j22821j07251k7723j3460
152a04005J75702M1794m5499r7182j11110R8002N9312R2506L855j93766j2071
163i2462J8129Q8691J23322q8719n9608r0475j0066J65834L9505j4799r2795r7631
175a11074M2220P1626J08767k8030j12959m3795l2345J19421R6029m5345n6114
186H401j10701J2542J07966N2922K7064r8177r4445J5737P0058R8471n368q0621
198C849q0164j8861R4877P4301J2764o7949j06286N204O7646Q3037K8197q7112
$$ plain form
210 9503 -67048 -85245 -25484 73015 85091 21911 -61788 -90420 -21817 62379 87734 25220
222 25220 -60412 -84757 -32821 58142 87623 28783 -52350 -86607 -33635 52158 83672 36681
234 36681 -46579 -85483 -35670 48383 80203 41463 -42282 -86750 -36974 38568 80565 45555
246 45555 -41269 -78177 -46009 32982 82369 43428 -29929 -78876 -47596 32367 73757 52496
258 52496 -29570 -77038 -44683 18443 78297 51592 -26226 -67798 -58427 20321 73429 49592
270 49592 -11644 -74353 -53051 16065 64241 60685 -16177 -66591 -53069 5804 70387 52632
282 52632 -5956 -61421 -64398 11056 58231 57153 2803 -67696 -53562 -1202 56298 64439 -5074
295 -5074 -53312 -58761 -6107 60730 53956 8791 -54155 -63059 -1850 44748 63265 11551 -55407
$$ packed form
210I503p6551j8197N9761R8499J2076o3180q3699k8632O8603Q4196K5355o2514
222B5220q5632k4345N1936R0963K9481n8840q1133l4257N2972Q5793L1514m6991
234C6681q3260l8904M9813Q4053L1820l8740q3745m4468M9776P5542M1997l5010
246D5555q6824l6908L2168P8991M9387l8941p3357m8947L1280P9963M1390k1261
258E2496q2066m7468L2355O3126N9854k6705p7818m1572R371P8748N3108k3837
270D9592o1236o2709K1302O9116M8176l556p6862n0414J3522N8873O4583j7755
282E2632n8588n5465k977P5454M7175j078n4350p0499J4134N2360N7500Q141o9513
295e074m8238n449N2654O6837o774m5165o2946q904O1209M6598J8517n1714o6958
$$ plain form
308 -55407 -54445 -15070 48889 61635 8920 -41187 -63311 -12857 47159 54080 21945 -45271 -60216
321 -60216 -14106 35436 62778 18025 -39415 -55441 -27129 40880 57495 19865 -30738 -61970
333 -61970 -20783 33895 54490 28562 -34521 -54028 -25705 26486 60727 24986 -26741 -54818
345 -54818 -32013 28704 51593 30709 -21629 -58642 -28220 22572 51539 32684 -21453 -51604
357 -51604 -34076 20609 52586 30606 -13288 -51171 -37635 18137 49111 35542 -13599 -50250
369 -50250 -34599 10170 47601 38433 -12812 -47600 -35394 8854 44669 38863 -5031 -48162
381 -48162 -38906 9715 40916 37998 -80 -45455 -41696 4939 41732 38097 -1433 -39197 -41287
394 -41287 -862 42539 38797 874 -37278 -41478 -1885 35457 42568 7385 -42402 -38241 -2402
$$ packed form
308e5407R62L9375O3959J2746n2715n0107k2124N0454O0016O921l2135o7216j4945
321f0216M6110M9542K7342m4753n7440j6026K8312O8009J6615l7630n0603l1232
333f1970M1187N4678K0595k5928o3083j9507K8323N2191L4241l5741n1727k8077
345e4818K2805O0717K2889k0884n2338l7013L0422N0792K8967j8855n4137l0151
357e1604J7528N4685L1977k1980m3894l7883J3536N5772L0974j3569m9141l6651
369e0250J5651M4769L7431r168n1245l4788J2206M4248L5815n806m3894m3131
381d8162R256M8621L1201k918l8078m5375L759M6635L6793l635l9530l7764k090
394d1287M0425M3401l742l7923l8152m200L9593L7342P111l5183m9787M161L5839
$$ plain form
407 -2402 29722 43170 8882 -36156 -42743 -4946 33464 36049 14277 -31486 -47445 -3471 28688
420 28688 38683 15723 -31323 -39800 -14391 27689 45179 9431 -27099 -38985 -14044 23742
432 23742 39126 21484 -30487 -41049 -9419 15722 43473 21079 -27328 -37136 -19160 22115
444 22115 37433 18766 -13409 -46358 -18957 22092 33797 23627 -20082 -36247 -20519 11346
456 11346 43628 20297 -15525 -35404 -26516 17113 33141 25915 -10461 -43252 -15792 7035
468 7035 30401 35125 -16068 -36318 -22143 7330 35571 23075 -4619 -35060 -28510 10205 28921
481 28921 31682 -6309 -36028 -21656 -767 34488 28370 -9069 -24003 -32055 1369 33792 24838
494 24838 2506 -33923 -27812 5167 22822 32410 1527 -29325 -27945 -3037 30289 25583 5358
$$ packed form
407b402L2124J3448l4288m5038o587L7797L8410K585k1772m5763j5959M3974L2159
420B8688R995k2960m7046q477K5409M2080J7490l5748l6530j1886K4941L7786
432B3742J5384j7642n1971j0562L1630K5141K7751k2394m8407r808J7976M1275
444B2115J5318j8667l2175l2949K7401M1049J1705j0170m3709j6165J5728L1865
456A1346L2282k3331l5822j9879Q888M3629J6028p226l6376l2791K7460K2827
468G035K3366M724n1193k0250J4175K9473K8241j2496k7694l0441O550L8715J8716
481B8921K761l7991k9719J4372K0889L5255o118l7439j4934q052L3424L2423q954
494B4838k2332l6429O111L2979J7655R588l0883l0852J380K4908L3326m706k0225
$$ plain form
507 5358 -25672 -35909 5159 21326 25148 12892 -30886 -29092 -3180 20917 33198 4014 -22462
520 -22462 -28703 -8479 24096 26540 10591 -21087 -31628 -5734 17709 31499 9741 -22437
532 -22437 -25864 -12086 19129 28708 10123 -13604 -34681 -10408 21738 22205 14768 -13234 -32811
545 -32811 -11743 17466 25696 13346 -10419 -32005 -15051 18489 23257 15568 -10324 -31254 -12000
558 -12000 10195 25137 19911 -13259 -28562 -13690 9376 24123 19330 -8817 -28848 -14864
570 -14864 7715 23807 20053 -7985 -25333 -19002 7643 26449 15158 -3286 -23095 -21678 7198
583 7198 23959 18894 -4718 -22953 -18659 1707 24825 19040 -2662 -21295 -22742 5277 19518
596 19518 19231 3875 -26623 -18581 3045 16908 23617 -638 -20201 -20746 -2194 22172 18015
$$ packed form
507E358l1030j0237M1068J6167L822j2256m3778J794K5912K4097J2281k9184k6476
520b2462o241K0224L2575K444j5949l1678j0541K5894K3443J3790k1758l2178
532b2437l427J3778L1215R579j8585k3727k1077K4273L2146M67p437k8002j9577
545c2811K1068K9209Q230j2350k3765k1586J6954L3540M768p689k5892k0930J9254
558a2000K2195J4942n226l3170j5303J4872K3066J4747m793k8147k0031J3984
570a4864K2579J6092l754k8038j7348O331K6645J8806j1291j8444j9809J417K8876
583G198J6761n065k3612j8235M294K0366K3118n785k1702j8633j447K8019J4241
596A9518k87j5356l0498Q042K1626J3863O709k4255j9563n45J8552K4366m157
$$ plain form
609 18015 3436 -19107 -23224 1169 14774 23718 3423 -22010 -15265 -8087 17640 24342 -633
622 -633 -12507 -23398 -5109 18716 16846 9610 -18029 -21696 -2729 10112 25500 4374 -14850
635 -14850 -17636 -12594 18905 18301 5848 -7654 -27435 -3542 11685 17428 14967 -17391 -17641 -8627
649 -8627 7788 26006 4351 -7424 -19813 -13952 15856 14475 13507 -7987 -25087 -3958 3077
662 3077 21731 14179 -14207 -12465 -15821 7880 22867 5887 -397 -22964 -12584 11019 11507
675 11507 18416 -7675 -19537 -8410 -858 23817 10276 -5768 -11817 -20881 9464 16451 9759
688 9759 3029 -23381 -9373 2304 12430 21178 -8346 -13488 -12997 -2670 21504 8796 2609
701 2609 -14321 -19840 7683 9022 16216 3549 -20939 -8505 -4427 14537 17995 -4815 -6798
$$ packed form
609A8015j4579k2543m117K4393J3605Q944k0295k5433O745P178K5727O702k4975
622f33j1874j0891J8289K3825j870p236k7639l667J8967J2841J5388k1126j9224
635a4850k786N042L1499o04j2453j3502j9781K3893J5227N743k461l2358k50R014
649h627J6415J8218k1655j1775j2389N861K9808j381r68k1494j7100K1129P035
662C077J8654p552k8386J742l356K3701J4987j6980o284k2567J0380K3603M88
675A1507O909k6091j1862J1127P552K4675j3541j6044o049r064L0345O987o692
688I759o730k6410J4008J1677J0126Q748k9524n142M91J0327K4174j2708o187
701B609j6930n519K7523J339P194j2667k4488J2434M078J8964L458k2810j983
$$ plain form
714 -6798 -18816 -2110 17385 9257 7589 -15983 -15836 2136 5699 20427 1288 -14098 -9974
727 -9974 -9398 15892 14145 1298 -6263 -21178 -234 10331 11311 10380 -15165 -12803 -4338 6408
741 6408 20056 848 -7479 -13420 -9757 13533 10512 7442 -6181 -18967 -1729 4653 15279
754 15279 8904 -12008 -9412 -9676 6366 17464 3058 -2616 -16066 -9109 9849 9870 10580 -6645
768 -6645 -14638 -5334 1277 16216 8094 -6366 -10194 -12477 7146 13176 6494 -369 -15993 -8130
782 -8130 4162 10201 12739 -5929 -11888 -8648 451 14960 7428 -1864 -10268 -12113 3851 10173
796 10173 10827 -680 -13752 -7334 -711 10938 12063 -3383 -8527 -10737 -874 12920 8913 972
810 972 -10642 -10897 902 8432 11586 514 -9925 -9450 -2782 10744 10501 240 -7508 -12066 -1418
$$ packed form
714f798j2018J6706J9495q128j668k3572J47J7972L563J4728j9139j5386M124
727i974N76K5290j747j2847p561j4915K0944J0565R80r31k5545K362Q465J0746
741F408J3648j9208q327n941L663K3290l021l070j3623j2786J7238O382J0626
754A5279o375k0912K596k64J6042J1098j4406n674j3450O957J8958K1P10j7225
768f645p993R304O611J4939q122j4460l828k283J9623O030o682o863j5624P863
782h130J2292O039K538j8668n959L240R099J4509p532r292q404j845J5964O322
796A0173O54j1507j3072O418O623J1649J125j5446n144k210R863J3794m007p941
810I72j1614k55J1799P530L154j1072j0439M75O668J3526k43j0261p748m558J0648
$$ plain form
825 -1418 9188 9637 3095 -9528 -10240 -2245 7389 12293 1303 -8362 -9473 -3876 7548 10998 3534
840 3534 -7712 -10407 -2835 5889 11346 4369 -7771 -9535 -4640 6027 11289 3221 -5387 -9900
854 -9900 -5823 6751 10469 3643 -4607 -9323 -6019 4667 11729 4368 -5389 -8889 -6143 4087
868 4087 10660 5636 -4273 -9980 -5223 3673 9128 6705 -3508 -10093 -6051 3662 9133 5772 -1719
883 -1719 -9033 -7685 3323 10031 5777 -2623 -7259 -7169 450 10418 6823 -3527 -6891 -6619 52
898 52 9202 7362 -1310 -8340 -7116 1500 7410 6468 580 -7907 -8833 1573 8784 4903 710 -5304
914 -5304 -9580 -3 8786 5838 70 -5927 -7493 -1586 7012 8521 -54 -6617 -6681 -1369 5746 7562
930 7562 2177 -6858 -8123 -58 5055 6592 2798 -5664 -8123 -2460 6806 7028 415 -2763 -8139
$$ packed form
825a418J0606M49o542j2623p12P995R634M904j0990r665j111N597J1424L450p464
840C534j1246k695P572Q724N457o977j2140j764M895J0667N262q068q608m513
854i900M077J2574L718o826q250m716L304J0686P062p361r757l500K746J0230
868D087O573n024r909n707M757Q896N455k423j0213o585M042R713N471l361p491
883a719p314J348J1008O708m254q400m636R0P619R968l595j0350l364K72O671
898E2R150j840q672p030J224Q616N910r42n888q487r26J0406P211l881m193o014
914e304m276R577Q789k948n768n997j566N907Q598J509q575o563o4N312P115J816
930G562n385r035j265Q065N113J537l794q462k459N663R266K22o613l178n376
$$ plain form
945 -8139 -4350 7677 7093 1328 -3869 -7052 -3139 4107 8365 2864 -4991 -6449 -3211 3850 6748
960 6748 3807 -2854 -9206 -2493 4844 4786 4615 -3147 -7965 -3563 3315 7351 2300 -2581 -5330 -6221
976 -6221 3518 7331 3329 -2409 -7064 -3118 886 6364 5996 -3969 -5315 -4040 1181 7579 3133
991 3133 -338 -6201 -6487 3313 4676 4809 251 -7369 -4257 370 6623 5308 -2511 -3867 -6130 452
1007 452 6811 3545 559 -6226 -5123 1453 3520 6663 -268 -6067 -3524 -1366 5812 5200 -299
1022 -299 -3520 -6635 694 5000 4153 1941 -6211 -3872 -1146 3135 7418 -1356 -3436 -4289 -2990 6421
1038 6421 3824 1126 -2767 -7087 501 2727 4647 2911 -5693 -3625 -2226 3227 6540 -199 -1494
1053 -1494 -5719 -2711 5250 3031 3164 -2921 -6389 192 1016 5540 2637 -4159 -3075 -3924 2855 5648
$$ packed form
945h139L789J2027n84n765n197l183L913P246M258n501p855j458L238P061K898
960F748k941o661o352O713P337n8j71p762m818M402O878M036n051m881k749q91
976f221R739L813m002n738m655L946M004N478l68r965j346J275N221O398m446
991C133l471n863k86R800J363J33m558p620L112M627O253j315p819j356k263O582
1007D52O359l266k986o785J103O576K067L143o931n799K543K158P178o12n499
1022b99l221l115P329M306q47k212q152K339K726M281M283q774k080q53J299R411
1038F421k597k698l893m320P588K226J920j736q604K068J399N453L313o739j295
1053a494m225L008P961k219J33o085l468O581Q24M524k903o796J084q49O779K793
$$ plain form
1069 5648 973 -661 -6185 -2144 2910 3311 4168 -3132 -4523 -1629 -77 6602 1572 -2183 -3138 -4715
1085 -4715 3509 3640 2446 462 -6462 -1445 741 3612 4943 -3422 -2908 -3184 -351 6133 1356 83
1101 83 -3674 -4532 2757 2273 4265 -126 -5786 -957 -1202 3833 4737 -2232 -1992 -4351 157 5226 1840
1118 1840 1244 -4290 -3584 640 2120 5039 -718 -3465 -1991 -2329 4423 3560 -711 -1862 -4665 502
1134 502 2583 2865 2058 -4963 -2520 -401 1228 5123 -646 -2128 -3110 -2106 4200 2245 987 -1815
1150 -1815 -4767 -97 1384 3967 1334 -3876 -1537 -2373 1372 4851 10 -1537 -3434 -1588 2792
1165 2792 2305 2310 -2206 -3325 -516 606 3807 1602 -2100 -2260 -2792 2107 3511 900 -694 -3641
1181 -3641 -1819 1105 2958 2731 -2562 -2663 -1422 -112 4186 1567 -1299 -2441 -2481 1044 2391 2182
$$ packed form
1069E648m675j634n524M041N054M01Q57p300j391K894J552O679n030l755r55j577
1085d715Q224J31j194j984o924N017K186K871J331q365N14k76K833O484m777j273
1101H3l757q58P289m84J992m391n660M829k45N035R04o969K40k359M508N069l386
1118A840n96n534P06M224J480K919n757k747J474l38O752q63m271j151k803N167
1134E02K081K82q07p021K443K119J629L895n769j482r82J004O306j955j258k802
1150a815k952M670J481K583k633n210K339q36L745L479m841j547j897J846M380
1165B792m87Nm516j119K809J122L201k205l702j60n32M899J404k611j594k947
1181c641J822K924J853k27n293j01J241J310M298k619k866j142m0L525J347k09
$$ plain form
1197 2182 -432 -3644 -1615 742 2761 2526 -1038 -2334 -2491 496 3390 1569 -562 -2225 -2365 507
1213 507 2294 2355 -415 -2488 -2043 -570 2460 2457 -63 -2475 -1957 -49 2113 2673 -72 -2343 -2061
1230 -2061 -308 1981 2359 345 -2197 -2527 -103 1925 2230 477 -2166 -2115 -845 1977 2362 -41
1246 -41 -1325 -2301 -798 1738 2042 1057 -1910 -2423 -582 825 2647 469 -1614 -2042 -1223 1755 2149
1263 2149 832 -912 -2654 -338 1264 1882 1333 -1737 -1518 -1175 837 2887 274 -641 -1945 -1630
1279 -1630 1396 1474 1651 -880 -2633 -645 311 2089 1355 -1485 -1168 -1606 644 2016 757 232 -2555
1296 -2555 -1348 1238 902 2264 -656 -2107 -659 -294 2646 1130 -852 -718 -2224 753 1346 1216
1312 1216 610 -2457 -1149 -40 1171 2409 -861 -1232 -1422 -404 2162 526 329 -1135 -1799 985
$$ packed form
1197B182k614l212K029K357K019k35l564j296j57K987K894j821k131j663j40K872
1213E07J787O1k770k073M45J473L030lk520k412N18J908K162N60k745k271K82
1230b061J753K289L78k014k542l30K424K028L05j753k643N1J270K822L85k403
1246d1j284r76J503K536L04r85k967n13J841J407J822k178k083m28Q19K978L94
1263B149j317j744j742K316J602O18n49l070K19L43K012K050k613r15j304L15
1279a630L026P8J77k531j753J988R56J778p34k840L17m38K250J372j259n25k787
1296b555J207K586l36J362k920j451J448L65K940j516j982J34j506K977N93j30
1312A216o06l067J308J109J211J238l270l71j90J018K566j636j97j464o64K784
$$ plain form
1328 985 555 1425 852 -2292 -676 -518 1166 2172 -286 -647 -1893 -282 1308 494 1014 -1588 -1543
1345 -1543 110 250 2111 24 -1468 -693 -1402 1315 1812 140 -378 -2037 -103 1025 1066 1050 -1479
1362 -1479 -1065 -399 368 1968 102 -516 -1274 -1342 1500 893 576 -246 -1871 -484 298 1268 1011 -1285
1380 -1285 -606 -796 233 1655 532 -212 -1254 -825 634 1001 1168 -618 -1219 -170 -278 1660 753
1397 753 -569 -509 -1402 299 1653 648 -39 -1271 -1094 54 858 1077 -566 -1014 -916 -270 1168 921
1415 921 225 -836 -936 77 636 1060 356 -1251 -539 141 521 1064 -130 -644 -797 -424 873 856 -44
1434 -44 -345 -1097 -197 897 1221 314 -970 -798 -311 475 1092 145 -773 -1012 -331 924 719 266 -190
1453 -190 -995 -274 696 600 408 -399 -732 -435 646 956 403 -196 -936 -364 524 564 907 -380 -950 -149
$$ packed form
1328I85m30Q70n73l144J616J58J684J006k458l61j246J611J590q14N20k602M5
1345a543J653J40J861k087j492P75p09K717M97j672n18j659J934J128M1j6k529
1362a479M14O66P67J600j866o18p58o8K842o07l17q22j625J387P82R70k57k296
1380a285O79j90J029J422j123p44j042M29J459L67J67j786o01J049j08J938r07
1397G53j322O0q93J701J354j005o87j232J77J148Q04K19j643m48R8O46J438k47
1415I21o96j061j00J013N59M24p04j607P12O80L80N43j194n14j53L73J297j7r00
1434d4l01p52R00J094L24r07j284J72M87P86O17r47r18k39O81J255k05m53m56
1453a90q05P21R70r6j92q07l33K97J081L10n53n99p40N72Q88M0L43j287n70Q01
$$ plain form
1473 -149 70 654 704 -384 -704 -155 194 865 306 67 -722 -899 339 476 539 -170 -452 -449 31 995 484
1494 484 -175 -445 -588 175 586 555 72 -866 -497 173 178 464 56 -568 -591 314 534 268 353 -389 -741 -80
1516 -80 495 539 -112 -571 -179 -499 512 777 -144 -621 -419 -383 273 600 140 -640 -40 -333 273 559 167
1537 167 -6 -550 -66 324 279 189 -71 -413 -458 179 393 11 -69 -338 -663 373 497 288 -160 -709 -14
1558 -14 210 387 411 -477 -321 -238 45 376 210 -37 -187 -513 217 459 43 221 -561 -232 -277 701 403
1579 403 -394 -12 -465 -20 608 143 131 -354 -376 137 67 631 -293 -340 202 -450 183 365 -7 -97 -726 52
1601 52 102 144 557 -355 185 -53 -63 511 -210 -111 -204 -461 453 281 228 -64 -590 238 -40 407 544 -472
1623 -472 1 -283 -67 420 -94 112 -562 -269 368 -194 597 -238 -540 88 -440 617 270 -276 -44 -350
$$ packed form
1473a49K19N84N0j088l20N49L49O71n59k39p89j77J238J37O3p09k82LM80R64n11
1494D84o59k70j43P63M11l1m83r38L69O70NK86m08o24k3R05K20k66Q5p42l52O61
1516h0N75M4o51m59L92l20J011K65r21m77K02L6O56L27m60p80O00k93O06K86l92
1537A67j73n44M84L90m5r0k60l42m5O37K14l82q0k69l25J036J24k09m48n49O95
1558a4K24J77K4q88J56Q3K83L31j66k47j50l26P30K42m16J78p82L29m5R78k98
1579D03p97L82m53M45O28m65j2m85k2N13p0N64r24m7N42o52O33J82l72r0o29P78
1601E2N0M2M13r12N40k38j0N74p21R9r3k57R14j72n3k92n26Q28k78M47J37j016
1623d72M73k84K16M87n14K06o74K93O37n62P91q35l02O28n28J057l47n46K32l06
$$ plain form
1643 -350 161 267 9 362 -593 -155 255 -115 705 -171 -48 134 -343 539 -80 156 -177 -729 624 -362
1663 -362 27 339 -921 261 -212 104 582 -439 383 -597 -374 283 -406 421 -150 -439 514 -126 352
1682 352 -95 -259 401 -312 524 26 -48 485 -509 38 252 0 564 -377 -165 -8 -462 746 -38 -14
1702 -14 -1 -708 720 -110 -13 297 -618 192 -222 63 577 -349 216 -337 -174 517 -372 288 -58 -231 305
1723 305 35 437 177 -324 200 -437 495 157 -544 349 -326 252 216 -311 307 -427 -211 215 -258 800
1743 800 -72 -47 227 -532 386 56 60 392 -552 5 110 -71 480 -268 125 -181 -186 272 -175 310 -71 -139
1765 -139 470 -329 410 127 -727 204 -429 116 303 -161 6 -275 63 67 -188 218 -532 -201 139 -25 426
1786 426 -347 -154 91 -413 384 59 117 -206 -457 59 19 259 504 -247 -22 0 -94 392 -187 217 -131
$$ packed form
1643c50N11J06k58L53r55M38M10l70Q20q76J23J82m77Q82o19K36l33n52J353r86
1663c62L89L12j260J182m73L16M78j021Q22r80K23O57o89Q27n71k89R53o40M78
1682C52m47j64O60p13Q36m98p4N33r94N47K14k52N64r41K12J57m54J208p84K4
1702a4J3p07J428q30R7L10r15Q10m14K85N14r26N65n53J63O91q89O60l46j73N36
1723C05k70M02k60n01N24o37R32l38p01Q93o75N78l6n27O18p34K16M26m73J058
1743H00q72K5K74p59R18l30ML32r44N57J05j81N51p48L93l06nM58m47M85l81o8
1765a39O09p99P39k83q54R31o33N45J87m64J67k81L38Mk55M06p50L31L40j64M51
1786D26p73J93K45n04P97l25N8l23k51N16m0K40K45p51K25K2r4M86n79M04l48
$$ plain form
1807 -131 -152 35 -30 147 7 -273 127 92 462 310 -440 -4 -371 70 307 -90 4 -402 -192 65 69 262
1829 262 -86 -200 154 -144 395 91 10 -42 -317 13 163 232 184 -420 -100 77 148 37 -149 -108 -451 118
1851 118 189 186 50 -238 -101 207 102 72 -8 -184 -68 -352 326 95 -52 -216 -52 147 -185 292 51 105
1873 105 293 -128 -35 246 -57 14 -329 -39 -9 13 168 -155 -233 -94 89 310 147 -389 -427 -45 101 139
1895 139 386 -79 -533 75 83 179 336 -144 -327 -109 307 198 -140 315 -262 21 625 74 355 -149 -413
1916 -413 -175 -116 236 91 -192 -117 -296 -128 143 178 78 -298 -21 -250 -11 343 -47 -129 4 95 132 187
1938 187 89 -171 -54 199 269 192 187 -222 -38 -170 -27 363 -23 41 -280 190 259 207 231 -337 -278 -136 261
1961 261 89 78 -275 -240 -236 -32 404 136 19 -139 16 316 113 108 21 -350 -155 169 222 112 -77 -289 -323
$$ packed form
1807a31k1J87o5J77j40k80M00l5L70j52p50M36l67M41K37l97R4m06K10K57MJ93
1829B62l48j14L54k98N39l04q1n2k75L30J50O9m8o04L20J77P1j11j86M1l43N69
1851A18P1lj36k88J37L08j05l0q0j76J16k84O78k31j47j64J64J99l32M77k41N4
1873A05J88m21R3K81l03P1l43K90L0K2J55l23p8J39J83K21j63n36l8L82J46L8
1895A39K47m65m54O08QR6J57m80j83K18M16j09l38M55n77K83O04n51K81n04k64
1916d13K38N9L52j45k83P5j79J68K71L5j00l76K77k29K39L54l90q2J33R1L7N5
1938A87r8k60J17K53P0p7nm09J84j32J43L90l86O4l21M70O9n2K4n68N9J42L97
1961B61j72j1l53L5MK04M36k68j17j58J55L00k03nq7l71J95L24N3j10j89k12l4
$$ plain form
1984 -323 101 200 122 92 -251 -262 38 275 218 -95 -344 57 -164 144 202 -131 -401 18 216 155 148 -21 -55
2007 -55 -264 4 56 45 -54 -349 -67 33 306 268 -229 -333 -156 -22 1 -115 87 -511 -81 -139 -90 176 60
2030 60 -26 -187 -248 240 324 47 -129 -329 -36 205 158 166 -258 -5 41 266 492 -119 -271 -175 -123 9 -12 176
2054 176 -496 -155 119 6 395 -113 -157 -257 -136 207 190 163 -101 -515 111 306 253 117 -361 -175 -41
2075 -41 21 341 -65 -116 -199 -4 388 143 295 -21 -410 122 -77 313 151 -224 -63 -58 -32 181 -286 -42
2097 -42 -295 -21 223 134 180 1 -123 -271 -91 653 353 3 -347 -511 -272 72 163 29 -328 -148 202
2118 202 -66 401 -226 -138 -97 118 231 81 109 -328 -301 245 -87 -185 121 -467 -144 228 66 410 -201 -96
2140 -96 -388 -58 238 132 221 -427 -140 -132 109 249 13 -107 -241 -222 123 409 104 -145 -229 -125 378 404
$$ packed form
1984c23M24R9p8l0l43j1L00K37n7l13k49M01k21L08N8l33k70M19J98o1pj69l4
2007e5k09K68N2j1r9k95K82J00K73l8m97j04J77J34K3j16K02n98M30n8M9K66j16
2030F0q6j61o1M88Q4k77j76k00K93K41m7Qm24K53M6K25K26o11j52R6N2J32k1J88
2054A76o72L41K74j13L89n08m4j00J21L43j7k7k64m14O26J95n3j36m78J86J34
2075d1O2L20m06n1q3J95L92k45J52l16l89N32j99L90j62l75J61NK6K13m67K44
2097d2k53K74K44q9M6j79j24j48J80P44l00l50l50j64K39L44R1j34l57J80L50
2118B02k68M67o27Q8M1K15J13j50K8m37K7N46l32r8L06n88L23L72j62L44o11J05
2140i6k92L30K96j06Q9o48K87QK41J40k36j20j34J9L45K86l05k49q4J04N03K6
$$ plain form
2162 404 276 -46 -147 182 -104 203 74 -52 -297 -163 200 122 63 -159 -165 -39 35 -74 198 -224 84 -193
2184 -193 135 465 24 -219 -253 -37 80 173 107 -40 -156 -257 107 130 -189 -83 -335 -137 23 99 234 -50
2206 -50 -183 61 -48 728 54 -123 -185 -441 155 336 629 404 -187 -380 -265 317 -153 -291 -183 39 249
2227 249 91 181 13 -194 -129 218 215 366 -277 -185 -364 141 382 239 24 -1 -376 219 227 236 -9 -141 -84 -42
2251 -42 170 127 199 -99 -469 -253 359 115 201 54 -136 248 152 120 3 -210 -258 28 75 104 -121 -28 -60 -210
2275 -210 79 289 227 -124 -232 -9 138 60 -45 -180 -161 13 28 94 170 195 -376 14 63 99 127 97 -337 23
2299 23 -128 287 180 33 -44 7 169 72 61 -97 -320 57 180 106 97 -119 -223 -314 -145 224 324 -163 126
2322 126 -291 -64 234 345 16 -287 -109 -70 272 199 -49 7 -137 -106 397 278 147 -163 -304 486 -107
$$ packed form
2162D04j28l22j01L29k86L07j29j26k45J34L63p8n9k22oJ26P4j09K72m22L08k77
2184a93L28L30m41k43l4K16J17R3o6j47j16j01L64K3l19J06k52J98J60P6J35k84
2206e0j33K44j09P76o74j77o2k56N96J81K93k25n91j93J15N82m70j38J08K22K10
2227B49j58R0j68k07O5L47lJ51o43R2j79N05K41j43k15k5l75N95QRk45j32N7M2
2251d2K12m3P2k98l70K16O12k44Q6j47j90L84r6l2j17k13m8K86M7K9k25R3l2j50
2275b10K89K10o2l51j08K23J47p8j05j35J9J74J5O6P6K5n71L90M9L6K8l0m34L60
2299B3j51M15j07j47p7N1J62r7j1j58k23L77J23p4rk16j04r1J69L69J00m87K89
2322A26m17K27K98J11l29l03J78L9L42p3k48N6j44L1N03j19j31l10j41P90n93
$$ plain form
2343 -107 171 185 -129 108 -235 119 414 80 -189 -187 147 469 -37 98 -472 -137 -78 -7 159 226 -5 -210
2365 -210 -317 231 238 -106 -38 -348 -77 -107 300 131 -188 61 -205 185 628 -102 38 -198 -65 252 54
2386 54 333 -118 -293 -123 202 349 -4 -73 -18 -183 114 294 19 -20 -399 -80 82 101 220 -120 -128 -14
2408 -14 158 260 202 94 -348 1 41 266 154 -304 -356 23 350 330 147 164 0 34 205 134 75 196 -296
2431 -296 -309 -56 189 221 -214 -228 -16 17 39 202 125 107 -219 166 268 293 162 -339 -338 -35 7 248 -144 -88
2455 -88 -274 146 328 220 83 -142 -192 78 184 134 -40 -134 23 -23 226 166 -147 54 -344 -177 188 306
2477 306 74 90 -198 110 49 333 -94 -251 73 -87 144 334 177 -14 -225 31 101 344 -12 -177 -107
2498 -107 -206 56 117 55 -186 -352 -76 336 152 24 58 -140 -19 166 160 130 173 -212 -34 278 271 142 -68
$$ packed form
2343a07K78J4l14K37l43L54K95l34k69KL34L22n06J35n70L35N9P1J66O7k31k05
2365b10j07N48Pl44O8l10K71l0M07j69l19K49k66L90M43p30J40k36J33L17j98
2386E4K79m51j75J70L25J47l53o9N5j65K97J80k75l9l79L19J62J9J19l40qJ14
2408a4J72J02n8j08m42L49M0K25j12m58n2L79L27k0j83J7j64L4J71p1n9J21m92
2431b96j3K53K45L2m35j4K12L3K2J63p7j8l26L85J02K5j31n01JL03M2K41l92N6
2455h8j86M20J82j08j37k25n0K70J06n0j74r4J57m6K49o0l13K01l98J67L65J18
2477C06k32J6k88L08o1K84m27j57L24j60K31J90j57j91k11K56P0K43l56j65P0
2498a07r9K62O1o2k41j66K76M12j84j28L4j98J21J85ol0M3l85J78L12pj29k10
$$ plain form
2521 -68 -150 -232 194 284 98 -18 -237 -117 102 178 201 -51 -126 -262 274 -45 244 -45 -182 -140 98 348 -26
2544 -26 -4 -152 -111 312 360 257 -109 -220 -133 -180 357 75 -165 -187 -224 27 24 89 -110 -10 -57 148 318 365
2568 365 12 -283 -173 -38 150 174 7 -201 -182 -29 88 243 67 -92 -100 -213 -45 80 -118 -10 -286
2589 -286 290 81 261 170 -241 -207 51 115 109 305 -195 -72 -110 212 148 45 76 -269 -65 -55 59 38 -104
2612 -104 -48 52 -67 173 8 81 -30 -73 -92 86 95 -160 -70 145 74 40 -23 -94 -166 26 -98 125 111 42 -5
2637 -5 -94 -110 292 182 73 -122 -68 16 11 79 -61 -128 -29 172 335 300 -26 -158 -183 -81 356 -284 -33 -46 -270
2662 -270 109 -122 95 -2 49 -33 -2 198 3 61 224 -251 173 142 211 108 -92 -63 243 85 129 215 -80
2685 -80 26 -98 234 152 -67 -110 -327 -18 134 134 -71 -217 -20 -74 183 30 88 -110 -193 166 209 157 -17
$$ packed form
2521f8q2q2M26R0j86j16k19J20K19P6K3k52p5j36N36l19K89k89j37M2K38K50l74
2544b6K2j48M1M23M8j03l66j11Q7m7N37k82k40k2l7K51lO5j99J00m7K05J70M7
2568C65l53k95J10J35J88K4j67k08J9J53J17J55j76j59qj13J68J25j98J08k76
2589b86N76k09J80r1m11L4K58O4oJ96n00J23l8L22o4j03L1l45K04J0J14k1j42
2612a04N6J00j19K40j65P3j11m3j9J78Rk55R0K15p1l4o3p1p2J92j24K23j4o9m7
2637eq9j6M02j10j09j95N4Q4nO8j40o7R9K01J63l5l26j32k5J02M37o40K51j3k24
2662b70L79k31K17r7N1q2L1K00j95N8J63m75M24l1O9j03k00K9L06j58M4Q6k95
2685h0J06j24L32q2k19m3k17L09J52%k05j46J97n4K57j53N8j98q3L59M3n2j74
$$ plain form
2708 -17 61 -358 295 188 87 160 -246 -107 56 78 407 -352 -183 -61 -29 59 90 184 -268 -480 65 34 151
2731 151 222 0 -7 -305 150 58 222 52 -167 -131 69 246 168 -304 115 103 30 189 -228 -7 9 93 -54
2754 -54 126 -44 137 -214 -130 21 196 -38 2 -137 -260 137 294 178 100 57 17 139 289 166 -182 -185 -214
2777 -214 -129 -59 202 31 -383 -172 42 392 376 -207 -12 -410 98 89 34 -236 -281 -48 80 437 -57 47
2799 47 -368 -16 -241 -212 66 -149 -131 -55 35 89 87 45 -303 -82 2 -210 71 -240 42 -217 -140 81 69 -5
2823 -5 93 -3 -82 270 266 -126 -32 -54 -228 130 197 15 -154 -16 -169 214 469 -31 -89 40 -253 124 251 25
2847 25 123 -206 176 254 157 33 -297 242 -210 -57 -97 -68 9 -23 64 91 212 127 -85 -123 -112 244 -55 -124 274
2872 274 -137 73 -48 249 107 49 -127 40 136 -43 -106 133 -31 -76 -70 56 -76 30 -98 -289 -137 -71
$$ packed form
2708a7P8m19O53j07j01P3m06J39J63K2L29p59J69J22L2Q8L1R4m52k12N45l1J17
2731A51P1k22pk98M55r2J64j70k19L6K00J77p8m72M19j2p3J59m17K21J6Q4j47
2754e4J80j70J81l51Q4J51J75k34M0j39j23L97J57j16p8m3m0J22J50j23l48lk9
2777b14Q5P0K61j71m14K11K14L50j6n83J95l98N08rn5k70m5K33J28L57m94J04
2799D7m15L52k25K9K78k15J8P6R0N4km2l48K21Q4k12K81l11K82k59P7K21j2p4
2823eR8r6p9L52ml92R4k2j74L58O7j82j69J38j53L83K55n00n8J29k93L77J27k26
2847B5R8l29L82P8r7j24l30N39m52J53m0K9P7l2Q7K7J21q5k12l8J1L56k99o9L98
2872B74m11K10j21K97j42n8j76J67R6j79o3K39j64m5OJ26j32J06j28j91J52O6
$$ plain form
2894 -71 386 286 -164 -176 -105 116 83 -65 -25 -9 200 8 411 -50 -283 145 -139 -23 207 -118 -244 -322
2916 -322 -87 243 -136 175 -150 -118 -2 237 194 -223 88 -103 181 194 37 150 99 9 0 316 193 113 -174
2939 -174 -331 -19 -88 239 53 -164 -148 41 328 -83 380 -250 -125 -60 122 272 260 -35 -345 59 146 170
2961 170 121 -76 -91 243 11 316 -135 -234 43 -11 -23 259 113 -77 34 -172 40 57 -272 -9 -88 -146 22
2984 22 166 -86 -260 -164 -185 -105 121 161 -26 15 -194 86 141 272 -246 -123 -130 202 80 223 -213 3 -76
3007 -76 56 -107 -178 190 1 -178 43 73 258 262 -568 70 3 69 264 105 62 75 117 195 316 -40 -135 -35
3031 -35 138 59 161 71 133 -75 -21 162 31 45 -10 -201 12 284 169 205 -92 -47 342 230 235 -17 -49 -239
3055 -239 2 203 21 27 -7 -54 -229 9 120 102 138 -79 60 64 26 167 158 -108 -276 15 82 -34 -46 -239
$$ packed form
2894g1M57j00m50j2P1K21l3j48M0J6K09j92M03m61k33M28k84J16K30l25j26p8
2916c22K35L30l79L11l25L2J16K39m3m17L11j91K84J3j57J13n1r0rL16j23q0k87
2939a74j57L12o9L27j86k17J6J89K87m11M63o30J25O5J82J50j2k95l10M04Q7K4
2961A70m9j97j5L34k32L05m51r9K77n4j2K82j46j90J11k06K12J7l29K63p9n8J68
2984B2J44k52j74R6k1Q0K26M0j87M1k09K80N5J31n18J23pL32j22J43m36K16p9
3007g6J32j63p1L68j89j79K21L0J85Mq30O38o7O6J95j59m3J3M2P8J21l56r5J00
3031c5J73p9J02r0O2k08N4J83j31J4n5j91K13K72j15L6k97M5L89j12Nk52l2j90
3055b39K41K01j82Ol4m7j75K38J11j8L6k17J39Ml8J41rk66j68K91O7j16j2j93
$$ plain form
3079 -239 97 -7 266 141 10 -10 -10 94 -24 135 -84 -162 -19 37 244 -90 -45 8 -43 71 46 -8 -232
3102 -232 70 -10 -42 -68 66 -102 17 -111 163 135 3 81 -130 -109 231 -45 192 -220 -259 105 84 -29 -96
3125 -96 -114 -169 67 -2 197 -257 -172 -40 67 -61 157 61 -124 -55 231 49 315 -20 -129 -89 -287 64 -30
3148 -30 195 -128 -174 306 201 5 -59 -81 38 -144 149 7 -85 25 -152 -113 419 -153 386 2 -55 -97 34
3171 34 100 224 -33 -253 -228 -198 28 -238 225 -109 -149 -87 -41 108 -75 -152 -29 -76 -5 -137 -137 -242 -100 84
3195 84 125 -79 181 151 -299 -231 96 -30 18 -60 -136 -265 82 83 -216 -445 180 -141 -106 -182 -59 195 8 123
3219 123 -248 41 235 -66 -97 -153 -50 263 -170 -67 -316 -88 22 131 146 161 104 83 -203 -31 -69 -166 -266
3242 -266 150 211 166 50 162 -96 -120 28 14 -60 -35 -42 -106 -143 199 101 43 -90 -57 315 27 190 1 -209
$$ packed form
3079b39L36j04K73j25j31k0%J04j18J59k19p8J43N6K07l34M5N3n1J14k5n4k24
3102b32L02q0l2k6J34j68J19j28K74k8j32P8k11K1L40k76K37m12l9L64k1j13o7
3125i6j8n5K36o9J99m54Q5J32J07j28K18r6j85O9K86j82K66l35j09M0j98L51r4
3148c0K25l23m6M80j05j96o4k2J19j82K93j42r2J10j77L9N32n72N39l84n7m2J31
3171C4O6J24k57k20K5L0K26k66M63l34m0O2M6J49j83p7J23m7P1j32%j05J42J84
3195H4M1k04K60l0m50O8L27j26M8p8p6j29L47Jk99k29O25l21L5p6J23K54j87J15
3219A23l71K89J94l01l1n6J03L13m33J03k49K28J10J09J5J5n7k1k86J72l8r7j00
3242b66M16O1m5j16J12k58k4J48j4p4K5po4l7L42r8n8j33L3L72k88J63j89k10
$$ plain form
3266 -209 151 -48 20 192 113 -153 19 80 44 133 -33 -179 -60 -86 -65 144 372 8 -66 45 109 47 19 103
3290 103 -54 21 -76 -362 -14 37 -172 31 180 297 -92 -71 77 46 -201 -57 -46 -94 -59 182 49 -161 134
3313 134 -46 -31 202 270 23 -7 -98 -25 -121 -116 246 -98 -257 29 0 163 75 215 -228 208 19 -126 192
3336 192 -178 62 108 -59 195 142 409 -44 -123 -16 -3 239 15 203 -71 -322 131 205 114 53 -110 -149 92
3359 92 121 -122 -58 -6 -67 -114 -87 -79 161 100 -42 239 204 25 -11 -87 34 16 153 145 -143 -45 -118 -84 119 130 85
3386 85 -129 -1 109 -184 106 -47 -120 -141 -269 92 197 -37 24 16 92 95 45 95 13 125 125 -64 -137 0 -39
3411 -39 -144 96 190 341 -344 -240 28 -97 -38 227 -148 -3 -19 54 207 233 251 -107 -362 107 165 -43 146
3434 146 -120 60 -120 -137 219 -26 52 56 -55 181 -87 -122 4 -236 135 5 20 -53 48 -82 -84 116 42
$$ packed form
3266b09L60j99O8J72p9k66J72O1l6Q9j66j46J19k6K1K09K28l64p4J11O4o2k8Q4
3290A03j57P5r7k86L48N1k09K03J49J17l89K1J48l1k47J44J1m8L5K41j33k10K95
3313A34j80J5K33O8k47l0r1P3r6NL62l44j59K86k9J63q8J40m43M36j89j45L18
3336A92l70K40M6j67K54n3K67m53p9J07J3K42k24J88k74k51M53P4r1o1j63l9K41
3359I2K9k43O4N2o1m7K7QK40o1j42K81l5j79l6p6J21j8J37qk88R8p3L4K03J1m5
3386H5k14J28J10k93K90j53p3k1j28L61J05k34O1qP6Ln0N0q2J12%j89p3J37l9
3411c9j05K40R4J51o85J04K68j25N9K65l75J45j6P3J53K6J8l58k55M69N8k08J89
3434A46k66J80j80j7L56k45P8Mj11K36k68l5J26k40L71j30J5p3J01j30kK00p4
$$ plain form
3457 42 223 60 78 17 212 132 -131 190 97 -138 18 264 62 -14 -470 78 86 115 159 164 3 -169 20 318
3481 318 13 167 -1 -308 -56 297 157 16 81 -349 176 -210 19 -339 94 -210 -448 -137 -27 -60 -257
3502 -257 -161 -67 88 -13 -39 -158 -135 -41 82 -61 50 260 17 -37 -149 69 160 -110 199 91 27 -164 144
3525 144 -90 -155 -273 101 -94 -162 52 -100 81 176 -94 -24 189 -137 61 -92 -41 90 -199 55 345 122
3547 122 196 130 15 -250 70 -127 -312 2 262 136 -117 -153 21 113 21 68 -96 -87 69 7 177 -53 187
3570 187 -67 -132 14 -173 -89 177 82 90 159 48 17 32 -86 47 22 -68 -160 10 85 46 -43 -27 -189 -77 -70 -20
3596 -20 -108 -148 57 34 57 -82 443 110 -228 -329 -233 41 -17 32 -22 164 23 -52 281 163 -197 -118 -37 -124
3620 -124 121 -58 -371 -139 -170 -92 268 -38 -91 23 -42 130 -73 -44 261 -49 -194 -7 -58 32 -78 -203
$$ packed form
3457D2J81j63J8o1J95q0k63L21r3k35J56K46k02p6m56N48QK9M4Nj61j72J89K98
3481C18l05J54j68l07K52L53j40j41O5m30N25l86K29l58M33l04k38L11J10l3j97
3502b57R6R4J55j01k6j19K3R4J23j43J11K10k43n4j12K18R1k70L09j08o4j91L08
3525A44k34o5j18L74j95o8K14j52J81R5k70P0K13l26J98j53N1J31k89K54K90k23
3547A22P4o6j15k65L20j97j85L14K60j26k53l6J74R2r2M7j64RJ56o2J70k30K40
3570A87k54o5J46j87Q4K66r5QO9j11l1J5j18J33k5r0r2J70P5l9q9J6j62J12PN0
3596b0q8m0K05k3K3j39N25l33l38j01R6K74n8M9n4J86j41p5L33j18l60P9Q1q7
3620a24K45j79l13K32l1P8L60l06n3J14o5J72k03K9L05l10j45J87n1R0j10j25
$$ plain form
3642 -203 58 -161 -5 -324 82 -180 -223 -154 73 -44 -262 -49 -228 17 -97 48 139 -178 145 166 209 183
3664 183 -271 212 89 -117 84 91 23 76 97 -111 140 177 290 -71 204 77 -87 5 246 -147 -48 298 136
3687 136 277 -156 -209 46 30 -60 275 -80 85 40 75 -50 117 111 81 -173 -60 132 236 -37 -39 -16 87 57
3711 57 -239 -38 127 276 68 114 64 -67 24 -23 -44 60 63 66 -129 71 78 131 33 -435 -276 -58 -20 -106 70
3736 70 2 -20 71 131 76 164 105 -52 78 8 -61 162 10 32 -133 -149 244 199 -213 1 193 -92 0 127 88
3761 88 237 -89 10 287 -34 87 -41 36 91 -100 99 15 -34 111 -155 -13 89 -78 -79 -50 46 37 -174 159
3785 159 -117 -59 122 -42 35 -161 26 -182 138 191 -69 -26 209 19 37 -104 -62 -65 -18 60 -120 13 -31 -193
3809 -193 -122 -146 -138 115 5 -210 -237 -115 -196 17 -97 -248 -168 -16 41 41 251 97 156 -267 -171 71 117 234
$$ packed form
3642b03K61k19J56l19M06k62m3O9K27j17k18K13j79K45j14J45R1l17L23K1M3k6
3664A83m54M83j23k06K01Po8N3K1k08K51L7J13l61K75j27j64R2K41l93R9L46j62
3687A36J41m33n3K55j6r0L35l55J65m5L5j25J67ol0k54J13J92J04k73kK3J03l0
3711E7k96K01J65J49k08M6n0j31R1m7k1J04LLj95K00PN3r8m68J59K18L8q6J76
3736G0o8k2R1O0n5Q8n9j57J30p0o9K23j52K2j65j6L93m5m12K14J92k85R2J27l9
3761H8J49l26R9K77l21J21j28P7N5j91J99q4m9J45k66J42J02j67jK9R6rk11L33
3785A59k76N8J81j64P7j96J87k08L20N3k60M3K35j90J8j41M2lM7P8j80J33m4j62
3809a93P1k4QK53j10k15k7J22q1K13j14j51Q0J52N7%K10j54N9m23R6K42M6J17
$$ plain form
3833 234 202 -24 78 206 25 133 -6 -61 -66 -17 88 174 212 131 153 -45 -39 -201 -50 -246 70 46 115 97 128
3858 128 -159 -144 -335 -110 22 -51 -35 -2 101 -124 -39 -115 -445 -146 -138 -182 38 -39 57 -34 119 26 -46 107 209
3883 209 -189 98 -6 31 147 56 -174 -171 -90 140 -72 29 -170 -102 90 5 -110 92 -54 -159 -66 85 -3
3906 -3 -113 -22 -51 -100 64 -58 47 -297 110 109 353 6 -219 -151 40 173 380 -13 -88 -7 -40 127 214 15
3930 15 144 -172 -85 -155 197 33 130 75 -165 -289 48 122 99 -58 11 82 119 40 -1 138 -336 15 142 74
3954 74 113 178 168 -46 -107 86 3 115 -84 115 11 180 116 -222 12 -68 154 -29 135 88 -107 9 46
3977 46 -238 -305 -214 259 -5 -154 188 -43 26 -249 -259 -86 164 -17 -235 112 105 223 354 97 197 -30
3999 -30 177 327 -139 -171 195 -25 -64 -80 -60 -196 102 -150 -6 219 103 -92 -13 -105 -86 105 10 12 -189 15
$$ packed form
3833B34l2k26J02J28j81J08j39n5nM9J05Q6L8q1K2j98Oj62J51j96L16k4O9j8L1
3858A28k87J5j91K25J32p3J6L3J03k25Q5p6l30K99Qm4K20p7R6r1J53r3p2J53J02
3883B09l98K87j04L7J16r1k30LQ1K30k12J01j99O8J92q5j15K02j46j05R3J51q8
3906cj10R1k9m9J64j22J05l44M07jK44l47k25O8J91J33K07l93p5Q1l3J67Q7j99
3930A5J29l16Q7p0L52j64R7n5k40j24L37P4k3j57O9P1L7p9m1J39m74L51J27o8
3954G4L9O5j0k14o1J93q3J12j99J99j04J69o4l38K34q0K22j83J64m7j95J16L7
3977D6k84o7R1M73k64j49L42k31O9k75j0J73K50j81k18L47pJ18J31k57J00k27
3999c0K07J50m66l2L66k20l9j6K0j36K98k52J44K25j16j95P9r2J9J91r5Kk01K04
$$ plain form
4023 15 -45 -58 43 -30 -44 -9 -87 191 0 -28 26 -88 20 141 223 179 -32 -221 -68 -5 160 -13 51 103 116
4048 116 -2 60 49 -35 100 48 98 -24 236 121 -14 -56 2 -238 164 -3 103 23 -89 49 73 -112 -351
4071 -351 162 26 -20 389 -49 122 -80 84 4 44 46 -147 -65 -108 -163 79 -132 79 212 -1 -54 20 21 66
4095 66 -241 -164 110 -8 155 -70 13 92 106 69 202 -4 -59 -62 136 150 -100 -161 -156 198 -171 -215 134 -194 -15
4120 -15 -19 -235 -215 -266 61 -6 116 -66 -130 246 37 -110 -17 185 -25 317 -10 -190 -99 -260 189 -216 95
4143 95 -48 7 -126 165 88 134 -83 81 217 -71 -37 107 -31 -32 44 137 -82 -135 273 16 165 -44 43 265
4167 265 32 -239 17 420 59 -55 53 164 165 254 -9 -87 -66 62 -36 -142 -106 -37 -94 -241 -53 115 102
4190 102 -35 197 -69 -111 -101 95 -204 -70 134 24 -74 49 -53 250 249 43 18 3 -12 -96 -64 69 152 46
$$ packed form
4023A5o0j3J01p3j4L5p8K78j91k8N4j14J08J21Q2m4k11j89J53O3J65j73O4N2J3
4048A16j18O2j1q4J35n2N0j22K60j15j35m2N8k40M02j67J06q0j12J38K4j85k39
4071c51N13j36m6M09m38J71k02J64q0M0Kj93Q2m3n5K42k11K11J33k13n3P4JM5
4095F6l07P7K74j18J63k25Q3P9J4l7J33k06n5lJ98J4k50o1NL54l69m4L49l28J79
4120a5mk16K0n1L27o7J22j82o4L76k09j47R3K02k10L42l27j80R1j61M49m05L11
4143I5j43N5j33K91p7M6k17J64J36k88L4J44j38jP6R3k19n3M08k57J49k09Q7K22
4167B65k33k71K56M03l61j14J08J11JQ9k63p8K1J28r8j06L6O9n7j47J88J68j3
4190A02j37K32k66m2J0J96k99J34K04j10r8J23j02L03jk06k5j5j5q4L2J33Q3j06
$$ plain form
4214 46 3 -41 60 -75 68 166 96 -102 -24 -48 -12 98 -202 -302 15 130 -52 83 13 93 50 -172 252 -58
4238 -58 324 201 203 -90 -123 121 -35 -132 176 -68 157 -27 -78 98 -170 197 206 -70 69 214 218 -161 39
4261 39 13 279 111 152 -56 -190 61 52 79 147 -7 27 18 -52 115 -199 -143 203 165 159 42 122 3 168 118 68
4287 68 -28 335 23 -145 277 158 102 118 -109 -72 52 383 11 -86 160 120 58 100 307 -57 27 -12 -108 49
4311 49 88 -40 155 -192 194 82 39 -48 167 136 -143 195 -207 159 115 53 -114 -37 15 192 39 166 66
4334 66 81 71 57 -15 116 -108 182 49 48 2 69 59 68 -117 -105 108 -150 125 -75 76 265 80 69 -144 89
4359 89 -159 87 89 88 -40 14 -3 205 -125 -145 44 364 6 -37 245 -3 51 64 309 -134 62 -83 149 138
4383 138 96 -201 -141 -270 -61 75 12 -169 -7 25 -16 23 1 -4 151 183 122 -24 -33 94 10 21 22 65 -49 26
$$ packed form
4214D6m3m4J01j35J43R8p0j98P8k4L6J10l00j00L17J15j82J35p0Q0m3k22M24l10
4238e8L82j23Kk93l3K44j56r7L08k44K25j84n1J76k68L67Rk76J39J45Ml79K00
4261C9k6K66j68M1k08j34K51rK7O8j54L4rp0J67l14N6L46l8oj17Q0j19J65n0n0
4287F8r6L63l12j68M22j19n6J6k27L7J24L31l72r7K46m0o2M2K07l64Q4l9r6J57
4311D9L9j28J95l47L86j12m3q7K15l1k79L38m02L66m4o2j67P7N2J77j53J27j00
4334F6J5j0j4p2J31k24K90j33jm6O7j0Rj85J2K13k58K75k00J51J89j85j1k13K33
4359H9k48K46Kjj28N4j7K08l30k0J89L20l58m3K82k48N4J3K45m43J96j45K32j1
4383A38m2k97O0j29K09J36o3j81J62L2m1L9k2nJ55L2o1j46rJ27q4J1JM3j14P5
$$ plain form
4409 26 -78 49 -295 116 89 64 271 224 -84 273 40 28 231 -321 -32 36 10 102 221 -55 -137 -77 -182
4432 -182 90 184 -46 214 89 -144 90 -33 83 35 171 164 221 13 40 -172 -72 108 -30 55 54 -101 136
4455 136 279 -201 33 -70 120 -39 30 93 96 324 166 25 -40 58 -216 -49 5 -84 30 141 0 -70 -239
4478 -239 96 -1 74 100 199 144 34 114 -141 147 -97 -20 -45 238 203 133 84 57 -185 74 -64 492 98 -71
4502 -71 50 199 -21 -99 237 -49 51 185 87 -51 363 -138 170 97 114 -50 -10 -139 98 111 179 -75 -89
4525 -89 23 22 -58 -130 267 -18 87 18 93 176 -27 41 11 119 -65 -202 -12 110 -48 -200 251 -78 0 44
4549 44 -126 -219 166 178 167 192 -198 -141 71 -53 -6 185 113 -130 -116 32 -102 197 -133 -72 -192 132 -116
4572 -116 -35 -113 21 213 222 45 -75 -157 -138 104 140 -298 -49 38 11 28 -154 230 -121 107 -173 -74 -240 -11
$$ packed form
4409B6j04J27l44M11k7k5K07m7l08L57k33j2K03n52K89O8k6R2J19k76q2O0j05
4432a82K72R4k30K60j25k33K34j23J16m8J36pN7k08K7k12J00J80j38Q5jj55K37
4455A36J43m80K34j03J90j59O9O3LK28j58j41o5R8k74J67N4q9J14J11j41p0j69
4478b39L35r7P5K6R9n5j10Q0k55K88k44P7k5K83l5p0m9k7k42K59j38N56l94j69
4502g1J21J49k20p8L36k86J00J34r8j38M14n01L08p3J7j64M0j29K37J3O8k54j4
4525h9J12jq0p2L97k85J05o9P5Q3k03O8l0J08j84j37J90J22j58j52M51l29P8M4
4549D4j70r3L85J2j1K5l90N7K12j24M7J91p2k43J4J48j34K99l30O1j20L24k48
4572a16Q1p8J34J92Rj77j20q2J9K42L6m38K49Q7k7J7j82L84l51K28k80R9j66K29
$$ plain form
4596 -11 -244 -63 -39 37 81 -11 -66 -71 -125 70 154 -37 67 -31 110 -89 -47 90 -35 -46 11 40 136 26 78 -208
4622 -208 93 82 222 23 -164 -44 207 13 91 -86 -132 -28 132 -95 -155 -54 -378 107 125 -186 -32 125
4644 125 126 106 -104 145 33 -7 9 -5 215 242 100 119 -139 -50 59 201 93 -116 141 -100 36 -1 -184
4667 -184 98 -11 189 331 -111 128 317 2 -202 134 144 280 269 226 -428 -8 292 -220 429 488 27
4688 27 104 27 -203 307 -13 92 -120 196 53 -84 -42 -46 18 -162 37 205 -151 -121 4 43 -107 -168 196
4711 196 -119 63 -8 -190 60 307 -88 -199 27 -117 27 103 -68 -60 68 155 75 31 -295 -187 131 35 106
4734 106 -110 107 -11 56 -143 -7 -36 112 -156 199 19 -12 -70 -168 162 -34 -52 -53 -27 115 23 -127 125
4757 125 -28 147 16 -106 -126 35 -234 -85 -34 -37 -113 61 182 -115 -3 -35 -102 87 224 -30 22 16 31 112
$$ packed form
4596a1k33J81K4P6M4r2n5nn4J95Q4j91J04r8J41j99M2J37j25j1N7K9R6j10N2k86
4622b08L01j1J40j99j87J20K51j94P8j77m6J04J60k27o0J01l24M85J8l11J54J57
4644A25Jk0k10K49j12m0J6j4K20K7j42J9k58Q9J09J42j08k09K57k41J36l7j83
4667a84K82j09K00J42m42K39J89l15k04L36J0J36j1m3o54M20L00n12O49N9m61
4688B7P7p7k30N10l20J05k12L16j43j37M2mO4j80J99J68l56L0J25L9j50o1L64
4711A96l15J82p1j82K50K47l95j11K26j44J44P6j71QJ28Q7q0m4l26J08L18r6P1
4734A06k16K17j18O7j99J36k9J48k68L55j80l1n8r8L30j96j8jK6J42r2j50K52
4757A25j53J75j31j22k0J61k69J49N1lp6J74J21k97J12l2o7J89J37k54N2oJ5Q1
$$ plain form
4781 112 -174 -162 -21 198 -86 56 132 -84 -93 -4 -17 -114 -33 -102 260 213 -62 -37 -1 -142 -32 122 211 -66
4805 -66 -134 19 -198 63 82 -20 56 251 -24 -71 230 101 297 106 -40 -24 66 380 195 64 -119 136
4827 136 -161 13 -233 -118 10 182 195 146 -67 -63 -92 207 -72 -160 -93 -104 277 80 177 -262 69 71 -9 -122
4851 -122 -121 39 -26 -93 46 44 -5 -105 -37 95 165 24 54 -42 -83 -140 -432 -136 -219 15 -32 144 8 127 40
4876 40 0 -145 -289 177 11 2 -121 213 -142 -29 42 -117 -76 112 -227 -56 73 221 -15 -268 149 -177
4898 -177 -97 70 25 12 107 147 -228 -7 -5 239 94 -90 -115 98 -46 5 -193 29 89 -216 26 -2 22 -123
4922 -123 12 17 -68 51 95 -163 -101 -95 117 -12 235 82 -105 195 -133 -68 -68 -6 99 117 -101 -176 -23 -16 -155
4947 -155 104 132 -27 -24 182 235 -136 -288 229 -305 -22 308 -23 124 -93 -91 -37 268 -36 -245 -9 -73 112
$$ packed form
4781A12k86J2J41K19k84J42P6k16rQ9j3r7Q1o9L62m7k75K5L6j41J10J54Q9k77
4805f6o8J53k17K61J9j02P6J95k75m7L01j29J96j91j46J6R0L14j85j31j83K55
4827A36k97J74k46J15J28J72J3m9k13Mk9K99k79q8O7j1L81j97R7m39L31Kq0j13
4851a22JJ60o5o7J39km9j00O8J32P0j41L0r6m1n7k92K96q3K34m7J76j36J19q7
4876D0m0j45j44M66j66rj23L34l55J13P1j59M1J88l39J71J29J48k36k53M17l26
4898a77Q0J67m5j3R5M0l75K21KK44j45j84k5K13j44N1j98K22O0l05K42k8K4j45
4922a23J35Nq5J19M4k58O2OK12j29K47j53j87L00l28O5%O2J05J8k18p5J53Pj39
4947a55K59K8j59LK06N3l71j52N17n34K83L30l31J47k17KN4L05l04k09K36o4J85
$$ plain form
4970 112 -72 -97 -32 -108 -49 -7 10 -94 322 -71 123 25 82 33 76 -247 164 135 -63 31 127 107 -159 -56 23
4995 23 -65 -46 94 121 -102 50 66 -169 140 164 -52 -261 194 66 -205 -171 -67 16 -27 26 -159 125 -209
5018 -209 -25 -292 -60 -76 142 -52 141 69 -6 178 -13 118 16 -63 132 121 -189 199 -196 109 -27 -205
5040 -205 31 4 -173 23 -185 -232 34 -97 -6 28 62 49 -188 135 -16 -85 -156 -222 72 210 131 -176 -4
5063 -4 -136 -50 -2 -29 -71 -24 -73 -66 0 -72 -97 105 -95 64 -186 -281 -186 -337 -98 44 -32 -105 -114 88 -105 -122 18
5090 18 182 -82 173 89 220 -8 -142 134 191 52 -46 -18 144 186 42 -144 -20 128 186 131 32 136 49
5113 49 45 13 116 -34 -126 -256 33 -66 -99 184 57 154 -244 -130 66 233 50 -8 -18 -222 62 -163 160
5136 160 266 88 189 -26 -111 93 93 115 57 -70 -112 178 -159 17 2 142 -74 -169 -46 41 -11 66 79 -1
$$ packed form
4970A12j84k5O5p6N9M2J7j04M16l93J94r8N7m9M3l23M11k9j98R4R6k0k66J03P9
4995B3q8J9J40K7k23J52J6k35L09K4k16k09M55j28k71L4J04Q3m3N3j85K84l34
5018b09J84k67K32j6K18j94J93p2p5J84j91J31j02p9J95j1l10L88l95L05j36j78
5040b05K36k7j77J96k08m7K66j31R1L4L4j3k37L23j51o9p1o6K94J38p9l07J72
5063dj32Q6M8k7m2M7m9PO6p2k5K02k00J59k50r5R5j51K39J42p6p3rK02j93j7J40
5090A8J64k64K55q4J31k28j34K76N7j39r8K8J62M2j44j86J24J48N8n5r9J04q7
5113D9ml2J03j50r2j30K89r9l3K83j27R7l98J14J96J67j83n8j0k04K84k25L23
5136A60J06j78J01k15q5K04%K2n8j27m2K90l37J76j5J40k16r5J23Q7n2P7J3q0
$$ plain form
5160 -1 -10 103 -118 70 47 -159 -125 32 12 -209 -6 82 -30 -181 239 193 361 122 216 76 -259 -99 231
5183 231 -52 -41 -74 -64 -88 22 -68 -97 -200 148 -112 68 -157 -22 -41 89 124 61 -364 135 183 -239 -124
5206 -124 -57 26 -381 -52 12 -24 -65 -181 253 -46 135 -155 172 12 -106 67 -160 -9 108 -89 -212 -138
5228 -138 -15 11 40 11 -105 102 78 77 133 -77 -123 21 -118 236 -96 103 35 -62 105 56 145 7 170 -289
5252 -289 -132 55 -30 -184 -75 -136 -11 -511 -105 -214 -193 63 -42 128 -158 26 231 7 127 49 155
5273 155 88 -124 166 -101 241 146 46 143 -90 -196 -127 214 -64 76 -88 -75 -9 81 143 133 271 -88 53
5296 53 49 111 -47 -168 -57 424 51 -311 102 143 -47 22 -71 159 131 -17 -109 68 -110 -321 52 -84 127
5319 127 -120 42 -102 87 51 -194 -51 -49 -70 33 -23 167 152 161 -296 -22 -174 113 -11 -109 -120 49 -112
$$ packed form
5160arJ13k21J88k3k06L4J57k0k21K03Q8j12j51M20m6J68k39R4j40l35J60L30
5183B31k83J1l3J0k4J10r0k9j03L48k60J80k25J35j9J30L5o3m25M99M8m22J15
5206a24O7Q3m07L29O4l6m1j16M34k99J81k90L27j60j18J73k27J51J17j97j23P4
5228a38J23K6K9k9j16K07k4jN6k10m6J44j39L54l32J99o8r7J67m9Q9j38J63m59
5252b89J57J87q5j54J09o1J25n00M06j09K1K56j05J70k86J84K05k24J20p8J06
5273A55o7k12K90k67L42r5j00R7k33j06O9L41k78J40j64J3O6R0O2j0J38l59J41
5296E3mO2j58j21J11M81l73l62M13M1j90O9r3K30k8j48r2J77j78k11L73j36K11
5319A27k47J62j44J89l6k45J43Kk1J03n6J90j5Rm57K74j52K87j24r8j1J69j61
$$ plain form
5342 -112 -32 256 -129 -102 -67 66 92 115 50 -140 137 180 23 -147 -30 -80 72 -148 -1 -119 85 -65 165
5365 165 268 -192 94 59 87 79 -42 -157 -212 -25 36 82 60 -156 -14 -12 -157 -110 -19 -46 9 279 112 126 -88
5390 -88 102 79 201 -22 26 27 170 3 106 -41 -54 121 10 153 -20 24 180 233 -45 193 19 -95 -62
5413 -62 -30 33 207 -54 356 13 -234 197 1 -215 147 -48 185 -155 -110 -29 -23 -90 105 -141 45 170 -112
5436 -112 -132 -141 183 -306 -35 -235 -16 -75 11 -64 87 169 -96 -344 90 -3 -209 -135 -219 365 -80 127 14
5459 14 10 -139 100 118 -10 -15 39 -29 48 -4 137 -34 -25 -136 11 -22 -51 -261 98 -99 32 92 -207 151 -85
5484 -85 -131 -88 101 -57 -120 85 -29 -177 -298 -93 -220 -54 -54 219 72 -81 31 -236 192 -171 -99 -281
5506 -281 27 -11 51 196 144 75 2 -156 16 8 171 112 203 155 29 13 179 -231 109 114 -63 210 -63 -109 136
$$ packed form
5342a12Q0K88l85K7L5J33K6K3o5j90K77M3j57j70J17n0J52k20J47j18K04j50K30
5365A65J03m60K86l5K8qj21j15n5J87O1M6k2k16J42Kj45M7R1k7N5K70j67J4k14
5390h8J90k3J22k23M8JJ43j67J03j47j3J75j11J43j73M4J56N3k78K38j74j14L3
5413f2L2O3J74k61M10l43k47M31j96k16L62j95K33l40M5Q1Oo7J95k46J86J25k82
5436a12k0rL24m89K71k00K19n9Q6p5J51Q2k65k48M34r3k06P4q4N84m45K07j13
5459A4mj49K39J8j28nN4o8P7n2J41j71Rj11J47l3k9k10L59j97J31O0k99L58k36
5484h5m6M3J89j58o3K05j14j48j21K05j27J66%K73j47j53J12k67M28l63P2j82
5506b81L08l8O2J45n2o9p3j58J72qJ63n9R1m8j26j6J66m10L40Nj77K73k73m6K45
$$ plain form
5531 136 10 76 51 62 -213 202 -2 60 155 -15 -231 -265 -49 -220 16 -71 -24 92 201 141 13 -60 231
5554 231 74 -78 0 152 -57 -92 -144 67 56 73 242 -66 42 12 -96 -12 71 -44 152 120 74 115 -13 54
5578 54 21 180 44 17 -13 -261 29 -42 -116 157 38 -112 193 29 126 -35 -62 76 -155 362 -169 69 2
5601 2 -174 -27 -120 107 -48 177 -117 -24 23 50 15 -188 -170 -69 18 131 -90 19 70 -31 -151 202 83
5624 83 62 -103 -41 -101 -33 -93 -56 -57 113 -78 154 76 -201 251 196 18 18 53 119 -23 94 15 -110 -158 -87 -96 84
5651 84 83 41 149 -23 -79 69 11 -14 137 225 -55 150 196 63 140 -4 110 125 -117 -67 70 -141 -29 -116
5675 -116 -75 -26 -114 230 177 9 -170 178 100 -95 -15 32 216 93 121 -115 51 29 63 9 -93 212 -241 194
5699 194 109 -232 -14 67 -75 74 -63 -157 118 -89 0 -70 100 -189 124 -150 -4 -327 -136 -70 -37 -50 -65
$$ packed form
5531A36j26O6k5J1k75M15k04O2R5j70k16l4K16j71K36q7M7J16J09o0j28p3K91
5554B31j57j52P8J52k09l5n2K11j1J7J69l08J08l0j08Q4Q3j15J96l2m6M1j28O7
5578E4l3J59j36k7l0k48K90p1p4K73j19j50L05j64R7j61k7J38k31N17n31K38o7
5601Bj76J47r3K27j55K25k94R3M7K7l5k03J8J01Q7J13k21J09N1j01j20L53j19
5624H3k1j65O2o0O8o0L7jJ70j91K32p8k77M52n5j78%L5O6j42J17p9j25m8P1rJ80
5651H4jm2J08j72n6J48n8k5J51Q8k80K05M6j33P7j44J14J5k42N0J37k11J12q7
5675a16M1M9q8L44n3j68j79L48p8j95Q0M7J84j23K8k36J66k2L4n4j02L05m53M35
5699A94q5l41K18Q1j42J49j37r4K75k07Q9p0J70k89L13k74J46l23J91O6L3j3j5
$$ plain form
5722 -65 30 34 -39 -123 35 -156 113 -17 -197 -72 4 -31 -40 -57 244 -91 158 152 -101 239 -266 76 154 103 40
$$ packed form
5722f5R5Mp3q4J58j91K69j30j80J25P6l5rj7L01l35K49ok53L40n05L42P8n1o3
$$ [...]
8191A43
##END NTUPLES=NMR FID
##END=
