##TITLE=1H_SR39H
 D2O,8 sc, 
 11.03.2021
##JCAMPDX= 6.0         $$ Bruker NMR JCAMP-DX V2.0
##DATA TYPE= NMR FID
##DATA CLASS= NTUPLES
##ORIGIN= UXNMR, Bruker Analytische Messtechnik GmbH
##OWNER= root
$$ XWIN-NMR		Version 3.5
$$ Thu Mar 11 13:43:25 2021 Russian Standard Time (UT+4h)  she@DPX200
##.OBSERVE FREQUENCY= 200.131506
##.OBSERVE NUCLEUS= ^1H
##.DELAY= (6, 6)
##.ACQUISITION MODE= SIMULTANEOUS
##.ACQUISITION SCHEME= undefined
##.AVERAGES= 8
##.DIGITISER RES= 18
##SPECTROMETER/DATA SYSTEM= spect
##.PULSE SEQUENCE= zg30
##.SOLVENT NAME= D2O
##.SHIFT REFERENCE= (INTERNAL, D2O, 0, 15.7039)
##AUDIT TRAIL= $$ (NUMBER, WHEN, WHO, WHERE, WHAT)
$$ ##TITLE= Audit trail, XWIN-NMR		Version 3.5
$$ ##JCAMPDX= 5.01
$$ ##ORIGIN= Bruker BioSpin GmbH
$$ ##OWNER= she
$$ F:/spectra/data/she/nmr/H-F/1/audita.txt
$$ ##AUDIT TRAIL=  $$ (NUMBER, WHEN, WHO, WHERE, WHAT)
(   1,<2021-03-11 13:42:21.68 +0400>,<she>,<DPX200>,
      <created by zg, POWCHK disabled, PULCHK disabled
       configuration hash MD5:
       00 E9 B6 7A A2 85 ED C7 34 08 36 98 17 FE 4E 26
       data hash MD5: 16K
       C0 40 7F 0A B6 F0 CD 1A AE 40 E6 02 CC FF 12 48>)
$$ ##END=
$$ 
$$ hash MD5
$$ B3 53 A4 61 73 0A E5 A2 7D 9A 3B D1 6F E5 E6 37
##$RELAX= 
##$RELAX= 
##$RELAX= 
##$RELAX= 
##$RELAX= 
##$RELAX= 
$$ Bruker specific parameters
$$ --------------------------
##$DU= <F:/spectra>
##$EXPNO= 1
##$NAME= <H-F>
##$PROCNO= 1
##$TYPE= <nmr>
##$USER= <she>
##$AMP= (0..31)
100 100 100 100 100 100 100 100 100 100 100 100 100 100 100 100 100 100 
100 100 100 100 100 100 100 100 100 100 100 100 100 100 
##$AQSEQ= 0
##$AQ_mod= 1
##$AUNM= <au_zg>
##$AUTOPOS= <>
##$BF1= 200.13
##$BF2= 200.13
##$BF3= 200.13
##$BF4= 200.13
##$BF5= 200.13
##$BF6= 200.13
##$BF7= 200.13
##$BF8= 200.13
##$BYTORDA= 1
##$CFDGTYP= 0
##$CFRGTYP= 5
##$CHEMSTR= <none>
##$CNST= (0..31)
1 1 145 1 1 1 1 1 1 1 1 1 1 1 1 1 1 1 1 1 1 1 1 1 1 1 1 1 1 1 1 1 
##$CPDPRG= <>
##$CPDPRG1= <>
##$CPDPRG2= <>
##$CPDPRG3= <>
##$CPDPRG4= <mlev>
##$CPDPRG5= <mlev>
##$CPDPRG6= <mlev>
##$CPDPRG7= <mlev>
##$CPDPRG8= <mlev>
##$CPDPRGB= <>
##$CPDPRGT= <>
##$D= (0..31)
0 1.2 0 0 0 0 0 0 0 0.06 0 0.03 0 0 0 0 0.0002 0 0 0 0 0 0 0 0 0 0 0 0 
0 0 0 
##$DATE= 1615455741
##$DBL= (0..7)
120 120 120 120 120 120 120 120 
##$DBP= (0..7)
150 150 150 150 150 150 150 150 
##$DBP07= 0
##$DBPNAM0= <>
##$DBPNAM1= <>
##$DBPNAM2= <>
##$DBPNAM3= <>
##$DBPNAM4= <>
##$DBPNAM5= <>
##$DBPNAM6= <>
##$DBPNAM7= <>
##$DBPOAL= (0..7)
0.5 0.5 0.5 0.5 0.5 0.5 0.5 0.5 
##$DBPOFFS= (0..7)
0 0 0 0 0 0 0 0 
##$DE= 6
##$DECBNUC= <off>
##$DECIM= 32
##$DECNUC= <off>
##$DECSTAT= 4
##$DIGMOD= 1
##$DIGTYP= 9
##$DL= (0..7)
0 120 120 120 120 120 120 120 
##$DP= (0..7)
150 150 150 150 150 150 150 150 
##$DP07= 0
##$DPNAME0= <>
##$DPNAME1= <>
##$DPNAME2= <>
##$DPNAME3= <>
##$DPNAME4= <>
##$DPNAME5= <>
##$DPNAME6= <>
##$DPNAME7= <>
##$DPOAL= (0..7)
0.5 0.5 0.5 0.5 0.5 0.5 0.5 0.5 
##$DPOFFS= (0..7)
0 0 0 0 0 0 0 0 
##$DQDMODE= 0
##$DR= 18
##$DS= 0
##$DSLIST= <SSSSSSSSSSSSSSS>
##$DSPFIRM= 0
$$ [...]
##$SUBNAM2= <"">
##$SUBNAM3= <"">
##$SUBNAM4= <"">
##$SUBNAM5= <"">
##$SUBNAM6= <"">
##$SUBNAM7= <"">
##$SUBNAM8= <"">
##$SUBNAM9= <"">
##$SW= 16.9725357007746
##$SWIBOX= (0..15)
0 0 2 0 0 0 0 0 0 0 0 0 0 0 0 0 
##$SW_h= 3396.73913043478
##$TD= 16384
##$TD0= 1
##$TE= 0
##$TE2= 300
##$TE3= 300
##$TEG= 300
##$TL= (0..7)
0 120 120 120 120 120 120 120 
##$TP= (0..7)
150 150 150 150 150 150 150 150 
##$TP07= 0
##$TPNAME0= <>
##$TPNAME1= <>
##$TPNAME2= <>
##$TPNAME3= <>
##$TPNAME4= <>
##$TPNAME5= <>
##$TPNAME6= <>
##$TPNAME7= <>
##$TPOAL= (0..7)
0.5 0.5 0.5 0.5 0.5 0.5 0.5 0.5 
##$TPOFFS= (0..7)
0 0 0 0 0 0 0 0 
##$TUNHIN= 0
##$TUNHOUT= 0
##$TUNXOUT= 0
##$USERA1= <user>
##$USERA2= <user>
##$USERA3= <user>
##$USERA4= <user>
##$USERA5= <user>
##$V9= 5
##$VALIST= <valist>
##$VCLIST= <CCCCCCCCCCCCCCC>
##$VD= 0
##$VDLIST= <DDDDDDDDDDDDDDD>
##$VPLIST= <PPPPPPPPPPPPPPP>
##$VTLIST= <TTTTTTTTTTTTTTT>
##$WBST= 1024
##$WBSW= 4
##$XGAIN= (0..3)
0 0 0 0 
##$XL= 0
##$YL= 0
##$YMAX_a= 235232
##$YMIN_a= -170814
##$ZGOPTNS= <>
##$ZL1= 120
##$ZL2= 120
##$ZL3= 120
##$ZL4= 120
##$ABSF1= 10
##$ABSF2= 0
##$ABSG= 5
##$ABSL= 3
##$ALPHA= 0
##$AQORDER= 0
##$ASSFAC= 0
##$ASSFACI= 0
##$ASSFACX= 0
##$ASSWID= 0
##$AUNMP= <proc_1d>
##$AZFE= 0.1
##$AZFW= 0.1
##$BCFW= 1
##$BC_mod= 2
##$BYTORDP= 1
##$COROFFS= 0
##$CY= 11.3945322036743
##$DATMOD= 1
##$DC= 2
##$DFILT= <>
##$DTYPP= 0
##$F1P= 15.9154993809931
##$F2P= -4.1035820241983
##$FCOR= 0.5
##$FTSIZE= 0
##$FT_mod= 4
##$GAMMA= 1
##$GB= 0.15
##$INTBC= 1
##$INTSCL= 1
##$ISEN= 128
##$LB= 0.24
##$LEV0= 0
##$LPBIN= 0
##$MAXI= 10000
##$MC2= 0
##$MEAN= 0
##$ME_mod= 0
##$MI= 1.114404
##$NCOEF= 0
##$NC_proc= 0
##$NLEV= 6
##$NOISF1= 3.799351
##$NOISF2= 2.8
##$NSP= 1
##$NTH_PI= 0
##$NZP= 0
##$OFFSET= 15.70392
##$PC= 1
##$PHC0= -11123.25
##$PHC1= 13.20094
##$PH_mod= 1
##$PKNL= yes
##$PPARMOD= 0
##$PSCAL= 0
##$PSIGN= 0
##$REVERSE= no
##$SF= 200.130013532006
##$SI= 16384
##$SIGF1= 3
##$SIGF2= 2
##$SINO= 400
##$SIOLD= 16384
##$SREGLST= <1H.CDCl3>
##$SSB= 0
##$STSI= 0
##$STSR= 0
##$SW_p= 3612.71676300578
##$SYMM= 0
##$S_DEV= 0
##$TDeff= 0
##$TDoff= 0
##$TI= <>
##$TILT= no
##$TM1= 0
##$TM2= 0
##$TOPLEV= 0
##$USERP1= <user>
##$USERP2= <user>
##$USERP3= <user>
##$USERP4= <user>
##$USERP5= <user>
##$WDW= 1
##$XDIM= 8192
##$YMAX_p= 0
##$YMIN_p= 0
$$ End of Bruker specific parameters
$$ ---------------------------------
##NTUPLES= NMR FID
##VAR_NAME=  TIME,          FID/REAL,        FID/IMAG
##SYMBOL=    X,             R,               I
##VAR_TYPE=  INDEPENDENT,   DEPENDENT,       DEPENDENT
##VAR_FORM=  AFFN,          ASDF,            ASDF
##VAR_DIM=   8192,          8192,            8192
##UNITS=     SECONDS,       ARBITRARY UNITS, ARBITRARY UNITS
##FACTOR=    0.0002944,     1,               1
##FIRST=     0,             0,               0
##LAST=      2.4114304,     0,               0
##MIN=       0,             -170814,         0
##MAX=       2.4114304,     235232,          0
$$ Real data points
##PAGE= N=1
##DATA TABLE= (X++(R..R)), XYDATA
0 0 0 0 0 0 0 0 0 0 0 0 0 0 -8 8 -8 8 -8 16 -16 17 -24 32 -32 40 -48 56 -64 72 -81 96 -109 121 -140 157
34 157 -177 201 -225 252 -279 311 -348 385 -429 473 -523 578 -637 701 -773 851 -937 1034
52 1034 -1140 1258 -1390 1542 -1715 1912 -2145 2420 -2752 3166 -3690 4383 -5347 6782 -9128
67 -9128 13636 -25376 120938 235232 -67582 -73543 -54882 -113539 12478 170742 52989
78 52989 -102122 -132676 -38509 87044 108510 36351 -21918 -120674 -102631 103703 167352 26928
90 26928 -39012 -88322 -118173 27707 143355 41243 -65157 -80239 -71920 6986 124043
101 124043 91472 -63805 -119214 -33242 47283 83506 98127 15300 -131362 -113784 51668
112 51668 101500 30902 -12157 -58872 -98545 -19761 111920 97850 -48625 -102658 -31909 14950
124 14950 59310 114929 31437 -120564 -96673 31560 64606 50800 26675 -65171 -108771 -10312
136 -10312 84748 65990 -7773 -61091 -67968 -17104 76285 108949 15082 -81585 -68125 -11625
148 -11625 37040 82008 45389 -72878 -99601 -5627 52410 45153 26383 -32814 -90879 -34227
160 -34227 79378 92438 12480 -42968 -57535 -45392 28377 97093 44221 -61333 -76160 -21523
172 -21523 19688 50315 47740 -31490 -91496 -31537 57722 68207 31534 -13484 -65162 -60284
184 -60284 32045 90562 37078 -33707 -53789 -45800 -2150 62547 53335 -33429 -74585 -30311
196 -30311 24933 53833 52968 -1994 -70033 -57291 27073 71188 40791 -5454 -45209 -62577
208 -62577 -8760 64168 47413 -23827 -52151 -39245 -3521 51241 63481 -2145 -63200 -47700
220 -47700 10663 50705 53148 15740 -45437 -65940 -8295 52025 40364 -2897 -35491 -52010
232 -52010 -18834 48815 59969 1403 -46796 -44550 -8548 38473 61286 25906 -41130 -60780
244 -60780 -11828 35057 38639 17636 -26555 -60105 -22730 41630 48015 10353 -27701 -48046
256 -48046 -23256 34398 60367 27650 -28332 -51780 -22498 21423 42184 28633 -20293 -57389
268 -57389 -25789 27614 39496 20957 -14645 -49720 -31729 27182 54612 29890 -14175 -43672
280 -43672 -32577 11082 44477 33707 -14117 -47588 -30432 10702 35595 29955 -8711 -46314
292 -46314 -33341 15345 45618 35252 -3131 -38492 -36426 2906 40108 37022 -3856 -38791
304 -38791 -33925 -1168 30559 34084 -1862 -39942 -34786 4040 36073 38533 6198 -33786 -37915
317 -37915 -3079 33324 38377 6962 -30828 -36675 -8726 24764 33892 6461 -32047 -36800 -4969
330 -4969 28432 37076 13745 -25207 -38966 -10119 27125 37516 14691 -21214 -36593 -15901
342 -15901 18968 32996 12490 -23215 -36477 -12760 20371 34465 18883 -17232 -38250 -16675
354 -16675 21143 35028 19207 -11051 -34156 -23033 13602 32638 15814 -15324 -31677 -20350
366 -20350 10956 33309 22550 -11980 -34181 -20193 12246 31633 24488 -3500 -31337 -26409
378 -26409 7862 29532 18614 -7231 -26879 -25774 3120 31226 24472 -7870 -27971 -21825 2420
391 2420 27696 29920 1257 -28823 -25817 2556 22987 21834 2358 -23590 -29661 -1539 27361
404 27361 23221 -1810 -21301 -24540 -6212 25560 32272 3943 -23321 -23173 -4830 16391 26382
417 26382 8830 -22231 -28636 -4012 19449 21461 6433 -16017 -28052 -10892 22502 29906 6429
430 6429 -15396 -21470 -12858 12253 29588 11560 -18798 -24514 -7980 10317 21388 13736 -13445
443 -13445 -29742 -11928 17149 24286 11430 -6834 -23385 -18564 11728 28710 11435 -10911
455 -10911 -19732 -15273 4496 23858 16492 -11606 -25758 -12634 9345 20064 16976 -939 -24928
468 -24928 -21534 11072 24198 10879 -1255 -15508 -23344 957 26177 15174 -8542 -18439 -15951
481 -15951 188 19338 20829 256 -22033 -20288 4353 19856 14870 4087 -14279 -24712 -1589
494 -1589 22633 14250 -1917 -12493 -20362 -6912 20557 21747 -1181 -15747 -16088 -5864 13793
507 13793 23242 6613 -17023 -19595 -2449 12731 15069 7073 -10358 -23229 -9037 17908 20146
520 20146 881 -10547 -14078 -12305 8038 27061 9809 -17073 -16311 -3777 4816 16024 13921
533 13921 -10183 -22865 -8027 11037 16696 8691 -7184 -17881 -12025 6916 21030 11891 -8490
546 -8490 -15671 -10115 2777 18177 14560 -9015 -18361 -7445 2768 12787 16317 -3428 -22460
559 -22460 -11396 8368 13394 10838 1731 -14563 -17465 2440 19394 12244 -5318 -12826 -10531
572 -10531 -2363 12386 18261 -472 -19757 -12346 4200 10616 12391 5452 -13180 -18356 720
585 720 15827 11478 943 -9599 -14987 -4231 13466 15241 397 -12325 -12925 -3738 9859 16522
599 16522 5076 -12887 -14851 -1513 9034 12434 7344 -8462 -18227 -4813 12456 12099 2778
612 2778 -5996 -13756 -9467 8851 18016 5197 -10550 -12011 -5487 4446 13954 10517 -7376 -16841
626 -16841 -5426 8326 10859 6981 -2722 -15224 -11001 7786 15284 6013 -4902 -11153 -10158 2531
640 2531 15620 10337 -5805 -12839 -7383 2224 10620 11435 -1736 -15403 -10014 5148 11022 8251
654 8251 553 -11160 -12735 1929 14164 9294 -2139 -9327 -10093 -1640 11166 12710 -1085 -12493
668 -12493 -9366 694 8363 11130 3071 -11797 -13068 772 10309 9129 2469 -7529 -12566 -3387
682 -3387 11077 11585 796 -8503 -9900 -3858 7074 12843 4139 -9994 -11476 -1686 6401 10204
696 10204 6271 -6911 -13337 -3832 8163 10338 3666 -4988 -11162 -6807 6231 12594 4481 -6624
710 -6624 -9700 -5074 3525 11348 7497 -5817 -11754 -4981 4658 9378 7044 -2641 -11586 -7604 4661
725 4661 11004 5814 -2811 -9335 -7957 2013 11660 7882 -3834 -9588 -6521 1359 9184 9046 -1808
740 -1808 -10872 -7690 2435 8568 7722 -115 -9254 -9026 1224 9689 7666 -768 -8168 -8337 -918
755 -918 8571 9369 -244 -8723 -7921 -327 7099 9140 1940 -8382 -9536 -381 7479 8179 2095 -6537
771 -6537 -9803 -2406 7727 8787 1651 -6359 -8553 -3041 6277 9471 2963 -6524 -8941 -2746 5387
786 5387 8640 3963 -5202 -9642 -3525 5847 8434 3674 -3963 -8645 -4665 4681 9453 4175 -4231
801 -4231 -8259 -4747 3659 8743 4866 -3629 -8506 -4964 3456 8044 5087 -2907 -8236 -5666 2806
816 2806 8309 5459 -2474 -7639 -5837 1972 8238 6104 -1988 -7603 -5748 1268 7325 6145 -1123
831 -1123 -7658 -6379 1171 7306 6119 -626 -6518 -6530 183 6843 6595 -329 -6331 -6401 -267 6174
847 6174 6869 487 -6462 -6798 -706 6089 6657 1116 -5341 -7120 -1444 6092 7013 1127 -5097 -6851
863 -6851 -2164 5052 7069 1642 -5443 -6813 -2073 4442 7037 2733 -4486 -7161 -2278 4684 6828
878 6828 2684 -3586 -6533 -3636 3782 7142 2840 -3707 -6277 -3339 2726 6704 3598 -3316 -6786
893 -6786 -3331 2898 6096 4033 -2276 -6669 -4160 2802 6153 3465 -2090 -5822 -4589 1293 6456
908 6456 4493 -2084 -5748 -4216 882 5417 4894 -1234 -6092 -4434 1306 5330 4523 -291 -5347 -5431
924 -5431 565 5761 4415 -566 -4552 -5131 -811 5316 5579 -215 -5009 -4499 -421 4134 5461 1018
940 1018 -4621 -5307 -336 4704 4764 787 -3807 -5497 -1487 4759 5304 668 -3642 -4459 -1854 3399
956 3399 5906 1523 -4302 -4453 -1229 2778 5038 2496 -3240 -5671 -1540 3459 4662 1951 -2161
971 -2161 -5058 -2812 2976 5684 2165 -2962 -4207 -2325 1523 5318 3173 -2583 -5400 -1995 1977
986 1977 3937 3243 -1479 -5325 -3042 2356 4511 2391 -1233 -4249 -3494 1082 4698 3267 -1864 -3940
1002 -3940 -2937 465 4230 3969 -817 -4845 -3068 974 3298 3347 342 -4513 -4078 730 4347 2844
1018 2844 -678 -3125 -4135 -865 4135 4229 -439 -3981 -3048 -331 2876 4028 1265 -3549 -3814 -126
1034 -126 3160 3202 1114 -2677 -4295 -1118 3407 3890 513 -2255 -3569 -1665 2713 4350 1041 -2857
1050 -2857 -3322 -1140 1900 3927 2206 -2663 -4294 -1321 2258 3157 1562 -1387 -3690 -2453 2011
1065 2011 4110 1354 -1548 -2780 -2133 868 4120 2528 -1934 -3746 -1498 1200 3062 2441 -730
1080 -730 -3883 -2505 1261 3162 1959 -389 -2842 -2814 628 3744 2397 -1143 -2842 -2303 -84 3085
1096 3085 2942 -613 -3252 -2370 303 2478 2566 503 -2913 -3081 222 3033 2164 131 -2112 -2895 -747
1113 -747 2978 3042 -59 -2653 -2517 -766 1870 3268 752 -2539 -2720 -40 2002 2418 1062 -1609
1129 -1609 -3352 -988 2312 2765 754 -1387 -2589 -1411 1736 3130 734 -1901 -2613 -1111 1072
1144 1072 2569 1653 -1764 -3023 -1181 1358 2069 1581 -943 -2829 -1966 1286 2645 1130 -885 -2190
1160 -2190 -2095 588 2901 1826 -1050 -2531 -1503 550 2060 2269 -450 -2705 -1798 703 2281 1701
1176 1701 -194 -2072 -2287 409 2627 1997 -237 -1905 -2063 -121 2230 2423 -26 -2259 -1718 -192
1192 -192 1752 2013 414 -1834 -2406 4 1791 1853 319 -1292 -2412 -780 1982 2129 167 -1354
1208 -1354 -1862 -1013 1398 2361 649 -1485 -2068 -606 1295 2019 971 -1002 -2317 -826 1410 1695
1224 1695 887 -720 -2156 -1098 1034 2327 952 -778 -1790 -1196 515 1964 1511 -782 -1865 -1139
1240 -1139 787 1730 1375 -419 -1974 -1496 670 1759 1248 -443 -1773 -1522 292 1835 1395 -736
1256 -736 -1776 -1111 142 1430 1716 -120 -1699 -1602 353 1597 1310 206 -1443 -1642 50 1669 1498
1273 1498 -117 -1226 -1760 -420 1263 1708 427 -1410 -1444 -174 934 1697 516 -1337 -1667 -402
1289 -402 1158 1407 620 -1081 -1835 -848 1089 1577 651 -852 -1638 -762 676 1646 842 -867 -1412 -725
1307 -725 840 1688 1018 -672 -1595 -982 808 1453 805 -600 -1584 -996 491 1431 1083 -586 -1547 -1122
1325 -1122 412 1380 1400 -251 -1300 -1235 129 1314 1324 20 -1038 -1265 -47 1188 1226 -142 -1109 -1213
1343 -1213 -135 1301 1377 -264 -1117 -1160 -130 1186 1343 384 -1269 -1380 -169 1018 1272 197 -1174
1360 -1174 -1276 -519 740 1262 463 -935 -1023 -332 656 1358 528 -708 -1530 -560 484 969 580 -661
1378 -661 -1324 -920 558 1133 512 -403 -1269 -919 340 1410 1037 -592 -1404 -620 594 1082 874 -202
1396 -202 -1277 -792 346 1416 949 -105 -1103 -881 39 1123 780 -311 -1076 -898 110 1145 1152 -75
1414 -75 -1092 -843 -131 707 1074 -80 -777 -1151 100 1017 947 114 -874 -1093 -110 872 1160 54 -904
1433 -904 -1089 -348 745 1019 479 -870 -1155 -97 873 1146 386 -734 -1088 -317 662 1132 539 -543
1451 -543 -967 -561 637 1194 474 -575 -1086 -351 -180 1125 612 -351 -999 -494 374 957 651 -309 -1021
1470 -1021 -808 278 1118 330 -231 -585 -809 158 1166 660 -513 -1079 -751 222 882 1006 -67 -905
1488 -905 -765 107 1115 743 -41 -993 -849 111 1161 614 -167 -677 -697 171 801 1148 121 -1073 -1007
1507 -1007 -75 887 951 299 -733 -878 -218 680 771 143 -622 -1028 -168 812 895 -99 -845 -805 -356 501 940
1528 940 241 -573 -909 -275 628 844 232 -637 -958 -241 708 751 421 -417 -918 -430 469 789 420 -343
1548 -343 -806 -574 357 793 264 -495 -851 -380 553 706 454 -320 -1169 -753 284 925 238 -395 -808 -688
1568 -688 22 894 670 -394 -619 -654 19 907 899 36 -702 -543 89 900 786 122 -578 -718 95 981 578
1589 578 -278 -289 -621 -63 765 658 217 -829 -803 25 525 640 -108 -672 -687 -85 589 356 -16 -421 -690
1610 -690 -239 547 526 260 -477 -599 -255 709 733 194 -581 -765 -307 523 724 304 -342 -952 -284 589 702
1631 702 206 -279 -716 -336 483 544 167 -458 -617 -506 -5 725 416 -363 -822 -364 266 573 507 -391 -695
1652 -695 -354 378 501 451 -432 -724 -496 141 711 274 -11 -693 -386 271 571 497 -97 -686 -473 125 494
1673 494 574 51 -609 -511 400 498 589 -86 -482 -677 -16 651 768 193 -291 -575 14 412 497 -5 -677 -907
1695 -907 -76 419 390 16 -527 -424 -305 508 500 84 -428 -433 -270 459 468 266 -600 -534 84 155 514 229 -608
1718 -608 -689 -525 320 522 218 -92 -719 -377 405 702 262 -467 -320 -340 13 322 531 -353 -552 -175 310
1739 310 514 83 -8 -619 -324 331 534 603 -101 -288 -514 42 680 233 -47 -542 -337 25 420 354 -6
1760 -6 -316 -303 85 471 338 -101 -277 -500 264 292 470 2 -248 -470 -37 524 314 201 -369 -107 68
1781 68 342 315 356 -432 -47 -105 144 427 42 -278 -514 -145 290 398 83 -378 -278 -56 241 583 98
1802 98 -317 -263 -90 216 549 138 -368 -87 -268 159 532 118 -5 -445 -297 138 557 216 -219 -381 -542
1823 -542 220 549 598 11 -309 -180 29 257 227 287 -428 -211 115 299 298 -107 -314 -285 -105 204 329 7
1845 7 -459 -77 81 396 366 269 -292 -453 0 341 189 -229 -193 -312 79 293 300 128 -325 -256 -74 103 243
1868 243 -80 -227 -382 131 258 331 187 -208 74 -170 190 139 41 -275 -164 -9 343 404 75 -44 -13 -47
1890 -47 31 37 191 -203 -37 -283 36 405 130 138 -152 -137 7 235 13 -235 -225 -288 170 385 202 73 -184
1913 -184 -182 -49 220 224 -86 -123 -143 -110 326 242 -147 -365 -231 -158 388 361 25 -7 -200 -69 60 310 132 -218
1937 -218 -214 -21 107 329 197 -213 -225 -76 20 216 178 -152 -428 -102 180 47 195 -98 -85 -107 113 211 125
1960 125 -25 -365 -149 -10 234 -121 -197 -61 -83 107 116 -48 -107 -131 -172 23 440 230 -113 -124 -385 -12 99
1983 99 202 51 -231 -255 -212 65 227 -59 -157 -133 11 257 10 -6 -420 -199 -162 419 263 -42 -345 -176
2005 -176 18 55 60 63 -187 -377 -357 99 434 286 -378 -184 -80 130 -73 -17 -81 -159 -298 -170 364 91 -46
2028 -46 -54 -230 78 309 222 -187 -329 -223 -170 291 98 130 -54 -275 86 279 185 180 -265 -134 18 175 80
2051 80 76 -317 -33 -38 210 392 45 -127 -289 -39 75 324 41 -338 -290 -34 300 189 -2 28 -234 -15
2073 -15 95 184 300 -217 -183 -129 47 323 144 -273 -163 -101 -131 268 158 -164 -192 -156 -217 117 6 -154 -320
2096 -320 -235 152 258 350 -234 -213 -274 -17 219 229 -72 -314 -1 9 113 144 -4 -195 -324 10 510 15
2118 15 -148 -51 -10 -43 101 136 70 -116 -191 93 318 363 112 -459 -265 -38 165 198 -86 -241 -335 -15 247
2141 247 396 102 -21 -121 -86 30 -68 174 -93 -331 -313 36 425 134 -141 -416 -244 314 313 179 -144 -257
2163 -257 -34 464 257 158 40 -425 -69 63 362 293 -68 -645 -239 15 214 358 -78 -272 -232 18 106
2184 106 26 -177 -139 -135 71 171 229 51 -200 -332 -72 272 323 174 -189 -218 -66 171 98 42 -210 -159 -17
2207 -17 120 199 37 -213 -309 -595 189 329 185 -58 -316 -174 350 280 79 -170 -437 -301 204 232 222 -177
2229 -177 -636 -14 188 627 146 -290 -332 -214 272 319 -3 -117 -357 -24 202 239 60 -255 -134 -140 35 403
2251 403 29 99 -386 -228 159 287 148 -29 -232 -190 37 288 30 247 -340 -316 81 407 300 -99 -413
2272 -413 -381 52 412 322 0 -38 -407 -90 210 3 342 -291 -372 -47 190 277 274 72 -600 -222 214 278 -81
2295 -81 -201 -314 -131 84 316 100 -200 -326 -89 236 109 165 -177 -311 -21 257 297 78 -53 -230 -299
2316 -299 261 31 173 81 -153 -244 239 274 205 -99 -202 -136 149 128 121 -54 -462 -25 -59 166 221 113 -206
2339 -206 -107 -15 157 292 -16 -420 -93 -53 461 402 122 -37 -266 -13 163 382 116 -269 -361 -154 226 444
2361 444 128 -298 -377 -201 258 380 -194 -164 -32 -240 17 336 0 -263 -149 8 5 279 136 -209 -297 -13
2383 -13 -61 79 118 -251 -180 -228 183 118 48 -340 -208 -125 281 143 257 -58 -280 -18 -32 331 236 -234 -263 -446
2407 -446 97 538 220 -55 -335 -69 132 183 173 -104 -143 -250 186 301 198 52 -498 -291 180 198 276 -180
2429 -180 -91 -216 -91 303 69 13 -387 -190 42 619 -123 151 -135 -116 215 237 222 -109 -89 -350 -232 348
2451 348 348 122 -61 -288 -232 200 384 136 -228 -344 -99 214 152 103 45 -350 -224 117 318 66 -38 -227
2473 -227 -157 76 55 62 -106 -335 -232 165 346 222 -227 -36 -278 104 143 154 -147 -324 -207 106 279 198
2495 198 -105 -231 -192 -88 230 284 -99 -230 -215 135 352 255 -76 -386 -376 122 406 492 -76 -335 -259 -152
2517 -152 328 339 173 -139 -232 -141 291 289 172 -111 -281 -9 90 124 113 -274 -352 57 295 324 179 13 -149
2540 -149 -134 127 135 208 -177 -62 -73 171 327 25 -7 -163 -189 203 397 349 -95 -122 -119 -305 328 197 -18 -482
2564 -482 -176 220 259 282 -127 -276 -544 -61 369 -137 -89 -475 -423 96 368 451 21 -216 -234 -71 348 438
2586 438 -35 -264 -239 -153 189 231 20 -263 -198 -209 147 257 21 -234 -304 -85 305 -39 119 -127 -303 -127
2608 -127 128 356 -206 -265 -415 0 -92 197 11 -144 -280 -100 185 465 114 0 -150 -294 -31 295 236
2629 236 -195 -548 -214 -25 248 232 -95 -541 -325 183 414 249 39 -484 -266 176 260 86 -86 -316 -147
2650 -147 126 272 251 -92 -401 -162 -197 334 9 148 -217 -100 -69 324 478 120 -434 -400 -103 138 484
2671 484 94 -148 -160 -202 232 337 159 -141 -97 -240 298 441 10 -419 -466 -173 98 237 144 -249 -356 -201
2693 -201 126 249 37 -104 -258 -206 150 284 246 46 -244 -5 -99 617 173 27 -138 -463 89 188 224 -274
2715 -274 -186 -107 239 345 225 -153 -401 -261 153 183 328 91 -115 -155 -250 173 95 -182 -548 -446 -149 431
2737 431 192 65 -408 -206 177 410 279 42 -232 -403 -48 81 343 -137 -232 -212 -39 175 243 247 -296 -259
2759 -259 -85 417 81 15 -345 -382 -315 482 371 250 -452 -559 -90 195 278 170 -292 -297 -125 51 215 210 -289
2782 -289 -269 -105 349 196 133 -8 -269 -243 70 103 330 34 -335 -253 -33 185 238 -228 -219 -213 -111 268 214 -242
2806 -242 -169 -256 137 398 172 -23 -297 -362 -183 349 238 -111 -215 -213 -199 336 88 -65 -329 -418 -58 136
2828 136 415 59 -30 -166 -182 390 425 255 -324 -313 -117 252 324 184 -447 -579 -94 156 328 145 -184 -389
2850 -389 -123 101 701 414 -155 -587 -159 282 274 120 -86 -579 -44 89 443 167 -256 -220 -465 113 116 310
2872 310 -301 -522 -298 28 345 201 -94 -604 -169 191 129 370 -79 -422 -141 45 459 220 -175 -366
2892 -366 -247 -138 427 317 -134 -562 -415 167 197 323 149 -339 -548 -150 406 151 130 -329 -485 -111 597
2913 597 472 122 -359 -441 -106 190 304 166 -371 -267 21 185 531 128 -80 -635 -166 125 501 280
2933 280 -124 -271 -55 233 308 124 -475 -535 -440 -101 217 112 -12 -623 34 191 432 469 -14 -276 -276 -3
2955 -3 452 136 -140 -465 -301 30 360 291 17 -502 -26 215 464 445 -66 -285 -228 66 642 312 -73 -358
2977 -358 -161 -40 168 242 56 -185 -383 -88 399 239 88 -465 -492 85 211 265 -30 -346 -407 145 192 142
2999 142 110 -297 -382 75 411 160 75 -364 -430 -257 304 432 131 -440 -500 -23 479 359 127 -270 -347 -148
3021 -148 263 291 60 -179 -370 -206 -6 441 -51 -50 -257 -120 24 156 143 -318 -516 -346 371 283 151 -73
3043 -73 -276 -89 -16 282 439 -62 -452 -192 270 430 235 62 -411 -260 -65 423 184 30 -332 -294 245
3064 245 272 353 -161 -469 -46 -5 216 622 91 -320 -499 -61 344 389 148 -254 -246 12 174 278 -87 -260
3086 -260 -215 -139 444 208 455 -234 -426 112 404 299 -223 -407 -458 124 65 405 -6 -158 -124 -47 394 401 363
3109 363 -268 -280 -57 123 282 276 -245 -270 -339 138 389 126 -240 -222 15 -101 153 -34 -323 -300 -219 85 413
3132 413 236 96 -485 -324 27 256 189 142 -438 -173 -60 251 117 -184 -529 -308 252 195 281 -323 -444
3153 -444 -136 17 256 159 -71 -184 -390 107 374 391 137 -322 -428 118 395 435 147 -198 -281 163 359
3174 359 482 -96 -402 -322 73 372 490 181 -228 -205 -311 216 429 30 -342 -145 -180 201 530 67 -393
3195 -393 -195 -258 302 437 -97 -124 -371 -196 73 381 218 -419 -322 -104 295 125 251 -651 -352 -438 160
3216 160 230 243 -116 -307 -173 144 439 379 -110 -387 -265 154 577 252 -126 -328 -108 147 341 287 -243
3237 -243 -520 -281 340 155 224 121 -251 -205 -12 469 359 127 -221 -355 -1 361 245 92 -435 -341 -34
3258 -34 233 226 89 -315 -290 -145 136 258 -142 -277 -267 -188 314 322 201 -353 -335 -167 245 212 122 -100 -352 -118
3282 -118 28 468 127 -266 -386 -239 285 382 293 -362 -233 -141 -85 399 113 -198 -340 -113 140 476 166
3303 166 -168 -447 -204 66 160 127 -64 -215 -222 172 356 401 -264 -385 -249 -124 176 343 -194 -286 -241 217
3325 217 510 270 48 -272 -311 0 281 299 181 -429 -177 2 43 146 -129 -246 -275 84 495 274 226 -372
3347 -372 -528 -107 309 448 -55 -442 -173 -141 325 460 70 -285 -377 -82 259 442 56 -389 -482 -316 49
3368 49 441 -36 0 -475 -261 353 450 99 -303 -233 -27 218 540 188 -284 -408 -183 222 228 218 -32 -638
3390 -638 -209 86 395 437 -251 -307 -194 43 326 46 -139 -230 -212 97 465 284 -289 -321 -422 7 434 270
3412 270 -103 -591 -212 -43 335 265 -163 -342 -229 261 25 -11 -176 -497 -383 38 254 245 61 -501 -342
3433 -342 4 413 98 107 -398 -511 -110 240 324 48 -328 -239 -94 305 555 163 -13 -394 -177 237 292 49
3455 49 -323 -198 -262 321 412 175 -177 -431 -136 144 393 202 -267 -266 -85 180 579 1 78 -325 -318 379 358
3478 358 332 -307 -290 -268 -37 390 166 -160 -487 -228 81 299 389 -373 -371 -335 25 323 358 -195 -297 -278 0
3501 0 620 237 -170 -382 -248 -254 455 364 39 -532 -274 -131 319 262 0 -170 -504 20 330 569 -34 -370
3523 -370 -179 -163 351 356 69 -341 -413 90 364 264 163 -177 -325 41 216 409 -62 -289 -426 -170 431
3544 431 546 130 -282 -369 -199 21 339 -54 -530 -115 -398 288 229 -15 -145 -565 -337 91 454 214 -23
3565 -23 -315 -16 74 446 146 -50 -179 -160 262 430 288 -92 -412 -429 111 240 307 -241 -338 -351 180 452
3587 452 438 -18 -440 -124 80 399 162 56 -377 -290 117 405 286 -81 -417 -45 132 431 51 -207 -447
3608 -447 -403 6 264 254 -179 -360 -241 231 311 221 -68 -302 -399 -8 405 231 324 -396 -317 82 234 431
3630 431 -75 -121 -571 -31 398 285 274 -231 -511 -61 93 318 63 -328 -357 -291 237 433 127 -302 -410
3651 -410 -18 232 279 40 -106 -396 -201 346 310 341 -114 -225 -405 422 385 250 -263 -418 -410 213 337 57
3673 57 -174 -367 -186 -10 159 209 -235 -399 -183 112 372 312 -111 -239 -202 -81 331 143 69 -281 -297 93
3695 93 255 306 220 -268 -126 -185 195 306 37 -410 -227 59 557 325 133 -444 -479 -45 228 254 38 -278
3717 -278 -143 -138 185 273 -98 -356 -248 -11 45 369 191 -269 -420 -404 188 323 102 -250 -339 -341 252 377 166
3740 166 -185 -191 -113 245 494 357 -234 -318 -18 289 455 235 -145 -273 -190 246 261 -94 -219 -374 -362 137
3762 137 387 243 -74 -263 -227 122 348 255 17 -180 -297 217 372 116 -335 -196 -160 -76 383 176 -185
3783 -185 -220 -61 -193 343 475 67 -241 -343 -23 329 281 -5 -78 -284 -195 369 319 37 -427 -242 -107 309
3805 309 239 -4 -94 -431 -13 378 34 -3 -340 -206 -151 279 203 145 -338 -192 -238 219 401 -41 -263 -346 16
3828 16 134 142 -136 -150 -353 101 337 272 306 -22 -305 -168 142 268 20 -130 -333 -167 208 322 95 -161
3850 -161 -337 -120 202 183 180 -244 -499 -149 116 292 269 -71 -415 -318 -129 420 275 -155 -402 -234 9 301
3872 301 391 25 -406 -284 -46 159 193 -246 -440 -348 131 293 220 42 -330 -257 40 263 305 19 -201 -269
3894 -269 -297 82 287 124 -440 -184 -7 272 58 -33 -73 -323 212 148 378 221 -179 -310 45 355 243
3915 243 42 -269 -111 -125 19 186 170 -23 -348 -129 266 313 -72 -169 -237 38 336 170 107 -73 -242 -182
3937 -182 290 212 175 11 -319 112 98 320 272 -162 -208 -153 -27 171 91 -296 -160 -105 264 96 -29 127 -110
3960 -110 -189 135 217 208 111 -87 22 2 267 160 -88 -195 -364 302 379 -10 115 -135 -327 204 334 127
3982 127 -109 -15 -325 -9 183 17 -64 -314 102 117 195 156 4 -81 -220 46 239 -4 -89 -14 -50 3 112
4005 112 -11 -50 -285 -228 27 -286 178 52 -202 -60 -5 13 233 266 -316 -194 -103 285 81 251 -16 -286
4027 -286 -117 151 318 95 81 -24 -45 198 222 262 -168 -388 -54 21 298 283 -123 -283 -282 234 333 68 -88
4050 -88 -469 -211 150 224 86 -181 -238 -301 -54 120 134 -127 3 -90 -110 -71 247 -196 -236 -187 -76 428 -2
4073 -2 13 -69 -142 -194 274 122 -103 -96 -132 58 278 90 -45 -60 -240 -52 75 194 84 -330 -221 -89 161
4096 161 158 23 -287 -29 -37 100 171 -31 -214 -173 153 174 -112 44 -127 -179 195 268 254 -85 -148 78 101 22
4120 22 52 -108 -279 42 -93 60 241 -91 13 -493 -55 -199 12 156 -101 16 -13 196 256 34 -110
4141 -110 -151 -419 4 255 45 -145 -94 -202 214 140 166 0 -110 41 94 129 -95 -124 -110 -161 117 247 207
4164 207 -37 20 -40 -132 -45 174 -28 -92 -121 -105 123 441 -291 -262 2 20 221 159 1 -315 45 -4 103 145
4188 145 1 -171 -5 -91 144 189 17 -241 113 73 188 130 -73 -227 -258 114 92 183 198 -114 7 193 146
4211 146 142 -155 -234 -131 -51 200 34 -37 -244 -304 -91 206 448 84 -251 -228 -83 18 127 -128 196 -89
4233 -89 85 175 252 54 -135 -214 -50 91 347 216 -254 -124 -146 62 190 -195 23 -23 -111 78 221 -32
4255 -32 -226 -449 -88 279 197 55 -100 -250 34 186 249 273 -60 137 -78 -67 103 -159 25 -198 69 158
4277 158 51 224 -105 -64 41 109 287 278 -149 -196 -90 33 114 202 52 -406 -2 -53 14 3 19 -122 -24 -147
4301 -147 74 -129 -115 -350 -84 64 246 -114 -92 -171 -209 -18 84 100 296 196 -231 26 -87 -76 -106 -162 -321
4324 -321 -47 -8 2 -56 97 -81 7 -24 270 195 56 -22 -174 164 282 81 -128 45 -233 115 -82 70
4346 70 7 -135 -1 120 -73 31 -2 -207 70 171 104 50 -121 -23 154 291 -40 -43 66 -35 58 118 -38
4369 -38 109 57 -45 -82 23 -202 137 -42 -4 -190 -22 102 -95 -17 7 -46 -164 123 -57 -217 -91 116
4391 116 283 119 0 -131 -45 -33 -220 16 148 17 -229 18 -48 169 201 -114 -141 -202 -222 310 324 25 -75
4414 -75 -192 -112 -118 308 -122 58 145 -100 -169 15 161 -32 8 -141 137 67 -45 -16 -316 78 -167 296 -159
4437 -159 -18 -42 -71 30 132 194 -75 10 113 102 109 9 -63 69 27 82 83 7 -15 -201 -113 191 145 48 -124 -106
4463 -106 -198 164 20 -3 -39 115 -142 236 119 213 -139 -11 31 -23 -233 -37 10 -39 31 96 176 18 93 -138
4487 -138 -127 -13 -16 -32 36 -141 -11 -198 178 9 172 -4 32 82 3 10 -39 -134 -101 151 -46 122 129 -106 135
4512 135 176 -66 -67 -111 -99 -203 73 241 283 -80 99 78 231 88 0 116 -83 -140 -85 133 8 19 -114 -213
4536 -213 -2 38 166 31 -143 -37 -78 204 -163 -115 -25 -163 354 121 -56 218 -47 -149 30 7 129 120
4558 120 94 -85 -123 42 -38 -108 -130 -120 20 -26 73 71 -220 -114 -50 40 194 39 -266 -210 92 88 225 -12 77
4583 77 -13 -91 37 135 48 -71 6 -32 152 102 152 42 -84 77 -113 -112 93 -83 45 126 299 238 353 -86
4607 -86 88 -22 43 326 -58 -157 -99 51 -15 214 46 -2 -235 12 -102 -29 -148 -224 -75 63 235 213 101
4630 101 -54 52 -241 -78 131 56 -20 62 12 49 24 262 -319 -15 2 -58 149 -45 -120 -157 -11 75 -108 54
4654 54 -150 -276 -46 -84 -188 -147 103 -239 -35 29 118 -23 -276 26 -148 4 -148 275 7 -19 -81 -103 60
4677 60 34 105 -162 -50 -1 212 75 -59 160 -49 103 -65 51 171 57 -182 -157 -143 -25 157 34 -22
4699 -22 -146 209 172 34 -159 -117 -67 289 251 156 100 -37 -442 47 -109 -66 -314 -66 -89 121 194 -1 -145
4722 -145 -276 -250 -177 -262 -366 -215 -72 -151 78 256 -115 130 -250 -69 -46 215 -149 160 -131 -62 40 206
4744 206 -28 -144 -284 -268 54 189 110 8 -11 -199 122 311 -102 -22 -65 -143 215 123 174 100 102 32 29 -72 272
4769 272 -11 53 6 -202 -15 286 -46 -106 -269 -35 89 8 -23 -34 57 146 58 106 15 -248 24 92 116 43 -251
4794 -251 -35 -61 -319 125 119 120 -211 1 -94 85 111 169 9 -163 -50 305 191 96 -13 -225 -224 -100 110 114
4818 114 59 -62 122 132 95 -27 58 -240 36 251 297 -244 -42 -191 -113 -83 169 -330 17 -56 -139 113 -62
4841 -62 255 223 -135 -162 -47 -55 -31 51 0 -150 -52 104 184 -55 -86 -328 48 170 234 211 -351 36 9 -43 -65
4866 -65 151 32 -161 -158 102 318 -156 10 12 16 -54 52 56 -124 -32 -227 -122 238 118 -139 -16 132 -25 163
4890 163 -100 -65 99 -28 7 79 7 -132 -258 24 -76 80 -15 -209 44 -35 -57 219 211 -41 -11 -226 16
4913 16 301 -64 -186 -110 -14 122 128 -20 1 -161 -21 216 39 38 -32 -312 177 23 113 84 -14 -9 -207 53 -38
4938 -38 -66 -118 -44 33 -142 -7 -20 -99 -148 -98 -214 36 257 118 -133 127 -22 164 -2 -81 -7 -32 -21 -141
4962 -141 -62 -29 -100 67 -32 -11 277 84 217 -18 -245 144 107 63 -245 -53 171 -120 146 43 -186 45
4984 45 128 -86 154 -56 7 -95 54 -109 117 -178 107 231 76 233 180 -112 80 -69 213 25 101 129
5006 129 -80 54 -47 122 -36 -105 -25 70 -41 38 108 89 132 -338 -74 370 -4 -216 -30 -88 -131 49 55 -17
5030 -17 -101 -296 18 62 50 57 223 -263 -149 73 -45 -27 -198 0 -99 116 -12 -74 6 -130 -112 -195 -13 -74
5054 -74 -91 -199 -177 -131 29 -1 -33 17 -145 23 112 179 84 -163 -108 146 223 -14 171 30 -3 141 49 80 -120
5079 -120 -160 -209 242 5 -116 -106 -162 -92 112 -177 -70 -245 61 148 -37 99 101 25 132 -103 29 61 -28 113
5103 113 50 -87 62 -68 211 -101 -46 -88 119 -120 121 89 111 -163 -84 -94 -48 21 -87 29 -74 -157 126
5126 126 289 -139 2 50 -40 -16 -98 105 80 -99 70 144 -38 -53 -260 -263 33 52 -29 -14 52 8 -44 -89 -363
5151 -363 -40 15 82 11 96 64 -138 50 17 11 -143 121 -35 -141 11 60 99 80 -7 -74 -122 -1 -277 -263 9
5176 9 70 25 93 21 103 -12 -125 169 73 -100 293 -38 -149 84 -100 64 -34 137 -215 -81 -211 59 39
5199 39 151 63 232 -25 -60 135 212 -75 -91 1 -83 97 144 39 -85 11 67 116 -27 159 182 10 -95 33
5223 33 132 87 -62 -94 30 -13 -243 -61 10 -6 -26 175 -173 -88 -16 119 131 41 -89 57 31 -18 131 162 -70
5248 -70 -39 154 90 -20 -217 26 -42 -178 -43 -71 -93 34 -210 -54 -21 -90 -140 -46 187 -316 -112 -112 -140 -52 79
5273 79 81 -4 -193 -250 35 112 -36 -107 0 -160 80 -95 -12 -11 190 74 32 132 150 -120 -20 27 211 130 -38
5298 -38 95 -146 -103 125 -91 -141 -70 -92 -103 -110 170 -134 -239 -32 -72 -4 -15 -23 -64 -225 100 206 -68 9 -145
5323 -145 131 104 -220 148 -193 18 -99 123 -84 23 131 -59 43 122 -46 -126 -129 -10 109 -84 274 93
5345 93 -111 -209 10 -55 -35 38 79 -214 64 -15 86 309 -65 20 28 13 22 91 -255 -25 -190 84 -133 49 119
5370 119 40 -45 7 0 -48 168 64 40 -99 30 44 187 11 168 -252 54 78 58 -44 -32 110 -22 -211 246
5394 246 124 -86 71 -48 -72 -99 128 -142 99 -1 99 -36 148 61 -18 21 245 -49 -260 269 98 88
5416 88 175 -212 -37 -15 -175 85 -100 7 22 -139 28 -171 220 109 154 -30 -288 -24 -23 -106 -4 7 75
5439 75 126 -24 42 45 91 -55 20 97 289 121 -127 -186 283 179 -139 -105 -70 46 103 117 138 143 -164 50 -166
5464 -166 30 33 -188 -169 -71 108 57 226 215 14 -46 11 154 60 -51 -15 0 -144 3 91 -117 -53 14 -92 -191
5489 -191 126 201 -89 6 -48 63 224 -129 -162 -108 63 -137 160 -10 225 -126 91 -92 11 -98 165 53
5511 53 118 -99 -76 -123 147 11 -70 148 -105 60 91 154 194 9 94 129 34 -95 35 137 119 121 -169 -37 -204
5536 -204 -106 206 -17 -103 -71 -51 -34 157 89 44 -187 82 -54 19 57 -148 -118 97 -17 123 19 -170 -217 -110
5560 -110 -139 152 -86 -31 -95 -156 142 66 -193 176 216 142 -32 45 10 -193 -136 -72 263 9 17 -21 -12 25 74 120
5586 120 103 72 13 -45 4 -40 -280 198 72 -17 -51 115 64 53 34 -26 59 163 -9 16 -33 7 -172 -3 -67 -37
5612 -37 67 -270 -84 31 29 97 -46 151 -201 224 -7 70 -265 -348 -90 -46 150 100 -11 76 -1 20 140 156
5636 156 125 -293 45 85 180 -121 192 -79 -66 -209 -107 133 -43 -36 -43 81 -14 37 78 -81 -286 -68 266 -97
5660 -97 -283 -38 -262 -72 50 95 -60 43 -28 92 66 -83 -34 -20 -230 -342 -10 -48 223 -263 -80 87
5682 87 193 -55 215 -98 -10 63 -202 -24 -25 38 -283 -220 96 -66 -69 -220 122 247 24 -21 -19 -31 -18 -297 56
5707 56 -19 -2 -64 42 74 -242 -118 -264 -119 -12 191 -82 180 -95 -189 -282 16 70 82 22 40 4 -236 22
5731 22 91 -12 -139 -216 160 -23 154 41 179 122 -18 90 16 -62 24 78 -44 -20 186 94 87 131 6 6 100
5756 100 -146 -182 -72 -185 27 294 -40 250 204 -9 59 -101 -193 134 -188 -76 117 71 161 -75 -49 -13 -17
5779 -17 16 116 55 -210 -92 -107 140 -45 -125 35 -15 -65 83 248 -153 84 -169 -32 78 -5 -111 42 139
5802 139 -99 -136 82 39 97 -39 5 122 217 -54 215 76 -11 157 -115 -29 -344 -88 72 -12 316 -85 -12
5825 -12 -70 -319 65 168 -51 -117 40 -143 -110 -39 38 -4 -14 80 91 70 -211 126 -109 -57 37 -120 -54 29 89
5850 89 160 65 108 -130 18 57 -63 66 72 117 21 37 68 -40 36 157 -24 229 -140 -131 128 93 126 41 8 -252
5876 -252 42 -73 -47 -151 13 -262 36 -33 83 -35 72 108 -111 37 -134 -80 76 27 113 129 194 -159 -43
5899 -43 334 -260 -14 127 -70 -112 -197 -148 123 28 14 -20 142 97 -1 142 53 -268 -228 103 134 38 49 -53 -128
5924 -128 -25 222 92 35 -136 -3 -50 -167 -93 -152 -348 -45 -162 322 -122 -20 263 -141 -62 67 3 -66
5946 -66 -325 -122 12 82 0 0 143 -192 87 53 91 83 -25 -144 51 48 224 -153 117 -29 -146 -120 -154 244
5970 244 157 140 -174 76 173 35 264 -211 -22 -76 25 -26 115 84 144 -22 -149 59 198 355 -193 -109 117
5993 117 168 36 21 -51 -217 287 277 -15 -20 35 82 -139 2 -127 -103 -32 -59 68 106 -216 -37 -206 -100 -129
6017 -129 24 146 -191 77 -77 -141 -76 2 100 88 -217 -133 91 155 -1 -12 40 -173 -118 -19 37 181 235 -6
6041 -6 114 -94 -3 -1 -180 -158 -22 79 260 100 -210 136 -9 116 93 -160 -42 70 154 -154 122 -160 150
6064 150 -89 -214 172 147 -66 8 64 -96 337 126 -19 -28 95 -74 147 45 -35 117 -121 -123 86 -60 -29
6087 -29 -19 -29 -21 -99 60 -60 -181 41 154 -120 -11 65 -36 59 241 288 91 -31 171 156 -122 163 57
6110 57 190 94 32 100 -82 -118 -93 109 -142 -34 54 -275 -138 2 -161 0 6 -133 10 5 112 -45 -55 203
6134 203 -170 48 226 9 -58 115 -147 20 -62 -128 117 260 -99 96 -180 -100 -68 -171 131 -143 -161 119
6156 119 80 84 104 -62 -40 -17 88 -99 -42 -28 -113 103 -139 1 -42 111 -142 -214 -169 162 112 45 42 -65 -109 -44
6182 -44 -76 44 -157 -175 157 -45 49 292 238 85 -166 -61 52 236 -108 -85 48 196 79 61 15 171 -92
6205 -92 152 148 -96 21 27 127 58 222 -91 -20 -165 0 -133 164 89 24 -79 -30 -136 -32 -51 -117 -231 165
6229 165 248 -38 -80 17 200 179 305 -25 76 152 35 -4 140 34 259 130 125 -78 -275 119 184 124 -34
6252 -34 -3 145 159 -20 -24 -169 -108 -176 5 -47 89 -21 144 154 106 0 -114 -28 35 -54 43 164 119 60 73 172
6278 172 -140 -8 107 47 -8 -181 -78 -124 85 -268 -364 38 -52 -90 -224 89 283 -171 82 56 -131 212
6300 212 -119 -101 74 149 56 155 -16 -72 8 24 -52 212 149 -113 -59 -86 -101 -92 -121 64 60 38 98 9 59 148 -24
6327 -24 237 -183 92 220 22 107 70 -70 -12 14 -194 -58 -43 -18 -65 45 21 -73 91 153 -81 -33 79 78 267
6352 267 107 178 134 -94 -7 -69 26 13 -33 23 -211 66 -90 -255 -410 107 127 -49 240 -41 -50 111 10 50
6376 50 67 -50 168 -9 6 76 199 20 -149 47 67 137 98 -135 -38 -4 -101 147 224 48 90 28 -189 143
6400 143 77 165 24 -117 -277 -33 -81 -69 -45 -14 -70 205 14 181 47 115 83 0 -175 59 -238 63 166
6423 166 55 25 138 9 -18 -336 190 184 216 145 -139 227 217 110 123 308 -244 56 -51 -207 -88 104 -71
6446 -71 -122 -36 54 -42 21 175 -91 -73 -156 -129 190 -66 -89 -32 28 121 -207 125 -114 -119 -33 82 134 120 135 -75
6472 -75 231 144 120 185 50 13 -27 50 -35 -194 -33 36 -128 114 -97 38 -56 -52 12 100 46 319 -242 10 5 32
6498 32 -171 -239 207 38 21 -140 138 -96 88 25 -26 164 -84 -132 61 10 147 135 48 46 -139 -200 2 126
6522 126 100 -92 131 -331 80 -3 189 169 -77 72 129 -17 222 -140 -49 -188 -122 141 -86 43 -105 143
6544 143 -67 -51 -14 -7 -226 28 -71 115 -163 20 -118 -68 121 216 8 -40 45 -36 -39 -232 41 307 266 98
6568 98 -99 71 -93 -59 95 -62 -133 6 80 39 -5 -66 -104 82 120 164 153 -197 -68 -66 83 -23 248 -253
6592 -253 -39 148 5 31 127 1 -126 224 -153 149 105 -60 129 134 -27 -218 -198 13 -67 52 230 -22
6614 -22 49 228 10 -109 -60 -51 -180 -63 -40 -76 -55 -45 104 -204 10 231 -42 97 66 -233 -209 -17 -32 108
6638 108 220 -109 87 47 -285 -55 -30 -160 -11 -136 0 159 99 99 0 -28 -200 -89 -133 -74 5 -221 -90
6661 -90 234 20 113 -77 -223 -29 97 182 2 -76 -48 -163 -135 -113 20 -29 -12 -113 121 29 -64 58 33 -199
6685 -199 -21 121 -61 79 -201 -55 170 83 -49 -93 193 -27 -79 196 137 117 57 -169 -80 -46 -97 22 61
6708 61 -49 9 -31 205 -6 32 -92 -89 68 51 132 10 -155 -200 11 -50 0 133 -43 -45 -163 317 -10 -52 178
6733 178 95 -31 41 -4 192 -14 -160 -65 -72 54 81 95 115 -74 13 249 -97 -325 69 156 53 -52 11 -129
6757 -129 -48 -35 -91 43 107 19 -43 -50 178 29 45 -98 7 -24 -3 -137 108 83 -106 -122 8 101 83 172 -195
6782 -195 -272 -239 206 147 305 -108 -103 13 -307 34 -151 -319 243 132 -15 13 -185 -142 -84 212 -86 100 57
6805 57 94 -24 -45 -52 6 -198 -37 -53 82 -111 113 -314 -171 85 -17 35 119 -150 -345 131 -19 283 5
6828 5 -171 176 52 4 65 184 81 -197 138 27 78 -79 -9 10 -159 -186 83 -100 -162 -151 75 -267 64
6851 64 64 -96 55 -95 235 -279 28 -63 208 -185 -8 206 -145 -57 113 118 -90 200 -35 -134 116 134 37
6874 37 79 -121 -53 -120 -81 -245 305 69 57 11 0 68 24 1 58 39 88 145 55 78 -93 22 -241 -70 139 -74
6900 -74 -103 -81 -14 64 52 13 110 -103 395 -2 230 142 -132 -261 -260 79 49 123 0 52 -104 106 19 51 6 -80
6926 -80 103 103 185 34 161 -6 97 -38 -192 24 -3 -169 36 29 11 297 -49 -64 -91 -54 197 146 191 -150
6950 -150 31 -51 -301 125 151 155 158 159 52 -122 113 -28 -112 -79 -9 -15 55 -62 14 -174 110 85 -9 199 3 43
6976 43 -50 -17 -81 50 -76 209 -122 103 -201 85 -77 205 -130 -50 145 -14 -146 27 63 76 388 68
6998 68 -95 -208 -101 -81 -28 -224 133 122 -166 -216 63 -41 -12 -47 21 123 40 -36 54 1 24 19 102 61 158 16
7024 16 158 72 247 -103 -9 22 100 120 -287 -45 52 116 -27 162 127 -165 35 -230 -211 211 -95 310 -101
7047 -101 114 -40 208 122 10 37 -179 -154 69 46 -109 173 86 -94 -48 -1 -69 -132 -30 89 95 -183 183 -193
7071 -193 99 15 -141 -53 -67 15 -97 1 108 -162 -221 -5 161 30 -153 -98 -28 219 -139 167 99 -88 -52
7094 -52 -176 -54 275 -49 149 -122 324 97 64 -40 -6 -212 107 -95 -19 3 129 -99 345 -124 -187 -92
7116 -92 33 -116 -57 155 -82 -88 -42 11 -149 -182 139 -113 58 9 34 -179 1 59 174 -196 125 155 -9 16
7140 16 58 2 -150 239 -48 114 151 64 -56 -81 79 236 261 246 27 68 245 278 -186 131 20 -25 -63 -37
7164 -37 -44 56 -82 121 133 -66 -79 14 198 37 -30 64 67 -50 -30 104 135 167 74 -77 71 192 25 121 -240
7189 -240 -54 -121 -136 91 48 81 60 206 -158 -238 191 6 37 -207 -110 122 114 22 206 -211 -172 18 -51 -109 130
7214 130 175 25 218 -263 180 -213 189 91 20 -18 120 134 107 191 -164 93 10 -153 -44 -51 -21 80 49 -44
7238 -44 190 346 -303 138 196 -142 154 123 -3 -83 52 -113 174 14 171 94 92 80 -147 -86 -97 134 150 111
7262 111 59 44 -26 -31 -175 -145 -162 87 129 131 -22 -143 -62 -149 183 -59 92 -128 -105 -74 247 71 26 -37 -18 64
7288 64 -70 -67 86 28 126 -50 17 88 -131 -10 -72 -327 190 -66 103 40 177 -50 124 -230 -59 -319 -143
7311 -143 120 162 -128 -153 -61 12 90 40 -154 -27 354 219 66 53 -115 217 114 -61 67 91 20 -15 166
7334 166 32 -157 -133 75 51 38 131 111 6 27 84 -106 9 102 -34 180 160 -1 199 150 -60 16 -24 60
7358 60 204 -63 74 109 -34 -211 179 58 213 114 -122 143 -183 135 -83 -104 -160 13 5 -25 -120 -14 34
7381 34 -111 93 114 292 -8 -51 -15 43 -15 42 -116 -48 125 -94 -84 55 164 -88 -62 -9 -29 184 47 41 143
7406 143 -205 -150 80 -12 70 7 -78 179 159 160 -135 187 92 125 52 -288 -46 29 -70 13 -105 115 34 21 102 -8
7432 -8 38 -1 -5 207 45 -41 8 -95 68 -28 13 110 68 29 80 -96 262 24 -201 -7 63 105 32 -70 -167 -43
7458 -43 -215 23 -96 -60 40 32 -12 192 94 107 192 126 -132 -98 -52 -22 33 18 -114 17 -125 -27 124 -95 -37
7483 -37 215 25 2 114 68 38 -112 -68 -3 196 -51 -152 79 -40 46 -319 -36 137 -31 99 105 -24 -217
7506 -217 46 112 45 64 -139 -76 -42 -108 137 -2 46 81 -61 -31 -162 -25 -220 -132 -69 37 169 99 -27 117
7530 117 118 -152 124 136 89 66 -163 -6 169 -180 -61 48 -201 -100 -66 -265 125 123 118 122 122 9 -78 -24 42 248
7556 248 77 -17 296 -142 91 11 104 -8 -73 39 -23 171 -114 40 37 -100 -173 161 99 -94 -62 4 83 -31
7580 -31 93 41 -243 -199 -21 -83 -178 80 -77 10 5 -107 200 -152 32 -27 55 243 76 33 4 117 77 -17 117
7605 117 52 97 10 73 -248 368 25 153 -16 45 126 66 -108 -186 -52 -131 41 154 177 -7 -111 -30 90 212
7629 212 86 -68 72 211 72 -233 73 -9 83 -287 138 302 31 36 -112 -157 127 31 -111 90 88 25 88
7652 88 -100 104 -133 132 78 60 63 -14 68 -118 243 31 -210 27 -256 65 -104 -106 44 -31 113 84 -112 87
7676 87 -118 120 -82 181 -172 -13 114 -43 -70 304 -2 41 -87 -275 82 166 90 190 -9 -10 184 29
7698 29 67 113 -33 -158 152 152 -57 26 54 -62 173 181 35 20 -149 -136 9 -2 213 169 157 62 2 121 30 117
7724 117 -164 -179 241 -71 164 -28 -24 62 -5 -34 174 -50 107 -30 -145 -113 -62 -89 -134 132 -87 -19 119 -124
7748 -124 -79 93 6 -22 -28 10 364 -124 -15 -203 57 -42 -50 -39 8 165 -92 87 114 -38 334 -36 46 128 65
7773 65 134 120 115 -162 1 -46 -7 162 110 140 59 221 -52 -172 -100 -99 249 -21 154 190 75 176 85 68 -43
7798 -43 -41 -106 111 90 53 58 145 13 62 -63 -45 -163 48 -40 71 272 -4 -221 223 -173 -5 -144 -100 -54 -63
7823 -63 -57 -99 -195 266 -103 -257 -115 -17 -4 56 35 -109 89 112 203 198 -57 90 145 -76 -68 151 -104 88 -165
7848 -165 -233 -122 40 15 -133 147 -107 -256 77 88 -15 116 97 25 69 -113 79 -37 67 144 -101 123
7870 123 80 -20 -64 105 -32 152 168 -69 -4 138 -129 159 -279 33 305 97 43 -56 131 -42 41 28 178
7893 178 176 101 -15 198 -214 -163 98 -42 10 -11 199 -233 -81 9 32 -260 -100 -95 -179 104 63 67 158 -94 53
7918 53 226 14 -60 86 -141 30 -23 -73 67 74 -211 -219 337 -49 -106 176 -35 -66 -121 19 -4 11 52 -16 -47
7943 -47 122 96 -62 48 -31 -236 15 222 -63 48 73 -169 -10 71 45 -2 26 -22 206 26 -177 -184 43 116
7967 116 -78 90 -121 -14 -183 15 138 -136 -31 61 27 -150 15 -526 -184 -118 75 37 76 106 23 -7 69
7990 69 -10 -80 36 -151 -332 -109 -42 29 117 -31 92 63 -94 32 21 -111 133 68 66 70 155 -69 131 -253 22
8015 22 84 168 -4 -15 -82 -243 219 -175 -51 -159 -92 80 9 66 -44 5 -83 -52 67 140 164 195 -49 101 49
8040 49 -77 169 161 133 4 131 -82 267 23 -139 0 31 61 61 110 134 -32 -238 -123 123 80 28 -202 130
8064 130 -30 -10 174 -61 5 32 63 6 -100 -138 156 111 -11 189 73 -32 -65 -209 -123 92 14 -126 -147 -90
8088 -90 -49 269 146 109 -84 77 103 -158 0 -17 67 67 -208 93 2 -58 -153 -17 88 -129 -74 250 -225 -240
8112 -240 -28 149 -205 185 -184 29 -117 -1 45 -104 142 -11 -295 85 -126 -326 -14 20 100 107 31 111
8134 111 95 22 -33 106 60 -173 62 86 20 73 -214 -191 39 -229 -63 50 239 271 43 -22 73 -55 -69 41
8158 41 3 -16 -85 -155 -68 65 -66 -84 -55 58 -45 136 112 207 193 104 60 -172 -34 -40 114 -126 -79 -16 -127 167
8184 167 -35 -29 39 125 13 44 123
8191A23
$$ Imaginary data points
##PAGE= N=2
##DATA TABLE= (X++(I..I)), XYDATA
0 0 0 0 0 0 0 0 0 0 0 0 0 0 -8 8 -8 8 -8 16 -16 17 -24 30 -32 40 -48 56 -64 72 -86 96 -112 127 -144 164
34 164 -183 207 -234 262 -294 328 -365 405 -452 499 -551 610 -674 742 -820 902 -994 1095
52 1095 -1207 1331 -1469 1626 -1802 2005 -2240 2513 -2840 3239 -3733 4370 -5224 6433 -8290
67 -8290 11530 -18827 74101 -92171 -170814 15023 -21387 62594 163391 21855 -157646
78 -157646 -106831 17385 113256 73924 -41083 -93507 -95025 -45160 132703 160399 -31423
89 -31423 -109822 -59698 -36259 80076 157393 14639 -115315 -74147 -13084 44488 100433 32877
101 32877 -117286 -127313 8492 94726 75384 33499 -38683 -123251 -63179 111383 132725
112 132725 2068 -58939 -56022 -51702 21945 109490 53976 -97769 -122579 -2067 64298 56978
124 56978 57019 -18116 -129077 -65664 91928 103014 24813 -15415 -66095 -75955 30152 103463
136 103463 36805 -58666 -82794 -43425 22284 80379 68896 -35582 -107052 -45870 45460 71777
148 71777 64145 10372 -82813 -78980 36317 83980 27756 -20839 -54552 -73237 -4473 90873
160 90873 67663 -39000 -79705 -42156 3747 58980 89050 15595 -82581 -64747 22067 56483
172 56483 42444 11434 -53006 -83731 -5351 77971 52796 -17847 -52339 -58615 -23021 60939
184 60939 91813 11186 -64037 -49251 -4614 33885 63691 29583 -56458 -75870 -4257 51255
196 51255 44470 10517 -39097 -73646 -30905 57104 78043 15032 -38565 -46926 -28226 25721
208 25721 74940 33624 -48611 -58842 -13732 24245 48055 32054 -36697 -76187 -28397 41255
220 41255 59754 29161 -17663 -53859 -42371 25122 70848 32193 -28916 -44586 -30010 7832
232 7832 54152 39342 -32485 -65605 -30579 20312 49513 41633 -6021 -56017 -46665 19438 58986
245 58986 34333 -7017 -36819 -44296 1659 54946 36963 -21760 -48404 -38357 573 47455
257 47455 47673 -3323 -49603 -44061 5592 46315 42055 7578 -33566 -47744 -3621 46906 35796
270 35796 -6714 -35894 -44684 -11876 42612 48179 1410 -39521 -42175 -8841 35181 48534 16650
283 16650 -30046 -44355 -8973 32876 36922 8622 -29013 -46947 -17012 32865 43431 10254
295 10254 -29461 -43415 -18295 26758 47370 23274 -21957 -41103 -15964 22522 37296 19230
307 19230 -20671 -45173 -21045 22715 38380 17839 -19522 -43022 -25824 18800 43453 27300
319 27300 -11826 -37161 -23162 13975 36387 24911 -11258 -39287 -26915 13280 35413 22078
331 22078 -11127 -38154 -31649 8876 39608 29733 -4615 -31452 -27626 4884 33865 29344 -3389
344 -3389 -32687 -29364 4212 31260 25331 -3737 -32458 -34458 -389 34576 31431 782 -24840
357 -24840 -29271 -4988 29337 33439 2683 -27164 -27957 -3661 23558 29022 4119 -28491 -34654
370 -34654 -6160 26546 30906 8272 -19506 -30995 -11868 24249 33798 8110 -19837 -25982 -10930
383 -10930 16490 31618 10456 -24702 -32190 -9945 16912 28784 15863 -14993 -32933 -14356
395 -14356 19000 29969 13202 -10647 -25422 -17556 12792 31284 13107 -18019 -27617 -14900
407 -14900 8003 28093 21266 -12335 -31453 -15496 11288 24720 19795 -3130 -26715 -20584 10378
420 10378 27587 14362 -8949 -23467 -20893 1981 28168 22510 -9371 -26705 -16625 1896
432 1896 21292 25680 812 -26106 -19992 6453 20811 17326 1180 -21650 -25485 -77 25578
445 25578 20390 -4059 -19105 -20769 -6083 20867 27950 1368 -21136 -17537 -1908 15037 22965
458 22965 6404 -20713 -24994 -2038 19465 18630 3738 -13503 -24996 -11935 20381 27096 1301
471 1301 -14009 -14866 -11381 10671 28776 8188 -19220 -19905 -5274 10216 20279 10596 -12528
484 -12528 -25244 -12334 14882 23503 6946 -8489 -16534 -15744 8046 27405 10139 -13375 -16010
497 -16010 -10874 3546 22958 15191 -13037 -22367 -9727 5072 17823 17035 -4307 -22706 -14820
510 -14820 8589 19645 11284 -2787 -14917 -16858 1194 22662 16391 -9701 -18620 -10079 -1086
523 -1086 13311 21992 1092 -24445 -14815 7345 12854 12627 5228 -14969 -20505 1324 18900 13949
537 13949 -1235 -14527 -16425 -3002 13757 18577 2857 -16835 -15963 -766 11118 16985 7238
550 7238 -14988 -18588 724 12523 12009 7518 -10101 -22380 -4953 16660 14473 1760 -7632
563 -7632 -15184 -10308 10094 20849 6572 -12931 -14258 -3255 6802 13800 11164 -7826 -21538
576 -21538 -7247 12966 13390 4924 -3766 -15587 -13242 8211 19586 6959 -7936 -12219 -9232
589 -9232 3611 16757 11076 -7605 -15981 -8184 4607 13191 11466 -3124 -17172 -11739 6473
602 6473 14175 8449 -901 -11847 -14207 2394 17535 10132 -5215 -11081 -9981 -1365 13049 15126
616 15126 -2543 -16430 -10417 2318 9804 11498 3420 -12252 -15491 1076 14401 10140 -361
629 -361 -8103 -12838 -4172 12904 14738 -1004 -11695 -10423 -3234 8002 14759 4232 -12088 -13092
643 -13092 -894 8823 10795 5075 -7247 -15001 -4751 11448 12384 2144 -6791 -11700 -7606 7499
657 7499 15509 4405 -9090 -10936 -4829 5062 12482 7999 -7139 -14363 -4983 7366 10399 6223
671 6223 -3349 -13294 -9227 6860 13323 5088 -4617 -10016 -8561 2751 13541 8510 -5870 -11370
685 -11370 -6465 2788 9794 9467 -1856 -13328 -8866 4557 10494 7206 -463 -10180 -11086 1751
699 1751 12506 8578 -2231 -9116 -8678 -672 10455 11010 -1112 -11316 -8503 928 8229 9708
713 9708 1817 -10137 -11154 534 9324 8629 1393 -7434 -10615 -2445 9438 10828 594 -7990
727 -7990 -8966 -2955 6836 11266 3369 -8789 -10073 -1693 6430 9381 4573 -6380 -11388 -3533 7597
742 7597 9489 3251 -5078 -9808 -5372 5799 10881 4044 -6054 -9184 -4534 4210 10028 6043 -4871
757 -4871 -10464 -4511 5014 8907 5407 -3003 -10075 -6651 4552 9703 4877 -3244 -8427 -6620 2424
772 2424 10103 6477 -3329 -8885 -6117 1867 8631 7164 -1806 -8929 -7157 2126 8499 6429 -824
787 -824 -7922 -7687 932 8793 7139 -1047 -7449 -7353 -90 7821 8179 -617 -7853 -7075 -440 6835 7873
804 7873 711 -7223 -7901 -929 7086 7560 1034 -6133 -7796 -1835 6669 8245 1366 -6199 -7682 -1975
820 -1975 5510 8144 2367 -5738 -7839 -2514 5114 7703 2672 -5058 -7858 -3059 4725 7968 2892
835 2892 -4502 -7688 -3806 3983 8081 3919 -4259 -7454 -3628 3657 7591 4389 -3504 -7600 -4336
850 -4336 3209 7395 4161 -2889 -7267 -4618 2547 7296 4788 -2701 -6969 -4591 2078 6764 5375
865 5375 -1979 -7204 -5108 1633 6549 5077 -937 -6401 -5674 1017 6530 5270 -1052 -5976 -5538 -57
881 -57 6169 6108 -402 -6286 -5381 238 5460 5889 342 -5963 -6316 17 5493 5621 875 -4739 -6059
898 -6059 -1038 5464 6068 473 -4997 -5488 -1390 4268 6564 1539 -4829 -5952 -1486 4160 5848 2149
914 2149 -4027 -6347 -1876 4253 5613 2153 -3375 -5614 -2989 3468 6682 2127 -3721 -5504 -2588
929 -2588 2211 6110 3694 -3389 -5909 -2519 2964 4855 3389 -2019 -5806 -3276 2653 5800 2786
944 2786 -2321 -4869 -3500 1257 5877 4038 -2305 -5319 -3268 1216 4540 4643 -1047 -6058 -3670
959 -3670 1657 4457 3744 -214 -4966 -4599 1018 5149 3464 -824 -4085 -4135 -435 4136 4574 -461
975 -461 -4889 -3626 79 3516 4320 928 -4288 -4922 310 3971 3770 631 -3258 -4823 -949 4447
991 4447 4449 453 -3153 -4074 -1241 3034 4957 1403 -3784 -4246 -685 2644 4263 1883 -2810 -5172
1007 -5172 -1098 3192 3541 1519 -1668 -4426 -2578 2891 5082 1529 -2668 -3436 -1865 1280 4434
1022 4434 2845 -2811 -4689 -1579 1816 3655 2439 -1209 -4410 -2836 1917 4118 2006 -1375 -3316
1037 -3316 -2873 914 4497 3021 -1784 -3600 -2468 515 3532 3380 -891 -3774 -2761 951 3274
1052 3274 3079 183 -3430 -3632 776 3750 2517 -233 -2676 -3158 -461 3667 3865 -386 -3272 -2435
1068 -2435 -291 2601 3643 742 -3381 -3346 60 2640 2857 911 -2271 -3737 -850 3076 3453 210
1084 210 -2163 -2713 -1442 2102 3791 1003 -2737 -2861 -841 1598 3254 1801 -2035 -3722 -1283 1853
1100 1853 2750 1327 -1243 -3471 -2033 1904 3561 1131 -1382 -2279 -1875 881 3368 2026 -2021 -3211
1116 -3211 -1195 1032 2650 2101 -671 -3357 -2221 1176 2743 1562 -416 -2384 -2664 302 3390
1131 3390 2176 -844 -2537 -2007 91 2589 2929 -363 -2759 -2280 502 2271 2319 492 -2506 -2780
1147 -2780 276 2647 1749 151 -1631 -2446 -636 2223 2612 -45 -2140 -2418 -512 1607 2698 1043
1163 1043 -2123 -2435 -381 1703 2154 748 -1762 -2881 -953 1686 2283 533 -1421 -2048 -1179 1612
1179 1612 2881 906 -1674 -2199 -984 939 2328 1675 -1601 -2391 -927 1042 2266 933 -714 -2474
1195 -2474 -1687 1075 2364 1334 -914 -1997 -1568 431 2283 1601 -956 -1990 -1256 249 1965 2113
1211 2113 -229 -2333 -1725 525 1883 1831 -250 -1626 -1780 -35 2431 1656 -38 -1554 -1854 -241
1227 -241 1573 2243 4 -1857 -1555 -192 1423 1868 169 -1481 -1874 -472 1694 1649 314 -1314 -1950
1244 -1950 -748 1234 1979 357 -1405 -1835 -646 1153 1942 592 -1359 -2051 -594 1168 1577 791
1260 791 -972 -1816 -694 1170 1840 829 -524 -1779 -1005 860 2110 936 -1001 -1331 -930 376
1276 376 1600 1318 -466 -1886 -1264 477 1423 1081 -337 -1918 -1403 597 1601 1117 -402 -1462 -1258
1293 -1258 314 1592 1407 -197 -1749 -1272 41 1480 1429 9 -1373 -1448 144 1171 1370 47 -1271
1310 -1271 -1542 -292 1510 1450 366 -1145 -1499 -251 1053 1449 388 -1264 -1432 -384 991 1514 288
1327 288 -1130 -1488 -493 859 1402 555 -662 -1581 -823 1042 1467 319 -688 -1302 -830 614 1261 684
1345 684 -670 -1302 -711 657 1323 791 -704 -1405 -1096 675 1568 842 -326 -1303 -794 218 1332 1050
1363 1050 -430 -1222 -1069 366 1280 1064 -279 -1117 -1222 -37 1311 1137 -17 -1157 -1041 -43 1281
1380 1281 1287 -210 -1134 -1124 -129 1058 1203 198 -975 -1231 -47 1032 1086 333 -1032 -1452 -304 817
1398 817 1180 516 -704 -1067 -378 622 1165 506 -945 -1221 -513 473 1177 585 -678 -1109 -589 699
1416 699 1291 637 -407 -1272 -721 531 1101 544 -669 -766 -710 505 1356 1016 -553 -1273 -709 293 932
1435 932 707 -337 -1503 -688 396 953 587 51 -780 -982 177 1024 878 -266 -1027 -1011 299 892
1453 892 1059 69 -1262 -993 124 955 961 264 -1026 -937 -79 916 774 164 -866 -1132 -429 819 975
1472 975 -51 -674 -839 -202 463 963 206 -936 -1159 -259 610 714 496 -699 -1076 -555 609 1179 491
1491 491 -484 -945 -589 552 978 269 -641 -908 -604 553 859 858 -543 -921 -702 641 758 565 -334
1510 -334 -1143 -623 407 1044 443 -122 -1045 -618 215 846 602 -459 -795 -617 146 807 671 -234 -865
1529 -865 -626 237 803 509 2 -1007 -835 -69 896 702 -127 -631 -942 -119 866 911 -136 -794 -722 79
1549 79 666 731 468 -533 -1081 40 618 778 217 -621 -974 -336 669 743 -157 -479 -592 -139 539 911
1569 911 222 -731 -868 -303 514 861 379 -426 -722 -362 751 997 57 -497 -981 -637 429 980 430
1588 430 -353 -616 -525 288 584 412 -619 -647 -339 495 835 236 -250 -983 -518 302 757 380 -340 -597
1608 -597 -473 150 938 714 -392 -791 -524 -23 623 502 45 -538 -846 278 726 511 -37 -706 -689 70
1628 70 1063 440 -52 -200 -644 99 766 606 -111 -629 -610 -231 696 585 73 -733 -761 101 745 666 96
1649 96 -617 -925 60 493 559 -7 -499 -344 -213 417 724 177 -509 -785 -242 269 485 388 -216 -775 -354
1670 -354 513 492 201 -387 -724 -40 251 477 265 -503 -582 -179 293 744 370 -181 -711 -130 71 562 326
1691 326 -96 -826 -312 257 558 299 -292 -566 -440 222 857 437 -505 -578 -328 68 449 328 -187 -580
1711 -580 -254 282 663 398 6 -604 -649 218 350 356 -8 -578 -440 233 174 312 72 -750 -524 20 404
1732 404 559 54 -418 -667 98 546 452 70 -218 -423 -143 474 381 94 -388 -549 49 493 654 88 -493
1753 -493 -316 -165 89 350 -16 -296 -381 -68 420 485 203 -129 -630 -348 392 473 83 -395 -215 -212 294 477
1775 477 375 -173 -603 -124 260 532 347 -379 -500 -7 68 466 334 -16 -389 -359 43 281 160 -79 -462
1796 -462 -360 131 467 116 -60 -197 -340 -261 154 250 230 -159 -451 92 357 407 12 -169 -347 -64 293
1817 293 521 98 -393 -374 150 363 263 94 -166 -301 18 293 334 -6 -415 -428 -290 238 271 34 -14 -214
1839 -214 -121 193 217 209 -159 -187 -141 343 170 44 -218 -465 -167 52 145 266 99 -159 -224 165 571 82 -133
1862 -133 -366 -180 87 381 59 -92 -178 -104 -66 253 277 15 -112 -123 202 207 201 -99 -194 -240 -102 300 429 27
1886 27 -163 -476 8 255 169 88 -110 -212 -190 334 327 -184 -248 -523 -150 144 428 37 -278 -276 118 -28 361
1909 361 185 -98 -420 -71 109 58 20 -324 -325 -238 86 225 78 31 -275 -288 363 189 108 -146 -356 149 -148
1932 -148 244 224 -194 -204 -81 30 104 -74 -316 -109 -157 120 281 326 47 -548 -150 -60 286 130 -78 -199
1954 -199 -167 8 136 146 128 -4 -497 -83 263 250 -97 -231 -153 124 341 284 -35 -380 -209 -118 248 333 152
1977 152 -268 -338 65 29 214 60 -89 -133 -55 -47 407 -72 64 9 -265 -140 180 125 -89 -193 -186 182 229 198
2001 198 -246 -181 -42 133 181 187 -140 -20 -96 180 15 220 56 -91 -239 81 157 19 55 -206 -241 -115 334
2024 334 465 35 -399 -294 158 419 519 120 -199 -192 217 22 145 137 17 -157 -203 56 181 -72 -299 -107
2046 -107 3 136 289 206 -175 -204 -213 19 269 59 -31 -417 -183 -24 227 319 29 -162 -216 12 -20 10 -128
2069 -128 -458 -38 52 161 105 226 -220 -552 74 88 410 36 -316 -429 -30 224 87 -74 -185 -168 218
2090 218 67 328 -185 -11 -188 -74 223 382 239 -154 -339 -84 93 335 114 -299 -242 78 94 61 102
2111 102 -181 -182 -345 44 386 313 -225 -208 -121 108 345 224 -121 -402 34 153 74 483 -129 -160 -165 -95 270
2134 270 330 -208 -292 -253 278 359 148 108 -95 -157 42 191 171 -165 85 -257 -63 123 272 72 -244 -159 -151
2157 -151 391 204 -155 -387 -351 -113 45 376 22 -287 -246 143 159 329 -8 -86 -444 93 -64 161 62 -507
2179 -507 -204 -11 278 442 145 -240 -365 -148 137 179 195 -120 -126 -283 73 132 137 6 -348 -150 259 470
2201 470 277 -201 -65 -371 -46 435 230 -41 -86 -250 91 349 98 64 -363 -48 -3 482 266 -79 -282
2222 -282 -327 44 306 472 50 -308 -297 -118 292 427 -23 -129 -369 33 285 -44 323 -216 -210 -38 231
2243 231 478 -5 -37 -393 -131 417 277 -53 -252 -268 -462 173 475 44 -84 -266 -110 253 349 317 -242
2264 -242 -171 -228 259 221 31 -70 -775 48 174 363 118 -173 -251 -38 -152 411 81 -117 -123 -260 61 457
2286 457 404 -101 -231 -112 173 347 70 -226 -191 37 148 337 201 -47 -294 -254 151 331 236 163 -185 -154
2308 -154 58 80 309 -155 -262 -65 -77 280 170 -30 -286 -213 38 140 220 -157 -279 -278 182 359 415 70
2330 70 -118 -352 -58 354 26 -140 -120 -227 -86 101 272 -69 -61 -200 -253 -16 186 34 -176 -211 41 121
2352 121 366 135 -110 -265 -206 405 162 3 -140 -252 -179 356 249 329 -88 -125 -228 105 236 149 -88 -370
2374 -370 -7 48 198 178 -152 -212 -356 -93 246 181 -44 -77 -44 -229 297 173 80 -459 -342 -165 191 265 121
2397 121 -61 -281 109 -123 167 -23 -120 -412 -137 33 235 -9 -121 -268 -163 266 335 -23 -140 -264 -72
2418 -72 254 248 287 -111 -402 -101 267 179 -11 -25 -268 -224 359 205 196 -175 -424 -93 45 426 313 -167 -347
2441 -347 -252 -38 529 272 -97 -234 -330 109 370 167 -239 -221 -298 188 254 455 -24 -519 -211 -154 383 -63
2463 -63 -68 -268 -231 34 159 47 46 -229 -387 -173 87 247 50 -304 -187 -283 84 151 110 -95 -273 -134 33
2486 33 205 61 -161 -477 -198 343 195 91 -284 -392 -183 93 334 297 -226 -326 -89 194 239 62 -228
2507 -228 -291 -209 216 398 296 -188 -215 -185 304 410 -7 -36 -445 -204 286 355 130 105 -254 -160 -120 273 265 -230
2531 -230 -257 -187 473 194 397 -167 -287 -230 20 275 173 -11 -271 -153 -1 327 456 163 -371 -272 181
2552 181 167 245 106 -186 -195 130 538 395 305 -321 -326 225 421 248 341 -190 -280 -212 308 324 236 -82 -167 -82 -146
2577 -146 297 56 -197 -319 -179 174 200 127 74 -63 -133 141 423 278 -229 -191 -200 61 184 276 75 -370 -37
2600 -37 111 222 30 -21 -239 -344 139 456 258 75 -408 -111 83 396 307 277 -326 -297 4 224 43 -88
2622 -88 -244 -419 9 525 338 -213 -222 -275 -116 180 424 189 -187 -339 -16 250 118 53 -122 -232 -10 256
2644 256 206 -207 -306 -474 14 199 373 -22 -159 -421 -230 273 614 36 -97 -328 -240 184 344 1 -258
2665 -258 -175 -42 36 326 180 -38 -451 -230 240 326 274 -23 -110 -109 -149 448 408 -113 -419 -127 136 239 169
2688 169 188 -423 -333 56 80 362 174 -409 -240 74 199 175 74 -90 -145 155 303 439 210 -149 -128 -99
2710 -99 440 375 -97 -291 -315 -266 165 130 -86 7 -380 -263 142 370 -57 -126 -193 -205 263 329 299 -220 -381 -344
2734 -344 118 326 297 -423 -213 -183 123 372 398 -14 -372 -54 175 359 126 -34 -267 -292 265 288 195 4
2756 4 -130 -399 45 295 116 -164 -405 -39 51 218 158 -70 -281 -335 -42 109 136 -78 -546 -316 -80 572
2778 572 265 -20 -385 -205 324 377 417 6 -474 -392 78 376 466 142 -267 -458 28 225 416 135 -114
2799 -114 -355 -199 520 192 -1 -463 -480 -249 366 415 86 -138 -338 -195 -117 395 -34 -244 -88 -25 130
2820 130 314 138 -65 -171 -45 255 -80 216 -246 -485 -299 148 264 5 -91 -448 -50 79 362 377 -83
2841 -83 -258 10 270 278 286 -89 -326 -91 -47 254 412 84 -404 -305 -33 398 232 43 -393 -486 4 336 33
2864 33 -125 -306 -286 -57 406 388 104 -502 -302 -187 185 373 320 -251 -491 -287 176 267 240 -326 -157 14
2886 14 89 330 -19 -224 -402 -271 6 487 204 -192 -391 -84 470 595 316 -387 -279 -221 333 369 169
2907 169 -409 -315 -385 -38 360 135 -97 -343 -277 249 419 324 -243 -703 -143 210 465 276 5 -291 -229 288
2929 288 179 256 -89 -318 -285 75 288 131 -79 -544 -366 187 69 123 227 -267 -492 -116 396 243 160
2950 160 -82 -358 31 496 358 31 -243 -316 13 116 327 241 -397 -349 -158 232 351 3 -259 -311 -274 294
2972 294 399 123 -98 -422 17 219 416 88 -339 -380 -77 106 256 -166 -300 -304 -329 126 379 0 -143
2993 -143 -393 -36 208 288 120 -180 -463 -224 55 300 288 26 -475 -109 274 360 228 -179 -336 -209 118
3014 118 300 220 -147 -389 -104 16 353 90 -192 -214 -324 25 202 240 11 -379 -287 126 219 366 -130 -338
3036 -338 -518 -123 245 156 44 -263 -156 -97 517 410 -219 -294 -521 -12 329 273 47 -339 -262 96 254 483
3058 483 110 -551 -297 -59 30 481 266 -302 -589 -437 176 349 -53 -280 -442 -252 193 396 137 -221
3078 -221 -486 -185 164 483 225 -181 -500 -127 160 271 381 -201 -696 -382 66 200 360 -100 -487 -359
3098 -359 139 291 223 -74 -469 -171 188 372 127 -52 -449 -261 268 275 436 46 -186 -434 156 233 479
3119 479 -7 -271 -240 25 302 493 128 -574 -187 86 302 170 46 -281 -261 -63 143 364 136 -344 -447
3140 -447 32 452 223 301 -147 -496 -133 180 213 77 -349 -599 -342 195 283 76 -325 -526 -39 176 487
3161 487 63 -74 -398 -328 59 376 252 -12 -268 -282 62 369 198 -104 -311 -234 269 357 591 -83 -251
3182 -251 -199 128 494 109 -73 -319 -267 80 432 199 -225 -337 -354 51 239 154 -223 -381 -529 -30 192
3203 192 398 296 -355 -439 -247 291 353 70 -252 -208 -153 379 329 -19 -231 -326 -40 174 288 -49 -433 -162
3225 -162 149 2 333 14 -286 -533 -11 206 307 97 -76 -377 -87 382 641 104 -486 -94 -145 313
3245 313 362 12 -331 -480 -176 204 719 34 -64 -403 -224 413 235 128 -128 -365 -131 83 256 297 -81
3266 -81 -170 -354 37 534 323 -111 -380 -206 105 394 232 -107 -405 -125 94 297 203 -153 -500 -537 -95
3287 -95 235 213 -337 -365 -249 94 587 421 -90 -163 -196 -199 295 359 -33 -478 -312 -233 396 293 -131 -246 -324
3310 -324 -134 -62 433 46 -256 -388 -124 364 417 -81 -224 -315 -357 158 308 26 -173 -618 -184 21 259
3331 259 305 -10 -305 -45 111 391 352 -370 -17 -75 235 398 -102 -104 -251 -196 -49 237 177 -232 -193 -320 130
3354 130 360 290 -38 -185 -462 65 313 37 -151 -164 -215 90 589 96 29 -319 -282 159 554 374 164 -402
3376 -402 -293 -47 213 466 76 -22 -399 71 387 139 -9 -325 -453 -88 271 400 -204 -383 -335 -61 236
3397 236 418 38 -244 -273 -184 159 312 87 -303 -319 -278 169 304 -30 -256 -450 -162 442 433 267 69 -285
3419 -285 -24 68 349 63 6 -434 -129 264 421 12 -60 -370 -171 163 437 193 -32 -315 -167 -71 204
3440 204 110 -191 -339 -38 158 363 353 -64 -546 -274 -99 444 357 -43 -545 -101 60 263 179 -59 -473
3461 -473 -349 -97 514 253 -48 -326 -452 -64 274 389 157 -267 -503 -61 287 317 -53 -302 -180 -146 145
3482 145 400 -1 -403 -542 -90 368 357 20 -209 -368 10 405 533 -106 -333 -429 -268 79 546 60 -331
3503 -331 -342 -180 323 611 175 -596 -452 -227 248 298 109 -317 -387 -97 -7 388 125 -144 -494 -181 143
3524 143 393 131 56 -255 -204 -15 101 261 -227 -138 -395 -30 420 403 -125 -362 -84 140 204 386 51 -255
3546 -255 -564 54 425 301 -189 -292 -527 -91 530 254 -326 -511 -348 -4 310 443 199 -498 -349 96
3566 96 324 354 -123 -256 -345 -46 492 330 -29 -411 -342 -118 251 485 -13 -259 -671 167 348 476 72
3587 72 -320 -435 -75 202 94 211 -206 -497 -162 347 280 38 -83 -334 -212 288 165 140 -108 -444 -274
3608 -274 203 333 229 -117 -192 -223 -73 247 506 -59 -486 -178 222 317 149 3 -329 -158 296 116 294
3629 294 -101 -436 -380 91 421 6 -36 -238 -280 -158 584 246 -201 -410 -530 -108 316 197 -56 -200 -219
3650 -219 -86 421 275 -19 -138 -264 -83 418 269 18 -128 -429 -28 101 240 125 -252 -442 124 168
3670 168 311 207 -386 -251 17 328 442 21 -239 -298 103 236 607 -75 -353 -245 -86 241 552 233
3690 233 -339 -472 -246 260 534 126 -280 -177 -57 290 217 237 -78 -146 -162 162 389 118 -209 -513 -129
3711 -129 -7 310 202 -148 -485 -338 -20 248 284 -163 -376 -161 9 368 175 -67 -425 -199 250 204 346
3732 346 -113 15 -57 51 -149 140 -21 -13 -209 63 336 238 -96 -238 -230 52 174 203 -106 -369 -206 76
3754 76 222 302 13 -324 -114 174 238 397 27 -59 -320 -199 502 278 61 -228 -498 -48 337 442 -58
3775 -58 -358 -238 -122 258 206 6 -348 -516 -147 352 153 264 -411 -546 -124 267 429 246 -223 -352 16
3796 16 249 270 273 -413 -266 114 301 196 28 35 -356 7 347 325 268 -226 -221 -315 223 216 114 -286 -330 -150 122
3821 122 537 231 -320 -288 -288 -147 188 36 -296 -334 -194 -207 136 307 -127 -432 -70 219 -95 240 -191 -152
3843 -152 -230 256 316 75 82 -168 -23 16 342 535 5 -226 -86 -83 518 225 138 -204 -53 178 155 352 7
3866 7 -222 -197 163 94 219 -6 -376 -523 -79 92 262 -72 -166 -308 -10 -53 461 -21 -255 -352 -160 -31
3888 -31 73 129 -477 -375 -160 14 197 20 -65 5 -121 108 170 348 -105 -223 -117 88 485 101 -123 -393
3910 -393 -52 234 109 205 35 -103 -138 -114 55 224 -36 -282 -139 195 532 338 -131 -354 -219 39 304
3931 304 185 -257 -369 -123 139 111 306 44 -420 -261 121 304 291 -112 -360 -446 -61 -34 264 4 -418
3952 -418 -333 -237 366 192 170 -96 28 -67 111 214 22 -328 -418 88 198 439 -128 -226 -130 22 85 358 -13
3975 -13 -262 -244 210 258 415 69 -209 -321 -52 77 301 171 -347 -195 -312 98 -74 121 19 -72 24 64
3997 64 473 -9 -163 1 -77 2 56 107 -314 -329 -77 102 101 82 -172 -253 -174 224 295 209 -25 -244 -85 -2 95
4022 95 203 -151 -178 63 4 238 178 -229 -207 -302 234 125 229 -141 -263 86 -137 206 116 -39 -233 -238 263
4045 263 290 174 -32 -149 -354 41 154 348 -173 -90 -207 92 -99 327 -34 -105 -184 -15 99 152 -49 -512
4067 -512 -185 -36 106 235 116 -179 -101 126 127 26 98 63 -393 -77 422 187 39 -139 -231 -48 206 218
4089 218 61 -71 -159 -197 146 141 -33 -152 -258 10 148 111 199 -37 -352 -12 -46 -33 131 -67 -161 -235 110
4112 110 198 0 151 -94 -95 -4 -24 260 -109 -28 -169 -64 154 51 -190 -15 -159 -85 294 268 -15 -260 -176
4135 -176 -142 258 92 8 -104 -93 -230 180 221 87 30 -153 134 88 145 63 -146 -84 -5 -93 79 108 -343 -216
4159 -216 -243 126 276 -134 -217 66 8 156 -46 174 8 -198 -135 231 170 9 -58 -276 -144 244 288 -90
4181 -90 -2 -296 16 273 179 -127 -102 -242 -179 90 -131 151 -177 -48 -84 143 207 318 -42 -236 113 173 100
4204 100 211 198 -106 218 -34 123 115 -200 -283 -190 123 10 277 -215 -278 -348 -44 -60 75 -81 8 -13 -60 50
4228 50 63 -219 -65 -289 -239 291 49 28 -25 -170 16 57 176 -86 -454 -190 -102 266 240 -79 45 -115 299
4251 299 58 204 162 -200 -352 -52 54 201 -54 -186 -221 13 185 15 -21 -160 -235 32 -60 -84 49 -24
4273 -24 -126 -253 182 -23 94 -225 -241 73 185 121 -89 -86 31 -52 90 70 313 -190 -196 -60 98 271 117
4296 117 -233 -212 -150 -52 61 74 -33 -144 -135 34 30 -162 -12 53 47 302 7 136 -98 -56 -255 -11 171 64
4320 64 28 -216 -132 80 358 13 65 -238 -17 -62 -90 93 68 -258 -214 186 272 97 -47 130 88 -19 172
4343 172 220 -62 30 -77 19 97 142 -19 -270 -165 -88 -86 72 -104 -68 -58 85 141 -135 34 31 7 -86 -107 83
4368 83 -260 -231 -83 -9 1 204 74 -162 -11 99 -11 130 194 -24 -65 -118 -201 10 -290 158 -176 61 190
4391 190 222 -123 -81 -183 -40 53 -21 -61 -6 -211 104 -125 66 16 5 73 -105 155 411 111 -54 -81 24
4414 24 104 127 -171 -26 -400 17 109 -98 11 -15 -60 147 45 21 -101 -125 -288 100 25 177 303 -34 67
4437 67 53 254 -85 150 57 -374 -18 -95 161 296 34 -106 -167 71 343 187 -79 -176 -118 114 47 -19 -5
4460 -5 -322 -21 290 6 72 -353 -89 -67 -12 142 119 -65 -162 -14 205 126 -58 -55 102 -102 42 9 -162 34
4484 34 14 -21 89 -36 41 92 -75 -120 -118 378 94 137 -220 52 -153 -76 412 94 -71 64 21 -45 310 -337
4508 -337 -236 -89 -71 -29 38 -52 3 120 -158 137 143 275 66 -7 -76 41 284 -31 -206 -150 -50 6 84 -14
4532 -14 -44 -22 -24 156 92 58 -267 -90 -117 134 -184 198 -46 -100 -87 -14 -43 97 20 -53 -108 -57 94 75 -47 124
4558 124 83 134 229 69 36 106 -52 79 127 62 10 -212 -133 -106 93 -9 -11 -108 -140 17 130 63 89 -60 -159 -95
4584 -95 221 89 9 -20 79 -214 -38 19 157 -116 -98 -81 29 -116 -94 -157 59 167 95 211 -137 -165 -122 109
4608 109 -25 -31 -54 -2 -66 3 118 65 149 137 22 17 -180 286 189 -156 25 123 -101 216 136 -103 -138 -101 38
4633 38 63 -5 64 -74 41 244 82 190 -118 8 -121 -83 -16 45 -84 -219 13 -136 120 321 -316 -84
4655 -84 -92 280 41 -108 -120 -296 -83 -58 -114 -49 -188 -136 2 -57 -40 54 150 -126 -31 8 70 59 -125 -120 -56 109
4681 109 200 -133 -142 18 -131 -53 60 135 110 -102 -91 -160 -69 71 -3 161 -87 -28 146 17 35 -110 -207 40
4705 40 93 -140 -228 6 79 107 -26 67 -4 -81 36 -80 33 251 25 -39 108 177 -217 390 -41 -27 -53 14
4729 14 210 28 78 138 -70 -247 53 -134 48 115 -159 -245 -88 -71 118 -131 -65 53 87 401 -154 -73 -33
4752 -33 100 73 177 3 5 -125 -116 -10 164 202 -168 67 -120 111 158 41 -122 -196 -172 135 235 -168 -57
4775 -57 -115 95 -73 -40 -117 -73 -79 -189 52 -4 86 -139 -231 30 -72 105 69 50 -208 -84 226 352 215 -128
4799 -128 -13 130 -15 126 249 -78 -87 -14 219 -47 37 101 -202 16 -112 346 96 -58 -168 -127 0 -41
4821 -41 87 61 -193 -144 34 206 174 111 -144 -22 -28 38 65 -94 48 -202 -148 199 73 43 -95 67 -160 52
4845 52 -101 -13 -154 1 192 61 69 -134 -260 14 -125 -203 -56 -52 18 73 61 233 215 -141 -45 -61 75 -10 162
4870 162 -2 159 -185 92 -62 14 -20 144 97 12 12 -82 22 8 -21 65 130 171 93 -97 -160 -229 157 87 215
4895 215 -114 -124 -77 107 159 87 66 -170 -191 -120 3 -125 -69 79 32 -70 40 95 51 -57 -2 62 165 -10
4919 -10 -59 4 29 -71 299 207 -23 -39 -20 -28 -135 -13 90 -390 -134 149 172 115 -162 -113 -155 99 212 246 -27
4944 -27 -103 -189 212 141 -34 112 -39 204 137 46 -133 90 294 -243 -63 -46 -127 82 -227 -160 199 -213 74
4967 74 201 107 -23 -23 30 171 114 -127 -80 37 161 131 -13 -256 -27 -17 -56 42 -107 106 -52 113 41 -60
4991 -60 350 155 121 -66 -6 345 -191 46 17 -48 -42 176 8 43 -309 -240 65 -84 -182 -161 -37 -56 66 2
5015 2 63 -176 -88 -126 -65 -20 79 73 42 -247 164 -31 150 -104 -32 158 -40 -107 152 196 -239 -256 -21 54 239
5040 239 183 -66 -223 -27 -4 122 188 -21 64 93 -69 -212 192 -185 -155 15 -23 32 132 72 -146 -8 4
5063 4 -112 -80 31 -21 -18 51 94 147 64 28 14 92 -63 101 205 -345 63 -23 66 -134 -218 -26 60 -104 -180 185
5089 185 86 -89 -77 -23 452 78 -14 -76 109 62 -5 118 34 -30 60 39 65 -35 -36 -59 -188 1 42 -26 -221 -132
5115 -132 -182 51 167 84 13 -70 -145 55 58 324 -166 55 -58 48 120 33 -60 -120 -66 110 129 27 35 48 55 158
5141 158 -93 -81 26 49 82 -57 53 -6 29 -84 183 157 93 -6 225 14 19 -50 166 180 77 13 -119 -109 -117
5166 -117 2 -13 60 -5 -20 14 40 14 -46 -112 48 -201 103 -51 7 -134 37 -104 1 -9 26 -294 -47 131
5190 131 154 -215 155 -177 -80 -120 -128 20 334 -174 171 -21 -120 158 56 31 -22 288 273 -26 -120 -174 -118 82
5214 82 69 125 119 177 -144 93 328 -27 -51 81 -480 -79 185 -282 70 -42 -24 67 129 -29 -89 155 29 -112
5238 -112 88 235 83 205 -137 7 40 118 -140 88 195 173 57 35 117 -9 -4 73 -90 -26 21 145 45
5261 45 -137 210 256 133 158 -46 -197 -136 -5 178 194 -225 -90 -223 -50 -285 -43 -176 -21 179 73 62
5283 62 -142 -156 -59 362 109 -27 42 -305 -210 85 8 10 65 -187 119 132 -4 217 100 -244 -146 -45 -11 136
5307 136 88 194 62 -121 123 44 105 -52 79 47 252 -11 6 277 87 170 128 124 97 -68 36 -42 -165 156
5331 156 -41 -180 -96 2 8 -71 15 -115 -200 -75 146 64 -91 -172 199 -150 7 293 -53 109 70 119 -16 109
5355 109 -42 -178 -95 -132 136 237 -25 -131 115 -161 84 0 -10 14 -34 -7 158 155 -162 -38 -182 30 -62
5378 -62 135 34 200 -183 116 -79 12 42 110 326 -129 175 31 129 98 -105 -37 -147 223 214 58 -126 -124 -171
5402 -171 -92 165 59 102 -228 -55 151 106 256 -62 -44 -63 141 178 -139 -128 134 75 45 -4 -139 1 -35 -22
5426 -22 115 -89 -65 29 137 -72 150 69 90 168 -68 -55 39 164 131 -20 -219 -13 131 280 45 211 -117
5449 -117 79 -73 -3 37 53 -199 81 278 73 -15 -45 -72 -17 -63 -17 71 -19 -154 -377 63 -11 -183 -71 -353
5473 -353 104 153 76 169 -134 -8 -207 129 134 58 56 -15 -6 102 93 257 196 -12 -117 -111 132 148 28 -102 -125 83
5499 83 -45 -201 -14 -226 70 -57 11 96 135 -73 49 -32 -42 -55 -20 -40 46 -1 7 100 -389 25 -40 128 -14
5524 -14 51 64 18 33 -48 87 -51 127 -205 -29 -59 135 90 291 -55 -217 -143 65 -5 129 3 -163 -42
5547 -42 179 91 -41 -214 12 -16 211 -20 147 -64 -63 -139 85 -209 115 83 3 68 84 352 -58 -249 -36
5570 -36 -133 -3 253 70 121 -100 -187 -85 293 69 211 221 -234 -84 -129 90 78 -7 -25 -132 -51 340 -128
5593 -128 -44 -189 -98 84 48 228 -13 11 -24 66 -335 26 83 32 216 26 159 50 -76 -70 -87 88 -55 -1
5617 -1 53 58 84 62 165 76 172 -87 52 -48 126 -142 -168 52 -23 109 133 133 -185 -138 -211 248 154 325 -112 -11
5643 -11 -48 188 -57 -106 -123 -340 187 -68 191 -78 138 158 -42 137 -65 -53 192 -199 89 186 40 3 48
5666 48 -137 -108 2 38 -204 18 -149 -77 -63 -61 -95 -115 3 -307 93 114 165 -34 -188 -89 100 -33 -34 -23 9
5691 9 14 377 -135 -77 115 107 -58 -115 3 -26 29 -40 -219 -113 163 -111 -141 31 -77 82 140 55 208 -11 142
5716 142 -37 91 82 -67 57 26 -85 -25 86 75 4 107 -50 -38 80 71 -24 -107 -181 13 9 -58 -188 -23 -51
5741 -51 -231 -194 -89 -266 -110 -71 -72 -70 -30 169 -77 167 -73 131 187 151 69 419 -44 -9 68 -36 -88 63 -30
5766 -30 -4 124 -95 -210 -40 37 138 35 -104 66 75 -23 38 92 86 -66 -75 -205 -76 52 -159 -189 19 -1 19
5791 19 97 78 -66 46 -42 -133 146 114 -16 -80 -224 25 64 95 -33 -5 -17 -237 -208 145 -10 210 72 -29
5815 -29 283 -19 -39 53 -60 -187 104 178 3 -265 133 -33 5 93 47 3 -86 -88 7 78 116 -198 -374 69 218
5840 218 2 66 -222 52 234 141 85 174 -23 -139 -148 -72 49 228 144 -35 -253 148 177 -94 117 -51 46
5863 46 -13 73 12 216 -80 -249 -37 -16 -156 -196 -113 16 104 -115 81 -64 3 -10 145 172 139 -44 224 63
5887 63 69 119 55 48 -173 -228 -141 -30 -29 140 147 -28 99 153 -159 -58 -94 -7 -5 -48 0 226 -65 -17 -35 2 168 21
5915 21 -71 146 -25 -47 98 -76 -39 96 67 102 77 54 -249 35 -92 -42 -73 -25 64 -172 -68 -53 -50 207 19
5940 19 -31 113 -30 -59 -211 -107 -156 -172 -50 -43 39 -37 -16 -161 -245 -88 237 -68 -92 -41 -30 179 25 -93 140
5965 140 -149 73 32 -65 57 -175 30 3 164 58 30 -94 3 -239 20 184 -16 -220 42 -45 -39 98 -74
5988 -74 -186 16 17 62 282 21 -41 -292 258 117 151 -46 -135 148 -81 -8 -250 -75 -264 -30 66 -136 -49
6011 -49 32 -145 28 4 40 55 -156 -154 140 -323 -219 -53 -10 -64 -28 -111 -116 142 -39 -41 29 135 148 -91 -230 -69
6037 -69 59 -37 -128 41 -126 29 -34 -216 -50 11 204 -59 105 -124 158 -78 -46 205 -67 40 -261 49
6059 49 -261 -130 -4 -33 9 131 -16 -247 -3 -41 102 -56 -271 92 188 -55 61 152 94 142 -54 68 55
6082 55 -6 85 157 -150 -196 72 47 -8 9 121 -361 141 -118 -251 68 -5 11 108 58 148 143 -121 79 -73 -91
6107 -91 99 36 -4 -151 24 62 -50 -201 286 -140 177 30 123 -23 175 152 19 84 28 206 82 46 -19
6130 -19 -191 65 205 -5 283 19 -3 -208 114 101 -57 137 209 4 -44 48 98 -328 -113 69 311 156
6152 156 -29 22 70 187 58 -52 5 -42 -32 61 41 -150 19 -111 292 45 192 -20 -190 -79 -210 115
6174 115 -150 -136 53 -161 -63 -105 -83 18 -116 136 -155 229 130 -44 147 -21 21 18 71 202 129 99 -3 52
6198 52 239 63 38 36 173 -153 96 122 7 -68 118 -109 53 120 -153 -108 -44 9 -71 0 85 87 -21 -98 -150 -15
6224 -15 -130 -42 35 25 -65 -6 84 -60 20 -141 32 211 213 302 114 147 181 118 22 85 -48 -180 -59 42 58 -56
6250 -56 17 15 -203 80 -167 29 65 -93 -72 -29 -37 10 -126 193 256 113 18 213 -131 -73 -8 -34 83 -42 49
6275 49 -78 -192 -87 141 41 -250 -17 62 66 154 -53 -71 232 74 26 90 218 109 -94 -61 -114 113 -54
6298 -54 -37 -63 10 -10 74 175 -15 51 -44 80 146 70 23 -260 -35 208 119 -28 32 -46 301 -24 336 -138 -172
6323 -172 58 -8 -38 120 210 6 145 -51 -55 -107 -55 -213 154 -187 -15 -82 -304 -151 -78 18 -24 -143 201 -108
6347 -108 -296 96 282 71 3 -17 48 -114 -122 26 0 17 64 -92 68 -21 -66 -81 241 151 146 -69 -228 159 35
6372 35 -176 48 72 -33 -20 112 28 44 -76 -112 70 -189 -101 -3 289 420 180 104 49 182 180 -74 -48 50 44
6397 44 -22 121 -134 -69 346 27 7 26 47 141 77 -63 -380 112 -101 -85 -36 -73 -142 -141 -146 -132 24 -164 -85 177
6423 177 -40 -236 154 -218 159 -253 -13 -8 -8 65 131 179 111 -42 -276 -26 135 -137 168 -129 -169 -193 96
6446 96 -3 92 185 191 -85 -94 149 46 258 -25 -88 -23 -435 -62 285 91 58 79 122 -30 -257 -117 -83 -212 18
6471 18 -84 266 167 -185 -26 77 58 -14 -153 -21 -189 -104 -24 252 -146 133 -97 88 24 27 -54 -209 132
6494 132 117 48 -39 -115 10 -13 -37 97 125 -79 17 -81 63 109 34 309 -94 104 122 -229 -12 139 -97 -60
6518 -60 119 -107 -130 56 101 53 -112 -85 106 -59 46 100 -178 -186 145 -32 166 -3 36 126 -24 -65 -108 21
6542 21 277 -68 54 -4 -51 23 -95 62 95 -43 138 -22 -71 17 -36 189 -195 -282 205 131 152 117 -281 -34
6566 -34 -117 -65 55 117 120 -273 -52 92 -40 -143 15 57 -93 -172 -198 181 -11 17 91 -164 -27 -13 78 -50
6590 -50 -216 33 56 -154 126 -34 -74 -57 191 209 3 -185 14 183 -191 -98 -192 -296 -138 -87 -121 56 -124
6613 -124 210 35 -99 -138 3 -53 -27 -123 99 45 182 66 -35 -122 -123 -7 130 -25 202 -5 -25 -39 71
6636 71 189 77 -112 29 29 -89 108 113 264 156 79 185 113 154 387 -93 61 143 -324 57 99 -60 -143 -15
6660 -15 9 -194 -130 -69 52 -42 112 24 -95 122 -187 -118 3 -59 -215 211 -51 163 34 -152 36 142 127
6683 127 72 -82 -73 -12 -231 -16 -162 -174 75 -213 120 -47 -5 63 -63 63 37 -55 -127 -113 -28 -35 -80 -49 100
6708 100 -113 -68 70 -142 -100 119 -31 31 -208 65 223 192 11 -66 293 249 -261 -21 107 75 82 -23 -139
6731 -139 -65 132 -104 -68 151 -57 274 280 211 76 63 9 131 -223 -19 97 91 107 22 -67 -32 -233 86 -50
6755 -50 30 -20 -55 93 -22 215 -32 200 -12 -311 -38 42 -92 -258 28 -24 -151 -21 56 -155 -146 32 -277
6778 -277 25 -296 -83 86 -23 55 -54 -69 97 46 24 -8 34 -18 84 -81 69 127 -121 279 120 -307 66
6801 66 104 -144 103 -152 173 132 -7 13 92 16 72 -278 -235 -68 -56 -187 -72 122 -104 171 -256 124 -2
6824 -2 61 -117 124 64 -163 34 151 79 54 -39 21 79 15 48 84 115 -24 146 25 -252 3 219 -319 197
6848 197 -5 -52 -53 -102 -196 53 64 -108 -198 109 -39 58 -195 -86 103 -78 35 121 -86 109 170 37 149
6871 149 74 49 -101 -20 4 -121 74 -56 40 110 39 8 36 -41 56 -210 -256 141 -30 26 -242 -159 -132 0 -29
6896 -29 -171 115 -143 0 -6 -258 1 -234 -217 -77 -36 209 -72 -121 118 -86 20 86 220 -51 107 -56
6918 -56 -215 29 -158 -159 -43 -192 -266 -77 -167 -53 -126 -28 -157 -94 -289 -28 225 108 65 -121 -53 91 156 -172
6942 -172 71 -36 94 -93 -39 18 -4 -156 218 -56 -29 191 53 -120 -266 71 -153 -148 69 105 166 162 123 -88
6966 -88 273 -126 -195 -208 -2 55 9 -238 -119 43 -109 188 55 -70 -193 -18 -28 20 -75 32 -150 86 144
6989 144 -78 -63 -86 -42 53 5 -138 -35 111 -137 133 -64 76 -27 192 -155 99 87 36 -118 85 -33
7011 -33 67 14 70 100 -301 -54 -91 -79 -52 128 391 108 -11 164 -16 -68 30 -34 203 152 196 115 -114 -87 -283
7036 -283 -32 168 34 -32 -172 -44 -129 -152 -56 45 18 -181 34 37 -98 83 -109 -57 -74 -84 -191 5 23 65
7060 65 78 72 -59 23 -253 181 174 144 133 23 102 60 130 -333 82 -137 -57 -33 12 93 91 33 12 72 70 105 113 171 -217
7089 -217 254 235 -61 -42 -241 205 -77 -145 -156 127 33 13 93 52 -176 -105 -127 -87 -75 163 44 235 31 -116
7113 -116 -183 261 84 145 4 168 -195 -54 265 -32 35 119 65 -108 -196 -74 -49 -353 45 33 -82 -73 -9 -67
7137 -67 -24 -111 -106 50 -248 -55 58 -64 15 72 27 23 -58 86 34 -70 46 34 149 -201 43 52 121 -111 -75 141
7163 141 40 -12 -157 88 29 98 81 -267 28 248 32 -228 -14 -104 -21 23 -225 -118 -165 -213 -242 45 189
7186 189 -142 -102 -134 220 -125 -82 -221 -87 38 95 270 -76 8 118 -101 201 42 4 -155 300 228 154 13
7209 13 -341 63 -152 60 94 -113 197 -69 -97 -130 -45 43 -157 29 234 -63 240 -242 -51 20 -108 139
7231 139 58 27 -77 -41 -119 95 122 102 85 86 -250 -95 3 13 90 75 146 -153 4 154 -4 -135 -135 -103 -80 39
7257 39 30 -181 -187 -48 0 105 35 139 61 15 98 -60 199 -121 271 -29 84 -69 -49 -45 35 45 146 198 -33
7282 -33 256 -130 147 -78 -40 -44 -234 40 169 74 58 123 6 11 -266 -220 134 218 -25 -14 -154 -130 65 -106
7306 -106 -304 41 331 14 257 -108 -59 180 172 180 -90 6 -13 142 -166 -114 43 -213 140 -181 -142 -81 37
7329 37 -56 66 -14 -43 -26 173 -22 -79 23 -42 -186 107 73 47 51 185 23 -31 -31 -131 -142 -55 -96 -75 -78 136 68
7356 68 38 88 81 117 49 40 -168 210 228 95 82 17 -70 171 82 94 298 -50 -144 53 9 12 157 -177 -110 -79 -20
7383 -20 99 254 -15 -163 86 -6 133 -111 69 -13 13 68 -43 48 37 45 66 -155 -117 -37 -191 -114 21 71 27
7408 27 24 58 -29 -135 11 35 53 -190 -57 92 200 -63 278 -6 37 -19 -40 -38 43 -108 -84 147 -118 -183 43
7433 43 -344 -233 -99 -185 203 -113 -64 173 8 -19 44 208 -133 -115 -98 47 111 140 142 105 -15 -65 -12 46 193
7458 193 260 -9 -149 77 27 186 9 -80 182 -23 -17 181 16 25 -12 -31 -101 -133 284 -101 -40 187 -125 61
7482 61 22 69 -187 91 -43 137 56 -97 -182 -137 -30 -8 74 -151 -25 50 -104 275 -167 -10 -176 130 28
7505 28 -92 75 147 -18 168 -23 -9 69 -85 24 -4 -14 179 -129 67 173 -101 -150 -135 -89 217 -39 81
7528 81 47 -151 -64 0 -3 -28 -196 37 -101 197 -45 -234 -190 112 -68 47 115 22 18 -326 -186 26 -11 1 93
7553 93 -17 203 -66 149 152 74 117 -39 139 53 72 267 47 112 81 54 -137 -33 9 -6 -115 131 -204 -88
7577 -88 17 -105 -255 -76 -217 -259 150 -41 224 -32 -44 89 18 -86 34 33 -142 154 -126 73 -52 30
7599 30 -28 -19 -67 143 -7 76 54 165 -54 -7 -17 228 19 39 54 -5 -191 -49 52 -60 -270 33 -108 -178
7623 -178 38 -349 -118 45 -39 -62 -72 -253 90 164 52 -231 93 15 -175 -122 123 26 102 144 363 -133 231
7646 231 73 -8 -90 -19 -155 193 -128 115 -206 -138 60 -310 -68 100 -67 -6 190 -199 -13 -40 368 -93
7668 -93 -32 198 112 168 22 163 210 -13 -83 79 -160 84 -135 -74 -33 -113 -61 -53 -15 -328 79 140 -208 -102 20
7693 20 3 -49 184 9 -70 -36 15 -29 100 -158 -159 -53 136 84 -100 98 -79 4 49 153 31 46 -43 -60 -18
7718 -18 -26 -67 6 -172 81 68 -106 -287 -102 -107 40 90 -12 -35 -220 -181 -272 -18 -81 -120 33 -229 75 -13 98
7743 98 -84 25 179 191 -155 -101 -73 -178 -76 139 82 46 34 21 144 126 117 74 196 -31 97 -146 -154 -86 124
7768 124 -153 194 -109 -13 -56 -14 -96 -51 -15 206 71 55 83 -151 11 -132 15 30 -41 90 -45 -32 -82 74
7792 74 -47 -27 -142 -46 187 95 96 120 -10 160 82 -76 137 0 -79 -269 78 127 75 -74 141 -18 58 -1
7816 -1 -51 -90 -116 -138 65 326 44 -130 -3 -103 -26 57 57 204 42 -86 310 31 67 -97 -293 242 35 -63
7840 -63 38 122 26 97 40 -103 31 122 -130 214 -29 -48 141 133 -38 -164 185 -27 -144 -79 -127 45 -5 173
7864 173 77 -123 -136 123 -8 95 9 12 110 -30 -50 -232 -104 27 6 32 -110 82 35 -103 -122 -58 71 51
7888 51 75 -138 -77 -48 -44 53 168 -100 20 54 83 -98 -21 82 -100 8 -79 -178 -233 92 -146 236 -23 86
7912 86 72 102 125 -67 116 -129 43 -13 84 25 226 52 66 50 -52 -116 -31 -59 -41 124 8 -114 4 71 -5
7937 -5 145 63 180 -91 219 -15 -34 56 -180 5 107 42 -76 -160 -51 -88 39 265 -93 -140 -3 99 119
7960 119 -42 106 -108 49 33 49 121 81 -194 -106 -18 -178 57 6 110 -79 -145 68 -29 -93 150 -30 -74 51
7984 51 -75 31 -29 100 -161 -35 70 199 -138 -153 102 -82 -46 86 30 131 -97 53 -90 -83 179 -87
8006 -87 195 -210 -54 -38 116 56 -280 -45 45 -160 -50 -187 -24 16 72 -33 114 -39 65 -194 -98 129
8028 129 -36 -39 7 -101 32 -230 48 29 -246 -84 73 -48 -81 -45 -123 41 100 -42 136 -92 -105 102 25
8051 25 -53 5 82 -120 119 -88 -37 41 132 -111 -28 83 73 59 -244 74 101 -231 22 43 97 58 4 -77 -132 -118
8077 -118 -51 -91 -242 31 10 202 1 -13 -53 75 -70 109 -101 -89 86 -120 37 -94 38 -55 32 5 138
8100 138 -64 -258 -85 28 -93 71 31 -36 -258 -21 -70 -4 151 -98 -39 108 -53 -226 89 164 134 -108
8122 -108 -55 -107 142 -11 67 -101 59 128 -15 -43 150 13 -165 -62 169 166 -86 1 20 247 -135 99 79
8145 79 -57 -117 -65 46 28 -64 106 -83 203 79 -199 201 191 -152 181 97 169 -6 -140 -232 138 -144 -39
8168 -39 -191 31 79 3 187 -55 -143 -119 -27 -148 1 -249 -11 319 147 -8 81 16 195 -68 168 130 -131
8191a31
##END NTUPLES=NMR FID
##END=
