##TITLE=1H_SR36_oil3
 CDCl3, 8 sc, 
 14.05.2021
##JCAMPDX= 6.0         $$ Bruker NMR JCAMP-DX V2.0
##DATA TYPE= NMR FID
##DATA CLASS= NTUPLES
##ORIGIN= UXNMR, Bruker Analytische Messtechnik GmbH
##OWNER= root
$$ XWIN-NMR		Version 3.5
$$ Fri May 14 10:13:56 2021 Russian Standard Time (UT+4h)  she@DPX200
##.OBSERVE FREQUENCY= 200.131506
##.OBSERVE NUCLEUS= ^1H
##.DELAY= (6, 6)
##.ACQUISITION MODE= SIMULTANEOUS
##.ACQUISITION SCHEME= undefined
##.AVERAGES= 8
##.DIGITISER RES= 18
##SPECTROMETER/DATA SYSTEM= spect
##.PULSE SEQUENCE= zg30
##.SOLVENT NAME= CDCl3
##.SHIFT REFERENCE= (INTERNAL, CDCl3, 0, 15.7039)
##AUDIT TRAIL= $$ (NUMBER, WHEN, WHO, WHERE, WHAT)
$$ ##TITLE= Audit trail, XWIN-NMR		Version 3.5
$$ ##JCAMPDX= 5.01
$$ ##ORIGIN= Bruker BioSpin GmbH
$$ ##OWNER= she
$$ F:/spectra/data/she/nmr/H-F/1/audita.txt
$$ ##AUDIT TRAIL=  $$ (NUMBER, WHEN, WHO, WHERE, WHAT)
(   1,<2021-05-14 10:12:52.67 +0400>,<she>,<DPX200>,
      <created by zg, POWCHK disabled, PULCHK disabled
       configuration hash MD5:
       00 E9 B6 7A A2 85 ED C7 34 08 36 98 17 FE 4E 26
       data hash MD5: 16K
       3A 36 07 11 4C 5D 8C 4D 31 15 86 95 21 D0 91 85>)
$$ ##END=
$$ 
$$ hash MD5
$$ D9 8A FC E9 88 F2 20 CD F9 01 DC 54 80 62 D1 12
##$RELAX= 
##$RELAX= 
##$RELAX= 
##$RELAX= 
##$RELAX= 
##$RELAX= 
$$ Bruker specific parameters
$$ --------------------------
##$DU= <F:/spectra>
##$EXPNO= 1
##$NAME= <H-F>
##$PROCNO= 1
##$TYPE= <nmr>
##$USER= <she>
##$AMP= (0..31)
100 100 100 100 100 100 100 100 100 100 100 100 100 100 100 100 100 100 
100 100 100 100 100 100 100 100 100 100 100 100 100 100 
##$AQSEQ= 0
##$AQ_mod= 1
##$AUNM= <au_zg>
##$AUTOPOS= <>
##$BF1= 200.13
##$BF2= 200.13
##$BF3= 200.13
##$BF4= 200.13
##$BF5= 200.13
##$BF6= 200.13
##$BF7= 200.13
##$BF8= 200.13
##$BYTORDA= 1
##$CFDGTYP= 0
##$CFRGTYP= 5
##$CHEMSTR= <none>
##$CNST= (0..31)
1 1 145 1 1 1 1 1 1 1 1 1 1 1 1 1 1 1 1 1 1 1 1 1 1 1 1 1 1 1 1 1 
##$CPDPRG= <>
##$CPDPRG1= <>
##$CPDPRG2= <>
##$CPDPRG3= <>
##$CPDPRG4= <mlev>
##$CPDPRG5= <mlev>
##$CPDPRG6= <mlev>
##$CPDPRG7= <mlev>
##$CPDPRG8= <mlev>
##$CPDPRGB= <>
##$CPDPRGT= <>
##$D= (0..31)
0 1.2 0 0 0 0 0 0 0 0.06 0 0.03 0 0 0 0 0.0002 0 0 0 0 0 0 0 0 0 0 0 0 
0 0 0 
##$DATE= 1620972772
##$DBL= (0..7)
120 120 120 120 120 120 120 120 
##$DBP= (0..7)
150 150 150 150 150 150 150 150 
##$DBP07= 0
##$DBPNAM0= <>
##$DBPNAM1= <>
##$DBPNAM2= <>
##$DBPNAM3= <>
##$DBPNAM4= <>
##$DBPNAM5= <>
##$DBPNAM6= <>
##$DBPNAM7= <>
##$DBPOAL= (0..7)
0.5 0.5 0.5 0.5 0.5 0.5 0.5 0.5 
##$DBPOFFS= (0..7)
0 0 0 0 0 0 0 0 
##$DE= 6
##$DECBNUC= <off>
##$DECIM= 32
##$DECNUC= <off>
##$DECSTAT= 4
##$DIGMOD= 1
##$DIGTYP= 9
##$DL= (0..7)
0 120 120 120 120 120 120 120 
##$DP= (0..7)
150 150 150 150 150 150 150 150 
##$DP07= 0
##$DPNAME0= <>
##$DPNAME1= <>
##$DPNAME2= <>
##$DPNAME3= <>
##$DPNAME4= <>
##$DPNAME5= <>
##$DPNAME6= <>
##$DPNAME7= <>
##$DPOAL= (0..7)
0.5 0.5 0.5 0.5 0.5 0.5 0.5 0.5 
##$DPOFFS= (0..7)
0 0 0 0 0 0 0 0 
##$DQDMODE= 0
##$DR= 18
##$DS= 0
##$DSLIST= <SSSSSSSSSSSSSSS>
$$ [...]
##$SUBNAM2= <"">
##$SUBNAM3= <"">
##$SUBNAM4= <"">
##$SUBNAM5= <"">
##$SUBNAM6= <"">
##$SUBNAM7= <"">
##$SUBNAM8= <"">
##$SUBNAM9= <"">
##$SW= 16.9725357007746
##$SWIBOX= (0..15)
0 0 2 0 0 0 0 0 0 0 0 0 0 0 0 0 
##$SW_h= 3396.73913043478
##$TD= 16384
##$TD0= 1
##$TE= 0
##$TE2= 300
##$TE3= 300
##$TEG= 300
##$TL= (0..7)
0 120 120 120 120 120 120 120 
##$TP= (0..7)
150 150 150 150 150 150 150 150 
##$TP07= 0
##$TPNAME0= <>
##$TPNAME1= <>
##$TPNAME2= <>
##$TPNAME3= <>
##$TPNAME4= <>
##$TPNAME5= <>
##$TPNAME6= <>
##$TPNAME7= <>
##$TPOAL= (0..7)
0.5 0.5 0.5 0.5 0.5 0.5 0.5 0.5 
##$TPOFFS= (0..7)
0 0 0 0 0 0 0 0 
##$TUNHIN= 0
##$TUNHOUT= 0
##$TUNXOUT= 0
##$USERA1= <user>
##$USERA2= <user>
##$USERA3= <user>
##$USERA4= <user>
##$USERA5= <user>
##$V9= 5
##$VALIST= <valist>
##$VCLIST= <CCCCCCCCCCCCCCC>
##$VD= 0
##$VDLIST= <DDDDDDDDDDDDDDD>
##$VPLIST= <PPPPPPPPPPPPPPP>
##$VTLIST= <TTTTTTTTTTTTTTT>
##$WBST= 1024
##$WBSW= 4
##$XGAIN= (0..3)
0 0 0 0 
##$XL= 0
##$YL= 0
##$YMAX_a= 299453
##$YMIN_a= -228365
##$ZGOPTNS= <>
##$ZL1= 120
##$ZL2= 120
##$ZL3= 120
##$ZL4= 120
##$ABSF1= 10
##$ABSF2= 0
##$ABSG= 5
##$ABSL= 3
##$ALPHA= 0
##$AQORDER= 0
##$ASSFAC= 0
##$ASSFACI= 0
##$ASSFACX= 0
##$ASSWID= 0
##$AUNMP= <proc_1d>
##$AZFE= 0.1
##$AZFW= 0.1
##$BCFW= 1
##$BC_mod= 2
##$BYTORDP= 1
##$COROFFS= 0
##$CY= 11.3945322036743
##$DATMOD= 1
##$DC= 2
##$DFILT= <>
##$DTYPP= 0
##$F1P= 15.9154993809931
##$F2P= -4.1035820241983
##$FCOR= 0.5
##$FTSIZE= 0
##$FT_mod= 4
##$GAMMA= 1
##$GB= 0.15
##$INTBC= 1
##$INTSCL= 1
##$ISEN= 128
##$LB= 0.24
##$LEV0= 0
##$LPBIN= 0
##$MAXI= 10000
##$MC2= 0
##$MEAN= 0
##$ME_mod= 0
##$MI= 1.114404
##$NCOEF= 0
##$NC_proc= 0
##$NLEV= 6
##$NOISF1= 3.799351
##$NOISF2= 2.8
##$NSP= 1
##$NTH_PI= 0
##$NZP= 0
##$OFFSET= 15.70392
##$PC= 1
##$PHC0= -11130.71
##$PHC1= 13.601
##$PH_mod= 1
##$PKNL= yes
##$PPARMOD= 0
##$PSCAL= 0
##$PSIGN= 0
##$REVERSE= no
##$SF= 200.130013532006
##$SI= 16384
##$SIGF1= 3
##$SIGF2= 2
##$SINO= 400
##$SIOLD= 16384
##$SREGLST= <1H.CDCl3>
##$SSB= 0
##$STSI= 0
##$STSR= 0
##$SW_p= 3612.71676300578
##$SYMM= 0
##$S_DEV= 0
##$TDeff= 0
##$TDoff= 0
##$TI= <>
##$TILT= no
##$TM1= 0
##$TM2= 0
##$TOPLEV= 0
##$USERP1= <user>
##$USERP2= <user>
##$USERP3= <user>
##$USERP4= <user>
##$USERP5= <user>
##$WDW= 1
##$XDIM= 8192
##$YMAX_p= 0
##$YMIN_p= 0
$$ End of Bruker specific parameters
$$ ---------------------------------
##NTUPLES= NMR FID
##VAR_NAME=  TIME,          FID/REAL,        FID/IMAG
##SYMBOL=    X,             R,               I
##VAR_TYPE=  INDEPENDENT,   DEPENDENT,       DEPENDENT
##VAR_FORM=  AFFN,          ASDF,            ASDF
##VAR_DIM=   8192,          8192,            8192
##UNITS=     SECONDS,       ARBITRARY UNITS, ARBITRARY UNITS
##FACTOR=    0.0002944,     1,               1
##FIRST=     0,             0,               0
##LAST=      2.4114304,     0,               0
##MIN=       0,             -228365,         0
##MAX=       2.4114304,     299453,          0
$$ Real data points
##PAGE= N=1
##DATA TABLE= (X++(R..R)), XYDATA
$$ [...]
1972A9L79j6l82J48J7K4q6P5L12K13m81Mo61P34m63P24l82R5o53L34L3N30l18
1995A99q1l15n4r0P35p99N20q7R8j62l78k62O41K9j92M9j58L34m5p4k71K57k53
2018c59L31Jj56L34r3m8p8j45L12j11J52k03L32k77K73l30L37k15J64J20k21M2
2040A62J83oj70l69L05M7J98k33K82j69J18NO5J11l23J77m34J04p0j11M00l82
2062a10k57L87K12l39q7Pk74O89l10n9J58l63MJ4O39j14n91J84M35q3l83J35p1
2085a77l74O04l00K23k35l11J63k5l02J007l45J29o42J008j89l56k05J68K30l9
2105C2J77o57R54m88Q5L38m8k37k32N7L78l85K20r4p0RN83m47j91J90L8k20O17
2128F09l69l38K84j86r0K24j0p6P7j51JN46p73L81K05k3k33l49K52j88K41j59
$$ y = [19, 398, 382, 0, 148, 165, 189, 103, 178, 490, 703, 222, 226, -435, 299, -164, 560, 178, 273, -380, -46, -13, 517, 199, 118, -197, -251, -341, 394, -405, 115, 28, 126, -36, -414, -676, -35, -6, -198, -149, -307, 27, -18, -92, -363, -106, -359, -28, -27, -183, 151, 58, 10, -68, -213, 99, -12, 140, -63, 269, -8, 265, -65, 272, 57, 221, 341, 120, 162, 345, 339, 169, -200, 105, 152, 350, 117, 399, 230, 348, 353, 418, 529, 206, 383, -51, 53, -17, -128, 272, -110, -367, 20, 232, -107, -194, -187, -461, 228, -82, -141, 17, -346, -342, -328, 311, 197, -394, -210, 225, 142, -241, -106, -177, -551, 53, -247, -24, -259, -570, -407, -432, -734, 273, -72, 57, -585, 423, 234, -122, -327, -159, 71, 32, 209, -448, 506, 18, 103, 441, 393, 156, -76, -19, 359, -26, 194, 100, 30, 39, 622, 175, -16, 174, 212, -8, 609, 240, -98, 186, 0, -90, 134, 124, 48, 125, -26, -25, 521, -252, 129, 334, 311, 78, -271, -19, -207, 34, -125]
2150a25L86l38k45M1K54M5J35k65n41P58J55p72N06L43m27J7J80j60n64M6K55
2171c16M23k98L61m1m4K23q28L79J86K74p9n9l73M20q3o32L65L27m57jQ72m47
2193A72K19Q8j66l22m21N7J014k75n98L10ML7m7j04j74L40k21J45L9l73L50o7
2215GP8j10J5J51j7q35R15j006N62K3P68n53j90M0l42L42n4m7L88j019J06J354
2237E76r06R48l9j178M11k60M22J92p69N92j15k48j4J180n19l89k32l54J014j41
2257A71k24K93J53n18N52r0j29j23P35j304J105k33lj55K16M33n08k5L80n24k54
2278e2L37l33q5J35p4L10p7qM82p19O40k8p76P8L45k3l44k12P1N81q2k18k64K16
2302a00j44K13P79j265M66r6k09L40q40O53m7N71m08k85j85N67j61J40K07J19
$$ y = [-125, 261, -77, -322, -281, -27, 18, 153, -112, -653, 105, 260, -512, -6, 337, -90, -73, 107, -53, -617, -571, -316, 107, -191, 170, 129, 85, 308, -520, -141, 45, 319, 240, 181, -192, 228, 145, -487, -122, 205, -252, -253, 619, 172, 391, 479, 313, -9, -430, -373, 641, 366, -232, 78, 82, 119, 72, -32, -206, 134, -87, 58, 97, -276, 74, 7, 85, -25, -10, 141, 124, -711, 204, -802, -240, -217, 551, -2, -192, -152, -494, -152, -206, -253, 135, -884, -778, 576, -330, 618, 579, -599, -188, -448, -26, 166, -603, -11, -126, -374, -388, 792, 273, -116, -348, -702, 312, 171, -53, 240, 393, -125, 427, 337, 208, 85, 820, -484, 621, 388, 385, 230, 446, 879, 371, 346, 726, 202, -52, 285, -48, -133, 2, -72, 238, 161, 153, 635, -84, 556, 528, -248, -170, 175, 152, -192, -404, -333, 248, 166, -52, -316, -100, -244, -31, 748, -517, -51, -147, -356, -16, -856, -203, -250, 321, -87, -372, -557, 10, -151, -11, 196, 315]
2322C15m4p89K28j36M58rj88n35M40J46N92r36P03k60M13m94O5j24J82J8l01K30
2344b6J16n0J16J08p3l48K73j88K19L28o6K14m9K31o86o14M99K50m49O03l66J31
2366A73M09q2p55l24J95L22l92O39k81N32k74l20N7m3O2r33J147k14l99M88k66
2387b59l6k33N57K57j63k79M12m49N37m75K71M19m86K35L80q34M4j57J53K69p11
2408e48K18M50L81m46o0N71J46k59m9m55M70n73Q66j25K29p04K46m43Q21N8p87
2429GM09o80O45m36l49N76J64m00K92J86p60J8K48l06O45J99l64K90L29o60J62
2450B15P7j015O46K12k28K36n03P83k9n39k85M93r5K72O9n12N09k66L13k86l76
2471c09J50j82Q57j88m55P3n0R15q91k86N91k96M00m88j56K54j01J05o1K77j46
$$ y = [315, 271, -518, -290, -426, 32, 23, -165, -700, -260, -114, 478, -458, 245, -15, 398, -96, -31, -155, 27, 45, -256, -26, 90, 40, 156, 264, 191, -157, 116, -72, 147, 475, 409, 623, 574, 805, 119, -495, 4, 254, -195, 408, 42, 173, 582, 500, -255, -579, -384, -62, -454, 185, -96, 436, 162, -158, -101, -144, -82, -1015, 132, -82, -481, 7, -259, -295, -528, 29, 286, 123, -156, 256, -193, 344, -131, 140, 559, 73, 308, 688, -146, -102, -259, -106, 163, -548, -330, 120, 501, 55, -5, 566, 712, 453, 404, -51, 419, -154, 712, 587, 816, 112, 358, -85, 736, 794, 7, 416, -264, 381, -55, -404, 172, 336, -64, 228, 414, -346, -328, -80, -386, 259, 458, 94, 384, 713, 53, 215, 292, -723, -77, 135, -93, 143, -360, 423, 394, -145, -430, 63, -32, 240, 309, -203, 306, 40, 353, 67, -309, -159, -341, 516, 328, -127, -54, -104, 811, -80, -366, 225, -71, 329, -159, -315, -61, -162, -57, -118, 159, 13]
2492A3J17m50N74j14j41J51j26K8K67K23k39m37J09L63n81j90N12n10J138j536
2512h29N06J32K50M47o31N25L74p52m58O94l32p29L81N18j98ml00Q17j078K64
2532d03L20K03n9P54n67Q2p69O57l23r0L33l86J24J66j13N04n49l46M38m83P81
2553B74k75l71P77j578J618j232J421j067Q39K04m20r36J134k74p97M25M07N60
2571G09o85k32Q64q10o3N36j78N31n55j09j27R77j460Q30Q7J01k80L68L8k64k92
2592a4O83q73J25J72K67j086N12L88J18k04k80K81k0j29n1L01k36m78K60N09l65
2613a20K57o87M46l64k05O55K35ol57K84L6o66j07R74l37m50M16n13J055n60r9
2634a13qO9l65K60M79K21K94j032M47K46k75j23K28l99L80k92L13J90m25J25j0
$$ y = [13, 130, -320, 254, 140, -1, 150, 24, 52, 319, 542, 303, -134, -25, 338, -243, -433, 79, -431, 707, -829, -323, -191, 59, 506, -125, 400, 774, 22, -436, 258, -74, -803, -422, 96, -102, -106, -406, 411, -667, -403, -83, 120, 61, 815, 248, 330, -439, 218, -105, -195, 138, -248, -124, 42, -71, 433, -116, -462, -24, -507, 274, -1, -372, 405, -1173, 445, -787, 634, -433, 406, 610, 190, -746, 388, 114, -683, -258, 149, 709, 24, -208, 656, -154, -217, 319, 141, 672, 117, 8, -119, 858, -602, 228, 315, 416, 136, 504, 542, 278, -14, 669, -204, -79, 93, 360, -726, -214, 174, 292, 88, -192, 89, 69, -60, -111, 190, -46, -524, -264, 245, -120, 137, -550, -104, -468, -673, -18, 217, 211, -146, 138, 174, -492, -599, 375, 38, -412, 4, -509, 546, -14, -113, -121, -52, -417, -157, 322, 543, 837, -195, 252, 498, 223, 100, 328, -71, 309, 17, 330, 520, 95, 220, 210]
2655B10NJ21M35n42J76j020N63J42J79k19k99L57Kl09M6M46p8L17l18o58M62l69
2677c51L67N7o90P40k85j29r9O8L72p0k30k7k45N48j20j98L91J52m22J82j88J76
2699aO20j165O43L7M3m57N09j36j34N2L95n28L05k06j10M96k51m42Q22k61P15
2720I46o97o6K3r3J27M7o41L58l40N66m38L82j63j06O3J84K0J0K60n79J38j61
2742a60J09M5j73M81J30n04M7j54L32n8n57K05Q6N88l97j82K27Qk04l7M68k57
2764D3n10K32q0K87r2J89l71K60j01p6L36K93m04J37Q6l42K99r0K39o5k27J31
2786A74k42j7P5j05N45j32k48K44k76R7K04k72j71L07J86j28m17M29j28m8p6L34
2808C35k71j19K22n1j63Mk70M65n0J3k77K90p2M13l01l10M08j86K01l73OR8Jl08
$$ y = [210, 215, 336, 771, 229, 405, -615, -52, 90, 269, 50, -249, 108, 110, -199, -153, 293, 215, 532, 214, -444, 18, -351, 16, 73, -617, 123, -162, -291, -390, -322, 50, -20, -250, -277, -522, 26, -94, -292, 99, 251, -171, 11, -177, -1, 619, -546, 97, 134, 177, -280, 229, 93, -41, 11, 406, -122, 183, -23, -133, 363, 112, -330, 492, 231, 946, 249, 183, 206, 113, 240, 287, -354, 4, -336, 230, -208, 174, 11, -95, -32, 152, 172, 182, 442, -137, 1, -160, -51, -6, -179, 302, 432, -72, -25, -179, 153, 95, -462, -257, -171, 417, 20, -162, 65, 73, -131, -168, 300, 43, -467, -235, -315, -28, -120, 69, -302, -42, -143, -219, 117, 410, 6, 143, 229, -113, 186, 96, 335, 270, 43, 174, -68, -85, -10, -115, 430, 298, 50, 294, 18, 115, 319, 47, -124, 183, 369, 241, -176, 253, 125, 77, 1, 335, 64, -55, 167, 116, -47, -43, -313, 152, 102, 115, -162, 128, 56, 469, 168, -142, 266, 80, 281, -92, -86, 12, 13, -295]
2832b95K19j00k3K14k80J08K27q5j89j70J37J32J12Q0k77j60K48j73N47k25n1
2853dJ06K40o04K03J81j65J17r1J69m1j35J54m1j9n0K92p5J6j16R4j50K99k43
2876A37J8J78k7j29l24K44J11j33J74j29J23j11j87j3K06L8l3k19Q1J1j04J92
2898A04j4k55K30j85j34K69k18Q4J09j16J8L3j03n4R0K13k58J70j53J36R8k49
2920a85L57k45j2k5j4R2j21R3k49M67l34K36J8Q8N8P0k64O2J11j43J81j73MK36
2944C08k83j05J44J14p0k90M51k95Q5q6L38Q0k43q7N4m3mk7J80j13p7J10j33r9
2968i1k1J84k51Q5r2L20j09J91k70p7m8M2K10r2K8Q1j11Q6m82L72J7k69P1K50
2992B4J6k31O5k2K97k21L50n65L43M4r1r5l4J63K02l60J27j1L0K39k62N7K0j15
$$ y = [-295, -76, -176, -199, 15, -265, -157, 70, -15, -204, -374, -237, -105, 7, 87, -190, -350, -102, -275, 272, 47, -4, 102, 342, -262, -59, 122, -43, 74, -17, 152, 111, -24, 130, 89, 70, 20, 312, 237, 253, 137, 231, 81, 380, 137, 155, 333, 306, 177, -147, 97, 208, 75, 249, 120, 243, 132, -55, -68, 138, 176, 143, -76, 5, 16, -88, 104, 90, -165, 65, -120, -254, 15, -203, -119, -10, -126, -108, -75, -178, -232, -142, 71, -187, -17, -170, -34, 64, -185, 172, -73, -85, -110, -124, -32, -153, -60, -309, 158, -176, 60, 78, 166, 224, 294, 30, 92, 203, 60, 241, 68, 72, 308, 25, -80, 64, 178, 108, -182, 269, -26, 59, -27, 311, 391, 148, 61, 115, 72, 68, 41, 221, 108, 31, 141, 8, -91, -112, 72, -179, -94, -186, 134, 25, 216, -54, -131, -179, -137, 73, -19, 9, 90, -21, 65, -417, -45, -28, -297, -226, 24, 40, -191, -126, -148, 149, -72, 278, -287, 56, 100, 9, -86, -120, 43, 245, -115, 12, 1, 31, 270, 8, 65, 85, -30]
3016c0J79j93J79l42N50j94j87J37q0K36k14N5j06J28J40j03k1n7M1q0J82k17
3038Cq2J11K38P1l32K92k41j82lK67j80J00j47j45J78n1J04pJ8k47J24K29m28
3061c10R7m4L3M8j09J66Q5K8p6j18k0j11L32k55J39j15J17J22L3o4J15j26J84
3084A51j57M2J57k70J08N1J88p6K0j16J39k49J80j16J59k0p2l2J6N8j56n2K65
3107B18j18o7J01O4k37J58j27J6P7j29n4J11j14l2K32l40L68l86K77k25K76o6
3129Cn2r3J59q8J08k36K11l15J54q7J89m6J39j8k54K30j26J91k4j15m6K43j06
3152B1j74K39K37k67M9k56K83j63J0K18m0l99N14k89J76l16J38j93L42J13n99
3173c56J38J58j65L13K06l52j19r1M04K09n11k4N67p31L37J07l61L00j77M68k97
$$ y = [-30, 149, -44, 135, -207, 343, 149, -38, 99, 19, 255, 41, 96, -10, 118, 258, 155, 134, 77, 118, 38, 220, 3, -79, 32, 270, 341, 9, 301, 60, -122, -125, 142, -38, 62, -85, -230, -52, -103, 1, -6, 12, -235, -111, 118, -310, -213, -257, -224, -176, -285, -119, -34, -6, -82, -200, -220, -331, 1, -254, -115, -230, -113, 9, 42, -22, 93, -33, 151, -6, 36, 193, -77, 31, 82, 270, 194, 214, 98, 237, -12, 168, 52, 211, 191, 119, 87, 103, 161, 5, -47, 218, 100, 33, 134, 198, -39, 119, -8, 8, 85, -44, -98, 13, -101, -133, 99, -241, 127, -259, 18, -207, 69, 3, -49, -142, 17, -71, 37, -199, 12, -303, -149, -236, -47, -93, 46, 28, -226, 4, -122, 69, 45, -70, -116, 127, 21, -153, 86, 323, 56, 105, -151, 132, -31, -21, 197, 157, -242, 272, -17, 159, -157, -19, -212, 130, 243, -356, -218, -60, -225, 88, 294, -58, -177, -268, 136, 345, -166, -190, 377, -354, -17, 90, -271, 29, -148, 320, 23]
3194B3j64j21M53k08J68n38J40M0K30K79k15j57k86K10M2J16k03J17K82n59Q0
3215b71M13m63J16J85j54O1M35j76j82j55K93r2m43L16R0j6j13p0L51n4j60j60
3237b49L07o5M2j97L04j29j21J31O32n0n75J48j14J10j06R8q4j07Q32o21K90L27
3259H03m65j51j89k91K80K68l37L15nm46N83n91L43l10K3m6K89r56L66J224p48
3280d1k6k17j94N19J86l99j41o4J57o73M37O65m07l95O89l20M6N70m84p06J174
3301C76o6m17N66m47L31r97n2M31K71k47j59J64j05R40n32N6k86J79k89L53J59
3322B29k90J32r9K97j62J51j49n3J23J71n25L71k68Q4j10j0j8KJ25J60o9j49K22
3345A65k82J46j15K4p1J78j74n0O7j7J82r5K39m10Q1KP5k7l3J04Pq5k10K25m6
$$ y = [23, -141, -262, 191, -17, 151, -387, -247, -207, 23, 302, 87, -70, -356, -146, -104, 12, -191, -74, 208, -351, -271, 142, -321, -205, -20, -174, -113, 322, 146, -36, -191, 102, 10, -433, -117, -27, -43, -156, -226, 125, 71, -89, -249, 58, -7, 35, -162, 142, 13, -108, 23, 655, 605, 30, 178, 64, 174, 68, 166, 82, -25, 807, 186, 476, 803, 338, 187, -2, -293, -13, 255, -82, 233, 228, -218, 365, -226, 117, -193, -170, -216, 73, -883, -517, 707, -41, -67, -284, -478, 41, 227, -172, -313, -377, -220, -893, -456, 209, -198, -593, 96, -224, -178, 392, -92, -798, 376, 310, -107, 459, 12, 343, -654, -706, -275, -4, -251, -410, -246, -351, 589, 57, 113, -173, 6, -283, 70, 229, -61, 71, -28, 269, 107, 258, 109, 56, 179, 350, -175, 196, -72, 12, -98, -108, -126, -124, 1, 161, 92, -57, 165, -117, 29, -86, -62, -133, 45, -129, -179, -112, -129, 53, -42, 197, -213, -132, -130, -55, -82, -115, -11, -4, -89, -299, -74, -120]
3370a20L8o9J73k32O1jJ46K5n6p0K49l51K70k07J71N4R9k34N6J70j03j55J80j75
3394h1K02Mj05J4J09j9R1j82j93O7L6K35mr9L8K19k31q9Q8l9o3p4P3K87k15L8
3420A07l18J41M4K8j9m3j28J75j11K46k04m7Q6j00p9Q0K16k24j2O1J72k06J8K03
3444H6j33k5jJ01n3kj36J32m6N0k08J84J58k0Q2l45K04p7P5KM8j15K08j13J65
3469B21j66j61K88j50j37l7L82J3j20K05k25j45PK44p8J06l54K77O7j83K14j83
3491H5J61l03p6J94r8J49l8k03J60R6p4j42J6J57j62j49J21J00k8j43J84J55m32
3514b70M4J30J02O4o4j28oj36K77r3K49l96J80N5J19j82p3J41j09J49P0j10n8
3537d5J40r4J23K6n2J94k04N7j24p4K42k22K4J3O2K8J18l2O9k01j15K51j28K13
$$ y = [-120, -82, -151, 22, -210, -149, -150, -4, 21, -35, -105, 144, -207, 63, -144, 27, 81, 180, -54, 2, 172, 69, -86, 94, -81, 121, 125, 20, 34, 143, 124, 215, 33, -160, -93, -57, 178, 174, 75, 113, 332, 101, 12, 100, 61, -2, -76, -3, 284, 69, 107, -211, -70, -26, 2, -17, -60, -188, -13, -124, 122, -82, -129, -43, -143, -222, -142, 74, -150, -162, -101, 71, -135, -117, 86, -47, -72, -73, 28, -25, -27, -163, -31, -77, -27, -235, -51, 107, 87, 169, -176, 28, -49, 26, 28, 76, -39, 169, 56, 221, 55, -106, 182, 32, -105, -142, 240, 253, 133, 338, 113, -32, -25, 219, 141, 247, -107, 170, 237, 54, 268, 85, 246, -57, -133, 61, -37, 112, 74, -129, 31, 127, 53, -89, -73, 84, -78, -227, -106, -6, -34, -177, 7, 162, -270, -226, -96, 6, 70, 6, -122, -128, -264, 13, -80, 169, -227, -47, 8, 127, -55, -128, 13, -96, 53, 123, 13, -45, 95, 1, 124, 150, 98, 292, 88, 145, 21, -53, 189, -33, -9, 4, 66, 94, 212, 180, 249, 48, -67, 184, 56, 269]
3561B69k99L38j30j00J5L1j34L57m65J93K01k23J36j54J45l82j3R0J91k92L29
3582A03j58J37k33K27k99L4J63n9O8j20K7q0K31l60L38j5J43k17j83J34J9J88
3604H8j96J88M9k1k33K12k51K23N6j19K3K72k78J36J27R6k92j23R8n6J89k43J84
3627A29k32J85J7j0Q7j34L2R7l70M03o3j81J15n7L05k87j46J74P3R9m43M01n7
3650A37L2K7n4j40j79J16J32o4p3Q6ok5k82K59J53j16K16j48k16r6J89L0P3l37
3674b86L53j01R6j34Q2n5J41M1l52K82j67L1K18j52K33j80J00j52J81l86N98j61
3696B30k40j0L6j08J35K76j55p7n6K2J11o4k64J63J39k9J06k39k8J89p8k1N0j56
3720f8m1L40j33M1p2m4j2p0J6l8N7q1J2J29j61j39L27k92J82J18n9j37j22K73
$$ y = [269, -30, 308, 178, 78, 93, 124, -10, 347, -118, 75, 276, 53, 189, 35, 180, -202, -215, -125, 66, -226, 103, -55, 82, -151, 76, -223, -189, -26, -85, -17, -137, -110, -190, 41, -319, 19, 4, 147, -70, -253, -119, -100, 88, -108, 80, 129, 108, -125, 87, -164, 59, 115, -4, 19, 291, 13, 149, 276, 372, 80, -43, 55, -1, 188, -55, 129, -103, 82, 99, 89, 176, 42, 74, 171, -199, 204, 141, -40, 75, 18, 323, 36, -110, 64, 137, 236, -207, 194, 137, 169, 196, 142, 2, -177, -61, 71, 7, -66, 20, 14, -11, -293, -34, 119, 3, 219, 71, -145, -241, -52, -22, 51, -286, 67, -34, 62, -72, 10, -45, 96, 137, -215, 67, -100, -69, 149, -3, 230, 50, 150, -2, 179, -207, 391, 230, -10, -20, 16, -92, 43, 319, 164, 87, 31, 53, 164, 100, -164, -1, 138, 109, 215, -24, -52, 137, 59, 38, 88, -68, -109, 231, 98, 139, 67, 23, 11, -59, -43, -81, -24, -105, -93, 36, -125, -264, 63, -229, -47, 71, 12, -125, -247, 26]
3744B6j79P6j75Q4L4l0J52j92J88JJ4q1O5Q5j34l3n0J90k07R2m2J73Q1K1j76j32
3770a49J12Q5Q7Q1n6n0j34L8O9k34P3K52j13J20j29j1kO1q4J82n1j47J29Q0j99
3795A0K37l81J29m2Q6P3j77J58l12K04J9k09J30r6p2J63PJ26M3k38n5Q7k00P4
3819b36M49l11P8n6M0J09l10J32oO7j37L36l22M5Q1k04J57J77M1N4j1l18j0N6
3843i9j45J32K70p9j90K13qk8j24LK09q7K90k83rM0k11K33k27l3R9J32K05k82
3867B1l6l0k5J81k4j45j4J88k23K14o0o8R8k29K25oJ4l92L49j32k02L68j60O0
3891b8o1K4j46K11Lk81J63J45r1m3k28K57OJ44j68J72l17K06K63k39j33J44j24
3914a21K62j10j41L52K9l05J20p4j5R0j72k8K90M7O1l79K32j26j47J95o2J82j73
$$ y = [26, -153, -77, -252, -168, -134, -164, -12, -204, -16, -15, -1, -82, -17, 68, -66, -99, -149, 41, -166, -74, -116, 57, 138, 159, -17, -149, -37, 48, 135, 216, 160, 110, -24, 14, 83, -151, -78, 174, 61, 181, 52, 41, 39, 100, 16, 198, 147, 0, 129, 209, 10, 247, -134, -5, -47, 39, 112, -65, 93, -219, -15, 4, -205, -75, -171, -243, -80, -73, 53, 96, -142, -197, -110, -310, -236, 213, -98, -20, -76, -36, 73, -237, -105, -111, -44, -181, 155, -167, -122, -41, -245, -88, 89, 130, 184, 173, -145, -155, -99, -244, -112, 158, 79, -111, 102, 94, 66, -58, -55, 154, 67, 357, 74, 65, 105, -106, 127, -100, -133, -34, 98, 303, 21, -15, -45, -70, 111, 87, -58, -72, 116, -107, 107, 47, -21, 77, -152, 73, 67, 81, -311, 38, -94, -296, 72, -88, -28, -89, -65, -211, 0, 3, -278, -115, 30, -61, -104, -332, -75, -69, 75, -93, 79, -238, -32, 231, -8, -141, 3, -121, 141, 31, -110, 242, 271, -34, 86, 12, -3, 87, -85, -113, 177, 224, 285, -94, 138, 12, -135, 60, -2, 180, 7]
3937Gl0M5J04m4L1q1M1j77m0K82j24j38J05J07r1M8J02l10L15q6%m8j35K51r9
3962C5j05nJ7l08M67j16r4j24J51J78j42LJ65k29J13q5N8J53j14n0J18j36L0N1
3986C1N5l43N7J3M6P3O0J65oP8l89J01J63j83qK53j10O3R0l38K00Q3j68M8J31
4011A65j74J28j83J54j9Q0j31J93m5l76K58n60J14P03o23L25l56J01M47q7j53
4032c9k14M3K36L4l04N3LK62Pk80K60p6j15p7r6L48J52k26k03J84o4J94j36j8
4056g2N0j09K3L1J96j67RM9m7j3Q6M2Q5p6K1pj29o5P6J68j32j26Q1k9R8P4lJ19
4084B33k76lK12j03q4J8J33N7k59N6L68l12J50l14O5J92k8M6j19o6j01J57N4p6
4108@lO2k23L19j89q6J12k7m5j55K19N2k13K97q2j84K04k27K41j56M8P6No0j04
$$ y = [7, -23, 22, 126, 82, 113, 32, 73, -104, -144, 138, 14, -124, -19, 88, -3, 45, 147, -163, 152, 66, 66, 18, -117, 134, 35, -70, -75, -58, -366, 101, -15, -109, -233, -82, 96, -46, -43, 122, -107, 6, -79, -21, 132, 18, -32, 86, -50, -20, 31, 86, -257, -200, -187, -141, -68, -8, 157, 151, 229, -160, -59, 104, -79, -87, 166, 56, 119, 209, -129, 71, 154, -14, 34, 165, -9, 119, -64, 90, 71, 151, 20, 213, 168, -208, 50, -510, -396, 307, -316, 9, -347, -246, 201, 114, -39, -253, -210, 26, 60, -244, -191, -188, 74, 81, -199, 61, -15, -130, -207, -303, 45, 197, -29, -232, -48, -112, 82, -54, -72, -22, -131, -108, -77, 119, -48, -39, 10, -37, -50, 36, 78, 163, 87, 108, 101, -28, -93, -17, 151, 19, -107, -26, -55, 43, 117, 114, 233, -43, -46, 166, 63, -21, -3, 130, 187, -72, -16, 352, 40, 190, -124, -59, 133, 105, 151, 32, -34, -135, 22, 76, 0, -3, 59, -164, 155, -34, -120, -8, -35, -80, -235, -16, 36, -177, 120, 38, -146, 58, -169, 72, -84, -36, 40, 45, -15, -119]
4133a19K6N7Mj07J35K06k24l8Q1j57J67J97k01j83J29J19k47J56K4J1J8J10j49
4156A5L8K8J8j47L01j53Q1j91J6K43k24J5K08j55N8L7j78J7r8j32J25L43l75j00
4180b10L14j66K3j5n7k50K26L8J23K0j1j73J56j3k47K95K7q9j36J03L4n6N8J8
4204A2Q2Q9j38o9J52j05n8q2N7J26j79J20p6J30l1l4K5J65o1j17J89j62L12k28
4228A19N3k2j12J2J01j73J09l6q8O5N3K6j8m8j33J13J21j57R9k02J58M0Kj96L24
4253B10l77Q6j1J08O3oR8j02K3o7p3O7J28k03O4j9q4N4jL3l1j56J46r4k54L59
4279c9m7nJ13J24j00j1j5m8l5N2J33k53L32l28P5P9q3K49j74k4N1k6j23m53R20
4304C64j72K9m30N35l27N51J57j79J88j257O37m22N53k47O8R3j82R7j87m8K45
$$ y = [-119, -93, -36, -32, -139, -4, 202, -22, -60, 21, -136, 31, 228, 27, -156, -27, 92, -155, 1, 25, 36, 54, 164, 15, 53, 81, 99, -48, 253, 100, 181, -10, 6, 249, 25, 40, 248, 93, 151, 188, 10, 27, -71, -203, -78, 265, -110, -210, 104, -62, -39, -54, -111, -361, -135, -97, 26, 46, 35, -138, 18, 5, -242, 53, 80, -9, -145, -42, -8, -64, -6, 12, 94, 183, 45, -24, 128, 23, -35, -117, -60, 66, -113, 7, -69, 61, 30, -4, 21, 186, 125, 8, 197, 35, 347, 119, 172, 150, 38, 50, 151, -22, 87, 51, -37, 28, 81, 107, 89, 41, -92, 21, 142, -15, 84, -118, 40, 80, 82, -114, 210, -167, -81, -92, 16, 79, 73, 171, 69, 92, 25, -48, 19, 147, -56, 8, -11, -95, -41, -42, -9, -40, -196, -50, -144, -398, -39, -86, -91, 22, 146, 46, 35, 20, -28, -63, -11, 122, -131, 201, -127, -52, 27, -56, 193, 19, -5, 46, 20, -103, -556, 364, 192, 221, -209, 326, -1, 550, 707, 528, 716, -541, 96, -326, 227, -20, 48, 141, -41, 56, -131, -179, 66]
4325F6L6k22P0J3%NJ2nj8J07k39K51k56RJ27q2j9P6j46K26m0o3j72R3J08j11N9
4352a15J56Qj87j0J73j39P3O3j0J88j9j09j35j13K06j47J79l9j44J82J00k2q9
4375E0m4N8k2J23l36K47l5k0P4J6k19K34j87K34k51Q3J03j12P7n4j06K93n8j40
4399Hk5L3j84K61j5P5k68K77k51Q4j20P2J15k03K4J9P1O9J7k30K36o4j13K29j86
4424f9k66K21j10J96J20j13j80J93J00p9K4k72J56J06j90L8k3M2J39j06r2J69
4446DK90k86n0J71k09J68r9O6j72K55K83m12J02l87N01k26p2J89j48j13K89k01
4468e7Q7J34k2j70J70j26R5k15J13O3J45j69r5j88K4M9JK25k81J95JM8k3k03J23
4493g6J16j75N4p2K54l34K86j06J29j2%l40J26j53J48L07k72Q7J64l37J49J51
$$ y = [66, 102, -120, -50, -37, -37, -32, -20, -25, -43, 64, -175, 76, -180, -171, -44, -126, -145, -69, -215, 11, -29, -92, -264, -171, -63, -174, -115, 41, 49, -138, -148, 25, -114, -41, 22, 12, 200, 181, 72, -63, -176, 30, -117, 62, 23, -121, 61, 161, 139, 50, 6, 64, 42, 165, -171, 76, 41, 21, 95, 111, -108, 126, -61, 173, -78, 5, 108, -4, 73, 19, -87, 206, 148, 8, -17, 16, -168, 93, 78, 153, -115, 162, -89, -5, -125, -53, 62, -141, -117, -98, -27, 42, 59, -171, 65, 1, -112, 117, -69, -335, -114, -224, -28, 92, -21, -201, -8, 92, 13, 37, -235, -79, 27, -163, -125, -148, -106, 33, -73, -165, 4, 294, 8, -42, 129, -80, 88, -11, 55, -117, 138, 421, 9, 111, -276, 225, -1, -73, 116, -32, -145, 144, -57, 30, 164, 142, -28, 142, 16, 111, -104, 9, 72, 217, 48, -47, -235, -211, -162, -161, 64, -217, -22, -21, 27, 4, -199, -76, 40, -135, -81, -153, 101, -233, 53, -53, 76, 64, 64, -276, -150, -303, -155, 152, -120, -33, 131, -206, -57, 94]
4515I4k12J54J1J4j7j2K83k31l1oJ20m32L54k61L55k25r8K66l94L24m66K90l9
4538a59L10m15N10m7k37j11M03j17k61j59j36L88J15k5K33o7k89j07Qn9L93k75
4560a04L10l76n9J09N3L06n1m99L10K4M1K14r2q77R76J15j82r12J051m98N6N5
4582c0n1L46m21K00q5l69L9L23k16N31k75J13M81p33k4M10k94P58m84k30J46J50
4604B85l23P9J47Nq79J127k23K72p97O4Q02n69O0M66j62n1n53M19k93K5M40p45
4626d04Q15p85J6K42NM22l02K0o18P75l22R1J01L5m16l91Q15n30Q50r37P42l58
4648a34l64M53R6o5K78rq08J31O72M77j196K86j13K61k11R82k58j03k8k05M17
4669E59on82L22M58m81j38l50J89j23N47k91o8L49j48o36l21R13L61k21J16l9
$$ y = [94, -118, 36, 47, 61, 44, 32, 315, 84, 53, 47, 167, -265, 89, -172, 183, -42, -140, 126, -268, 56, -410, -120, -159, 151, -264, 246, 199, -38, -149, 254, 137, -124, -283, -419, -31, 84, 59, 292, 225, -64, -171, -163, -222, 171, -104, 206, -170, -229, -120, -67, 239, 188, -311, -1, 23, 64, 278, 186, -691, 285, 400, 218, -694, 357, -141, -85, -30, -81, 265, -156, 44, -41, -410, -371, -48, -264, 267, -8, 105, 586, -147, -171, 239, -55, 703, 219, -11, 135, 285, -38, 41, 188, 193, -686, 441, 218, 490, -307, -243, 559, -10, 50, 516, 354, 303, -250, 169, -124, -99, 341, -404, 411, -374, -358, -116, -111, 311, 9, 29, -589, 186, -136, -45, 56, 91, -325, -716, 99, -431, 419, -518, 224, -134, -498, -45, 51, -14, 264, 255, -553, -422, 250, 727, -469, -183, -296, -35, -246, 736, 478, 375, 347, 142, 559, 553, -29, 293, 751, 270, 132, -218, -29, -152, 395, 104, 36, 385, 237, -399, -720, 193, 554, 333, 449, 410]
4690D10k52O6k98J38l26L11l15M95j99m65M14N98q42K08M70m27k06K98R2l96K22
4711dQ2m9n7N5P0k92K80p2LK9M34n03j57p5J90j74P47q29O40r0m94M52k62l41
4735d17K94J24l06K19k42J23J78j44N01q5n61P38l03l7j22Q0l93P7j42O36J06
4756C24m11J37M43l13N22m33m57O7L98j34M4k44K27j44J00m45L39N29J9K83j89
4777F62p24K51L87q54n6P72j93q58J83M13J16jL48J4l60O14r76O23o97k32J35
4798d33M76n71K18O52l62J13M16n95N77k64o97J12J12R49l65n09L8k02K76m99
4818e58M10J87P96r20K66l84Q27o05K13l80j81L2K01p2K19J11r3j29J24p5k60
4839b71J92J51j37R7o9J07K7k71p2O6L82J4j33n7r4J49m6J76m38R2J99Q3k30k28
$$ y = [410, 158, 224, -74, 64, -262, 49, -266, 229, 30, -435, -21, 577, -265, -57, 413, -14, -220, 78, 170, -226, -4, 78, 29, -28, 27, 97, -195, 85, 13, 16, 45, 479, -24, -181, -256, -66, -240, 507, -322, 318, 228, -266, 186, -76, -417, -123, 1, -305, -86, -328, -205, -27, -171, 330, 245, -316, 422, 119, 82, -40, 40, -353, -276, -418, 218, 324, -87, 50, 493, 180, 702, 269, -188, -121, 277, 143, 187, -57, 170, 26, 126, -319, 20, 549, 568, 851, 662, -62, 189, 576, -278, -334, 438, 245, -613, -430, -17, 99, 98, 446, 460, 100, 714, -262, 361, -336, -568, -433, 43, -528, -310, 342, -20, 93, 509, -86, 491, 227, -470, -358, -246, 703, 338, -171, -133, -335, -59, -558, -148, 39, 835, -85, 181, -203, 624, 19, 232, -148, -329, -297, -96, -168, 51, 162, 69, -60, 64, -11, -271, -79, 72, -65, 32, -37, 70, 97, -174, -246, -180, 202, 216, 83, 26, -68, 81, 35, 211, -227, -135, 64, 147, -83, -311]
4863c11L11N9O5m5R7j14N5J44m45L07l06K29l3j13J34m6O7l3j8j86q3K98m8j7
4887c2L2n5O2j14R6k12K65p3P3o5J51J12Q5l74O3M1m6O3r4K07J09n61K69L37l12
4912B7n1l5M7J68l45L00j74O0O4r7L7J57j90K62k83P5p7K8J14q2Nl0J55j31o7
4937f3jM4O3q1j5L0Np7J32k23J91P2k13L03o6p8j88J24K8j59K13j07L43k58j4
4962Ek7j53J80j73n0K11j35J10j1j48L47P6J23J05m71j58K30J91K08o95K36L63
4984C64l59K2j04Kn1J74M9j66l02L43j54K99k29P41m32Q9k40J4m18N64M84j92
5006D98m74K69j21n01P81m47l88n4P10k02Ql86J83L73n86n0K51n22R10l62J83
5027G3j6j73j85L54P2k37J93J97n66J03j14L25J03l10L90M0l0j55N08n92j17J40
$$ y = [-311, 0, 59, 124, 79, 176, 62, 117, 261, -184, 123, -183, 46, 13, -100, 34, -12, 55, 22, 4, -182, -265, 33, -15, -32, 0, -55, 7, -107, -11, -223, 42, -31, 42, -23, 128, 240, 325, -49, 14, 55, 9, 72, -22, 185, 294, -267, 2, 339, 27, -24, -59, -12, 156, -189, 111, -63, -3, 61, -36, 1, 158, -32, 230, -53, 22, -55, -27, 87, 5, 10, -20, 135, 4, -63, -64, -20, 43, -38, -53, -23, -18, -95, 37, -186, 5, 77, -136, 167, 101, 23, -165, -41, -13, -172, 41, -66, 277, 19, 5, -22, -175, 5, -168, -218, -7, -142, -32, -43, -191, 156, 232, 355, 460, -11, -169, 61, 252, 460, -235, 1, 364, 5, 27, -77, -75, -126, 48, 97, -69, -371, -28, -182, 117, -112, 629, 197, 286, 46, 60, -358, 206, 690, 498, 24, 293, 172, -329, 452, 5, -383, -437, 273, 71, 79, -307, -124, 249, -337, -387, -136, -658, 252, -110, 73, 57, -116, -301, 53, 125, -112, 81, 278, -288, -185, -299, 26, 129, -181, 209, 249, 219, 64, 572, -20, -137, 3]
5049Ck43n49J249n44L39o4m24Q78q93l35J263j324O98k80O38j25p67O28K21m7
5069C22j65M90p49j47m90P26J02m1k32l15P05r57R76P1L27l67O9l14n4O6L20k94
5091D9L6l06Q9K55j62j07J14j65J62M%M9K06k72L25n68K72L9M12p80ln45R19K64
5115B87k60M15l2j346J327r1L4k63L64p87M31O33m48k66l21O40l56n7J69j11k19
5136b57L64k27K00n5n3l81O30n0k9L89n99O7Q2l73J89p19J004k00K49m06L57n22
5158c40K05J05l52j88N42L68q04O87p97J481j243J79J18k41M32k12l04N73l17
5177a08L54o26J41P3K62o32J77q5K31K58nk60K89m09M71k88l78P05j9q9m0K68
5199B90l86j07J31J34K38p1o4j46p3J48L10k83k89k3L8j28K87K63j94o3j6m2M26
$$ y = [3, -240, -789, 460, -84, 255, 191, -233, 645, -248, -583, 680, -644, 54, -226, 412, 287, -480, 148, 369, 322, 157, 647, -102, -249, -739, -13, 89, 48, -184, -499, 206, -751, 225, 296, 623, 256, 325, 11, -43, 23, 343, 49, 85, -221, -132, 123, -39, -146, -32, -197, -35, -31, -31, 18, 224, -48, 277, -291, -19, 20, 432, -348, -351, -896, 23, 287, 27, 442, 410, -936, 391, 300, 334, 71, 435, -352, 79, 712, 264, -2, -323, 317, -39, -96, 73, -38, -257, 107, -120, 80, 25, -28, -409, 221, 171, 142, 531, -68, -1, 81, -292, -103, -822, 182, -18, 231, -175, 182, -340, -135, -30, -382, -570, -28, 340, -464, 223, -574, 907, -336, -157, -39, -280, 152, -60, -364, 209, -108, 246, -380, -239, -166, 96, -536, -359, -444, -213, 45, 40, -220, 69, -340, 131, -157, -535, 170, 151, 62, 22, 290, -96, -203, -72, 62, 300, 229, 165, 19, -54, 94, 404, 121, -168, -191, -153, -281, 6, 269, 75, 12, -4, -46, 380]
5222C80j27j98mL07k44j18L76m54o1K7J78j87J65q4K67m59L24k17k3j05J04K49
5244I6j3j55K26k98K25p6J0o5K58j91J07o5j8L3p0N6J12k04kJ72r2J18j92R9l1
5269D0J2R7k13K29k32j07J61J42q7j96L57k76L46k50K62m42K78jk17J79O8K1k69
5292i8K66j38j66M35l05j36K87k00q4m9L11qJ2m5J75k50K9m4J54l5k74L32k90
5315a21q6J92k27K90j12k49K86O0j04J70k50q8J95j01n6K06m6J38Pj77j02Q0Q
5338h7k39J76J60m9Q4N6l9k57kL10j40PK28j60m4r5n4LK70O7k85M3J46m1j80M9
5364g3N0j71L32o8o9Q6k37J60q3j2j81L62m5K1j05L5J1k4oJ09L6j90K25k49L5
5389e1N1J17j85OJ34k68J93j14JL57k39k53J92qJ76m1n2N1R7k41Q4K0p6R8o2O0
$$ y = [380, 253, 55, 51, 358, 114, -4, 372, -82, -143, -116, 62, -125, 40, -44, 223, -236, 88, -129, -152, -257, -153, 96, 83, -72, 154, -144, 81, 5, 15, -50, 208, 17, 124, 59, 41, 74, 4, 60, 172, -32, -34, 138, 46, 164, -28, 71, 40, 52, 149, -64, 165, -67, -174, -13, 129, 42, -154, 203, -73, 273, 23, 285, -157, 121, 120, -97, 82, 150, 171, -98, 168, 30, -136, 299, -6, -142, 145, -55, -139, -188, 123, 115, 127, 82, 257, 7, 36, -8, 146, 111, -163, 169, -121, -207, -15, -242, 48, -64, -313, -27, 33, -71, 99, -151, -239, -44, -145, -201, 5, -41, 97, 104, -73, -175, -95, -87, -326, -150, 10, -39, 45, 101, 62, -195, -197, 113, -27, -20, 208, 48, 4, -91, -145, -142, 128, 195, -90, -47, 99, 58, -122, -73, -23, -194, 138, 70, 1, 87, -150, 10, -73, -85, -266, 96, 51, 72, -33, 2, 13, -11, -17, 92, 128, -62, 163, -86, -51, 0, 117, -68, -62, 72, -196, -3, -117, -116, 241, 2, -251, -59, -67, 109, 68, 16, 67, 164, -77, 7, 27, -49, 49, -13, 47]
5415D7k59J00J9J74M2j17N5j51rQ8Q2j67P0J56k06J56j04o9K19j74J53j91L0M7
5439iL8J72j76Lk1OJ15nj48P0L1j44J18J29l41K07k06J84k9k7LM5o1N4M3J21k59
5466h7jR2p9J47k6o8j59k0P2k3O5k20L93q3r7r3J46j7J27m9o9rP8j11k7O2O0L
5494Gq3L95k18j84K21k05K26j65l2O9k52J4K52m8N0j44J08j5N4M7J69l60J05j34
5518a23J73J1r4J28p1J30l90L24N0j15n3M15m43J31J5j39J20k00O5K5j8R3n8j45
5542a69J91j51K35k67k1K40r8q8L2J16j21J76l84J28J28L6J88m88J94M39o91J78
5564a97M18j34J2m77N34q24K01P33m41K47K96l14k78l85M84R63j001Oj23k83M13
5585a50N42n79O75o51j61R07q05K49o8K60m6n3l77L91l55J14O21k39O4l73Q7j80
$$ y = [47, -212, -112, -93, 81, 123, 6, 61, -90, -99, -11, 71, -96, -26, 130, -76, 80, -24, -93, 126, -48, 105, -86, -56, -9, 29, 201, 25, 28, 7, 13, 128, 123, -25, 45, 76, -68, 50, 179, -162, 45, -161, 23, -6, -33, -30, 15, -46, 8, 51, 172, -87, -88, 4, -75, 72, 46, -22, -181, -201, -129, -152, -87, -307, 86, 3, -94, -187, -41, -58, 69, 20, -49, -58, 20, -91, -118, -56, 4, 7, -76, 319, 101, -83, 138, -67, 159, -6, -38, 31, -221, -207, 45, -3, 47, -97, 11, -4, 50, 97, 266, -94, 11, -123, 50, 61, -33, 95, 24, 154, -236, 88, 138, 23, -30, 385, -58, 73, 88, -51, 69, -131, -66, -41, -59, 34, -24, -169, 22, -129, 106, -161, -182, 58, -40, -128, -96, 20, -101, 75, -309, -181, -53, -17, 171, -317, -123, 316, -375, -197, 221, 87, 99, -378, 156, -668, -467, 266, -175, 72, 368, 54, -224, -609, -125, 838, -163, -157, -280, -563, -150, 392, -187, 488, -163, -324, 583, -222, 27, -41, 219, 173, 120, -257, 134, -221, -107, 514, 275, 339, -34, 53, -127]
5607a27j35N43k3n28L41J97j61p6k62p2K89m06R79n65K41K8n05Q70J23o36L70
5628D85qn08M62m33O18l65n73L79j94J41J82l0l39O17n56P8L4K04k76L2M1L0l2
5651a1J11j93j14L13N0k67K69p6J0j26j13K35k24K14J67l41J22J57j09q5L5J10
5673A34k20J61n7P4J80j75j24L0O6j7mm5LM1k05K59j41R6J41k22L7nR2j79J8j4
5699g6Q0r3l8K31j86O7J1l6R4K7M4k63k05L84j68J44M0o8J11P5j79M1JJ32k16
5724d6n8N8O8M3p2J30Pj43J33p8j08J28J3k09q3J46QJ17J72l76J85J1j94K6RJ91
5750G8j9k41L63r5p7k7P9j53J17j19J37r9J7J95k08L8J58k84o2K39J02l88J72
5773g7p5M8J54nn9O6k07K34j73k69M07k6J81k51rj37K26J56q6j94O3p3K30N2k76
$$ y = [-127, -262, 281, 258, -270, 71, 268, 107, 31, -231, -303, -14, -420, 559, -6, 235, 263, -242, 628, 751, 115, 485, 477, -31, 431, -2, 616, 251, -322, 57, -137, 4, 186, 156, -183, 434, -122, -44, -10, 194, -82, -50, -9, 21, -11, 100, -93, -207, 106, 156, -111, 158, 82, 92, -34, -147, 88, -136, 78, 245, -96, 26, 183, 74, -11, 24, 134, -86, 75, 18, 92, 272, 97, -27, 3, 69, 52, 48, 3, 6, 47, -158, 101, -40, 56, 197, -25, 12, 7, 99, -80, -62, -76, 4, -89, -127, 104, -82, -15, -4, -40, 54, 81, 125, -138, -343, 41, -127, 17, 57, -11, 100, 175, -4, 37, 38, 170, -46, -104, -46, 22, 65, -7, 123, 130, -13, 120, 42, -66, 62, 75, -134, -217, -71, -63, 54, 226, -150, 35, 46, -148, -122, -113, 78, 59, -182, 181, 86, 9, -18, 61, -92, 25, -94, 43, -56, -39, 156, -52, -14, 144, -140, -202, 37, 139, -249, -77, -152, -104, 50, 45, -14, 52, -155, 79, -94, -363, 44, 18, 199, -52, -61, -198, 28, 184, 98, -96, -33, -106, 124, 176, -100]
5798a00M4K33n9j96Q4J8K14k59R2j32J01r5Q9j88L06O1k24M1L4O6L8k36L09l51
5822a10J04J28k73L6J00Mk0j86L00j02j32J21l9%q7J94M7k82J76j25m4J68o4Q0
5846fj45J89m5r6J76j03j10J91P7k98J44j15J43k38L20M1l50J61j06j02L58k26
5868a40K22j13J0J83k94L09k7j27J1Q1m07L06P9k13J46n9J73k7l26M10l31J55
5890B1j32J66O9k38J38p3R2J29j72n8J12j9o2j17R3K17jP1j76j81K13j24O5lJ47
5915A77k8j09m9J3L9J7Q0q0k27L39j15k37J38O3j45J9MJ75j04l7j42L52k79J61
5939B5n6o1J74j93M4J7PJ14k35J92J91k91J87q0k24J67p6J0J95p1O0q8P3l9N1
5964I3k48O0K30k6p6R9m34L27J11o5l9J35l13Q9J90k25K7J46K1j62J62J11k3k46
$$ y = [-100, -56, 177, 118, -78, 6, 24, 238, -21, 71, -61, 40, -55, 34, -154, 152, 213, -11, 30, 64, 130, 168, -68, 241, -110, -6, 122, -151, -115, -15, -11, -31, -217, 83, -19, -151, -30, -69, -69, -156, 38, 85, -197, -21, -146, -190, -22, -86, -6, -151, 38, -7, -103, 73, -30, -140, 51, 128, -170, -26, -141, 2, -236, 84, 125, -225, -64, -170, -272, 86, -140, 82, -31, -21, 162, -132, 177, 150, 23, 34, 115, -292, 14, 93, -120, 26, -33, 140, 113, -213, 197, -134, 21, -111, 55, 124, -114, 24, -49, 43, 172, 0, -58, 54, 35, -27, -144, -51, 166, 165, 236, 60, -121, 92, -32, 33, 30, 177, 149, 40, -9, 4, 43, 60, 140, 60, -167, 172, 57, -180, -42, 21, -124, -105, -101, 74, -30, -67, -209, 143, -136, 25, -31, -92, 82, -111, -67, -50, -43, 71, -164, 28, 219, -72, 115, 35, -189, -22, -98, -88, 107, 36, 96, 8, 81, 42, 93, -155, -95, 135, 109, 33, 132, -302, 25, 136, 71, 32, 167, -146, -57, 133, -92, -65, 81, 102, -60, 102, 213, 190, -56]
5988e6k5K5j1R9j46K16k96K87j76k2K07j79r6M1l3j84L14J76j06J56k74J32l9
6011A0j87L34k70R5j16J17j0L3j13J89m00K87J04J03r0J5j62R8K12L7j41P7k05
6034A7J72k63J55j14q4O0n3J98o6j09Q7J82j0j57n9K81l24Q8j39K39k11R4Q0p4
6058a0R1K3j93P8P8q7j26q5L19j87l0J01l1Q4M1p9Ro3J81k43J48r0k1J57j81K35
6084A19j77J54l2om3j05n1l5K65N3j04k53K97j89j60K34J50k07n0K54J4k00J09
6107C7R2n19K19m5J54J45j43P42n25j64J87J28nl95J74L97n35l34j17j24N39J080
6129I88j272O39K1p80K55K20J17m26K3O62l46K60j53K47p55J69K54n07M20l76
6149c40O89K21L65q44k39m03R46j95P9O7l89q3j29l98Q97m53L29K10j90j10L8
$$ y = [-56, -81, -56, -67, 32, -114, 102, -194, 93, -83, -105, 102, -77, -173, -132, -165, -349, -35, 141, 35, 191, -83, 49, 10, -177, 157, -113, -18, -134, -17, -27, 6, -107, 82, -318, -31, 73, 176, 86, 101, -61, 37, 249, 286, 145, 222, 17, 189, -74, 81, -33, -117, -57, -110, 88, 22, -87, 0, 182, 172, 15, -44, 237, -87, 1, -138, 101, -110, -16, 64, -10, 81, 104, -89, -11, 67, -20, -146, -231, 88, -99, -129, -28, -59, 25, 66, -13, -4, -67, 114, -129, 19, -71, -92, 65, -116, 119, -58, 96, 64, 58, 15, -90, -141, -176, 89, 142, 38, -215, 82, -107, -267, -33, 117, -90, -140, 114, 128, -72, 37, 129, -390, -171, -216, -62, 83, -60, 682, 157, -7, 180, 308, 303, -92, 82, 479, -56, -390, -507, -631, -92, 988, -284, 355, 376, -404, -149, 71, 188, -238, -215, 447, 101, 361, 208, 455, -300, -131, 123, -384, 36, -340, 349, 570, 935, 91, -148, -551, 395, 200, 279, 346, -43, -126, -255, -653, 244, -209, 120, 330, 140, 30, 68]
6170F8J77K2j46k62p5K44mj64O28q64O87l79l6RJ70J28K21r50O26j06l12J5M13
6193A10m31P60q5j74k23k57L7k79P47o2n74P20p95J180p08N59k5q90Q4J077q75
6214a04p79O64K04M06p59M00L6n96L81L69o39L97K52n44J91K64n8Kj4m7K24m07
6236a57k44M62K61o56N6R26q62m25N00N62l83K1p33L73L66J05J22r1l95l9O6J79
6258A4l27M50M4o8k19J07Q2k39J91j22O8l08L12j30N05p23Q1L89k80M81k12l04
6280b08Q2J28J7mK36n20Q7K09k6j34J26Q3o9J10K38l79l1L3j14k81N51j76K05
6303A63j26j26l8o2R2L18j09j50m7K99l14O3J44j56J74j03L8k68L96j15J62m24
6325a89Q0K0r2L5K83j15M05m94J95J00m9k4n62N03j52M74m75L91l30j7k4L10j15
$$ y = [68, 245, 267, 121, -141, -216, 28, 24, -140, 488, -376, 311, -68, -104, -95, 75, 203, 424, -526, 100, -6, -318, -303, 110, -321, 439, 354, 180, -43, -300, -263, -542, 205, 143, -431, 289, -506, 674, -34, 525, 500, -390, -306, 771, -104, -883, -219, -15, 391, -368, 32, 68, -528, -147, 222, -417, -20, 232, -312, -121, 143, 85, 87, 73, 26, 250, -157, -401, 61, 322, -334, -278, 648, -214, -639, -139, 423, 40, 61, -672, -299, 67, 172, 294, 203, -192, -231, -165, 14, -313, 137, 181, 113, -106, 1, 83, -156, 35, -87, -19, -327, -15, -145, 360, -363, -282, 107, -173, 308, 96, -208, -126, 2, 19, 15, 251, -269, -182, 27, 1, -133, -7, 76, 7, 117, 355, -24, -55, -22, -136, -417, 134, -42, 163, 37, -89, -127, -189, -97, 221, 112, -38, -85, 214, -100, -37, 107, -49, 125, 22, 60, -208, 188, 73, 235, -189, -109, -89, -181, -146, 137, 22, 427, -67, 128, 228, 179, 155, -407, 96, -56, 418, -57, 334, 4, -13, -37, 273, 158]
6348A58k15J03j34L97j53K22o32M40K55o60J16k83R48q15q7K67m1J85L24n66J90
6369A9r3K13k02j14k49K90K53n71K92m38O51l17L40p6Ll2LL5P6N0l59L86ml47
6393a91J95Q0m67M98l63K34R2P8qN0j47J68k98j22L27k30J02j56q3M3q2Q6L57
6416A63p11J025k86j15Q6J19K0n09J48O6m4m05Q96k34l80K14m3j56O6k70J34k2
6438b38K25J52k16J29r7j0J14j39j17J06K91q6l16N0l01N21q4n1k79M31J62p23
6460d76N49P9j65k6M21l70j50K97j96L2P4K52n83M06R8p2k03k57M56K47j55l88
6482a30J32l8K0o6j5J67M22n41j92M28j27r8L75o85J89J41L1j69N76m95j18O3
6504a30M8M59m33O9Q2j18NJ31K99r47N28J91l12R2m8j99K95K82n21K85n6j67J86
$$ y = [158, -57, 46, -88, 309, 156, 378, -254, 186, 441, -219, -103, -386, 562, -253, -340, -73, -114, 71, 395, -171, 19, -74, 139, -63, -177, -426, -136, 117, -454, -162, -600, 51, -266, 74, -2, 1, -31, -28, 7, 83, 133, -226, 160, 156, -191, 4, 84, -383, 115, -248, -14, 78, 156, 148, 198, 51, 219, -79, -201, 126, -104, -2, -158, -241, -198, -280, -194, 163, -548, 477, 191, 76, 162, 281, 301, -208, -60, 6, -38, -443, 453, 219, -161, 53, 10, -146, -80, -350, -216, -238, -13, 139, -77, 52, -45, -55, 59, -80, -197, -91, 200, 114, -202, -152, -453, 68, -16, -67, -346, 85, 247, -476, 73, 152, -13, -39, 382, 12, -138, 159, -37, -5, 69, 321, -262, 144, 242, 170, -33, -290, 166, 413, 258, -130, 2, -36, -16, -82, -97, 70, 492, -49, -241, 187, 60, -38, 337, -348, -159, -18, 13, -156, 420, -75, -193, -130, -82, 377, -56, 13, 95, -23, -18, 113, 412, -535, -7, 184, -128, -36, -84, -283, 12, 294, -227, 58, 2, -165, 21]
6527B1l57M26p03L94K35j49j60j98K21O7J97j34J03m97N52k69M83M0k58j31P3
6548d4j03K46n0k93N62m20k41N40j79j82L67K27l74K63l63K92l57j35J72k61J00
6569b33N22m47N34n20K66J71n52n0L61n34K86M45K52m62m97K81N06k16n0J16m92
6590c13J5J80K28K5k46M1j88L3O0L9k99O21n7l47J59k72O7K24K61j07J74O0n74
6613b16N53R4n59R0L06k90K46j46j46J57m20R1J86J01j27J1m8L56j12J2p2K05
6635B72m27J19j75J80j08J27j78L12Nk74J46k24J66O4o4L2k1J18q9o9Q5L3M9k20
6659a41k1K10O2Q7l32J25n0K9q2K40j52m0q0J70P1k03j0Q2K9k61K86l6Jk7L5j92
6685b00J56J43j1j72j42J63Q9M2j29j07J36K06l81L28R2j84O2k74Q6n4J62o8L1
$$ y = [21, -336, 90, -613, -219, 16, -133, -293, -491, -270, -203, -6, -140, -37, -534, 18, -251, 232, 272, 14, -117, -44, -147, 99, 49, -244, 318, -102, -343, 197, 18, -164, 203, 430, 56, 319, -44, 248, -109, -244, -72, -333, -233, 289, -158, 376, -144, 122, 293, -259, -309, 52, -482, -196, 249, 501, 39, -458, -177, 329, 113, 63, 179, -313, -298, -118, 110, 135, -111, -70, -258, -225, -165, -126, -425, 196, 139, -208, -49, -321, -254, -30, 231, 124, 298, 358, -216, 337, 431, -128, -38, 268, -22, 224, 78, -68, 89, -331, -240, -54, 47, -80, -69, -117, 239, 127, 139, 67, 272, -155, -36, -211, -31, -139, -12, -190, 122, 127, -147, -1, -225, -59, 5, -59, -27, -48, 70, -19, -88, -3, 30, 79, -141, -162, 48, 110, 197, -135, -10, -60, -31, -113, 127, -25, -65, -145, 25, 96, -107, -117, -35, -6, -267, 19, -17, -16, -43, -8, -200, -44, 99, 88, -84, -226, -63, 26, 68, -61, -168, -32, 174, -207, 121, 213, 29, 91, -183, -97, -151, 11, -57, -26]
6708b6n6K52j94J34r9L4J7J1Qj24j16J91R6j20J58l6j20J34k56P6j09J51J7J28
6732A51o5k06OK03j24J55P6k13J24n2j48L4O0j27pK33j15N4j49K46l32R4K13r1
6756B0J0p2n0R5J11q3k27K32J19j21M6k03O0J98p6j92J44LK9OJoj52J10j42K12
6782G2j39o0J96J83l61L19k13J52o3k96J94Q4r6q4J34k7mJ66p7jJ05k42R9l4o7
6807f0L3P3M4j03k73K85J23oo3M4J8j34R1k35K24l1k17K06n8l4r8R5K22k34P3
6832a5j3J35j12R8k59P0K62m27L40Q7m00L68m58K29L6K0J61j49L3j02o9K42k53
6855a76J30m3L05k99L7K18j68k34J05J21J10P3j7j33j25K7J10j13J89K8j9k73
6877a47J71K5M1K4J14j43M6N3j86J22j5j6n7p5J26l60L42k9mm0J00l07J98j27
$$ y = [-26, -82, 170, -24, 110, 11, 45, 62, 73, 81, -43, -159, 32, 128, 8, 166, 130, 10, 144, -112, -36, -145, 6, 23, 151, 86, -120, -114, 89, -35, 120, 196, -17, 107, 55, -93, -59, 1, -126, -133, 100, -15, 39, -110, 136, -196, -102, 111, 20, 30, -42, -92, 3, 114, 31, -196, 36, 155, 34, 80, -123, -63, 135, 59, -133, 11, 14, 43, 49, 50, 44, -108, 2, -140, 72, -67, -127, 69, 252, -109, 210, -3, 149, 86, -210, -16, 68, -28, -112, 22, -5, -9, 157, 80, 79, 184, -58, 41, 7, -60, -27, 46, 90, -13, -286, -1, 122, 116, 53, 97, 115, -19, 72, -163, 61, 30, -187, 19, -39, -73, -171, -76, 146, -88, -15, -28, 107, -5, 93, -166, -96, 166, -261, 79, 166, -234, 134, -324, -95, -59, -39, 122, -27, 6, -96, -165, 77, -176, -46, -89, 216, -83, -46, 172, 4, -230, -125, -4, 106, 179, 162, 29, -96, -69, 41, -72, 117, 145, 126, -147, 24, 49, 90, 114, 228, 85, 131, 184, -2, 120, 105, 89, 32, -43, 83, -277, 65, 36, 32, -8, 92, -215, -17, -144]
6901a44KJ97J10j81K1j02j4J8K35q9p0l48K19J66k2r2K65j40k15K58%k43K28k5
6925C4r1M6q5M4jJ9q6K04j34K33j40lj25J0P2J31j26Q7l1%L8r3j9l0J27k08M03
6952B76l72J51Q3k97J64j02N1J60P8l5q7j48J7J72J54j57j6j17J39P6k26J13m9
6975B8o8m8J50J4k46q2P7J08r9M13N4l68m5K02R9lk63J38L3l26J94K8L95m11J23
7000I7j00o4k22K1K47J98m96L12K04j70m6l12O52m68k36L02l59O19o45K26L55
7021A15m51L62M97o88k2M37k94Mq1J52J28k15k74L30j4J9K67k85M78m63kO33n84
7044D9j06L8K0q6l21K36J00n2J90L98q57M74j58L41j78k31J49m0O4n9J9q9L07
7067B08k20jlJ89N3l56K1Q9r2M2L6j87L75j7k04j09Q9J38J35j66J71j75j02J32
$$ y = [-144, -142, 55, 165, -16, 5, -97, -111, -93, 142, 53, -17, -365, -146, 20, -2, -94, 171, 31, -184, 74, 74, -169, 59, 34, -57, -11, -96, -52, -53, -34, -120, 84, -50, 183, 43, 40, -85, -75, -3, 128, 2, 89, 58, 58, 96, 3, -16, -46, 81, -127, 276, -96, 55, 138, -159, 5, -97, -46, 114, 192, 157, 70, -78, -61, 111, 265, 108, 92, -25, 114, 190, -36, 77, 28, -40, -88, 62, 76, -170, -252, -175, -67, -166, 247, 301, -67, -112, 90, 189, 186, -77, 61, 94, -232, -38, -10, 385, -26, 97, -3, -67, -289, -268, -21, 177, -319, -7, 197, 27, -19, -331, 321, -147, -383, -81, -440, 179, -466, -240, 115, -336, 26, 523, -165, -187, 250, -44, -40, -121, 31, 159, -56, -330, 0, -14, 5, 272, -13, 465, 2, 0, 633, 49, -57, -19, 1, -85, -406, -170, -70, -122, 68, 466, -391, 83, -75, 266, 88, -143, 6, -34, 30, -29, -10, -99, 208, -12, -13, -16, 173, 226, -130, -109, -20, -112, -70, -34, -221, 154, 137, -67, -176, -87, 51, 186, 20, 191, 16, -86, 46]
7091D6k4N6k45K02ol3j14qR5rn3J34n7M7J2M3m8k85K56l5J56j30m9J21j62l1l1
7118a52m0J03J49p5j9L3J18j31P6j44N8J78j08p6m4j47L54l5k54Q3J56K2r7j65
7142a57K44K5m2k09J01J4J2q8L27q5j2M1j42Q3J89l30j43J6R2j55J83J20k11J60
7166C3J4j9N9Q4m0q2M7j29l2n4K21l1l4L7j55K26rk14J61K3J4j2l6o9kj00J60
7193F1J66k11n1J36j52o6M5n7J25rJ4j42R5k3L1K01k45J42j82J00J76l19N6J49
7217D0J1O1r5j5p7p9J15J7LL1r1J1J26j03j08L4K52j82K43o9r1Q5j87K96k52j14
7243a38J24j96J73J32o6QJ4m4j39K26j18j28J10L4J13j6j38O7j09K4j9J86k1m0
7267C9J14j23J00j0p9j06J52n9j68J72k03L44m7k58K53o1n1j11J87r4L8L1Lr3
$$ y = [46, 22, 78, -167, 35, 29, -4, -118, -126, -31, -40, -93, 41, -16, 31, 43, 86, 38, -247, 9, -26, 130, 0, -49, 72, -90, -121, -152, -192, -89, 60, -15, -34, -1, 117, -14, 62, -82, -24, 154, 46, -30, -74, -221, 133, 98, -156, -73, 83, 105, 8, -157, 87, 112, 70, -139, -38, -24, -12, -100, 227, 142, 130, 171, 29, 112, 301, -29, -172, -156, -64, -219, -36, 84, -127, 33, 47, 28, 87, 171, 131, 49, 96, -33, -65, -119, 102, 71, 37, 74, -81, 145, 136, -78, 83, 106, 120, 108, 72, 3, 1, -99, 61, 227, 16, -35, 101, -51, -117, -72, -129, -4, -13, 1, -141, -46, -69, -38, 163, -82, 60, -122, -22, 154, -165, -109, 40, 51, 112, 17, 2, -75, -154, -39, -22, -19, 12, -79, -68, 58, -45, -153, -119, 133, -49, 194, 125, 34, 119, -68, 228, -24, -138, -14, -210, -37, 95, 29, 37, 51, 7, -132, 94, -24, -152, -42, -8, 105, 89, -49, 18, -91, -67, -86, 100, 79, 39, 153, 30, 130, 120, 41, -65, 87, 28, -140, 32, -171, 173, 126, -132, 121, 60, 9, -102, 85, -9, 29, 60, 63, -30]
7291c0J0k17K10J19k46J12L4R0N0rj48p5K26r6l4K00k66K14m95Q14o3m02J74m2
7315A30l63j36M32L68n61K46J94Q1o33K22O1l31R9N45j90k65J31K27k10l36J17
7336a72k59J010q24J55j02N13q3n31R46r39J33K17M38j79J88k0m16O45q22J30
7356B8q46J48O22j10RL8m20M68P2m05M15O13m47o28J252p89k82R22j141R13m96
7377f4L24K36r08L10L57J06o22K79j79M70o55L54N2J50k08k6q8J2J18j73J3N98
7399D56p31O52l53J1j47L65j52p9j64L12l27P4j14J59n2Q6j70K56j11j08N1k28
7421c14M18k85J00J32j54K1J66j41L21l45K08k35k3J87j18J51p1j91J22q3P9n
7443f0p4Q7K7J08k03K77n6j30j64J21L47j54j84J93j16R6J2o5q4L7R9j20Lm5L2
$$ y = [-30, -20, -237, -27, 92, -154, -42, -8, 82, 132, 123, -25, -100, 126, 30, -4, 196, -70, 144, -351, 463, 400, -2, 172, 130, -233, -369, 63, 431, -130, 116, 310, 391, -242, -20, 41, -290, -191, 354, 164, -101, 30, 257, 47, -289, -172, -431, 579, -245, -90, -192, 321, 238, -293, 653, -286, -153, 64, 502, 323, 511, 491, 75, 720, -102, 28, -818, -670, -48, -158, -149, -111, -531, -63, 9, -396, 19, 632, 185, -443, 809, 20, -262, 660, -481, 432, -64, 260, 496, -412, -102, 255, 361, -261, 18, -161, 309, -346, 8, 60, 210, 2, -24, -112, -100, 18, -155, -142, 456, -275, 377, 24, 35, -112, 253, 101, 22, -142, 170, -157, -83, -197, -38, -90, -4, -174, 82, -29, -137, -86, -314, 104, -181, -81, 51, -103, -82, 84, -57, 264, -81, 127, -108, -131, 56, -62, 89, 18, -173, -51, -134, -55, -60, -134, -47, -20, 88, -115, 162, 106, -24, -188, -67, 280, 126, -58, 135, 19, 115, 127, 62, -22, 15, 114, -6, -3, -48, -16]
7468a6jJ99k84J8J82j68J2j28P9P4j97K10K06j32P9J1J07k29Q3r9l5Q1J3J5Pq3
7494DP9J8j85NK20j25n9K6J43j78J14J0o4k36J56k9N5K49k93R5J37k35J34j98
7518a57O1J20j15J07J13k51J7O5j10K96o8%j79K64l8j79m2k6J83j16J46Q9k54
7541g4M4p0J19P6N0j06J22p0j29l6J79qj58P7j51K83l9j0M8p1nj76q9K02j57K3
7567a26J78M2j69K05M1k83l3K73p9O4k2j39JO9Jl1j56L42k45K3OK1kO4j6M0j59
7594i0JM7o9J49j87N3rM2J23J3j65K23j08R8m1j25l1oj07k2L0N4K10k02J03K28
7620B12j17k48J11K3m7j28K10J13l15K85J35k78j28J07J8n4J10j6J25R2k09K7
7642B8P8L1kl04NN9K7l1K52j01Q8k56O2j10L79j76N8l39J79J65L7j18n6J23j40
$$ y = [-16, -17, 182, -102, -84, 98, -70, -58, -186, -107, -33, -230, -20, 186, 54, 133, 144, 251, 22, 105, 6, -29, 52, 65, 80, 87, 4, 83, 101, -84, -79, 141, 16, -43, -17, 126, -52, 62, 72, 8, -228, -72, -101, -46, 203, -90, 5, 142, -93, 41, -157, -96, 24, -91, 16, 129, -122, -105, -40, -150, 146, 78, 78, -101, 163, 125, -54, -96, -122, 61, -55, 91, 180, -74, -30, -100, 19, 95, 145, 39, 161, 91, -38, -74, 105, 97, -61, 16, -135, 148, 109, 99, 147, 76, 71, -105, -194, 8, -149, -126, 52, 94, -75, 130, 171, -112, -145, 128, 49, 113, 91, -48, -47, 22, 23, -8, -164, 178, -67, -44, -38, -17, -19, 45, 29, 69, -90, -89, -42, -111, 38, -149, -96, -105, -63, 60, 73, -92, 131, 23, 121, 80, -45, -76, -82, -189, -211, -181, -127, 83, -119, -16, 212, 95, -153, -42, -19, -66, -194, 16, 129, -186, 99, 234, -44, -172, -65, -47, -101, 9, -7, 118, 210, 1, 28, 106, 137, 135, -169, -164, -105, -78, -109, 143, 42, 130, -126, -64, -174, 205, 29, 87, -252, -73, 92, 129, 11, -45, 78, -62]
7667f2Qj20O2J30Rj68P4J48o0J02l45M85k15J18j69j64K57j21J14Q9k38N1m9j31
7691a95K67j38P4Q5k06J92r1J3o8J10k3J64l5k36J28O8J19o6k02J22P8k6p5j65
7715a06MJ18Q4k33K94l12J99k57K89r3p0K92k57J56L1j64P7J42k91K3J72j06k9
7738c7K4m27M61o8n4J58l8j06M0R6L0J52k53j83K87j15m8J80k03J01J95q3j73
7761f4j20J16o2n5M24k27K8m6r1J19KO6k00L8J43J6lrL0k74K06MN7j95Q8j95L02
7788I8n8NoN0j58N7K32k65Q1j74L75k89Q1j58P2K72k59R6p6J27r9K8N3j45J16
7813E6K6r9R0M1M2nj73o8J09J38k42R0L8k68L57p5J24k45n0J74M5K8j94L6N0J47
7839A72j56Q9l5j13J00p4k45J84J00R9q2l03M09k88K08j74k62J16K71k33L01j98
$$ y = [-62, -54, -174, -112, 18, 27, -141, -67, 81, 21, 123, -222, 263, 48, 166, -3, -167, 90, -31, 83, 172, -66, -15, -64, -195, 72, -66, 8, 93, -113, 79, -12, 1, -67, 43, 20, 184, 149, -87, 41, 109, 228, 162, -40, 82, 160, 134, 59, -106, -102, 16, 100, -133, 161, -151, 48, -209, 80, -13, -83, 209, -48, 108, 139, -25, 52, 194, -97, -74, 98, -8, -37, -13, -440, 21, -47, -101, 57, 19, -87, -47, 49, 79, 231, -22, -205, 82, -33, -81, 99, -104, -3, 192, 109, -64, -184, -68, -130, -185, 239, 12, 40, -6, -97, 22, 24, 90, -110, -72, 71, 87, 84, 75, 105, -169, 37, 41, 98, -97, -9, -204, 98, 40, 45, 39, 89, -69, -12, 220, -45, 36, -138, 237, -52, 29, -129, -57, 215, -44, 52, -24, 103, 4, 32, 85, -60, 56, 82, -17, 73, 114, 156, 151, -22, -90, 19, 157, -85, 5, 43, -225, 132, 57, 181, -64, -114, 60, 105, 133, -61, -25, 25, 172, 16, 105, 70, -43, 57, -17, -262, -78, 22, 121, 39, -264, 145, -143, 65, -109, -371, -255, 16, -217, 84, -114]
7861a14j22J73j04J44NL71r9j16l00O45n45j80K98m61M49L2k75k00J61J33J65
7882F0lj39M43m72K10K4P2Qj19j31O27r9l10JK8m95Q19q92O87o19J97K96q08M25
7906a90L52L0K94o67J1k59L65L22M8L55l52o82Q36m30r4K19k54K32n85L58l08
7927c99J88J99P59j489O86m35J31J05Q61r44M02k63K01O96j313P35r94J485j30
7946D81J27q72K64p1K75jo9m65P93k14l04M29j79N5p17O03M5J40j34K96n97L54
7968B39L27l49j16n95J77k95K57R76n11j66r8k37L62l74J81O3N22o04M85j022
7988g78L50K69j84K92n28L29J08K77J15q6R1K3J07k74j84L45l51J43Q9o34M70
8009a1J01k70L26l03K29K96o86O35q3m71K85j54J45K60j20k47o1M22q34J263p14
$$ y = [-114, -236, -63, -167, -23, -18, 353, 254, 138, -162, 483, -62, -242, 56, -405, 44, 76, -199, -399, -238, -105, 60, 57, -82, 361, -111, 99, 123, 195, 203, 84, -47, 580, 481, 171, 172, 200, -295, 524, -368, 319, -300, -103, 193, -615, -190, 162, 192, 486, -181, -170, -429, -64, 258, 306, 661, 309, -373, 463, 33, -61, 158, -96, 136, -449, -91, -399, -211, -12, 747, -742, -56, -491, -360, -255, 606, -338, 64, -199, 2, 698, -615, 120, -874, 611, 481, 608, -264, 0, -71, 204, 203, 134, -331, 462, 248, -56, 373, 194, 249, -468, 135, 180, 320, 186, 482, -115, 239, 566, 217, 101, -494, -317, -612, -355, 621, 110, -56, -154, -391, -29, -403, -222, -159, 363, -241, 244, -778, -428, -159, -343, -51, -579, -250, -142, 135, 250, 164, 255, 278, 385, 111, -73, 272, -79, 64, 153, -481, -11, 90, -180, 146, -157, 72, 368, -318, 317, 234, -237, 48, -106, 39, 299, 179, -68, -129, 293, -541, 722, 8]
8030HK1j89K36k1M54J58q87J24J75k02k72M98k92J10m89Q12l91M8oN89J9l42j29
8053C2k2pK7m5J72j74q9j54M80L25o02j0j0P9J0O0K81l80Q2j40K15j40j27J99
8077F2K6j84j79L26j70p1K09m2k5mM2J46K7o4K1J5k33L2J39Lj07MO2K3n1kJ9R1
8105A15j43k6j09N5R1k36K50J31q5J26m13M38k11J01j59j3Q1N0j49R0P6k18l0
8128a88M82l69M5j23J39J04j33k5K03K8j87o4J72m8J30j21m1j64L46j5k73J15
8150A3mm6n1r4J77q8L05l22J92l4K06k07n8J13k62L1J69k31K0N0K45k31O6J76
8174A35k23K4L9j45K49Kl3J44k38N3L6R4r6K1p8rm4
$$ y = [8, 29, -160, 76, 55, 509, 667, -220, -96, 79, -123, -395, 103, -189, -79, -568, 244, -147, -99, -105, 484, 503, 161, 32, 10, 3, 30, -15, 157, -17, -106, -260, 220, 545, -57, -67, -77, 2, 12, 72, 353, -27, 55, -85, 130, -10, -137, 62, 88, -96, -275, 51, -119, -190, 19, -23, -48, -52, -10, 136, 163, 99, 120, 135, -98, -66, 73, 76, -31, -27, 35, 58, 7, 5, 24, 115, -28, -54, -163, -108, -17, -253, -3, 128, 43, 169, -244, 194, -17, 84, -75, -88, -7, 43, -106, -16, 60, -158, -188, 294, -75, -30, -153, -14, 90, -43, -68, 135, 163, -24, -88, 84, 36, 166, 45, 4, -160, 186, 171, -102, 13, 9, -37, -88, -182, -5, -93, 212, -110, 82, 48, 254, 47, -11, 102, -160, -129, 40, -191, -171, -121, 124, -107, -41, 135, -88, -64, -25, -170, 79, 81, 48, 192, -46, 7, 43, 137, 41, 62, -16, -25, -69]
8191f9
$$ Imaginary data points
##PAGE= N=2
##DATA TABLE= (X++(I..I)), XYDATA
0@%%%%%%%%%%lJ1j6J6j6K4l2M0m8N6p2Q8j04J24j48J75k06K39k75L18l66M19m78
33b54N44o19O99p87Q84r90J107j238J382j534J700j885K087k307K546k807L094
50A622l408L752m132M554n022N544o131O795p555Q431r455J0674j2151J3980j6319
65h821J9435k3812L0495m2482J03332l06512L33220R2393m16596M02713j09730
76G3635j73921K20847p3147j28490J17305L3647q6462L2406L3088j37077J12068
87B3899j9794q4083J35786r0947K2782L9482j74149J88021k6074j50548K00058
98F4433q0455r4667J36380o7397n3437J10525J0852j34067Q8798L8508j74649
109a55176J77250J18j73507K34503j06952j15207K07124j32533J8286R7733j23470
$$ y = [0, 0, 0, 0, 0, 0, 0, 0, 0, 0, 0, -3, 8, -8, 8, -8, 16, -16, 24, -24, 32, -40, 48, -56, 68, -80, 95, -111, 128, -147, 171, -195, 224, -254, 290, -329, 370, -417, 467, -523, 584, -654, 728, -806, 894, -991, 1096, -1211, 1335, -1472, 1622, -1786, 1966, -2166, 2388, -2634, 2910, -3221, 3574, -3981, 4450, -5005, 5669, -6482, 7498, -8821, 10614, -13198, 17297, -25185, 78147, -228365, 104855, 197248, -219348, 183365, 73635, -100286, 120561, 47414, -81076, 36229, 69876, -16586, 15820, 48908, -88169, 23899, 4105, -79978, 55808, -35139, -12357, 27125, -147024, 40997, 14923, -135625, 64433, -16022, -110689, 25691, -41706, -95143, 15382, 26234, -107833, -19035, 19473, -155176, 22074, 22192, -151315, 83188, -23764, -138971, 68153, -64380, -46094, 51639, -71831]
120g1831P2443j8370m5413P7282m1031K2320J8979l6198J2569q98J3395j5257
132a2010K6389Q823m7424N4134l9848j6480Q1138o5302K3060K9921o4938M6185
144B3648j7096m654M4190m1735K4714m479l3180L3799p601K067L776N226j1781
157A6894k8097N0394l1457o016O7701q2916K2510M4416q8792O4415Q268n5321
169a8001O2489l9640j4789L8542m1041K8643J0932l8870L2064o389l8720L9359
181A4579J0016m9191M6674Q129p9645O8534O134q3338R7130j1706q5368R1909
193C3857k6418o2755Q8609j8948n4942O3644j4803n5876N9291q2m9916N9571j5363
206E869m6615N6864k7989j3884M8884m3526J3850J8988n0970M3725j465m0976
$$ y = [-71831, 612, -17758, -63171, 14111, -26920, -4600, 14379, -21819, -9250, -10148, 3247, -12010, 14379, 23202, -24222, 29912, -9936, -26416, 54722, -10580, 12480, 42401, -22537, 23648, 6552, 1898, 46088, 4353, 29067, 24588, -8592, 25207, 17606, 19673, 23449, 28675, 16894, -11203, 39191, 7734, 1718, 69419, -13497, 9013, 53429, -35363, 29052, 37320, -18001, 44488, 4848, -9941, 28601, -12440, 16203, 27135, -11735, 20329, 13940, -24780, 14579, 24595, -24596, 22078, 30207, -49438, 19096, 25230, -58108, 39022, 27316, -58052, 33857, 7439, -55316, 33293, 14345, -40597, 23047, 8244, -47632, 11659, 11577, -38339, 21232, 5869, -40746, 16118, -11871, -25755, 23129, -20397, -6547, 12441, -38529, 5196, 3731, -37245]
218c7245O1496k5656m0372O6093l6512l2250P7347l9205l3729P4405m9109l1233
230d5970P9824m5793k3371P1700n0503k3136O1528l9767j1975N5549l5778j6395
242b4087M2935l1843p858M1259k8271j679K6457l2308P963J8417k4609K0440L915
255A0731k3376K2953q970j5707L0366j3586r061K8128k4387n953K7672k3694M448
268d36K4250k6628M512J3692k1692J0394J1784j2726N136L111j0689J182Q541
281A0431l554j884R262j0425m411J1328r977K707J1825j4316J613P027j2782M973
295A817P475q930J730N424r974j119R312o993j787J0412q765o054J0325p003n963
310a0093J5920n669j1778J5239q517j1224K2096r604r683K0445j6698m695J8723
$$ y = [-37245, 24251, -1405, -41777, 24316, -12196, -44446, 32901, -6304, -40033, 34372, -14737, -45970, 33854, -11939, -35310, 36390, -14113, -37249, 24279, -15488, -27463, 28086, -7692, -24087, 18848, -12995, -20853, 20406, -7865, -9544, 16913, -15395, -7432, 10985, -13624, 6816, 10731, -12645, 10308, 1338, -14369, 15997, 2411, -6650, 21478, -2909, -8862, 18810, -4884, -436, 23814, -2814, 1698, 15390, -6302, 4092, 15876, 3150, 8286, 11397, 708, 1890, 10431, 6877, 4993, 14255, 3830, -581, 10747, 770, 3477, 15302, 986, 2599, 9626, -3156, 1817, 9292, 362, 2092, 7516, -2458, -3577, 5735, -1258, -3045, 7367, -1398, -7452, 2873, -4130, -10093, 5827, 158, -11620, 3619, -4898, -16122, 5974, -3630, -13313, 7132, -9566, -14261, 4462]
323D462j6123M715J1893j7241P916K149j1625J3896k593p007J2500r643l754J3851
337C396j0536j299J5548j2693k766J6020j4049j875J9768j6128k377K0247j8273
350e017l347K2781j7746j687K2244k2057j215K2355k2040L489K1076k4515O406
363G27J3883k2104J0427J0743j8003J0659K907j3604R604P06p082R371m827n235
377a828Q034m758j953P230o518p98O387p439OO830p044l56P778q784j974J1082
393E895j1723J417J1597j3667K306J0811j6248N891R416j5582R239N072j5904
406a1480R936M097j0976Q617J993r927N697K465p482O776J907o417L626J479n808
421e497L842M394o376K847K667o325M333K637o063N337J101o203P108k079m157
$$ y = [4462, -11661, -6946, 4947, -12294, -4378, -2229, -13854, 42, -2551, -9558, 2942, -6701, -10455, 3396, -7140, -8439, 7109, -5584, -8350, 7670, -6379, -8254, 11514, -4614, -6991, 13256, -5017, -8364, 14417, -3329, -5016, 17228, -4829, -6044, 16311, -5729, -2240, 18836, -5679, 727, 14610, -7494, 2933, 13676, -4327, 6332, 9239, -4365, 5239, 5945, -1137, 8234, 3407, -1828, 6206, 1448, -505, 6725, 207, -591, 5796, -1643, -1637, 5193, -1851, -2207, 5571, -3213, -5187, 5895, -5828, -4411, 7186, -6481, -4175, 6636, -9612, -3721, 5695, -9887, -648, 4424, -11480, -1544, 2553, -8423, 194, 2187, -7740, -2043, 422, -7060, -284, 1623, -4794, -1168, 311, -5497, -1655, 2739, -3637, -790, 1877, -4448, -115, 2522, -3541, 1796, 2897, -3306, 3802, 1723, -2434]
436b434P057l770j528P547q453J206N544o770L153L605p169M057J080n564N388
451B949P80m668L584K38n642L194L564n058K499K232o885K831M439p706M750M126
467E227j0063N333K964r389P265J747q745P778m63p567P202j287m231O604k551
482a76l652M436k421j173L635j608J37J494k544j62J390M51O08K95j325r83J702
499A04n27n54L665l083n49L421n237K404M065o061L788J594p009N636N02n315
515c156O281j335m512M942j588k685L992j109j985L162r64l365K553K84k099K502
531I18M91l569J426L13k102K588N11l162J938j91l163M293l68k389L364k800j632
548c534M175l118J345K604m358K501M9l038L877m97j851K594j467n74O09J237
$$ y = [-2434, 4623, 853, -675, 6872, -1581, -375, 5169, -1601, 1552, 5157, -2012, 2045, 3125, -2439, 2949, 3729, -939, 2645, 2883, -2759, 435, 3999, -1059, 1440, 3672, -3213, -382, 4057, -3649, 1101, 5227, -4836, 497, 3461, -5928, 1337, 3084, -5661, 2117, 1654, -5913, 1289, 2, -4229, 2375, -176, -3828, 608, -1813, -2986, 649, -959, -822, 672, -1872, -2034, -644, -193, 415, 710, -615, -1598, 104, -423, -977, 2688, -395, -944, 2477, -2760, -356, 3709, -2352, 1436, 3030, -3979, 1657, 2159, -3156, 3125, 1790, -2722, 2220, 632, -2053, 1939, 830, -1155, 2007, 1043, -2322, 231, 515, -1584, 918, 1409, -2160, -734, -421, -2523, 65, 576, -2586, -648, -839, -4002, 291, -77, -2466, 898, -1902, -3534, 641, -2477, -1132, 1472, -2886, -385, -336, -3374, 503, 6, -1845, 749, -718, -1292, -683, 554]
564E54q87J527M71j690j61J290k266K325J580k610K186m30l176L062R06j958K771
581C494j258k699L309j336j608L630j022j698K211k034m35K755j676K63N91k492
597eJ481j009K61J19k51M44j205J36m03n03J447L8j363N13r47j027J311r17J279
616f01J59k594R33pj514K886q75j354K119k729n31K464q05O09J055k413R22l04
634b580l09J647m46O33j63r25J083o96J60J967j261Q07L91j892J207R55n34J786
652A830k30j057O71q38K20J494j74M52k63j331Q58J04J38J974j723k9K24j646
670F74J700L79j077J759j673m60J223k196K281k58j540J954k285j06J368j921
686a78J406L14j465O48j054k80N12l16N17l45k08p84o09Q75K34K1j64k59j399
$$ y = [554, -333, 1194, 1665, -25, -186, 1104, -1162, 1163, 2743, 133, 2319, 1889, -1287, 1775, 2681, 723, 3494, 2236, -463, 2846, 1510, -98, 3532, 2510, 812, 3023, 989, 554, 3309, 1633, 1896, 2487, -5, 1476, 467, 728, 847, 596, 1040, -165, -29, -432, -935, 512, 550, -813, -300, -1247, -2274, -963, -1880, -601, -442, -3036, -2103, -2110, -3624, -738, -1613, -2967, -848, -3577, -4108, -1644, -2449, -1840, -785, -3198, -2276, -2580, -2889, -1242, -1688, -1055, -1218, -2143, -1060, -1756, -1596, 371, -890, -83, 308, -1584, -377, 578, 44, 1830, 1600, 543, 1214, 376, 596, 2090, 1916, 2368, 2105, 774, 1632, 1736, 1874, 3848, 2125, 2096, 2320, 674, 2374, 2753, 1676, 3435, 1762, 1302, 2525, 329, 2610, 2352, 812, 2766, 481, 375, 1743, -178, 1228, 1542, 77, 725, -329, -609, -97, -413, 104, -241, -449, -1233, -1842, -967, -733, -712, -876, -1135, -2534]
705b534O63M47q67J726j35k192J894r95r46L271k190K29J837l168J968J52j294
722b134K742j471n31J456j775J472n4n42J719j221N63l33m06J449r79R16N39j810
740d00J131k32p76K232n99j129J032q83q86K032l2j492K046j581j284K729j928
757b0J83K011k612N39J034k097J739k89p38R38j163M08p14K12O80j445J907r33
775c60j324K225j958L21J866k369J247M03k341K161l49r09K083j143q56J299r40
792i44l7J987q96j013J740j804K41K066j766Q89P27j557Q47M05m20L11L26j9p52
811C31O17L57j689K162o98j093K517k422l34K782l009J458Q47k423J405K9j378
828e41J818n16n00N87q42p24Q68p4k50L48k48p66L46j58j76M90l7j327J009K15
$$ y = [-2534, -1871, -1424, -2291, -565, -700, -2892, -998, -1993, -2939, 332, -1858, -1629, 208, -2960, -992, -840, -2134, 608, -863, -1394, 62, -1713, -241, -295, -837, 882, -339, 224, -109, -515, 934, -45, 871, 1410, -400, 731, 499, -277, 1955, 1356, 227, 1259, 376, -510, 1522, 1490, -2, 2044, 463, -821, 1908, -20, 163, 2174, -438, 101, 1135, -962, 777, 488, -250, 688, -475, -67, -781, -569, 111, -1334, 573, -360, -1684, 541, -1417, -1096, 770, -1599, -352, 51, -2290, -129, -478, -1387, 696, -447, -1303, -4, -944, -981, 1006, 110, -903, 837, -967, -726, 1340, -426, 463, 1190, -367, 480, 885, 465, 776, 1102, 1083, 331, 948, 1305, -384, 1778, 1080, -13, 2504, 82, -252, 2530, -479, 979, 1826, -597, 808, 837, -541, 1277, 761, 261, 848, 6, -718, 150, 76, -174, 174, -74, -840, -494, -652, -828, -338, -375, -1702, -693, -478]
848d78j381J306J55j050J046Rk098K182j397p12L276k089n74K443k548N94K142
865H26k682J759Q64k249J011P65j598J836J15q77L63K12p7k19J887k188P91R79
883A518j256K13J336j462R33O20k141J791j1j642K263p72j891K887j740p84K285
900B147j668l73K060k234N62P27j455R87P6j086M77K94j710J182M01j186N96M46
918B43j430K31J151j495M16N72j397R76L39j610R05J098k512J800L38k112K121
935c66n89j202K231j059m95J334j038J3J299j080N36N02q70L96P47m59k74P63
953C89l91J62L13J95o56J100k12q63J529q47k29J748j505j60J422j608P07R51
971B045j858J105L53j289J387M2j932J404m9j304J535l56p96M35j02n82L40L09
$$ y = [-478, -1859, -553, -398, -1448, -402, -393, -2491, -309, -1706, -2418, 858, -1231, -1805, 638, -1910, -1316, 826, -1856, -97, 767, -1482, -471, 294, -1304, 532, 647, -230, 133, 345, 268, 49, 1936, -252, 539, 1518, 262, 475, 1811, 349, 1282, 1902, -239, 1552, 1541, -101, 2162, 1390, -501, 2386, 646, -138, 2147, 479, 106, 2166, -68, 494, 1221, -234, 753, 829, -257, 220, 514, -1196, -14, 387, -799, -203, 243, -1187, -956, 195, -1300, -884, -312, -1709, -733, -394, -2004, -1099, -1, -2513, -713, -375, -2487, -366, -955, -2157, 74, -985, -1480, -146, -1184, -1171, 128, -952, -416, 86, -784, -388, 359, -100, -374, 389, -2, 160, 473, 668, 12, 1112, 900, 37, 1566, 719, 490, 2238, 733, 573, 1995, 387, 1094, 2045, 187, 1292, 1645, 356, 1743, 1785, -147, 1257, 1208, -96, 1439, 1083, 287, 722, 620, 38, 378, 687]
989F87p21M29J16j192P51K99j426R66J27j357J473m85j367K009j183q88K297j921
1007a386k6J392j722O93R37j423P86N90j457J056J68j017P98R8r09Q22N11r90
1025a079N90O10j353Q69J082j582Q83P56j473J133L76j508J436J75j477J688k24
1042I02j261J722p77o71J752j147l47J673j790O44P69j317Q16L48j029M81l7n34
1060A97J21N39n48j38N81p15pQ23j294J58J333j833O27N67j567J034J73j132R80
1079a01k54p63J113l82r27J329n30q16J193m52m03J370q78k91R57q77M61R6k25
1098c80L08oj34j53J90K89n14Q46l54p33J746j230k97J526j248L20P59r37O62
1117F60M6r16R38k28m60L84J42k95K77O3k94M84j97n31L37O5p27P17n8p79M72
$$ y = [687, -34, 395, 511, -681, 70, 369, -1057, -91, 36, -1321, 152, -333, -1700, 309, -874, -1762, 535, -1386, -1412, -20, -1742, -1049, -112, -1535, -749, -159, -1616, -560, -392, -1409, -611, -513, -1422, -600, -89, -1079, -489, 121, -1232, -363, 719, -863, 20, 776, -697, 436, 812, -696, 740, 915, -562, 1126, 902, -359, 1363, 586, -85, 1667, 520, 173, 1846, 56, 700, 1469, 152, 968, 1316, 287, 768, 731, 197, 318, 857, 309, 171, 752, 37, 30, 853, -441, -283, 1050, -783, -156, 411, -1156, -122, 51, -1081, -101, -355, -1118, -5, -387, -1314, 15, -515, -1331, -138, -590, -993, 377, -501, -792, 165, -712, -251, -155, -380, -72, -78, -212, -365, -175, 114, -400, 446, 92, -641, 1105, -125, -422, 1104, -144, 176, 935, -2, 660, 706, -210, 728, 500, 40, 424, 566, 271, 548, 611, 317, 801, 604, 73, 410, 475, -252, 465, 407, -372, 100]
1138A00J72n60L63L45j208P24K40j146J200k63r86J144o64p05J733j406n5R81
1156Ij059K76O59r25L76L36o06K84K98n01K1P50o93L70O12q39M21K92o16N23K52
1177B40o44N79J24n53L84N96r31R30p1o61Q62m9q77J058k76p28J259p41k80J142
1197A363j042M18N43r66O33j81k48K21q5j35l38N24k75j72N82n05k57O08j062
1216c74K56O47r34N52J06r13K19M34q61N82K01p15N87k90n37P58l38l29O11k91
1236f29l97O13n53J89L24k68K01O7j55M1J88J95l58N01l69k61O34k76r5R20r13
1257d01P7O82o94M62M59n16J60L44m54L34J64o06O66k2n30O68j56j36L01j89k83
1278C30K71qk12J82r5k74M19qm43J42J56l64K97j14l80M59l36l59M74l01kO40
$$ y = [100, 272, -288, 75, 420, -788, -64, 176, -970, 230, -33, -1019, 125, -539, -1244, 489, -917, -972, 9, -1050, -774, -115, -1040, -664, -328, -934, -650, -352, -853, -832, -82, -775, -405, 207, -632, -211, 81, -535, -12, 240, -404, 175, 299, -254, 130, 726, -205, 725, 654, -7, 855, 806, -71, 987, 711, -17, 1242, 501, 221, 1363, 321, 739, 1282, 316, 949, 768, 520, 741, 656, 521, 183, 707, 432, 260, 842, 337, 80, 688, -374, -118, 529, -405, 147, 253, -660, -441, -7, -868, -286, -85, -800, -213, -503, -1040, -282, -620, -949, -338, -629, -1026, -413, -966, -777, -453, -721, -520, -453, -608, -567, -379, -184, -542, -41, -410, -671, -37, -313, -408, 512, -401, -324, 358, -336, 126, 585, 69, 229, 573, 119, 453, 617, 11, 677, 655, 125, 793, 637, 501, 802, 613, 330, 601, 593, 381, 563, 468, 194, 613, 605, 162, 304, 460, 96, 393, 279, -101, 358, 22, -337, 137, -164, -166, 474]
1300D74q30p0K68n72O36o7m75J85K24j80Q1J41n82L32j21PK06j77NJ78K38k93
1322c92J36O2k00J40M61m20J68K80m59J40J79q1L22l39k46O56j12m2J75j62K2
1343B88K88l73Q1L30j29k75K10j24K74o7j35n8L63m58r2J15K76n91O02k14l73
1364f2N26o27K0J12p3J06M4m07J55rl01N37K8n50J93M2m17M42l56J42K81n03j2
1387f89J75J90j68J53j16n5J61j39p8L09L8l72M40j54o5M45l31N2M94j72k64L06
1409A60l30L84K48l23J90J5j78K85r6p8R5J13r2K27k85J57K5k25J61j59O4O8l5
1432C91o0k05Q2K42l49J80r0M0J1k28O2L1J80l48Q1m44L70Pj38L25k19k22j11
1455d12K85j83K46l27J82L7j41p8O0j36m4j07J95k00K20J61k11O9J50L8k4R1l17
$$ y = [474, -356, -426, -158, -730, -94, -161, -636, -451, -227, -407, -326, -185, -767, -435, -556, -549, -343, -520, -515, -337, -99, -392, -256, -194, -394, -254, 207, -213, -45, 235, -224, -84, 95, 14, 336, -3, -249, 407, 295, 253, 428, 266, 288, 576, 203, 284, 614, 485, 210, 420, 296, 570, 503, 368, 310, 673, 215, 123, 238, 514, -77, 525, 311, -62, 464, -163, -143, -31, -104, 2, 46, -361, -206, -215, -516, 21, 49, -501, -308, -266, -683, -241, -597, -455, -174, -677, -689, -514, -324, -492, -339, -455, -510, -349, -488, -566, -257, -219, -591, -151, -305, -370, 75, -256, -204, 290, 118, -146, 160, -170, 214, 462, 139, 329, 344, 166, 451, 355, 277, 372, 485, 393, 620, 335, 492, 517, 292, 453, 294, 358, 426, 391, 331, 126, 208, 450, 101, 281, 191, 231, 242, 14, 76, 107, 287, -61, 20, -424, -54, -47, -185, 140, -79, -301, -412, -127, -310, -64, -391, -209, -172, -313, -391, -331, -467, -511, -618, -423, -623, -403, -242, -453, -384, -234, -196, -220, -129, -446]
1478d46K38L46j09q7Q8p3Q9p1J80L37k30k17K1J26J5J80l8q2J66j94N8J8J83N0
1502E48j86J04j14oj37K2P6j87m2L92k80q1J05j14R0j51q0KJ8J27l72J39j05j10
1526c42J40P7j01j11n2M0m2J60p0r0Q5q6Rk40J69J44P6j14L8j7j23K63l12K83
1550b16K8j14L34l74K10K2L6J47j9j3J08p4m9K28l06K07P7j59K07J8l5Q4J5k0
1574C42m3R9n6Q0M8j44m9M3R4k6p3O3l91M19j63n5N2m5j35N1J57l63J15j42O0
1599f2K24l51J19k34J31j00r1K1J10j08J47j8j70K19j55O6L7l81L30l4L9j4J2
1622b63Rqp1K36Q6l55K84R3k17J63j56K44J9m6J73k20K92K2l50K92K1j05LJ29
1646B75k25K92j4k13L22k72K28o8j26l8K86k37K25j28k02J19k14J28l0J86o5k27
$$ y = [-446, -208, 138, 29, -58, 30, -43, 46, -25, 155, 492, 262, 45, 66, 192, 207, 387, 349, 267, 433, 239, 297, 315, 498, 548, 362, 466, 352, 346, 209, 231, 307, 120, 78, 470, 190, 109, 214, 100, 190, 39, -41, -39, -21, 106, -266, -127, -232, -342, -202, -125, -226, -337, -389, -349, -391, -231, -301, -391, -306, -392, -383, -623, -454, -310, -234, -348, -310, -327, -450, -187, -499, -216, -188, -302, 32, -342, -132, -110, -74, 73, 54, 41, 149, 75, 26, 254, -52, 155, 232, 73, 280, 298, 263, 347, 362, 342, 299, 398, 342, 422, 470, 326, 277, 320, 414, 388, 315, 378, -13, 406, 243, 188, 240, 195, 60, 111, 268, -95, 20, -122, -62, 162, -189, -70, -304, -173, -273, -364, -343, -233, -341, -194, -212, -382, -163, -318, -252, -215, -596, -266, -300, -261, -275, -263, -254, -262, -333, -97, -11, -366, -82, 11, -206, -43, -199, 45, 64, 18, 191, -29, 263, 285, -65, 227, 248, 143, 146, 275, 50, 342, 328, 115, 437, 165, 393, 325, 199, 161, 447, 210, 435, 307, 105, 224, 10, 138, 108, 294, 229, 2]
1668BR9l2Ko7R2k15K04j25k2N7p7k03J39j49P8N1j02J25M3k39K33%j30O4j37K24
1694h5j48j2J31m8QJ42j25J00j09j22J8L42k64L05j7j79J36l4J76k79O1L66o8
1717B95j15j9k73M44L2j38K52j98j90P2K18n4j58k5j2K8l1J89m01L88j39j38J0
1740C7J84J20k0k66Q6j58R0j39l5K74m0j91q9j00J03k4j38J41n05N43j33J55Q0
1763b5l10L71l02j88O0J30p3O9j5J2P1l34L48K95l95p9J91j55J09P6k28L54J71
1786A53m7K47K34l01n6k17j8m17R09m49j40N25l66j42P33l80O02n68k81L32o28
1807b75L76N4L87n85M49l28Q8K10j25m67M12NR8l81M15k44j00J85m44L90p33J046
1829D33n23J1j12Kj41L86K18o48k30j07N61q3L14o5M24r40J57j60P89n72j24Q43
$$ y = [2, 101, 69, 71, 4, 96, -119, 85, -40, -62, -5, -82, -285, -146, -295, -217, -166, -268, -143, -100, -339, -106, -106, -236, -172, -309, -85, -233, -245, -114, -162, -154, -12, -137, -37, -146, -268, -250, 92, -172, 133, 116, -63, 73, 39, 215, -64, -3, 363, 295, 180, 161, -112, 332, 364, 226, 478, 280, 90, 162, 380, 326, 168, 143, 131, 159, 128, 317, -84, 304, 165, 27, 37, 221, 341, 321, 55, 141, -17, 73, -66, -101, 173, 133, -58, -147, -247, -144, -168, -306, -165, -670, -127, -260, -105, -25, -335, 36, -266, -454, -394, -264, -337, -268, -283, -271, -200, -534, -186, 109, -286, -365, -174, -329, -220, -144, -372, -18, 153, 106, 353, 587, 286, 230, 13, -5, -422, 487, 38, -102, 423, 57, -85, 648, 268, 870, 302, 21, 353, -275, 101, 155, 542, -43, 406, 78, 166, 376, 251, -216, 196, 201, 299, -82, 333, 89, -11, 174, -270, 120, -613, 433, -90, -79, -191, -189, -330, 56, 274, -374, -604, -711, -150, -233, 81, 16, 440, -500, -343, -503, 286, -286, -410, 433]
1851D33j014J84l71J08R59n15J07O1K35n41N30n24O42l09Q8o06M25J014q67P17
1871G56p2P4p42r2J84K2r36L23J087n27lk83P75n58K36m54N55P70n70k22k92k1
1893A0R5j79L2Jpo28K33k50P55q86J197o60j17l19J006l51q61R22O2m59P6J96
1915a32j45j69N14L33j059L87M32J51q96N05K20K43o49O0P8k59J0p87J260l76
1935b79J40M67j27k74K42N0L60m90L64o45Q75j58k25n0l4J32K73k84om30q9N49
1957C61J60j02p31L28K45L0q7J35K28q25N03n2K08q04Q75k02k25n29N60l52j0
1978b86L50j34J29m21L02L22p40M88k24l11M16j9l15L61R5q85L53J77J25P8K78
1999A39l72J74k75j15K70p4J75r1p8M13j86q5M50m4j90n8K4R2j30j34J60M08m23
$$ y = [433, -581, -397, -768, -660, 299, -216, -109, -48, 187, -354, 176, -348, 294, -15, 73, -533, -108, 906, 39, 756, 684, 758, 16, -76, 108, 130, -806, -483, 604, 77, 74, -209, 566, 8, 244, -210, 345, 1115, 545, 323, 31, 10, 105, -74, -42, -41, -48, -676, -443, -693, 62, -824, 373, -287, -404, -723, 283, -68, -929, -7, 55, -404, -328, -132, -277, -446, 68, 401, -658, -271, 161, 312, -584, -79, 141, 384, -265, -205, -127, -386, -376, -1163, 97, -279, -139, 328, 201, -73, 169, 219, 579, 89, 453, -192, 683, 525, 300, 250, 216, 348, 621, 337, 331, -99, -188, 361, 521, 419, -312, 16, 261, 291, 204, 339, 567, -258, 245, 193, 401, -403, 472, 270, 45, -484, 76, -276, -286, 64, -70, 59, -362, -60, 262, -478, 10, -214, -525, -109, -128, -443, -82, 13, -872, -519, -342, -217, -139, 139, -233, -59, -334, -449, -179, -253, -78, -169, -247, 166, -20, -105, 345, 301, 111, 53, 77, 169, 39, -95, 65, 473, 50]
2022E0L34j41j43L4K10P2l68L79o9P1m80M76j10k05J24j88k95K06n8L59k21m51
2044d14Q62k37k49K78l98P8r8L11l62j19J36N6j32L0K52m67L63j12j04K31k91
2065c86k53J47L17K65K0J13n29J65n8K81j96l33L36l27N92n87M39r7O5k79L24
2086A9J70R6K69k85j4l38L39k06k45N17m29p2M54J85k72J47j58M20q87J36L35
2107A81O8L78K1m15L26j43j80J42K9k1m60R7K65Jl01p4M06L8k28J4n80J12P34
2130D10l33j60r0N20l67m0o23O32m69J22J95l15k7N48K11m61P2J44K66j29m98
2151c92O98n50N02m14K32L7o26R93p38K53k26M35k93P90q07O0mO27k79m67K85
2172A16N5p20N23l67P77o61L05K51L09k78JJ38k31l13L22p33M27M53l86N67k78
$$ y = [50, 384, 243, 100, 134, 344, 416, 48, 427, 358, 429, -51, 425, 315, 110, 234, 46, -249, -43, -101, 258, 37, -414, 448, 211, -38, 240, -158, -80, -178, 133, -229, -348, -212, -156, -288, -258, -6, -473, -110, -222, -326, -95, -386, -639, -492, -175, 90, 110, 223, -306, -141, -199, 82, -114, -447, -111, -438, 154, -433, 6, -91, -26, -305, 19, 189, 285, 554, 269, 255, -83, 256, 50, -195, 322, -107, -179, 275, 460, 188, 335, 177, 597, -290, -154, 181, 249, 627, 648, 233, 559, 416, 236, 378, 407, 386, -74, 23, 288, 289, -12, -86, 320, 358, 130, 144, -436, -324, 410, 77, -83, -173, 347, -20, -60, -683, -51, -520, -398, -203, -518, -545, 3, 214, -247, -175, -31, 235, 106, -392, 306, -244, 258, -156, 76, 113, -513, 480, -258, -5, -231, 204, -89, 701, -106, -46, -50, 577, 298, -169, 116, 171, -549, -26, -393, 384, -277, 28, 279, 588, 310, 311, 449, 218, -95, 227, -506, -79, 374, -12, 555, 277]
2193B77l8m30P9k38N10qk83J23O1o22M35O4k88kM76l50K15n8j98K30k21M63k91
2216i4j02L82n78R2N25j63m9j5o67L16j8N15m21R9M57o09j38N13k95L29N0k27
2238i8k07n31J077o80N40l93n95Q95p64J86L12J021k48l92m22N35O29j215l5L22
2258f3K19K50j58jQ22p48QO5j49J34l32m91J01R96o33K51n93J24M91J80k35l52
2280a14p2N38m96L18m9k57m22L41k69Q45r41O45m13j66k82M73j61N17J2L8q7L69
2302C67k90k50O64m1l34O6K0m12K92n10O72L11J96j218N74O6L56J47m81p43Q27
2323B79L80q81P23o45K70o7k54Q19l10m47M10k7j7QJ43j56m54j91m6L84O52j10
2345D63k66o90M43J57o01P22o28J02k89N97j10R96q37J6M29q38k08K06k40J65
$$ y = [277, 239, -191, -112, -350, 160, 152, -131, -8, 53, -569, -134, -70, -358, -360, 116, -234, -19, -77, -275, -45, -266, 197, -94, -196, 186, -392, -300, 225, 62, 13, -2, -669, -353, -371, 144, -277, -178, 279, -330, -468, 45, -250, 79, 129, -98, -305, -836, 241, -439, 101, -292, -887, 8, -756, -570, -258, 763, 515, 123, -299, 236, 865, -350, -385, -63, 156, 406, 248, 247, 1069, 321, 329, 394, 245, 379, 47, -444, -343, 653, 20, 271, -322, -198, 293, 473, 238, -114, -186, 352, -144, 174, 125, -132, -554, -213, -482, 363, -578, 67, -346, -512, -794, -321, -482, 35, 47, 85, -2, 367, 77, -173, 491, 450, 116, 182, 202, -210, 82, -428, 244, 555, 751, -467, 107, 173, 529, 676, 195, -548, 279, 659, -222, 501, -144, 126, 59, -195, 624, 314, -133, 277, 250, 233, 241, 384, 228, -226, -417, -463, -79, 573, 463, 197, -493, -50, 107, -494, 228, -400, -298, -587, 10, -100, 896, 59, 75, 504, -334, -542, -336, -576, -411]
2365d11N08Rl11O37n80O04r3m57l51J41K69O36Q0r74P48m90j09o4j03j06J015
2386E98m78p0o05P02p16O48M16j96R6j64L45j46j12p09M70j86j3k6Q20K5l8r25
2408b64p8Q56q47P28k88N02n60q72Q63N4j60K98K3l47n89O49j7M41o65K04O03
2429E34p33N11m62m12R21l86q5p5j56j52O26j35O39r88J00P69r98R80m66J88o74
2450d54l41r9R65j94p49J056l09K63p5n93Q3J96J374o30p80K15j12L35Q6j28k93
2471a84Q03J6l78K82j65n65Q90l30n56K9j20m0M42J98q64L15q26J221J03M8p4
2492B45N61j005L91l58N70k04j075J316j126P71n25o32O62Q73o48N01o23L71n12
2511d47J40j29L47j63J30l49M81l72K69j92l74N28K77o8L25j040O95P93j128N66
$$ y = [-411, 97, 106, -205, 432, -148, 456, 363, -94, -445, -304, -35, 601, 681, -293, 455, -35, -144, -208, -311, -417, 598, 120, 50, -555, 147, -569, 79, 495, 299, 395, 231, 576, 430, 318, -391, 79, -107, -120, -146, 674, 699, 661, -264, -342, 514, -333, 395, 107, 609, 49, -823, 40, 94, -66, 232, 255, -92, -681, -32, -49, 392, -273, -69, 534, -199, 312, -150, -562, 359, -27, -112, -187, -343, -495, 131, -4, 635, -353, -253, 516, -482, 498, 32, 220, -454, -795, -894, 71, -123, -872, 184, -125, 138, 63, -530, -447, -251, 1123, 493, -287, -72, -184, 151, 237, 109, -184, 619, 635, 257, 539, 374, -191, 699, 369, -187, -158, -278, -318, 124, 322, -542, -227, -1053, 168, 271, 319, 245, 806, -199, 192, -166, 404, 200, -875, 441, -685, 86, -439, -1071, -409, 464, -184, 317, -306, 65, -447, -307, -436, -89, -252, -122, -471, 10, -362, -93, -285, -659, -131, 146, 78, 403, -637, 58, 851, -277, 289]
2531B89l11o00R68n06L85k56K88K00K34j71R4k84l91p5J12P35n6K04j258m2K98
2552a43L79q0L18q35L0Q83n20M35k45p28Q59n16J232j257J64J36P95p77n89J56
2572c03R63K23j173N60r8N29q22j28k67J153l1q70N99q3p31o3J083n73j4K14p90
2593f22J86R87o13K1J8L73N3r27L54R7J5K71J58o13N06j19n17J135P3j028N11
2614C19L8j07r1L21q40L91q2L1L50m92O53k8m80k51O16j61o59P21j10k69M35j63
2636A42L96j91k52K21k26j34O34p02o28L09M36M7j71L23n33N40N1m94rL43l52
2657b50M72j00l77l01R12k46k49J09q28R10j07K04j71P6j86k21j57P25l49N12
2677C78k04j94j09K38l60J74l23O66k27K05k11j03O9l84M75J50j93j63M41oK7
$$ y = [289, -22, -622, 346, -160, 225, -31, 257, 457, 691, 520, 614, 330, -61, -136, -24, 711, 655, 859, -399, -441, -143, 236, 156, 474, -361, -331, 552, 32, 467, 222, -506, 353, -163, 1069, -188, -24, 112, 907, 130, -459, -303, 660, 883, -290, 270, 172, 701, -121, -249, -516, 637, 606, -264, 335, 252, -479, -542, 541, -32, -46, 168, -622, -436, 551, -62, -41, -23, 350, 403, -524, -170, -73, -58, 213, 371, -242, 264, 145, -372, 763, 836, -192, 319, 357, 250, 159, 480, -360, 31, -51, -20, 330, -162, 491, 463, -17, -268, 348, 187, -472, 249, 139, -130, 305, 142, 538, 347, 95, 316, 90, -44, 590, -112, -740, -431, 5, 52, -119, 204, -329, 211, 262, -232, -241, 102, -250, 222, 122, -255, -556, 356, 110, -139, -30, -858, 52, -55, 149, -22, 54, -132, -353, -510, 215, -134, 378, 174, -20, -129, 109, -251, -77, -400, 266, 39, 244, 33, -70, -1, -385, 90, 240, 47, -116, 325, 319, 346]
2698C46j53K17j56j144R04L33m19J22QO57p51o0r9L6k7J23J40m65K98K26j62K89
2720B63n19R62m66m25o4L38K30p31N14l96K59k26j5J85J18k92L86J99m50N4J51
2741G5j35j04J83O13p65J45k7j96J45M25o09K14M46k61K76o70n4J94m4L01l3P2
2763A91J54l55j45j07j8K28J27l13O39l35n7K6j72j7L85J91k58j01K16K22m53
2784D8K50k12QO1k68L20l72J25k4Q6j56j42R5Q5l37N44l57J42L7j2M8l4k30K99
2808Dj31O2J06j73R0k43J5J8k46j43O33L7qk1l1j1K20l01l10M95p2R3m9j36J11
2833IOK21j15M0l6j72k2J97m5P2j78M6J10j65K77J1Q4k82K81k98o9J22j15j2j04
2858a37j2L53j77P2j40J24P4P3l34J91J14j47R3k31K13j40j11O1n0k2n8N7J76
$$ y = [346, 193, 410, 254, -890, 14, 347, -72, 50, 58, 715, -36, -96, -195, -159, -186, -63, 77, -388, -90, 136, -26, 263, -256, 706, 240, -185, -249, 89, 319, -412, 102, -294, -35, -261, -276, -91, 27, -265, 121, 320, -130, -76, 75, -60, -164, 19, 632, -133, 12, -15, -211, -66, 359, -250, -36, 410, 149, 425, -245, -299, -105, -149, 152, 119, 191, 345, -10, -155, -262, -280, -52, 75, -238, 401, 66, 9, 35, -137, -154, 231, 422, 164, 63, 279, 501, 48, 298, 86, 94, 155, -113, 207, -165, -40, -64, 22, -134, -276, -181, -96, -433, 111, -246, -104, -67, -79, -31, -65, -295, 4, -127, -65, 41, -132, -42, -285, -270, -252, -498, -641, -8, 29, 21, 0, -31, -42, 178, -123, -433, 62, -10, 83, 34, -102, 9, 15, 236, 121, 161, 125, -47, -69, 128, 83, 155, -23, 23, 133, -32, 245, 256, 340, 58, 339, 41, -28, 94, -21, -33, -137, -149, 204, 27, 99, -41, 83, 157, 230, -104, 87, 201, 54, 147, -84, 129, -11, -122, -61, -111, -133, -191, -134, 42]
2881D2k26K25r3o8j21J01L8k10K48M0q3l6J36j00k22J14j98M10j1qj77J3K98K3
2905A35l69Q4qJ58l6M9p7N7q4J94j06l9n2K19o1J88j67n6K54j08k5k18P0J65k3
2930A44l0J2jJ21j07J30j36R1k13%J18k63N43l37j26k63M84L9m41J95M6k6j2k02
2954b34J49Q9mj69P8j07J23P2q0j96K01j56J9J92l6J26k67J15k8K23J43l50J68
2977G1k08J72n7L6J5L0l39L01O9j31J57Q1k58J99k47RK74M7p9m0R6qk14J08r9
3002a5j68J63K22k4n4L38m70q5O07L7l83l8N6R2j59j01q2K25R9J4k49k09J92r3
3026h5J98k69N7K11k40L17l01J03j35J08o9j40K41j83J33k69J19Nq4O2L06l36
3048b51K89j98Q4J67l4j65J45k49K41m5r6r5J02K72k02K40j60q6J78j15J00M6
$$ y = [42, -184, 41, -52, -120, -241, -140, -102, -312, -64, -24, -107, -143, -7, -107, -329, -215, -413, -3, -14, -22, -199, -186, 112, 135, -234, -150, -158, 0, -36, 13, -64, -7, -91, 103, -3, -42, -94, 125, 64, 252, 85, 29, 283, 175, 150, -68, 2, 167, 144, 114, 126, 125, 246, 139, 269, 133, 224, 11, 11, 129, -134, 409, 72, -54, -317, 167, 206, -235, -40, 6, -20, -32, -234, -85, 4, 0, -169, -91, -198, -75, -3, -83, -279, -78, -234, -215, -23, -59, 67, -200, -85, -113, 110, 253, -97, 71, -137, 35, -22, 14, 29, 59, -280, 21, 90, -41, 116, 197, -61, 138, -109, -100, 174, 221, 142, 102, 198, 190, -24, 84, -15, -183, -20, 202, 178, 124, 462, -8, -93, 514, 551, 168, 130, 186, 278, 119, 18, -64, 161, 260, 274, 25, -184, 8, -85, 113, -156, -99, 112, -128, 189, -112, -9, -144, -36, -105, -245, -4, -187, -54, -323, -204, -199, -283, -221, 85, -251, 38, -160, -76, 91, 57, -108, 37, -212, 29, -16, -112, -207, -105, 167, -35, 205, 45, -41, 137, 22, 122, 168]
3070A68j69o2M1K46k01L3QR0k37J14L9j0J05j06O1j05J39J97l29j2O6j4J23L3
3094B18k18L6O3j23R3j85L3j21K75O5l15J62K3O0J60l85j16R6O3K3J05q2R1j41
3118a20L2R6R6k32N1J28j41kl06L21O6M5o5j64K55j46k09L53o1M3j11m1M56l63
3142a9Q3J25j56P4m39J43L08k01J74j20j06L51k7j72J74kk2r9K12o37L24k36L62
3165I4K16j09m51N3M02P3l38K95k45J87j74p9k65J91L8L75J39m94O22o68J53l52
3187c37N44l89J03M34k16k68J51K46k77j59P8l85O98k58R8J28r48P57Rp9j40K20
3209A0k88K54j3P1j08j03j58M39l09M31mk70N81l90o78N71L8m65N23l69L84l91
3231b44k41N13l30M30j58O00Mk23J47o10o1Q5J02J96j32k47N26m45k04L42j94
$$ y = [168, -1, -63, -22, 224, 23, 56, 64, 154, -83, 31, 70, 60, 165, 59, 120, 15, 154, 351, 22, 10, 76, 62, 185, 218, 0, 36, 99, -24, 69, -116, -83, -204, 71, 136, -179, -17, 6, 66, 226, -159, -275, -179, -116, -93, 12, -70, 21, -120, -88, 8, 104, -128, -77, 51, -90, -92, -398, -77, -11, 34, -31, -195, 60, -86, -295, 58, -3, 40, -71, -112, 344, -19, 64, 189, 33, 107, -332, -189, 119, -82, 92, -28, -134, 217, 190, 18, 192, 190, 168, 69, 281, -356, -32, -268, 94, 310, 201, -250, -197, 205, 278, -60, 235, -10, 177, 3, -76, -341, -150, -112, 263, 402, -92, 530, -138, 15, -337, 207, -182, -79, 355, 139, -129, 22, 268, -9, -168, -90, -475, 223, -35, 63, 191, -757, 0, 9, -70, -210, 10, -278, -24, -37, 34, -74, -177, -335, 104, -205, 226, 222, -48, 533, 143, -535, 36, 74, -391, 132, -237, 147, -244, -485, 28, -302, 128, -30, 570, 574, 351, 498, -112, -173, -88, 14, 210, 78, -169, 357, -88, -292, 50, -144]
3252a44J67n5L95j57j135J038p19N07Q5J72m28k4J12m42J090r16k04L31R1M71
3272B35k29M05l61M5p9j001J285k26o8l60M43l72LJ38m66N72o85J474n74O7pn59
3294c20N64l52k10R43j135M06K94L85p1j233O20M54J42L89p68n30K88j82M15j81
3314h2l9K33k25K57k18J88j07L9K71k48O5R7k27Q4N5M6l62k80k26O14j2J39n9
3337CM5r0J38m89M98l16r0L10J08j64n8k55J13J1O1K11n1L3q1j50J52Q3n3j06
3361a37M2P3J38l11L8L01l64J94J83j73M7J3J34k2k54J48J07j36PJ3K0l0J14J70
3385C15k57k46L14m7J43j28K04o6p9J19k23K01j92K7j53j26J01O7Qp0l1J60p3
3408c2m4j53J12J21j70PjK65j30M0j8j05q0m0J77P2k83K61l93N13j29lLj16J59
$$ y = [-144, 23, -32, 363, 206, -929, 109, -610, -103, -18, 154, -274, -298, -186, -628, 462, -454, -658, -327, -236, 235, 6, 411, 50, 95, 16, -985, 300, 74, 6, -354, 89, -283, -280, -142, -608, -36, -721, 753, 179, 246, 239, -320, 244, -108, -318, 625, -510, -104, 190, 575, 504, -729, -109, 345, 487, 876, 108, -422, -134, -316, 99, -82, -121, 112, -113, 144, -74, 114, 7, 46, 317, 69, 134, 231, 4, 88, 143, 189, -173, -453, -679, -65, -77, 62, 3, 48, -42, 96, -393, 105, -211, -301, 9, 117, -47, -105, -360, -247, -236, -175, 36, -15, 18, -63, -213, -61, 22, -31, -137, -95, -22, 116, -195, -157, 144, -220, -26, 157, -16, 31, 44, 178, 156, -98, 50, 157, 21, 28, 41, 61, 31, 145, 315, 58, -188, 126, 79, 222, 94, 298, 232, 153, 272, 49, 250, 58, 85, -68, -194, -93, -26, -18, -88, -119, 41, -32, -76, -229, -117, 4, -166, -159, -160, 105, -25, 15, -3, -108, -188, -228, -51, 21, -262, -1, -394, 119, -10, -13, -10, -126, 33]
3433C3j65rk6J80P1j83J40j72R3O0q6M6J67P1k05L47l67R9j01N1J11j17Q8j22
3457DJ50q4j3J38r9k32L22m29K23L04j66j08M0m7M1k2oq1J65j60J8J17j12k0J0
3482d7k3J56Q4l3q0j23ML1k90K22r5o9J43P3k05k1O8N6J00j56J26l6J26p5p1k1
3508a56J43k10L11r7p6Q9J12k6o0J28j33j37K18L2Q8j93M8o5J30j7jO2j92l9p2
3533a13L05K0n2r3N5j66K47k2M4o2j8k03K12k49K36r0j22M1J76j2j77J20K6k15
3557a12l6Q1q3j39P6K84j9M2r0n4rk54L65l51J60p3J57j04N8J22q5J47j18p7J3
3582i9M79m57j0J72nk96J1K48j83J23R2J30k0j37O8q1l2N1k51L78o5l6R4j41M
3607C7K24k90j24L87j67K9r2R5Q9r6Oj53J13j11Q9O8k05k3K64l52K97J13k23p3
$$ y = [33, -132, -141, -167, 13, 84, -99, 41, -131, -38, 22, -64, -18, 149, 220, 15, 362, -5, 94, -7, 44, 155, 38, 126, 4, 154, 70, 57, 195, 96, -136, 186, -243, -20, 284, 118, 10, 50, 3, 44, 22, 16, -65, 100, -60, -42, 75, -37, -57, -47, -70, 86, 170, 137, 57, -66, -62, -31, -321, -99, -194, -263, -120, -47, -252, -273, -205, -149, -49, -205, -79, -115, 11, -64, -135, -156, -13, -223, 88, -9, -85, 4, 116, 90, 30, 158, 25, -112, 106, 138, 226, 33, 81, 16, 146, 129, 128, 190, -2, -41, -113, 192, 212, 160, 67, 122, -44, 203, 181, 225, 163, 145, -58, 154, -95, 141, 51, -71, -30, 146, 134, -43, 77, 103, -112, -148, -67, -150, -289, -213, 71, 52, 94, 4, -50, -59, -313, 52, -299, -139, -212, -55, -159, -101, 21, -64, 83, -35, -112, -99, 380, -77, -87, 85, 80, -216, -205, 43, -140, -17, 75, 205, 185, 48, 116, 35, 3, 54, -197, 181, 116, 80, 174, 33, 37, 261, -29, -153, 234, 67, 96, 4, 99, 188, 92, 98, -55, 58, -53, 36, 104, -101, -124, 140, -212, 85, 198, -25, -98]
3631i8R7kj05j06J64J23k01RJ70k15m6o7L02o1j63J09m3j42o7M33l11J55K5j72
3655b12K59m0j49qJ44j76j7K18p1K91l80J02K57j53J3N8O9j87J48j1k41J94p3
3678C5Q9J18j99J76j25j03J33k19J64n0J62J04j29j44lJ09J26j67O5j54R5J6j28
3701b9Q3n0l7N8k34J64J1J28k23L1J09P1Q5j20m3q9K3L7m6r9p8Q0K0J15J7j68
3727a84N2N5p2J97k0Nj98J56l0K17j89Q6j29J40pj04j11J37l6l5R7k1K2J68p2
3752A24j13l4J67j96mJ49R6l9R3n3J8p6j6J33l39K97j44j4QJ7k19K20QJm3k5J66
3779A82j9l78J20K17j73j60K66p6K3j50L3p3K80j49K19l26K68p3K2j08j07K18
3801E6j11J94j80p9K11m64L29P5j32OK01j23L6R0j70j1Q1kj53J50J78j22j7J26
$$ y = [-98, -1, -3, -108, -214, -50, 73, -128, -119, 51, -164, -210, -277, 25, -36, -199, -90, -133, -275, -342, 91, -220, -65, -40, -212, 47, 7, -142, -150, -6, -182, -199, 19, -52, 239, -141, -39, 218, 65, 78, 136, 205, 18, 166, 155, -86, 108, 35, 124, 242, 43, 219, 94, -9, 124, -95, 69, 19, 181, 285, 156, 12, 9, 118, 244, 77, 142, -12, 83, 99, -29, 54, 4, -33, 25, -209, -45, -34, 94, -129, -98, 11, 82, 167, 47, 4, -85, -62, -25, -71, -170, -248, -168, -148, -33, -16, -184, -132, -77, -149, 48, 28, 33, -165, -9, -39, 178, -11, 75, -54, 86, 79, -25, -136, 1, -35, -70, 27, 6, 28, 196, 124, 11, -23, 144, -52, -56, 93, 189, 150, 243, 190, 208, 132, 116, 249, -90, 207, 63, 49, 57, 74, -145, 75, 83, 84, 41, 16, 182, 163, -215, -95, 122, -51, -211, 55, -21, 2, -148, -115, -188, 92, -57, 162, -164, 104, 31, 53, -55, -162, 56, -55, 139, -41, -120, 91, -373, -44, 31, -101, -95, 106, -17, 19, 109, -61, -72, 9, 7, -146, 4, 182, 60, 43, 169]
3825A69j67J09j87L2J61k26N6J66j4j24K83j63k53K47J0K5q3M6j76J49k1Q3n4
3848F8L1j67o7J46Or3k09M89l59K10k06L80j68p1r7K79j79j24M4p9L0mJ31j00
3872a09K9j4k5o9j3j1K09j20Q1n0j59L26k70J37m9K12j27O3j57l5L15k29j43J58
3896e0J13k20O9J67j43J54j28J10j00J29n2m2K4kn6j7J11L9O5k0r1j8j0Q9r4L6
3922F3J3r0J33l1j5k0q0K1J38j31o6r4k8p0K40j45N8J88j87J52q7j16P5P6J60
3947A57k28j50K04O9j95J29k7j33J32m2J96L1m19K17L2j13N3p3R2J24k5n7K3R1
3971H8j94J56J61j97Q6J16k71j5K51M1nj70P1rK2j25M5J37m3j36m3j48K43m0J75
3996A96k4j42Q8%K0j7l7J80l04J81j78n5j2J14k3j27N5Q0N8r3o7M0N2J14r0o1
$$ y = [169, 2, 111, -76, -44, 117, -109, -53, 113, 99, -25, 258, 95, -158, 89, 99, 124, 41, 87, -89, 60, 39, 122, 68, 99, -68, -135, 11, 17, -76, -285, 204, -155, 55, -151, 229, 61, -10, -107, 172, -7, -131, -87, -166, -136, -140, -9, -109, -80, -94, -119, -188, -201, -212, -3, -123, -42, -92, -251, 75, -195, -58, -107, 105, -22, 41, -116, -151, 164, -65, -208, -50, 63, -157, -88, 79, -64, 90, -38, 72, -28, 101, 49, 7, 31, 29, -27, -44, 67, 106, 171, 151, 60, 42, 32, 121, 27, 63, 76, -14, 119, 88, 73, 53, -27, -6, 132, 1, -65, -159, -187, -257, -17, -162, -104, 84, -103, 49, -38, -154, -79, -3, 157, -71, -221, -17, 52, -143, -14, -41, -174, -42, -84, 112, 143, -276, -59, -27, -140, -87, -160, -68, 56, 31, -26, -3, 88, -106, 50, 211, 14, 100, 216, -55, -70, 181, 222, 217, 47, 118, 109, 131, 6, 51, 188, 145, 9, -34, -182, 61, 21, 196, 172, 30, 118, 118, 138, 121, 84, 264, -40, 141, -37, -92, -104, 10, -13, -140, -85, -5, 53, -40, -107, -67, -15, 99, 9, -52]
4022e2k64J26k12n7N76m90N75l80K41j44J08J73j68n6J65k96J28k47L09L9p8k47
4044b51N91l61j9L56m52K28j64O8L8L9J32J29j38j20m7P3j62K33j73J73L1r7p1
4067C6j2Q5k39L91k6l64m8K70R2l6k50J36J00%j77j13L26n9l19O1O5P7J73k03
4091c4Q2k96K62j34M7J59L3k69J71j11Jm7j5K45j00k49K11k0N5qJ4j06K15l74
4115b68K83K34j9k37J83k41o9K18l42M32k50K05j65qJK55j30K1r8NJ26k05J12
4138D3j38L11j58J05l6n5Rm2Ll3j78K13p2l7l3J00j32N3L1M7q6K06k32L03j28
4163F4j7l6j80K75k04L11l77J12N4j34Q2J50kj74o4K08m5j52m7n6M44k08J3N2
4187F9q0K78l92j68M68j32j12j70L46o7j71K22k34J72N2J8j07K15j28P3j96N0
$$ y = [-52, -316, -190, -402, -459, 117, -373, 202, -178, 63, -81, 27, 200, 32, -24, 141, -155, -27, -274, 35, 74, -4, -251, 340, -21, -40, 316, -136, 92, -72, -4, 34, 73, 205, 334, 196, 76, 29, 102, -60, 173, 0, 173, 204, 107, 36, 24, 109, -130, 261, 235, -129, -177, 93, 185, 149, -101, 35, 135, 135, -42, -155, 171, 112, -207, -146, -81, -4, 169, -34, 48, -248, 14, -120, -73, 86, 119, -150, 21, -90, -89, -136, -151, 94, -6, -255, -44, -64, -9, -17, -3, -109, 106, -268, 15, 249, 230, -7, 176, -65, -134, 84, -258, 174, -76, 129, -36, -44, -43, 212, 82, 103, 5, 10, 136, -69, 43, -95, 216, 58, 163, 127, 72, 81, 39, 42, 9, -169, 44, -28, -65, -98, 2, -130, -77, -46, 1, -85, 121, -111, 192, 64, 47, 11, -169, 106, -98, 213, -164, -52, 2, -132, -50, 100, 98, -76, -140, 68, 23, -129, -176, -232, 212, 4, 17, 69, -11, 267, -125, -293, 175, 43, -69, -239, 107, 40, -131, 91, -143, 29, 81, 99, -8, 207, 79, 152, -44, 6]
4209FK5J63j22Rk46K53l6P5j04j46J38K0M0L2m8j76L85m5q8j35K8M0r6J30j79
4234g7k16O6L48l25J52j22L11k86n0J72J07k23J70O2l52K13o8j6p1P3N5k5K28
4257A26k57Q9n6J00J02k85L04l51J92k17L85l21jJ75J44k01J4K82o3j32J02k33
4279a02Q0P0k8J80l10N8j88L04R4j19j38M8m0Q4J24N2j15k17J46L3L8n0P6k42
4303a62O21k05m26O07m52j35K42N38j403M91N18j2j32l62K37j5jQ0j67M9P9p3
4325h3l7k44L30j02N5k5J54k50N3k0J12j29L90k94n2L31k73N9O5k86J11J20O1
4348D6q4K36l07K67j33j62J64J99k61j51K29K9P7m8L2n4l4n4K7J14k96L7K95m26
4372b58K33j22J89R6N7p6j25n8K07j14Q6o6j9oj12q8K49j57OmP2n4J57J84m17
$$ y = [6, 31, 194, 72, 81, -165, 88, 52, 127, 23, -123, 15, 35, 75, 107, 59, -117, 268, 223, 135, 0, 28, 68, -28, 102, -77, -293, -227, 121, -204, -52, -174, 137, -149, -199, -27, 80, -143, 27, 89, -263, -50, -118, -134, -205, -132, -77, -102, 126, -131, -42, -98, 2, 104, -181, 123, -228, -36, -253, 132, -189, -190, -15, 129, -72, -58, 224, 161, 29, 131, -102, -22, 48, 20, 200, -110, -52, -240, 64, 158, 39, -99, -51, -91, -7, 117, 169, 54, -163, -17, 16, 54, 4, 80, -162, 459, 254, -172, 435, -17, -152, 90, 628, -775, -284, 234, 222, 90, -272, -35, -50, -51, 29, -138, -89, -10, -83, -120, -364, -34, -136, -81, -106, 48, -202, -149, -169, -57, -186, 204, -90, -142, 189, -84, -25, 40, -246, -135, -15, 46, -38, 198, -109, 158, 25, -137, 27, 226, -35, -186, 43, 72, 149, 101, 133, 79, 45, -9, 18, 132, -164, -127, 168, -258, -25, -147, 42, 138, 195, 119, -6, -64, 143, 29, 115, 49, 30, 24, -88, -176, 73, -84, -78, -82, -10, -64, 93, 277, -140]
4397a40K92j49Jj30J81k16K84j97J6J68k2k11m5J49R5M7k0m7k08J87Q1j26P6J26
4421A92k81K5o3N7QJ82k22Q8L9K9m8J05Q6k6j63n6J27q4N4l3K73m05L14j51O8
4446A15M2p4j93J4J66J40p9n0j28O9o5k5K87j05j67j9o7R4N3m3J33M7l09J4J90
4471D0m7j02J97j84J20j40J36j02j60K80q5L2p3J50j5k99L3k07L08qN2l2Q3j29
4495a52J10J15j91K52J3n2l91J33q5K56N1k29O8L42P5J9k73N3r5j26K92l03K39
4518A21R6j53j78K46K06k30Ro1l20k6R2j18N79m9o13O01k62j53L26k4n87O28k65
4541a35n9L90j1j59j08K17J24j62j34j36L25k8m48K99j27qN2R4P24n64K13l06
4563E3m7M50q72K14kK38O7k2k19m6P35p08K58L08p33O88q17P08l36O12p21M03
$$ y = [-140, 152, 3, 4, -126, 55, -161, 123, -74, -58, 110, 88, -123, -168, -19, 76, 123, 103, 56, -152, 35, 116, -10, 66, 192, -89, -64, -127, -70, -62, 120, -102, -14, 25, 54, 6, 111, 197, 171, 8, -48, 79, -5, 49, 16, 289, -116, 198, 47, 115, 157, 83, -110, -96, 70, 210, 131, 81, -47, 22, -43, -68, 219, 114, -53, -72, -139, -45, 8, -35, 98, 145, -164, -150, 40, -7, -109, 88, -96, 24, -116, 20, -82, -242, 38, -47, -15, -88, 62, 47, -252, -219, -426, -118, -126, -74, -106, -23, -152, -42, 73, -118, 134, 147, 95, -296, -163, -248, 8, 59, -170, -102, 240, 315, 334, 61, 114, 19, -107, 185, -118, 121, 217, 64, -114, 132, 338, 108, 117, 56, -264, -290, -198, -316, 263, 214, -399, 202, -60, -213, 113, 89, -498, 130, -135, -194, 196, 185, 26, -82, 135, 259, 97, -37, -173, 152, 124, -324, -25, -152, -160, -108, -14, 710, 146, 359, 53, 6, 456, -416, -202, -204, 34, 101, 79, -140, -186, 549, -159, 99, 407, -326, 362, -455, 253, -83, 529, -192, 211]
4585B11q6j23K26j48M31r8r43M67K2j83K80J31M48p56k96j12L09L92l45N26o79
4606c26j60M69j0L45Lm42L48j12n03N57J53J06n40P64o57J99j54j11k58k10J029
4627D90m97M57j033Q06r03j32K26O89L67q55L25L53p73M29K65r1m90Q27k6p64
4647c30M89l61Q91m18M2m25m50Q84o02L05o78P36O8n78O31q2j94L39K29Kk01m45
4669a48L34Q45j052r0N58k31k86q0J8k30M00l92j25N88J19l41Q5J70k2j50j87
4690b17K59o68O34j99K57o0m5k95P88l69k88M5J97m5l40M45k3J69o55M47k64K06
4712b1R1m00K10Q2L13k47n4j85P6m35N61Q7r9L04n45lO41q12M06J15J78m08L36
4735A91m30J86j15J89p0K95n22M14M6n72Q1K63o93R28p86O60k46j65J132q96R42
$$ y = [211, 125, 2, 228, 80, 511, 413, -530, -63, -41, -224, 56, 187, 635, -121, -417, -529, -220, 172, -173, 353, -326, -486, -17, -27, 318, 321, -121, 227, 115, -388, 169, 322, 428, -112, 652, -5, 194, 40, -71, -329, -539, 490, -7, 450, -583, 223, -680, -812, -586, 103, 470, -385, -60, 293, -480, -51, 214, 123, -367, 460, 434, -330, 159, -202, 689, 271, 313, -112, -562, 322, -280, 25, -653, 83, 151, -427, 204, 122, -72, 267, 496, 498, 297, -148, 186, 1031, -21, -111, 447, 216, -70, -150, -132, -362, 38, -354, -479, 109, 228, -113, -28, 142, 120, -30, -217, 42, -626, 8, -191, 66, 6, -39, -334, 454, 85, -203, -158, 39, -6, -346, 99, 76, 245, -410, 37, -227, -21, 70, -330, -120, -38, 275, 28, -26, -211, -135, -570, -9, 78, -21, 283, -262, -265, 376, -436, -30, 85, 263, -145, 191, -239, -53, -168, 21, -49, 246, -276, 138, 184, -388, -307, -44, -737, 191, -595, 65, -181, -346, 786, -110, 832]
4756H32o82K18nl27L02k71k27l15J171r60J60k11R96m27k68P6k47K71q9L83j318
4777i38J447m36K06J59q07N39m43K14K74J85p70L54J40J17M52j158R32l49N40
4796F58j309O88l85l28J507q67K29k8p81J37R42n0N42p15K45j154J159m16O26
4815G00n15j77N13L5j106J342l60j96l31M79J44k60l88l41L82K63M37o75j47K23
4835B2j01R2k92l13P21k33L8r1O47j54P5n97K54N9J7m96N42j62J79k53n9j2Q5
4858c2J74m84M86j32n0J87p8k21J41P0j64J3J04L9j62R7K14k64K68j90j0J6M6
4881F8o0J25r6R1j18n7m4L57k78P2Jj10K32n27M00J77j07j26J52j86K25j4m54
4904b77L54j8k70L13p5k2j31J46J98r0l28J68R9N1mn6L1k51M8m8K9Q2L8Q3O4o1
$$ y = [832, 150, 368, 363, 36, 338, 67, -160, -475, 696, -264, -104, -315, 681, 254, -14, 62, -185, 86, -3, 380, -938, 509, 73, 279, 438, -369, 170, -273, -59, 215, 400, -370, -16, 124, 241, 693, -465, 467, 118, 658, -651, 37, -348, -676, 831, -36, 193, 165, -616, -479, 463, 413, 955, 240, 485, -669, 490, 74, 700, 185, 8, 521, 556, -550, 792, 432, 236, -95, 384, 528, 268, -120, -461, -79, 184, 621, -54, -201, 22, -79, 13, -279, -592, 129, -104, -66, -157, 490, 336, 411, -186, 68, 127, 144, -352, 190, 28, 207, -46, -105, -117, -32, 142, -342, 144, 12, -38, 149, 71, -150, -9, 61, -103, -90, 14, 53, -109, -12, 202, -62, 206, 16, 6, 22, 68, 8, 133, 37, 128, 10, -47, -91, 266, -12, 60, 61, -49, 183, -344, 56, 233, 126, 0, 152, -34, 191, 177, -277, 77, 59, -211, 102, 27, 5, -126, 20, 218, 128, -200, -32, 67, 118, 114, 58, 89, -162, -114, -162, -133, -51, -13, 70, 134, 73]
4930G3j16J76j8k01L9J39m2j40J35J10j77J3m0j14J60p1k5K08J32k62LJ48k66
4953a36J08K83r9j18l1J54m07M64Rj18N8j08j82K27L8k6j19J4M9L1l05L58k80
4976a36j47L58k4R0j40j30n8L47J10m51L1L88m33j57O4J33L03q0o6J10k52l35
4998d75K44J59p9R7j58O78k46k56k43J30L41k39l20K11L7k00J092o50m31j24M16
5019a6J56J31o4j39o82M36K11j78j10L66J77O9Q6l33m83O50n39K63n11L79MJ18
5041il86M5K24J16J67K98l53r12Q91k0J34o21L48o97J035r55P90J19l61l96M31
5062a12N21r61J88O32n53M11l86n00R15j43k71o43R21n7K27j95J25J5o21L70N7
5083f0L71n90o16R31m13L97k04J56l04K31R4j99M04m33K87j74R6L72K5k04M0l84
$$ y = [73, -43, 133, 115, -86, -47, 92, 50, -90, 45, 155, -22, -9, -49, -163, -3, -74, -99, 109, 241, -21, -18, 130, -136, -28, 255, 156, 38, 7, 161, -246, 218, 227, 109, 167, 59, -123, 104, 142, 116, -3, 11, 60, 91, -214, 144, -136, -283, 75, 51, 141, 1, -129, -187, 160, 270, -181, -150, 238, -195, -352, -288, -155, 148, 68, 2, 112, -140, -475, -231, -72, -151, -54, -212, 466, 220, -36, -279, -149, 192, -47, -367, -156, -119, -319, 773, 123, -308, -432, -16, 140, 271, 207, 68, -614, -178, 33, -145, -255, 111, 288, 357, 443, 110, -373, 277, -262, 1, -510, -131, -127, -9, -395, -350, -126, -10, 157, 455, 102, -810, 81, 61, 195, -426, -78, -775, 260, -695, 95, 214, -147, -543, -112, 409, -552, -364, 268, -285, 126, -260, -760, 155, 12, -259, -902, 19, -38, 189, -6, 119, 134, -487, -117, -60, 311, -279, -895, 36, -377, 20, -184, -28, -332, -101, -7, -206, 198, -235, 52, -122, -26, 346, 371, 167, 207, -177]
5105a77l4Q68r48r3K05M49j41l02P85k14l4j83o33K76L88p47O87K32k99l21R38
5126G02j040J02J95j93J80k23l06Q45j15n49P47j85l94j08N27M29m73j90j69L50
5146A32k58n1J14k42k57O27m05J04J27K8r7r6j85J84J3J11k18m38J298k37m42
5167a88M29p9o70M15K41m07o9N64o8J93j154N13J98jK19l20L32M45j60k58l9J02
5189B38j22j68j20O42n4l08Q0r1p26N63M00r03O82j65L51k36j90k77O03J71n12
5210a42J76Q6j71k33J29M41J58o49K88j55L2j62P7l1O37p88L04l67L46p3J79K04
5232B86n03K9J35l30J96J45k4J40p5p1j15J53r5rK04m8K8m3J96k19k6j68L21n6
5256E1j22K13L5N5m8k72J4K16lk01k19M15n3l53M18j67nL02k31n0n8l5K44k01
$$ y = [-177, -211, 657, -291, -384, -179, 270, 129, -173, 612, 398, 364, 181, -452, -176, 212, -535, 152, 384, 85, -236, 702, -338, -236, -41, -234, -54, -277, -583, 262, 147, -402, 345, 160, -234, -342, 185, 614, 141, -49, -218, 132, -126, -177, -63, -305, -562, 65, -340, -236, -109, -81, -178, -274, -459, -275, -262, -151, -369, -807, 491, 254, -188, 241, 162, -508, -93, 148, -259, -328, 236, 168, 361, -793, -280, -82, -83, 136, -184, 148, 593, 433, 175, 136, 238, 116, -52, -172, 470, 416, 108, 188, 97, -629, -66, 334, -569, 113, -52, 299, 63, -127, -404, 199, 370, -142, 34, 120, -51, -284, -155, 286, 444, -205, 83, -72, -40, -202, -125, -156, 481, -307, -3, -370, -24, -97, 82, 286, -217, -188, -53, -383, -187, -42, -66, 74, -1, -72, -187, -34, -129, -138, 66, 18, 46, 3, 199, -20, -46, -214, 107, 51, -71, 142, 177, 232, 184, -88, -74, 142, 139, -62, -281, 134, 81, -272, 146, -21, -26, 276, 45, -5, -63, -98, 146, -55]
5280e5QN9j82L52j05k10K0J84j7O4l01Q6L0M18l22k3J60m18N03k49j17K54k52
5303a13O6j18Q2R2n8K87j39j78O8L4n7N6r8K15k1k06N0q8J58j03j5L35l71j20
5327b42Q0L15j70N8r0N2o5m7K58J19l35J78k52n2L02J08j73j11J00k9Q3k47L36
5350A76k92K6J21o4J9P9n2J03J05k37j07L09j93R0J20j18m1k86R7L9L54j36l8
5373G4l5j8J8j3j12P1J51r8k17M37j87l08K05Qj8L4k54K87J4j77K14p6O0l9pj33
5399a19J69m4P1o8j49J88k35J41J44k69J76j54J80j61J70l7Q1j05k6R8p0M1m6
5422b4O7k21OJ02J46j35N8M2lP0j63J45K2o7j7j08J35pM2l1j76J71p3N9j90J56
5448FJ22J2k54J49Q4l55K81m3j29J55O0j72Q8qO9j87J65p5j0m8j88K53M1j38L17
$$ y = [-55, -47, 12, -170, 182, 77, -133, -113, 71, 54, 118, -183, -97, -67, 351, 29, 6, 166, -252, 251, 2, -115, 139, -113, -47, -165, -83, 9, -49, 238, 99, -79, -11, 23, -34, 22, -76, 139, 118, -88, -38, -126, 32, -71, -86, 249, -122, -242, -162, 153, -17, 41, -49, 3, -62, -109, 149, 268, -67, 111, -141, -193, 109, 217, 44, -67, 33, 4, 87, -160, 176, -116, -90, 31, -33, -14, 65, 13, 116, 221, -16, -123, 186, -7, 83, 203, 85, 44, -242, -145, -106, 248, 112, 74, 39, 21, 39, 26, -86, -15, 136, 38, -179, 258, 71, -237, -32, -24, -42, -8, -262, 25, 39, -138, 76, 0, 60, 21, 14, -119, 50, 6, 77, 9, -140, 48, -187, -46, 98, -171, 5, -149, 31, -130, 40, 3, 84, -21, -47, 51, -19, 22, -24, 43, -178, -172, -70, 76, -59, -1, 41, 38, 108, -55, 90, 112, 45, 28, -80, 55, 48, 90, 59, -117, 54, -19, 40, -150, 6, 128, 140, -114, 35, 119, -236, 45, 2, -127, 28, 88, -84, 4, -4, 65, -122, 43, -32, -42, -90, -278, -25, 16, -122, 195]
5473A95k22qO1kO8k10J00M8j0j45K62j83P3J38k32j61L09J32k60o2P7K08j10o0
5497Fj12J28j58O7j34M09o0j28J40L5j63L38l44J84j78M7J12j43j34J50O1k66
5519a43N3P7j27J65K6l7q9j79L47l54J9K78l2L3J27p5k73L21l5o0q7J6L6j42K24
5544H9Pj62J61m21K21Q7R4k60J88J08R0k92N9Pn0R9k85K68j17J26J24J23K8m72
5568a80K67K26q8N93l90o64J03M4K57k56k57k3m74J738q86j67J89K00L00l72l11
5589a51l9o2J35L98l06o5J56M0j69J24q0j20R8lk9l96O03j15m02R26j85m26K63
5612A95l49M01j36k83N28l66k79n4P10m59k51N46L80q16R31r85O9J40j71Q08p40
5633a81J96K09K50n28q1K31k03L50j74R1k83J76n5j96L24Q4k51L9K24k55L9p1
$$ y = [195, -27, -35, 26, 24, 92, -118, -18, 30, 20, -125, 137, -46, 27, 165, -67, -228, 81, 213, -47, -109, -32, 176, 66, 6, -106, 22, -136, -69, -203, 206, 146, 18, 158, 193, 30, 368, 24, 208, 30, 77, 189, 46, -88, 62, 123, -143, -90, -13, -140, 25, 51, 14, -75, -254, 93, -261, -242, 36, 4, 37, 164, 89, -184, 137, 102, 42, -45, -29, 7, -135, 89, 96, -66, 95, -326, -105, -18, 76, -184, 4, 112, 202, -90, -31, -24, -74, 25, -260, 8, -109, 17, 141, 264, 292, -180, 87, 313, 225, 818, 428, -236, -133, -89, 168, -88, -345, -368, -842, 896, 10, -157, 32, 232, 532, 160, -151, -190, -252, -117, 281, -25, -90, 66, 106, -63, 61, -19, -139, -41, -44, -73, -469, 134, 19, -383, 543, 358, -68, 195, -154, 247, 111, -172, 356, -10, -289, -343, 367, -92, -343, 203, 583, -233, 698, -287, -218, -78, -249, 559, -181, 15, 224, 474, -54, -135, 96, -107, 243, 69, 160, -123, 53, -2, -198, 126, 210, -41, -2, 222, -33, 6, -65]
5655f5Q9l7m9J05j65J33%L0nqk07J47J07m15L77J7P7j82J00j43J53o1j32O8jJ09
5681D2j84Nj0J27R9K0j55J4j09J08j52K03r7K80p4p6m5k34J96N4NPJ2N3rR2j23
5708D9l8J01m4j54K24j39%pJ80k23m5k6K38J8q5j89N9J63j3J17j44KKj70Q3r3
5734a34K36o3p2J96m67K58q8J71k0k5j15J46J08qj04k19O3J26j16R3J6K26m36
5757b28K72nm8J3j32J03l0j33J08j1k5N0J11K3j72K08p9K3o7o8L1K57l16K83l12
5782a44J92m0k1J67k21M4K10j51O2J77k28J65j29K22l08m9l7K24O4r8o1r2k11
5805b63L19r3pK43j49m8M7k03J75j09J67j38L7J59l13J17J57j00j7M4M8k3k86
5828b36k4J96Q5J37p5k00j44Q4m1Q8J63j18K11m0L1n6k23K43J47l46J56l6q5K44
$$ y = [-65, 24, -13, -62, 43, -122, 11, 11, 41, 36, 28, -179, -32, 75, -340, 37, 54, 131, -51, 49, -94, 59, -2, -134, -66, -67, 42, -142, -137, -147, -20, 79, 99, -56, -42, -151, -43, -195, 8, -89, 191, 117, 41, -4, -238, -42, 12, 17, 24, 36, 89, 80, 172, 49, 11, 112, 68, -86, 138, -1, -1, -8, 172, -51, -96, -122, 116, 134, 49, -140, -81, 82, 69, 186, 42, 44, 46, -124, -41, -134, 102, 39, -33, 163, -304, -46, -134, 37, 17, -8, -123, 23, 131, 123, 19, -200, -137, -11, -127, -34, -18, 208, -228, 44, 39, -9, 4, -128, -25, -55, -188, -80, -91, -116, -66, 45, 68, -104, 104, 25, 48, -19, -87, -56, 201, -115, 168, -144, 48, 8, -13, 154, -67, -23, 187, 36, 98, 275, 47, 212, 83, 305, -3, -52, -89, 135, 199, 101, 40, -52, -263, 56, -37, -44, 199, 50, 2, 49, -154, 21, -88, 79, -59, -22, 137, -176, -59, 98, -2, -19, 25, 73, 50, -236, -260, -64, 21, 158, 83, -117, -261, -177, -218, -130, 33, -85, 126, 86, 117, 61, -162, 81, 228, -118, 38, 2, -83, 161]
5852A61l02K49k91L0o4K89K6k25J57J23j8r0k7p0QJ32j06J25J23l18n2L93j96
5875E7L0k2J11k64P6noJ85n1n3M2r7M4r1J07k2j09N0LR0m4j3j35J35p0l3J53n0
5903A8l1q2J31R3k22k5L04j25k2J5k0j14J16l23K13j36LK64l4j45J07o1J13o5
5927b8L1Q4Om6m0k61K68J7l10K58K80l96l0K82o8j18J61r6J39n9j60J78k04J63
5951E1p5K8J9q2J79j0J29j33Q1k21k1J84k7j44O9Q5o7k9QJ0j03J52p3j48R3q8
5977a33j20M28j10j03k3J55k38L26j44j35O2J27j23L8j03K47j86M7n1p6M1K7L1
6000a6m5J61j48K49j69l6q6J17j42K19o7l2j18j58L36%j39o5Q5J42q8r7L08k03
6024Hj27J72KO8k09K41o9J13o9j35O8J02j84J28j68J75j36J99j60l6M4l32J60
$$ y = [161, -141, 108, -183, -153, -217, 72, 98, -127, 30, 153, 135, 45, 18, -52, -44, 88, -18, 107, 230, -88, -140, 253, 57, 87, 65, 176, -88, -12, -17, -23, 162, 111, 58, 100, 3, 47, -44, 63, 41, -68, -18, -15, 75, 31, 18, -117, 18, -52, -85, 68, 18, -13, -95, 36, 129, -93, -118, 186, 61, 39, 54, 34, -80, 36, -287, -74, -210, -207, 57, 23, -122, -15, -76, 37, -28, 3, 87, 93, 47, 7, -254, 14, 31, -279, -21, 259, -137, -167, 115, 47, -71, 90, -6, 133, 74, -86, 92, -112, 51, -24, 4, 23, -59, 120, 110, 239, 106, 187, -34, -55, 129, 102, -42, 27, 112, 45, 16, 24, 34, -69, 83, 10, -138, -45, -133, -253, 175, 65, -38, -61, 94, -144, 182, 38, -97, -35, 92, -31, 7, -96, 151, -35, 12, -39, -115, -74, -47, -16, -61, 100, -48, 201, 32, -4, -90, 27, -115, 104, 37, 5, -113, -271, 65, 65, -74, -139, -54, 88, 0, -97, 211, 8, -119, 53, 55, 123, -86, 155, 86, 199, 130, -5, 63, 165, -19, 109, -59, 116, -20, 179, 19, -17, 27, -305, -145]
6047a45M0j24K83L0j07K3NJ52r2j18j03J29J23r8j52K41m7j95j7J41k4rR1m0k71
6072b84J32K24J3j38Nq0J24j21K46j67N1k69O3L23k96M10k80J0j71M07k72M00
$$ y = [-145, -105, -229, 54, 84, -23, 0, 5, 157, 65, -53, -156, -27, 96, -2, -154, 87, 40, -155, -172, -31, -55, -64, 27, -13, -284, -152, 72, 85, -53, -48, -128, -4, -125, 121, -46, 5, -264, -201, 122, -174, 236, -44, -34, -205, 202, -70, 330]
$$ [...]
8191E3
##END NTUPLES=NMR FID
##END=
