##TITLE=1H_SR36_oil2
 CDCl3, 8 sc, 
 12.05.2021
##JCAMPDX= 6.0         $$ Bruker NMR JCAMP-DX V2.0
##DATA TYPE= NMR FID
##DATA CLASS= NTUPLES
##ORIGIN= UXNMR, Bruker Analytische Messtechnik GmbH
##OWNER= root
$$ XWIN-NMR		Version 3.5
$$ Wed May 12 13:22:03 2021 Russian Standard Time (UT+4h)  she@DPX200
##.OBSERVE FREQUENCY= 200.131506
##.OBSERVE NUCLEUS= ^1H
##.DELAY= (6, 6)
##.ACQUISITION MODE= SIMULTANEOUS
##.ACQUISITION SCHEME= undefined
##.AVERAGES= 8
##.DIGITISER RES= 18
##SPECTROMETER/DATA SYSTEM= spect
##.PULSE SEQUENCE= zg30
##.SOLVENT NAME= D2O
##.SHIFT REFERENCE= (INTERNAL, D2O, 0, 15.7039)
##AUDIT TRAIL= $$ (NUMBER, WHEN, WHO, WHERE, WHAT)
$$ ##TITLE= Audit trail, XWIN-NMR		Version 3.5
$$ ##JCAMPDX= 5.01
$$ ##ORIGIN= Bruker BioSpin GmbH
$$ ##OWNER= she
$$ F:/spectra/data/she/nmr/H-F/1/audita.txt
$$ ##AUDIT TRAIL=  $$ (NUMBER, WHEN, WHO, WHERE, WHAT)
(   1,<2021-05-12 13:21:01.37 +0400>,<she>,<DPX200>,
      <created by zg, POWCHK disabled, PULCHK disabled
       configuration hash MD5:
       00 E9 B6 7A A2 85 ED C7 34 08 36 98 17 FE 4E 26
       data hash MD5: 16K
       3A C5 75 77 08 9B 5A 97 B7 7A 22 A4 4C C8 F5 3B>)
$$ ##END=
$$ 
$$ hash MD5
$$ 8C F4 EF 44 DE 9B 19 F4 0F 15 E0 E7 C2 B8 F3 A9
##$RELAX= 
##$RELAX= 
##$RELAX= 
##$RELAX= 
##$RELAX= 
##$RELAX= 
$$ Bruker specific parameters
$$ --------------------------
##$DU= <F:/spectra>
##$EXPNO= 1
##$NAME= <H-F>
##$PROCNO= 1
##$TYPE= <nmr>
##$USER= <she>
##$AMP= (0..31)
100 100 100 100 100 100 100 100 100 100 100 100 100 100 100 100 100 100 
100 100 100 100 100 100 100 100 100 100 100 100 100 100 
##$AQSEQ= 0
##$AQ_mod= 1
##$AUNM= <au_zg>
##$AUTOPOS= <>
##$BF1= 200.13
##$BF2= 200.13
##$BF3= 200.13
##$BF4= 200.13
##$BF5= 200.13
##$BF6= 200.13
##$BF7= 200.13
##$BF8= 200.13
##$BYTORDA= 1
##$CFDGTYP= 0
##$CFRGTYP= 5
##$CHEMSTR= <none>
##$CNST= (0..31)
1 1 145 1 1 1 1 1 1 1 1 1 1 1 1 1 1 1 1 1 1 1 1 1 1 1 1 1 1 1 1 1 
##$CPDPRG= <>
##$CPDPRG1= <>
##$CPDPRG2= <>
##$CPDPRG3= <>
##$CPDPRG4= <mlev>
##$CPDPRG5= <mlev>
##$CPDPRG6= <mlev>
##$CPDPRG7= <mlev>
##$CPDPRG8= <mlev>
##$CPDPRGB= <>
##$CPDPRGT= <>
##$D= (0..31)
0 1.2 0 0 0 0 0 0 0 0.06 0 0.03 0 0 0 0 0.0002 0 0 0 0 0 0 0 0 0 0 0 0 
0 0 0 
##$DATE= 1620811260
##$DBL= (0..7)
120 120 120 120 120 120 120 120 
##$DBP= (0..7)
150 150 150 150 150 150 150 150 
##$DBP07= 0
##$DBPNAM0= <>
##$DBPNAM1= <>
##$DBPNAM2= <>
##$DBPNAM3= <>
##$DBPNAM4= <>
##$DBPNAM5= <>
##$DBPNAM6= <>
##$DBPNAM7= <>
##$DBPOAL= (0..7)
0.5 0.5 0.5 0.5 0.5 0.5 0.5 0.5 
##$DBPOFFS= (0..7)
0 0 0 0 0 0 0 0 
##$DE= 6
##$DECBNUC= <off>
##$DECIM= 32
##$DECNUC= <off>
##$DECSTAT= 4
##$DIGMOD= 1
##$DIGTYP= 9
##$DL= (0..7)
0 120 120 120 120 120 120 120 
##$DP= (0..7)
150 150 150 150 150 150 150 150 
##$DP07= 0
##$DPNAME0= <>
##$DPNAME1= <>
##$DPNAME2= <>
##$DPNAME3= <>
##$DPNAME4= <>
##$DPNAME5= <>
##$DPNAME6= <>
##$DPNAME7= <>
##$DPOAL= (0..7)
0.5 0.5 0.5 0.5 0.5 0.5 0.5 0.5 
##$DPOFFS= (0..7)
0 0 0 0 0 0 0 0 
##$DQDMODE= 0
##$DR= 18
##$DS= 0
##$DSLIST= <SSSSSSSSSSSSSSS>
$$ [...]
##$SUBNAM2= <"">
##$SUBNAM3= <"">
##$SUBNAM4= <"">
##$SUBNAM5= <"">
##$SUBNAM6= <"">
##$SUBNAM7= <"">
##$SUBNAM8= <"">
##$SUBNAM9= <"">
##$SW= 16.9725357007746
##$SWIBOX= (0..15)
0 0 2 0 0 0 0 0 0 0 0 0 0 0 0 0 
##$SW_h= 3396.73913043478
##$TD= 16384
##$TD0= 1
##$TE= 0
##$TE2= 300
##$TE3= 300
##$TEG= 300
##$TL= (0..7)
0 120 120 120 120 120 120 120 
##$TP= (0..7)
150 150 150 150 150 150 150 150 
##$TP07= 0
##$TPNAME0= <>
##$TPNAME1= <>
##$TPNAME2= <>
##$TPNAME3= <>
##$TPNAME4= <>
##$TPNAME5= <>
##$TPNAME6= <>
##$TPNAME7= <>
##$TPOAL= (0..7)
0.5 0.5 0.5 0.5 0.5 0.5 0.5 0.5 
##$TPOFFS= (0..7)
0 0 0 0 0 0 0 0 
##$TUNHIN= 0
##$TUNHOUT= 0
##$TUNXOUT= 0
##$USERA1= <user>
##$USERA2= <user>
##$USERA3= <user>
##$USERA4= <user>
##$USERA5= <user>
##$V9= 5
##$VALIST= <valist>
##$VCLIST= <CCCCCCCCCCCCCCC>
##$VD= 0
##$VDLIST= <DDDDDDDDDDDDDDD>
##$VPLIST= <PPPPPPPPPPPPPPP>
##$VTLIST= <TTTTTTTTTTTTTTT>
##$WBST= 1024
##$WBSW= 4
##$XGAIN= (0..3)
0 0 0 0 
##$XL= 0
##$YL= 0
##$YMAX_a= 321852
##$YMIN_a= -248596
##$ZGOPTNS= <>
##$ZL1= 120
##$ZL2= 120
##$ZL3= 120
##$ZL4= 120
##$ABSF1= 10
##$ABSF2= 0
##$ABSG= 5
##$ABSL= 3
##$ALPHA= 0
##$AQORDER= 0
##$ASSFAC= 0
##$ASSFACI= 0
##$ASSFACX= 0
##$ASSWID= 0
##$AUNMP= <proc_1d>
##$AZFE= 0.1
##$AZFW= 0.1
##$BCFW= 1
##$BC_mod= 2
##$BYTORDP= 1
##$COROFFS= 0
##$CY= 11.3945322036743
##$DATMOD= 1
##$DC= 2
##$DFILT= <>
##$DTYPP= 0
##$F1P= 15.9154993809931
##$F2P= -4.1035820241983
##$FCOR= 0.5
##$FTSIZE= 0
##$FT_mod= 4
##$GAMMA= 1
##$GB= 0.15
##$INTBC= 1
##$INTSCL= 1
##$ISEN= 128
##$LB= 0.24
##$LEV0= 0
##$LPBIN= 0
##$MAXI= 10000
##$MC2= 0
##$MEAN= 0
##$ME_mod= 0
##$MI= 1.114404
##$NCOEF= 0
##$NC_proc= 0
##$NLEV= 6
##$NOISF1= 3.799351
##$NOISF2= 2.8
##$NSP= 1
##$NTH_PI= 0
##$NZP= 0
##$OFFSET= 15.70392
##$PC= 1
##$PHC0= -11133.74
##$PHC1= 17.201
##$PH_mod= 1
##$PKNL= yes
##$PPARMOD= 0
##$PSCAL= 0
##$PSIGN= 0
##$REVERSE= no
##$SF= 200.130013532006
##$SI= 16384
##$SIGF1= 3
##$SIGF2= 2
##$SINO= 400
##$SIOLD= 16384
##$SREGLST= <1H.CDCl3>
##$SSB= 0
##$STSI= 0
##$STSR= 0
##$SW_p= 3612.71676300578
##$SYMM= 0
##$S_DEV= 0
##$TDeff= 0
##$TDoff= 0
##$TI= <>
##$TILT= no
##$TM1= 0
##$TM2= 0
##$TOPLEV= 0
##$USERP1= <user>
##$USERP2= <user>
##$USERP3= <user>
##$USERP4= <user>
##$USERP5= <user>
##$WDW= 1
##$XDIM= 8192
##$YMAX_p= 0
##$YMIN_p= 0
$$ End of Bruker specific parameters
$$ ---------------------------------
##NTUPLES= NMR FID
##VAR_NAME=  TIME,          FID/REAL,        FID/IMAG
##SYMBOL=    X,             R,               I
##VAR_TYPE=  INDEPENDENT,   DEPENDENT,       DEPENDENT
##VAR_FORM=  AFFN,          ASDF,            ASDF
##VAR_DIM=   8192,          8192,            8192
##UNITS=     SECONDS,       ARBITRARY UNITS, ARBITRARY UNITS
##FACTOR=    0.0002944,     1,               1
##FIRST=     0,             0,               0
##LAST=      2.4114304,     0,               0
##MIN=       0,             -248596,         0
##MAX=       2.4114304,     321852,          0
$$ Real data points
##PAGE= N=1
##DATA TABLE= (X++(R..R)), XYDATA
$$ [...]
1637a97l8J3L04l54k06K70R8k07L51p2J12J7k97K91j27j64L01k20O4J16J51q0
1659A26K09j28op8J25J10K4j74lo6j59M42k81Q0L8l41L58q2q0K2J29j91R6J6j76
1684A0j0J81o9j20J31j09j55R8l8n6J94k00P0j4l0l3K18k00J0l7R9k61K10k38
1708c49K39k39N3K45M7l21L47ol7j50j46L63j61J23k03J09ko8J87QK5m6Q5L8J36
1733B77k02J91j53lJ28k06R3J47j40J13R8l92K96n4j16K63j59m7J24k88J17J21
1755B08o5O8j04r9l7r3J51j22O9j05K31k55k46J35J1L42j69j0P7j28J61j15p2
1778a67K54j44J58k68PqMk5k01J95J46lJ4o8O8M3k47J85L1j73L03k58Q4J71k52
1803a51K22k35K37k1J16j00q0J75k40q7J80P5k3P2q6N1K9M0J95j75M7oj90J95
$$ y = [-197, -235, -222, 82, -272, -478, -208, -110, -317, 34, -38, 74, 91, -206, 85, -42, -206, 95, -125, -61, 55, 206, 126, 335, 207, 201, 123, 248, 358, 382, 208, 205, 139, -20, 422, 141, 221, 259, -82, 276, 194, 114, 136, 265, 74, 170, 186, 10, 0, 181, 112, -8, 123, 14, -141, -43, -81, -137, 57, -143, -73, -87, -117, -150, 68, -132, -122, -159, -60, -321, -111, -349, -110, -349, -296, -51, -4, -325, 22, 16, -21, -171, -317, 46, -115, 8, -195, -86, -88, -156, 31, 39, 64, 18, 103, 141, 277, 75, 266, 113, 110, 238, 32, 125, 272, 132, 245, 343, -49, 247, 193, 77, 340, 181, 134, 258, -30, 87, 208, 143, 211, 107, 8, -29, -122, 29, -93, -24, -129, 102, -153, -399, -264, -253, 89, -80, -90, -13, -141, 20, -95, -167, 87, -57, 101, -167, -160, -168, -164, -189, -390, -195, -49, -52, -38, -106, -38, 5, -242, -57, -26, -199, 104, -154, -70, 101, -151, 71, -164, 73, 52, 168, 68, -12, 163, -77, -164, 16, 91, 68, 140, 54, 105, 134, 174, 369, 194, 241, 235, 45, 240]
1827B40p9j60R4R6n8M6m8k18L64j79j81J56k00pQ4J15j72m6K31n8o4j00J13rL9
1852aj43q3L22k22pj07N6J98J22k17m1J49j97J7R6j55N4J67j9j05Q4K3m7J72j57
1877d1J12m8l7R0k42J49MQJ14l4LK24k88O6l0O5n7N4K52j89j79j06L01k5J67m02
1903f9J59O8k6M7r3Q9k7l1j02J56k61n3J66k01O7p1p2K95m7j42oJ39j86mj07K97
1929a5j58M8j09O8J06k10J35J68k03O3M4R6l30P8L0K62o4j18J66l83J63M4J08
1952a1k09L08j39P8K74j48j00Q6q9qJ11n6J19j43K3Q0O3j97P2r3J52J70k50J07
1976B00l5Q7j80J35q5R1k85K09j43P2N3p5j04R5P9j26P9j60J97m1o3r6p5K5J23
2001b3j76Q9OK4k51J04p1K48j38R0j76K56n2l6j62J69J52l11J15kN9J34M7r1l12
$$ y = [240, 161, 1, 95, 191, 133, 179, 131, -87, 277, 98, -83, 73, -127, -134, -50, 65, -107, -153, 78, 20, -44, -144, -31, -40, -1, -144, -227, 95, -127, -134, -241, -185, 13, 135, -82, -123, 26, -171, -154, -58, -213, -159, 8, -11, -116, -32, -9, -56, 116, -41, 71, 23, -14, 76, -166, -17, -13, -5, 109, 75, 78, 302, 14, 80, 50, 115, 58, 112, 364, 175, -4, -110, 191, 166, 333, -69, 90, 158, 132, 179, 86, 175, 148, 117, 15, 171, -90, -143, 23, -178, -111, -182, -254, 41, -6, -148, -154, -15, -201, -205, -312, -15, -173, -125, -234, -166, -60, -270, -135, 33, -170, -107, -63, 33, -297, -219, -189, 73, 9, -109, 57, -326, -163, -119, -11, -220, 88, -51, 27, 301, 153, 53, 139, 50, 42, 153, 97, 216, 73, 96, 176, 239, 42, 114, 21, 173, 343, 93, 200, 165, 252, 72, 207, 122, 213, -72, 137, -6, 66, 119, 44, -60, 35, 114, -12, 67, -93, 104, 63, 0, -96, -171, -146, -23, -199, -110, -104, -80, -331, -227, -298, -50, -188, -98, -274, -18, -70, -106, -268, -99, 53, -258, -143, -145, -86, 48, 95, 4, -308]
2026c08K81J07l19J37J40J42k30J25N0r4l8J01j38J06j8J6J34M7J05k73R0J06
2048B69j03K1m3j34J7k6N8P6j57L5q2J35k36J87J09q9J04L7l57L46P2k71J59j11
2072A6j66J73k8j19j56L06j32O3M6j7p7OK5L1N3j38n1r1J82L6k13K73R2k62J57
2097Ir0m9J09J3k8K8l3M1J00j20J29J3O2j46M3J10J15r2j01R2j57K6m1J24q6l3
2123C8L5N0K5J30k79J3J28k98K71j55nm4J62N5m7K47l35Q5m3j09K60j97rj99J71
2148e0N5l14J71L33j52j03j99K87j32n3K0o5Q2q0lJ80j69L05k08q7n2K52l3m9
2172f4J48L2j36J2Nm2N4pK57k35qO7L4r8J8j2l8M71m33r4K88j43J19p0k0j99L02
2199B08l1j11r3J5J00R7k49J66j5j35J35o3o0J83p3k37K78l11K58k44J60j58J19
$$ y = [-308, -27, 80, -239, -102, 38, 180, -50, 75, 125, 31, -7, 94, -44, 62, 44, 60, 194, 241, 346, 73, 163, 269, 166, 187, 144, 10, 27, 1, 59, 135, -22, 13, -69, 66, -170, 17, 126, 37, 141, 178, -179, 167, 239, -32, 127, 16, -150, 23, -5, -124, -280, 26, -106, -43, 3, -14, -91, -85, -60, -29, 24, -114, -165, -256, -74, -38, -251, 22, 114, -148, 9, -81, -130, -21, -8, -36, -8, -41, 0, 100, -20, 109, 122, 184, 38, 81, 191, 306, 214, 113, 205, 48, 74, 33, 157, 71, 38, 73, 123, 148, 278, -1, 12, 140, -158, 113, -42, -47, -91, 71, 126, 79, 326, -9, 76, 33, -76, 184, -13, -22, -221, -50, 5, -309, -138, 195, 43, -60, -259, 28, -104, -157, -137, -202, -120, -200, -203, -23, -192, 113, -95, -182, -234, 18, -15, -64, 84, 116, -20, -8, -3, -45, 9, 2, 259, 24, 16, 83, 117, 19, 37, 25, -13, 458, 25, -69, 219, 76, 195, 125, 105, -94, 208, 177, 66, -27, -12, 88, 185, -64, 102, 87, -48, 87, 24, -36, 147, 74, -163, 115, -196, 62, -182, -22, -180, -61]
2222f1RM5Nl9o1J35j38k9N1O2Q0j86Q4p4j1r8P6k8L9k04K72J13Mj55%J68m8j51
2250a40M3m7J65j74Q8n5J16J32j59J9j4K80j54j71l6J39Rp1P8J17r6j72K77lj22
2275D9J49l4J1j28Q0R9k23M2k1k28P4J4R7j27J61j17k3Q6Q3J20m21M3L45k69P4
2300f4J36m4j47J28o2j36k4L22n2j78oJ32j79N8l1J81p5q0L1M1J54k85K07l3N1
2325D5qk06J74J32k90L87m27K19j24L52l94J38qj40K91P7l0j30J48j52J48j59
2347D3J83P9l6j73J02N8m9k96PK70j48L8M2q7n7L29l90J14o5q6NJ1L3l5L23l53
2373a38k0J48j99J32R8N9j72l3J5K4k9K8L3j15J04r6N0m3J18J10q8L6R4j98p0
2398a52J06r2K63j59n6lJ46m4l9M8n5j14K85L3r6K51j98k26O7J36l3j81J31P5
$$ y = [-61, -52, -7, -2, -41, -102, 33, -105, -134, -83, -21, 59, -127, -43, -117, -128, -226, -150, -178, -139, -343, -71, 42, 46, -109, -109, 59, 11, -140, -97, -144, 21, -153, -65, -120, -4, 128, -31, -12, -26, 254, 100, -71, -107, 32, 41, -30, 48, 165, 69, -103, 174, 171, 49, 198, 164, 175, 47, 127, 226, 3, 45, 24, -204, -130, -116, -19, -146, 15, -102, -125, -39, 44, 164, -257, -214, 131, -138, -64, 72, 28, -119, 9, -53, -189, -213, 109, 57, -121, -127, 5, -174, -116, -147, 34, -41, -121, -90, -49, 105, -180, 27, -6, 45, 37, -169, 5, 137, -153, 234, -193, 26, -98, 254, -140, -2, -10, -150, 141, 218, 188, 58, 206, 54, 202, 43, 226, 305, 269, 96, 198, 256, 207, -89, -82, 188, 40, 78, 120, 33, -24, 305, -85, 29, -36, -122, -117, -106, -73, -108, 215, -138, -158, -10, -209, -77, 21, 80, -92, -125, -110, -86, -115, -87, -54, -169, -65, -161, -111, -154, -36, 74, -14, 22, 116, -82, -152, -46, -138, 125, -34, -90, -93, 53, 9, -30, 18, -37, -151, 134, 167, 71, 322, 124, -102, -35, 101, 68, -113, 18, 93]
2422I3k20M62m33P7K57l15K46j48J85r3Q6k29R9o1j08K32p1j08M3K30l51J34K8
2445C5O4j3l06J24Q9j45p2R0K0p4K32j24p7k5j4J58%M9p7q1J7k3P9K08l52Q6P7
2472e5j23J81o3j6J81j98M5J20J90l44K54k50J72K0R0k73J38O3k79n6K18K74j21
2495A68k39J54n8j24J40o9K6mL11k02k21L17q4k3ll5l7j88J88K94k10k2j33J7
2519c7L57k41j13O1n6p2J71j64rQ6J4K2j37l0P0j44Q4J04j0j28J94j8K02j69K
2544C9j08j94J87OpK06k4k31K48j75J07Kk00K87k57O8j0L9P4J61k84Q8O9k9J05
2569A67j07j25J40m8J63k86J28n8J67k06R6K4M9p6k4M8k8n0j37J22l2K7J11nm8
2594A2K6R5l71K27L5J14j41J3j9k16K37J52m33p3J18R3J22j03J43j36J05m1j85
$$ y = [93, -127, 335, -98, -21, 236, -79, 167, 19, 204, 111, 197, -32, 67, 6, -102, 130, 59, -49, -6, 224, -127, 7, 35, 99, 86, -220, -96, -7, -152, -224, -134, -114, -188, 44, -80, -157, -182, -196, -38, -38, 11, -66, -147, -130, -153, -74, 134, -218, -132, -55, -178, 3, -60, -76, 105, -93, -48, 72, 262, -82, 172, -78, 94, 114, 204, -69, 69, 132, -147, -203, 15, 289, 168, -71, 83, 25, -99, 41, -28, -2, -6, 305, 103, -118, 199, 115, 92, 89, 54, 17, -171, 17, 311, 101, 79, -54, -37, 320, 79, -34, 27, -29, -101, 70, -94, -103, -17, -3, 19, -118, -148, -78, -222, -138, -34, -44, -172, 22, 4, 206, 37, 39, -69, -263, -76, -70, -77, 129, 105, -126, 122, -53, 54, 56, -144, 143, -114, -46, -56, -17, 57, 218, -66, 22, 91, 62, 167, 60, -65, 75, 27, 190, -96, 32, -26, 141, -65, 31, 55, 104, 28, 4, 52, 24, -26, -163, -41, -73, -46, 65, 60, 12, 38, 133, -238, -11, 24, 138, -3, 10, -9, -225, 12, 164, -269, -342, -224, -131, -9, -112, 31, -105, 0, -41, -226]
2617b26K80L3k5k14J71l6P9J97n07K89j82L60j66j91J26J30j56P6M5O0N8p1p6
2640E4q6J52J12j74Q3l35L67l5j52K9l2J52k03L9J45k1N4rn8o6M1J68j28q5r3
2665h1P7J59n1r8P8n4j92P3J33jn9J69j73l9j8j05Q1J46j77J25M2Jo3q2K99l57
2691a67mJ53j83N8j9Q0M1P3m2M6r3j57K72l6J39k22J85j10q5K10nK8k40L43k63
2716BN3P8%j04K2N9Q8l4k57k5PJJ58P3m8j51O9J50k04K14j26o8O0p5J34mj10J13
2744G5o9J01j50k3J53Nj63j5K8J56j01O6l30K61j5M0J7j22J42j21M8j11R2l1m9
2769a16K0K28O7l20J33j47j18K71k22J93n5N8L9r8J30J9j35j13K56Rr5R5j78N
2793g4K17j46J14j41R8l3Q4P7j23j18k1p6K69j50kJ19M2n3L3j20O6l9rj90L19
$$ y = [-226, 54, 87, 62, -152, 19, -17, 62, 259, -248, 41, -141, 219, 53, -138, -12, 118, -38, 38, 83, 143, 201, 130, 54, -32, 120, 232, 58, 141, -194, 173, 138, -14, 15, -17, 135, -68, -29, 116, 95, 149, 140, 82, 16, 57, 225, 97, 12, -81, -4, 155, 104, 6, 84, 30, -162, -89, 44, 43, -16, 153, -20, -59, -77, -182, -101, 45, -132, -7, 35, 36, -27, -109, 190, -167, -171, -18, -201, -143, -162, -82, -41, 32, -10, 36, -57, -214, 58, 22, 161, -61, 124, 14, -71, 139, 134, 162, -78, 265, 2, 55, 133, 133, 29, 51, 110, 198, 164, -93, -118, -111, -110, 48, 121, 73, -78, -9, 141, -63, 151, 25, -43, 17, -58, 76, 72, -38, 75, 6, 107, -43, -66, 87, 92, -71, -86, -58, 98, -3, 63, -267, -6, -21, 19, 36, -86, 56, -65, -17, -128, -36, -67, -116, -96, 132, 199, -121, 12, -135, -253, 18, -204, -11, -66, -8, 31, -67, 63, 82, -53, -166, 90, 99, 4, 99, -79, -74, 143, -3, 111, -30, 68, 35, 119, 196, 73, -45, -66, -142, 127, -23, -25, 94, 136, 83, 116, -4, 62, 23, 14, -176, 143]
2818A43j42o0J56k21J10J01R9j95j17M9q2J04mJ17o1K8j38o2J88j5Q1j72k4P1
2842d6j86K65j34P8j8k19K19k20K48K2j08J79k82J35R4K8n5o3k8L70jk40JK92
2866C31j57j16M0o1j23K16j01K00r9j57K19j29j70J98R5o7J77k65R6j48N3k0L2
2889D4m1r8RK41j87o9K07o1o4K3j45J84p7O3K02l08m0mj44J85K05m5Kj29N1L8
2915D2J86l76j7J66K5n5n9p3K20j63j07N5K68k48J31P9j87N2N6N3K2J07r5O5q7
2940F0o4J29j30j34J66q0N4J53j0J21j67m7O0l0J9mL8N9j60p2R8M0o3L9j53J70
2966I2r4n6K23m0o9j47P2J88k30J72j79k8R5q0r5Q0%pN1r2M9J10l1lJ00j05P0
2993D6j34J5J82l3k02N4l10K52J18K9k77K33R3j37j32J22J83k47J32l3J25k16
$$ y = [143, 1, -59, 97, -124, -14, 87, 186, -9, -126, -77, -159, -55, -59, 58, -3, 25, -113, -175, 13, -2, 79, -93, -117, -46, -232, 33, -101, -23, -41, -260, -41, -261, -13, 9, -99, 80, -202, -67, 27, 55, 0, -63, -91, 279, 278, 38, 39, 331, 174, 58, 98, 37, -86, 130, 29, 229, 130, -27, 192, 63, -107, 91, 186, 119, 296, 31, 127, -21, 32, 12, 44, 3, -95, -86, 155, -32, -101, 106, 45, -19, 4, -141, 43, -34, 29, 231, -77, -117, -121, -265, -80, 125, 80, 82, -47, 4, 42, 228, -148, -165, 1, 26, -29, -88, -161, 59, -104, -211, -156, 112, -136, -5, 74, -113, -61, -5, 48, 70, 177, 82, 147, 60, -4, 125, -5, -139, 27, -53, 1, 154, 144, 265, 98, 51, 111, 81, 100, 96, 134, 193, 33, -39, 59, 99, 36, 75, -78, 92, -2, -58, 165, 125, 56, -91, -19, 169, -61, 111, -68, -96, -1, -81, -176, -96, -96, -103, -52, -144, -95, 15, -16, -19, 81, -24, 46, -88, -73, 109, 76, -126, -72, -382, -130, -12, 17, -260, -27, 66, -71, -203, -81, 102, -145, -13, -46, 79, -137]
3015a37P6R9L2J31j06l6j60J18J63k12j1L74l76mj49J96l2j20R7R4M5ro3n5M9
3040DJ41j11r7K5j52N6n1K31J86r2l93K10L2or3J47j54K01l1j84J76r3j62L33
3064A23j67l0m8o0j3L1J46J32k34N5L4N9q0j52Q6J26J04j00Q4j16J20o7r8L9J8
3089hk70L52k8k5o2L3K33l88J07J55p2j3k26K40J16l55M92k10l8l1J81k82K28
3112A29lr4J08k57K17O5j34j64n2J68OJ14j64J02J47l91L93l01J98j20L88m82
3134a27K9q3Q8R7j15J39q8K02l3l91P2P5J52k91O5N6O0K36j86K9M6k6q6J1pj1
3160h7R1p3L18l37Q9R2j02N3N4o5r2J88J63l66J20J85j88pJ28l9n9J1r3J59n7
3185H6j02J6qj11K96k65Q8J12Q5j93O3J55r4r2j25J42n8q3K02k59J38l8j18P4
$$ y = [-137, -61, 38, 70, 201, 95, 59, -101, 17, 180, -32, -43, 331, -45, -49, -198, -2, -34, -154, -57, 37, 82, 73, 10, -45, 4, 145, 34, -63, -38, -190, -134, -185, 46, 232, 140, -253, -43, -11, -17, -110, 37, -117, 84, 53, -131, 45, -48, -210, 123, -44, -74, -122, -182, -195, -164, -18, 114, -120, -65, -31, 28, -52, -204, -118, 8, 112, 12, 96, -20, 100, 33, -65, -26, -8, -278, 74, 46, 21, -41, -8, 225, -163, -56, 99, 27, 14, -212, 28, 144, -211, 281, 71, 33, 2, 183, -99, 129, 126, 32, 140, -117, 100, 165, 31, -133, -185, -17, -11, 103, -61, 41, 188, -203, 190, -111, 87, -33, 355, -127, -98, -181, -93, 4, -111, 28, -60, 142, 109, -282, -210, -135, 17, -274, -209, -153, -93, 143, -43, -14, 32, 6, -80, -69, -76, -87, 4, -69, 249, -88, 1, 93, -9, 44, 98, 33, -59, 129, 292, -74, 46, 231, 43, 36, 164, 125, 66, 77, -16, 143, 86, -16, 0, -8, -119, 177, -88, 0, 112, 197, 4, 67, 222, 128, 36, -89, 53, -5, -88, 114, -145, -7, -45, -163, -89]
3209h9K19j72oQ6j3j4O1j16j74K38j83P9J64r6r0r3L2L49k7j93mK7Or2K06J23
3235B28k87J76J41n27M45l5k36L1J47J51k20M6p5j17l4L95l20K89j10l34L83q5
3257E2J84j28P6k92J67j8O8J02k39K39p6M2j15N3J1k49J62l67M28l81K44l6L1
3280d2K12l52J55N9L3K5j01J51k20P1j36J04r1o8J84N1m4m6J06j73J54q4l4n7
3304a43K71j48j06O6LK7O2k12K58j17L14n0j99k12J17R2O9r8pO4N8J7j40M9J3
3329D8J20j4j85O2Qm1k6q7M01o6l72L80j63l3j16J72p4J74Pj83Or6J10j41L6j26
3355a99J74j0o2J51l02L75j94j0QJ24L9j46J33j92K54l25J65Q8L7k06J77j11O5
3378C3j23p0mL1O5K9J50j62p5J03J1p4R4J36Jj41j04j38J96j7o2J16P6%R8l03
$$ y = [-89, 130, -42, -48, 38, 25, 11, 72, -44, -218, 20, -163, -84, 80, -16, -106, -199, -167, 182, 155, -38, -42, -15, -9, -101, 105, 228, -59, 117, 258, -269, 176, 141, -95, -64, 83, 234, 14, 60, -15, -132, -166, 229, -91, 198, 88, -246, 137, 52, 236, 108, 184, -108, 59, 41, 109, 211, -28, 211, 135, 177, 62, 115, 126, -123, 39, -328, 100, -281, -37, -73, -42, 170, -182, -27, 32, 65, 90, -11, 140, -80, -9, -145, -41, -132, -200, -16, 35, -9, -55, 51, -122, 32, -52, -86, -143, 128, -20, -126, -60, -57, -30, 32, -180, 78, -39, 275, 225, 26, -186, -69, 23, 92, -6, -13, 51, 109, 126, -14, 35, 48, 168, 154, -31, 31, 39, -2, -28, -115, 286, 220, -152, 228, 65, 32, -84, 88, 14, 188, 195, 12, 18, -78, 32, -109, -73, -199, -25, -35, -97, 54, -248, 127, -67, -77, -69, 55, 94, -52, 81, -111, 143, -182, -17, 71, 108, -98, 79, -32, 33, -90, -160, -164, -133, -68, -39, 111, -51, -126, -23, -12, -86, 8, 144, 145, 4, -100, -238, -42, -59, -121, -5, 71, 71, 169, -134]
3404a34K55p4J70oj53O1K5l24J96o4K46k47L6Q5j34Q5nq0J72n8j40r1J11J91k62
3429a39rK03K4j93jP8J24r7K20Rl48J89k16J5K05r5lRk6l3J26P5j62k7Q3ln5l12
3457c59M35k92L41k1k49J36j9j61K87r5JK02l90J77q5Q9M2J43j39K6j08J39l0
3480G0j22n7J82J18j38o6kL7r4J14Qn0k08K52k36J99j29K83k4O6r6J7p3k13J52
3505a0OJ12j12m0K1J53k2l47J17J79j03j8o4q0J75K33l60K15r4R8p5L6m4M1j53
3530a36J18J03j96J15m1M4J01Q7l24J15L5J6j50J21P0j80L11J33l49r1J62j32
3552f8P5O0J1J24j69o1j85J77J36j44L19k05p3k8K8J26O1j5k31N4K05k95pj2O2
3577e5J03j25k2L5J58j67Q1J99j91M9J18k51j48K01J09n3oJ39j37L2N2j94P0p5
$$ y = [-134, 121, 47, 217, 211, 58, 119, 144, -180, 16, -48, 198, -49, -13, 72, -62, 23, 18, -62, 110, 52, -88, -179, -68, 123, -139, -148, 55, 79, -114, -115, -37, 87, -10, 210, 219, -129, 60, -156, -141, 64, -31, -34, -25, -51, -84, 42, 117, -45, -72, 11, 8, -47, -359, 76, -216, 125, 104, -145, -9, -28, -189, 98, 3, 4, 206, -184, -7, -92, -3, 39, 182, 43, 69, -39, 100, 70, -52, -109, 73, 191, 53, -13, -15, 22, -72, 42, 50, 0, -208, 44, -192, 7, -122, 161, 137, 203, 107, 124, 51, -162, -10, -4, 108, -4, -44, -23, 130, 108, -239, -122, 57, -46, -64, -128, -208, -33, 200, -160, 55, -39, 59, -16, 20, -24, 17, -136, -18, 85, -111, 4, -37, 7, 108, 195, -129, -14, 21, 37, -113, 8, 78, -102, 209, 342, -7, -98, 64, -68, 7, 67, 78, 202, 33, -28, -213, -36, 100, -44, 275, 70, -3, -31, -3, 123, 184, 169, -62, -8, 197, -98, -105, -117, -55, 48, -77, -99, -64, 94, -73, 8, 207, 16, 65, 183, -68, -216, -15, 94, 41, 35, 174, 37, 69, 121, -73, -3, -78]
3601g8J09L3j20J30OJ02k60p7M03q0l45J37o1l4J43m3j58KJ72n9J61j3m1j00K50
3626A79mk07J02J5k74OK92r0j64J30l5j8M6o2K23j12k38J64K00j20O0j83J56m9
3650A7M0K2m6k01N8J17j19J12q5L7J19n0j19J7P1q9J33K15l14Qj19L27k35j61
3674b45K00J47J3j60p5N9Rq8K04j7o9K24l14K54r8k4R6l59J13K04%o5m3J21j93
3699a06M3J67r4J7n0Q3k6Kj12M7K44k08n9k8J29M2j85J00J02n8j12J14N1r3r9
3724h9N2K47N5j44k28R4M9O1lN1j97K47j30j86J1K14k23L24j48M1j33J05Mr8J33
3749A09l9j88p6J72K2j95L20Oj64L1o2J1mN7J8OJ43j73PJ36j74N8J80j60J78j70
3775D9R1k88J67O3O2j1j09K9O9m3o1R4q8Mj24J23n5L1j0j67K42j42K87k97J74
$$ y = [-78, 31, 64, -56, 74, 80, 182, -78, -155, 248, 168, -177, -40, -101, -135, 8, -35, -193, -191, -19, -78, 83, 70, 29, -71, 179, 175, -32, 70, 85, -189, -183, 109, 19, -145, -15, -50, -68, -22, -84, 139, 27, -211, -47, 153, 33, 93, -90, 66, 17, 57, 79, 33, -168, -110, 7, -112, 0, -85, -48, 71, 21, -98, -81, -10, -99, 34, 249, -65, -57, -176, 151, -84, -245, -45, 102, 115, -45, -120, -61, -52, -140, 64, 47, -22, 202, -112, 142, 44, 20, 116, -243, -130, 74, 74, 9, -34, 87, -106, -63, 104, 10, 27, -23, 60, 34, 36, -76, -29, 215, 7, -52, -80, 49, 91, -94, 6, 108, 50, -62, 52, 103, 10, -89, -37, 210, 265, 121, -107, -13, 36, 97, 94, 145, -52, 195, 65, -121, -110, 104, -119, 205, 57, 98, -35, 70, 74, -24, 109, 70, -118, -194, -22, 0, -195, 125, 131, -33, -2, -64, -53, -57, 0, 18, 24, 167, -6, 1, 137, -37, 21, 201, 41, 219, 49, 140, -148, 19, 82, 144, 133, 24, 53, 122, 79, 18, 112, 24, 28, -96, 27, -28, 3, -7, -174, 68, -74, 213, -84, 90]
3800I0P8k13J17J11k77Kn4J07Oj02J73Q6r4o4J98k67J58N3j30O1j44J89k00K31
3824A15n5j1j32J47l7Lj42K56k39J42Rk03J24N7N5L4l52L21P7j63r4Q3k7R2j44
3849h4m4N9J57j43J69j39n4J22k2J2k84N8K08j59J29R3ON5j13p2J95k05KK69K8
3874B43l90k1K03k7k05P1J90k8k8k5J27j06J39p0l39K57m3j0q1K65j68M2J26k45
3898a23N6k7J38j57J52k06M18l37J29k5Q2k17J13j6L89k45j95J93j27K3J7r3j83
3921b41J99O2j18J87j71N7K0j43L77k99R2m7J38j94Jk3n3J02J11J3l6j19NJ02
3945B2j08O4J7l5R3j41J48Pk96L09o4J10j62j8o9q2K01L5k46J97j86L53o2j25
3969c8k3J01j5r9K50l46P5K36O7j59j64J3J02P5k26kJ23K06p4k17M6N1J14J32
$$ y = [90, 168, -45, 72, 183, -94, -92, -146, -39, -33, -135, 38, 124, 30, -34, 164, -103, 55, 108, -22, 39, -105, 84, -116, 115, 60, 49, -83, 64, 27, 30, -112, 144, -95, 47, 56, -147, -23, 34, 89, 123, -229, 92, 169, 6, -88, -5, -32, 60, -84, -128, -69, 88, -55, 114, -25, -79, 43, 21, 33, -251, -193, 15, -144, -15, 78, 84, 139, 26, -46, 149, -56, -54, 215, 243, -147, -168, 35, 8, -197, -126, 64, 36, 8, -17, 110, 4, 143, 73, -266, -9, -52, -62, -143, 122, -46, -4, 122, -123, -67, -94, 44, -113, 39, -167, 251, -86, 43, 18, 100, -117, -4, -20, 369, 124, -71, 122, -5, 18, 35, -58, -241, -42, 20, -98, 89, -82, -25, -5, -148, 229, -70, 22, -25, 113, -81, -80, -103, -156, -54, 57, 70, 34, -85, -80, 22, -86, -22, -5, -40, 53, -88, 60, 67, -229, 80, 16, 126, -36, -54, -123, -205, -4, 31, -215, -18, -204, 149, 87, -38, -61, 40, 25, -74, 176, -170, -95, 141, 208, 49, -115, -102, 0, 75, -151, -153, -30, 176, 102, -115, -69, -18, 96, 228]
3993B28k13L9M8p1q6Q4J99r1j82r4P7J55Q1k70J7K2J94j65M1j17R5j56J49J50
4017A34j30J37j79L4J24j50J01j65L7J50q9j72K82j39R5J03p2j40Q0q3j59L35
4039A34N3l53O6M0j21K27j22K2K64q6n0J0rq2J26np2L9l09J34O8J44j42n0L15
4064B41j29j35n7L1l2J76q2j93J45K36p1j92M0j6P6n8K4L0j1j82J66J05J5j52
4088b5l3L4J72j14j63Q3k1k4L17k56J0K4o0J38J04j57K6j87K58j81J41k35M19
4111B70j50OM2k02j33J17J01j45L13k62m0R3P2Q0j11Q6j42L1m4j40J7J4J32J1
4135A6j05J80m4Q9l3j84L7J85j65j35K45r7K7R5k30J18J0j04J51k05J60Q1k05
4158a13K25j05j13M5j8J21k06L83k20J4j21K80j97J53k62O8K63k24k3L7P7l29
$$ y = [228, 15, 54, 102, 31, -55, 29, 228, 137, -45, -139, -62, 93, 174, -96, -79, -57, 137, -28, 13, -104, -9, -165, -16, 134, 4, 141, -38, -4, 120, -30, 71, -94, -57, 93, 4, -168, 114, -25, 70, 173, 101, -39, 41, -42, -201, 134, 187, -166, -100, -60, -181, 46, -76, -54, 210, 124, 74, 84, 75, -7, 119, 114, 42, 81, -228, -94, -26, 118, -24, -74, 241, 112, -23, -80, -49, -81, 95, 13, -180, -35, 201, 130, -62, -22, -38, 38, -20, 4, 34, 23, -159, 7, 112, 127, -25, -58, -24, 148, 34, -129, -46, -67, -91, 226, -30, -20, 4, -56, 82, 186, 29, 55, -132, 126, -55, 86, -149, 270, 120, 126, 168, -34, -167, -50, 51, -94, 219, -43, -83, 10, 82, 162, 51, 137, -5, 26, -18, -158, -141, -127, 5, 16, -89, 91, 47, 136, 103, -81, -44, 141, -24, -159, 86, -11, 16, 111, -119, -1, 9, -95, 56, -149, 11, 92, -113, 112, 7, -106, -61, -79, 42, -164, 219, -1, 13, -108, 172, -25, 128, -134, -66, 197, -27, -50, -13, 64, -265]
4180b65L71o8j92K99j21j8J32j28k20J98l9L0J9j29n7K88k16J53L5O9j42j8j29
4203a48J03n2J25J29m13L60j47L0O6r5J34P2l5j5K2j40j86R8n1K92p8J71k45M0
4227C7r9R3Lj0q3j8J17O3k65J54J83k73j3R1J64l12M04l29N5J56j40M1L4q0N8
4252C1O9l5j70M1J20l7j02J88L1j06r0L4j18n4J85k7O1j7O2P8k2j07J39N9k89
4277g6P4j94J79L1J20j55l0L0j03R2J03k58J92J95k27j60K30k61R0K5J6J4L47
4300B74k17q2O2JJ16j64J76q5J11k71J09l2q4J28J2O4J0k8r2K4r6J55k45K83Q4
4325B13j19k29J67j14K3J30l8M0m3N2J06j70r0J70n1n6p6K67r2m5j91J82J5j24
4349g3q0K27q6l11J99K70K0j84K81j67J0m4q0o4L33j65j48N7P7K9j68q3P3j24
$$ y = [-265, 106, 38, -154, 145, 24, 6, 138, 10, -210, -12, -51, -21, -2, -131, -188, 100, -116, 37, 72, 141, -1, -19, -148, -45, -97, 28, 157, -256, 104, -43, -13, 53, -42, 92, 164, 129, 114, 136, -4, -190, -92, -143, 149, 71, 242, -3, 37, -62, 31, 34, 24, -59, -77, 40, 103, -162, -8, 175, -98, -111, -20, 144, -168, 236, -93, -38, 118, -22, 19, 53, -27, 31, 100, 65, -105, -64, 56, 19, -83, 105, 136, 30, -60, -26, -144, -198, -13, -40, 21, 4, 66, 144, 122, 15, 154, 213, -76, -2, -196, -17, 14, 134, -21, -51, -21, -124, -32, 71, -187, 5, 200, -27, -187, 43, -218, -128, -103, -87, -73, 274, 57, -25, 37, 38, 154, -10, 166, 81, 192, -79, 30, -2, -86, 42, 54, 118, 128, 100, 8, 32, -64, 91, -154, 129, 213, 94, -135, 32, -82, -59, 71, 33, 73, 30, 82, 188, 18, -72, 98, 47, -9, -85, 182, 90, 45, -146, 36, 51, -73, -153, 74, -12, -323, -124, 146, 166, -18, 263, 96, 106, 62, -18, -82, 251, 86, -62, -5, 72, 101, -67, -150, -77, -201]
4373b01P0J54J57j86R4r3o0J35r2M0p1M0J9j2n4R6k45K78j98MJ99j83j96K54J70
4398A19j03Q6rk49J04p1K89k29J74j30m5J9K65N6m58L1K07J3K6p4p3J94j72n8
4422h8J1O8o4K00q9m8K34m4p2j33J03k8J2j91J7rJ85j67K08j36k8J61k4j83J08
4447Ck8J62j38o6J46o3l7J86l9J96j69j09N8k79J60P6m9n6J71ok91L8L34q7r3
4472B0P5j53K37m8M6Rj04M4m2Jk8r5K21o9j26K4J08n4q9J12k7q7L43m36K41k13
4498i0J31Pj20K70j77J4N1q7N6J21j59J15l75K66M4N7K2l06J83K14j63j04l3N9
4522dj10K51k03JJ2J57k1k88J80p9K87k76rJ94j22K54k21J1j14m3J17J31K16k08
4546A13j59j20Q8J55j39m6J4J93j74K33j05Q5n5L3Kj01Q3j08m5K43k98l9J86m6
$$ y = [-201, -131, 23, 180, -6, 88, -5, -65, 70, -22, 18, -53, -13, 6, -6, -60, 36, -209, 69, -129, -125, 74, -109, -305, -51, 119, 16, 102, 93, -156, -52, -123, 166, -63, 111, -19, -64, -45, 220, 276, -182, -151, 56, 69, 95, 21, -52, 142, -30, -88, -77, -9, -73, 127, 38, -10, 224, 180, 108, -25, 78, 50, 62, -129, -112, -121, 64, -103, 105, -31, -59, 102, 78, -105, 3, -25, 137, -1, -67, 79, 16, -21, 165, 126, 322, 153, 44, 102, -177, -17, 59, 10, -46, 125, 119, -172, -134, 200, 113, 20, 95, -58, 179, 131, 177, 186, 82, 126, 84, 85, 57, -38, 183, 114, -12, 12, 120, 66, -23, 89, 62, -25, 318, -118, 123, -90, 41, 48, -72, 198, 21, 35, 86, -1, 55, 176, 17, 132, -243, 23, 67, 124, 146, -160, 23, 237, 74, -30, -63, -4, -114, 137, -66, -65, -53, 104, 83, -205, -25, -104, 183, -93, -102, 92, -30, 224, 3, 14, -100, -143, -26, 105, 321, 113, -46, -166, -78, 77, -62, -108, -94, 99, -75, 158, 53, 138, 83, 116, 118, 17, 100, -8, -53, 190, -108, -147, 39, -7]
4570gJ9O3k98K22j1LM9j27j6J33N7n1o8p7L04k10n0Q3P6K7j0N0k30l7O5J08j39
4597g2L7%r7R6j98K28J30q4j90K36k82J49N7L2J53j49LK2O8j48J02o6nK9k2J5
4623D4K4L7j01J57l80J35K8K37m1o9K5P4j91K21k81J4J68n1k8J09O8j26n7m5j41
4648a70J04J85j88J69k11K49l24L46j65K4k8Q3j38P2J20J52l22k7J48j33M3M1
4670C0O1q9j45qK56O1j91K4M0J23Q6k29j39K83k2l54J99k53L62j68J21p0M3Oj3
4695A4o1j10J71L5j3R9m3k71K53J96l09r4R5K5n5J00o6p6J94j53M0R6J92l17k41
4720b99K37J97j95L15l50l2M7J54j21P3j13j70L26j36NJ70j03j38L43k00J41j94
4742d3J06L1k83O4N2Q8r6J21K0J17j94O4J69j60j1K6nj3j1k21J40J85R9k91J79
$$ y = [-7, 12, 75, -223, -1, -12, -9, 40, -87, -103, 30, 87, 36, -32, -109, 195, -15, -65, 18, 94, 121, 111, 161, -69, -106, -41, 67, -72, -35, -35, -132, -36, -234, -6, 124, 40, -150, 86, -196, -47, 10, 42, 195, 46, 49, 71, 139, -9, 93, 27, 22, 51, 29, 44, 68, 105, 4, 161, -219, -84, -56, 181, 140, 71, 96, 170, -21, 200, -81, -67, 101, 50, 22, 131, 199, 73, 16, -29, -170, -66, 119, -69, 100, -111, 138, -186, 160, -5, 19, -9, 74, -64, 8, 128, 280, -42, -69, 79, -54, -11, 30, 91, 2, -143, -151, 105, 166, -25, -1, 39, 162, 248, 19, -120, 163, 141, -213, -14, -267, 95, -73, 48, -22, 21, 27, 14, -47, -157, 14, 49, 36, 135, 92, -179, 74, 270, -39, -133, -38, -13, -68, 32, -34, -110, 84, -69, -29, 67, 259, -58, -299, -62, 135, -60, 255, -95, -127, -80, 74, -47, 26, -87, -257, 69, -67, -62, 108, 5, -133, 210, 10, 151, -43, 63, 94, -189, -125, -73, 15, -81, 40, 60, 177, -17, 47, 216, 56, 45, 71, 66, 53, 42, -179, -39, 146, 245, -46, 133]
4767A33k01m9L6J21M1r0qL6k0k09L31j04L2n6J6n6j69K19J99j79p3r5J33J99j75
4792A2P2j58p0J49J60k2k17J55j22M7M2j76K16l2PP0m27N6L60j9%l7mj52J08Q
4818B6j77K26j53J02K4k03J31L7j63Q0R5J26p0j79n0J6J91j18K56k89K97j97J55
4841A63j98O3j37N5J27l0J6q9r7N8J83J9j05N0J90l86K68j08K2k17J11ko2j45
4865b51L29j96m3J55O5m1k86L16j2q9%P3r6P3Q1J35j23J4R3k34j0JJ8o9J77j61
4891h1L19k35j08J21j21J21lk33K00K96l65K31k11j07J14J38N8PJ03j65k66J70
4913a7m9j85L85O8k12k80K97o8K2j43K10j04J30o8k4J52j02P7j09J84k22J08k38
4936a88K95j22j5L9N6k58J25k8J15R2k59K21k12K02J15l5o2L5k33j43L74o9j19
$$ y = [133, -68, -117, -81, 40, 81, -9, -17, 19, -1, -210, 121, 17, 49, -7, 9, -47, -216, 3, 202, 23, -50, -145, -12, 187, 12, 84, -74, -144, 5, 165, 143, -74, 81, -41, 6, 48, -128, 88, 56, 63, 133, -294, -238, 122, 103, 103, 66, 62, -90, 18, 26, -151, 75, -78, 24, 48, -155, -24, 13, -150, -70, 25, 151, 81, -98, -148, -132, 59, -59, 197, -92, 205, 8, 163, -35, 28, -109, -54, 73, 43, 59, -30, -127, -69, 114, 133, 28, 78, 268, -118, 150, 42, 64, -153, -42, -44, -106, -251, 78, -118, -161, -6, 59, 18, -268, 48, 36, -53, -53, 20, -76, -3, 78, 213, 90, 104, 197, -37, -47, -46, -28, -97, 80, -81, 238, 3, -105, 16, -105, 16, 13, -220, -20, 276, -89, 142, -69, -176, -62, 76, 134, 141, 244, 79, -187, -17, -66, -251, 134, 202, -10, -290, 7, -61, -39, -182, 28, -76, 54, -14, -38, 114, 12, 89, -20, 164, -58, 50, -188, 107, -15, -30, 9, 65, -193, -68, -96, 19, 111, -148, 73, -139, 63, 178, 143, 81, 116, -117, -260, 114, 45, -74]
4959g4K0j39J20l2K83k46M7r7l2K7J23O7o7j49K04j82L57j45j01Q7J10l60J63
4982a6Jl9l7J16K30k62J17j18Np7P6O5k50K38j06j0J38O2k3j92o0N4l4P4r2K00
5008F0k1j80J33j25J16j72J63qk9P2J99L4k76j58L47k73J55j23L87l58K63r2k2
5031I2J46j75O4N3j1k61J23J43j44K2J08k38J41K22k92J43j27K00k67K21l7m46
5053c20M22M8k34q3K15Kpk64K16Q6M8k86J85j89O8J16j21J91q4L3M2n0L8k38K73
5078A07j07n0j43M0K1J27L41l84J62l3j65J56j8N1q6k48N47l22J77j37K65k64
5100C7l9p0l7m8L37l31J48J5j38mK11j04O5N0k2j9j22J02r1r6L9J39KJ85l58J43
5126fm7J84l18P7J51p6m1J44j86J79j20N8J35l11K32l1J40j40M5k70J37l6J27
$$ y = [-74, -54, -193, -73, -105, 178, -68, -21, -118, -150, -123, 0, 67, 0, -149, 55, -127, 230, 85, -16, 71, 181, -179, -16, -15, -54, -91, 25, 255, -7, 110, -8, -3, -80, -4, 61, -189, 49, -57, -67, 71, 133, 110, -82, -142, -88, -122, -48, -140, 60, 39, -141, -8, -133, -17, -189, -26, -34, -63, 9, 208, 242, -34, -192, 155, -118, 37, -86, 301, -57, 206, 114, 92, 238, 63, 127, 180, 169, -92, 31, 174, 30, 52, 160, -78, 63, 285, -7, 136, 9, 209, -58, 163, 126, -320, 102, 150, -84, -167, 48, 50, 43, -221, -5, 81, 129, -157, 28, -161, -93, 23, -98, 93, 9, 42, 84, 34, 72, -166, 107, 0, -50, -193, -153, -132, -5, 336, -48, 114, 81, -84, 72, 54, 105, 19, -229, 318, -4, 173, 36, 301, 37, -2, -72, -109, -157, 180, -151, -3, 12, -126, -130, 81, -23, 42, 92, 70, 51, -71, 31, -60, -156, -117, 22, 24, 209, -149, -6, -53, 131, -187, -110, 41, -35, -76, 68, -118, 61, -59, -1, 134, -177, 55, 24, 164, 24, 69, -201, -64, -100, 27]
5149B7n1n9K64k25j31Q4j55J73R9j51L13k25l6K02k09O2j8Jj42L54l35J27K50
5172B19k71j9QkJ1M4J13j68J6P9J52j20j45J4j60R2n4J44O6j76L3J85jj9k9o1
5198d9J29j34M3K6p3K53k75M7J0K50l01m1K42j70J68q1j88RK52q8j97K81j30L6
5222A9J1Q0k19J79p8J47K6j80J36j80j33K42m8Q6np0R4P1J5j50n0J41j54N6m9
5247a3r1J63P4l9j10n0J44r6R8j29o6K82k05r9J82K0j19P1M5j7q8R7J51j86M6
5272F5l0J1q4M6j21L8K76qk65K07j34o3K38j27RJ12m7J9j69j45R5J73o5r7L5K9
5298bp5J64l12K96O1k60J65j90J45j47K20L3j7j24j15k6Q0l3M3R3j29K18j05P7
5322F0j01L7LN1N4R9l5k54K71j08j79J23p4J4K16j89J12O5%n7k92K50Q5j83j51
$$ y = [27, -24, -83, 181, -44, -175, -91, -246, -73, 26, -125, 188, -37, -73, 129, -80, -18, -36, -35, -177, 177, -158, -31, 219, -52, -71, -63, -65, -54, -10, 103, -65, -49, 30, 182, 62, -83, -69, -229, -137, -191, -47, 19, -157, -124, 61, 60, 41, 12, -49, 80, -54, -11, 15, -58, 195, -80, -33, -23, 227, -74, -115, 127, -43, 125, 44, -144, -135, 117, 29, -168, 113, -17, 19, 30, 110, -109, 70, -8, 139, 165, -15, 121, -59, -192, 50, 2, 88, 83, 13, 107, 178, 193, 43, -7, 134, -20, 36, -13, -104, 59, 133, 94, -16, -66, 78, -18, 80, -49, -115, 167, -38, -137, 45, 65, -54, 17, 62, 45, -43, 54, 205, 19, 65, 35, 46, -38, 8, -113, -75, 201, 193, -72, 135, 1, -62, 176, 49, 58, 170, 123, 142, -27, -172, -77, 96, 31, -66, -31, -2, -77, 87, -225, 71, 132, -128, 37, -153, -8, -155, 65, 98, 81, -43, -158, -184, -104, -137, -94, -1, -130, 88, -17, 60, -41, -4, -1, 50, 104, 203, 168, -86, 185, 77, -102, 21, -53, -39, 177, -12, 100, 165, 165, 108, -184, 66, 151, -32, -183]
5347a83J46J86L8l49L9P3J51n0On8Q3j19j32P7K28Ok10P5k1J14j08P4o8O7j20
5372e5J60j36j09K81j0M2o2j36K40j25LKj09N6J14R0n2n4j96Q9j47J8J39K7k13
5397a43J3P8k30K05K43l14L38r5k38J34j99J30m4K73o5k36K82kk89Q8l6L8l0J85
5421H6Q3j23k2J19k2k13P0O6o4P8R4o0j86J84k81K26j85j36L85j56l8P1p8K60
5445A58p1j13K42j87L7m0m1o6n6J01l8n7Q5R1r3L7L2r7J30k81L36j57R0Q5k13
5470h6J25K9l1n0P5n8R3k71J27J02J07k58K63k58R6R8k25K00J2r7j33P9M0Q9k12
5495a44J84j5Q9%q7q0n3pR5J85l93M62p7K7j61pM7N3q9nQ7j11O0l7j48K80j81
5522b6j40K58j87K20J46j59p6N4k58J01N8K2j9L1l19L01J8n1n4R5j12k2J22K09
$$ y = [-183, -37, 149, 187, -162, -123, -50, 101, 51, 57, -1, 82, -37, -169, -92, 136, 142, -68, 7, -14, 100, -8, 66, -2, 65, -55, 105, -31, -140, 141, 131, 173, 111, -25, 215, 90, 93, 95, -14, 42, 156, 246, 194, 140, -56, 33, -114, -96, 43, 70, -143, -130, -52, -282, -77, 166, -148, 190, 95, -143, -9, -208, -78, -122, 151, 86, -150, 132, 130, -159, -71, -107, -69, -99, 86, 169, 46, 24, 143, 121, -92, -22, 44, -20, 58, 152, 92, -94, 90, -191, 35, -150, -286, 99, -57, -95, -24, -102, 158, 87, -26, 216, 29, 66, 26, -15, -81, -137, -36, -74, -131, -46, 45, -48, -11, 21, -76, 54, -227, 109, -48, 42, 127, -86, 39, 68, 37, -13, 62, 4, 97, -174, -47, 55, 162, -96, 167, -91, 5, 103, -122, 78, 90, -7, -140, -61, -21, 68, -144, 40, 25, 114, 114, 27, -53, -106, -113, -18, 167, -226, 236, 159, 186, 25, 18, 65, 118, 29, 24, 111, 0, 60, 23, -125, 155, -26, -166, 92, -95, 125, 271, 112, 36, 90, -168, -67, -9, 13, -6, 25, -294, 7, 25, -26, -80, 15, -97, -119, 3, 212]
5546B12j81l4j11K48j90m4J65Kj63J67q0J07k01J09j19L22N4k01j4j69K87l06
5568a40K28j25J34n1m4qM0k8m1J3K53j70m8J13j56k5r1K28m4j16K7N1P5l8r4K6
5594c1j17J66m1j78K07j07J34j35N2K75k78M2O1k0J23j42J49j75J7M3j9lO6j45
5618e6K48k40kK06r3k67K21r4n9K08p8j14K90q5j87J47j07K00k50r7J19j5K62
5641A57l29K45N0rk24J15l94M24R7m80L87q7J46J0n87N27N7N0n1J24L6m35K14
5664D3j68l80P97q7Q2j41K06k37n18K41k1l36Q99m93N03j137J086r34n9P43L7
5685A26R0n63L04K52J04j50j98J26K79j38o88N61l14K27k00K32j71l0K12p3o6
5706g8J16jj90Q1L27k83P1j18o6O6r8K06j47K83k42J67O5k54N9Q5n2n4n6J72k0
$$ y = [212, 31, -3, -114, 134, -56, -100, 65, 67, -96, 71, -9, 98, -103, 6, -113, 209, 263, 62, 48, -121, 166, -140, 88, -37, 97, 46, 2, -6, 34, 6, -35, -22, 231, 61, 13, 126, -30, -55, -146, 82, 38, -78, -51, 0, 75, 37, -57, -31, -148, 18, -23, -201, 6, -101, 33, -102, -50, 225, -53, -11, 50, 30, 153, 11, 160, -15, 2, 45, 26, 23, 89, -56, 192, -48, -50, 156, 63, -204, 17, -77, -136, 72, -6, -120, 170, 85, -102, 45, -62, 138, -112, -209, -90, -105, 157, -172, 73, 123, 114, -110, 5, -389, 35, 132, -348, 39, -48, 98, 108, -479, 48, 105, 155, 104, 228, 264, -171, 43, -125, -505, 292, 205, 287, 146, 352, 115, -403, -162, -183, -519, 380, -113, 390, -747, 339, -595, -654, 89, 126, 216, -347, -43, 209, 313, 163, -35, 91, 370, 232, -456, 105, -209, 18, -182, 50, -121, -151, 61, -12, -78, 38, 37, -153, -72, 255, -28, 43, -75, -141, -75, -173, 33, -114, 169, -73, 94, 159, -95, -36, 49, -3, -57, -113, 59, 39]
5731C9L5n1n6J03J38l96J91m3p6J17k10J59L7P6M2P7k23Pq4j70L62q6q6L6K25
5756A63k51J86j67J08K3k82K54p8J50q2k2j7K18o7j58K19k04q7J99k88K81k28
5778a30J37j01R4m5J37j61J64k38J49l1O6M9l3J39l09K72l40K69k65J36O9j74
5800a46N3K70Mj51p4K9P2j21L9M6l7r1j1M0J66j39P9j75Q2k5Q7J94j19j80L39
5825B31j89k14J86k24K34J11j00OR1q3j42JQ5j73K95j53n8k1J17Lk45K09K18j84
5849Aj15J04J02M1lor4P1m0k62n9J79pJ7J5K5J67l42K83j35l8r1L53k44M4J16
5875H2j95J39j63K74j7mj42P5j69N4j57L39N5k73J40j1j27J74l3j62O4j10K88
5898A21j60JR0j2o2K3q4J24j22k4R3J75m4j33k03L12j30J10r7QQ1m8m6K02qj19
$$ y = [39, 74, 23, -33, 70, 208, -188, 3, -40, -116, 1, -209, -50, -13, 63, 105, 182, -41, -34, -118, -288, 74, -12, -98, -62, 163, -88, 98, -69, 39, 62, -220, 34, -44, 106, 24, 2, -15, 203, 136, -22, 197, -7, -94, 105, -183, 98, -130, 7, -94, 0, -45, 92, -69, 95, -143, 6, -25, 41, 90, 57, 196, -113, 159, -181, 88, -177, -41, 28, -146, -93, 177, 181, 30, -44, -15, 57, -64, -25, 21, -16, -107, -118, -78, 88, -51, 28, -147, -65, -90, -3, 191, 72, -108, 231, 42, -172, 14, -210, 24, 135, 35, 41, 132, 49, -93, -92, -7, -180, 115, -38, -96, -117, 0, 3, -242, -33, 185, 1, -114, -10, 92, 133, 130, 124, 30, 101, 61, -201, -260, -81, -88, -71, -56, -31, 136, -206, 77, -58, -96, -187, 166, -78, -34, 82, -113, 26, -137, 137, 120, 116, -26, 49, -120, -66, -223, 116, 171, -102, 38, 27, -100, 74, 41, -121, -57, -167, 121, -39, -38, 52, 40, -22, 1, -83, 41, -81, -105, -12, 163, 119, -14, -217, 95, -35, 75, -22, -14, 67, 19, -27, 175, 167, 48]
5924D8M9R9j97L4O2L1l72K01p8P5k18L91n9j69M5J00M6l22J59j27J15J42k9r1
5948f5R6%O0j10qO4K1p6j71Q1O3j3j1Q9j8o4N5L8J00k53K47j7J6k03Q3M4N2j47
5976d7L25r6j08j0j49R8j18P5N0r8N5r8o4K10J14l79K71r2J61J12r8j03J17J75
6000C03l22J5o9J28j11J05j12J36l8j58O5J76j95n5J52RJ88k90L6K1Q6k64J22
6023g2P2J24j45O2j42k25M58k01J16P8o8j8r8M4j21J42L3J49j72J25n4r3o8p3
6047a47Q2j9J1J59n2r5J50o9kj26R8pJ74j02L3j52P4N6l7R1k33R7j06J22R6M0
6073A36j82L01j07k5k43N5J18k7k50J44O2R8j21R8n1p2K9n3l5J67j05M2p0j53
6097b44K10J92j75m4P1k8R0m0k52K22J89j22J3J7j74R4L9k12K79o9j68j57J86
$$ y = [48, 97, 196, -1, 33, 95, 126, -246, -45, -123, -48, -266, 125, 66, -103, -58, 42, 88, -234, -75, -202, -87, 55, 26, -65, 31, 31, 91, -19, -27, 37, 58, -18, -189, -108, -45, -58, -69, 20, 2, -62, -7, 31, 131, -122, 125, 108, 124, -79, 4, 48, 100, -47, 278, 182, 74, 64, -85, 13, -105, -30, 20, -78, -23, -121, -185, 25, 139, -240, 31, -61, 100, 212, 114, 11, 128, 303, -19, -4, -73, 55, -56, 49, -63, 73, 35, -123, -58, 118, -77, -132, 20, 29, 217, -73, -37, -16, 70, -194, -72, 0, 124, -21, 41, -101, -326, 132, -69, 47, 125, 57, 39, -59, -15, -136, 6, 39, 188, 16, 141, 87, -6, -74, -147, -65, -84, -73, 86, 34, -61, 89, 20, 18, -108, -10, -17, 157, 55, 88, -64, 10, 66, 29, 120, -113, -16, -122, 0, 96, 136, -46, 255, 148, 123, -120, -65, 53, 26, -224, -80, -18, 80, -41, 57, 6, -66, -37, -90, -125, 42, -63, -21, -91, -244, -34, 158, -17, -61, 10, -18, 72, 32, -220, 2, 191, 69, 82, 99, -75, 19, 58, -154, 125, 56, -112, -269, -83]
6120h3K93p7j76lK47j72q2r1K14l7J26L5l23K24P7k72K64j34o1Q5j41J00n8K22
6144A77r1n6L8M6m3k44R2mK39j49j03J25P3k08K50o7k03K28l57J59Np1J72j62
6168a54K42K3k86K27J06l9j10p6O4j4J50k50M6N0m9M0k04L29k43L53k10K16k25
6191a4j91o4L19mN5k48Q8K61j79o3J67j27j62R0K24m1p9j36J66K4m2j28J9P8m7
6216c4j53m7M05l3P1k39K72k55j82R6J09J5k20J68J9l6J9P6q7j44K07O4j71J48
6240F8j37n4K78p3q5O6q2k08P0K39l00J22J30p7O0O4p4J00k37L52j45j04L8j87
6264a76J21r6k9K71r4j63J99k9O3k18K24j14J44r5j68L38j03L%N2l7j12M6j5k1
6289ip9L00k34K50j41o3k2k8Qj03K20Pl6p2k68M0L40j29K07k70L50l37K01q3j61
$$ y = [-83, 210, 133, -43, -46, 201, 29, -53, -144, 70, 33, 159, 194, -129, 95, 172, -100, 164, 30, -31, 54, -87, 13, -45, 177, 86, 30, 68, 114, 71, -173, -81, -85, 154, 5, -98, 27, 100, -108, 142, 75, -128, 100, -257, -98, -93, -164, 8, -154, 88, 111, -175, 52, 158, 119, 9, -67, -3, -17, 133, -117, -71, -21, -70, -30, -234, 95, -148, 205, -5, 211, -14, -205, -269, 50, 46, 101, -147, -59, 202, 23, -40, 127, 0, -162, -72, 152, 111, 32, -104, 62, 86, 44, -84, -65, 13, -34, -187, -234, 171, 138, 209, -30, 242, -13, -195, -99, 10, 25, -195, -27, -8, -44, -25, 51, -36, -180, 27, 91, -80, 68, -69, -123, 155, 82, -3, 63, -19, -227, -157, 82, -218, -96, 34, -43, 17, 81, 7, 107, -130, 222, 77, -27, 11, -176, -55, -151, -180, 91, -3, -166, 33, 4, 67, -151, 73, -41, 103, 8, -160, 178, 75, 78, 78, 130, 93, -19, 27, 12, -9, -88, 212, -22, 228, 87, 24, 2, -26, -18, -121, 99, 106, 70, -2, -270, -230, 110, -19, 188, -82, 268, -69, 132, 49, -112]
6314a12k6L51k40K53k51N0l2O6j4j51P8M2L8o9k3J08k2p5J50qn1K4N0l14M04k81
6340e5J41k22Q6J51k02nJ51J20k12J48m9j73R2K23k09Oj07R2J41k03J67j09J17
6363H9Q6k06k4m6L8J05J5j00j52L56k95J63J4O2k1j02K4J95k19M0n2J26k47O0
6387i1R6j38J90k22K64k16N4K06j33l7J16k59J18j4J21K2K19j52j73pj75K78k44
6410a77K93j91N0r8K47k49J71j98P2Q2NJ70j92J6M7R5k92r8L30l8qj27J13K4j5
6435C2j20j0J59M9k32J41J46J3k10L8j9R7m5j12J07n2N6l0j89K48R7k83K09j41
6459e1J19j97J97Lj79M9J14j28l8O9M6J43J25j91l18K70p0o7M0N6M3m0m6J29P
6484H5J0j14O5j07K45k72O2J9j65L72n6r4m4K2j1J59M8m10K36qJ5J03j42K3J13
$$ y = [-112, -138, 213, -27, 226, -25, 25, -7, 59, 45, -106, -28, 14, 52, -17, -40, 68, 46, -29, 121, 113, 62, 86, 136, -178, 226, -55, 86, -136, -50, 101, -101, -106, 45, 165, -47, 101, 52, -121, -29, 194, -15, -9, -116, -24, 117, -86, 81, -28, 89, 175, -31, -55, -101, -63, 42, 57, -43, -195, 161, -134, 29, 43, 105, 84, -18, 6, 201, -18, 22, -30, 96, -151, -91, 5, -133, 57, -165, 99, -117, -63, 143, 10, -27, 89, -170, -52, -66, 55, 77, 296, 144, -29, -36, -211, 67, -177, 116, -75, -25, -123, 124, -125, 46, -152, -80, 2, 7, 177, -15, 1, 48, 143, -149, -247, 83, 45, 37, -90, 23, 47, 32, -88, -98, 61, 110, -122, 19, 165, 178, -32, 6, -13, 84, 39, -73, 34, -18, 38, 8, -181, 67, 164, -119, 90, -51, 68, -129, 68, 71, -108, -59, 55, -73, -111, -42, 4, 147, 272, 81, -237, 33, -37, -104, -64, -8, 35, -5, -51, 78, 85, 95, -19, 46, -61, 184, -88, -26, -7, -172, 200, 144, 50, 6, 28, 17, 176, 224, -186, 50, 42, 57, 160, 18, 41, 154]
6509A54k57J03J3Q0j49J48k46K3L14j37k74K64mP3L7j96K2M6q8J04j58J27k6j1
6533c8J65l9l4n0J0O6j61J99j76O9j04J34J41l38L66k94J86l3l0k1J5J1Mm3K02
6558B07j72j02Q4J67k17RJJ63j29j19J32l1k8k5O2k29K22P2q4R8Q3k19J79q9j80
6583a45J30j0r8J44n1K0k08L55k17N8j31R4J00j09M7O2l5M3l2m0K6p0p4J10P9
6608D8m8J2j08N5K55M1k12J83jk60J5m5J85K0j76m7J96jk59J75J55K8k04p8l1
6633a02J34j14n2O5rK33k38J02J2j85K23j27M4M4j34o9L06nj72M7r2K89j01J9
6657A18j89J61j15O3L5L7L3p8P4k21J63j49k3K46j97L40l55R3Pj91K51l1r2N3
6681C3m6P1r1J79q1m2n6L06l59L63j78j29O1l9J04j82J41p7P1J05k64J33J32j80
$$ y = [154, -103, 0, 13, 93, -56, 92, -154, -131, 183, 46, -228, 36, 32, 105, 142, -54, -32, 14, -74, 30, -128, -1, -27, -38, 127, 88, 54, 4, 14, 80, -81, 118, -58, 11, -93, 41, 182, -156, 210, -84, 102, 69, 39, 18, 33, 44, 48, 5, 207, 35, -67, 17, 184, -33, -24, -23, 140, 11, -108, 24, -7, -35, -60, 2, -227, -5, 67, -17, 81, 164, -55, 124, 35, -145, -15, -25, -123, 21, -30, -10, -218, 137, -80, -22, -153, -59, 41, -68, -21, 41, 6, 49, 17, -23, 3, -67, -141, -31, 48, 0, 12, -96, -41, 214, 255, 43, 226, 225, -35, -20, -65, 120, 140, -36, -83, 113, 112, -147, 28, 183, 211, 7, -71, -102, 32, -82, -134, -69, -78, 155, -83, 19, 31, -154, 69, -58, -14, 30, -104, -173, 133, 128, -44, 3, -89, 200, 99, 118, -71, 90, -25, 38, 73, 110, 143, 65, 139, -82, 81, -68, -91, 155, -42, 298, -57, 36, 43, -148, 103, 72, -20, 33, -13, 58, -33, 146, 65, 23, -33, 273, -86, 277, 99, -30, 31, -8, 96, -86, 55, -22, 49, 154, -110, 23, 155, -25]
6705b5R0j98J10K13j75J60n8q2L5j96K24r3O9k7J30k32j34J47nJ2j44P2k2K4m8
6730a53J57J21j81J19OJ09r9n4j53K29r0q4J11M0k31O5J64J7j25K0k1Q3J02l18
6754a66K97k28L0P5J91k49J5N3J6j49L5Q0j96L74j97J6K4j08P8k4j82K65o7o8
6778h5M8OJ09o2O7rL7m7j84M1J98j56Jj62K25p6J10p9Lj47p5L79j27J18k13K13
6804A33j55qm6RP5M9j45J45J58j80J35j08n5j8L9j88J51j03J07K05l88J56N1N5
6828G4p9o1m7J20P9k53k1L73k56K82j81k40K07n2N8J5N4j09K06k8J9k43k2J05
6852@M8o5JJ17k56J95J82j93L0M0k88J55j31L08n4P1j96j02J42j19R4K28k17K0
6876A0k07K11K80k62j12J08J8k48M45k45j99K52p9j3m1N2j84J41J14j43K36k35
$$ y = [-25, 65, -133, -23, 190, 15, 175, 117, 35, 70, -126, 98, 5, 74, 47, 177, -55, -189, -42, -47, -35, -179, -107, -129, -105, -153, 4, 125, -56, 63, 69, 178, 79, 25, -128, 101, 11, -73, 38, 78, -153, -88, 76, 93, -32, -12, -33, 50, 152, -166, 131, -97, -67, 8, 199, -50, -35, 18, 34, -115, -80, 0, -196, 178, -19, -3, 21, -87, -9, -33, -215, 50, -17, -85, -37, -31, 78, 16, 83, 74, 111, 64, -120, -79, 119, -37, -36, -198, 27, -49, 61, -18, -15, -162, -237, 142, 15, 133, -80, 133, -22, -30, -76, -67, 8, 57, -88, 57, 215, 35, 170, 62, 7, -11, 28, -160, -9, -112, -5, 200, -188, -32, 19, 74, -5, -66, -113, 7, 86, -167, -188, 185, -71, 211, 30, -210, -3, -55, 3, 18, 72, -37, 169, 141, 160, -83, -105, 0, 48, -17, -16, 101, -155, 40, 222, 29, 59, 99, -189, -34, -165, 143, 89, 160, -36, -138, 4, -115, -21, 207, -10, 10, -197, 14, 294, 32, -80, 28, 46, -202, 243, -2, -201, 51, -28, -41, -82, -30, -214, -73, 41, -102, 134, -101]
6898a01K39l30K84j4L0j37J2o9Q9n1o7L02k10J31l5L2k72K76p9l0n2L08k5k84
6922e3K1R4k34K02J6J47k61K34j89P5k20J84l4J9P9p1pJ9q4P1J06j27M4O3l53
6947b59K79M4%j34l5J50l22K91p6p9N3J95P7l08M5L4K30k85Q5q5K34k76J02K26
6971A86k39qP6o4j41K81k27PJ70L5J6O5k9Jj54J4K15j83R5j98J5n8K85k31K3J78
6997A30kn4j3q6J40Rj60Q1o4p9K31k06J66m7N9j46k1K6q7P0K45q1j61K68l53J61
7023B6kj32J18K03j36R3p8J01k42k8J45j07P6Q7p0P8k2j71J77K2m02L79K6kr6
7048D3j51O4R6M8r1l5j6K39k53J37J5q1J07kj92nL4J28J03k54K25j13q2J74j48
7073a0J6J46k19J31n7J10l5O5o3j34L0RM4j9j2m1m4J93R4l87J84k34J1M6P6l7
$$ y = [-101, 138, -192, 92, 78, 108, -29, -17, -86, 3, -48, -115, 187, -23, 108, 73, 105, -167, 109, 30, 0, -52, 256, 231, -53, -32, 62, -172, 30, 46, 193, -68, 166, -23, 52, -168, 16, -18, 1, 80, 9, 2, 21, -63, 8, 114, -13, 31, 94, -259, 20, 64, 64, -70, -105, 45, -277, 14, -62, -141, -88, 107, 184, -124, -79, -45, 185, -100, -15, -100, 134, -142, -40, 186, -53, -61, 15, -49, -190, 91, -136, -129, 41, 76, 92, 157, 128, 129, -25, -11, 204, 21, 116, -82, -67, -125, 160, -71, -48, 130, 128, 74, 61, -25, 115, 124, -36, 45, -19, -98, 133, -73, 93, 46, 105, -41, -62, -36, -123, -53, 192, 111, -50, 218, -135, 26, 24, -108, 10, 213, 77, 170, 92, 193, -49, -77, 68, -39, 37, 124, 54, 132, 110, -61, 116, 138, -264, 115, 141, 139, 43, -108, -44, 52, 100, 9, -26, -42, 197, -56, 81, 96, 15, 122, 120, -72, -77, -43, 85, 188, -66, 159, 46, -36, 138, -10, 6, 152, -67, 64, 7, 117, 82, 147, 84, -50, -20, -11, 33, 14, 2, -39, -83, 110, 204, -183, 1, -233, -222, -176, -100, -137]
7099a37L8Mo9K98q2j31j27O03l64P4q1ql8o5j9O7J22j1j63K41J07j12l6j9j5m1
7125C6J45Rj53J29k21M6J70k87L33r9n7k69K19p8J99j84K04r9N7q6J12n5P1j4
7149A28j69j1L1l1N2k7K11m4k27P5p5P1p3J41J7L2j28J47k17J38J17j61M5R9k65
7174a24Q3p8L27j38J06j8j80l1J61j02L2n8J89J1j07k07J18J60n5k63K05o6L0
7197eR2Rm1m1J08k40J88r3O0o4j31N1J51n1m8Q0N7k7Q9j81l9o7K37k48J46m7j11
7224a66Q5J33k48K98j48K2k50L08J27k36J08j6rQ0j32K5O9q3J94K5k58Q2p9n3
7248a22K52p3q5n7K43k61J96O7j80P6o4Klj54K03N3k17n1J93n0j2l8K3J6J14j33
7274f2K04j19p5J86k05K70l48J07p0J18L2qn6j4J85k35k8J06o8j72K42J27m01
$$ y = [-137, -99, -95, -164, 134, 52, -79, -206, 397, 33, 107, 26, 18, -20, -85, -104, -37, 85, 74, -89, 152, 259, 147, 111, 92, 77, 36, 181, 190, 37, 166, -55, -9, 161, -126, 207, 108, 51, -218, 1, -77, 122, -62, 142, 43, 100, 14, 126, 71, 142, 128, -41, -52, -21, -52, 0, -27, 184, 140, -87, -12, -87, -16, -89, 52, 69, 101, -27, 120, -97, 41, 158, -3, 42, 141, -124, -41, -119, 208, 70, 176, 158, -22, -53, 108, 6, 38, -20, 169, 180, 73, -134, -16, 144, 89, -174, 31, -35, -5, 87, 96, 55, 14, 122, -118, 70, -23, 37, -27, -158, -107, 44, -7, -55, 25, 82, 55, 144, -37, -76, -143, 94, -154, -8, -55, -166, -81, 52, -196, 102, -46, -24, -274, 34, 161, -75, 33, 17, 8, 88, -44, -19, 50, -33, 161, 186, -72, 10, -69, -122, 130, 57, -28, -85, 158, -103, 93, 160, -20, 56, -8, -6, -9, -163, 40, 93, -124, -175, 18, -32, -44, -82, -59, -43, 71, -62, 142, 23, -52, 134, -71, 199, -149, -42, -112, 6, 38, 30, -26, -40, 145, -90, -118, -12, -80, -252, -10, 117, -284]
7297b84J50K84j78J7K1j97R8R5P5j13n8K20j51N7k6mj08o5J30ro9J84l2k7qj61
7323a59L77l50K1l9L06j40J22oj99K00Qp3j97J11M2k6o7P3K09k85LJ21j52J13
7347A3P2j67m6oJ90K5K0m8K8J64l69o1N1Q8j19K95j42j26K04o4L4o5J15r5L4J47
7373A72k22q1R5J23K32j97j04M2o3J1O9J80m05J42Q8o2J3L4Q7j15j44K32j03l20
7397b96L40r4L4N0J4l20K70J52j2j7p7Qj91K36r1j2L8J44k24n5J93j55q2Q7q6
7422a46J87r2J61N3j88L28m57R1J86p0k30K3J27K14j88k1ro2J55l6J38l07K04
7445F1R4k49P8j83J29J71k58L0R2j21K13J09M5k19n3R1k16L30j73K42k29k4L04
7468B64m34j0J44n9N6j00J13Q1p7N7k22K61l6l7Mr7J51j45o0K02k3k5o2P0ML6
$$ y = [-284, -134, 150, -28, -11, 10, -187, -89, 6, 81, -32, -90, 130, -21, 36, 10, 6, -102, -167, -37, -46, -115, 69, 37, 10, 2, -159, 218, -132, -111, -150, 156, 16, 138, 132, -67, 133, 141, 68, -129, -18, 24, -2, -69, 4, 213, -72, -69, 52, -100, 13, 85, -82, -128, -134, 56, 81, 101, 53, 81, 245, -124, -185, -134, -46, -165, 130, -12, -138, 66, 2, 36, -29, 86, -9, 25, 172, -50, -131, -36, 87, 319, 122, 18, 60, -3, 8, 77, 257, -148, -6, 82, 20, 33, 67, 154, 39, -105, 127, 24, -296, 44, -50, -16, 34, 48, -272, -2, 150, 138, 121, 44, 52, -139, 97, 6, -6, 32, 176, -48, -103, 90, -65, -147, -60, -146, 41, -51, 110, 163, -25, 303, -154, -63, 123, 53, -177, -154, -27, 187, -1, -22, -31, -93, 62, 26, 164, -143, 61, 155, -94, -16, -199, -70, 101, -157, -127, -35, -156, 57, 166, 211, -8, -61, 30, -186, 144, -29, 213, -16, -40, 264, -170, -180, -36, -95, -39, -139, -26, 55, -22, 35, -187, 74, 38, 1, 5, -92, 59, -86, -146, 56, 33, 8, -54, 16, 20, 56]
7494E6j59J55J9k29J88k03J44k4k2J76p1L54k41j90J29r4J57q3j2j34Q6k7m8M0
7518c3p8J13J06k73K78k19j85K94n6o4K13J57l12Q0J37p8q6J55j63K2J93k50Q7
7541C8j43K47j6k89J09J37n6J38k8Oo7o5j36R7O8n5QK37M8m13P3k9R6j0L8P8j94
7568h3m8L6L04k40P7J93j63j15L2J49j24j59Q8R6q6O3p5J2K86l11K20l35R0j7
7592a10m1N4J02j82L31k93J29j38O2L4l3J87j82n2L19k97L42k26p8k7Q0P9Nj23
7616e8J1P6J6O1Q9l31K41J6m6R5k37R4j80L80j75j10J95k47P1K35l14L12j56n1
7640a3j00Q4l2J65J14k27K09r1k57J72J40p7J00R4l47k8o0J89l37K45l9K10l6
7663G8k9j74K43j24M0j9J22j51P4O6l1J6j20P4LJ49k43n0R4k52J98K05k27N6O8
$$ y = [56, -103, 52, 71, -158, 30, -173, -29, -53, -75, 101, 30, 384, 143, -47, 82, -12, 145, 62, 50, -84, 2, -25, -73, -33, -111, 2, 108, -165, 113, -106, -291, 3, -53, -117, 96, 253, -59, 21, 158, 80, -6, 149, -14, 8, 201, -49, 38, -105, 142, 126, -163, -54, 83, 27, 165, 137, 143, 76, 11, -125, -28, 40, -15, -7, 230, 278, -135, -62, -91, 5, -5, 33, 111, -83, -131, -95, 209, -31, 46, 239, 76, -39, -7, 142, 18, -141, -53, 43, -43, 20, -55, -43, 243, -68, 152, -183, -93, -110, -151, -97, 5, -177, 154, -139, -10, -148, -86, -52, -85, 102, -80, -132, 187, -110, 232, 6, -72, -99, -19, 60, 65, -58, -47, 29, 45, 106, 195, -136, 105, 121, 75, 170, -67, 27, -153, 227, 52, -58, 137, -110, -39, 196, -118, 194, 38, -13, -113, -29, -61, 104, 218, -9, 200, 109, -148, 24, 164, 87, 187, 281, -66, -94, -154, 35, -302, -57, -96, 114, 78, 49, -125, 118, -6, 34, 15, 137, -14, 60, 126, 95, 111, -9, 65, 68, 217, -26, -76, 18, -234, -36, 169, -58, -2, 66]
7688F6j3q4j9O5j1O5j11q1J25k9P1p4R4n5j06J86k06M8j13K11J61j59j57J05K3
7713Bj69L28m2j30L5kLJ4Pj61L91k35l1M6j30K61j64K9j55J84m3K13k52O0o3L2
7739B8j38L12l88J90J2k07J08J7K8j9j2qL0k19K84q1Q8o4l1M13m27N0n9J45j28
7764g6J48n4q4K15k42J46l3k02L7J32q7J01J47j50P4j53P7n8J78Q4k29p3pO3Q3
7789C7M9j16R9o6L8j16J76l13J28pJ88q2O1o9j04J34n2p8J01N1k34JL48j03N6
7814A27j06j02j59K58j42K55j77p7J32o9K2M7l1J90k17K4j06J40J92j36J27m9
7836A43k49n6J52l6l6O3O0L2k71K86q3j9M2j19K75k0k45j3J03m2q2N1K19j55J3
7861A3K6j74J59n3N2l4j56K82l9m6k6p3PJ26N1m6q6j2J91l24J99Lp6M5M9p0j91
$$ y = [66, 53, -31, -50, 15, 4, 69, -42, -123, 2, -27, 44, -30, 64, 9, -97, 89, -117, -69, -182, 29, 190, 31, -126, -21, 2, -167, 161, 119, -11, 24, 22, 25, 39, 46, -115, 276, 41, 10, 56, -74, 187, 23, 52, -103, 81, 38, 251, -1, 59, -4, 28, -110, 202, -186, 4, 16, -191, -83, -66, -38, -57, -69, -77, -47, -266, 18, -63, 25, -39, -70, 343, -84, -34, -93, 52, -76, 72, 18, -66, 149, -93, 53, 20, -182, -145, -13, -100, 1, 148, -2, 72, -81, -4, -62, 116, 200, -29, -102, -109, -46, 37, 86, -30, 69, 3, 41, -75, 101, -212, -84, -91, 97, 15, 76, 7, -97, 37, -15, -93, 8, 59, -175, -174, 174, 71, 127, 21, -81, -240, 18, -124, 131, -46, -123, 9, -60, -38, 9, -22, 168, -49, -25, -131, 9, 201, 65, 192, 143, -106, -162, -10, -46, -82, -19, 41, 73, -198, 88, 5, -14, 28, -91, 184, 164, -81, -94, 9, -33, -115, -64, 155, 0, 13, 39, -135, 24, -29, 23, -11, -167, 115, 76, 30, 4, -69, -62, 64, 115, 69, -17, -29, 162, -162, 37, 40, -36, 9, 58, -12, -203]
7888b03L3K29j3nK47k81J1K2k00J85j67O9r7r8L01K0N8o3m1n2K0K5q8r3L19P2
7914B10k22K9nJ94j3k25j61K35l8J11j32N9N6k8j72J42K2j18j8J90j17QJ78j98
7938a3j38Q9r7J87J04J57k75P5j04K59o29J73K93k44L38o6j66M7K8q4R8LL8j95
7962a22J59l6O6k62J76P3j15m2l9R5j3O4p7l2O7j1P7J28j96k43K52j3n1J28M3
7987G6j29J74M1j20r6K7j1J44m6J0J19k97l5RM83k62r5mJ43j16k06M87r5n4j7
8012A30k48J29j10J14q7j41K79J1j01L3M7M8q9k34J35j52J81L8R0Oj5K3M3Q2l27
8037a15L6M5NJ06K2l3r0j59K27O7l3j02M9j9o5J3K89k06Mj83J57j52K60l0j18
8062b5J61j06r4K07q4J24k58l7J12K46j43Lj20M3n1p4K17j32J63j79K5j56L00
$$ y = [-203, -170, 59, 46, 41, 288, 7, 18, 40, -160, 25, -142, -73, -170, -268, 33, 53, 111, 48, 7, -45, -25, 0, -88, -181, 138, 210, -12, 17, 12, 206, 193, -32, -193, 42, 4, 115, -17, 42, 98, 70, -102, 40, 62, -56, -74, 116, -1, 7, 185, -13, -151, -62, -159, 28, 132, 289, 14, 89, -15, 244, -385, -212, 81, -163, 175, 109, -57, -10, 18, -66, 32, 35, 73, -122, 37, 1, 67, -195, -19, 54, -61, -103, -142, -47, -60, 4, -73, -105, -38, -49, 28, 156, -40, -283, -31, -44, -95, 33, 76, -53, 121, 162, 42, -54, -27, -38, 106, 60, 70, 189, -108, -143, -134, 349, 87, -8, -12, 131, 15, -191, 296, 201, 147, 130, -118, 11, -99, 15, -72, -213, 66, 77, -24, 9, 56, 104, 15, -219, -84, -236, -55, -17, 73, 79, 64, 87, 130, 212, -115, -79, -34, -29, 77, 99, 66, -24, -183, 44, 111, 78, -24, 25, 6, -59, -46, 243, 37, 41, -142, 15, -137, 123, 93, -25, 136, 30, -64, 143, 59, 183, -75, -112, 0, 246, 103, 106, -14, 29, -22, -96, 121, -11, 152, -27, -2, -158, 142]
8085A42k16K39o9k36M7J05j28J60p2j27q4K15j77o2K31N8K0p9k5j8J86J8n5j50
8109g7J38k38J85n1M2j84K42M4k6l06L82q1j9p7L1j05m1N7J35q8n5K47l0j75Q6
8134C6m0J89k12K63r7j49k31J93O6k62L20j89P0J03J21l10J90R5j76j84L1K76
8156A03j17l1Q7j17q1K63j41l0K29j92r7K13PJ12k59K40k03P7j30NK59j50j28
8179h1J66L2k90L14j75N6R4l8Q9k60L1j3
$$ y = [142, -74, 165, 96, -140, -93, 12, -116, 44, -28, -155, -239, -24, -201, -263, -32, 26, 46, -33, -58, -76, 110, 128, 73, -77, 61, -177, 8, -43, -1, -185, 57, 101, 75, -231, 151, 70, 51, -26, 5, -100, -141, -84, 51, -37, -92, 155, 125, -50, 36, -4, 185, -27, 236, 139, -10, -241, -48, 18, -244, 76, -113, -43, 60, 181, -129, 61, 156, -20, -204, -173, 103, -14, -45, 42, -75, -156, 107, -34, -64, 165, -27, -124, 89, 96, 208, -51, 189, -14, 63, -67, -62, 197, 47, -81, 85, 117, -173, 141, -34, 22, 116, 78, 167, -93, -62, -75]
8191g5
$$ Imaginary data points
##PAGE= N=2
##DATA TABLE= (X++(I..I)), XYDATA
0@%%%%%%%%%%pJ5j6J6j8K6l2M0n2O0p2Q8j07J31j55J81k13K49k89L34l83M38n00
33b66N67o44P29q20R21j034J158j292J439j600J777j968K176k407K657k929L229
50A693l557L917m315M754n242N788o400P094p885Q798r866J1137j2681J4593j7032
65i204K0279k4844L1811m4288J07581l23987L44827R4135m44906M20321j13369
76E8356j96160K36476p5907j45122J38184K9799j00044N0588K8001j41943J32222
87A4450l1074q1871J51325j04380L1019M9445j85801K00347k6077j63174K15379
98F9588q1103j08779J49730o8506o8431J26815Q659j50522J05903L3164j88996
109a72478J96008p367j81867K49057j17897j17072K18754j38030J7753J01636
$$ y = [0, 0, 0, 0, 0, 0, 0, 0, 0, 0, 0, -7, 8, -8, 8, -10, 16, -16, 24, -28, 32, -40, 48, -59, 72, -83, 98, -115, 134, -155, 179, -204, 234, -266, 301, -343, 386, -434, 487, -547, 611, -681, 758, -842, 935, -1033, 1143, -1264, 1393, -1536, 1693, -1864, 2053, -2262, 2492, -2750, 3038, -3362, 3732, -4153, 4645, -5221, 5916, -6765, 7828, -9204, 11075, -13769, 18042, -26246, 81335, -242652, 102175, 196310, -248596, 171725, 58356, -137804, 98672, 22765, -122357, 15827, 45626, -54418, -3830, 24171, -117772, 14450, -16624, -98495, 52830, -51550, -20531, 28914, -156887, 43460, 17383, -145791, 69588, -11515, -120294, 29436, -39070, -107501, 19314, 27973, -122549, -16646, 16518, -172478, 23530, 16163, -165704, 83353, -34544, -151616, 67138, -70892, -53139, 48497]
119D8497j25400P0874j5610m3794P6801l8390K0922J8258l2933J0220L454J4187
131G086k1740L1935O763n1111O0168m2619j7908Q4531o8013K2666L2082o5026
143b1186M3032j6594j451L9715m0076K7270j0047l0270L6419j0385K724O893K585
156B8629j5895k2117M9870l5041J079O2143q6128L1353L8042q8319P0720J274
168C5610n3881O3154m3450j0184L8281m2514L0165Q937l9004L4836q258m0305
180b6613M3153O536n1667N3867K585q0741P7054k415q1655J05303k1804q3970
192f0367R8991l5494o0150R6132k7472n4188P0211k3227n4058O7548r050m7922
204c9046O4461k5026m1065O0575l4633q375M7992m8711J9425J7179n2575M8389
$$ y = [48497, -76903, -6029, -21639, -65433, 11368, -27022, -6100, 12158, -20775, -10555, -7101, 7086, -14654, 17281, 24044, -27067, 33101, -9518, -27426, 57105, -10908, 11758, 43840, -21186, 21846, 5252, 3801, 43516, 3440, 30710, 20663, -9607, 26812, 16427, 19151, 26044, 28629, 12734, -9383, 40487, 5446, 6525, 68668, -17460, 13893, 51935, -36384, 34336, 35610, -18271, 44883, 1433, -8751, 29530, -12984, 17181, 26118, -12886, 21950, 13692, -26613, 16540, 23076, -28591, 25276, 27861, -52880, 24174, 21759, -59896, 45407, 23603, -60367, 38624, 3130, -57020, 39112, 11640, -42548, 27663, 4436, -49622, 17926, 8876, -39046, 25415, 389, -40676, 19899, -14734, -23109, 24883, -23828, -4403, 12776, -39799, 8590]
216H590n450m1636O4552k8880l9620P0156m1091l1334Q1367m4589l2698P8760
228C8127n5739k8792Q3712n1696k0508P5100n7779k0037O5707m6043q353N8249
240C1948m3357j2798M5587l7606k306M1813l4485K751K6061l6171J3684J7074
252A2195k7739K4113J413k4904K7506j1401j6354L3309j7224r409L1351k7110
264d254n754L0517k6929M653K7015k9305M157J6613k4423J0685J4956j6426M955
277F460N785j3937K601J1482p461m09R913j3836j842J2748j2190M726J0744j6037
291a253L773O519j3149P000O261j0614M011M815j0986J201P893q390P81R606j0020
306b552l405R264q565k835J4266p384q793J3833r771q477K0495j0485n953J7818
$$ y = [8590, 3140, -38496, 26056, -2824, -42444, 27712, -13379, -44713, 36654, -7935, -40633, 38127, -17612, -46404, 37308, -14388, -34896, 40204, -17575, -37612, 28095, -17948, -26301, 31948, -11409, -24207, 21380, -16226, -18532, 23281, -11204, -8453, 17608, -18563, -4879, 12195, -15544, 8569, 9982, -14922, 12584, 1183, -15171, 18138, 914, -8495, 22856, -4254, -10008, 20509, -6420, -1767, 25248, -4057, 100, 16713, -7710, 2975, 17931, 1505, 6460, 12245, -1692, 909, 12391, 4930, 4521, 14434, 598, -1244, 11504, -686, 4040, 14784, -1253, 2520, 9039, -4110, 2890, 9151, -1463, 2548, 7363, -3623, -2422, 5471, -2919, -2138, 7468, -2552, -5957, 3307, -5258, -8093, 6173, -1211, -10004, 3829, -5942, -14419, 6076, -4409, -10362, 7456]
320G456j7809k240J7204j5179O145Q642j6518R059J221j0315J4394m530o783J2531
334C278r934k724J4581j1375r85J5082j4053j036J6247j5855o52J9432j7399l13
348e706K0021k0721q35K2026k0126J418K2191k4492J501K1406k4111O812J9272
361A8656k5299P411J3279k2673J2456R631j9125J2019J828j4742J3249n66q620
374b496J0468n334n868R893n926j917Q438p580j250P257q141M98P957r114N33
389b582Q873j1100P37J0384j3291K887J1730j5897M671R884j7331Q311R078j6578
403a0224J0398M314j6546J0920L778j1513J0563M94j1152Q003J438p019P630J117
417B201p752M843R93n872O200K040o406M295R64o056N849J126n466O038j052m952
$$ y = [7456, -10353, -12593, 4611, -10568, -4423, 4219, -12299, -3240, -2019, -12334, 2060, -2470, -9253, 3278, -6656, -9380, 5201, -6174, -7159, 7923, -6130, -7166, 9081, -6774, -7426, 12006, -5393, -5706, 14315, -6406, -7241, 14785, -5341, -3923, 18268, -6224, -4723, 16683, -7428, -616, 18656, -6643, 768, 14047, -8626, 3830, 13461, -5664, 6355, 8183, -6559, 6690, 6124, -2496, 7972, 2638, -3230, 6663, 737, -1180, 7258, -322, -1572, 5685, -2456, -1958, 5999, -3115, -2582, 6291, -4809, -4072, 6312, -6979, -4092, 7638, -8259, -3588, 6296, -11035, -2724, 6354, -10224, 174, 4488, -12058, -1138, 2640, -8873, 1690, 2184, -8968, -965, 473, -6546, 1084, 2201, -5551, -708, 285, -5587, 613, 2653, -3753, 542, 1506, -4550, 1299, 2425, -3041, 2997, 1945, -3007]
433c007O987l169l287P890n058m71O619q278J778N114p335N261K817q289M974
448B546O86o287O361J024n076L479m59n692M737K661n271L358J100p294M229L589
464C691p280N760J788r317O261J286p737P765k36p316P650j706o128P001k227
479g45l389O304l207k624M628l054q40L950k067L64J497l457O28J871p18J303
495D44K45k385M65J292j261J201K603l626K00K499m755L529K744n917M229P02
511B209n860N721m59m572O431k367l535M714j873k105L710j387j769L720j884
526F94l001L097m46j503L549k109k433K325q25j020K678l35k212J394q93j872
542b912L863l18k424K984l268n57L857l528J876K077m482K747N9k418L605j304
$$ y = [-3007, 3980, 811, -2476, 5414, 356, -115, 6504, -1774, 4, 5118, -2217, 3044, 5861, -2428, 2546, 3232, -3055, 3306, 4330, -746, 2733, 2274, -3418, 1319, 3980, -1291, 2067, 3167, -4127, 102, 3691, -3589, 2171, 3959, -5358, 903, 2189, -5548, 2217, 1981, -5335, 2315, 609, -5519, 1482, -745, -4134, 2170, -1037, -3661, 967, -2087, -2927, 1023, -1044, -680, 817, -2640, -2012, -141, -859, 444, 689, -1696, -1231, 61, -1200, 1, 2604, -1022, -822, 1677, -3078, 451, 3195, -2722, 1507, 2209, -3651, 2070, 1611, -2961, 3470, 1103, -2432, 2282, 409, -1696, 2014, 627, -1142, 2578, 694, -2307, 790, 344, -1159, 2390, 281, -2152, 173, -652, -1672, 1006, 671, -1541, -147, -1040, -2912, 951, 633, -1791, 1193, -2075, -2632, 1225, -2303, -427, 1650, -2832, -85, -26, -2444, 1161, -143]
558a43j411K761j469p14J355m86m11J833j40j643J112k0j858K839K18j636K193
575B380j254k381K904K17r25K424j772k546L088p35j018L516k498j185K294k620
591a11N12K157k142J080Q0j793J020m94j89P92o26K98q65m33K43m41Q69k79m67
610g89P72j964j22Q56n36J476n1k418O40l46o07K531o03j004R10j626o48K227
628a302p29Q17M03j875N17J36K0J047o8J26r5p15J125m33L29J266j037Q58J12
647E02j663J195N93k98J359l17q35M39n13L65J534m57J26k14r79P43P7L88J293
666C338j475j89L95j393J749N2o56J005j865K72O65j339J817o91q36J257j997
683A09Q4J202j540J249J09j272M08o63m50L71L62O2j64l15r64k14P82J45K2j40
$$ y = [-143, -1554, 1207, -262, -976, 379, -107, -518, 1315, 1175, -468, 644, 624, -1234, 1605, 1823, 187, 2380, 1126, -1255, 1649, 1866, 941, 3365, 1593, -953, 2135, 1400, 382, 3898, 1400, 215, 2509, -111, 401, 2558, 416, 1496, 1576, -217, 803, 309, 120, 912, 286, 584, -281, -714, -471, -912, -43, -322, -789, -17, -1981, -2103, -1247, -1783, -307, -358, -2776, -2136, -2482, -3089, -558, -1161, -2165, -1255, -2881, -3529, -1302, -2031, -1214, -811, -2686, -2169, -2033, -2013, -966, -1034, -908, -1003, -1718, -593, -1026, -697, 569, -468, 390, 502, -1161, 34, 627, 329, 1688, 1371, 536, 975, 462, 827, 2361, 1904, 2030, 1816, 837, 1580, 1657, 2045, 3338, 1863, 1674, 2069, 676, 2425, 2477, 1821, 2826, 961, 1233, 1898, 559, 2376, 1685, 849, 2106, 109, 193, 1395, -145, 1104, 1213, -59, 349, -314, -764, -393, -31, 31, -133, -448, -1412, -1626, -844, -699, -677, -817]
703h17m81p02L45P59m79R36l73j826J699o68m09K418k239N26J180k432J974J71
721d18j339J841j134J25J019j358Q85K0PQ47r08L79l06KJ036q72J245j70j510
740f09J221m27j68J761r49o99J018j047k11J574m79q25J772j997o52K497j899
757a19K21J520k514J045M41j428J704n85o99R52o79R3o50M41K75q39J237o55q80
776a119J439j749J040P64j558J446p07j316J835m80l58J560j466l93J166p92L14
793c74J434j501k88J398j543N23J606j723P66P15j388Q81K60q41L73M84j94j67
811D21O03m12o32J631j231k21J910k235K49J580k070J373N64k161J450l26j123
828f30J767n80n51N06o52j74Q36l51m67P05p94l22P34m97J01L90n13l49N65k73
$$ y = [-817, -1298, -2000, -1655, -896, -1375, -439, -812, -2638, -939, -1607, -2016, 402, -1837, -1311, -131, -2563, -589, -418, -1757, 84, -1050, -925, 94, -1264, -379, -359, -352, 495, -413, -34, -340, -338, 698, -174, 1071, 901, -609, 612, 185, 17, 1778, 829, 130, 1148, 101, -110, 1464, 985, 160, 1932, -65, -717, 1780, -119, 102, 1622, -892, 153, 594, -834, 870, 285, -414, 538, -141, -48, -698, -257, 18, -821, 416, -239, -1119, 320, -1429, -389, 375, -1183, 263, -444, -1760, 75, -405, -763, 797, -669, -1062, 104, -688, -374, 1060, -441, -729, 669, -874, -351, 1255, -468, 298, 1013, -375, 506, 766, -75, 298, 782, 588, 421, 1024, 612, -20, 1611, 380, 159, 2069, -166, 83, 1663, -407, 966, 1530, -631, 819, 493, -630, 1137, 557, 6, 512, -140, -314, 522, 171, -296, 409, -385, -707, 27, -470, -369, 21, -492, -841, -276, -549]
848e49m80O75m10n34J507q27p11J521j501n5K118k071N09J189k227J204J233k009
866a418J426K57j733J405M19j212J228J79j368Q16M31o91P63M16j224P15L03r32
884b20J043L13j450J353j86r17J391m08j089J703q62n49J727j828o7J888k094
901b52P15J244k149Q42N63j648J356L13j533Q77O8j421J425J57j390P14K06q72
919g85L40O16j114N02N66j609J257M58j644J057l6j396J866m28j091J509r36n41
937a409J671j069j31J262j462O46O86p82L92M37q24N29K95l61L62M9k23O8N34
956F70l46J40K92m21o5R17q54K68R52j457M87R42j449J498k33j392J103N0j225
975a23J486l41j081J145l99o12R16n58m55O67k47m75N49j60q01Q17l15o86O49
$$ y = [-549, -1029, -354, -764, -1298, 209, -618, -1329, 192, -1309, -1364, 754, -1317, -808, 381, -1846, -642, 591, -1418, 8, 265, -1468, -63, 356, -856, 372, 551, -817, -1, 430, -261, 502, 918, -306, 409, 712, -220, 823, 1136, -314, 1039, 853, -64, 1327, 919, -170, 1533, 671, 122, 1849, 21, -46, 1842, -252, 463, 1707, -442, 400, 963, -685, 671, 984, -549, 328, 396, -1025, 400, 557, -833, -119, 87, -785, -445, 171, -943, -441, 125, -1484, -227, 231, -1413, -356, -392, -1788, 78, -350, -1441, 68, -868, -1409, 262, -807, -938, 324, -1138, -492, 194, -588, -196, 241, -583, -54, 241, -120, 242, 291, 68, 136, 670, 324, 464, 756, 335, 270, 1187, 333, 601, 1553, 96, 583, 1525, 76, 1574, 1341, -51, 1052, 1102, -123, 1363, 1022, -59, 1086, 687, 75, 991, 433, -22, 645, 398, -77, 472, 312, -489, 328, 13, -673, -24]
994b4J63j263J080k98n96J219p77n90J363j308j94J494j521K67R26j524J092M02
1012h9j489J134j5q57J044n0q00R97l05p46J154o0q07Q87l5j036J203K01q62J000
1032D69k06r62J527l39p06J136n11q07J490p80m90J498j343J32J331j349K71J163
1050A524j674N23Q58j209P71O5j062N71L18m63N43j51p95L27L24n89K41M91j063
1069d50P63J41j254J240l23r39J155m55l67N87n41l38R78o07k60R96p95m19R16
1088B8p67J03P79p41k8O55p67N35L22m97J50K98m99J2N52m4l94O13l85m10J161
1109F76q35j1Q21j213O93M39j006J011N4r50Q21n2n27N92l65k44N69j12j86L71
1129E46j18m44P67m36l12L72m16k56N29j09p2R5l35k99M90j1o20R33m99n21J101
$$ y = [-24, 139, -1124, -44, -342, -938, 281, -496, -1086, 277, -1031, -1225, 269, -1252, -985, -59, -1583, -491, -89, -1578, -444, -459, -1316, -272, -322, -1122, -125, -430, -1176, -22, -82, -889, -2, -37, -1073, 130, 331, -531, 469, 263, -699, 828, 489, -217, 919, 408, -399, 1091, 311, -179, 1319, -24, 108, 1439, 90, 361, 1524, -150, 373, 1231, 22, 793, 858, -204, 367, 685, 222, 765, 614, -181, 146, 470, -119, 122, 613, -450, 313, 454, -800, 440, 117, -822, 333, -122, -489, 98, -443, -781, 197, -410, -670, 326, -469, -888, 28, -739, -636, 143, -598, -626, 29, -738, -203, 119, -378, -228, 70, -429, -417, 135, 91, -303, 310, -75, -485, 676, -159, -170, 651, -562, 131, 570, -436, 575, 629, -321, 500, 448, -79, 513, 148, -96, 473, 361, 175, 546, 428, -16, 751, 315, 3, 375, -41, -297, 232, 123, 51, 146, -189, -488, 2, -9, -629, 304, -195, -716, 385]
1150C85j072J32Q84j366N96N77r62M84L01o95M62k6m85M98L0l27J75N93p07O33
1170A10J27j048P47M9n85R69m17l06O99l37k87P60l9n24O07k75j37P18m12n07
1190h8J169r17j63J129j054M53M91q75L54K19m11M17k12l78K98L23n23n2j4k04
1210c8L02J87n62J57J19n58L60K93r05P57K4o80M59k86k23M85J6o66O24k25l76
1231g36N32k50k46O17n55k00P28m45O5K04k17K63J41o40L76m2J94p9L93n44L8
1252d03M55k29J26M21o39J44M50o00L59K91n35M47o4n81Q95p8j99K23j99j91O77
1273G70k95l56M18l48K8L70j70j44P6l39L57q3j15o4k6O9l34M46p9m84M36m92
1295c59K26N36o30J56J21m57J87M21m50J18L2m43M10k11j80L13J36n00J75O4J52
$$ y = [385, -687, -555, 329, -1037, -441, 136, -826, -342, -41, -736, -274, -300, -785, -287, -257, -584, -409, 184, -523, 110, 237, -811, -64, -15, -600, 369, -48, -354, 345, 8, -279, 481, 442, -82, 525, 250, 113, 831, 419, -88, 1081, 164, 1, 1130, 76, 529, 1020, 145, 499, 718, 307, 724, 512, 134, 432, 755, 232, 180, 166, -38, 264, 451, -111, 46, 165, -393, -33, 260, -645, 112, 136, -544, -85, -371, -594, -109, -93, -759, -135, -360, -736, -204, -454, -700, -83, -638, -838, -110, -555, -490, -286, -503, -240, -99, -739, -363, -405, -211, -290, 103, -441, -403, 52, -177, -51, 370, -269, -125, 325, -275, 84, 375, -160, 287, 223, -358, 537, 459, 260, 483, 284, 93, 770, 475, 119, 537, 189, 217, 587, 417, 273, 349, 10, 367, 284, 169, 105, 79, 148, -186, 260, 181, -303, 133, -359, -133, 403, -227, -71, 50, -407, -220, 201, -249, -131, -99, -542, -132, -343, -523, -210, -74, -574, -399, -335, -183]
1316a83j75J09j50J18L13j07K51k20k76K58P0q1J15j98j70L82n7k30N59j94m6
1337H8J58l13K34K25n16K32R7j33K20J54j36J37l52M5J08Q6j1j9Q3j73r9K40j25
1360B30l5J26m25K41J6M0k04L5k55M56j80k00l8j30mK30j21l02L35j15j61L38
1382a23j38K8J86k98J29j47k0K60k03M2O9j70J01N9J26k36k0L31n2j39N01k78
1404Hm2k7k18M83k41j16L16N2j96J11o0L2K69k3J39K3m64R8K26j63ML10j25k59
1428A37L93j93k59K33jj58R4J3J1q0j17loJ11j93J18j53j7J20k77L13k61K8Q0
1452f7k83O4K83k35J19q7J04r7q9J51j62K10j18J8k1K5J16j53l8j03L08o4j17
1475b36J09J0p0K65p1o9J45j98j37M59k14K42o9j06K01k7j6m6p5J34J09k28O7
$$ y = [-183, -358, -249, -399, -281, 32, -75, 176, -44, -320, -62, 8, -73, 42, -156, -326, 56, -1, -231, 328, 134, 88, 246, -67, 167, 392, -124, 108, 205, 72, 292, 446, 310, 447, 95, 140, 248, 334, 323, 304, 387, 214, 115, 355, 230, 195, 321, -104, 137, 153, 193, -11, 24, -231, 225, 45, -155, -193, -323, -327, -97, -218, -520, -185, -300, -461, -123, -261, -233, -47, -345, -216, -363, -383, -123, -326, -284, -215, -385, -284, -225, -99, -335, -355, -24, -76, -215, 286, 8, -34, -61, -279, 204, -37, -153, 163, 215, 19, 130, 70, 102, 371, 348, 487, 510, 46, 144, 370, 207, 211, 521, 396, 137, 530, 337, 78, 311, 310, 152, 246, 259, 270, 190, 73, 70, 64, 175, -18, 100, -53, -70, 50, -227, 86, -175, -147, -67, -350, -286, -3, -238, -119, -206, -102, -199, -288, -137, -299, -89, -207, -189, -210, -185, -69, -222, -260, -363, -55, -119, -236, -127, -117, -187, 78, 7, -62, 83, -115, -252, 207, -7, 235, 166, 60, 261, 234, 218, 172, 97, 231, 340, 112, 179]
1498A79p2J58R5q1j25L2O3J35k15M1m8L7j35P2j60k35N14k53l7L3k64K96O0o4
1522B6j35P1j21M9Q2j65J20J7Km7j00R3n7Or9j26N0R3j05J76k31L83K4m26K83
1547a37J64N1j70j89K69q8k4rK48j76J93J23j11Jj08K5J44o4N9J8Q1j77J79J9
1571C21J41l06J90l0m3N4k19J33j48L07k90K68j19J16k30j24J45r8lK15j54k03
1593g7R6j7p5k31K91j24m3o5OJ49r8k30J81n1R9rJ77l31J38P3k59L08m3k99K27
1618b07k4j50K71j66j25M06k36J10J21j43R6j10J21J52L2k02k03L01L40o22L94
1639A56n4n0L5j4L5QM0P6r0j06J86K38k61k4J2R5j8p6j01Q6j68K6Q0K2Q3p6m5
1666I5NJ01j36j12j7L8j74K69lm1n1j53N4j6J4K2j37M2J80m8j43M3j87J35j30
$$ y = [179, 107, 265, 360, 279, 154, 186, 249, 384, 169, 210, 162, 199, 64, 136, -24, -259, 255, 2, -35, -2, -266, 30, 90, 26, -109, -38, -159, -110, -28, -193, -73, -56, -54, -101, -201, -108, -165, -159, -258, -384, -334, -241, -346, -170, -401, -18, 6, -420, -137, 27, 78, -92, -281, -12, -100, -124, -133, 115, -61, 132, 255, 144, 145, 37, 62, 206, 142, 201, 219, 300, 123, 302, 321, 462, 156, 346, 316, 273, 327, 108, 241, 93, 400, 110, 378, 259, 375, 145, 21, 166, 68, 65, 280, 126, -77, 19, 2, -73, -304, -13, -137, -180, -245, -239, -90, -188, -418, -237, -288, -189, -198, -21, -352, -214, -141, -400, -92, -135, -434, -207, -231, -381, -110, -276, -401, 5, -231, -121, 0, -143, -47, -157, -36, 116, 148, -54, -257, 44, 384, -238, 156, 102, 52, 87, 73, 108, 116, 156, 232, 142, 36, 222, 460, 199, 175, 187, 282, 264, 188, 87, 173, 5, 31, 111, 133, 216, 140, 95, 100, 201, 65, -47, -64, -26, -200, 69, 66, 25, -26, -179, -125, -141, -127, -105, -242, -200, -20, -68, -211, -168, -355, -220, -350]
1691c50N02m48J83l4k7n2K51k54J20M0p4j7j12J19R4J6j01n5K50j56L22K3l03
1714f3J50N7R8P5m55m5K65K22n4j46j7q2P3O5r1M13l45K06l52P9K4K03j82N5j61
1739hM1k07J75m5LQ6p5R4j39P4P2q3j67M7K7k70J76p7J41l18L53Nr7RJ99O4l31
1766b51J94k13OJ73K2q0L24l77J40J71k66rk17M52q7J4o6k3J76r0mj61J87J05
1790A20m2K4j3q7J51o0J17p3M9k39L76k44m1K63k77J41j22p6L58k61n9K19n5j9
1814A50pj95O8n0o4J83Q0pm52K13P5J79l03R8n2o2J22j35k8Q9k11K95j32P4kj46
1840b20J21j90m6K65k33J06J28j63j19M7K17j73K96k06pK7J36MnO4O4q3k0m3K1
1865a2J91k87O3K81l7K8n6q0r7K36l17M25j70q1O8l2J66j70j25K17pl2Ok18M19
$$ y = [-350, 152, -296, -113, -147, -174, -226, 25, -229, -109, -69, -143, -160, -272, -153, -59, -43, -144, -199, 51, -105, 217, 240, -63, 87, 144, 242, 317, -138, -183, 82, 304, 250, 104, 87, 5, 78, 143, 52, 465, 120, 326, -26, 53, 77, 280, 98, 153, -8, 33, -174, 1, -44, -41, 45, -30, 64, -75, -1, 71, -12, -179, -132, -105, -375, -199, -276, -135, -453, -100, -95, -192, -183, 16, 80, -251, -57, -270, -264, -91, -69, -149, 175, -202, -62, 109, -157, -166, -383, 69, -18, -4, -70, -93, 83, -7, -11, -172, 15, 120, 78, 102, 89, 2, 153, 93, 210, 137, 186, -53, 323, 79, 38, 301, 24, 165, 43, -33, 325, 64, 5, 224, 169, 150, 143, -52, 16, -34, -98, 85, 165, 158, -294, -81, -6, 173, -130, -32, -84, -146, -24, -159, -187, -98, -309, -14, -146, -72, -74, -220, -99, -289, -335, -70, -303, -197, -69, -232, -351, -304, -87, -260, 36, -170, -177, -150, -14, -10, -15, 49, 113, 30, 10, -33, -12, 179, -108, -45, 236, 199, 227, 171, 91, -6, 230, -87, 338, 168, 87, 155, 123, 289, 119, -6, 211, 204, 172, 178, -40, 379]
1890C79m20J87k51J61J28j00Q9n1j54k26M7R7p7j19J25Q0J9j51J48p1j83K7K77
1913c9k0Q8j06k10L47j57j07K66j48j39K78j05p3J23j08J7L1j31L31o0K4K4J4
1936A40k96J03L18m85J76J13p4j9J19J9l3Nr8L71m39k3K40Q9k1m0j25J98n8j09
1960G1p2O8J09qj8J36l57M4J55j27r5K11j79N1%j2P9j7n8m2k51K09lp6L06j69
1986d5q9Q4l7k56M04k74J40j74J1J02J45J0L9m3j01K35m29L67j02J1l8j06K05
2009E9p4M2j19J88K0n6q0J96o4K21k27j9L1o5j31J28l9J64O6J42l02Q6j56O7J80
2034B58J71m41j4N4oO8J06j77L2j03K23k40J26Q6l32O4O1j38QR4KJ11j62m1M4
2059a46O2k8mk9m0J20j14J7J46m0q4j36J22J20p0K4kJ02l0j25O3km2K93k73R0
$$ y = [379, -41, 146, -105, 56, 184, 84, 173, 122, -32, -258, -211, -114, -191, -310, -185, -105, -86, -237, -89, -160, -343, -316, -39, -59, 29, -77, -287, 60, -97, -204, 62, -86, -225, 53, -52, -125, -2, -110, -93, -62, -193, 138, 78, 102, 126, 140, -156, -53, 265, -220, -44, 69, -5, -24, 95, 114, 81, 86, -12, 359, -80, -103, 137, 226, 205, 165, 40, 238, 180, 71, -1, 67, 176, 168, 150, 286, -71, -27, 128, 1, -94, 117, -62, -11, -11, -23, 56, 39, -19, -61, -312, -103, -106, -182, 124, -45, -134, -50, -87, -343, 61, -213, -73, -247, -236, -134, 11, 21, 60, 17, -84, 151, -278, 89, -13, -2, -40, -146, 59, -15, 27, -92, 96, 116, 60, -20, 176, 112, 333, 106, 87, 118, 53, -78, 50, 11, 175, 241, 383, 81, 167, 11, 78, 258, 429, -12, -26, 28, 22, 90, 196, 19, 51, -52, 171, -69, 57, 143, -189, -125, -64, -202, -194, -100, -98, 13, -149, -190, -146, -84, -112, -116, -145, -185, -65, -179, -162, -16, -56, -140, -276, -154, -34, -104, -80, -82, 20, -10, -135, -72, -74, -116, 177, -96, -6]
2085fk70K75l2N6J00J8QJ9j47K41m05J15N4j45P2J92r2J6M1l26L21K10j14J36
2109C37l86J95k8l7K09k57j9o3J47n4q2k9k1l6J19J39k14J0J40j89J43j62J61
2132B3p4N5qk07J94P6j4j44%k9J02j08j09M11m44K59l7M4j46J71k17K68N3j63
2156d4J61o8k45K69M1J4J9j9N3q0n4K9J07j54J71J22k26m5l6K22k06M9J81r2J8
2181A87LJ1j38K07j16j62K42k40j33K57r8K7j78M9M9Q1p0J9J28k17R7k1O4n3o
2206a1j43J47N4l2j68M7j42J62j17L22m5j2L1l6j25J17l3j2j10L6nk3J29p9k18
2231b66K18m2l2K3q9l4K37j89O4K36k51J47n3RK02k70J40j1L0J4J61j90J53k27
2255b0O0P7j57M7M8j49m9L87j81p8M5M5m8k2j7K5j06J16J09K4j69j6j78Nj12K24
$$ y = [-6, -276, -1, -33, 23, 123, 141, 149, 168, 21, 262, -143, -28, 26, -119, -47, 145, 53, 69, 110, -216, 105, 315, 201, 337, -49, 146, 118, 81, 290, 33, 14, -49, 98, 44, -38, -67, -88, -124, -5, 134, -80, -70, 70, -119, 24, -138, 23, -51, 4, -4, -211, -17, 59, 45, -99, -99, -128, -26, -134, -243, 168, -276, -17, -54, -10, -156, 15, -202, 66, 119, -44, 117, 49, -196, 73, 114, 128, 147, 128, 181, 101, 47, 76, 183, 29, 200, 322, 96, 51, 15, 237, 31, 80, 261, 169, 187, 190, 201, 63, 270, 154, -8, 234, -6, -139, 118, 20, 47, -131, -82, -33, 48, -22, -3, 125, -92, 5, -16, 48, -5, -11, -154, -7, 47, 15, -153, -106, -248, -86, -203, 119, 74, 62, 93, 57, -68, 49, 16, 4, -106, -70, -75, -98, 31, -48, -266, -48, -90, -122, -99, -188, -222, 15, -174, -110, 126, -125, 22, -31, -22, 180, -90, 50, 39, 69, 83, 244, 54, 207, -20, 40, 117, -40, 7, 55, -94, -143, 244, 63, -15, 30, 75, 27, 5, -12, 13, -93, 23, 132, 156, -13, -29, -207, -202, -314, -90]
2281i0KO1Q6j49j1K5Rk38J68K40n1Kj79P4O8j4O3M8k28J86j53L4j57L07Lk34K0
2308a08L41j52o4k2j8R9j3j37J79R9k7o9J18j41n7K22k32M7N1J36j36k56M01j37
2332A24j7K9k30O2J52n7j25L03l36J28j12p9J83o1J41j5k7J65m26J05P7Oj11R7
2356b4K20l16J57r9J1m7j72J91m7J06J3j16J85j26n0L5n8J6J52K7k99K4J56r9
2380a60q3K43o0J29o9j16N0N0K8j49K11J66j67o0n9J70k60K1J74K09j26j9J8m9
2404I2j59L6J57q8J56k1p8L6n6M5j43M4R5m4k18K27J33j29j72Q1k6j3J40l40J90
2429e5k4J28j79K27j05j54Q4R5O5j77kJ66r4N9m1J28j01k23J29J35j20kj12Q6
2453h7J91j44M2MPP7j40J16j26O6r7K2J50n5k3J42n8k33J40K35j61j52J80K21
$$ y = [-90, -88, -27, 59, -90, -101, -76, -67, -305, -137, 103, 52, 54, -125, -51, 17, 3, 66, 114, -114, 72, -81, -47, -204, 103, 106, -128, -108, 233, 81, 17, -5, -23, 76, 63, -74, 105, 204, 177, 108, 226, 85, 28, 250, 18, 65, 116, 252, 116, -140, 261, 124, 107, 136, -94, -32, 120, 63, -62, 241, -95, 33, -79, -158, 25, -36, 105, 90, 63, 228, -198, -93, -16, -10, -121, -24, 196, -120, 37, -62, -51, -98, -270, -79, -126, -20, -7, -123, 62, -64, -114, -79, -137, -121, 31, 58, -241, -217, -61, -160, -243, 0, -60, 69, 0, -116, -66, -16, 12, -137, 74, 240, 73, 13, -46, 124, -136, -115, 59, 268, 142, 123, 141, 92, -67, -31, 126, 38, 194, 173, 95, 131, 75, 120, -23, 21, 116, 72, -146, 81, 214, 85, -87, -6, -32, -45, 95, -245, -55, -79, 49, -130, 97, -8, -162, -78, 17, 82, -95, -97, 69, -25, 34, -7, 121, 20, -203, -74, 61, -59, -61, -173, -87, 104, -40, 2, 6, 13, 90, -50, 66, -60, 6, -91, -69, 81, 26, 3, 145, 87, -146, -6, 229, 68, -84, 96, 317]
2477C17j53m1K9J36j46j43R5N5j2p4j94K85j80O3q1K1J49j14Lm2l8j57K77k68
2501b13K83J04k20J52m05J68M6O0P1j72j12L01k17O3n3J58j55J93j25N7j72l3
2523b21J20j28J19J70o7n1J33j13o1N6j49J90r7M5J82j78K23j1j07J09j64L1q0
2546d9K30l3k15R3J22k82L22J34k49P8L3o1N6j03L6M4j91O8J57O2j15l0j36K6
2570cJ4nj51L10j86J86q8k29O3L3%M5r2KL2oN5j57M41k93j65J20J1J11j97n8J60
2597d7N1J4j34J56k12OJ82k2p2p2J62j26J84q1Nn5J18o4P6J13j50R2j12R2J74
2622B78l60K06P2j40j1j38J04L5j08J7K8j1K28L3k80K0J69k66j7J73j65P7J52
2645I6J23l21J49r2q3j1K78j34r6j09J64R7J54k12jk8J40j99L0N2j69J87k84l1
$$ y = [317, 164, 123, 152, 288, 142, -1, 94, 149, 137, 63, -131, 154, -26, 37, -44, -23, 126, 12, 15, -27, -65, -222, 55, -213, 70, 174, -46, 106, -299, -131, -85, -25, 46, -126, -238, 63, -154, -91, -144, 14, -141, 52, -73, -16, -188, -221, -101, -229, -110, 60, -7, -58, 75, -38, -99, -43, -192, -2, -99, -54, 128, -50, 173, 162, 55, 164, 0, 31, -49, 181, 148, -67, 26, 148, -134, 188, 322, 73, 151, 184, 123, 179, 76, 112, 156, -35, 33, 190, 252, 137, 107, -29, -3, 11, 6, -145, 165, -21, 165, 77, -152, -89, -56, -56, -11, -103, -101, -69, -75, -20, -177, 264, -29, -194, -74, -63, 48, -149, -207, -47, 4, 18, -116, 40, -172, -166, 16, -6, -78, -150, 12, -114, 70, -11, -6, -61, 57, -7, 69, 182, 32, 124, 12, 104, 278, -82, 124, 196, 56, 45, -93, 11, 46, -62, -45, -17, -28, 200, 233, -47, -27, 142, -124, -141, 32, -133, -56, 96, 219, -102, 47, -45, -128, -139, 139, 5, -91, -200, -36, 61, 215, 3, 2, -26, 114, -85, -55, -3, -172, 15, -269, -300]
2669c00K76j15K0J89o8j42M0nO0j60J59q9J2J17q5L1m3J88kM0n6q6o6J38J1N6
2695A20pj87P9Q0j03L32n12Q3o2K54J90k79m9M40l11k4l2O1J73q8J52m16K40o9
2719F5j37P9n5J53J21k76J3k37K14RJ30n4J83j19j31o4R3K5k76K48j40J9J62m3
2743a8J46m7j50K0K2p4J36k16L6L65l31J15R5j54k0K44l65K69j72J02j32o7L52
2766A56k19mJ30q6J34k01L16j5j14J1l3j24L07l66Q8J87QPk88K25n6L9p7l9rM2
2792A9l10L07j08j39J30j41J77L6Qk05J18K94l69P2J15K12k65M7M0p7J06p9j19
2815a31J56q2o%o9K44j29J85k32m2M8K09k71J86l39J69M6j22J50J31k21k0K60
2838A20L8n6j37J0k0L01k97j8L14n0k60J08k4M3p8J01q9J71k06P5K0j18L86l07
$$ y = [-300, -24, -139, -119, 70, 2, -140, -100, -105, -45, -205, -46, -135, -123, -6, -91, -60, -103, 85, 83, 123, 67, -19, -85, 53, 64, 120, 113, -74, 5, 85, -18, 314, -198, -115, -177, 77, 267, -12, -61, 379, 68, 44, 12, 73, 246, 158, 310, -106, 134, 65, -72, 7, -48, 105, 226, -50, -37, -274, -60, -51, 79, 25, 208, 89, -42, -106, -13, 12, -264, -16, -156, -137, 25, -18, 128, 81, -69, -49, -27, -101, 35, -181, -145, 220, -111, 4, 99, -55, -75, 169, -196, 73, -99, 3, -129, -196, 156, -63, -67, 63, -23, 111, -90, 226, 211, 97, 108, 75, -49, 258, -108, -20, 167, 175, 182, -106, 119, 63, 102, 25, -14, -23, 19, -291, 16, -92, -231, -101, -242, -65, -29, -21, -226, -108, 186, -183, -111, 4, 216, -49, -2, 38, -39, 67, -12, -131, 25, -57, -63, -63, -132, 112, -17, 168, -64, -106, -58, 151, -120, 66, -273, -104, -58, -180, -30, 101, -120, -140, 120, 158, 102, -35, -25, -45, 256, -41, -59, 255, 205, -55, 53, 29, 72, -6, 95, 6, 177, -29, 46, 66, -52, 334, 27]
2862B7Q1j28J63j2j4j35L3K20k65P3Q0l9r5O5pM4j88K06j07P6l6j69j12J19p2
2887a92M24m68J28q2N8J60j84J76r1J26l6k12P4K33R4l60J5L32k52M0q8K7l6J14
2911@j91K81l0OQ9k87K12M3M4j26R7k84Q2m1K61M6r1m8j90L13j0j45M3j08P9j6
2937B9k1K31k40O7k65L51o6m1K16m70R9N1K5j13J29j40j7K45j79R5K2j56K11Q
2961G1j61J7j12K74P9k13J18k29R2N1k1R5J06k30K14j13k29L87j88j23M1M5K88
2984B59l31J16q4Lr4N1m2r9K90O3p1O7k34m8J1O9j49K21k1pK17l4l06L16j73R6
3010H6J88l04QK28l71K99k15K25j07P1j17k8K7RM2o0LQ8j38L1M40m14L3r4K50
3035A80k16m6J35j45M0L0J13n7nj42K96J6j76j12j23J14K39j78k4M2j68K78p0
$$ y = [27, 108, -20, 143, 131, 117, -18, 15, 235, -30, 43, 123, 84, -11, 54, 47, 91, -97, 109, 2, 78, 42, -127, -239, -120, -192, 232, -236, -108, -190, -132, 28, -156, 20, -71, 55, 19, -193, -119, 114, 208, -152, -137, 195, -57, -17, -105, -78, -114, 0, -191, 90, 60, 66, 155, -132, 80, 123, 167, 41, 138, -146, -64, -105, 156, 202, 111, 63, -127, 186, 176, 31, 74, -34, 45, 29, 8, 239, -1, 66, -199, 152, 86, 45, 261, -209, -110, -59, -34, -147, -18, -158, -175, 70, -109, -14, 8, -148, 63, 71, -90, -73, -185, 89, 168, -45, 73, -156, -64, -13, -34, 61, 167, -63, 151, 38, -191, 196, 8, -115, -74, -29, 259, -72, 44, -40, -37, -131, -80, -122, -221, 69, 132, 61, 128, -106, -154, -143, -74, -223, -2, -23, -30, 187, 153, -153, 163, -10, 86, 274, -30, -22, 206, -165, 134, -81, 144, 37, 108, -9, -37, -10, -1, 41, -19, -16, 72, -66, -35, 405, -9, 24, -70, 180, -36, -82, 53, -92, -52, -22, 91, 34, 29, -113, 183, 199, 23, -89, -212, -98, 141, -37, -61, -19, -187, 91, 21]
3058B1q1M0J07j42J02P0k41J50nmk0k05K62KL7j36J95m4l70K30J89k03J36K9r4
3083B5J91Jj29l8J58j56j8J05k08K47j83J21j46j78K07pN1j60N4Q3j12j42J32
3106a02K23n9o8J7lP1n0j26O1J43k03J68j23J4K48j59j95J2L8n1J29rp8R2O4o9
3132a5p0J15K4j3K8n4Q1j70JJ56k6n5Q6l44K34J42j74P8J2l5J6P1q5R8j69J39
3158G1l9M6J22j46o7j76J62j52J80K37k47Q2o5n7J45q8j01J25J42j63nQ7j24k
3182c3M1j32N4J6K0k1N5j87k0Q9m6L2J54j7k2o9j1J76r6J37j61PJ08N8j99m7O1
3209e3J63j79J04l7j99J31J46km8O0k0j09R5j37K99j87j86J17KK07j03q7JJ31
3233A09J6k18N9j76L14o3K67k57l8N8j29L14m09L30l92J53J82k12K16j76O1J45
$$ y = [21, -60, -20, 87, -55, 47, 117, -124, 26, 21, 17, -3, -208, 54, 56, 93, -43, 152, 108, -262, -32, 157, -46, 90, 119, 25, 216, 217, 88, 50, 208, 52, 34, 139, -69, 178, -5, 116, -30, -208, -1, -8, 43, -117, -63, 20, -92, -234, -102, 121, 62, -6, 11, 8, 79, 29, -97, -36, 107, -96, 72, -51, -37, 211, 52, -143, -131, -93, -144, -15, -24, -102, -10, 54, -15, -85, 30, 54, 41, 69, 15, 96, -74, -73, 83, 57, 2, 88, -256, -22, 120, -54, 24, 36, 1, 17, 88, 3, 101, -68, 71, 32, 78, 200, 54, -13, -189, -27, -179, 1, 238, -9, 73, 8, -49, 96, 8, -93, 32, 174, 11, 6, 93, -31, -33, 8, -124, -70, -54, -34, -55, 0, -187, -207, -118, -164, -132, 22, 5, -17, -86, -97, 79, -17, 120, -41, -34, 74, 132, -67, -114, -53, 110, -69, 35, -2, -201, -70, 76, 74, 26, 86, 66, -43, 52, -85, 214, 27, -159, -42, -40, 167, 64, -23, -22, 109, 125, -93, -34, -210, 104, 41, 308, 51, 13, 71, -58, 256, -153, 177, -215, -62, 120, -92, 124, -52, 9, 154]
3255A54l45K59J1l3J9r0O2m9J0J59j32R8r1j14j24m9M51k56OQ3R1j92r1J72j38
3280a29j32Q5O1O6J30J4j96J35J26l41J31J02n2qQ4q7O0j92LQ6J48j65oK61k10
3305b6m1K97k08J48o3j66n5K52K1j81M4K0J68j67K95k97P1n6J59k62J22k8j28
3328h1j65J81O2j7l2j21J86J02j77K14n7k45J77k04K07j88L9R7K72l01o7p1K06
3351A7n3q2J99q5o8k14L21J25j61j9j0j5j1j0n9rN5qn5J29k5J34j76l5Q6L5j76
3378a70K60p8M0j48K3K25j29J20N5j13Lj63k0K59j76J43j29k8J14k9K4J40l07
3401h4L9j43K08J11j24P0j18P6k2J39j71r0rR5j2j75K72Q8k48J28M9j73J58k19
3425a55M6J23L5j28j27P4R4P8l5J87l79J11M9J33O2r7k67L02j34J06o6k07J16
$$ y = [154, -191, 68, 79, 46, 65, -25, 37, -12, -2, 157, 25, 123, 32, -82, -206, -255, 196, -60, -54, 29, 120, -72, -163, 9, -129, -261, -176, -115, -49, 81, 95, -101, 34, 160, -181, -50, 52, 0, -8, 76, -11, 49, -143, -140, -54, 94, -71, -77, 184, -26, -67, 230, 22, 170, 107, -59, -114, 138, 159, -22, 22, 42, 210, 43, 338, 41, 112, 56, 215, -47, 75, 47, -81, -246, -65, -3, -20, -52, -173, 13, 115, -62, 152, 95, -150, 27, -177, 30, -158, -119, -22, 250, -51, -118, -189, 17, -36, -118, 81, -4, -72, -286, 35, 160, -1, -20, -30, -45, -56, -66, -125, -134, -79, -87, -142, -13, -38, 96, -80, -115, -29, 6, -170, 90, 12, 52, -96, -73, 152, 23, 143, 198, 85, 88, -75, -95, 164, -12, 131, 2, -26, 88, 59, 83, 223, -84, -45, -188, 20, 131, 7, 77, -41, 35, 13, 152, -19, -109, -118, -23, -35, -210, 62, 150, -98, 30, 79, -94, 64, -155, -109, 14, 49, -79, -206, -132, -38, 40, 5, 192, -187, -76, -27, 106, 168, 71, -196, 106, -28, 78, 12, -195, -79]
3448g9K09j08J08l2K8j48K46l02O5P4%j31J58m8j17r0J02J47L0p9k18K57j71O3
3472c6K6J25NM5k62J05r8K64k15J80j77K23k01L2rL8J7N9j0n1m3K23k49J72k01
3497c8J27j4l24K09J25k19K03J13m33J69j11R8J87j99N6j37J20R6r7kK08k91Q9
3520f5Q3J39k58k8K06L8l50M18r6j98J42j28J25L7k04RJ76Q2m8r3J03ko7J38l42
3545a83J80Q2j98J10r8P3k8J21k91K86n8N7j64J39J49n2n3p5k11K92k04K81k36
3568h1L6J46l47K75l1p6kJ28m0l9j06K02j57J68J11k60K96k62J00J2l9J30l23
3591a59r8J66O6J22K1k33N6K40j55k06K98o8j42M43l64J48l50J98o7KN9o1O5r7
3615a16j2J03k7mOK2K66k11j02R3j27J67j68Q1J01j88J83K0k25Q3n7o6J46r6K80
$$ y = [-79, 130, 22, 130, 98, 126, -22, 224, -78, -13, 61, 61, -70, 88, 40, -77, -167, -65, 82, 112, 33, -185, 72, -99, -36, -10, 115, 120, 165, -97, 8, -90, 174, -41, 139, -38, 185, -16, 16, 7, 45, 62, 121, 111, 60, 17, 240, -9, 163, -38, 89, 75, -249, -40, 85, -134, 69, 182, -251, -82, -193, -95, 92, -107, -51, -188, -68, 28, -69, -71, 137, -154, -65, 18, 157, -101, -129, 77, 115, -235, 183, 87, -111, 31, -97, 28, 65, -139, -130, 46, 128, 80, -13, 90, 88, 21, 159, -183, -3, 79, -119, -9, -107, -34, -62, 59, -232, 54, -4, 53, -111, 28, 177, 125, 72, -3, -214, 78, -126, 155, -81, -45, 101, -246, 29, -2, -78, -80, 48, 8, -31, -137, 65, -92, 76, 187, -73, 223, -39, 61, 73, 34, 164, -159, -257, -91, -25, 97, 118, -115, -59, 181, 26, -180, 118, 50, -92, 351, -13, 135, -215, -17, -84, -82, -23, -84, -19, -116, -128, -25, -52, -56, -50, -28, 238, 27, -75, 18, -109, 58, -110, -29, 72, -116, 67, 87, -138, -55, -112, -178, -32, -128, 152]
3640A52rn0J06q1j44p1J67n2L8J05k26O0k8J62k02M4P5q5R2j07J68k9j11J57j14
3665A7j21j11J13KK58o2p2j93L05L8k69J84j32M5J32j03P4j80K04l00J01R3p9
3688e6K85j68n6K44k03p7J5%J43j72l7j67K73J74k39L3J90j45LK6j87J36m4j32
3712a61K60j10K5j02L43j86r9j44K02qP4l82K88M7J34k98P1m9K21k8j51j32K03
3735A8K11k41j4o7J42j30J44L9J22k21l7O8K9l9R9j06j03KK08qk27K47j21J1J47
3760A73k15K8j63L03j33p3J02O4J44n7k55pj5J12J1q6K7Q2J11p9O5%k0j39k0P3
3786C3J2j00m9q4K44j2k33N7K16j73j7L08j19o2j02J89j06N5K1p0j23n3K45J8
3810I5k59N0m6K22N8k76K67j50n1L09k71K25j75P9n6J27j79n3M4k6J59j15p7J01
$$ y = [152, 143, 93, 199, 118, -26, -97, 70, 18, 56, 161, -65, -5, -33, 129, -73, -29, 46, -39, 53, -54, 114, 85, -26, 131, 17, -104, -215, -102, -100, 158, 96, 24, -169, 136, 174, -95, 89, -43, 2, 134, 31, 105, -75, 129, -171, -70, 23, -56, 229, 61, 5, 249, 46, -31, -16, -16, 127, -45, -82, -249, 24, 198, -41, -8, 182, 37, 40, 66, -121, 15, -29, -161, 99, -11, 14, -88, 255, 69, -30, -174, 28, 20, 94, -288, 0, 47, 181, -117, -46, -95, 126, 98, -53, -185, 18, 229, -12, -26, -93, 49, -81, 63, 102, 224, 3, -34, 34, 63, 24, 123, 17, -86, -84, 124, 116, -111, 136, 15, 26, 173, -42, -14, -177, 126, -7, -80, 22, 86, 230, 173, -82, -89, -104, 8, 19, -67, -40, 42, 153, 74, 139, 139, 119, -20, -40, 33, 45, -55, -104, -188, 56, 44, -189, -132, 84, -89, -106, 202, 83, 21, -81, 108, 2, 57, 78, 8, -115, -168, 77, 95, -164, -114, -160, 62, 120, -156, 111, -39, -90, 219, -52, 173, -2, 77, 21, 148, -31, -84, -40, -66, 93, -22, -99, 2]
3834BK0m3p0k9J42o2KL3Lq2K46k08J1J59k15M20k83j89K54j47J15q5J29j26jM0
3860C6kn7J07J4o2q3j7J95j12O0r6N3k19K45J51k72J5k2J33Q0o7j59j60K15j50
3885a74K29j80K3N5P5O9r9j32J56j70R1n1M0N8k72L01n9J8K01n5n6j45K17k44
3909a04K48j85J64j34k9r5M7J64q2R1J0j04p6J86k07J20M1l71K18J63J26k50J17
3932E8r7K34j86r9p5R5Q9o8J4n4O6l5N0k36K95p1L8r3P4J45j60J15J6k03m2J12
3958a8Q1R4m3k70J76L5j41J01k02J03J4p3M7J30J55Kl36L06m42N36n6j04l4r7
3982c6m3K66k19J22J32k54K0l3L0j2J95l1m0l31O3K99j1K2n8j12K29j00P7j71
4006DL06m29K01j51J61j74K60k83K15j42J4J79k26Mp6J49L5j17N3QJ01j64j95
$$ y = [2, 22, -21, -91, -120, 22, -40, -38, -5, -2, -84, 162, -46, -35, 124, -91, 329, 46, -143, 111, -36, 79, -6, 123, -3, -4, 36, 34, -23, 84, 98, 36, -47, -64, 131, 19, 79, -17, 36, -183, 62, 213, -59, -44, -66, 67, 147, 80, -79, -239, -24, -174, 55, -125, -102, -47, 28, 97, -2, -134, 22, -148, -57, -108, -68, -10, -282, 19, -40, -22, 179, 124, 68, -77, 140, -104, 144, -41, 123, -11, -40, -135, -88, 76, -6, 85, 95, -9, -85, 101, -106, 14, 55, -316, -98, 65, 191, -59, 58, -39, 195, 9, -90, -165, -70, 19, -49, -35, -89, -23, -58, -8, -244, 51, -20, 18, -75, -1, 144, -16, 99, 115, -88, -130, -18, 63, 157, 114, -156, 20, 55, -86, 15, -187, -84, -70, -143, -96, 34, 189, 191, -145, 161, -281, 255, 199, 95, 61, -36, -79, 187, -32, 90, 222, -32, -12, -45, -15, -27, 168, 137, 97, -234, -171, 128, 117, 139, 81, -31, 198, 98, 175, 4, 310, -119, 82, -69, 92, -82, 178, -105, 110, -32, -18, 161, -65, -61, -137, 12, 47, -70, -17, -9, 92, -72, -267]
4029b67J32K65r6L8J15k97L57j31k01J07j68K63l7k3j05K0J34o6k26J53r3J78
4051E2j18mJ67k46L12jm8K6j00m7k5J16r9k50L85k54J14j79J55K3p9j0R1J13q8
4076Fo3J20k22K10K7p8O5K8r4Q7j53J33p6j71K51j88M44j16m9k85j4K30k36K64
4100A20j81J5j7J28j97M18j72p9j19n2L8m7J46m1j81K38r2j8P6N0j2R0K6k53J05
4125a1N0Q6k05J99k70R0P3K75j33j9k8k00K0J12q7J32J27l15K7K0rM7J35j87L9
4150c2J31j38p8J9K14j32k16L43K9p1p0k60L07o8M7j5O6o5k3Q5J27Q1j20K41m52
4175e0J53l5q6J3Q6L9j37J30o3q9O5l2R6L7k36ll5Q6N9J4n2p9N0M3L3q8R6R9j09
4204EJ54j82Q0j57N2Q0QJ32k85K46j24M5Mj15J60j44J3J17k9q9J09N1k69J30j39
$$ y = [-267, -135, 130, 34, 72, 187, -110, 247, 116, -85, 22, -146, 117, 80, 57, -48, -28, 106, 40, -186, -33, -126, 52, -66, -70, 97, -149, 163, 162, 114, 140, 40, -7, -32, 84, -15, -265, 120, -134, -20, -199, -44, -21, -100, -110, -19, 94, 6, -57, 63, -159, 51, 78, 0, 65, 93, -1, 86, -67, 66, -10, -181, 70, -118, 326, 210, 161, -124, -138, 92, -144, 120, -61, -46, -63, 65, -132, 286, 114, 35, -84, -136, -98, -145, 1, -40, -221, 17, -75, -93, -17, 33, 21, 111, 137, -116, -11, 39, 125, -80, 119, -151, -61, 12, 287, 154, 135, 107, -93, -73, 39, -48, 84, 211, -104, -77, -57, -66, -19, 116, -71, -32, 99, -39, -117, -98, 116, -16, -232, 111, 140, 69, -1, -261, 46, -22, 25, 10, 76, 11, -12, 73, 200, 281, 161, 402, -50, 103, 68, -18, -5, 81, 120, -17, 113, 50, -39, 26, -6, 90, 127, -109, -112, -147, -61, -2, 12, -40, -119, -69, -26, 7, -81, 15, 114, 5, 159, -23, 57, -100, -48, 32, 40, 172, -113, 133, 9, 54, 58, -57, 103, -41, -28, 89, 60, -29, 80, 131, -138, -8, -147]
4229a47J32M8J23qk13l9l5P2l1K85Qj14j28P0j48K80j80J25k32O4J79J12l76J21
4253c2K14l8j64RL3j93J50M7N2p2Q7m5k3q2M8k46L76k34L8Q9R8j08M9M8j84r1
4279a74J92K63k79J49k82L14o2j72q1L03J5l13nJ83O7j39r7L00r2k73J76qKk11
4303b24N3K5K07m0j11J6J2jk5P7n8J58l4l04K89p3J68k39m0L9J7J10n1n3mO8m9
4330f7o4K81j42K10k35J13Q7n0r3j34K71j15j05J94k63K92l9l0N9k85K77k78J14
4353bO2j51m6N7J48n4Q1j38k4k8j81K85m2j33QK53Lql29L28j32J64k67O9jm3J74
4380E3k58J24l9K1k8L68Rj34j97J27R1j86K7Q8n5J31k17J05j08Q6K2j65K53k36
4404a18J13r0n2K61r9r4Q6J6%O5M1Pj96r7J85J60k30J21o9j41K60r4p1n2J31q3
$$ y = [-147, -15, 33, 156, 148, -65, -104, -139, -67, -98, 187, 195, 81, -47, 23, -125, 155, -25, 100, -132, -68, 111, 223, -153, -32, 182, 144, -20, -11, 22, -171, -21, 26, 78, 6, 93, 48, 25, -57, -9, -255, 121, -113, -75, 14, 112, 4, 53, 101, -83, -174, 18, 281, 2, 151, -131, 183, 121, -51, -132, 171, 186, -127, -132, 51, 118, -21, -118, 182, 90, -183, -7, -15, -13, -224, -171, -146, 61, 21, -90, -74, -62, -63, -88, -11, -69, 89, 55, -249, 40, -33, 135, -104, -144, -105, -88, 22, -29, -82, -86, -18, -67, -131, 150, 8, 218, -17, 96, 183, 133, 40, -94, 177, 62, -43, 151, -112, 180, 141, 111, 170, -115, 162, -116, -2, 60, -91, -137, -80, 68, 14, 95, -43, -67, -95, -276, 9, -33, -166, -158, 95, 98, 90, -239, 89, -43, 121, -146, -77, -78, -121, 53, -205, -81, -120, -99, -127, 241, 250, 116, -81, 46, 137, -49, -22, 66, 11, 142, -75, 30, -78, 8, 30, -135, 118, -118, -5, -95, -147, 114, 15, -79, 7, 23, 23, 88, 129, 136, -60, -157, 28, 188, -42, 79, 10, -131, 129, 35, -36, -88, 43, -40]
4430d0q0K13l21K91j59J38l0p3pO3n2Q2J08r6j15N5rj56J47r2K12j34J57m3O2
4455A21p1l6K13r7j1j68J11M2J0j16K38p3n9Q9j94k4q6K01j60M7P1K0o0k20J29
4480h3J92p2r1J44j59J52J13k29j23L32j99K0J27l26K10o9J37j12k22K62Q8M3
4502A35o7p4m2p2O6j20k9J91O3r3J77p1j82K17m9r2j47N7L14j9j42K5p9q9K17
4527I5q6k4j08Q2J86k11L8n3M2j65J39J98k75Q8o2J61K3L1k06K14j65L05l79J72
4551D0P1k32M3r8K89j36O2qJ84r1j34r6J98l11M3K36J19k01K24j81j28r7L36l5
4575I7j87J09L6M9o0j62J30j05j99M25j36R1j7L1p7J04j25k20K12N6j59k8L05
4598A70q4j00n4N0J09k3j33k9L2J40J71r1j53j0J41j52q5J11J01J2j08j39K04
$$ y = [-40, -120, 93, -228, 63, -96, 42, 12, -61, -68, -5, -57, 25, 133, 37, -78, -23, -32, -188, -41, -133, 79, -55, 102, 59, 121, 50, 14, 227, 130, 119, -49, 62, 104, 114, -2, 236, 163, 104, 193, -1, -25, -111, 90, -70, -23, 48, 68, 8, -212, -83, 109, 37, -54, 90, -69, 83, 196, -33, -156, 176, -23, -3, 124, -202, 8, -61, 76, -36, -258, 4, 92, 135, 68, -6, -48, -120, -54, -174, -203, -12, 51, -42, 135, 64, -118, 99, 50, -42, -189, -132, 182, 163, 21, 46, -33, -122, 95, 9, -15, -123, -41, 145, -66, -28, -81, -39, -204, -65, 133, -142, -54, -116, 45, 68, 99, -107, 107, -58, 247, -132, 40, 111, -121, -78, -176, 113, -23, 39, 31, 215, 124, -10, -106, 92, -219, -176, 60, 179, -22, 202, 21, -107, -204, 132, 97, -90, 19, 55, 104, 44, -118, 12, -93, -292, 133, -3, 88, 71, 102, 25, 129, 4, -216, -4, 52, -107, -135, 170, 86, -14, -68, -18, 91, 68, -65, -94, -62, 78, 249, 158, 5, -5, 136, -16, -101, 10, 111, 123, 15, -124, 80]
4621H0j59j54K21Q5o0R1j99J42n4J00r9q1J30q4j20n8K73p7J24mr3N7m0j2O4K2
4647I5Q2%l75L48l61K88J29k89L13k28l9nJ58p6n8L7j6M3j46rJ64N5j07q1J65
4672H7j30mK00lj60K40k21R6K0j36K29j60k1m8J4J1J50j66m0P9j02J65j72J53
4696H1q3J08j12J87p7m1J43j17k61Q4mq6J68Q9k7k5p4R6k65K83j34L6k6m9L34
4721B28k98k3J88r5j0K6m4J19j02J2K0q1J21o8J8J40j0l7l99K60m7J68j11P3j18
4746g0Q7J38k82R6K2K2L2o1m7q1J47k19J50j6J72q6J4L8k27QJ93p3J65j68Q7K16
4772B57l04K4k02J84N6j0o7q4J01J6o3Q0L1o0m3K15j10P3nr6Q0k3k6Lj53K20k31
4799a37P8Q1j00K0J76j7K8j38Q7r0R3p3J6l17J22P8k3J1K13kN3j90o6K22J47k56
$$ y = [80, -79, -233, -12, 73, 13, 104, -95, 47, -7, 93, -6, -87, 43, -41, -161, -219, 54, -23, 101, 97, 4, 61, 21, 9, 73, 95, 177, 177, -198, 150, -211, 77, 206, -83, 230, 2, -37, -42, 116, 40, -18, 19, 3, 46, -100, -109, 55, 110, 3, -78, 87, -43, -47, 153, 150, -10, 230, 9, 105, 125, -11, 218, 58, 37, -11, 3, 14, 164, -2, -42, 37, -65, 100, -72, 81, -2, 106, -6, 181, 104, 63, 206, 89, -172, -88, -92, -178, -10, 79, 52, 27, -47, 49, -216, 67, -67, -31, -57, -106, 228, -70, -93, 95, 0, -10, 16, -28, 91, -11, 1, 21, -60, 61, -7, 11, 151, 141, 104, -295, -35, -82, 86, -25, 48, -70, 17, 155, -127, -31, -9, 13, 45, -16, -63, -144, 3, -216, -66, -82, 90, 4, 18, 56, -171, -163, 30, -43, 122, -46, 41, 257, -47, -23, -225, -41, 15, 5, -62, -146, -45, -29, -92, -12, 19, -41, -84, 131, 21, 94, 89, -7, 73, 50, 24, 27, -126, 94, -137, -59, 22, -78, -58, 118, 101, 129, -9, 78, -12, 81, 8, 24, -293, -171, -93, -116, -105, 108, 106, 159, -31, -97, 125, 272, 16]
4825A6L5J1N5k02L7K16j98J12o5j06l6K37k6nj77k8K20Q3j63K53l56j08J87m9
4849e7P5k6M1j62N7j6K4K4J54N8j40J53j63J53k17j09NK52q3k0J22M8J20k66J45
4874A72n4j40P4p3j08K12o0PJ05n8j35K1J72n8J6k9O5j17j15N4K9j1K05k77j88
4899b91L68pJ7j52J70J32j15k44K3J20m5O4k74M41j75j30K38k51r2J68p0pN9m0
4923i3M2o8K05k34J69j83J75Q4q9QO7j41P9J71j39J8J14k46R9J22n5j40k7J1l5
4948h6K77j01k88L41P5j06q7L9P7j89N1o4N8l5J62n6j84K25r3l0j17J40M4l22
4972b69OK05J35q9M6n5N5l0l04L35M1j24N9JN5j8j87pR5K54k11J26p2k70L11k39
4998a51J12J96j95J80J2k17j04M01j99j1j11O7P1q9L26l79L4P8K3J65m35K44L2
$$ y = [16, 51, 62, 117, -85, -48, 168, -30, 82, 17, -89, -125, 112, 86, 81, -96, -124, 96, 179, 16, 269, -87, -195, -8, -57, 18, -8, 33, -129, -72, -88, -64, -40, 114, 172, 32, 185, 22, 175, -42, -151, -146, 106, 23, 3, 125, 173, 293, 27, 172, 118, -22, 52, -21, -129, 83, 23, 30, 135, 77, -58, -37, 135, 77, 93, 64, 129, 12, -103, -49, -20, -31, 174, -103, -291, 77, 70, 87, -65, 105, 237, 122, -122, -99, 21, -24, 40, -234, 207, 32, -98, 140, -111, -203, -35, -105, -112, -53, -93, -51, -119, 86, -148, 21, -162, 13, 97, 8, 16, 83, -58, 21, 192, 53, 71, 185, -61, 38, 160, 105, -35, -62, -51, -86, 191, 90, -198, 143, 218, 112, 25, 64, 141, -48, 3, -61, -3, -38, 124, 68, -116, 109, 16, -14, -131, 9, 53, -269, -263, -58, 77, -12, 34, -21, 34, 4, -300, 35, 76, -48, 11, 12, 67, 49, -138, -145, -50, 204, -7, 119, 47, -223, 88, -151, -39, 157, -38, 142, 154, -63, -167, 234, 35, 24, -87, -20, 51, -38, 288, -91, -57, 21, 44, 209, -226, 18, 50]
5021E0j00L20k87j1J06P4k72R6R1l1kl6J17l12J01qQ8R4j65J27J05m32K56j22
5045a53K00j66k3J14j67J59J6J98m8j44k4R3N4j45Mr0P1K7Q0j64J91j3j44J20
5069D6LJ6k55J62R6O4m04K63J7o6N3J5Rp0K20q7l97M34j0j11Rm4Q3k17K40N0k67
5096a48O0J23L5j12K6J93o5%k25J07M7J24j46p6M9K43l26L0J34j87J26J04j17
5119aJ09o0o7o8R3K7j9j85K28L5o8o1n0J40m3JP9j47R5q4K40l38K84j76M6Qk61
5146b43L47j70K03k02J29j23P7J8J79k62j82J59K94k40m3j9J14j05J06J25k75
5167a13O1P3K2K1oJ9k37K49J9j05N7j2O0p9l3j72j8K29j22M7P1p5QJ90j86J44
5193A12j69J00p0Q9p7J71k02J2p1K49j08N5k2q0Rl4k5l3J87J64k79J2j07O7NK57
$$ y = [50, -50, 270, -17, -28, 78, 152, -120, -24, 67, 36, 34, -2, 115, -197, -96, -104, -16, 78, -87, 40, 145, -287, -31, -153, 47, -119, -142, -28, -195, -36, -20, 178, 130, -14, -38, 55, 109, -36, -32, -122, -51, -24, 56, -108, 83, 70, -74, 46, 49, 65, -190, -28, 68, 132, -272, -9, 8, -58, -5, 10, 19, -51, 169, 82, -315, 119, 109, -2, 7, -37, 46, -171, 69, 119, -148, -88, 35, 70, -42, -16, 177, 112, 112, -113, -6, 41, 165, 19, -57, -8, 235, -91, -61, 73, -114, 12, 116, -1, 108, 48, -19, -87, 6, 33, 14, -171, 57, 92, 24, -37, -87, 53, 10, 11, 90, -57, 38, -46, 194, -144, 140, -36, 10, 18, -243, 104, -66, 137, -65, 64, -59, 18, 36, 215, -47, -229, -70, 224, -16, -59, -78, 36, -69, 37, 162, -113, -52, 21, 43, 64, 58, 77, -160, 89, 108, 3, 60, 48, 108, 29, -4, -176, -194, 35, -87, -40, 31, -44, -36, 154, -32, 112, -57, 43, -27, 62, -15, 156, -46, -34, -105, 144, 36, 91, 69, -11, -2, -36, -61, -94, 93, 257, -22, -10, -117, -50, -45, 212]
5219B12m00L03k5L7k04P8Q5k4j5J44j01j7Rj31O5j47M1M27k32k19L61m73J95j5
5243d6P2j63Q1J9R7R3o1j48L9J28q8j2r4p7L72k69P1n0n5L33j50j65K00j50k2
5268d5PJ52J89l33o7j08L16K2p6j1j04J25q8l1l2k5J3N1N9O3r4J71r9jO3PM1k17
5296e2O3J9l2J09j86J50PK8j27l1J84j12OJ0k7K06j61K95l86R2p2j37p1j4J22
5321a17M02j66j35j13J16k8q0L66q0j88N4J4L1j45Q7j33J3O4J0j72J35L5J17p2
5345A5rk9J33q0Lk2J10p8j62K76j80K62n69M15K4k11P0k09L04j53P1N9J32k75
5369a03O8N5k92M08j46J8OK17k9m0k23M4O9J2j25J96r3K0p7j40R1J25j47J88l7
5394F5j12J00j56j4Q0lj11L98k56K13k20l5L0j05Q1K08j43L4n1r9J16r9N7R0m7
$$ y = [212, -188, 115, 90, 127, -77, 1, 86, 62, 47, 191, 90, 73, 82, -49, 16, -131, -90, 337, 105, -114, 247, -226, -31, -46, 26, -137, -56, -37, 60, 153, 92, -56, -17, 111, 23, 11, -83, -160, 212, -57, 14, -36, -91, 242, 92, -73, 127, -23, -45, -38, 114, 303, -30, -97, -205, 111, 133, 57, 46, -58, 67, -21, -52, -84, -109, -96, -45, 14, 77, -17, 154, 55, 54, 117, 124, 165, -52, 11, 30, -2, 107, -79, 71, 78, 106, -21, -52, 132, 20, 26, 36, 9, 215, 54, 349, -37, 55, -17, -154, -225, -239, -117, 285, 119, -16, -129, -13, -41, -121, 245, 165, -23, 31, 45, 76, -69, 18, -115, -102, -38, -28, -200, -65, -30, 87, 15, 6, -23, 110, 30, 33, 11, 121, 43, -119, 157, -23, 239, -330, 85, 109, -102, -32, -241, 63, -90, -19, 40, 172, -103, -35, 20, -272, 136, -10, 8, 14, 231, 202, 162, -61, -17, 52, 64, -61, 135, 42, 62, -15, -155, -64, 61, -86, 102, 65, -47, 53, -103, -117, -37, -40, -151, 247, -9, 204, -16, -51, -21, -126, -45, 163, 20, 54, 3, -96, 20, -79, -22, 68, 21]
5419B1j69QJ54J54j31N3j87K29k42J62j32O3L8o5o9K07j05j4J38j04j81K89n8
5442E9O1j25j08L00j71N5j65L0j47K97k07om7J87p5MP9m5l3Q6K10o1k17O0j09
5467h8M2r7K8J6K55J35k77j15Q1o9p8N9O8P1Kj7n3M7%Q4j18n4j41K36o2K07k82
5494a20j5J77o0o9L40k58N9j48J70q5M9k06L01j70Q8j51J42J18k04nM3K0j26K07
5518I7lj33j94L7K58rj87J83r4L9m8J48Pj18m1k1n1R4J50j28J05J42l20n4P7K3
5544d1J91k14J17Oj7J8n3J11j33j4J75L5k54K63k44J08q1O5Q1l1k15J76l0p6M
5569e3j0O9o2j0J11j12J31m4j71J91J14J1k4j52M1Op2k1N9j28J33k50J47J13o1
5594d4K12k30K2j4k5j61m2L34n1K0j0J41m02L38rPj12o6J17lj86j29K83M9p6N2
$$ y = [21, -148, -140, 14, 168, 37, 90, -97, 132, -110, 52, -80, -17, 21, -44, -113, 94, -11, -25, 113, 9, -172, 117, 59, 120, -5, -113, 187, 16, 71, -94, -64, -211, 86, -121, -127, -174, 13, -62, -58, 21, -24, -57, 29, 239, 178, -39, 21, -88, -46, -143, -115, -99, 156, 291, 14, -101, -20, -89, -167, -108, -40, 31, 33, 16, -37, 10, 10, 94, -24, -78, -219, 17, -45, 162, -120, -135, 42, -18, -87, 253, -5, 54, -94, 76, -9, 40, -166, 135, -35, 53, -98, 44, 162, -42, -47, -4, 16, -110, 97, 94, -39, -233, -196, 62, 53, -134, 49, -45, -6, -54, 94, 101, -17, -58, -79, -130, -36, 114, -14, 91, 233, -87, -141, -64, -41, 150, -64, 53, 59, 42, 60, 7, 118, -15, -29, 146, 181, -73, 190, -54, 54, -27, 38, 119, 88, -127, 49, 19, -57, -53, -63, 6, -56, -66, 45, -67, 64, 20, -151, 40, 154, 165, 141, -11, 30, 36, -36, -57, 2, -126, 7, -243, -96, 17, -44, 168, -62, -40, -54, -79, -240, -282, 52, 1, 21, 11, 152, -250, 88, 79, 86, -26, -92, 25, 22, -164, -293, -10, 39, -37, 15]
5620A5q6P5o1o2J26k4J63k98J43R8m9K0j17j89L41o7o7Q3j44L19k44J27j59K8
5644b9k9Q1r8K71j12k62M33M5p54O80j19j37M3j31m11Q64n22j0M35m91M69o64
5666d48N93J7l62N4j14K71J19L25k6p53K54L69l41p9j13L95K99q38O20r5n53J166
5688G60m42m96P88j89l16l19n3L12l51L23o4m0j87J31o9L18j22J24q6K2k42K42
5710D4M9N7n2O1j04p2l4K1rJJ26k15J52k41K24O7j55J42mO0k83K19K8q7q8J36
5736D3m4r7J07r8N1J4K05k91M2J29m9O1K72l96r0K01k53M11k35O5k0q0M2J7k9
5761b2J36k4j03J3m7O5L9k1o8M5K2j44K01j30M2J22n4j51nJ24p1K23M0k61rL1
5787gJ04o0n2p5j8M9P6r7o7L04l0l5k9q3J8K2J45k69J27j37J11k1J27j05R8j54
$$ y = [15, -71, 4, -57, -119, 7, -17, 146, -152, -9, 89, 40, 60, -57, -246, 95, 28, -39, 44, -100, 219, -25, 102, -57, -29, -58, 23, -75, 196, 84, -178, 255, 300, -454, 226, 107, -30, 13, -118, -529, 335, -187, -197, 238, -253, 216, -448, 145, 162, -200, -146, -260, 11, 130, 455, 429, -324, -70, 299, -42, -121, -234, 161, 460, -378, 242, 147, -406, 760, 318, -178, 610, 421, 105, -214, -267, 45, -306, 17, -47, -87, -274, -143, -212, 106, -16, 108, 22, 44, -198, 44, 93, 150, 98, 159, 55, -17, -51, -30, -39, -38, 88, -127, 25, -216, 8, 75, -80, 62, 58, 118, -165, 54, 82, -5, -93, 43, -1, -98, 9, -89, -38, -24, 181, -110, -68, 61, 12, 73, 345, -51, -141, 60, -193, 218, -17, 48, 28, -52, -10, 7, -22, 114, 90, -13, 0, -47, 18, 57, 36, -32, 13, 35, -109, 92, -38, 4, 126, 72, -79, -84, 40, -31, 192, 232, -29, -38, -7, 97, 37, -15, -90, -108, -59, 17, -80, -147, 157, 127, 92, 63, -20, -2, 20, 165, -104, 23, -114, -3, -24, 103, -2, 96, -58]
5813e8J74j92j12O7J68o9J05r2k0Q8j1%Q0j94K9J68j43J40l03J07j22M25p8Qj76
5838a1r1Q0j15J12J80j85J42r1j93J51NK48j00j31j30K97m57J18L62r1j45MM4
5861CQ8k4l5q4R7p6j04P5Q0n3J88j70%j48J85p5R5n4J08j73J44n3K37l73J3J65
5887E6j28O0Q9j79k7o6K97O9j97R4l17L13k20R9J62N0n3k13R0j1J94l1j0N2j75
5912bJ4J01m1j11m1O2q2O6O4J11l07K53j35k4J21K2M2m9j3q9J74j71J10j72L05
5937B08o5J00m72M20j72r1j8J83j34J5R2r2j29K5L3o1oJ86j51j5p5J02J94j63
5961h6P2Q1j9o0J86l05O3LK68j17o8q9K24j95n3j9J32k57L33m4j35K08j1k60J22
5986b6J16pQ8l19J87j35q4J43N4P0m2m0l0J43j20j1J33k03O9m3q5M2J15L7j35
$$ y = [-58, 116, -76, -188, -121, 47, -22, 83, -9, -29, 59, 48, 48, 128, -66, -37, 131, -12, 128, -175, -68, -190, 235, 157, 165, -11, -102, -22, -137, -25, 155, -30, 112, 21, -172, -21, -16, 232, 132, 1, -129, 168, -289, -171, 191, 100, -45, -41, 3, 91, 67, 32, -52, 45, -31, -135, -60, 20, -33, 155, -15, -15, -163, 22, -53, 42, -12, 96, -77, 67, 14, 251, -122, -109, 56, -72, -12, 77, -102, -129, -195, 102, 171, -26, 68, -249, 64, -156, -57, 105, 155, 102, -111, -21, -32, 162, 131, 121, 173, -2, 12, 113, 72, -39, -80, -18, -100, -34, 30, 141, -166, 87, -48, -72, 49, 71, 113, 64, 51, -38, 136, -35, 75, -97, 208, 143, 243, -229, 191, 19, -72, -90, 93, -41, -26, 66, -26, -155, -130, -97, -158, -164, 22, -129, -144, -219, -117, 77, -86, -14, 67, 48, -12, 174, -131, -68, -65, 203, 86, 18, -71, 153, -42, -95, -114, 18, -239, 94, 50, -85, 123, 112, -148, -26, 90, 83, 171, -148, 39, -96, -180, -37, 17, 87, 45, 5, -25, 118, -2, -13, 120, -83, -14, -57, -142, -100, 15, 52, -83]
6011h3QL5J55p4L7p0J27r2j01M2j29J32P7N5k6kq7jj00L76k43j24M3k1J9j86K79
6038D6j40J12M5o4k2J25k75J9L7J41l7j4J05m5pm5N3r3K30j79n0MJ08l3n3m9J22
6065D1j08k9K77l35J33n7o0J50p7n2m7J15J61m4l5n5j65J33Q3Mj45o5J75R8j44
6090d8R9j0Q9l22O1R0J32P6j47j97J82JQ1j34J35m1j91K10k69J78j55K03l3j64
6114a74J61J07p0n2R8j89J42j13J30o5J12%n2l2J70j13j19LJ19j4k49J22Q4l4
6138b8K48l03J32J24q6j06J06p7q2J30r4k00L07j33Q4P4p7L0K4q6L4R1l08L30
6162A34j67NJ49K7k34LN3L44l17O6Kl67L33J05K19m02K01l06N0K06j17j17J7l3
6186a46n1L37r1j33r1K69j71J96k48L12j67k8K9Q2n1m6r3Q5j9K0k00K79N5p8J32
$$ y = [-83, -75, -40, 115, 41, 78, 8, 135, 43, -58, -16, -145, -13, 64, 119, 93, 91, 4, 3, -97, 279, 36, -88, -45, -66, -47, -233, 46, -94, 18, 63, -1, -23, 102, -173, -154, -117, 24, -13, -27, 78, 33, 26, -19, 34, -59, 171, -8, -58, -54, 54, 21, -32, -81, 41, -67, -96, 181, -154, -21, -78, -138, 12, -65, -117, -164, -49, 112, 68, 33, -22, -187, -54, 29, 33, -112, -177, -2, 96, -48, 51, 41, 130, -192, -131, -41, 91, 167, 20, -177, 5, 6, 87, -47, 88, 47, -144, 66, -203, -25, -180, 23, -10, -174, -13, 94, 24, -28, 70, -119, 23, -90, 40, -25, 87, 87, 35, 3, 173, 60, -59, -56, 63, 49, -200, -78, 6, -28, 220, -83, 49, 173, 87, -19, 87, 10, -72, 58, -36, -236, 71, -62, 22, 96, 19, 49, 73, -13, 21, 112, -196, 134, -33, -28, 121, 148, -86, -83, -30, 314, -3, 63, 65, -302, 31, 136, 355, -47, 154, -152, -102, 104, -13, -130, -113, -146, -197, 140, 49, -84, -175, 94, -77, 119, -129, 183, 16, -12, 17, 99, 48, 2, -91, -6, -25, -5, -205, 74, 129, 51, 183]
6211A83k42O2k35P0K91m7q5J47p0k23K92l8j05j1O7j84J53N1J74l73J44O0j11
6234c0K9O5N1mj93J09P8j84K8L5Q9J21r9m2j97K64j46mK11m2J9r8l0Ol52K51j04
6261a69O9J4m1J08P8j2l9O4r8J6kJ26p5O0Qn7o4r6N2J07J06n5l5M4k82K87q8N5
6289H1o3K53j81P0j49l5j78L99M8p9l10L84j57k8J00j75r3M28k99j26J94L7j27
6312fJ7j21J27o8J74l1L9j91o5oj55K42p3J03k5R7o0Q2k81L50k35m1Q9M7qJ94
6338A95j33n5J16j96J20m3O9lq1kj11O1o1J68R6r5O3n2j49J49j12J66j40j50M29
6363B49l74R9k1K5J05K2j12K0N7k0Jj26P9K3l8l1O6j44P5J61K0M9k69K73j63k32
6389b06J90k39K58O3l4k1N0k17P5M3P0j16N2j52Q0J58J59j63K03j40Ln5j86L01
$$ y = [183, -59, 3, -232, -162, 129, 82, -3, 144, 74, -149, 143, 105, 0, -11, 56, -128, 25, 76, 250, -123, 21, 81, -30, -1, 64, 115, 111, -82, 27, 105, -79, -51, -16, 73, 194, 95, 53, -144, 120, -26, -30, 181, 139, 158, 60, 30, 36, -316, -65, -169, -100, -86, -127, -19, 59, 47, 8, 72, -26, -10, -12, 114, 39, 99, 107, 50, -14, -110, -58, 49, 155, 100, 65, 109, -173, 114, 26, 81, 18, 271, 90, 160, 11, -24, -202, 197, 245, 166, -144, 240, 83, 55, 155, -20, -113, 315, 16, -110, 84, 121, -6, 11, -110, 17, -51, 123, 92, 131, -60, -125, -131, -286, -44, -117, -14, -39, 58, -2, 80, -201, 149, -86, -127, -38, 9, 1, 195, 62, 7, 123, -73, 47, 4, 73, 70, -11, -13, -124, -63, -124, 44, 140, 45, 108, 56, -93, 56, -56, 110, -30, -180, 249, -125, -26, -47, -22, 83, 105, -7, 13, 70, 50, 51, -75, 4, 27, -11, -42, 24, -120, -45, 116, 136, 185, -84, 189, 26, -206, -16, -255, 3, 66, 32, 11, 61, -156, -81, -38, 32, -84, -32, -184, -104, 54, 213, 50, 253, 113, 116, 61, -125, 176]
$$ [...]
8191b5
##END NTUPLES=NMR FID
##END=
