##TITLE=1H_SR36-oil2
 CDCl3,8 sc, 
 11.02.2021
##JCAMPDX= 6.0         $$ Bruker NMR JCAMP-DX V2.0
##DATA TYPE= NMR FID
##DATA CLASS= NTUPLES
##ORIGIN= UXNMR, Bruker Analytische Messtechnik GmbH
##OWNER= root
$$ XWIN-NMR		Version 3.5
$$ Thu Feb 11 10:12:41 2021 Russian Standard Time (UT+4h)  she@DPX200
##.OBSERVE FREQUENCY= 200.1315066352
##.OBSERVE NUCLEUS= ^1H
##.DELAY= (6, 6)
##.ACQUISITION MODE= SIMULTANEOUS
##.ACQUISITION SCHEME= undefined
##.AVERAGES= 8
##.DIGITISER RES= 18
##SPECTROMETER/DATA SYSTEM= spect
##.PULSE SEQUENCE= zg30
##.SOLVENT NAME= CDCl3
##.SHIFT REFERENCE= (INTERNAL, CDCl3, 0, 15.7039)
##AUDIT TRAIL= $$ (NUMBER, WHEN, WHO, WHERE, WHAT)
$$ ##TITLE= Audit trail, XWIN-NMR		Version 3.5
$$ ##JCAMPDX= 5.01
$$ ##ORIGIN= Bruker BioSpin GmbH
$$ ##OWNER= she
$$ F:/spectra/data/she/nmr/H-F/1/audita.txt
$$ ##AUDIT TRAIL=  $$ (NUMBER, WHEN, WHO, WHERE, WHAT)
(   1,<2021-02-11 10:11:42.26 +0400>,<she>,<DPX200>,
      <created by zg, POWCHK disabled, PULCHK disabled
       configuration hash MD5:
       00 E9 B6 7A A2 85 ED C7 34 08 36 98 17 FE 4E 26
       data hash MD5: 16K
       84 97 BA 13 07 DB 7D B4 D8 01 E3 A6 C5 D8 94 2F>)
$$ ##END=
$$ 
$$ hash MD5
$$ 0C B6 E9 B9 A5 F7 AA 46 C1 D6 5E 95 2E 1B 64 48
##$RELAX= 
##$RELAX= 
##$RELAX= 
##$RELAX= 
##$RELAX= 
##$RELAX= 
$$ Bruker specific parameters
$$ --------------------------
##$DU= <F:/spectra>
##$EXPNO= 1
##$NAME= <H-F>
##$PROCNO= 1
##$TYPE= <nmr>
##$USER= <she>
##$AMP= (0..31)
100 100 100 100 100 100 100 100 100 100 100 100 100 100 100 100 100 100 
100 100 100 100 100 100 100 100 100 100 100 100 100 100 
##$AQSEQ= 0
##$AQ_mod= 1
##$AUNM= <au_zg>
##$AUTOPOS= <>
##$BF1= 200.13
##$BF2= 200.13
##$BF3= 200.13
##$BF4= 200.13
##$BF5= 200.13
##$BF6= 200.13
##$BF7= 200.13
##$BF8= 200.13
##$BYTORDA= 1
##$CFDGTYP= 0
##$CFRGTYP= 5
##$CHEMSTR= <none>
##$CNST= (0..31)
1 1 145 1 1 1 1 1 1 1 1 1 1 1 1 1 1 1 1 1 1 1 1 1 1 1 1 1 1 1 1 1 
##$CPDPRG= <>
##$CPDPRG1= <>
##$CPDPRG2= <>
##$CPDPRG3= <>
##$CPDPRG4= <mlev>
##$CPDPRG5= <mlev>
##$CPDPRG6= <mlev>
##$CPDPRG7= <mlev>
##$CPDPRG8= <mlev>
##$CPDPRGB= <>
##$CPDPRGT= <>
##$D= (0..31)
0 1.2 0 0 0 0 0 0 0 0.06 0 0.03 0 0 0 0 0.0002 0 0 0 0 0 0 0 0 0 0 0 0 
0 0 0 
##$DATE= 1613023901
##$DBL= (0..7)
120 120 120 120 120 120 120 120 
##$DBP= (0..7)
150 150 150 150 150 150 150 150 
##$DBP07= 0
##$DBPNAM0= <>
##$DBPNAM1= <>
##$DBPNAM2= <>
##$DBPNAM3= <>
##$DBPNAM4= <>
##$DBPNAM5= <>
##$DBPNAM6= <>
##$DBPNAM7= <>
##$DBPOAL= (0..7)
0.5 0.5 0.5 0.5 0.5 0.5 0.5 0.5 
##$DBPOFFS= (0..7)
0 0 0 0 0 0 0 0 
##$DE= 6
##$DECBNUC= <off>
##$DECIM= 32
##$DECNUC= <off>
##$DECSTAT= 4
##$DIGMOD= 1
##$DIGTYP= 9
##$DL= (0..7)
0 120 120 120 120 120 120 120 
##$DP= (0..7)
150 150 150 150 150 150 150 150 
##$DP07= 0
##$DPNAME0= <>
##$DPNAME1= <>
##$DPNAME2= <>
##$DPNAME3= <>
##$DPNAME4= <>
##$DPNAME5= <>
##$DPNAME6= <>
##$DPNAME7= <>
##$DPOAL= (0..7)
0.5 0.5 0.5 0.5 0.5 0.5 0.5 0.5 
##$DPOFFS= (0..7)
0 0 0 0 0 0 0 0 
##$DQDMODE= 0
##$DR= 18
##$DS= 0
##$DSLIST= <SSSSSSSSSSSSSSS>
$$ [...]
##$SUBNAM2= <"">
##$SUBNAM3= <"">
##$SUBNAM4= <"">
##$SUBNAM5= <"">
##$SUBNAM6= <"">
##$SUBNAM7= <"">
##$SUBNAM8= <"">
##$SUBNAM9= <"">
##$SW= 16.9725356469052
##$SWIBOX= (0..15)
0 0 2 0 0 0 0 0 0 0 0 0 0 0 0 0 
##$SW_h= 3396.73913043478
##$TD= 16384
##$TD0= 1
##$TE= 0
##$TE2= 300
##$TE3= 300
##$TEG= 300
##$TL= (0..7)
0 120 120 120 120 120 120 120 
##$TP= (0..7)
150 150 150 150 150 150 150 150 
##$TP07= 0
##$TPNAME0= <>
##$TPNAME1= <>
##$TPNAME2= <>
##$TPNAME3= <>
##$TPNAME4= <>
##$TPNAME5= <>
##$TPNAME6= <>
##$TPNAME7= <>
##$TPOAL= (0..7)
0.5 0.5 0.5 0.5 0.5 0.5 0.5 0.5 
##$TPOFFS= (0..7)
0 0 0 0 0 0 0 0 
##$TUNHIN= 0
##$TUNHOUT= 0
##$TUNXOUT= 0
##$USERA1= <user>
##$USERA2= <user>
##$USERA3= <user>
##$USERA4= <user>
##$USERA5= <user>
##$V9= 5
##$VALIST= <valist>
##$VCLIST= <CCCCCCCCCCCCCCC>
##$VD= 0
##$VDLIST= <DDDDDDDDDDDDDDD>
##$VPLIST= <PPPPPPPPPPPPPPP>
##$VTLIST= <TTTTTTTTTTTTTTT>
##$WBST= 1024
##$WBSW= 4
##$XGAIN= (0..3)
0 0 0 0 
##$XL= 0
##$YL= 0
##$YMAX_a= 115406
##$YMIN_a= -103676
##$ZGOPTNS= <>
##$ZL1= 120
##$ZL2= 120
##$ZL3= 120
##$ZL4= 120
##$ABSF1= 10
##$ABSF2= 0
##$ABSG= 5
##$ABSL= 3
##$ALPHA= 0
##$AQORDER= 0
##$ASSFAC= 0
##$ASSFACI= 0
##$ASSFACX= 0
##$ASSWID= 0
##$AUNMP= <proc_1d>
##$AZFE= 0.1
##$AZFW= 0.1
##$BCFW= 1
##$BC_mod= 2
##$BYTORDP= 1
##$COROFFS= 0
##$CY= 11.3945322036743
##$DATMOD= 1
##$DC= 2
##$DFILT= <>
##$DTYPP= 0
##$F1P= 15.9154993809931
##$F2P= -4.1035820241983
##$FCOR= 0.5
##$FTSIZE= 0
##$FT_mod= 4
##$GAMMA= 1
##$GB= 0.15
##$INTBC= 1
##$INTSCL= 1
##$ISEN= 128
##$LB= 0.24
##$LEV0= 0
##$LPBIN= 0
##$MAXI= 10000
##$MC2= 0
##$MEAN= 0
##$ME_mod= 0
##$MI= 1.114404
##$NCOEF= 0
##$NC_proc= 0
##$NLEV= 6
##$NOISF1= 3.799351
##$NOISF2= 2.8
##$NSP= 1
##$NTH_PI= 0
##$NZP= 0
##$OFFSET= 15.70392
##$PC= 1
##$PHC0= -10756.47
##$PHC1= 12.00095
##$PH_mod= 1
##$PKNL= yes
##$PPARMOD= 0
##$PSCAL= 0
##$PSIGN= 0
##$REVERSE= no
##$SF= 200.130013532006
##$SI= 16384
##$SIGF1= 3
##$SIGF2= 2
##$SINO= 400
##$SIOLD= 16384
##$SREGLST= <1H.CDCl3>
##$SSB= 0
##$STSI= 0
##$STSR= 0
##$SW_p= 3612.71676300578
##$SYMM= 0
##$S_DEV= 0
##$TDeff= 0
##$TDoff= 0
##$TI= <>
##$TILT= no
##$TM1= 0
##$TM2= 0
##$TOPLEV= 0
##$USERP1= <user>
##$USERP2= <user>
##$USERP3= <user>
##$USERP4= <user>
##$USERP5= <user>
##$WDW= 1
##$XDIM= 8192
##$YMAX_p= 0
##$YMIN_p= 0
$$ End of Bruker specific parameters
$$ ---------------------------------
##NTUPLES= NMR FID
##VAR_NAME=  TIME,          FID/REAL,        FID/IMAG
##SYMBOL=    X,             R,               I
##VAR_TYPE=  INDEPENDENT,   DEPENDENT,       DEPENDENT
##VAR_FORM=  AFFN,          ASDF,            ASDF
##VAR_DIM=   8192,          8192,            8192
##UNITS=     SECONDS,       ARBITRARY UNITS, ARBITRARY UNITS
##FACTOR=    0.0002944,     1,               1
##FIRST=     0,             0,               0
##LAST=      2.4114304,     0,               0
##MIN=       0,             -103676,         0
##MAX=       2.4114304,     115406,          0
$$ Real data points
##PAGE= N=1
##DATA TABLE= (X++(R..R)), XYDATA
0 0 0 0 0 0 0 0 0 0 0 0 0 0 0 8 -8 8 -8 8 -16 16 -17 24 -24 32 -40 43 -48 56 -65 77 -88 99 -112 127 -143
35 -143 161 -179 200 -223 250 -278 306 -340 376 -416 458 -505 558 -615 676 -743 819 -905 998
54 998 -1103 1223 -1363 1522 -1708 1931 -2202 2540 -2969 3542 -4338 5523 -7459 11122 -20329
69 -20329 86350 115406 -102421 111331 40440 -60204 85921 14985 -29710 59735 19022
80 19022 -19360 18210 36974 -423 43844 39085 -5130 51323 15391 2404 48259 -6122
92 -6122 47459 29284 -37934 55703 9043 -30744 56925 7257 -9900 42739 5496 -25071
104 -25071 30787 30100 -31030 33481 18029 -57682 41221 -3803 -49530 60223 -18272 -30340
116 -30340 34843 -37802 -2516 13881 -25431 12827 -12071 -20494 -676 -20125 -6739 -3705
128 -3705 -9759 -14072 -11438 -7748 -24668 -1375 -6161 -21041 10416 -21271 -21253 5293 -25151 -4806
142 -4806 -160 -17872 -1037 -16973 -11290 -2413 -13016 3644 -3864 -10776 -5091 -8523 -4502 -6887
156 -6887 7087 -3314 -14475 9938 -16040 -7664 19583 -17911 4399 11892 -20401 8970 772
169 772 -8569 13616 -4896 902 5404 -11134 7885 3584 -6959 13164 5664 -10726 9522
182 9522 6252 -15171 16001 12337 -18761 18726 6895 -24317 22496 8041 -17342 23038 3022
195 3022 -18129 17136 5642 -11375 18029 8340 -12736 12756 4717 -10423 17048 3587 -5142
208 -5142 14459 -4661 870 12930 -7055 11219 8943 -10469 15513 2100 -11989 20162 657
221 657 -10228 22788 -2933 -13519 21428 -3809 -10447 24359 -4098 -12087 19713 -7102 -9964
234 -9964 20406 -4372 -8178 14496 -8290 -8775 13309 -5023 -5035 11088 -8764 -6101 7127 -9339
248 -9339 -857 6005 -10861 250 126 -12173 3036 -1755 -10178 5570 -5153 -10492 5077 -8062
262 -8062 -8882 6720 -7971 -6877 4878 -10899 -6102 4320 -8711 -1751 3235 -9434 -3527 614
276 614 -6168 -114 2774 -4760 -2507 757 -5099 -889 4544 -3546 42 3341 -5853 1530 4840
291 4840 -3477 3814 4039 -3063 3221 3323 -1430 4006 4731 440 2858 4119 305 1552 5159 2326
307 2326 2168 5609 1686 -772 4708 2425 277 6439 2026 -1565 4649 206 -151 6347 3 283
323 283 3129 -2744 1563 2008 -1395 3436 -1230 -2612 2536 -2638 -1178 3318 -3758 -2161 2534 -4212
339 -4212 -2593 2972 -4348 -3205 3656 -4935 -4039 3702 -5504 -4231 4742 -5059 -4381 4642 -6394
354 -6394 -4109 5435 -5634 -2091 4794 -6717 -1706 4418 -5631 1116 3512 -5512 1246 1571 -3634
369 -3634 3250 1160 -2318 2738 -772 -1071 3552 -94 81 2971 -1204 224 3682 -887 629 3529
385 3529 -1291 384 4308 -1533 544 4495 -2233 529 5099 -3187 476 4620 -4062 1600 4444
400 4444 -4767 1403 2645 -4804 2374 2567 -3811 1678 239 -4003 1395 717 -2339 949 -538 -2839
416 -2839 -65 192 -1561 392 -245 -2651 -494 -172 -1834 720 149 -2024 480 -629 -1898 1265
432 1265 -1085 -1098 1716 -1579 -596 1679 -2385 126 2228 -1980 1708 1571 -2660 1438 1007 -1145
448 -1145 2628 1512 -1268 1347 852 -348 2134 1927 -674 858 1263 -1093 1364 2619 -1390 777
464 777 1417 -2856 1491 1392 -2356 1982 436 -2590 1656 -678 -2110 1457 -822 -1334 1029 -1227
480 -1227 -1679 445 -1371 -565 560 -1097 -673 -800 -1690 -637 -6 -796 -482 -706 -1888 -521 -79 -701
498 -701 -151 -100 -1838 -557 578 -1186 940 1257 -1918 884 856 -1781 2203 857 -1433 2533 287
515 287 -886 2711 452 273 2138 649 716 1860 704 408 1601 1778 1035 1692 1048 -24 1411
532 1411 1304 819 1821 596 -385 1249 231 831 1072 -89 -105 489 -1051 355 719 -540 -137 -67
550 -67 -1618 -105 -557 -1459 280 -1360 -1704 150 -1281 -1608 -653 -1873 -1228 -945 -1761 -1822 -1520 -955 -2206
569 -2206 -706 -697 -1980 -675 -951 -1942 -6 -971 -2330 -354 -1828 -1132 572 -431 -560 -26 -1055
586 -1055 -1382 309 -247 1153 1058 -238 383 344 218 1014 1271 1168 1356 861 1375 1091 1210 1337 1337 1542
606 1542 1573 1179 1348 972 1011 1922 1002 1964 1189 -53 1244 975 738 1928 585 92 783 -148 245
625 245 1142 385 296 30 -706 -25 1 282 277 -365 -512 -781 -845 -207 -636 -612 -7 -1232 -670 -938 -1473 -439
647 -439 -712 -794 -275 -1071 -1088 -785 -1026 -296 -187 -679 -589 -1090 -832 -85 -93 258 87 -444 -640 -242 -233 556 468
670 468 52 356 -216 133 822 570 980 535 -276 1034 -39 112 1229 -109 591 883 -277 806
688 806 547 132 722 338 374 247 -264 -96 -102 254 603 -709 25 -648 -685 221 -230 -261 -20 -1115 -916
709 -916 -576 -461 29 -61 -677 -1139 -438 -1589 -438 -671 -1060 -231 -520 -554 250 -877 -214 348 -569 453
729 453 188 -817 -44 227 690 -364 200 447 -540 483 719 -96 1476 392 -364 943 145 574
747 574 1524 379 750 874 308 545 1571 954 589 1094 305 595 1092 327 981 819 150 822 703 295
767 295 398 211 517 203 138 234 -583 187 -290 42 472 -883 -178 -376 -1344 202 -569 -1058 191 -1407
787 -1407 -1209 24 -1236 -458 -76 -1195 -1179 -470 -886 -600 18 -849 -886 -360 -1009 -756 85 -1063 -411
806 -411 -236 -846 -134 -14 -541 -303 474 -183 -54 475 -374 74 727 -298 897 735 -404 700 244
825 244 -5 1254 478 210 1165 -200 381 1186 379 808 528 119 724 854 423 405 453 167 80 494 4
846 4 37 644 -148 -143 569 -266 -458 262 -608 -306 428 -705 -454 -1 -1270 -428 18 -997 -64 -412 -1601
867 -1601 -594 -478 -972 -50 -742 -945 -570 -308 -629 -417 -59 -985 -585 -229 -703 5 140 -543 344 25
887 25 -357 610 -152 -566 797 112 -33 1079 -103 252 1187 -158 642 1301 -189 519 740 -198 1203
906 1203 1277 -328 807 776 213 1128 1228 180 247 1387 46 843 375 275 1007 843 -776 608 501
925 501 -64 812 -117 -338 1100 -299 -783 1026 220 -545 -133 -784 -1002 -376 -1265 -603 -431 -999 -238
944 -238 288 -723 -434 -650 -779 -687 -538 -686 -753 159 -1019 100 -282 -462 -382 491 -788 378 306 -583
964 -583 285 51 -655 837 363 -358 659 48 -217 740 80 -259 569 7 61 720 233 186 510 189
984 189 261 527 20 218 395 176 500 596 84 -161 272 -94 65 620 7 -429 -100 -456 64 372 -587
1005 -587 -153 192 -1241 47 215 28 -337 -604 -1539 556 -448 -839 102 -540 -315 -324 -304 -505 -267 -137
1025 -137 -653 19 115 -621 50 11 -276 534 502 -62 707 310 -440 647 -242 -178 659 -17 273 649 248
1046 248 268 820 0 521 598 238 1488 649 524 327 508 653 226 1119 -215 228 44 166 793 656
1066 656 -236 -155 270 -479 467 230 -418 555 -2 -747 588 -105 -766 88 -553 -468 116 -669 -766 -214 -853
1087 -853 -653 118 -686 -740 -120 -684 -580 -283 -724 -751 -364 -913 -370 -453 -721 -232 -465 -670 -186 196 -385
1108 -385 59 166 -508 69 119 -543 432 327 -545 548 -179 -184 722 71 -62 661 150 431 745 133 300
1129 300 439 396 394 831 225 427 676 241 160 735 135 160 245 89 283 483 245 65 409 -242 134 294
1151 294 -304 164 225 -163 4 126 -325 -17 -249 -703 104 -683 -82 973 -111 -681 484 -416 -72
1170 -72 -255 -106 -582 -300 -47 -484 15 -205 -417 175 -117 -303 165 -119 -365 487 -132 -175 447 89 196
1191 196 475 -176 367 390 -118 258 306 301 142 432 -24 376 704 336 467 381 279 241 359 266 -23 354
1213 354 -224 68 207 236 -107 292 -378 116 -309 -175 406 -12 -434 225 -320 -460 -48 -534 -34 -135
1233 -135 -336 -623 607 -116 155 -335 -713 361 -55 -659 -113 -409 -552 -441 90 -329 -682 -20 -153
1252 -153 -199 156 -305 -206 155 -388 65 -8 -194 165 -54 -5 146 88 276 503 92 301 581 -22 632 400
1274 400 355 234 181 377 192 307 387 344 613 550 178 440 260 109 361 113 325 225 313 279 314 26 269
1297 269 247 -248 173 -102 -334 133 -197 -319 -56 -172 -183 -337 -240 -331 -243 -266 -285 -76 -242 -242 -335 -349 -294 -159
1321 -159 -136 -337 -423 -388 -610 48 -181 -499 -300 -399 78 -43 -2 -210 10 -259 95 342 -111 299 139 -125
1343 -125 95 473 111 82 52 105 133 353 263 52 183 95 55 628 330 244 273 93 29 195 172 178 238 -96 144
1368 144 -59 -172 125 -6 -351 -272 -193 -178 -22 -10 -309 -98 -238 -92 -313 -291 -228 -288 -369 -374 -221 -73 -483
1391 -483 -263 -678 -347 -36 -108 -381 -457 65 -639 -183 6 -18 -68 143 230 116 -125 127 90 93 319 198 -15
1414 -15 28 -9 123 258 355 254 406 334 468 245 347 356 545 300 376 307 256 329 437 479 109 276 117 107
1438 107 30 210 50 317 -389 301 481 0 -161 708 -127 385 -323 -478 102 -130 -553 -448 116 -544
1458 -544 240 -298 -441 -515 -444 -159 -593 -539 -258 -283 -25 -222 -239 15 -392 -2 -143 -425 -242 -343 -233 -78
1480 -78 -293 -324 -369 -418 209 -476 55 -172 -2 -411 -45 -366 -54 94 861 -1 972 320 -87 -4 -323 246
1502 246 330 180 -199 272 -104 293 -19 93 372 232 95 -57 131 34 45 83 -59 -112 -38 206 -217 29
1524 29 -267 -397 -66 37 -89 163 308 -345 -370 -178 -376 -70 -207 -134 -219 -101 -336 24 -163 -184 -254 -176
1546 -176 -168 -120 -61 128 -429 -304 109 -7 -163 -122 -85 -65 54 132 116 150 -2 21 468 403 -23 102 127 124 336
1571 336 112 138 330 165 12 364 266 76 234 186 101 450 40 504 345 167 123 267 196 175 34 207
1593 207 253 -96 6 40 -36 107 -278 -182 -218 47 -288 -153 -247 0 -113 -419 47 -129 -271 -194 -276 -262 -349
1616 -349 -235 -289 -28 -293 -176 -82 -280 -119 -17 -171 -37 -58 -97 179 15 175 -171 202 83 112 -278 -162
1638 -162 -32 240 75 -107 110 451 118 239 -64 233 164 155 467 141 215 268 61 227 281 81 199 240
1660 240 177 71 21 -84 161 174 55 271 -19 25 -181 119 -67 -28 -111 -334 58 -45 90 -113 106 -98
1682 -98 -424 139 -12 -301 123 -177 -186 -8 -285 -82 -222 -279 -144 -326 -361 5 -123 48 -230 114 226 134
1704 134 24 90 -6 88 -194 176 -52 -48 265 170 -263 211 193 172 151 96 212 224 51 146 201 -49 142 282
1728 282 32 429 285 -2 274 162 81 49 360 60 157 -114 153 29 163 -10 6 -114 37 -238 180
1749 180 -171 -35 21 -134 -165 -38 -255 -4 144 -328 22 -307 -176 -30 -262 0 -179 -322 39 -50 -253
1770 -253 -273 -193 -275 -26 -257 14 -194 -233 -133 -158 80 -26 10 -66 -278 -27 -366 -248 -140 466 665 126
1792 126 308 91 -440 448 -376 266 663 344 290 -75 106 389 -270 576 272 -130 -289 89 108 -199 -101
1813 -101 -89 207 -232 -426 -507 602 581 -171 284 -232 -670 -492 -111 198 -431 -119 -68 86 -351 188 -64
1834 -64 -72 -517 -403 -174 -211 -208 -105 45 -145 -84 -5 -110 -140 -98 -8 -156 -191 -290 -218 -171 -57 -28 -49 30 -28 13 -178
1861 -178 -7 160 250 -79 153 65 -41 25 9 38 185 156 141 291 124 47 25 49 256 334 -214 234 -224 285
1885 285 92 -89 130 216 177 -60 38 -69 37 -182 -47 49 -50 -41 -108 66 -192 -324 -149 -294 34 -201 -222
1908 -222 -182 218 -170 -400 -202 -138 42 -103 -237 -205 -226 -285 -113 -191 -4 -112 11 -76 35 92 -79 82 80
1931 80 -28 -197 107 69 152 114 74 -53 221 43 217 214 102 318 147 222 157 214 61 270 27 34 -24 147
1955 147 73 -14 141 249 58 240 26 -45 -86 -72 -84 35 -211 -109 -38 -151 56 190 -75 -96 -19 -103 -276
1978 -276 -166 18 -188 -293 -198 -128 -104 -292 -86 -250 -147 -82 -80 -120 -265 -165 41 -1 -162 -1 -102 -120 -91
2001 -91 -146 154 31 13 -174 51 -94 37 -31 60 -129 91 4 113 155 112 -104 158 51 108 24 258 384
2024 384 211 258 126 307 60 119 167 217 168 42 -111 88 166 -235 383 568 303 -218 -317 -164 -799 -129
2046 -129 251 24 -631 -73 -440 -241 -63 -453 -167 -10 -404 5 149 119 70 -542 -173 -304 -158 -263 -280
2067 -280 119 302 -232 -106 -211 -305 -131 -7 -108 -298 441 119 167 205 31 301 201 395 -520 183 25
2088 25 -133 -340 -424 244 86 -162 366 411 347 63 304 57 238 60 -43 -162 -121 129 65 -308 -4 122
2110 122 257 48 150 126 -408 223 -471 -32 115 -401 -158 -349 -223 57 -58 -69 -203 -134 151 -243 -557
2131 -557 -356 -408 -295 -440 -216 217 -116 3 -93 -127 -250 -124 -36 -7 27 -110 60 -219 -420 115 149 252
2153 252 -17 -155 -243 186 -81 -138 108 -209 74 -81 14 180 89 514 191 795 1 117 385 9 675
2174 675 -64 -125 -33 -336 69 476 173 -18 335 145 -79 215 208 227 -256 52 -162 228 -303 125 364 -383
2196 -383 -531 1003 -407 678 232 -641 202 -471 -485 791 -31 494 391 -728 -343 -301 24 475 -302
2215 -302 -605 19 26 -545 -287 446 322 277 -77 649 103 47 -130 -301 -339 -34 -121 -447 -27 197 292 -347
2237 -347 193 382 -281 -118 207 -35 196 308 212 273 177 95 231 81 77 5 -6 127 132 77 299 88 19 -7
2261 -7 -38 21 0 -304 -57 225 -102 150 -77 76 -27 -110 -245 -239 134 -110 -336 190 -77 -337 85 -28 -51
2284 -51 -444 -397 -278 -226 -229 -441 225 495 -423 458 48 -1176 283 -742 20 -62 -302 342 -253 -545 -192
2305 -192 454 -197 187 240 -50 -162 -102 154 -373 50 388 138 -228 -50 -431 34 229 194 -124 -302 -217
2326 -217 18 -313 -64 46 306 499 361 -13 203 177 325 186 -539 -885 239 -239 144 237 267 -60 81
2347 81 198 188 -414 -342 -156 661 -223 -161 -901 411 425 -442 257 -278 -561 323 -440 -892 -824 -929 -626 -586
2369 -586 -167 -25 -202 -265 -52 307 -88 516 -265 268 -406 -186 -259 110 570 -97 200 1080 67 604
2389 604 242 217 256 166 -72 117 280 -197 368 -28 222 11 -500 363 620 234 550 -92 869 21 -442
2410 -442 169 429 90 -179 -125 165 297 265 -286 899 -139 -598 -331 17 -233 -32 -195 -156 440 711
2430 711 -279 -849 -258 -480 514 -954 80 -318 -312 376 230 87 5 -476 -738 133 -98 97 -330 -251 111
2451 111 -444 209 -321 -37 481 -311 86 -73 365 -147 844 298 214 372 -133 85 139 -215 378 12 82
2472 82 163 216 32 69 -132 -45 -35 97 155 342 37 -167 2 189 67 39 98 46 63 316 141 -294 39 164
2496 164 83 -102 -101 -102 -97 21 -104 -22 70 -227 92 -89 14 -272 263 56 -178 -148 -10 -95 -54 135 95 -119
2520 -119 -252 -242 17 -1 23 23 -179 271 72 -44 -154 32 111 -92 210 84 141 210 162 248 86 -54 -279
2543 -279 -244 -52 -95 -248 252 36 119 126 237 39 138 212 286 -568 -517 -19 -45 384 252 -855 -183 123 299
2566 299 208 -358 -247 341 49 -185 -534 -68 -239 88 -288 150 -261 -337 -57 -28 -166 -235 201 -169 -184 -128
2588 -128 -150 -85 -96 -489 -156 284 -466 -61 -294 -230 -104 -24 -71 176 -274 -83 123 -301 -41 -98 185 107 172
2611 172 -138 387 34 85 154 124 -143 320 20 132 159 -20 191 66 -22 -190 110 0 50 -99 -316 133
2633 133 240 -175 -129 -7 168 35 134 12 -29 -73 -213 -159 -115 -288 68 94 157 90 59 -194 140 -48 -218
2656 -218 -303 215 -207 -533 -180 -110 -389 -7 -182 -292 -164 -62 -164 -348 58 315 -95 83 396 223 -284
2677 -284 -93 -365 625 -415 647 -716 -96 49 -93 -130 -348 -572 -277 318 317 71 55 110 -432 -355 688
2698 688 -315 87 455 -58 430 122 119 -436 70 394 140 351 -654 99 -922 78 -323 30 -34 -137
2718 -137 231 267 -17 514 -44 117 288 42 -15 252 205 268 -114 -363 -12 -277 -580 144 -79 176 -686
2739 -686 -36 -397 -613 -402 -53 653 295 -495 -20 537 415 -536 -201 199 108 -572 -58 353 -184 269
2759 269 334 85 -816 145 -284 -218 80 216 -251 -135 -261 477 -99 339 -40 115 -44 212 -176 365 -252
2780 -252 -363 48 -75 -438 -268 -394 100 -138 -138 -168 -197 -316 -370 28 -255 -283 -380 515 44 -103 -133 77 1
2803 1 -24 235 -634 351 25 286 -294 86 -56 -290 -478 -58 -310 104 -255 -233 -709 -712 16 44 465 -421
2825 -421 66 -93 -349 -56 -54 348 658 322 -348 -1174 264 406 184 -265 -709 319 321 496 68 205 176
2846 176 -11 -327 -296 -279 256 -31 -11 1473 -322 -8 -76 -143 -417 -141 -167 -160 308 -60 -607 403 72 407
2868 407 -255 527 -278 -314 -616 -18 -765 612 -778 -203 769 -15 287 206 445 -774 321 548 -93
2887 -93 738 -32 1034 -42 57 257 -22 -256 -176 -294 -294 -911 -625 -709 325 -96 28 386 71 46 -633
2908 -633 681 93 -77 -302 128 -125 85 -1 163 -767 -75 -183 -218 -34 -293 64 362 -14 -134 -312
2928 -312 762 329 533 -4 343 96 26 -288 -679 -150 145 -232 -285 -221 -200 288 -213 -53 -321 -105 187
2949 187 -148 -308 -92 143 -221 -81 27 251 -166 810 -136 849 -718 -29 -308 -438 -71 -378 -319 188
2969 188 -383 227 384 -204 284 -416 51 -732 198 41 -569 152 -140 543 687 -56 355 413 1485 571
2989 571 197 276 451 275 481 556 -444 778 -97 -122 -247 1110 -417 480 -99 -54 -562 -125 538 70
3009 70 -41 545 390 -201 85 -612 -224 584 -683 1 -249 -168 -470 -151 337 375 -771 71 104 375 762
3030 762 412 -78 -222 339 626 -394 -596 -74 424 -447 -284 -133 151 300 -516 -7 137 81 560 180
3050 180 73 387 -102 172 121 123 657 -55 267 82 -116 368 353 98 -451 12 237 152 -109 608 -14 -1
3072 -1 188 274 -228 395 -546 -174 -60 -239 99 -371 448 244 2 157 -176 142 -392 420 -326 -71 392
3093 392 -63 -269 -190 -127 -486 -482 42 79 -305 -598 -115 -278 -527 -144 -355 200 -270 -182 -16 -73 -439 -378 -100
3116 -100 332 -365 -311 60 -215 -164 481 242 -8 9 -40 -199 112 83 209 356 28 301 13 216 -131 50
3138 50 -156 154 -276 -160 127 503 -125 -25 296 123 -92 -19 515 23 -209 155 -149 123 -447 -167 -21
3159 -21 277 626 75 42 -92 103 13 -6 223 -1337 145 -112 195 -300 638 79 516 124 532 8 207
3180 207 665 154 -359 218 359 -151 452 -170 -116 -170 -217 132 -15 -42 129 -221 440 -19 463 -102 -415
3201 -415 61 679 343 414 -349 -115 -247 54 -755 -111 -377 -470 -677 412 425 -281 14 1 226 171 526
3222 526 -131 -375 724 355 -833 561 305 434 -600 -457 32 198 -65 -196 25 -381 -710 -40 546
3241 546 414 169 26 743 -479 -250 601 605 319 -385 94 -42 -458 478 -58 -119 -583 395 222 -232 -354
3262 -354 -48 -22 138 69 89 404 -414 97 -429 -293 40 -180 89 89 -59 -13 -40 157 56 412 276 201 87
3285 87 -251 82 -143 -1 248 -229 57 -95 -48 97 151 161 62 -38 -83 29 240 -171 -70 -175 149 123
3307 123 -72 -173 17 220 -82 246 94 -82 -24 -2 -148 -172 91 -26 -221 -6 -39 -77 -327 -120 -159 57
3329 57 -140 17 -13 -38 21 36 -145 -77 8 -246 -88 79 -124 -126 36 -251 -120 -396 -150 67 135 146 43 115
3353 115 153 -61 -31 165 -129 68 -91 46 143 243 56 -47 -105 71 -108 62 84 -63 -24 63 135 316 89
3376 89 -211 -221 -291 1 45 -44 -91 219 21 -2 32 -7 -35 12 -90 95 -250 132 125 -283 11 -96 36 -162
3400 -162 -189 370 -262 215 -68 -57 -163 102 -209 -112 -12 27 284 45 166 36 122 65 -80 -91 35 -17 46
3423 46 22 191 96 -91 100 91 -34 103 -78 86 -61 211 175 41 -52 124 149 23 128 123 198 -221 -251 101
3447 101 -67 -46 34 354 -90 156 -112 109 -7 -19 76 199 -49 -222 63 136 -137 -281 -18 -48 122 -102
3469 -102 310 -155 -160 -79 -107 -257 -210 -198 -82 -240 -109 -40 -352 -122 -140 73 -150 -46 -20 -138 157 292 -97
3492 -97 130 112 52 -16 -31 72 72 200 225 -219 103 87 -104 73 -235 -226 -209 -95 -150 216 55 152 -62 -47 118
3517 118 32 -124 -98 -71 15 33 -11 -29 100 -125 -85 90 -28 -46 -184 36 62 75 26 -228 13 352 -109 -42
3541 -42 95 107 9 -356 -186 -176 -152 79 -61 -116 -54 46 103 83 25 -87 -82 105 -160 -33 111 -104 -71 10 139
3566 139 -139 -240 243 -136 7 -160 144 51 162 169 161 -115 -7 49 13 39 37 183 153 43 -25 -132 63 297
3590 297 -30 99 51 189 105 10 46 21 -52 62 -30 -184 -108 29 -162 317 298 -72 -44 235 137 16 -45 120
3614 120 206 -509 -8 59 -539 173 97 -128 -224 -14 -75 185 242 206 -138 63 -92 97 230 -557 353 -24
3636 -24 387 -67 487 572 81 314 -623 -735 207 -421 -83 245 88 -200 38 235 63 143 205 282 -112 -55
3658 -55 -1 117 -37 6 97 -111 -69 -43 58 74 -49 -144 -69 23 74 72 -24 -76 -9 172 1 -118 -235 10 145
3683 145 -96 -118 -6 63 127 -273 -226 -156 -198 106 24 38 58 -135 29 9 17 -88 -216 17 13 97 15 -328 -161
3708 -161 181 -152 -44 -283 30 178 -115 67 199 21 93 45 228 236 224 -103 17 30 185 -21 151 -55
3730 -55 14 116 69 54 -15 240 137 214 18 -296 -62 44 -117 7 -14 58 -115 -99 -48 49 -77 200 -34 73
3754 73 57 276 -1 -75 3 -48 -151 53 -308 105 107 -142 18 -46 -49 -192 68 -102 254 6 -107 -256 -190 388
3778 388 36 -18 -197 -127 -148 85 -14 70 162 30 16 -63 -88 38 201 126 165 -92 -120 -16 118 -166 -150 190
3802 190 -188 -70 -156 40 67 -54 486 48 23 109 164 155 147 -45 65 131 68 -204 -101 -33 97 -222 91 1
3826 1 22 -57 -73 351 119 -169 -9 -53 -199 -206 -314 10 -29 179 56 91 4 -194 -17 -61 -276 -76 -185 13
3850 13 123 22 -115 -21 -140 -90 -57 53 -290 -67 -71 55 87 115 52 -2 -112 -388 -81 -46 -59 -9 -76 -136 256
3875 256 -13 40 155 209 -49 187 67 59 113 92 -124 90 213 -203 26 -33 185 48 -98 -306 -51 -127 357
3898 357 -397 494 -43 -295 -248 -960 370 -351 40 -247 320 429 -217 159 -222 -88 -307 -10 111 84
3918 84 21 132 -162 66 -125 -52 -80 -12 -130 -13 98 -68 155 -71 48 191 1 48 -250 -27 145 -89
3940 -89 -110 -66 -171 79 -17 271 -31 -136 -63 -112 47 58 -9 220 -142 -82 85 -52 203 -162 136 -40 -2
3963 -2 -61 -97 142 0 141 39 -3 97 2 -434 101 153 6 -64 -38 -15 -67 -94 131 8 -28 -276 -173 -289
3987 -289 -10 9 34 -100 -237 -98 151 -30 -199 -177 -66 -40 78 186 105 -52 59 -55 28 -6 -10 -242 8
4010 8 -76 -152 140 -210 15 -200 -144 -223 26 -32 55 122 -112 -9 1 56 206 -100 -200 64 31 288 -70 -57
4034 -57 54 198 -6 -15 112 52 -140 -171 -263 55 58 31 44 -35 -69 347 -29 -36 -72 -25 -39 47 -31 -92 -90 -209 -75
4061 -75 -181 288 -43 418 -67 -160 -17 -212 199 616 428 103 -39 307 543 -418 -42 118 82 405 288
4082 288 -78 -36 155 27 299 228 -165 93 -50 133 -138 194 122 -152 24 13 -200 31 -132 -117 140 49
4104 49 54 72 92 197 71 14 86 -153 205 -120 88 32 3 59 3 -120 183 -64 -186 138 -85 108 -99 104
4128 104 113 -187 -130 104 -99 2 -69 -220 202 153 -12 357 218 18 -86 -76 -92 -110 121 1 -90 -67 -140 45
4152 45 139 292 104 -223 -297 79 -57 39 -77 -296 -101 -5 -104 -103 106 -23 -140 -135 -25 -175 -122 -135 46 26
4176 26 -97 -251 -215 123 76 60 10 -321 159 -162 -50 -248 -1 -126 2 135 -52 -47 284 171 4 101 119
4199 119 178 -115 -103 64 -171 -144 116 53 -91 -122 -27 9 -145 -165 -51 -57 220 -77 226 -340 22 -73 44 -70
4223 -70 -292 -90 -39 -102 -74 -66 -169 62 75 -110 134 76 163 52 -110 87 -219 -19 -1 197 46 182 -89
4246 -89 -50 -228 150 87 66 211 -308 -20 17 -133 266 22 36 -61 -78 108 -153 -193 -21 -88 -135 158 -23 208
4270 208 -72 4 81 -236 -152 -71 114 50 -84 -111 -180 -33 -206 -18 16 -80 -38 -270 -164 60 -157 -386 74
4293 74 -114 39 -65 149 -124 -228 -75 -26 16 -54 -44 -150 69 169 173 -41 94 18 -132 54 -186 -67 -74
4316 -74 -171 -23 198 -83 -14 86 33 157 -2 -49 -212 124 -39 59 -10 348 169 125 -19 -23 228 -103 85
4339 85 16 -6 43 -33 -105 39 -141 68 217 -47 -15 -51 -224 99 55 -31 201 -76 43 -240 80 -61 -248
4362 -248 -65 84 32 286 147 -155 120 -291 -101 -20 -24 35 -11 45 45 -74 53 176 39 -19 -56 82 -35 8
4386 8 -387 -118 -179 -147 -116 119 -76 36 -121 -182 -92 -300 69 44 -112 -6 -15 60 -234 146 -202 -3 70 -116
4410 -116 167 151 -193 57 -83 -41 -105 85 -14 -48 136 -47 225 8 -40 114 -122 297 185 -43 279 -57
4432 -57 -59 -31 119 141 -185 -134 81 -98 -166 19 -310 -94 -32 0 -172 -69 -44 60 137 -100 70 -73 -58 -120
4456 -120 176 -144 203 101 250 -54 17 -9 230 -35 6 -88 -25 172 -20 158 -70 80 164 106 -69 -76 212
4479 212 248 152 210 23 126 109 87 -70 14 -75 376 -48 214 284 -67 -52 -187 -187 -80 199 71 218 0 -141
4503 -141 -140 -68 -103 142 221 -594 -360 290 -556 -464 164 278 -501 -198 239 -242 146 -119 -12 24 110 -84 100
4526 100 161 -77 25 248 -82 -92 170 112 -234 91 -75 -78 -27 -28 10 277 -283 -39 90 176 91 -107 240 42
4550 42 -42 105 55 -229 315 -179 140 55 -158 -88 -92 -52 -88 -42 87 -39 154 -80 98 109 -74 119 -47 -44
4574 -44 -10 19 16 270 66 -63 -102 -191 91 -178 139 -60 -135 -33 171 136 179 -62 44 -82 173 188 -17 26
4598 26 4 178 105 202 143 85 26 41 92 20 -154 -8 -193 34 82 -28 43 -73 10 116 18 254 3 219 8
4623 8 135 -58 721 817 -413 -211 -185 -97 -108 169 -218 -59 29 -55 109 -80 131 179 15 -60 -44 -66 -77 3
4647 3 -181 -9 -63 13 -199 -56 159 -158 -116 113 -39 -32 90 7 52 110 97 -79 -145 -176 36 -142 193 -79
4671 -79 6 36 36 -34 -2 -80 -30 39 -82 118 -90 -9 -85 137 -100 -250 -165 172 -26 80 202 -44 -177 22
4695 22 19 -199 -93 -73 172 445 -125 191 104 78 18 -22 151 152 116 -57 3 17 312 -61 59 180 223 7 -52
4720 -52 102 -11 85 -212 37 -140 25 -308 -192 -136 -8 -39 170 -47 109 13 103 35 15 57 1 363 141
4743 141 147 -145 -142 -37 45 75 -71 140 112 -163 -66 -7 -67 -147 109 -202 99 29 147 61 253 -59 174 -240
4767 -240 36 115 131 200 -98 21 -26 -61 64 9 105 250 114 89 87 41 -27 41 147 10 117 -134 161 -31
4791 -31 25 -53 48 -8 -65 225 50 99 -83 -95 119 136 37 77 33 -184 53 -104 207 -96 46 60 -8 -70 91
4816 91 -114 -44 204 -213 -21 57 -61 -106 -38 103 -18 -50 9 -183 331 -78 -101 82 -252 -51 -65 -88 9 -81
4840 -81 87 51 -54 -221 63 51 -48 3 -62 272 30 -1 -211 27 69 281 69 111 25 108 -109 72 17 97
4864 97 115 125 -26 43 24 3 -108 -7 -30 111 17 -159 60 104 -132 121 -113 -79 126 -68 -218 -138 -158 116
4888 116 -3 60 88 -65 18 -30 33 192 -34 30 146 140 -51 -5 75 42 -102 40 119 70 -137 49 -29 -90 -213
4913 -213 -80 27 94 259 159 42 320 116 14 -73 -166 -29 -98 -65 -137 169 72 -121 29 39 51 -74 67
4936 67 20 73 -85 111 76 37 -10 -100 122 35 51 20 80 68 176 80 201 -42 120 14 -19 16 218 57 -52
4961 -52 -55 42 60 51 86 -68 32 -33 -170 -45 -250 193 28 -48 -142 -3 86 -331 229 182 -115 27 38 -78 134
4986 134 -198 163 -82 -57 126 72 -93 -117 337 -124 -147 -286 -127 -156 152 -322 144 -314 -233 242 149 263
5008 263 -183 53 -280 57 419 421 -1126 375 617 -266 -178 114 34 165 337 4 -360 -129 397 -251 -376
5029 -376 389 -22 106 37 304 -182 -50 -121 145 -7 -25 40 54 -26 25 99 -98 -69 -178 -129 -118 -16 17 -81
5053 -81 -59 -155 89 98 -69 41 -6 179 56 -295 -158 -9 -217 -111 118 -45 174 168 -199 18 -93 -29 -108
5076 -108 -88 223 -26 -26 17 281 -99 -139 58 67 29 -72 103 -207 237 -6 -93 311 189 112 246 42 -121
5099 -121 -215 385 243 75 9 -35 -76 -101 142 -496 129 -22 437 71 -168 -102 70 -188 -588 -254 -424 372
5121 372 -301 -76 281 377 -161 -393 576 34 -243 -70 -302 -101 192 -148 90 -161 17 31 35 -37 228 38
5143 38 20 73 20 -351 -1 80 -206 275 135 54 -111 -126 -141 -78 -125 -107 -29 71 311 117 19 -8 -122 43 -100
5168 -100 -51 -156 -171 -92 -254 -101 -98 -220 -92 96 78 112 24 -217 120 255 -75 156 281 -118 85 -203 89
5191 89 -104 127 -58 40 -509 -519 97 -163 -10 222 50 -243 334 -573 -125 -304 226 -441 228 279 -108
5212 -108 -18 -19 498 580 615 42 -715 184 -421 22 -460 -176 -407 -638 89 -7 133 -7 278 368 -449 -47
5234 -47 262 -339 -355 19 64 148 -18 -109 129 -183 30 -79 -68 118 32 -106 -178 338 -600 -250 137 311 -505
5257 -505 206 88 -14 888 397 10 -280 279 179 135 -180 654 -5 -337 -183 329 210 429 -603 65
5277 65 -390 -463 -683 -345 -875 -832 181 -330 1028 156 -122 -50 282 51 -74 3 234 -129 403 301 360
5298 360 -22 -73 364 -462 -239 397 291 150 -79 -230 -193 -93 163 17 124 206 -89 -75 204 130 -44 -3
5320 -3 -143 -91 -64 117 -59 -179 56 -234 -183 55 12 -109 62 -302 -150 39 146 60 -10 -195 152 20 -171
5343 -171 306 165 146 156 -137 -223 66 -17 -121 -2 -9 -129 -134 249 138 -14 -37 -161 15 40 -120 113 106 -50
5367 -50 45 -69 -77 107 61 -32 77 -236 78 -47 54 -169 -22 -28 217 -220 231 16 249 147 162 106 -32
5390 -32 51 24 58 95 18 28 120 20 -54 246 74 -141 -135 -166 156 -241 -275 169 70 81 -25 -40 53 6 180 355
5416 355 269 -47 82 15 176 120 -165 -104 159 -60 48 -295 143 -97 -166 -21 -183 31 -93 -396 148 -236
5438 -236 -14 25 -69 -99 -40 16 -46 19 -162 -48 -47 -148 -59 22 188 -37 322 366 32 189 -186 71 -33 -25 153
5463 153 -96 -43 -204 57 10 1 -171 32 -16 -5 -88 -344 -191 -12 95 2 101 340 -39 54 222 44 89 315
5487 315 105 -79 -253 545 399 198 -258 -257 -106 341 -418 -341 622 31 -335 -238 -682 205 233 -87 -480 151
5509 151 12 -312 -394 -9 57 -424 336 36 -268 -387 374 -192 -134 391 -97 -59 -115 26 -447 180 -62 42
5531 42 -216 -367 -27 62 2 -83 114 118 21 80 127 95 143 262 -52 110 -84 27 -64 -81 -2 166 229 147 130 -17
5557 -17 100 19 -134 102 7 -14 -26 -216 76 -184 -1024 -32 -327 68 -337 -682 296 129 210 10 180 75
5579 75 17 99 268 -3 -113 -75 12 318 -110 -189 178 330 109 84 -17 152 -8 79 -42 -194 -12 -180 28
5602 28 81 63 -7 -42 -58 93 204 -161 -174 45 18 -50 28 -96 386 -128 -135 133 -169 -183 196 66 114 233 70
5627 70 3 43 264 -3 -315 -69 0 -6 -167 -232 74 -102 -10 -38 -46 -161 -177 -71 -199 84 183 87 -2 157 398
5652 398 -2 -125 77 -30 33 -34 -82 178 -20 -185 -56 301 -23 21 -13 78 297 -53 203 -117 -22 -182
5674 -182 -95 201 -184 -36 -29 -169 10 -32 107 -325 -117 25 107 -116 -124 -40 -104 -115 141 -145 221 86 129 -161
5698 -161 -106 99 78 -20 80 -127 -68 -142 -158 49 -94 -12 -350 86 125 13 174 47 -36 111 -165 25 -177
5721 -177 -58 -57 4 115 125 -188 5 -173 -62 95 -12 46 -48 56 -62 -175 114 -97 -6 -168 101 -29
5743 -29 -38 -12 -11 3 230 38 -68 26 33 -11 56 188 -26 -69 98 -94 -27 -15 33 -36 -72 31 5 137 -74 -70 -208
5770 -208 -174 20 151 151 211 152 157 52 99 13 61 194 -100 -54 -26 14 -132 60 67 24 61 47 79 244 166 -86 -8
5797 -8 65 -189 -177 85 -166 174 31 -49 176 199 -105 50 -40 128 360 -466 -225 268 -31 -169 82 -367
5819 -367 -9 -173 39 134 349 -197 622 298 -20 -32 -26 -77 -98 -247 273 12 107 423 -184 27 96 449 -219
5842 -219 196 -205 -223 -109 -96 -209 127 -267 -80 162 37 -15 19 -474 110 -235 235 147 -160 -49 63 3
5864 3 329 -24 -405 86 -360 158 -10 95 -66 -103 -238 175 -154 -10 173 -295 90 -295 -149 24 -72
5885 -72 49 34 242 93 -241 37 156 60 5 -9 -17 -64 -71 -101 -20 149 205 25 -9 122 -143 263 17 -163 74
5910 74 95 1 -113 -29 -74 -95 1 171 -154 113 83 -146 -13 80 -42 96 -119 85 -155 52 133 -273 -186 125
5934 125 -32 15 -166 116 41 101 129 -38 25 -102 -209 -80 -23 2 207 -79 -31 35 -174 -61 67 35 -65
5957 -65 -82 -151 79 -93 -213 -209 2 252 34 -109 174 -199 -162 -11 242 -5 31 38 525 269 -185 -140 269
5980 269 -373 -237 466 79 -18 91 -241 84 78 -55 -121 -187 435 894 370 16 623 425 -21 -66 108 361
6002 361 -114 155 -187 -217 349 -93 101 -273 259 33 13 74 -4 241 -44 -92 235 58 -9 21 -189 245
6024 245 -109 -41 139 -342 49 191 54 -103 40 95 -66 -84 -190 -164 -124 -166 -100 -243 76 -26 -226 -62
6046 -62 -219 -200 -97 134 20 -248 -18 131 -137 57 -29 96 114 18 -186 7 -15 3 62 -75 -45 146 94
6069 94 38 -165 205 78 74 -33 145 160 -76 154 45 61 -21 -188 -24 123 3 -18 124 -13 -99 157 261
6092 261 90 -247 -2 -16 -62 -74 132 0 -152 2 -179 183 -215 -114 -30 21 -18 231 -536 130 431 149
6114 149 -53 -642 532 -65 -92 241 -73 654 -31 529 -291 -257 -59 49 185 -311 128 564 28 -179
6134 -179 255 162 -126 -138 -188 151 7 65 -169 35 -112 213 -37 -18 37 60 36 46 -136 15 -12 117 19 183
6158 183 65 199 164 103 -72 47 -7 181 -63 -197 8 47 119 -55 -173 11 -84 -10 118 -135 -211 81 91
6181 91 -40 48 -12 136 -154 -85 226 153 24 47 -169 -124 -156 43 -66 -169 91 86 83 64 -41 -155 43 -264
6205 -264 56 -10 198 66 44 17 -204 -46 -139 -20 121 -103 -156 -19 -178 36 22 115 -82 137 -97 -52 0
6228 0 45 -243 -124 127 -118 29 98 -100 -187 12 -9 -82 182 170 17 -178 -104 84 -154 29 85 -14 117 25
6252 25 -174 161 -116 -3 145 -18 -1 178 -26 72 138 31 -89 -226 -166 -23 -32 133 -70 170 -151 -178 -112
6275 -112 76 -53 81 -138 20 -69 -72 202 -137 28 -208 11 -25 0 115 -76 115 201 -161 -117 179 -17
6297 -17 -8 -15 -17 126 146 -54 -220 54 -71 -19 -240 14 -21 42 -178 -37 188 159 -104 70 48 -55 -15 -84 -104
6322 -104 -44 -89 -234 124 40 194 327 -4 87 32 50 -196 69 -104 128 151 169 47 -121 229 97 218 -13
6345 -13 -112 91 26 -67 -60 -169 -175 156 113 -1 77 42 60 -90 -145 -177 -40 -294 -97 -138 70 86 109 251 -19 158
6371 158 49 -58 -268 -67 -99 36 263 205 -103 -41 46 -133 -95 34 70 -53 -51 -17 69 -181 -18 -13 15 4 -19
6396 -19 -307 53 28 -58 -40 94 30 142 177 81 100 -3 87 166 -138 73 159 71 -46 -45 51 25 49 -92 -203 198
6422 198 60 -104 -72 -3 -158 -276 184 24 1 171 100 -186 -134 47 37 100 23 56 -54 175 41 83 -223
6445 -223 30 -144 -97 -36 100 -39 136 149 -115 -90 272 99 -177 9 -23 72 -22 -173 -162 390 -306 -535 -312
6468 -312 46 -324 39 257 345 120 -24 23 231 -231 -281 9 391 -355 -28 200 113 109 64 99 50 -166 -197
6491 -197 -75 240 -120 96 -28 -107 9 -39 -93 123 -22 -80 -5 156 10 -121 54 -162 -122 -119 68 17 160
6514 160 -44 -139 75 -286 151 -243 190 -32 39 215 126 64 11 -44 168 -2 -102 72 -38 217 -54 -141
6536 -141 -41 -47 -31 -184 -91 -86 -68 -111 66 175 -170 21 -83 29 139 -1 -88 327 -10 -213 -124 160 169 294
6560 294 -55 153 -51 -59 -38 -1 -53 -7 -71 62 45 -38 -184 -129 151 75 43 12 -174 154 -251 119 83 166 -116
6585 -116 -225 110 -147 136 30 56 128 152 -85 178 -51 -20 -169 155 98 73 208 -206 -27 253 46 71
6607 71 19 -21 171 150 29 221 -52 102 15 -289 -240 -130 -11 -102 -74 13 53 -71 -6 74 69 -146 -151 112 -62
6632 -62 -1 -59 -18 5 -31 -14 -189 183 -150 -161 62 21 -135 -52 -143 60 -232 -82 219 -99 -118 -150 -35 84
6656 84 23 -40 111 -177 149 33 -129 -85 -133 44 50 111 253 60 -6 -203 194 -149 49 -6 91 -14 67 84
6680 84 35 261 103 38 70 -10 49 174 -134 114 228 14 3 -15 256 -96 15 4 130 -261 -52 53 -76
6703 -76 -81 52 60 169 9 38 14 62 -32 159 -94 -53 239 119 15 -290 115 -83 -63 -41 116 20 183 -128
6727 -128 181 42 -158 -167 -4 92 274 -63 182 -50 -107 -103 -161 14 49 124 -26 56 -102 36 -193 67 186
6750 186 95 -52 -125 27 135 -168 -333 125 -42 131 177 185 -146 -18 171 42 107 -164 -133 29 -74 139
6772 139 -172 -232 153 33 -113 60 -15 -124 -13 44 134 91 -107 -68 71 -31 43 147 -33 -135 -80 150 -183
6795 -183 -282 -239 115 152 4 50 -25 77 176 47 35 -75 16 -60 -154 -132 -154 128 -107 -26 -46 -79 33 -269 127
6820 127 192 34 46 -4 -52 143 5 -12 155 -67 -50 -352 -310 -58 -142 119 211 -142 -71 127 124 -117 29 -118
6844 -118 192 143 -59 -67 -10 54 198 4 -101 -77 30 -69 203 -190 -9 32 28 -155 114 112 -179 104 62 34 -55
6869 -55 -68 344 389 409 149 310 -113 -194 209 307 -158 46 154 -229 213 -64 -121 599 407 -307 -311 196 129
6892 129 248 -502 70 235 141 229 69 77 22 -285 -200 303 -180 234 51 -79 138 291 154 -22 24 130
6914 130 -18 -162 -29 102 -410 -103 135 161 -143 182 122 -116 83 142 -145 108 -127 -425 109 -50 -13
6935 -13 -67 -50 -80 23 82 -1 -130 30 199 -15 142 8 -166 -31 20 -34 17 89 4 -145 87 76 -87 90
6959 90 -51 -20 -43 -7 -73 74 -151 -136 -74 -6 150 103 47 -3 41 2 35 -86 -44 31 -240 58 61 48 -3 -147 -1
6986 -1 4 -4 -44 -4 -213 -162 -242 117 -21 -51 80 -333 36 -6 -84 -240 69 181 90 -53 -16 136 68 -266 157
7011 157 64 269 159 -115 150 -100 -38 75 314 170 43 -199 -200 -46 59 92 70 102 -187 49 -167 -2
7033 -2 -234 132 196 136 41 83 -223 -166 64 165 174 -122 -89 -192 73 159 -125 -89 222 200 -15 -56 -26 28 -44 -182
7059 -182 64 -269 45 -179 -209 -146 112 266 56 -54 35 95 35 49 -34 27 29 -181 -38 251 67 247 200 -7
7083 -7 -46 -190 121 148 107 -75 108 187 -107 -116 -152 128 15 -300 174 130 -49 141 -85 2 87 152 197 -199 56
7108 56 -136 64 3 -84 -44 64 -16 -19 -41 8 134 127 -190 41 190 218 -59 -230 65 13 41 -62 -97 -116 -232
7133 -232 187 -92 -102 -58 -37 12 77 -39 48 -244 -51 -126 95 9 -17 182 -46 -110 6 3 -130 77 37 57 64
7158 64 41 -128 21 -67 -117 152 -26 100 -189 -134 -55 -305 -83 26 113 -134 26 83 -243 -106 -27 28 85 56
7182 56 -125 -142 34 66 -128 83 54 93 88 -147 146 159 -226 -194 -1 -96 -3 50 39 -162 373 -5 -158 219
7206 219 -285 62 -43 -1 48 230 -107 -118 7 -266 -55 141 3 -126 154 -121 539 -94 -137 -41 -142 112
7228 112 89 83 335 19 402 264 109 -148 -361 352 -57 28 -199 497 0 -99 -917 -329 -92 -214 -236 -38
7250 -38 148 422 242 -167 -29 2 -319 -134 379 294 97 4 127 537 -281 266 4 361 690 375 -602
7271 -602 248 449 -84 68 -131 156 -141 -632 -225 -33 -143 66 -178 -58 -25 -33 76 -40 -146 -98 -37 91
7293 91 -125 52 -40 -15 21 -168 39 177 -75 -140 -68 19 40 107 -165 175 -123 184 37 57 -96 48 164
7316 164 142 -2 255 -365 -15 118 -57 -3 160 190 -224 97 -78 75 -62 -34 -8 -155 114 122 -28 -145
7338 -145 0 -78 131 45 122 -218 -83 100 -115 -30 -89 -66 118 75 129 114 21 154 42 -169 63 -185 354
7361 354 104 15 -169 -2 -172 109 1 128 -186 -184 96 -205 135 9 170 122 -28 39 133 85 119 -184 4
7384 4 194 38 -67 98 43 -307 91 233 -195 94 163 159 -136 1 43 -213 -192 -15 -179 -192 102 -57 -35
7407 -35 -108 -82 -23 -232 240 38 -82 -11 76 -95 62 -24 26 113 -156 106 -31 -50 -49 141 24 -21 -64 67 41
7432 41 21 -29 16 -125 -6 -67 -15 86 32 -117 -64 -9 -157 -149 87 -49 -281 68 -143 128 11 60 -219 -49
7456 -49 114 157 -219 16 -205 -19 40 145 -303 -94 248 69 225 68 54 -46 -46 -111 -103 -174 137 -337 48
7479 48 159 70 214 -89 38 39 -95 -204 -86 296 197 -131 189 21 -31 147 -50 -292 -87 -33 -84 3 -4 258
7503 258 103 38 4 -11 32 -43 -44 72 50 115 164 104 -49 28 137 319 111 -178 -87 148 -28 -44 19 -59 -21 -26
7529 -26 -192 -93 141 32 -146 -94 198 -70 14 146 70 -179 256 -84 -90 116 95 48 55 136 109 80 136 96 -174
7554 -174 118 208 -124 -37 240 -163 7 45 51 -61 -124 -88 -299 25 -3 -148 -264 10 47 156 116 43 -242 -75
7578 -75 8 -391 215 -93 -270 134 -98 -21 -13 -38 200 64 -74 -250 88 -5 141 63 135 -15 -89 42 -94
7601 -94 170 -283 215 -50 -9 123 37 258 -2 59 -273 86 55 -87 -80 -17 -66 120 -178 91 26 -96 -166 63
7625 63 -28 27 27 -15 -92 108 56 155 -26 -59 28 216 -101 1 171 79 -149 123 9 -119 64 21 -21 364 -156
7650 -156 -148 -154 21 -44 -39 84 31 160 -79 -66 35 129 144 154 144 -33 67 52 -107 72 -102 -69 118 47 71 35
7676 35 163 11 -137 -43 219 136 -81 -121 -67 14 181 25 68 58 -30 -100 103 -77 145 40 208 -69 -87 -9
7700 -9 50 -156 -75 -4 159 -296 28 249 -74 365 -107 -134 -52 129 -118 2 -103 52 -109 -68 -57 140 -228
7723 -228 119 -112 -114 58 -102 -116 -15 182 -63 -207 -67 -38 -125 144 -151 177 -102 -231 1 -62 164 -159
7745 -159 91 -149 -81 120 -149 -17 53 -2 119 -218 64 -180 8 -7 97 -69 128 -10 61 -181 108 28
7767 28 103 -62 -67 247 129 -28 100 -44 -47 -78 -45 71 42 -57 -85 94 -198 165 -153 28 114 -13 7 99 94
7792 94 27 62 -168 176 -3 81 116 241 38 39 84 -117 85 -194 -156 180 45 -125 -76 48 95 43 81 -29
7816 -29 -22 31 119 -76 -173 11 -57 64 -131 27 427 -102 -20 -41 -26 9 -23 138 2 30 -138 145 64 111 100
7841 100 -216 173 88 46 -107 -121 103 -201 -331 151 -81 -161 198 -42 32 32 -21 -105 76 -44 90 -107 -213
7864 -213 135 -70 51 375 12 137 116 38 2 -115 -6 109 99 -10 35 -25 -55 54 -221 58 398 4
7886 4 1 207 -77 -128 33 -207 -31 53 -106 -59 99 82 69 -216 -12 -191 3 -76 202 113 209 -161 -34 -89
7910 -89 69 -176 -160 -31 36 300 -83 -22 -10 -25 197 194 -4 -248 108 96 25 -155 85 -392 201 214 -148 -617
7934 -617 -73 747 -139 250 309 413 43 452 -347 -138 406 -234 -11 -31 398 240 152 642 -5 176 271
7955 271 -690 -261 -284 168 279 -314 -261 160 255 -497 161 -395 -125 -2 -146 238 -729 -119 -501 -156 -96
7976 -96 -146 145 342 -410 501 170 -729 207 126 288 282 200 233 129 -118 -24 61 87 -16 145 -99 -1 -146 -25
8000 -25 -275 18 -70 -70 -49 115 -116 48 66 -5 82 133 -76 -1 -45 43 -15 -16 -31 26 94 121 -160 -12 -36 46 -50
8027 -50 87 -87 -23 32 11 15 -56 30 46 -305 -91 -116 -90 -16 -164 -177 -157 -3 17 226 -248 -64 2 28 -244 144
8053 144 -156 -110 -138 -61 91 -341 -139 -245 246 235 -60 -169 307 -37 -387 -112 -229 -165 544 -227 -367 -1021
8075 -1021 -621 211 -402 -234 -93 275 307 -168 -112 322 20 -187 -349 112 -3 76 -275 222 221 -150 -149 -119
8097 -119 64 48 -102 252 6 163 171 -15 8 136 -67 19 -56 -182 -110 -275 -169 145 55 5 152 43 -78
8120 -78 -60 439 92 -200 -53 -340 -63 166 -447 86 -368 32 3 -250 -68 110 -496 -387 -218 21 -356
8141 -356 -280 -341 -522 -72 195 -54 -567 324 20 261 -935 -548 237 264 -105 -168 -582 71 -314 -461 289
8162 289 212 251 -209 -236 -135 -211 35 51 -11 -68 -68 -17 94 -31 -356 1 -68 -174 104 -78 -61 -22 9 47 -178
8187 -178 60 170 167 21
8191B1
$$ Imaginary data points
##PAGE= N=2
##DATA TABLE= (X++(I..I)), XYDATA
0 0 0 0 0 0 0 0 0 0 0 0 0 0 0 8 -8 8 -8 16 -16 17 -24 32 -32 40 -48 56 -64 73 -88 100 -113 129 -148 168 -190
35 -190 214 -241 270 -303 338 -376 419 -465 515 -571 630 -697 769 -846 932 -1027 1131 -1246
53 -1246 1373 -1517 1677 -1857 2064 -2301 2580 -2907 3305 -3800 4423 -5251 6401 -8124 11022
68 11022 -17221 62483 -76372 12782 106893 -103676 52352 41413 -56004 35595 29770 -36702
80 -36702 10407 35572 780 6360 32270 -30947 7624 10524 -37185 18570 -12917 -15064 18951
93 18951 -65255 4578 17782 -63589 21139 9141 -50033 10677 -7688 -48035 -1817 16558
105 16558 -48068 -17893 15338 -71777 -4731 20255 -72206 26942 4079 -70608 23543 -22578
117 -22578 -34518 22993 -31151 -8835 -3225 -33466 110 -11513 -10723 2830 -10372 -9467 -8542
130 -8542 -417 -10776 -988 10959 -15548 8133 -231 -21907 17094 -3803 -5081 18232 -9200
143 -9200 3059 2901 -4837 14387 1589 8266 10358 -5291 5544 4365 6167 7004 10472 9564 -8608
158 -8608 12889 6237 -6864 28420 -264 -4041 24943 -11357 4341 18523 -7404 14659 5867
171 5867 -4217 11986 -4126 5628 13193 -4729 9453 10753 -9762 5041 13144 -10114 7855
184 7855 19818 -17376 5307 18162 -23089 11771 21720 -21476 11740 13076 -22488 10779 14744
197 14744 -14222 8747 12012 -16872 2991 10828 -13113 7968 8983 -13721 7286 -78 -9061
210 -9061 11960 -5321 -1877 10324 -14645 2401 7128 -18205 9448 6636 -19789 10771 2368
223 2368 -23616 11683 3393 -21034 13781 774 -24337 10935 -649 -20396 13096 -487
235 -487 -19708 7479 -4299 -17099 9158 -1227 -14015 6300 -5743 -13440 6587 -5306 -7752
248 -7752 6603 -9418 -6106 4104 -10361 -254 4723 -10097 2808 1578 -11402 4936 707
261 707 -8665 8559 175 -8311 7863 -2470 -5746 10585 -346 -2296 8911 -3043 -1733 7884
275 7884 488 2541 7447 53 -554 5617 1812 1983 8601 1696 33 7291 -474 1658 9035 -124
291 -124 2451 7162 -1806 2118 6090 -673 2524 5061 -229 705 3479 -305 -266 3406 821 -1429
307 -1429 1941 -386 -3590 1596 1573 -3071 1600 -84 -6188 374 -149 -4638 2579 -1625 -5531 141
323 141 -3896 -2730 935 -4149 -1170 -1621 -5658 253 -1815 -4242 1675 -3077 -4780 1791 -2689 -4407
339 -4407 2882 -2139 -4422 3310 -1684 -5014 4207 -988 -5033 5891 -491 -4807 5715 -998 -4275
354 -4275 7569 -319 -3625 6899 -1963 -3006 7772 -894 -643 6345 -2842 74 5288 -1979 2846
369 2846 3769 -2308 2331 2189 -1455 3854 1299 -1415 2618 -118 -871 3675 -49 -1153 3045 -1118
385 -1118 -1954 3193 -1096 -2365 3313 -2195 -3040 3653 -2728 -3335 4302 -2931 -2614 4412 -4582 -2589
401 -2589 3561 -4611 -510 3544 -4393 -936 1609 -4108 759 2204 -2743 -237 313 -2580 76
416 76 1488 -1013 -132 536 -1831 -318 1463 -664 826 1356 -1233 695 1286 -982 1986 1082 -830
433 -830 2597 468 -780 2841 -289 -429 3482 -704 34 2694 -1955 594 2927 -1397 1222 1833
449 1833 -2088 342 1471 -1082 720 1644 -1334 -751 1259 -1079 -203 2251 -1882 -1360 1375 -2022
465 -2022 -860 2095 -2889 -449 815 -3295 225 817 -3070 524 398 -2390 720 -466 -2036 698
481 698 -369 -1117 820 -916 -908 184 -483 135 1303 -120 -29 135 -643 776 1565 616 620 822 -234
500 -234 305 2268 364 895 2260 -742 437 2723 -953 1539 2725 -1453 1618 1678 -1245 2055
516 2055 1220 -703 1488 344 -435 737 187 -647 513 650 -521 -381 -45 -1450 -340 319 -1225
533 -1225 38 -734 -2207 -1145 -463 -1551 -506 -1480 -2316 -1191 -1611 -1220 -258 -1310 -2140 -469 -2749
550 -2749 -1293 35 -1372 -219 -829 -2160 -373 -740 -942 -209 -912 -794 -57 -336 -1251 -157 1190
567 1190 177 410 409 -681 498 1929 -386 1995 1957 36 1362 572 328 2773 1842 644 1959
584 1959 785 865 2142 1162 1322 2866 1318 1031 1576 735 1379 1741 916 1450 412 749 562 556 754
603 754 566 244 658 -442 -60 -101 -141 389 -472 -594 -343 -1775 -604 17 -942 87 -880 -1923 -820
622 -820 -1303 -1182 -192 -996 -1505 -988 -1651 -1105 -342 -858 -987 -1440 -1277 -799 -1153 -588 -333 -1101 -425 -920
642 -920 -826 -105 -794 -204 282 -368 56 -357 -428 100 366 466 908 -8 101 200 108 1013 795 627 250 89
664 89 8 707 564 955 705 141 86 265 484 1046 265 467 437 -657 426 459 -356 819 153 -295 459
685 459 -776 -149 179 -425 199 54 -462 -275 -640 -466 -247 -370 71 -974 -584 -461 -751 267 -67
704 -67 -310 -394 -414 -779 125 -301 212 -125 -95 -743 262 -264 389 1303 -634 310 553 -334 580 515 2
725 2 1269 187 324 1307 -54 849 423 529 1804 -85 910 280 -42 2108 660 892 1007 -792
743 -792 1588 597 208 1293 328 -473 548 -253 137 862 202 -318 -23 -619 -800 155 -435 -524 79 -841
763 -841 -706 -366 -1057 -608 -816 -854 -693 -854 -846 -1234 -812 -651 -1120 -216 -1045 -1087 -342 -1419 -242 122 -1204
784 -1204 -261 -857 -1506 370 -327 -366 522 -659 -502 383 213 -95 834 33 -189 600 70 104 1189 156
804 156 195 941 465 576 1047 443 531 876 746 174 907 319 203 1045 593 168 1158 -351 448 799 11
825 11 857 702 -230 666 -215 -163 792 -128 19 80 -468 -497 140 -265 -436 -322 -348 -963 -92 -278 -841 -217
847 -217 -504 -898 -28 -893 -907 33 -630 -956 79 -776 -1084 65 -802 -403 646 -507 -466 501 -1038
866 -1038 114 615 -104 220 51 -195 318 421 474 502 563 98 306 835 728 752 1087 451 645 1043 411
887 411 1018 959 312 1083 624 -16 1082 534 -12 1260 228 49 984 -53 -143 988 -170 155 978
906 978 -397 -50 384 -483 -59 207 -406 -1159 -631 -659 -348 -7 -1258 -445 -494 -1079 -605 98 -1478 -662
926 -662 -44 -1547 197 -407 -957 -67 145 -1140 99 -528 -1383 457 -561 -403 391 -308 -287 -30 -937
945 -937 -98 1105 -579 -341 437 339 -255 382 -68 573 703 -597 -597 830 221 688 786 -862 83 945
965 945 -126 494 700 -300 633 714 -378 556 453 -305 475 327 -389 540 -10 -371 87 -89 -60 159
985 159 -256 -382 -46 -292 -420 338 -132 -436 -126 -492 -424 30 -534 -172 -23 -598 -540 152 -766 -623 276
1006 276 -953 177 108 -563 -142 133 -359 457 448 -418 -99 212 -190 166 244 4 199 475 111 534 881
1027 881 203 416 863 -150 716 723 209 845 428 110 1097 556 -74 205 648 -331 769 21 129 635
1047 635 -29 -235 407 -11 10 -151 -362 106 244 -13 -51 164 -670 -891 -36 -634 -758 98 -938 -752
1067 -752 -459 -767 -776 -306 -1082 -594 -385 -1093 -90 -258 -1099 -63 -387 -1032 73 -346 -681 -20 -538 -601
1087 -601 478 -189 -486 389 -175 -181 399 -315 190 203 -185 166 771 88 497 462 192 336 755 315 289
1108 289 552 189 478 879 461 582 941 -109 1037 700 76 1034 349 91 901 460 129 556 -9
1127 -9 -33 276 176 -154 345 252 -345 -45 -161 -242 200 103 -371 -216 -296 -445 230 -407 -712 -309 -63 -527
1149 -527 102 -390 -530 -88 -343 256 45 -824 149 -119 -516 -242 193 -516 -12 -396 -688 391 139 -61
1169 -61 -477 227 433 106 283 30 185 13 -147 414 350 48 479 93 41 618 426 266 405 72 250
1190 250 390 86 -114 565 23 62 413 -143 18 115 -249 66 56 23 -219 -120 -241 33 -53 -420 135 -350
1212 -350 -398 -153 -224 -324 -311 -395 -686 -376 -305 -470 215 -520 -573 -73 207 -237 -236 -257 -203 58 -396 -157 -40
1235 -40 -483 -97 -298 -62 244 599 207 -74 210 71 -34 455 360 -313 495 307 220 657 393 366 675
1256 675 210 429 704 146 330 356 100 700 681 156 274 616 109 438 507 154 272 327 163 133 28 -91
1278 -91 -31 11 -211 44 -379 -157 -178 -297 -334 37 -1 -322 -273 -393 -301 -125 -537 -80 -32 -481 -467 -204 -406
1301 -406 -289 -382 -644 -373 -317 -321 12 -92 -429 52 -611 15 142 -91 92 -195 141 48 203 183 -172 -92
1323 -92 128 304 96 249 69 118 229 51 580 113 281 326 238 289 526 84 125 421 -31 276 319 -50
1345 -50 223 8 53 125 -56 146 -43 -63 -129 5 28 14 -60 -146 -180 110 -29 -174 -150 -92 -214 -202 -201 -251 -378
1370 -378 -507 -498 -74 -364 -514 -248 -290 -278 -153 -84 -107 10 -153 -245 207 -78 -292 -120 191 295 -108 -260
1392 -260 -27 332 529 -119 194 154 -193 594 823 176 281 -69 134 224 93 394 288 420 551 65 263
1413 263 291 378 36 553 330 185 -149 2 -28 -25 422 169 29 -99 187 86 220 -177 70 -80 -110 151
1435 151 -293 -304 38 -9 -390 -2 -137 -354 -144 221 -100 -266 -310 -80 -333 -521 -44 -214 -187 -76 -470
1456 -470 496 -348 -270 -562 -264 -504 -563 -365 51 -35 -102 43 -169 -139 181 296 228 -12 17 -283 559 114
1478 114 319 -40 302 353 303 420 144 346 374 -9 168 528 -346 43 -310 -161 -96 535 481 776 371 72
1500 72 8 507 942 612 -114 249 121 -297 108 -261 172 -355 11 -277 -54 41 -51 -312 -379 -215 -167 -292
1522 -292 -296 -210 -211 -125 -362 -116 -349 -76 -211 -225 -29 -431 -242 18 154 98 55 -106 137 -21 -1 14 96 313
1546 313 101 140 -155 121 324 -91 297 36 286 75 217 235 123 12 24 395 305 208 347 227 76 307
1568 307 130 95 77 86 102 284 284 -58 -15 -150 -38 -281 -8 -87 155 -350 -145 38 -265 -220 -289 -172 -201 -121
1592 -121 -288 -288 -341 56 -76 -423 -240 -65 -204 -292 -332 -114 -291 24 115 -194 -173 123 -183 82 -120 -182 -2
1615 -2 -122 -45 101 104 6 122 212 118 245 16 198 138 298 268 143 64 128 433 212 211 408 249 197 201 248 69
1641 69 298 8 452 190 180 -25 20 138 159 -70 26 145 -188 40 -16 46 -171 -240 -173 16 -50 -332 -129
1664 -129 -79 -27 -158 -163 -408 -319 -332 -63 44 35 -179 -346 -214 -128 22 -172 59 -131 179 -276 -195 -85 -60 184
1688 184 135 -240 89 104 -47 190 153 218 102 -27 250 154 4 334 352 -46 238 88 246 249 -9 362 226
1711 226 251 330 85 254 193 146 163 127 -16 35 295 183 77 145 12 -132 -125 130 -18 41 -20 72 19 -23 -232
1736 -232 -221 -243 -88 -121 -31 -264 -433 -304 -256 -234 -200 -96 -68 -311 -174 -141 -244 94 -10 -7 50 -173 -153 -154 -120
1761 -120 -227 11 -126 -65 -86 131 139 -37 71 256 291 273 -19 -182 -13 363 334 88 101 189 387 -22 418
1784 418 -196 -182 -238 -566 382 -44 -37 680 -41 95 -45 -13 350 59 -278 366 163 -160 249 -34 -155 287
1806 287 -179 -84 -520 -843 -84 -493 -474 -160 -364 392 -168 155 -319 -130 -127 -722 -459 -207 -144 -61 44 115
1828 115 -67 -347 189 -114 -32 -158 -424 -77 43 -22 142 -27 155 4 -186 189 328 52 -102 87 328
1849 328 237 -149 -104 7 119 132 314 94 250 241 151 255 375 291 190 32 -23 154 76 181 234 59 46 73
1873 73 4 -210 -66 37 24 33 -101 103 -56 -138 -251 35 30 -279 -69 -206 -179 -58 -276 40 -128 -122 3 -168
1897 -168 -136 -117 -73 -167 69 -16 -184 -269 -217 -129 -106 168 -42 -25 88 -88 22 -122 88 171 157 123 2 278
1921 278 -143 29 177 89 188 99 237 170 -100 201 161 141 371 149 435 128 -78 303 -24 202 53 280
1943 280 132 91 -186 19 -179 6 78 -319 -75 -46 -82 97 -128 36 99 -143 -13 -137 -117 204 -381 -156
1965 -156 20 -211 -254 -149 -232 3 -98 -145 30 -357 -129 104 163 -167 -1 -237 -144 8 228 -80 -65 84
1987 84 -58 -158 97 74 159 -310 78 206 147 257 344 62 74 85 42 -159 78 111 150 281 290 92 144 178 192
2012 192 143 159 176 -11 -33 67 -47 -113 168 227 26 124 -138 -97 43 -108 116 -22 45 -89 -77 -54 -10 -332
2036 -332 350 44 146 98 -140 134 -397 -79 -394 167 -892 -443 -426 319 17 -165 -202 -65 5 -25 204
2057 204 129 -230 -68 101 470 161 49 69 -98 677 172 211 149 -32 283 42 118 439 160 121 110 -157
2079 -157 562 163 182 450 -141 139 495 -119 -314 42 -101 -47 -5 -115 104 175 32 42 180 101 -212 -43
2101 -43 -370 -438 -316 -414 3 -177 -452 -202 -78 -105 60 324 222 -432 -371 -542 -167 -410 -350 -424 -83 -122 -324
2124 -324 -247 -368 -169 14 -389 -227 -154 27 85 359 -214 62 8 -197 -156 207 15 -12 15 -220 139 56 103
2147 103 333 328 -49 -197 697 199 -216 400 274 171 -19 240 71 147 -398 83 58 296 302 91 -432 26
2169 26 431 -318 300 -75 -214 -203 -246 -209 49 -173 193 361 -490 -70 62 -316 50 -118 321 -378 362
2190 362 -34 -112 -617 -271 -887 -244 -178 -152 -709 -403 424 -403 -892 -935 -104 236 -329 -82 -104 -157 303 50
2212 50 141 261 12 204 -352 232 -126 559 545 -263 -407 -113 -185 240 -185 48 227 629 223 58 159
2233 159 540 14 -180 -12 14 153 137 -133 -20 -4 -79 148 223 67 -25 270 -6 12 -35 -102 -275 -31 41
2256 41 -157 -97 1 -48 -294 -4 -115 -102 33 176 -3 59 -194 -239 -200 -83 -240 -83 -57 9 43 60 -31 323
2280 323 60 72 51 -416 -121 -232 255 700 -676 246 121 215 -91 -144 272 -146 -78 -50 329 -114 309 -103
2302 -103 438 643 209 245 193 -375 529 307 286 -73 -159 -419 75 -461 -7 -562 -3 428 -174 20 -399
2323 -399 -330 53 425 22 -470 -507 -27 -608 77 -596 -849 -229 -255 -700 514 40 48 -20 -45 -231 -37 -282
2345 -282 196 379 -98 -16 -131 -225 356 59 194 969 -632 105 -357 -54 -338 53 -50 146 -895 -88
2365 -88 134 130 -452 -363 -416 39 946 269 -232 -869 -44 -711 20 59 693 -44 -741 39 -151 580 156 -197
2387 -197 32 -450 -212 -122 99 -81 -201 204 -259 322 74 -433 -151 -528 -238 55 775 -23 -100 -355 -186
2408 -186 737 -523 -959 -551 -539 -216 -748 -820 -710 -713 -495 -152 346 -279 -413 -603 -8 -120 -57 -7 250 437
2430 437 537 32 -365 -495 13 -433 329 353 66 -139 -114 -17 -391 -183 -131 204 759 -184 1092 290 46
2451 46 649 -120 44 -59 342 -527 136 598 865 -130 582 122 188 99 -24 -43 24 258 -283 -3 49 57 98
2474 98 10 -230 5 -149 41 -50 -39 -102 -25 -222 -80 -279 -196 -153 -308 -40 -293 -139 -114 -231 -315 -17 -30 -201
2498 -201 -105 -216 3 -149 -144 -33 123 -107 -62 157 86 -132 34 -240 4 178 -77 66 -76 70 28 68
2520 68 272 16 -12 152 -46 169 117 233 306 12 255 147 140 216 195 121 -91 -79 5 74 -268 14 -138 -13
2544 -13 -258 137 232 -320 -428 -70 -306 298 87 -285 -226 -44 -139 -479 898 116 -53 289 -219 452 150
2565 150 -257 5 -350 -440 -415 155 361 -246 309 -90 413 11 -94 -76 85 -71 491 -220 -328 -38 -252
2586 -252 -125 -48 -103 35 126 1 -68 -43 399 51 174 563 14 363 -446 -437 147 -303 227 94 345 -42
2608 -42 393 -56 -45 36 -145 200 261 24 166 143 19 -59 200 -250 12 41 84 37 -62 65 39 95 -89 -125
2632 -125 -186 -259 -243 22 -199 107 -115 -5 -263 -277 -103 -251 -617 18 -511 -345 -376 -62 308 174 758 -220
2654 -220 723 37 376 -177 165 69 36 186 -176 -101 41 35 -28 -167 160 -288 349 -162 87 1031 126 -457
2676 -457 187 330 489 -877 211 284 -109 348 34 126 90 -112 34 1059 -88 -24 58 -163 -100 178 -343
2697 -343 -61 6 -265 -185 -33 375 5 425 -549 -181 371 665 469 -541 -411 183 -65 160 -296 -513
2717 -513 36 -14 -65 -222 22 -415 122 41 191 -229 179 -400 -567 690 -5 469 -740 -135 24 -269
2737 -269 207 -148 137 -640 -383 356 -803 -51 -50 170 734 880 512 -91 356 322 540 -46 -146 -366 8
2758 8 4 -111 213 -624 441 -175 -161 -205 -495 -157 159 179 -89 496 53 -616 -23 -355 -43 -196 -315 -687
2780 -687 209 -101 -41 -652 280 -146 -399 15 -395 12 -188 -81 -10 -206 -33 -481 -279 -135 -18 18 577
2801 577 293 -28 -22 200 -25 234 19 837 27 40 -191 565 295 421 -639 -255 149 -19 50 -499 54
2822 54 -711 11 534 69 0 -22 -96 -37 -447 -137 532 329 640 578 -2 -213 74 -179 262 -519 -261 -25
2844 -25 585 434 -660 -82 177 -102 524 391 -259 111 170 356 -163 -805 217 -502 -147 -250 460 262
2864 262 774 -248 284 -105 164 -357 -390 -429 154 619 -361 -816 -142 230 -282 16 -74 -53 -570 -66 -370
2885 -370 558 181 853 -565 545 160 31 -323 -191 768 4 978 388 -41 78 -335 -98 148 -391
2904 -391 104 -298 -906 -388 -239 323 541 253 709 -517 -135 237 -203 -556 -66 -406 -300 -13 28 -140
2924 -140 331 -116 -307 -78 464 -211 115 63 419 171 275 -74 -230 -327 -288 -23 -77 -237 189 -538 -224
2945 -224 -264 -359 19 8 40 244 113 33 -178 340 -397 595 185 101 -350 -333 203 -119 -210 -33 182 -608 -224
2968 -224 -167 547 487 640 -81 -121 780 8 -697 156 532 -830 479 -700 242 -199 -1689 -2 118
2987 118 -337 129 498 732 -801 33 -256 -1022 632 -257 -649 -689 1 -117 -652 577 -242 -93 589
3006 589 115 -343 -841 -378 -952 374 -317 660 93 -11 177 -594 -526 -277 -17 -213 -497 508 -644
3025 -644 -1139 -262 347 -457 -35 -219 -295 -834 -399 731 22 -439 -221 -116 -109 716 89 175 -126 -107 252
3046 252 57 -21 333 -169 -311 27 -191 -291 356 115 -156 -145 497 427 -546 38 82 -262 -343 56 -260 155
3068 155 221 266 281 60 627 -121 176 366 -82 -680 -86 -423 -349 350 -299 123 604 554 -444 -147 -548 250
3090 250 -26 -167 218 -521 300 -377 61 -307 73 -510 26 491 -585 112 70 126 387 306 -199 -322 -12
3111 -12 -183 178 239 250 -169 78 -528 -45 -58 300 -168 241 -341 38 -76 43 225 36 -220 -414 -128
3132 -128 49 311 205 372 29 -253 -488 -34 -23 68 99 -171 -164 68 -344 -543 -291 -302 -555 142 -333 -30
3154 -30 -186 -298 453 -229 0 -39 202 -165 -555 -349 44 231 131 -364 -739 -502 66 -174 -597 216 171
3175 171 -425 -712 -1026 404 -434 -211 -812 -30 -461 169 -147 -484 296 -37 287 96 -74 -78 516 -29
3195 -29 -159 213 189 -958 196 192 -558 -275 -118 -740 38 212 654 -249 -75 405 -650 -760 -934 -583
3215 -583 46 257 -1256 -369 -524 -773 -169 -24 79 174 103 190 -257 49 -229 -293 -498 111 32 -643 642
3236 642 692 -231 -61 -89 -113 -216 -395 -94 -429 -361 -278 -390 -389 439 254 20 -22 361 -190 39 133 188 -130
3259 -130 -341 414 -95 16 500 -187 -24 74 207 114 224 -735 -134 -98 -506 284 -181 43 153 -152 309
3280 309 -124 23 279 151 -151 -476 -210 197 34 -137 280 -280 -30 -43 43 -9 -66 34 207 -39 -77 131
3302 131 161 9 107 -112 -20 -138 9 -233 8 87 -22 82 52 22 -74 -155 -232 -2 -237 49 -75 -4 -4 247
3326 247 163 -55 -101 -60 -72 68 196 -156 -15 -129 -56 113 82 211 2 34 -127 187 114 231 284 70 -52
3349 -52 186 -169 40 246 118 -2 93 -7 -36 97 80 47 155 -90 134 -193 45 50 87 -28 138 -25 -52
3372 -52 -202 -9 -53 -22 102 -84 -15 -103 -184 -78 56 36 211 -28 -16 -8 67 56 61 -98 -1 172 -123 -63 150
3397 150 134 -39 -103 76 -237 113 -53 194 -160 129 185 118 -78 -104 -60 120 257 74 184 94 -149 307
3419 307 -13 5 -119 37 270 206 16 -59 171 1 125 -161 -13 -131 97 -5 64 73 8 23 227 -168 -59
3442 -59 -75 186 -15 26 -249 -95 133 158 184 11 -130 191 36 -200 -81 -24 77 -221 -84 -309 -217 -375
3464 -375 -205 -31 110 -11 -35 72 -110 86 -83 -55 -130 -126 -25 89 248 39 121 -156 145 118 -68 218
3486 218 299 67 89 2 107 96 47 -189 -75 12 -122 148 165 177 144 -46 -249 255 -405 78 -61 0 -72 -134
3510 -134 -53 131 121 -8 201 -211 -97 -67 62 -39 -148 147 0 -163 45 -133 184 -74 -8 26 -186 93
3532 93 -141 -146 -6 -111 -143 -72 -136 -175 34 -43 32 117 29 120 -187 -119 22 31 -35 181 142 64 94 -78 84 54 -270
3559 -270 -168 181 177 246 -165 -89 -72 -109 -9 -40 -15 154 -75 -74 -36 -109 14 90 20 90 -11 -97 186 -11 28 -53
3585 -53 43 54 -71 -56 53 -109 -125 -20 94 31 -40 -200 132 9 -71 -145 143 55 -117 106 -104 145 0
3608 0 15 -274 164 129 -522 105 -20 -433 98 -78 -101 26 -238 -293 -115 4 40 -182 9 -109 -276 75
3630 75 23 549 -13 -77 176 -33 30 -235 -3 598 21 65 102 -157 19 -65 -298 -163 -166 505 -524 -50 -109
3653 -109 -13 -50 -37 -57 221 279 47 -73 -41 94 22 26 -143 40 54 -181 105 105 31 23 17 -211 -4 -125 88 95
3679 95 -171 116 -50 10 -65 -218 89 -1 -73 -143 188 -191 -8 -181 35 -83 -41 53 -240 -243 -209 -168 63 -106
3703 -106 -134 24 7 69 69 231 -86 2 267 -294 6 32 49 163 -13 -24 70 -18 99 -171 109 -82 214 50
3727 50 -35 -156 -200 -111 57 221 144 140 134 56 44 83 121 119 65 -292 9 34 -23 32 70 18 83 1 -45 59 -183 -94
3755 -94 129 -41 4 -164 -249 -157 -119 -86 -29 -301 -221 64 28 67 -175 -183 -50 77 30 183 93 -157 26 139 102
3780 102 -54 -166 -13 148 151 232 6 69 146 -219 11 -34 86 -20 -246 -26 170 5 -91 -27 -161 -16 44
3803 44 193 -35 112 237 -124 -97 -23 156 147 97 125 -164 79 101 -112 60 -217 152 -154 -161 15 139 -78
3826 -78 -77 -299 30 -9 101 -196 -101 -234 259 -8 -88 148 -120 35 31 -53 -148 -99 -219 -111 0 -11 -71 128
3850 128 4 -82 -102 159 -440 -42 -61 102 130 86 -111 -227 -16 193 -101 18 -41 -20 228 32 240 -76
3872 -76 323 -109 147 203 -77 -67 -36 -66 49 -185 -91 303 -53 -170 -53 161 -222 258 -242 312 181 -159
3894 -159 403 20 68 -324 -392 -1 -122 91 -318 245 95 70 -137 105 -127 -282 -71 223 328 -233 175
3915 175 -259 -86 46 -20 118 62 73 272 282 -153 -106 -31 1 -152 85 166 3 -127 127 -128 -126 -83 -163 163
3939 163 -25 176 288 -1 -18 -92 48 138 152 107 -45 -37 52 -8 8 -87 199 -116 -124 12 -226 -89 -78 -96 3
3964 3 -35 -31 -6 141 -66 155 -119 -100 -59 -19 41 82 24 -244 -147 -18 -93 14 52 33 -82 140 -70 54 -244
3989 -244 97 -59 -248 -12 -112 -115 12 -81 -91 -167 79 -27 -278 -52 5 55 -73 -59 8 184 100 188 -9 -2
4013 -2 170 24 -26 49 -224 -158 -16 -95 189 -182 -108 83 67 -20 -257 -89 165 -264 118 -87 107 100 -34 75
4037 75 132 -23 -94 75 -125 377 -33 134 -227 -72 110 243 42 -45 131 28 84 -75 -29 -77 75 -43
4059 -43 -52 -8 102 164 -223 228 288 -265 -271 416 165 -82 -238 420 329 190 644 -69 318 -182 -528 -265 -78
4082 -78 -254 -195 483 604 408 -115 132 89 96 -49 9 -325 23 -140 156 251 97 -323 -141 -120 -48 6 -250
4105 -250 51 31 -49 43 62 156 43 71 166 20 -185 7 -119 -10 -152 34 129 117 -98 165 -159 16 -112
4128 -112 -140 -220 229 -84 -220 -167 -108 11 -146 2 -98 64 132 179 74 61 -65 154 7 -113 44 -60
4150 -60 98 66 -194 -95 -14 -90 16 164 155 46 -173 83 57 -44 263 53 -79 -87 -174 -81 -86 -23 67 157 -101 -250
4176 -250 81 -74 163 -217 4 78 -1 397 -43 -20 -8 -308 2 83 -214 280 164 -142 33 23 327 -103
4198 -103 -17 141 100 120 -30 -359 -82 -152 94 -94 114 127 -149 -39 -248 162 -90 23 -134 -77 -158 -134 148
4221 148 -63 -39 -176 -37 55 29 33 102 31 63 261 -30 72 37 -139 -29 0 75 -10 -27 -31 94 175 25 -160
4246 -160 93 38 -146 141 43 -140 -107 -197 -86 17 40 -222 230 93 -81 -181 -81 164 -167 82 95 31
4268 31 53 123 70 -136 131 -32 -64 -14 -133 182 92 151 111 -71 21 -133 123 180 107 -23 142 -1 124 -294
4292 -294 -234 98 74 -83 -152 -226 -12 -1 253 -152 -92 -110 -25 -15 73 45 -210 31 97 172 -73 68 -62 268
4316 268 -157 -36 -73 33 210 -38 -22 -35 -281 -13 41 69 120 167 115 -22 138 218 -33 22 4 181 -128 -53
4340 -53 -242 203 -80 -166 45 304 -213 -227 -11 55 18 -64 -132 -109 -84 83 -154 11 106 -103 95 -123 191
4363 191 108 37 22 -189 -56 -255 -183 83 130 114 409 116 -19 -108 -49 65 170 -87 194 33 160 -5 121
4386 121 115 17 66 -86 204 -59 -59 64 -180 219 -26 128 71 -24 -111 -164 -160 10 86 187 -46 113 -36 -54 -194
4411 -194 -36 -75 155 -69 19 174 -9 199 -138 64 -45 8 50 7 200 -73 -166 81 -15 -172 -153 -143 211
4434 211 115 -58 -166 25 48 146 -161 57 84 -17 24 -52 -110 -111 31 31 143 -74 -163 26 -81 -47 -290 -56
4458 -56 101 186 56 84 -189 23 87 -92 77 -20 41 -62 -222 139 71 24 -43 -123 40 -42 -173 -17 254 -78
4482 -78 -110 87 58 57 -121 132 -182 26 -71 121 -22 -50 -145 84 27 49 36 17 -63 34 -140 -210 39 486 84
4507 84 -54 -131 -115 559 -120 99 -294 215 767 247 -244 -17 328 -84 2 -254 -87 -130 75 284 28 87
4529 87 -95 6 -49 -96 21 -110 -1 -178 -181 192 215 -37 81 118 -151 102 -47 -91 156 216 -84 17 271
4552 271 -131 -33 41 89 -154 134 -68 -102 94 -178 142 -127 124 49 -41 52 -181 32 -91 4 56 56 43 -105
4576 -105 156 -9 3 -65 -124 18 -162 -35 -213 22 -10 -99 -116 -56 85 -43 50 393 85 -19 -87 -104 -142 44
4600 44 -276 33 -184 -50 103 -13 116 70 153 -220 44 -139 119 -108 -78 297 -87 -93 -102 42 134 -79 192
4623 192 -78 706 -376 -595 -450 498 73 245 -101 -297 174 -136 39 -214 120 -55 -36 27 108 -341 -26
4644 -26 70 20 27 332 45 -166 128 -31 24 81 -126 -55 80 80 -88 29 60 74 51 -33 224 -10 -77 39 -322
4669 -322 166 86 206 17 -65 29 -64 -74 -14 12 166 -63 26 118 116 -60 78 -44 -32 -56 128 46 87 88 21 28 314
4696 314 117 -190 -38 -5 -86 -44 -44 131 239 176 -19 91 3 -45 -41 62 12 -47 -49 -129 96 -72 52 -114 139
4721 139 96 60 -128 148 -63 34 -47 21 -209 -155 77 143 112 -62 -126 42 67 51 13 241 97 -3 283 -131
4745 -131 -11 -98 73 -65 -63 133 -74 -231 69 126 30 27 -176 -159 93 5 -34 -84 9 323 -134 -212 72 -69
4769 -69 -93 -48 -33 148 -174 136 -31 116 -147 67 -40 -10 12 84 266 203 -181 313 -87 -7 96 19 -151
4792 -151 157 -259 85 -369 -99 10 -120 -8 -71 62 -40 282 44 -182 -148 192 -212 -208 -59 153 -52
4813 -52 -158 82 101 -160 -20 -271 -91 -35 194 -21 -204 -169 150 -41 -77 -46 15 173 134 -88 262 46 88
4836 88 -57 -129 -143 -290 160 -65 -93 -106 63 -54 125 19 117 -148 -142 72 67 -1 -251 18 -24 -19 -80 218 146
4861 146 -75 -31 102 79 -215 -9 -197 -43 53 -139 -17 61 -23 23 -75 -57 -196 -192 -101 54 -7 -94 -154 125 -36
4886 -36 4 54 47 103 -185 147 -35 -92 -119 95 -98 194 -432 -193 283 -50 -216 -146 135 -48 -34 -95 215 -133
4910 -133 -156 37 -30 62 169 -90 131 -57 117 -252 -174 -131 -33 155 222 -137 -86 303 6 -176 236 46 -22
4933 -22 -216 -61 30 45 169 -167 -11 -267 158 -154 20 -200 8 117 16 107 -146 118 41 -68 -16 18
4955 18 440 -171 -41 15 -43 264 71 14 -142 126 95 -250 98 -75 81 73 52 -38 147 176 -52 37 -128 10
4979 10 77 36 89 8 -123 -87 119 178 68 44 -2 212 69 -87 210 -314 -74 -21 -101 127 -650 409 194
5002 194 169 -167 395 -403 -275 125 -82 -264 -327 209 351 -644 -979 145 136 97 -635 196 -5 -323 -14
5023 -14 -505 54 70 -352 84 30 88 -221 -73 192 -281 -409 -229 233 71 320 172 169 231 197 236 97 -340
5046 -340 26 -109 -20 141 -61 161 46 -97 179 -34 12 118 -62 22 -11 135 103 -25 -86 64 -20 -33 -67
5069 -67 86 86 -70 43 173 140 124 -136 62 -214 22 -155 -117 104 -3 67 -35 -97 127 -200 -178 -215 87
5092 87 -178 182 -5 29 263 39 108 -125 -140 222 -9 27 -220 -165 -71 622 -72 -52 300 282 123 264 -536
5115 -536 137 75 64 398 -101 -377 921 -188 -79 72 507 629 -768 565 -108 734 202 -305 -275 -152
5135 -152 -102 101 172 8 26 62 -52 -136 290 263 -216 10 -66 -51 -63 16 -163 -90 -207 -99 157 -87 120 127
5159 127 28 40 -99 -11 0 -157 -24 127 88 29 -198 -25 -104 -45 -419 -15 -168 91 126 24 -4 -53 14 -88
5183 -88 -79 148 194 100 58 9 144 232 18 -38 16 -61 -187 -415 -650 -102 227 -108 248 139 -33 986 -700
5206 -700 214 118 282 508 -126 296 323 4 -44 251 -609 -103 3 291 -200 231 -22 -73 477 -487 70
5227 70 -167 -324 153 210 247 -154 -362 -195 328 353 -307 95 96 77 141 9 -157 195 -317 375 -229 55 -64
5250 -64 168 -30 -249 -262 -171 -140 -333 -32 331 164 -239 384 -59 -304 -223 140 83 -47 119 -518 -72 235
5272 235 349 371 -37 -113 1004 -153 -323 -187 -683 1048 154 228 0 25 189 185 -121 -94 -140 -8 210 25
5294 25 466 328 -85 223 163 217 172 -198 329 552 67 -34 -35 269 -27 -27 46 149 74 -114 69 47 154 -86
5318 -86 -155 -234 -245 37 -157 -143 -55 73 15 -130 -8 -208 -60 34 77 -59 -23 -9 -5 -90 -169 61 41 -191 -46
5343 -46 -192 18 42 133 36 55 217 -29 134 51 -290 -337 21 11 -73 -39 -45 171 354 -57 19 18 -44 75 74 -53
5369 -53 18 -115 61 23 -43 -28 197 -135 -32 -102 -47 -14 219 -42 -260 85 -44 -206 28 -195 109 -30 325
5392 325 -20 -108 -91 67 69 -94 96 -256 -62 98 -80 -67 87 90 11 -169 84 44 46 173 -79 -207 -108 38
5416 38 0 106 31 -13 -336 144 -64 -92 53 -9 -252 40 -185 -21 -7 -59 107 -195 -154 -125 -15 -19 -5 29 115
5441 115 41 -94 41 212 60 -11 -92 -16 -21 118 115 16 9 87 83 34 16 106 -78 -85 -205 -98 -97 15 -75 -31 -131 -64
5469 -64 137 -7 -68 -116 -63 49 173 -232 -163 21 -18 96 -48 -107 -274 97 -135 53 393 31 -282 -458
5491 -458 383 777 152 462 -200 135 -656 329 579 556 614 557 567 -354 95 10 38 332 283 -3 16 75 -214
5514 -214 232 86 284 250 -101 -241 -34 -173 -106 -6 -240 41 20 130 -47 -412 121 72 103 30 -19 -68 -164
5537 -164 25 -208 156 226 12 -17 129 37 -242 -156 -124 -33 155 4 -36 258 144 -93 -33 135 14 225 -423
5560 -423 381 47 -294 268 31 184 -60 -515 -57 36 230 -275 -261 -270 385 -53 -46 24 337 56 38 -454 -230
5583 -230 -255 -76 169 -201 -132 -65 95 168 121 109 -208 24 -183 -109 -78 -106 -29 -98 112 194 173 162 45 -248 66
5608 66 -137 240 -16 43 -4 35 -41 10 -28 -1 -55 -192 31 160 -88 -97 164 182 -30 -302 3 77 -97 44
5632 44 -103 209 -152 23 -166 -104 -195 -106 114 57 46 189 107 274 10 -44 -229 -92 136 -85 -132 268 374
5655 374 112 -207 -147 -176 40 96 44 31 37 144 -92 -197 275 74 18 -102 171 65 115 86 181 69 -99 207
5679 207 -138 -11 -2 167 112 -124 -164 -173 112 170 101 -3 -107 95 63 -76 169 197 170 -36 -26 -27 116 86 -154
5704 -154 -41 44 -106 45 72 340 -40 -152 12 -88 113 -66 -88 15 -347 288 71 -80 78 -250 64
5725 64 72 -144 -4 -34 135 206 215 -143 72 69 -153 109 105 -4 -23 -314 -32 -200 12 70 -116 66 3 29 -44
5750 -44 -194 34 -91 31 102 -16 -142 -113 43 232 18 -169 -103 -7 -207 -225 -131 -30 177 -248 -62 -6 -52
5773 -52 51 -243 -16 21 18 -109 48 132 106 -31 243 155 -187 20 135 240 24 68 304 -250 145 11 -119
5796 -119 93 -100 60 -174 -113 -110 10 314 -34 -13 49 -107 -262 -45 -11 57 81 -13 32 175 230 -57 55 281
5820 281 -146 -40 94 45 174 196 235 271 239 -394 -268 263 -35 166 71 149 -91 15 102 286 137 -99 200
5843 200 106 259 -54 224 151 -129 -213 -248 53 -153 227 -369 110 37 236 -19 98 -160 239 -72 -84 -540
5865 -540 -153 -343 -520 -13 44 -116 161 -50 -198 90 -151 62 -205 -50 71 280 8 -164 60 249
5885 249 312 187 -19 -12 -263 -65 -175 -27 180 146 4 69 -157 66 -151 -80 215 81 -90 23 -107 -56
5907 -56 99 -18 -74 -154 28 20 -55 104 84 -103 34 -92 73 9 51 -13 -41 82 157 -285 156 6 -64 -32 212
5932 212 79 121 -154 -29 -214 109 334 -81 -93 -113 39 103 -39 51 -207 113 38 102 -41 -80 44 37 315
5955 315 -201 13 213 105 -41 124 82 247 -59 91 140 -230 237 -161 195 -148 -236 -208 -160 98 -42 -263
5977 -263 102 -337 -9 257 -18 -196 115 -279 -295 -80 -137 -26 137 66 -602 -540 -522 457 9 -657 -609 158
5999 158 -410 -542 -776 334 92 -686 63 -287 -71 -24 123 29 143 153 73 14 -135 -27 -64 -51 260 -19
6021 -19 140 3 7 -37 -178 -135 -118 82 86 -295 8 175 182 111 29 -88 -91 -123 58 -64 -108 340 127 17 15 -151
6047 -151 -90 -39 143 69 -5 -40 -159 -112 101 -68 33 -20 -35 183 112 6 89 55 258 21 18 -80 186 -91 283
6072 283 147 14 113 -58 1 12 1 62 -152 -108 201 -106 -94 113 -78 -14 -220 10 19 82 -278 222 -24 150
6096 150 -36 136 -162 113 -18 36 23 141 -114 81 40 149 42 136 -395 -88 -123 -286 -591 -140 -313 48
6118 48 707 511 -227 -68 288 68 -73 134 -376 361 92 -147 796 -201 -235 254 52 195 -27 -118 -72
6139 -72 -28 72 -212 129 -170 -93 107 197 -101 10 184 -41 -171 50 69 66 -153 -86 -3 52 -24 109 -51 52
6163 52 96 28 152 23 26 125 -111 51 -23 -92 -7 33 22 -106 -171 -103 -23 -128 -49 55 -141 77 -194 101 49
6188 49 99 -143 -21 -156 -194 107 -2 234 -133 174 -162 -47 -31 -236 -3 -67 -320 32 145 242 -160 -85
6210 -85 -98 -121 -36 102 -137 -55 -156 41 144 -30 -72 129 74 -136 -40 -21 35 -346 41 -190 -58 150 59 130
6234 130 -41 -11 27 -125 -64 -116 238 -167 -147 188 43 -60 -37 61 -57 -73 148 -157 82 142 -89 203 -220
6257 -220 -30 -134 -44 200 -77 -35 -12 48 39 -100 -85 -116 -45 -11 -31 -103 -1 186 174 -73 -148 154 -12 -212 30
6282 30 -95 -145 127 -12 45 154 -310 -19 130 26 -21 122 91 -67 -49 -215 -242 -133 -108 -115 183 -20 278
6305 278 -26 -164 -1 4 -78 83 -91 -127 -189 230 57 98 51 135 -46 54 56 -73 -10 -45 216 179 -105 8
6329 8 146 86 -149 34 107 117 40 -2 150 -98 -90 19 -54 5 -160 108 -26 34 -8 103 34 23 -118 -185 -189 3
6355 3 209 36 -125 -36 63 -175 37 -158 77 -29 27 -286 -91 83 31 149 -33 -141 32 -41 -88 8 -105
6378 -105 207 128 -196 54 194 47 175 10 -252 135 -17 85 -96 293 -42 316 -100 -47 -96 73 325
6399 325 -227 -84 95 10 73 -13 128 82 102 -39 -51 61 94 75 -31 -38 -261 4 -37 -64 173 48 75 133 -42
6424 -42 -59 40 -38 57 74 -77 -220 32 -173 74 -199 -182 -5 48 190 -193 118 -126 -184 36 -35 -133 30 -12
6448 -12 101 -144 -13 143 25 -42 -76 -164 145 -248 44 87 87 238 50 -74 -229 -287 120 -152 -13 -412 -220
6471 -220 -123 -313 172 14 675 202 -196 3 -284 -546 84 -5 586 66 116 -150 -67 144 100 -75 -42 206
6493 206 53 53 29 75 -88 -107 38 73 102 -121 -45 205 -178 -153 138 183 -39 -39 52 102 102 -4 92 196 55 -152
6519 -152 132 -146 -12 -150 105 -93 55 68 -4 98 -105 43 265 -158 -65 -60 -56 -133 61 -22 39 204 210 -55
6543 -55 24 6 35 -247 -111 39 177 5 46 -103 -148 -248 133 42 94 68 -249 104 -316 -103 -28 -31 20 20 96
6568 96 107 80 -70 -171 12 -137 -33 26 80 6 -96 58 -16 -114 -242 -73 -226 -30 32 104 138 -27 4 204
6592 204 -184 -135 32 -146 88 79 130 74 -8 -31 32 -10 58 41 -34 -136 -115 -78 -302 245 145 76 41 -156 -123 -278
6618 -278 -56 154 -233 119 90 -126 -126 173 30 -88 -158 39 36 -26 44 -18 112 -102 150 56 189 66 -53
6641 -53 -162 19 83 -43 11 -18 -31 -89 -99 -70 10 -105 285 46 -241 111 22 -28 -2 -40 384 -204 196 -23
6665 -23 -60 -29 -69 53 -156 36 47 119 -25 -15 13 78 204 -205 14 69 -19 203 43 -114 145 -48 29 164
6689 164 -92 167 125 37 115 15 110 -30 208 0 1 -116 -24 -73 217 0 -12 -8 -92 115 -15 155 199 -175
6713 -175 -236 -82 38 30 58 255 59 119 55 -79 -133 212 25 3 -185 315 -144 41 -3 -58 41 89 29 -4 364
6738 364 21 83 65 -115 -22 22 24 124 -122 18 91 164 -9 -242 55 -197 -97 161 -278 67 16 -97 96
6761 96 -80 9 -81 154 120 55 -17 130 -89 12 155 68 -57 82 28 -44 -98 278 -4 -83 16 30 64 -92 -158
6786 -158 -82 -6 73 15 -290 -80 24 15 -169 62 58 148 -106 45 -36 -19 -50 -46 -68 73 -3 -253 42 -58 33 42
6812 42 113 119 -104 61 63 61 -84 155 -181 4 -118 -53 111 36 104 -18 90 -95 114 -86 -101 -98 -166 -62 42
6837 42 70 133 -4 -86 201 35 39 34 175 196 20 170 -101 -59 -199 -197 29 85 160 -249 66 100 259 124 45
6862 45 -156 -96 61 125 39 16 -16 24 -199 -297 -126 -71 -24 -103 317 -91 -118 78 50 -148 -179 -91 -105 -464 -76
6887 -76 153 -60 -339 -131 280 -131 -440 -647 -102 -107 -167 -17 344 202 -47 -254 -124 82 17 11 68 21 249
6910 249 306 19 -45 -46 60 -113 182 180 13 114 185 33 -100 212 211 -84 -176 22 31 63 -7 -69 -17 -69 -105 -39
6936 -39 71 -8 44 209 91 17 -3 -48 -89 23 -132 116 -44 132 191 -42 -15 -310 -164 42 241 -222 127
6959 127 50 216 51 22 -7 -37 64 107 158 30 -114 -37 1 -26 63 -43 -217 -70 -108 -125 98 26 82 6 -84
6984 -84 -67 -156 -198 -40 -72 -187 -206 -89 107 106 -80 -13 56 144 -57 -141 353 -143 -95 159 -169 162 -102 -122 -9
7009 -9 138 -100 -127 49 236 114 -46 178 -295 144 -63 -249 183 -194 19 139 33 191 77 40 91 -73
7031 -73 -120 45 -170 -167 -68 -8 158 -13 198 198 63 1 -148 -31 98 176 -48 121 140 -206 -231 60 79 261
7055 261 82 15 -75 56 63 -44 237 -180 -86 41 -119 -236 44 -144 -171 27 -80 -109 97 86 238 -53 -44
7078 -44 205 -151 -83 74 -48 34 -27 -48 140 -38 -120 86 146 114 -331 -177 -78 98 40 -83 -45 58 44 161
7102 161 46 -102 -123 -53 96 -220 174 -72 -48 -164 88 111 -173 35 -119 134 -93 126 -115 193 -17
7123 -17 26 -117 -66 -212 -85 -204 26 84 -222 70 -19 -11 -157 4 33 108 172 88 175 61 34 -76 89 -19
7147 -19 107 -2 175 -73 -160 -85 -226 -7 14 3 -1 -21 -101 -176 67 -12 21 -74 -40 106 -64 189 110 16 -72 -34
7173 -34 12 91 62 34 -6 233 -109 50 115 -10 -105 -132 171 88 331 0 310 125 -150 -21 103 24 -75 117
7197 117 -131 -170 130 83 144 -75 -95 -70 -161 115 179 -95 111 151 -64 -97 -260 -104 178 261 33 -158 -233 -188
7221 -188 -254 476 49 -233 42 130 268 172 -194 -37 197 439 149 18 144 370 520 63 539 203 -172
7242 -172 -24 -64 544 747 262 104 -280 -332 -527 107 -121 222 -696 -445 241 414 284 542 -94 -265 -120
7263 -120 -758 -10 256 -566 -342 55 271 -657 190 -98 -128 -24 -270 -46 348 69 -255 175 -396 -223
7283 -223 -241 -222 29 55 -47 -4 116 182 -61 -113 -177 -29 8 20 182 386 49 -36 -243 -14 -141 124 -241
7306 -241 56 1 -15 -119 75 -52 -19 189 216 -61 -149 -140 -145 -136 2 -13 -45 300 35 184 -89 -184 -94 14 148
7331 148 18 1 -84 40 -220 -180 -64 78 -189 -128 102 70 -5 -13 167 -58 -12 84 65 -68 214 -145 -26 115
7355 115 17 267 -13 87 -80 -325 56 133 92 12 110 88 10 -251 -81 14 -349 126 -135 9 100 87 107 -62
7379 -62 -279 198 -101 12 114 194 -292 -204 -164 -156 -193 -5 -260 25 96 239 -222 97 207 77 3 -20 16 215
7403 215 192 221 224 78 -25 -42 -121 6 140 149 75 62 -128 18 317 -72 90 12 -3 127 188 147 -116 -31 -60
7428 -60 -117 28 -204 -122 164 -114 99 -181 -249 75 -2 -248 -193 -144 -4 -114 -90 108 139 2 -58 -29 -208 40
7452 40 -131 -215 -37 232 129 -27 -80 70 -33 -20 86 -199 67 -135 -13 32 135 198 -19 -15 -170 191 32
7475 32 -85 82 133 -24 101 386 82 152 -44 -132 -23 214 -4 46 -25 -94 232 15 -73 -71 -165 -34 68 -149
7499 -149 -13 42 182 -231 42 -88 83 102 72 62 -310 136 53 -40 191 -3 -12 4 -238 -75 125 -42 76
7522 76 92 81 83 50 68 277 -85 76 -25 100 90 -54 78 -39 79 -133 53 -138 -247 79 -103 -79 -167
7545 -167 -42 2 -25 20 78 18 77 78 51 -220 58 -29 -29 -204 -31 -145 -307 -197 -116 -30 -3 2 47 -14 -4 -71 77
7572 77 -226 -72 111 -260 -28 58 237 -85 110 49 164 226 66 106 -26 255 -35 -58 -250 210 63 160
7594 160 18 119 0 -119 -46 -184 57 208 -65 87 111 -156 -62 17 108 328 -2 194 -14 48 61 61 -132
7617 -132 43 -116 1 -110 110 131 -43 42 -148 -123 -145 159 65 -32 -3 161 -25 -65 49 68 41 191 89
7640 89 9 141 -68 -113 -97 -53 -39 -11 -165 -156 114 -190 10 33 285 -360 12 -132 192 -117 143 58 -142 79
7664 79 172 -80 -96 -129 -110 56 2 321 -193 -135 -51 54 78 282 -9 29 -222 -85 -6 -158 68 98 47 36 -78
7689 -78 47 54 -92 119 -63 -90 9 134 195 124 105 72 28 21 -200 -87 66 112 -123 48 196 -2 -54 62 186
7714 186 18 36 78 1 47 26 -33 -246 -65 98 33 41 91 -189 79 -62 -16 39 -39 -119 -38 -39 -163 50 24 2
7740 2 99 105 134 206 -6 -25 223 16 -188 41 -235 -25 -17 -90 -215 -22 -160 222 245 -53 12 6 -117 112 127
7765 127 -185 148 -11 -36 47 71 38 109 -177 -47 -265 237 -141 -58 85 92 355 110 -40 66 38 -115 44
7788 44 104 -111 -123 72 -53 26 -84 -203 -25 78 70 -30 134 123 -9 91 -45 208 -180 253 -116 -143 -17
7811 -17 -126 -73 -106 -62 45 -72 -32 -115 -30 26 -228 10 85 184 -19 145 129 132 57 156 -31 63 -98 -101 -217 -194
7837 -194 68 43 -10 -93 -187 78 120 60 -135 -154 -116 119 -342 -110 -77 -159 66 24 -76 152 -13 -14 -51 68 -35
7862 -35 64 -114 -72 -66 65 31 45 -8 -16 59 -19 -130 -23 -5 -105 214 133 30 -66 -44 169 -182 -76 213 163 -56
7888 -56 14 -6 122 191 72 -139 191 -61 -2 81 -93 -22 100 -33 45 9 135 71 240 -61 180 223 -61 45
7912 45 -130 60 136 -229 114 98 138 10 -24 -356 137 28 -96 30 74 -218 -20 -54 -365 -238 -39 -105 -44
7935 -44 463 242 227 401 287 -132 281 423 108 668 379 21 360 -661 129 -193 833 -28 -17 -501
7955 -501 259 754 416 321 -176 -97 -208 291 73 -566 829 448 33 -3 154 585 -311 -554 440 589 330
7976 330 -364 -124 129 -93 -335 16 260 134 214 -26 -62 284 291 235 -465 -196 117 307 -71 68 -70 -81
7998 -81 -197 -376 209 104 65 76 2 76 -151 165 -163 -187 -128 98 6 16 -95 38 110 115 106 -73 -56 35 149
8023 149 -106 -52 109 51 -236 202 17 -69 -104 -27 67 6 -51 -47 241 13 227 -13 126 41 200 285 6 -51
8047 -51 -118 120 30 255 219 47 -120 -266 -63 369 209 -300 -61 24 -347 185 207 -31 466 -81 -111 -152 -55
8070 -55 6 215 629 38 -724 -390 -575 226 660 -214 -380 -49 -175 28 32 110 307 -110 23 106 -103 -281
8092 -281 -231 83 -59 23 111 110 -142 374 136 -181 109 -12 -61 102 14 47 -331 -51 185 -61 183 90 198
8115 198 130 -232 -149 5 319 -87 398 -45 633 86 333 223 715 -141 306 -184 3 -248 383 70 -777
8136 -777 385 -287 229 -401 286 -488 -340 -284 -523 283 307 -73 80 279 456 394 -617 -182 123 57 230
8157 230 51 -130 269 -177 73 -418 24 155 108 -80 63 -193 25 7 -56 35 -186 16 23 11 70 -13 139
8180 139 -144 -43 100 52 95 -15 -105 -19 -18 -44 -53
8191e3
##END NTUPLES=NMR FID
##END=
