##TITLE=1H_SR36 oil
 CDCl3,8 sc, 
 5.02.2021
##JCAMPDX= 6.0         $$ Bruker NMR JCAMP-DX V2.0
##DATA TYPE= NMR FID
##DATA CLASS= NTUPLES
##ORIGIN= UXNMR, Bruker Analytische Messtechnik GmbH
##OWNER= root
$$ XWIN-NMR		Version 3.5
$$ Fri Feb  5 13:23:47 2021 Russian Standard Time (UT+4h)  she@DPX200
##.OBSERVE FREQUENCY= 200.1315066352
##.OBSERVE NUCLEUS= ^1H
##.DELAY= (6, 6)
##.ACQUISITION MODE= SIMULTANEOUS
##.ACQUISITION SCHEME= undefined
##.AVERAGES= 8
##.DIGITISER RES= 18
##SPECTROMETER/DATA SYSTEM= spect
##.PULSE SEQUENCE= zg30
##.SOLVENT NAME= CDCl3
##.SHIFT REFERENCE= (INTERNAL, CDCl3, 0, 15.7039)
##AUDIT TRAIL= $$ (NUMBER, WHEN, WHO, WHERE, WHAT)
$$ ##TITLE= Audit trail, XWIN-NMR		Version 3.5
$$ ##JCAMPDX= 5.01
$$ ##ORIGIN= Bruker BioSpin GmbH
$$ ##OWNER= she
$$ F:/spectra/data/she/nmr/H-F/1/audita.txt
$$ ##AUDIT TRAIL=  $$ (NUMBER, WHEN, WHO, WHERE, WHAT)
(   1,<2021-02-05 13:22:40.43 +0400>,<she>,<DPX200>,
      <created by zg, POWCHK disabled, PULCHK disabled
       configuration hash MD5:
       00 E9 B6 7A A2 85 ED C7 34 08 36 98 17 FE 4E 26
       data hash MD5: 16K
       EA B5 8A 19 37 18 CB E5 65 6A FB 2C 34 7E BB 20>)
$$ ##END=
$$ 
$$ hash MD5
$$ FF 2B A5 AF 76 E1 8F 5B CF 03 41 C2 35 8F 0B E8
##$RELAX= 
##$RELAX= 
##$RELAX= 
##$RELAX= 
##$RELAX= 
##$RELAX= 
$$ Bruker specific parameters
$$ --------------------------
##$DU= <F:/spectra>
##$EXPNO= 1
##$NAME= <H-F>
##$PROCNO= 1
##$TYPE= <nmr>
##$USER= <she>
##$AMP= (0..31)
100 100 100 100 100 100 100 100 100 100 100 100 100 100 100 100 100 100 
100 100 100 100 100 100 100 100 100 100 100 100 100 100 
##$AQSEQ= 0
##$AQ_mod= 1
##$AUNM= <au_zg>
##$AUTOPOS= <>
##$BF1= 200.13
##$BF2= 200.13
##$BF3= 200.13
##$BF4= 200.13
##$BF5= 200.13
##$BF6= 200.13
##$BF7= 200.13
##$BF8= 200.13
##$BYTORDA= 1
##$CFDGTYP= 0
##$CFRGTYP= 5
##$CHEMSTR= <none>
##$CNST= (0..31)
1 1 145 1 1 1 1 1 1 1 1 1 1 1 1 1 1 1 1 1 1 1 1 1 1 1 1 1 1 1 1 1 
##$CPDPRG= <>
##$CPDPRG1= <>
##$CPDPRG2= <>
##$CPDPRG3= <>
##$CPDPRG4= <mlev>
##$CPDPRG5= <mlev>
##$CPDPRG6= <mlev>
##$CPDPRG7= <mlev>
##$CPDPRG8= <mlev>
##$CPDPRGB= <>
##$CPDPRGT= <>
##$D= (0..31)
0 1.2 0 0 0 0 0 0 0 0.06 0 0.03 0 0 0 0 0.0002 0 0 0 0 0 0 0 0 0 0 0 0 
0 0 0 
##$DATE= 1612516959
##$DBL= (0..7)
120 120 120 120 120 120 120 120 
##$DBP= (0..7)
150 150 150 150 150 150 150 150 
##$DBP07= 0
##$DBPNAM0= <>
##$DBPNAM1= <>
##$DBPNAM2= <>
##$DBPNAM3= <>
##$DBPNAM4= <>
##$DBPNAM5= <>
##$DBPNAM6= <>
##$DBPNAM7= <>
##$DBPOAL= (0..7)
0.5 0.5 0.5 0.5 0.5 0.5 0.5 0.5 
##$DBPOFFS= (0..7)
0 0 0 0 0 0 0 0 
##$DE= 6
##$DECBNUC= <off>
##$DECIM= 32
##$DECNUC= <off>
##$DECSTAT= 4
##$DIGMOD= 1
##$DIGTYP= 9
##$DL= (0..7)
0 120 120 120 120 120 120 120 
##$DP= (0..7)
150 150 150 150 150 150 150 150 
##$DP07= 0
##$DPNAME0= <>
##$DPNAME1= <>
##$DPNAME2= <>
##$DPNAME3= <>
##$DPNAME4= <>
##$DPNAME5= <>
##$DPNAME6= <>
##$DPNAME7= <>
##$DPOAL= (0..7)
0.5 0.5 0.5 0.5 0.5 0.5 0.5 0.5 
##$DPOFFS= (0..7)
0 0 0 0 0 0 0 0 
##$DQDMODE= 0
##$DR= 18
##$DS= 0
##$DSLIST= <SSSSSSSSSSSSSSS>
$$ [...]
##$SUBNAM2= <"">
##$SUBNAM3= <"">
##$SUBNAM4= <"">
##$SUBNAM5= <"">
##$SUBNAM6= <"">
##$SUBNAM7= <"">
##$SUBNAM8= <"">
##$SUBNAM9= <"">
##$SW= 16.9725356469052
##$SWIBOX= (0..15)
0 0 2 0 0 0 0 0 0 0 0 0 0 0 0 0 
##$SW_h= 3396.73913043478
##$TD= 16384
##$TD0= 1
##$TE= 0
##$TE2= 300
##$TE3= 300
##$TEG= 300
##$TL= (0..7)
0 120 120 120 120 120 120 120 
##$TP= (0..7)
150 150 150 150 150 150 150 150 
##$TP07= 0
##$TPNAME0= <>
##$TPNAME1= <>
##$TPNAME2= <>
##$TPNAME3= <>
##$TPNAME4= <>
##$TPNAME5= <>
##$TPNAME6= <>
##$TPNAME7= <>
##$TPOAL= (0..7)
0.5 0.5 0.5 0.5 0.5 0.5 0.5 0.5 
##$TPOFFS= (0..7)
0 0 0 0 0 0 0 0 
##$TUNHIN= 0
##$TUNHOUT= 0
##$TUNXOUT= 0
##$USERA1= <user>
##$USERA2= <user>
##$USERA3= <user>
##$USERA4= <user>
##$USERA5= <user>
##$V9= 5
##$VALIST= <valist>
##$VCLIST= <CCCCCCCCCCCCCCC>
##$VD= 0
##$VDLIST= <DDDDDDDDDDDDDDD>
##$VPLIST= <PPPPPPPPPPPPPPP>
##$VTLIST= <TTTTTTTTTTTTTTT>
##$WBST= 1024
##$WBSW= 4
##$XGAIN= (0..3)
0 0 0 0 
##$XL= 0
##$YL= 0
##$YMAX_a= 121172
##$YMIN_a= -109891
##$ZGOPTNS= <>
##$ZL1= 120
##$ZL2= 120
##$ZL3= 120
##$ZL4= 120
##$ABSF1= 10
##$ABSF2= 0
##$ABSG= 5
##$ABSL= 3
##$ALPHA= 0
##$AQORDER= 0
##$ASSFAC= 0
##$ASSFACI= 0
##$ASSFACX= 0
##$ASSWID= 0
##$AUNMP= <proc_1d>
##$AZFE= 0.1
##$AZFW= 0.1
##$BCFW= 1
##$BC_mod= 2
##$BYTORDP= 1
##$COROFFS= 0
##$CY= 11.3945322036743
##$DATMOD= 1
##$DC= 2
##$DFILT= <>
##$DTYPP= 0
##$F1P= 15.9154993809931
##$F2P= -4.1035820241983
##$FCOR= 0.5
##$FTSIZE= 0
##$FT_mod= 4
##$GAMMA= 1
##$GB= 0.15
##$INTBC= 1
##$INTSCL= 1
##$ISEN= 128
##$LB= 0.24
##$LEV0= 0
##$LPBIN= 0
##$MAXI= 10000
##$MC2= 0
##$MEAN= 0
##$ME_mod= 0
##$MI= 1.114404
##$NCOEF= 0
##$NC_proc= 0
##$NLEV= 6
##$NOISF1= 3.799351
##$NOISF2= 2.8
##$NSP= 1
##$NTH_PI= 0
##$NZP= 0
##$OFFSET= 15.70392
##$PC= 1
##$PHC0= -10760.25
##$PHC1= 12.00094
##$PH_mod= 1
##$PKNL= yes
##$PPARMOD= 0
##$PSCAL= 0
##$PSIGN= 0
##$REVERSE= no
##$SF= 200.130013532006
##$SI= 16384
##$SIGF1= 3
##$SIGF2= 2
##$SINO= 400
##$SIOLD= 16384
##$SREGLST= <1H.CDCl3>
##$SSB= 0
##$STSI= 0
##$STSR= 0
##$SW_p= 3612.71676300578
##$SYMM= 0
##$S_DEV= 0
##$TDeff= 0
##$TDoff= 0
##$TI= <>
##$TILT= no
##$TM1= 0
##$TM2= 0
##$TOPLEV= 0
##$USERP1= <user>
##$USERP2= <user>
##$USERP3= <user>
##$USERP4= <user>
##$USERP5= <user>
##$WDW= 1
##$XDIM= 8192
##$YMAX_p= 0
##$YMIN_p= 0
$$ End of Bruker specific parameters
$$ ---------------------------------
##NTUPLES= NMR FID
##VAR_NAME=  TIME,          FID/REAL,        FID/IMAG
##SYMBOL=    X,             R,               I
##VAR_TYPE=  INDEPENDENT,   DEPENDENT,       DEPENDENT
##VAR_FORM=  AFFN,          ASDF,            ASDF
##VAR_DIM=   8192,          8192,            8192
##UNITS=     SECONDS,       ARBITRARY UNITS, ARBITRARY UNITS
##FACTOR=    0.0002944,     1,               1
##FIRST=     0,             0,               0
##LAST=      2.4114304,     0,               0
##MIN=       0,             -109891,         0
##MAX=       2.4114304,     121172,          0
$$ Real data points
##PAGE= N=1
##DATA TABLE= (X++(R..R)), XYDATA
0@%%%%%%%%%%%%qJ6j6J6j6K4l2L2m0M8n6P0p8Q8j04J20j41J65j86K10k40K72l06
35a62L44l87M34m84N39o00O67p40Q19r04R97j101J215j338J474j623J787j970
53a033K174k404K663k956L292l685M151m709N396o263P391q925J1137j4608K0803
68A2424l4949J18594K1361k22731K26473q6646r5405J52143p6942m3406R7838
79F8754m2801m3526M3277J7557m3706N3855r459m8066N7789m5102n388M8617n5720
92c919O0177l4826o2048J08695o4541l2361R7426o4856r651N1872n2292k1801
104b8125O3096r744n9678O9774k4272p2522J08274n5245m0232J15663r0745o844
116c0600O4477p9046L9090J2190l4069M0950l2672m040J8521j8543K0777o89p974
$$ plain form
0 0 0 0 0 0 0 0 0 0 0 0 0 0 -8 8 -8 8 -8 16 -16 16 -24 24 -32 38 -40 48 -56 64 -77 88 -98 112 -128 144 -162
35 -162 182 -205 229 -255 284 -316 351 -389 430 -474 523 -578 637 -701 773 -850 937 -1033
53 -1033 1141 -1263 1400 -1556 1736 -1949 2202 -2507 2889 -3374 4017 -4908 6229 -8379 12424
68 12424 -22525 96069 117430 -105301 121172 34526 -60879 91264 14322 -29084 68754
79 68754 25953 -17573 25704 43261 -445 53410 43951 -4115 53674 8572 3184 51801 -3919
92 -3919 56258 21432 -40616 68079 3538 -28823 68603 3747 -5904 45968 -6324 -28125
104 -28125 34971 25227 -34451 35323 11051 -61471 46803 -8442 -48674 66989 -23756 -30600
116 -30600 33877 -45169 -6079 6111 -27958 12992 -19680 -23720 -5199 -23742 -2965 -3654 -11628
129a1628m942Q66K061j6800K8141p357j1391L1871m2369P499K7918l5759L2040
142A50j076k2546K3862k1928Q431J3598j5991J8101p484r114N966j873M401k243
156g746J8565j2914j4268K7734k9178J0957K9645m1273K5297N645l4471L0992
168H985j0161m010K2489k0711Q759j517j5510K3047o438p766K0078j1239j7324
181a1318K2030j324k3252L4609l611l8376M4013j3858l5654N6943j7997k9309
193a7104M6287k5813k2985M0812j3641j7869L2020j0839k3486K6641p957j6192
205a0126L0046j2733j0155J9143k1593O746J1276j8489K2034p640j9824K8436
217A7121j8788j0256L6597k4718r639L4458l1328r967M0331k8318p879M0149l4788
$$ plain form
129 -11628 -16570 -15704 -13643 -30443 -2302 -9659 -21050 10821 -31548 -24049 3869 -31890 150
142 150 -926 -23472 390 -21538 -13107 491 -15500 2601 -4883 -13997 -8031 -9904 -5503 -7746
156 -7746 10819 -2095 -16363 11371 -17807 -6850 22795 -18478 6819 12464 -22007 8985
168 8985 -1176 -5186 17303 -3408 5351 3834 -11676 11371 4933 -2833 17245 6006 -11318
181 -11318 10712 9388 -13864 20745 17134 -21242 22771 8913 -26741 30202 12205 -17104
193 -17104 29183 3370 -19615 21197 7556 -10313 21707 10868 -12618 14023 6066 -10126
205 -10126 19920 7187 -2968 16175 -5418 1328 12604 -5885 16149 8509 -11315 17121
217 17121 -1667 -11923 24674 -44 -9683 24775 -6553 -16520 23811 -4507 -12386 27763 -7025
230g025j0177L9639l2815l010L8062l2576l377K8048k9850J367K5926k2744K264
243f268J6854k3111L780J2818j6053J0441N608j5810J0077k849j0243J6552o382
256d586n556J4923j4512l780J6465j4390K900J6407j8943K497J2480j9023P992
269g126J3232j6853P988O770j6852Q523O580j0798R278L953j1907N924L114q814
283f988Q360M704r747O598N17r340R019J422n147P276j831n717M055J72j565L886
299E674J622l565j140K385k567L60M837j924k214K633l142k737N624R3l702M534
315F771k334n711N729j663k223N567l627j987J648k947J797L22j115L345n001
330a429o33L709n708K542N215p270N86N708q901J437Q346q778R71Q708j1605M97
$$ plain form
230 -7025 -17202 22437 -10378 -13388 24674 -7902 -11279 16769 -13081 -11714 14212 -8532 -6268
243 -6268 10586 -12525 -8745 4073 -11980 -1539 4069 -11741 -1664 -4513 -14756 1796 -4586
256 -4586 -10142 4781 -9731 -13511 2954 -11436 -8536 7871 -11072 -8575 3905 -15118 -7126
269 -7126 6106 -10747 -2759 4011 -12841 -4318 2262 -8536 742 4695 -7212 -1288 1826 -6988
283 -6988 1372 6076 -3671 2927 3444 -5896 3123 4545 -602 6674 4843 -874 3181 3353 1788 5674
299 5674 7296 3731 2591 4976 2409 2769 7606 5682 3468 6101 2959 222 5846 5939 2237 6771
315 6771 4437 -1274 4455 2792 569 6136 2509 522 2170 -777 1020 1342 227 3572 -1429
330 -1429 -2062 1647 -4061 -1519 3696 -3574 -2988 2720 -6181 -4744 3602 -5176 -4205 4503 -7102 -6605
346f605J0401j0712J910J0615j2428Q81R740j1732L061J0132j1508K827P823j2272
360g867M712O829r759O049L244q818N627J208n522O899j291l760N730m127j360
375b206O096m650R93M762o370J408M488o550L310M581p977K923M848q725L555
390D86N423q684M184N143j0392M864N061j0674O778L681j0591P043J167q977Q109
405B621M04p326O782j268n110N139q95l332M364j241l044L026j111j609L404j451
421f47j797K729j467q35K074j225K22J702k775N50K735l171J012K810m445K335
437a93K494n651M045J964n784N250k73n055O037j419l603N238j546k413L267j132
453A226j547K612Qk642J771J226l427J961J510l535K436O94m306L721M71l565
$$ plain form
346 -6605 3796 -6916 -5006 5609 -6819 -5938 3802 -7930 -4869 5263 -6245 -3418 4405 -7867
360 -7867 -3155 3674 -6085 -36 3208 -5610 17 1225 -4297 2602 1311 -2449 3281 -846 -2206
375 -2206 3890 -760 233 4995 -1375 33 4521 -2029 1281 5862 -2115 808 5656 -3069 486
390 486 5909 -2775 1409 6552 -3840 1024 6085 -4589 2189 5870 -4721 2322 3489 -5488 2621
405 2621 3025 -4301 2481 1213 -3897 1242 347 -2985 1379 138 -2906 120 -991 -2600 804 -647
421 -647 -2444 285 -1182 -2017 57 -1168 -946 756 -2019 -1469 1266 -1905 -893 1917 -2528 -193
437 -193 2301 -3350 695 2659 -3125 2125 1852 -3203 2834 1415 -2188 3050 1504 -909 2358 1226
453 1226 -321 2291 2299 -343 1428 2654 -773 1188 2698 -837 1599 2293 -2013 1708 2179 -1386
469a386L223j019k445L768k417j439L654k473q77K400k242M04K059l238J326R94
485B92k350J687q5j456K116j162q74J437r17j6L48L74n15m62J818k285O81L014
503A645m116K231J616m568M032L76m274N226j147l367M594k153j193L819k380
518C41j59J633j082n55J400l07r51J419o54q85R01n2j37Q06o00l64K00k87n97
537G0J308n49r43J902k015l36K572l006Q56K196m356K718L65l697L924j211k037
554b239L232k877o7J713j928J071L73r42K61l48N51p03O64R35j512N59M7j114
572b324J569J80q23J280p64p42J484p34l02K166j006j133J945j850Q24J715j793
589c08J682K91k142J794o42j43K135j624L25N18j479J398k64N14N08j238Q78j011
$$ plain form
469 -1386 1837 818 -1627 2141 -276 -1715 1939 -534 -1411 989 -1253 -849 1210 -2028 -702 292
485 292 -2058 -371 -456 -1912 204 -958 -1832 -395 -1312 -1328 -980 -606 -1121 -1583 235 -2050 -1369 1645
503 1645 -2471 -240 1376 -3192 840 1216 -3058 2168 1021 -2346 2248 95 -1098 2721 341
518 341 182 1815 733 178 1578 1271 320 1739 1085 200 1101 1049 912 1718 1118 754 954 667 70
537 70 1378 829 -114 1788 -227 -563 2009 -997 -141 2055 -2301 417 782 -2915 1009 -202 -2239
554 -2239 993 -1884 -1951 -238 -2166 -1095 -722 -1664 -1403 -1751 -1200 -1903 -1239 -304 -1816 -1257 -1210 -2324
572 -2324 -755 -575 -1398 -118 -882 -1624 -140 -874 -1176 990 -16 -1149 796 -1054 -230 1485 -308
589 -308 1374 1665 -477 1317 675 532 2667 1043 1368 1886 407 1805 1541 2055 2563 1325 2203 1192
607A192j63J510j060L65P58k013R67j51r68J324p5j130P05j272l24J485q91o5
625A94P44j517l04N60j086J271ko26L90j288j10N39k88R09l25j091N50p98K60
644b018N86n17R81n60n70K22l76P42N80m56J26j57k90L55M64J94J65K8m22L17
664f06k56N54L82M5L98l33p18Q89o12J340O28j361R92r42k42J315q10J077M97
683B237j599N03j56l40J339p01N32n74n87J25k61R01r0l45J73q99JJ38l40Q41
703H98k26j54p45j96J44M8P86m22n22L52j034j0Q75q71J092k37j065Q87j233O33
723a000J058j166J079q51m08O44n57Q66J4l18O99j447R68L0j96J516r64j39M32
742B60j035O73Q20m73M39m4m81m28P99k55K69J207j712J15P95j757J691M58j517
$$ plain form
607 1192 1029 2539 1479 1844 2602 589 1556 1405 437 1761 1686 556 1261 -11 -335 1150 259 194
625 194 938 -579 -883 -323 -1409 -138 -140 -766 -376 -1664 -1774 -1235 -1523 -614 -939 -2030 -1480 -2278 -2018
644 -2018 -1432 -1949 -968 -1528 -2098 -1876 -2252 -1510 -930 -1386 -1260 -1417 -1707 -1352 -888 -694 -529 -501 -923 -606
664 -606 -862 -308 74 119 517 184 -534 355 -257 1083 1711 350 1342 400 158 1473 663 1740 2237
683 2237 638 1141 985 645 1984 1283 1815 1241 654 779 518 1419 1329 984 1157 258 259 397 57 898
703 898 672 518 -227 -423 -279 -231 555 133 -389 -37 -1071 -1081 -206 -1077 15 -222 -1287 -400 -1633 -1000
723 -1000 58 -1108 -29 -880 -1288 -644 -1201 -335 -321 -639 60 -1387 -419 -389 -585 931 -33 -172 260
742 260 -775 -102 718 245 684 640 159 -269 530 275 544 1751 39 154 949 -808 883 1341 -176
761a76J560j170o13J111p55N77J62m37j00o48N62o08N73P37j566J059o19j416
779a767K075q47k82J542j970L66M82j075J202M43r36r8L40j139N82O47m56L99
797d92Q12j942Q52P79j206J586Lj049Q24n50n31J259J45O7L0r2r30P33P03q61
817A40J294L18j830J349n50n76J880r13K7L66r51R5O06l80N74J09n90l17J21k70
837E02J87P31o77k76M56j029M02k9l77P19l46p66J57J33k98J61N80j254l6M53
857f07j227P58Q26j526J265k46j635J521k33q30J506m99j130R56n55j82J123K47
875d68q44K27K00q15J002L13q02J329m53r51J082k59k83J521m76q66J363j042
893b22lJ853j053p2J179j719P04Q75j627J478L76j309J177j60j481J565K27j007
$$ plain form
761 -176 1384 214 -399 712 -43 534 696 259 159 -489 73 -535 38 775 -791 268 -351 -1767
779 -1767 308 -539 -821 721 -1249 -883 -401 -1476 -274 169 -767 -865 -525 -1664 -1082 -435 -891 -492
797 -492 320 -1622 -770 9 -1197 389 392 -657 167 -383 -914 345 490 557 587 495 -435 298 1001 140
817 140 1434 1752 -78 1271 721 145 2025 1112 1139 1505 554 649 1255 875 1449 1558 968 651 772 502
837 502 689 1420 743 467 923 -106 296 267 -110 609 263 -503 -346 -213 -511 -350 230 -1024 -1060 -607
857 -607 -1834 -1076 -250 -1776 -511 -757 -2392 -871 -1104 -1934 -428 -927 -2057 -1101 -1656 -1838 -715 -468
875 -468 -1312 -1085 -885 -1700 -698 -385 -1187 142 -311 -1262 -180 -439 -722 799 323 -543 820 -222
893 -222 -225 1628 575 503 1682 -37 667 1542 -85 1393 1769 460 1637 1477 -4 1561 1788 781
911G81J117n47j311J553m23j133J673m29j650J545n99j124K013q81j049J963j593
928i4j082K175j424n39K145k082j94J836k352O77J605j817M41N31j842J266M97
945b53r86Q74l51o83R13l65n29J224n34k78P75p55m41J279l82m70J316n87j249
964a482J756m75q58K113j092p81J841j691J10K097j679K01J169j754M77J075q89
981A38K58M60o76L34L55q24M0M10R3j89L41m97l80O68Q0k12L6m07j26L33o9k87
1003a21L85p28N36j38q62P04Ln68J034q76n26J163p07K73L82r56L24L33j76j43
1023f64K80L31m77O57l37o85R91R5p72J405q16p58J740j195l05J651j021l40J642
1042A422j540j44J669j520Q23Q98j940R04P16j477J408k36q39R72l39n74O08l50
$$ plain form
911 781 1898 1351 40 1593 1170 37 1710 1281 -369 1176 577 -547 1466 585 -464 1499 -94
928 -94 -1176 999 -425 -964 1181 -901 -1095 741 -1611 -934 671 -1146 -705 -174 -2016 -750 -253
945 -253 -1239 -365 -716 -1399 -486 -851 -1380 -156 -690 -968 -193 -948 -1389 -110 -492 -962 354 -233 -1482
964 -1482 274 -201 -1059 1054 -38 -819 1022 -669 -559 1538 -141 60 1229 -525 -48 1027 138
981 138 396 856 180 514 869 45 85 495 588 399 740 243 -137 531 611 399 435 28 -98 235 166 -121
1003 -121 264 -464 72 -66 -928 -224 -221 -789 245 -631 -1157 6 -701 -428 -46 -1002 -678 -345 -521 -664
1023 -664 -384 -53 -530 127 -210 -895 96 191 -581 824 8 -750 990 -205 -510 1141 120 -220 1422
1042 1422 -118 -262 1407 -113 710 1608 -332 572 1288 -189 1219 983 144 1116 777 203 811 461
1060D61k12P09l10o46K66L95n90O79m78r29J398p47q09J883j581j98J600j490
1078e99k43J319j499M35J291k102N46R96j684P73R40j849P56Q50j759J165L79
1095b85j167J157m40m71M13j3O0K68j33J66k76R11r01M78K81o73J092o95j54Q76
1115D94p05J83J060j152N69O77j186P38L44o74O57J4p87L94M72o31P33J26r23
1134D03M84M44r59O09N5m66K13k43m6j10N58m74m15P00q61K35N10j035N24K71
1154C97r48R24o72k38N07m93K03Q5k79N5j02r7J05PJ90o13M02m3n10R99m34l03
1176h58N42o79M09N95p02L36J13kk44K85l04R9P80o75j19J233j092K73Q12j446
1196f44J068M16j276J149k81k73M24j13j82O5N72p30J84M71p16N66M20r87O72
$$ plain form
1060 461 249 958 648 2 268 663 73 752 274 -655 743 -4 -813 1070 -511 -709 891 -599
1078 -599 -842 477 -1022 -587 704 -1398 -852 144 -1540 -767 173 -1676 -920 -70 -1829 -664 -285
1095 -285 -1452 -295 -735 -1206 -793 -806 -746 -478 -611 -445 -721 190 -711 -233 48 -625 467 -228 -382 494
1115 494 -211 -28 1032 -120 449 1126 -60 678 1022 348 1005 1019 232 626 1098 467 1200 1326 403
1134 403 887 1331 372 981 1036 570 783 540 494 384 942 468 53 753 -108 127 637 -398 126 397
1154 397 -551 373 -299 -537 -30 -523 -320 -235 -514 -459 -561 -658 -553 -546 -356 -969 -567 -610 -1120 -121 -555 -858
1176 -858 -316 -995 -586 9 -693 -357 -244 -246 -490 -205 -509 -410 370 -305 -424 809 -283 -10 802 -644
1196 -644 424 840 -436 713 432 159 583 470 288 353 925 195 379 850 134 700 1120 133 805
1215H05j66o25Q35n38l06P37p96L56L14p90K80K11m10k01O04p56j07P73j078M68
1235c90N57j180Q60J0r36R21k85l30N71m59j71L94j3k84K22M4k24M85K64p63Q56
1256A49l56m37P95l23n06P88l08j84M77l26L43j9J62n8L24j36l91O80l15K03J70
1277G32m73L22J87m16L99n2m62L01N6m49M99k12L8l13L56m43M0N49o58L15J09
1298D25m86L42j52o20O83m00r9J01R7m19L94k35j14J83q3m04K61n1j44M27k68
1319e62o7R5j4J85q3k14j3L39Mj92K37m1j8J48j38k7O02o84M63L9k26M41J06n75
1343a95O12l86L6L82l08J38L46p6k53K56r7QO6P7k75K29K02j32j10J37k29J57
1365E85k67m02N90K2m44L30j23k62L09k55j35K65m86P8J78m63N3K97l17J48n6
$$ plain form
1215 805 639 14 849 311 5 742 -54 302 616 -174 106 317 -93 -294 310 -446 -553 220 -858 -390
1235 -390 167 -1013 -153 -143 -1079 -158 -443 -773 -202 -661 -832 -438 -451 -735 -513 -469 -693 -208 56 -707 149
1256 149 -207 -644 151 -172 -678 110 -198 -382 95 -231 112 93 255 197 521 385 -6 674 359 562 732
1277 732 259 581 768 352 751 699 237 538 594 145 644 432 470 157 513 70 110 659 1 316 425
1298 425 -61 281 129 -491 192 -208 -307 -206 -109 -528 -134 -369 -483 -300 -383 -787 -526 -577 -721 -294 -562
1319 -562 -629 -534 -548 -363 -446 -660 -673 -334 -330 -522 -285 -326 -344 -196 -334 -361 241 -443 20 59 -167 274 380 -195
1343 -195 417 31 67 449 141 279 625 549 296 552 455 463 529 606 331 560 762 630 520 657 428 585
1365 585 318 -84 506 528 84 414 291 29 338 83 -52 213 -273 -195 -17 -480 -427 -130 -447 -299 -355
1386c55j23K48k16k79K30J38k7m61K37J69p8J9n6J86K3k20J61Ok79N09r4l84M24
1409b22K11l53M15j31n5M09m00J50L62k35J14n7J16K58j03rj85J33O7R1q1K04
1431F99r9J7J52l27R8Qo2q3J41j50L20m52K20J32m82J41L8j34L12m34o3J48j06
1454C4j60P3l30J20J36l64LJ83o3PL1Pj82k0l0j18K20J27j35L3j7j66L88j57j77
1479e57K48k50J99M15m80L30n8j95L89j17r3M12k25L3L9l65L52K49k50K85K6l12
1501G5J92l5K41k4k77K59k6O3m3K10k91L47l62J30j99m0K97j83j94K65m26K80
1523B59M5m66P8M06l78J53r0l6k7m29K28j69L9L52l40M9J33k75K02j66r5J19K07
1546b01m07J59J16k9R8m9j10J68l92N29R7l87L42m3P3J48k94J30M96l47N2%K4
$$ plain form
1386 -355 -478 -230 -446 -725 -495 -357 -384 -845 -608 -439 -517 -498 -554 -368 -345 -565 -404 -398 -677 -168 -262 -646 -222
1409 -222 -11 -364 51 -80 -135 274 -126 24 386 151 265 208 324 582 479 470 285 418 485 576 495 699
1431 699 600 617 769 442 540 548 486 403 544 394 714 262 482 614 132 273 311 177 489 55 -8 140 34
1454 34 -126 -53 -383 -263 -127 -491 -488 -305 -368 -361 -330 -323 -505 -525 -555 -673 -453 -326 -461 -428 -445 -611 -223 -380 -557
1479 -557 -309 -559 -360 55 -425 -95 -153 -348 41 -76 -169 243 18 51 90 -275 77 326 76 361 387 75
1501 75 267 232 473 449 172 431 405 468 425 635 344 691 329 459 260 220 517 334 140 405 -21 259
1523 259 304 -162 -84 322 -56 97 7 -29 -56 -485 -257 -426 -387 -35 -375 -326 -193 -468 -266 -432 -527 -408 -201
1546 -201 -608 -449 -333 -362 -264 -313 -423 -255 -647 -118 -21 -408 -66 -109 -36 112 -182 -52 444 97 149 149 173
1569A73R0j56N1J99k31K39l1j24M16j15k11J40p8O3mk23R9j8K6K06k31j21J86
1592C45j79K84j95j21mk7q5L38l39j32KK05k76P2J05k27N6j51K0j97K54Q3j18
1615b87j20J08k98J65j27m3K87m7P1J46k14oj73J30K12r3j35M9m1O05k85K09k75
1638a62k10L37K24j24J17k09m8K03j85M12l2j9J28k44j14L90J38l55M5J50m6J05
1660E01o3k11L89k30J58l70k9J26l6l9J89j46l2l21J05K55k82j39K99k93L92m19
1682a96m9K79k40O3k86j01J33JnK01k15OK5J0j96J75k9j45J07J00k8Q4r1K99j03
1707b01k73K40r8O4K3O7K50j44q0J38O9m5J71j62M72k84k17M59j12j9O2m9j76
1730A55O4L4J55Qq6J56j70Q2j84L39m72K31Q3l9m6p8K00l45k9N6l3K1j96n5J89
$$ plain form
1569 173 263 107 158 357 126 365 334 210 626 511 300 440 362 425 421 198 297 279 305 511 280 159 345
1592 345 166 450 255 134 130 103 18 356 17 -115 -113 92 -184 -112 -7 -234 -178 -329 -309 -506 -252 -169 -287
1615 -287 -407 -299 -597 -432 -559 -602 -315 -362 -291 -145 -359 -365 -538 -408 -196 -289 -424 -375 -416 189 -96 113 -162
1638 -162 -372 -35 189 65 182 -27 -75 128 -57 355 323 304 432 188 74 464 602 247 292 442 396 501
1660 501 438 227 616 386 544 174 145 271 235 196 385 239 207 -114 -9 246 -36 -175 124 -169 223 -196
1682 -196 -245 34 -206 -143 -429 -530 -397 -396 -401 -200 -415 -409 -384 -374 -570 -395 -424 -569 -462 -362 -390 -306 -397 -98 -201
1707 -201 -474 -234 -332 -268 -245 -178 72 -72 -152 -14 55 10 181 19 491 207 -10 449 337 318 380 331 155
1730 155 219 253 408 416 330 486 316 398 214 553 81 312 395 356 310 232 432 87 58 114 81 102 -94 -149 40
1755D0J8M8j13j12P8k83j45L96k91n1J74j7j08J55K7j93J4p2M1J16j2J84k41J30
1779b17n1J68j06J01k9L5L6j01Q4o4j51J17J95nK96j85Q2l10L08Rj78N3K04N4
1803C45k76J61J0J55j82O5L77l16o6M2P8K8p0Q0k81r4K79j93L4N5j97J86P8k66
1827C2J35P1l21K1q0L7j56J54j86K81k67J1n8j33J45O8j92J88l53K41l0o9K49
1850b12J56j43J7j68L04o0k31R2K31O0r4j23K9N4j73K18M9N1L28m30K30n3k37
1873a05L33j21p1K83k05J02J14O3n6N3j00K01j06k14J21k71K98q9j49J93p4j91
1895IL43j10L6j06j97J05L14n10r1J54r8J33p8J14j26l42K78Oj66P9P7k94J43
1918c27m5J32q0Q0L5k04J41j24Q4J8K8j6J14j23R8j12L7m8J30J26l21M13m03N10
$$ plain form
1755 40 58 106 -7 -119 -41 -324 -469 -73 -364 -415 -241 -258 -366 -211 -184 -377 -363 -435 -394 -278 -290 -106 -347 -217
1779 -217 -268 -100 -206 -105 -134 -99 -63 -164 -80 -144 -295 -178 17 12 308 123 205 -105 203 212 34 87 291 345
1803 345 69 230 240 395 213 278 655 339 273 315 393 421 351 431 150 56 335 142 176 231 34 220 298 32
1827 32 167 238 -83 -62 -142 -105 -261 -107 -293 -12 -279 -268 -326 -459 -314 -246 -438 -250 -603 -362 -392 -461 -212
1850 -212 -56 -199 -182 -350 -46 -106 -337 -245 -14 46 -48 -171 -142 -88 -261 -43 6 57 385 -45 185 132 -105
1873 -105 228 107 36 319 114 216 330 393 337 390 290 491 385 171 292 21 319 230 81 274 200 9
1895 9 352 242 278 172 -25 80 394 -116 -207 -53 -151 -18 -96 18 -108 -450 -172 -166 -332 -253 -176 -470 -327
1918 -327 -372 -240 -320 -240 -205 -409 -268 -392 -308 -290 -262 -278 -164 -287 -189 -301 -264 -312 -182 -56 -377 36 -367 143
1942A43r6r3K62Po1M4j13R7K49j11j49K30j86Q3j53m9K65M0j95J88m30M79l2j50
1966B69p1K13J1k53n8K1J24k37J3J20j18P2L0l27J51j24%K2l52N47k75J35j34
1989b21j6j2O4j95O8k20M34k31rK21k44RK53k47J41j47K40k28J09m6j15K25p0
2012b37K30k1j88L75p9o3J50k55L6J51R3R9q9j25L63j79NK5l4OM7q2J11m8J63
2037D54k81J81j04j15K20k65OQ4J4k3J48j93l2r4k1O1K17k73OJ63k69o2K54m99
2061d23N39j64l27K01J12k84K79l84J41M7J5j3N6j23K98q1j39J30K2k14o6L27
2083e1k00j15L03q2q2Q2J94j44J46j20O5n0O5Q4n7M1p4K56j55Q5J07k33O0l7K30
2108C18o7j46RJ48k28R2J82j39K1M6l23J09J12k42O8p5Jk6j5q3Q6N9Jj82K33j07
$$ plain form
1942 143 47 -46 216 223 162 206 93 190 439 328 179 409 223 306 153 104 369 409 214 402 -28 451 419 269
1966 269 198 411 422 169 111 132 256 19 32 152 34 106 136 -191 -40 -164 -164 -142 -494 53 -222 -87 -221
1989 -221 -237 -249 -185 -380 -312 -532 -98 -329 -338 -117 -361 -352 -99 -346 -205 -352 -112 -340 -231 -277 -392 -167 -237
2012 -237 -7 -28 -216 159 80 17 167 -88 -52 99 192 291 202 77 440 261 266 291 257 263 310 228 339 291 454
2037 454 173 354 250 135 355 90 96 180 194 171 319 126 94 0 -21 40 257 -16 -10 153 -116 -178 76 -423
2061 -423 116 -48 -375 -174 -62 -346 -67 -451 -310 -263 -248 -261 -205 -328 -30 -111 -250 -120 -98 -312 -378 -51
2083 -51 -251 -366 -63 -145 -227 -145 49 -95 51 -69 -4 -54 11 95 38 79 5 261 106 191 298 65 125 88 318
2108 318 251 105 114 262 34 126 308 169 190 236 -87 22 134 -108 -40 -115 -114 -140 -155 -238 -152 -93 -92 -274 -41 -148
2134a48j91M10l66nJ47p9P2j95O0R0L0K3j74J06mJ7k0J40J0q2k38J34J64k27M5
2159b81K74l37L28M8j84J96m8K1K07k42qJ89R8j93mK24Q0k88K7%J73L7l16K92
2183B93j35J4J88j07J49j42j66K26L4Q8k34R4j15j30n7M4Q6j6j98J34O4k74J92
2206C2m1J06k70L5l31N9j4K87j48J27j22P3J52l23N5J3L4Q5r8R9J59j84J98l53
2230c70L3O2K03k04P2KK00K1j21KJ69j3M8N5J20Kj89j2m3J90Q1j37J39Ro7r9L2
2257A85p4R9J50M7j92O7j46j62L53N7o9k01J46k76R4K23k83J44j71j38R4K6K27
2280B00n57J87K84k94k57N69k29K7j64J61k88L8J95p7O4l2J3k42K14j2P4k25J3
2303c38K85j79RO5M2J26l24K02O2p8qJ68J44n7J39j44l4m2j61L42j38J55j7r2
$$ plain form
2134 -148 -339 71 -295 -300 -153 -232 -160 -355 -295 -205 -175 -152 -326 -220 -224 -207 -227 -87 -77 -159 -397 -263 -99 -326 -281
2159 -281 -7 -344 -16 32 -152 44 -4 17 224 -18 -26 163 261 68 64 288 368 80 107 107 280 317 1 293
2183 293 158 172 360 253 402 260 94 320 354 442 208 302 187 57 0 44 130 114 -84 50 114 -160 32
2206 32 -9 97 -173 -138 -469 -410 -424 -137 -285 -158 -280 -207 -55 -378 -323 -310 -276 -191 -289 -190 -31 -215 -17 -370
2230 -370 -337 -275 -72 -276 -204 -202 -2 19 -102 -100 69 56 104 159 279 281 92 80 37 227 308 171 310 319 252 153 185
2257 185 111 210 360 407 215 282 136 -26 327 384 315 114 260 -16 78 301 18 162 -9 -147 -53 -27 200
2280 200 -357 -170 114 -180 -437 132 -97 -70 -234 -73 -361 -323 -128 -205 -141 -173 -160 -402 -188 -200 -126 -351 -338
2303 -338 -53 -232 -223 -158 -116 10 -314 -112 -50 -128 -136 32 176 119 258 114 80 38 -123 219 81 236 219 127
2327A27J01k7n9K8m7r4J01J96k97j4r8r7K84P3J58k24J58L3k17k34K71k47K62
2350A37Lj25P7j60R5j29N6j07J2K25k39J90j00r3j47J4Q4j3KO9oJ07j58p0J37
2375a39J0J24j16k6L2j14j7K70l60K20K32J9j92K8Q8Nn6J91p9j51l3K90l73J29
2399a8M82j40j63J0j58K34j23K7K39k39K13k39J64j79J40l05L75n5r6r3J3Q2l25
2422a54K43J04j50j40N53l24p2o7j43r8K31N1Lr2n5J77r7k63J0J01m1O8J95j78
2446a38Jj54j64L52j35rP8j13K4Q7K42m9j20M0j61M31n53M08o4m4j7J38n5Qj6
2471A7J7p0L41l21J17j92L23p1j9j22L9J97O3j15o1J40J87l77M2R0Mq6q2o6NJ57
2497A57j9J50q1m7l36J94o2J1j68K10j64L02j98m39L15P8l6l44J8L42L5N8J1k48
$$ plain form
2327 127 228 201 142 170 123 29 130 326 29 15 -83 -180 104 177 335 111 269 302 85 -149 122 -125 137
2350 137 140 15 92 -68 27 -102 -46 -153 -141 84 -155 35 -65 -158 -305 -291 -207 -220 -218 -149 -155 -48 -206 -276 -139
2375 -139 -129 -5 -121 -147 -115 -229 -246 24 -336 -116 116 135 -57 -29 59 64 8 199 120 -31 -64 226 -147 -18
2399 -18 464 324 161 171 13 247 124 151 390 151 364 125 289 110 250 -55 320 265 169 76 89 171 -154
2422 -154 89 193 43 -97 456 132 60 -7 -150 -248 -17 34 37 -55 -110 67 -30 -293 -283 -182 -223 -155 40 -138
2446 -138 -137 -291 -455 -103 -238 -247 -169 -282 -258 -171 71 22 -98 -58 -219 212 -341 67 3 -41 -58 80 25 33 17
2471 17 34 -36 305 -16 101 -91 232 161 142 20 59 256 319 204 143 283 470 93 135 225 229 143 61 -5 0 157
2497 157 138 288 207 160 -176 18 -44 -33 -201 9 -155 147 -51 -490 -175 -97 -133 -477 -459 -117 -82 -24 -13 -261
2521b61J87j03j09j60K95j67Q2R6P6op6J41l47M59k84j02K88K70l49J23N7k17
2543a07L02l79L08j5J62j18J7K1k29N4mJ72j21J23j04r8J97N9L1l82K08L00j13
2566B84j98K66k26o9J00m8L0k12J90l2j29K25j89M4j17j10J00K2N1J2J5k94J92
2589i3j0n1J10q8J04j64K3m4J68l31K29r2J61k5j29q3K9K25j00J9K04l44J64q8
2613b06J32K15k66j6m0J69n0K84L1j37Q5j1j18J37q0J70l14Q8J63r0N3n4N5j83
2637A7J86j54K32j42k75K57P7n8j26r5m5J78j98L14o7k09J41j4P8j93K63l44J49
2660b8j93K10j13R4M8k97K66j52L9M0q4L78m33oK12k26O2J5J02k7J02L3j81j71
2684c10L25q5O3p4L4J72m6k36J20Q0m5P0JK67j94j59L7J8jJ16l2k29K55j91K64
$$ plain form
2521 -261 -74 -177 -286 -446 -151 -318 -236 -140 -64 -70 -146 -5 -352 107 -177 -279 9 279 -70 53 110 -107
2543 -107 195 -184 124 109 271 153 170 191 -38 16 12 184 63 186 82 -16 181 240 271 -111 97 397 284
2566 284 86 352 126 57 157 109 139 -73 117 85 -44 181 -8 36 -81 -191 -91 -69 -18 -6 9 -285 -93
2589 -93 -103 -154 -44 -132 -28 -192 -169 -213 -45 -376 -147 -239 -78 -103 -232 -315 -286 -61 -161 -142 62 -282 -118 -206
2613 -206 -74 141 -125 -141 -181 -12 -62 222 253 116 201 190 72 209 129 299 -15 73 236 146 199 145 200 17
2637 17 203 49 281 139 -136 121 198 140 14 -81 -126 52 -146 168 101 -108 33 19 97 -96 167 -177 -28
2660 -28 -221 -11 -124 -30 18 -279 -13 -165 -126 -86 -170 208 -225 -231 -19 -245 -183 -168 -66 -93 9 42 -139 -310
2684 -310 15 -70 -7 -81 -47 125 79 -157 -37 43 -2 68 69 336 142 -17 20 38 37 153 121 -108 147 -44 220
2709B20k9jq0r6K21j40K02j86k12L95j81j48K26j24J62q6j15p6J80k82K23k88
2731b15R3K02k07J47r7j38J35O3q8P3j03Q4r1j73L32j89J52K9k69K03j02Jk6J15
2755f9M9o2N1K74k71O5r3Q2r4J5Q6r4J25p1N0n7J20j70J70J38Mj94M2K3j82K10
2781A47k97L62k23P2qK2j94J44K46j98q4J56j00M8M8j2K41l89N1k8N7q4j12J72
2805C7q3q6O2P2j80J66l0M0k81Q1J42l7M7j07NN1k84K75l3lP1K66l93m5K21r9
2831a25J95K7q6j69K15r0m5qj23L11j77Q8K5J09r8P2J11k66K2J38j47J31P0l40
2855a60N44k06j89ml3J42K29k20P2N2p9q6Q3j01M5q1P3k57J36K09j20J94k66j24
2879a47J53l08M06j90J46K6j65o8J47p2M2J48k73j08p9K26no0J88l3Q7l29K35
$$ plain form
2709 220 191 190 110 14 235 95 297 111 -101 294 113 -35 191 67 229 143 28 -48 132 -150 73 -215
2731 -215 -122 80 -127 20 -77 -215 -80 -17 -105 -32 -135 -51 -142 -315 17 -172 -20 9 -260 -57 -159 -158 -184 -69
2755 -69 -20 -82 -31 243 -28 37 -56 26 -68 -53 33 -61 64 -7 43 -14 106 -64 106 244 248 54 96 119 -63 147
2781 147 -150 212 -11 61 53 75 -119 25 271 73 -11 145 45 93 141 129 370 -19 32 4 61 -23 -135 37
2805 37 -46 -132 -70 2 -178 -12 -42 -2 -283 -202 -60 -97 -50 -157 -152 -101 -385 -110 -143 -146 -75 191 -202 -247 -26 -125
2831 -125 70 97 11 -158 57 -33 -78 -86 -209 102 -75 13 38 147 49 121 232 -34 -12 126 -21 110 180 -160
2855 -160 384 178 -11 -15 -48 94 323 103 175 227 148 62 145 44 89 8 81 -176 -40 169 49 243 -23 -147
2879 -147 6 -302 104 -86 60 86 -79 -147 0 -72 -30 118 -155 -263 -342 -116 -121 -181 7 -26 61 -268 -33
2902c3J25j27L4kj81L35k25Ok21r0N00J8j82J91l9k8R6k45m9K63j26n2J77m3j14
2927a2M1o0K91l37P6K53r9N9j80K55J4k25o0M4j14L33K0k60Q5O8k13J49j5j08
2951EM8k37J04j21J44K8r7J66p7J0k64J83nk6Q7p5J70j36j64O9k30K32R8p0Q2
2976g6q2J83k39K46J11j47k67L23j55J02OQ9j07o1l97N06J58m3j51K73k25N3o0
2999D0J28L6j16l0j29K31J95l16k2kK17j06J17j95m2P0m1K25k01J26M2N2n46K89
3023B2K30j31J77m08J25O5m3j93K44k73O6p2O8j37J32j02M8q3M14n49K83J45k47
3046b19nP9rj01J89j52K44j02P5k32J55L6J89m74M78k55K05j19j6K70k57l7J54
3069I6n9J14k5k17L76kj79K4L2l4L8l9J95k63j67J99P4K7k05l0K66Kpj97m1j9
$$ plain form
2902 -33 92 -35 -1 -3 -184 151 -74 -68 -289 -379 121 139 -43 148 109 81 177 -68 -117 146 20 -32 145 102 -12
2927 -12 29 -31 260 -77 -1 252 153 212 32 287 301 76 16 60 -54 279 299 39 124 192 -21 128 113 5
2951 5 53 -184 -80 -201 -57 -29 -126 40 -37 -27 -291 -108 -113 -139 -52 -127 43 -93 -257 -188 -418 -186 -88 -158 -76
2976 -76 -158 25 -214 32 143 -4 -271 52 -103 -1 5 94 -13 -74 -471 35 193 150 -1 272 47 100 40
2999 40 168 204 88 58 -71 160 355 39 17 15 232 126 243 48 6 76 35 260 59 185 227 279 -267 22
3023 22 252 121 298 -110 15 80 37 -156 88 -185 -119 -191 -123 -260 -128 -230 -182 -265 149 -400 -117 28 -219
3046 -219 -224 -145 -154 -255 -66 -218 26 -76 -1 -233 -78 -42 147 -327 151 -104 101 -18 -34 236 -21 -58 96
3069 96 37 151 126 -91 285 283 104 128 160 126 164 125 320 57 -110 89 163 190 -15 -45 221 223 216 19 -22 -41
3095d1J13K1o0J54k39k3K84j72j51J84l30Q3K54j87j13L16J40m02J74j15O4n8
3117a04K59k42k19J97K5Or8n7J76k46J13J90M5q8N2Jo7l9L7J03l5J6J08j75J42
3142A00j38R4J59m17K48J60P9o2r9J41k19P8nJ23Ok23J21j10k4k8j41L86l11J96
3166A14l9MJ44j37j54K27l28K09q0j7K69l8l06K05J2j44p3L3J73k62K44k90R9
3189a35J71j38q6J62J21k85K0RJ07q0M8o1J23m2j52Q9K66j77O7k2r1J1k0q7L09
3214A27j80K3Rj3J2J48k3rR6N3j66J48n7n2k5P4q1Q8m2j95J54o3k29K23J64L3
3240B17j67j13J94k34M45k94P8P9l82O8L23j43j76J41o5j55K85l3k26N5J17q5
3262g1J6rJ03j02j68J7r0K26J80k40J52M1l5J92m7l15N9j13K16J5P3p7o4j08J03
$$ plain form
3095 -41 72 93 33 187 -52 -75 209 37 -114 70 -260 -177 77 -110 -223 93 233 -169 5 -110 -46 -104
3117 -104 155 -87 -306 -109 -84 -78 -176 -233 -57 -303 -190 0 45 -43 9 10 -57 -96 -59 44 9 25 133 -42 100
3142 100 -38 56 215 -202 46 206 285 223 124 265 46 124 119 242 248 25 146 36 12 -16 -157 229 -82 114
3166 114 75 79 223 86 -68 159 -169 40 -40 -57 212 174 -132 73 85 -59 -132 -99 74 -188 56 -234 -135
3189 -135 36 -102 -188 -26 95 -190 -170 -161 -54 -134 -86 -147 -24 -66 -218 -129 137 -40 27 5 -86 -75 -95 -182 127
3214 127 -53 -30 -21 -34 -22 126 103 94 190 243 77 225 168 116 91 165 84 172 130 -65 89 26 -203 20 184 217
3240 217 50 -63 131 -103 342 48 126 205 -177 -109 214 71 -105 36 -29 -184 101 68 -158 -103 14 -71
3262 -71 -55 -64 39 -63 -231 -214 -304 -78 102 -138 14 55 20 212 165 -150 -91 -204 12 27 100 23 -41 -149 -46
3287d6n5o7R7P1K6P0j16O9j9LK44l10O3Q2o3M1Q1j84O1R3j32j33K92j67J71q2
3313I0J5j75l6K49j22J50j31j85J69J93j63k9P8qj5L2j00j96l3J00J92j19j20
3336a64M6J53l2k45L34j00j31K22k67m1Q3RJ55j53J34n5J05j15nl6K9m7k14M55
3360A20r4j2Q1j4j56r8M68j94o6M0r5O5m3O3r3J47k64K80j04K5J11l82L31O9k88
3385a03R3J65J37j34k30O6k9kK09p3j7k18N1K82k7n5j09J03j79K0l9J53r3k0O6
3410A7r2j7n4O7J15j86Q0K0q6J88j50J01k56L42j58j46M8P9Q0j51p9K30j77K48
3434F3M0k24J58l6j90L30p9k09L14j69R5j74R5o1J54J5j12p1N7J9J55pk25J45
3458H3k18J56L67n15L09l21J66J1J06N8O9k80j21O1j7j07J60J38j12j41J43j1
$$ plain form
3287 -46 -101 -168 -71 0 26 96 -20 49 30 33 277 -33 30 112 49 90 171 -13 48 141 9 -124 168 1 172 90
3313 90 105 -70 -106 143 21 171 40 -145 24 217 54 25 103 95 80 112 12 -184 -217 -117 75 -44 -164
3336 -164 -118 35 3 -242 92 -8 -139 83 -184 -225 -142 -133 22 -131 3 -52 53 -62 -67 -103 -74 -121 -335 120
3360 120 26 14 95 81 -75 -173 295 101 35 75 -20 45 2 65 -28 119 -145 135 31 56 167 -215 116 185 -103
3385 -103 -10 155 292 158 -72 -6 -35 -37 172 99 82 -136 -85 197 170 115 6 109 -70 -50 -89 64 -29 -49 17
3410 17 -75 -92 -146 -79 36 -150 -70 -50 -136 52 -98 3 -253 89 -69 -215 -167 -88 -8 -159 -238 -8 -185 63
3434 63 103 -121 37 1 -189 141 62 -147 167 -2 93 -81 14 -47 107 122 10 -61 -4 15 170 163 -62 83
3458 83 -135 21 388 -127 182 -139 27 38 144 202 271 -9 -130 -69 -86 -193 -33 105 -7 -148 -5 -16
3480a6K5Q6M7k27N7m0O9l54M78k51lk17K91L2j10K9o7J53N2k27j9J65r4J67j86
3505a60J25l12K64q1Q1K7Ql6j70K72k93J74J43M1k04J28L9J34l4k37K50j47p7
3528f5J66l5P4j78K31k35QJ43MN6j18m9K18j69q2L07r1r9J76r7k40j2l2j21J66
3553g4p7J64J29o9j26J63j39N3j27N7J18j27j20K05r5%J06K1j55j59M9m0L36k62
3577a69oQ4j51M93m79R8O4Q4PJ53j96J8p9K2oJ32q7n3K69k16j26K63k31K08j40
3602d4J81K66k87j47L4q7L22r7k6j40j08J43mK08o0k9M2k5j38q4J78k07K14J3
3626A18K9q0kj80M5M7Q5r1J6l00K56r9m4K33k86PK30J31j76J90k66J21j08K6J81
3651H3P3k5j01K0R6l77M24k78j24Q8o0qp9L04j87K60N4k54L24k54R2J26j85J9
$$ plain form
3480 -16 9 95 142 -85 -28 -68 1 -353 125 -126 -129 -346 -55 -23 -133 -104 -171 -18 34 -193 -212 -47 -141 26 -160
3505 -160 -35 -347 -83 -164 -83 -56 -48 -84 -254 18 -275 -101 42 83 -121 7 46 180 146 -91 159 12 -65
3528 -65 101 66 140 -38 193 -42 -34 109 113 169 51 2 220 51 -31 276 185 86 262 165 -75 -87 -119 -240 -74
3553 -74 -151 13 142 73 -53 110 -29 24 -103 -46 72 -55 -175 30 -65 -65 41 62 -93 -252 -203 -243 93 -169
3577 -169 -175 -91 -242 251 -228 -130 -66 18 25 178 -18 0 -79 -57 -63 69 -18 -71 198 -18 -144 119 -112 96 -44
3602 -44 137 403 116 -31 3 -84 238 141 115 -25 -133 10 6 214 154 125 167 142 4 -80 98 -109 105 118
3626 118 147 67 65 -115 -70 -23 62 -29 -13 -313 -57 -156 -200 33 -253 -246 -16 115 -61 129 -137 -16 -124 -98 83
3651 83 156 131 30 50 146 -231 193 -85 -209 -121 -181 -189 -268 36 -151 109 163 -91 233 -21 71 197 12 31
3675C1J56J0N3k49k74L50J23l2m5Jq0PL0J27j69l9J40j20J07j39k50K48K04l74
3699a84K71k11J0J90p3P5j06K7KJ06l43K69J12Ll49N7J32j41o0K40l5m2j35J35
3723e0J46m12J80J91j87j72O2j00J47N4L9R1N3J65l16NK75k20J24k03j02K73R3
3746A36j28p0O1K44k94L2j51K15J94k8l2n8k05N1k68K60K03l78J17jL50j34P1
3769A87J47k21j81r5K33j77J26j69J33q1K39k19J72j07J20p5k58M65k40j87N2
3790a36j4O0p6m3J73q4j90K73nnj88J09J56p1Q3p2p9J7J49jQ2q1j01Q1j66L27
3816A98m4k49J88jJ02n6k20K4j02N2K33l06K47J92m71P9K26J37mk62M18l92J05
3839I4j00M3j08M9p1K46J63m82K43Q6l02J94j07J18n3j95J55j12K1K8M2J82m24
$$ plain form
3675 31 187 197 250 1 -273 77 200 168 123 124 44 51 81 208 39 0 140 20 127 -12 -262 -14 190 -184
3699 -184 87 -124 -114 76 3 78 -28 -1 1 107 -236 33 145 148 -201 -144 -12 -153 -213 27 -8 -50 -185 -50
3723 -50 96 -316 -136 55 -132 -304 -242 -342 -195 -141 -102 -11 42 207 -109 -104 171 -49 75 -128 -230 43 136
3746 136 8 -62 -1 243 -51 -19 -170 45 239 211 179 121 -84 -33 -301 -41 162 -216 -99 -100 250 116 187
3769 187 334 113 -68 -163 70 -107 19 -150 -17 -98 141 -78 94 -13 107 32 -226 239 -1 -188 -136
3790 -136 -150 -90 -166 -209 -36 -120 -310 -37 -42 -47 -235 -126 30 -41 42 -30 -109 -92 57 56 138 57 -44 37 -129 198
3816 198 154 -95 93 92 194 138 -82 -58 -160 -108 125 -181 66 258 -213 -134 92 229 225 -37 381 -11 94
3839 94 -6 37 -71 -22 -93 153 316 -166 77 163 -139 55 -52 66 13 -182 -27 -139 -118 -90 -48 134 -290
3862b90P3J18M8m5K04j62N9j65rJ92J3J42k46j62K34j43j9J61j28J20N9K3j25
3885d8n9j26M14j4k22m1J43N5l2j86K70Q4l18K57j25J83k47J6R5k75J81Q9o5n0
3909b1J12n8q9L14k48Q4R4j15R7r1l5L9J35l22K19r7K2j27l2R7J45k50K5J7J53
3934F8N8l30n7L20r0Lm2m85M10p1J17J01k17K08J43k64K26k38K4p0J39J9m8l7
3958a13J46r5lK69k88K91k16k5k3M7j88L55k0l95L16N5P6k22j14J33Q8j4M3J14
3982B17j03j71K37l55J04J41n6P8j14N6L7p4j76P4J26J82j71j98L58j49n9J90
4004A74qj11K9k05P5r8J63j14Q0K33j83j52P7J7J31j15J62m2Q0j25j51J64N1k31
4028i9O6J20k15L47m15K40J5j75j4J45m0m4J30r2j40L66q1q4j48k8l3J73j16J6
$$ plain form
3862 -290 -217 -99 -51 -96 108 -54 5 -160 -169 23 36 178 -68 -230 4 -139 -158 3 -125 -5 54 77 -48
3885 -48 -107 -233 181 167 -55 -96 47 102 70 -116 154 238 -80 177 52 235 -12 4 99 -176 5 94 29 -21
3909 -21 91 33 -56 258 10 94 188 73 170 79 44 83 218 -104 115 18 40 -87 -119 -22 123 -127 -102 -85 68
3934 68 126 -204 -261 59 -31 -28 -70 -555 -145 -216 -99 2 -215 -7 136 -128 98 -140 -116 -186 -47 -28 -76 -113
3958 -113 33 -62 -65 204 -84 207 -9 -34 -57 -10 -198 157 137 -258 58 113 189 -33 -147 -14 74 60 103 217
3982 217 114 -57 180 -175 -71 70 14 92 -22 34 71 -3 -179 -105 21 203 32 -166 192 43 -16 174
4004 174 166 55 84 -121 -46 -144 19 -95 -15 218 35 -117 -40 -23 108 -7 155 113 193 68 -83 81 132 -99
4028 -99 -33 87 -128 219 -196 44 59 -116 -130 15 -25 -69 61 -31 -171 195 114 30 -118 -146 -179 -6 -122 -106
4052a06J45N4j50J3J78j3P0k19N1J91Rn3n1k17K75j36l2jl29M65M1K0j5J9j61
4077D8j41J49p4j71J71P6J43l32J31K9j25N2n1%P4r0r9J07R0o8Q3j31Q8p0R6k9
4103d4J93l11J73o7J34k57M2j3R8J24j03K19k58j19L50k2j94J03j26J7K16j52
4125CK49k95J53r1M6p4P6m4N1K62n99L74j76J82n3K4n9k26m2M5K85l16M12p0R
4150A26J9j93l5J7j80O7J69r4j04J84j99Q0L54j57j37J62k00N7K38k69J1J09j76
4173a51K68j61k3J2R6K4N0k46J0K53j21j40K38j47J61o3l5m2K0L5j63P7J78m6
4197H4j08L72k38j15Q7j03J65K60k74k36K27j30K56r9O7k91K02j46K32J4k55K25
4219A96j61K9n2j87J31m5M7j63L03l6j53J04r9K1p4K09n7o0M3J33j07o3J95n9
$$ plain form
4052 -106 39 93 -57 -44 134 121 191 -28 23 214 223 170 119 -98 177 41 9 8 -321 144 185 205 190 209 48
4077 48 -93 56 -18 -189 -18 58 201 -131 0 29 -96 -44 -95 -95 -21 -111 -210 -103 -13 -81 2 -129 -41 -111 -15 -44
4103 -44 149 -162 11 -56 78 -179 -137 -150 -52 72 -31 188 -70 -189 161 139 -55 48 -78 -61 155 3
4125 3 252 -43 110 19 65 -9 67 23 74 336 -263 111 -65 117 64 88 29 -197 -239 -194 91 -225 187 117 126
4150 126 145 -48 -83 -66 -246 -179 -10 -104 -208 -24 -223 -143 211 54 -83 79 -121 -64 174 -95 -84 25 -151
4173 -151 117 -44 -67 -55 41 65 115 -131 -121 132 11 -129 109 -38 123 60 25 -17 3 38 -125 -48 130 84
4197 84 -24 348 110 -5 82 -21 144 404 130 -106 121 -9 247 148 215 -76 126 -20 212 226 -29 196
4219 196 35 64 12 -175 -44 -89 -42 -205 98 62 -91 13 -86 -65 -139 70 13 -47 -4 129 22 -41 154 95
4243I5n7j07O1Oj32J19l15M10j63j2K5K3N5l91M66k04K34j1nj93J45j55N5K68
4267B17k57j18K05J21j98j6K70n4j99j30J51J02j79n4M50m69J08K24p6j5J07l44
4289a54L67m91L07K10k63n9ql9J01o6K43j18%m7L55j70O4l81J02l1J27pl75J86
4313a47K19k50K38k15K49k70K26k07m0K32k90K30q4J65q5M2m6k85K86p7M4J27
4335F2J97m02J05J44j03R3j95j45J35l4J45J63l27K15mm1OJ15M3j15m3n3R4j0
4359D5q8J01j7o2j72L81m05J14K38k24K29q1r3k80K14K74j09j25j73L05r8J79
4381A53j71L0j54J15J0J34J68l94J43r0L5n1p2J17l31L35J63l55M20k62J16n5
4403DJ30J1l45P4K3K13k28L7K16j00p7R7P8j47Q7N7j13J1j26J94j58l1J53o6O2
$$ plain form
4243 95 38 -69 -8 -2 -134 -15 -330 80 -83 -95 -70 -47 8 -383 83 -121 113 102 97 -96 49 -106 -51 217
4267 217 -40 -158 47 168 -30 -46 224 170 -29 -159 -8 94 -85 -139 311 -158 -50 174 98 83 190 -154
4289 -154 213 -278 29 239 -24 -83 -91 -130 -29 -95 148 30 30 -17 338 168 232 -149 -47 -78 49 42 -333 -147
4313 -147 72 -178 60 -155 94 -176 50 -157 -197 35 -255 -25 -109 56 -29 13 -33 -318 -32 -109 -65 62
4335 62 259 -143 -38 106 3 96 -99 -244 -109 -143 2 165 -162 53 49 8 14 129 172 57 14 -39 55 45
4359 45 -43 58 41 -21 -193 188 -217 -103 135 -89 140 59 -34 -314 -100 174 65 -60 -233 72 -26 153
4381 153 -18 12 -142 -27 -17 117 285 -109 34 -56 -21 -72 -144 -27 -358 -23 140 -215 205 -57 59 4
4403 4 134 145 -200 -126 -103 110 -118 -81 135 35 -42 55 133 -14 73 130 17 28 -98 96 -62 -93 60 -6 56
4428E6n9r1J51mpP6j20J9q9M6J2L04k57M8r6K17k88Q8K61k20p5J3L6rJ53l78j5
4455b28K73JP1k04L1Q2j41J84j54J97j93J43mP9m56M32J6k68L02m37L05l37M89
4478A83k82q1q6M52l14r3RL47L81m87L15p29l7O17J31j16j97k03M83l31P5M7j69
4501h5M63m34l71K36J04M35n93J67l7L2J25K6j93L04l81M71l05J55k87M16l79
4522a31K13j30J92n32L86l31L20L47%j96k2j7k36J92k78K21Q7Q4m04R3j29O80
4544D09o57J21K58j52K05l15qR6l34K96kl27L6N24k57O06n22l89M79j04k71J60
4566a48J13J58K41J02m40L42m18k02O02m79J75l54L38l55M09r5M7nR8j26R7L61
4588D61l37K90l73j29Q3J0j60L12R6K95o65L34N6o97M47k49O7N67k37j74N1J91
$$ plain form
4428 56 -3 -94 57 53 46 122 2 21 -68 -22 -10 294 37 85 -11 206 -82 6 267 47 -28 -15 21 12 165 -213 -228
4455 -228 45 46 117 -87 -56 26 -115 69 -85 112 -81 62 58 137 -319 113 129 -139 163 -274 31 -306 183
4478 183 -99 -180 -266 186 -128 -221 -212 135 516 29 344 -385 -422 195 326 210 13 -190 293 -38 37 84 -85
4501 -85 378 -56 -427 -191 -87 348 -245 -78 -115 -83 42 68 -125 179 -202 269 -36 119 -168 248 -131
4522 -131 82 -48 144 -388 -2 -333 -13 334 334 138 116 99 -137 55 -223 -2 85 169 -235 -142 -271 409
4544 409 -248 -127 131 -21 184 -131 -139 -43 -377 -81 -83 -410 -374 150 -107 499 -23 -412 67 -37 -308 -148
4566 -148 -35 123 364 466 26 368 -50 -252 350 -129 46 -308 30 -325 84 -11 36 31 129 3 100 461
4588 461 124 414 41 -88 -5 5 -155 157 253 548 -117 217 273 -424 23 -226 -159 408 171 -3 48 239
4610B39m61N51l21J50m45J96k21j72N25J91m34j56J62K2K5L32J6m20L54k2L8M16
4632E65p13K39q0m2L28q5k4k42m00N04j11P7K06M36q29O38N7o19m9Qk61M17j32
4655a12j83J52L09L13m45r4L98L7k01K16J12p58K0L02M29L6m88J87P8m30p62M97
4677c87N71M8K09l18n57L89L91k63j42K62m18Q63m93KJ84k46k47O64o95m5Q6k41
4699c83j99J206j21m36k7J4l03J35N22j34k94j76O25j42o01k6J39K97j39m4m9
4720a36k2m5K21n2L22o48M96p50P72m30L61O3K24o14j79k54M29kQ11J47o04J37
4742B47l53L9P11m14j74j28L58n33O54n18M78j0n13M43j02k29J13O3j47rj98N36
4764C14r55O63l52J34L34K53J15n73L82p45O04p1k85j34L40K95k50l51j64P48
$$ plain form
4610 239 -222 329 8 158 -287 -91 -312 -484 41 232 -202 -358 -196 -174 -149 183 199 -221 133 111 149 565
4632 565 -148 91 11 -31 297 212 188 -54 -454 50 -61 16 222 658 -171 467 524 -95 -144 -136 -397 20 -112
4655 -112 -295 -143 166 479 34 -60 338 375 174 390 502 -256 -236 66 495 531 43 230 308 -122 -884 -387
4677 -387 184 232 441 123 -434 -45 346 83 -59 203 -215 648 155 157 341 95 -152 512 -183 -228 -142 -383
4699 -383 -582 624 503 67 40 54 -249 -114 408 274 -20 -196 429 287 -314 -340 -201 96 -43 -87 -136
4720 -136 -158 -203 18 -34 288 -360 136 -614 158 -272 89 152 376 -238 -417 -671 -242 -244 567 714 110 247
4742 247 -106 -67 644 230 56 -72 286 -247 407 -111 367 357 -156 287 185 -44 69 132 -15 -24 -222 314
4764 314 -641 22 -330 -196 138 391 506 -67 315 -430 174 103 -182 -316 24 319 69 -282 -446 302
4784C02m97P9p6N39l88o3J11K5Nj86M90n7N4o77Q3M31k7K49O9k56k45n18O01Q6
4808A34K81j5k64M23p65L91k91K52k14K81n93M46J30j94m39M42l91N48j1l75N18
4829B94k67o14Q05o41L75M45N68j122j41n18J84J447m47p64L30l35M89J35l13
4848i0K29l13l1m58K64Q89J8j222Q56p70O45k94P6J329j235L08O39j192R57j46
4868D59q21J163l09l05k68L04q06O85o94l58N32N03K0J87k86L55L17q80J017j024
4888b09k1j40J03J64l30O84k87K7J248r93p42R77o81p7L85j87j03n39Q66j34J94
4909B05j05O52p60O99j352J291n53J341j504K96n44J34P01l21o93J331l39p58
4927b79k96L54R74j233M66l72R38k78n22M59J07q92L77j73K44k47K66o1N55n0
$$ plain form
4784 302 -195 -116 -192 347 -41 -104 7 32 37 -149 341 284 338 -339 -256 175 148 397 466 210 -35 -553 48 134
4808 134 415 400 136 559 -206 185 -106 146 -68 213 -380 66 196 2 -437 5 -386 162 151 -224 294
4829 294 27 -587 218 -423 -48 397 965 -157 -298 -816 -632 815 368 -396 -66 -401 88 223 -90
4848 -90 139 -174 -205 -663 -399 490 508 -714 142 -628 17 -277 -201 1128 -107 201 840 -352 605 459
4868 459 -362 801 492 187 -81 223 -583 102 -592 -950 -418 85 105 292 6 361 678 -202 815 -209
4888 -209 -230 -370 -267 -103 -433 251 -36 -9 1239 246 -496 481 -200 -277 108 -79 -182 -721 145 11 205
4909 205 100 752 -8 691 -661 630 77 1418 -86 210 -334 -200 501 180 -513 818 479 -279
4927 -279 -575 -221 753 -480 -14 -386 552 274 -248 211 318 -574 -197 -370 -126 -373 -107 -168 387 337
4947C37n4j85l90L83J55J8J6m72P64m92n32M35K71J09K22l63j048J134q64Q52
4967B96n16j2K36m67P69J2m09K83M5J35l06p37J486r96J33N85m02m81J10K10K83
4988B57j34J01j71P99K83j200R5O05n17R7K6o57J375l81J4r59O67l38n38Q54L14
5009E92m75m48P23k01J62o66M83R08j127n6R57j963J523j279j85Q25j95L80M46
5028D04o58K70j01n64P39K64k89m77L41L93j46o38M07k12O82O6o70M2K84l20K92
5049A09K49k47k98j89K32j61N17o35O69Jn95J04M34L78l49n33q9N10k6L21m87
5070h5L89K4l36L61n55M81j98k91K3L87q7j6N28m10J07j92k55Q3M19q72P01j83
5092B3l06L25m47M50n22P94n26K76K5m14R4j19Q3L14n84M09J74p6l22R3L06l0
$$ plain form
4947 337 283 98 -292 91 246 264 280 -192 572 80 -452 -17 254 363 585 222 -826 308 -556 296
4967 296 -220 -232 4 -463 306 318 -91 192 237 372 66 -671 815 -181 -48 537 135 -346 -236 -26 257
4988 257 123 224 53 852 1135 -65 30 635 118 215 241 -416 959 578 592 -367 300 -38 -576 278 592
5009 592 117 -331 392 191 353 -313 170 1078 -49 -105 852 -1111 412 -867 -1052 -227 -422 -42 404
5028 404 -254 16 -85 -649 90 354 65 -412 -71 322 176 -462 -55 -267 415 481 -189 -147 137 -183 109
5049 109 358 111 -187 -376 -144 -305 212 -423 246 247 -348 -244 190 568 219 -314 -403 107 81 402 -85
5070 -85 304 328 -8 353 -202 279 81 -210 -187 200 113 97 625 215 322 130 -125 -42 377 -495 206 23
5092 23 -283 42 -405 45 -477 317 -209 67 92 -322 -228 -347 -264 50 -534 -125 49 -27 -349 -256 50 20
5114B0o3j15N26k96j69L2R7n6P84o59j9q5j94L48o6K7m5K4J47m26N3M90n80L00
5138G5m47L29K60o49L69l15K76M17O9m91L8o8K55k52l10N36k08M08n56N23k86
5159b7ON8N6m71O69l09j49J68L31o16j54O87k78K01m17M08j08k33M64k8p1J5J47
5182C49l30L18j09l21K54j02J8J09k22J28j5p1J64k34m5L41j59K13m05J76L3Q6
5204A76r4q7l54L09L99m22K12j54q1j19K72J05m13K63m21M64O0l53J92l18M09
5225D5j77K66j08k5j26J39k59J25M3J33l26M07n8j29j1k2J41j05N4OK56m25J56
5248@j21J16m2m09L31L51j51P1k65K83k9m13M50j68J1j17r7O2J52Qj91K16J0L9
5272I7m8j63K70j61J23j20j20J74p7j87J53j26K35Q3j95mJ53l53K13O6m4J05q3
$$ plain form
5114 20 -43 -158 368 72 -97 -65 32 -24 760 101 82 -3 -197 151 85 112 67 91 238 -188 -135 355 -225 75
5138 75 -372 -43 217 -432 -63 -378 -102 315 384 -107 -69 -137 118 -134 -444 92 -116 292 -264 259 -27
5159 -27 -21 37 93 -378 291 -18 -167 1 332 -284 -438 249 -29 172 -245 163 55 -178 286 258 187 202 349
5182 349 19 337 228 -93 161 59 77 186 -36 92 77 6 170 -64 -109 232 73 286 -119 57 90 176
5204 176 82 -5 -359 -50 349 -73 139 -15 -96 -215 57 162 -251 12 -409 55 115 -238 -46 -364 45
5225 45 -132 134 26 1 -125 14 -245 -120 -77 56 -270 137 79 -50 -61 -83 58 -47 7 13 269 -156 0
5248 0 -121 -5 -47 -456 -125 226 75 146 -119 164 135 -278 172 4 15 -102 -199 -137 15 23 -168 48 58 97
5272 97 49 -114 156 -5 118 -2 -122 52 -25 -212 -59 -185 50 133 -62 -66 87 -266 -53 13 -31 74 -9
5295iM15m15k04J42K4M8K24k76n3k77M34J5Q9k18L4J18r3L9k18M5K13Nl1j83j25
5320b57L21k86K52j83K1Q9J63L14k55k87J77k69L60J2j32j21J39r6K63p7j16K1
5342E3j20J49j59q0K07j10K64j76r9r3M9J58j64K68j31j52Q9Q9o5ll30K35J57
5365C6n6j61p5J64K27k37P2J70l67K99m2Q6j26J64l51J41J60q4K74j44o5k4r1
5388c0J09n7q2R1N1OM1J2m7l38K17J9j77K20J52r3J80l23n3K14ql1k46K37p2K58
5414B50k89p2R2k9N2K31m00K68n9p6k30K88K39k57j38P2K82l58J39k27L31k50
5436a41J66j94J64K93l35N6R1j12k3o3K90m13l5L23j92J01j40p5K67L4n7p8J03
5459C0O8j08p0l8J86J45p1p8j47p7J19Qj43J35p0j00K14Pj93K05Ql1Q6j40P0K38
$$ plain form
5295 -9 406 -9 -213 -71 -47 1 225 -51 -104 -381 53 68 157 -61 -27 91 -2 37 -181 -136 77 82 51 -132 -257
5320 -257 64 -222 30 -153 -132 -43 120 434 179 -108 69 -200 160 172 40 -81 58 -38 225 148 32 53
5342 53 -67 82 -77 -157 50 -60 204 28 -71 -164 -115 43 -121 147 16 -136 -47 42 -23 -26 -356 -121 36
5365 36 -20 -181 -256 -92 135 -102 -30 140 -227 72 30 116 -10 154 -197 -56 104 20 294 150 85 61 -30
5388 -30 79 22 -60 31 82 88 129 141 94 -244 -27 -8 -185 35 187 94 274 -49 -102 112 104 73 -173 64 -8 250
5414 250 -39 -111 -19 -48 4 235 -165 103 44 -32 -262 26 265 8 -130 -58 224 -134 5 -222 109 -141
5436 -141 25 -169 -5 288 -47 9 100 -12 -35 -98 192 -221 -256 67 -125 -24 -164 -239 28 62 5 -73 30
5459 30 98 -10 -80 -118 68 213 142 64 -83 -160 -41 -33 -176 -41 -111 -211 3 10 -183 22 30 -1 85 -55 15 253
5485B53m0l18M4p1K66M7k22J00R0l17J66J48l76K01J07r0O1J0q0j50M35l26k6
5508h8q6k09K99K67K8l61K87l4N8k08k2J73j45O8j16J35q4p3r5J64j05J72j30
5531a05k3J99j73J0j59L30N6j33k26L42k34K27J41j59l7j93P2qK8K49kM7k00m5
5555DJ10m15M57j57j08L51k82n4J07p6K05j32j48J31k4J87r9M5K2m2l0j81nL18
5579A84k67q4K5M54l11k50K56J11p5j56J34J05P6j90k6m1K46j10J7N3k57K19P3
5602A86k76R9p7J04R9l43O7j1K86k00j7M8L24l47Q5J4r0Q6j57K97O7k93K28o8
5626A11L4j59N3j78J30j71kM83j80q4l1p4j48K25KK8j06k9K32j07j34L59j18j77
5650d1n0P0k10M14k78K64k85J13N1J09k3o8j23P3n9J23j82J72q9J3J33k45K68
$$ plain form
5485 253 213 -105 -61 -132 134 181 -41 59 149 -168 -2 146 -230 -29 78 -12 49 59 -21 -171 264 -62 -88
5508 -88 -174 -383 -84 183 211 -150 137 103 161 -47 -69 104 -41 27 -89 46 -38 -111 -206 -42 -147 25 -105
5531 -105 -128 71 -102 -92 -251 79 135 2 -224 118 -116 111 252 93 56 -137 -65 -73 -45 204 202 249 49 4
5555 4 114 -301 156 -1 -109 242 -40 -94 13 -63 142 10 -138 -7 -31 156 57 102 124 82 52 -129 -134 184
5579 184 -83 -167 -142 312 1 -249 7 118 43 -113 21 126 202 12 -14 -55 191 81 98 151 -106 113 186
5602 186 -90 9 -68 36 135 -208 -141 -152 134 -66 -83 -35 289 -58 27 41 -49 37 -120 177 244 -49 179 111
5626 111 145 -14 39 -139 -9 -180 -182 301 121 37 6 -68 -216 9 11 39 -67 -96 136 29 -105 254 136 -41
5650 -41 -91 -21 -231 183 -95 169 -116 -3 48 157 134 66 -57 16 -43 80 -102 70 -19 -6 127 -118 150
5673A50l84L86m9q7p9L24n6o3P5r5n9NK25k08L1L7k49J47OO5k64J83J7N0o1L10
5699C57k33j3j62J64J43m61K16L75m29L16l04k8L10k11J31k99J82R7n2j82R1j26
5721a18J19n0K09j67J92j87J91k09qJ84k94J88J68k01l44M53kn4j28J48l08J82
5743c6K1j9r0L41k99J4qn1K70ro0J87m96J15M3N2k78L29M0Q1j71j44M04j08j45
5768a7O8m7j19O7qO8j16L9P0l45K15L14j91j2P1j63P0q9M9Q9P2j37o0L98m59M74
5794C01k50q3K2r9n3q1R3J83k31k3K39l7j62k0K22n5J8j13J93l29n3N04k96k3
5818a33O8K02j89K54Q2k92j50J11M2J62p9j40M8K19k83K29k01j67K92j61R7q4
5840g3Q2k13J60J11M2N6k49J02m0p5K8r0M51k73p5k0M0K59k24Q5jo1k8m0K7J60
$$ plain form
5673 150 -234 152 103 16 -63 261 205 142 217 122 63 68 293 85 116 153 -96 51 57 122 -142 41 58 108 47 357
5699 357 124 111 -51 113 256 -205 11 386 -43 273 -31 -59 251 40 171 -128 54 151 99 -83 8 -118
5721 -118 1 -49 160 -7 185 -2 189 -20 -28 156 -138 50 218 17 -327 126 124 70 -58 90 -218 -36
5743 -36 -15 -34 -124 217 -82 -68 -76 -127 143 134 74 261 -235 -120 -77 -25 -303 26 66 147 -24 -168 236 128 -17
5768 -17 51 4 -115 -48 -56 12 -104 -65 5 -340 -125 189 -2 -14 57 -106 -36 -125 -76 13 85 -52 -112 286 -173 301
5794 301 51 -32 -10 -109 -162 -243 -150 33 -198 -221 18 -19 -181 -201 21 -34 -16 -129 64 -265 -318 186 -110 -133
5818 -133 -65 137 -52 202 284 -8 -158 -47 -5 157 78 -62 -14 205 -78 151 -50 -217 75 -86 11 -73
5840 -73 9 -204 -44 67 109 165 -84 18 -22 -97 -69 -159 292 19 -56 -76 -36 223 -1 84 83 22 -6 -46 -19 141
5866A41j98K55k34n0J49Q9j13j12J01O0Ol06K39l5J8j73M3K55k88P7K32l29K19
5889D6l1r8n8O1j69K87j58J59O3k24J7K9L71l95L8K05k52J58n9r5K19j16K11l92
5913a83J63lq2mJ49L0l20K26j57K24r4J42m9Pj21k9J51p1J31k26K91q3j25K58
5937B25j74l0j27K88q1j17J99j89j3J9p4J78q4J00k24P1M8r0J00P8m4kj7j58K18
5962A00rOJ12j48k28K9L77k20j55J72j00R5K79l42J05J27r6Jk62K40q1K4p0j18
5986a62J02m4K96q0p9Mr8J20k40R1R7J56l18J35J65p8k03J44m8L11l77J40l6j9
6010b1j10R6K04j25j7j27K66j37O3k51K07P0K03l23J05M4k61J73M1j94K74m30
6032b50L93j84J44L8m9k5p7k32K15lJ76m86K85K90k61j6J16j46r2J04Q8r3J13
$$ plain form
5866 141 -57 198 -36 -86 63 152 39 -73 28 88 94 -212 27 -8 10 -163 -120 135 -153 -76 156 -173 46
5889 46 15 -83 -141 -80 -249 38 -120 39 102 -122 -105 -76 295 -100 -62 143 -109 49 -10 -105 114 -2 209 -183
5913 -183 -20 -23 -105 -109 40 70 -250 -24 -181 43 -51 91 42 49 -72 -101 50 -21 110 -116 175 92 -33 225
5937 225 51 21 -106 182 101 -16 183 -6 -19 0 -74 104 20 120 -104 -33 15 -75 25 103 59 57 40 -118 100
5962 100 91 97 209 61 -167 -138 239 19 -136 36 -64 31 310 -32 73 200 104 105 -157 83 2 26 -44 -162
5986 -162 -60 -104 192 112 33 37 -61 59 -181 -90 7 163 -155 -20 145 67 -136 8 -40 271 -106 34 -2 -21
6010 -21 -131 -35 169 44 27 -100 166 29 92 -159 48 118 321 -2 103 147 -114 59 100 -94 180 -250
6032 -250 143 -41 103 141 92 67 -10 -242 -27 -30 146 -340 -55 235 -26 -42 74 -72 -164 -60 28 -65 48
6055D8k08P1J17K60j23p6M3j90j26O8L1k6K68j61J3J4K12k22R3p1k62R1J65jl08
6080b80L28K6j9j10J92k42m0q0L05j52M9j2M4N5r8Q9j61K36j54O3p3k1J21J4r0
6105a0K22l93K72j51Q3J64lj44K18k06r0J98k1k3j04Q6O6l20J56j8P4o5m1r1R6
6130d5R5j02P7j51L8ln4K95M4j12j06j3K2j31K82k02K40P6k35j02M2k0J34rn6
6155Dk00j9L70j88O0r5n5O5J30j00J08j68N3M7j10p6J69k5j14P6NK65r7k19K66
6180A52j63N5O4k25L87k67n1KJ12r3K18k4L3j72Ko4j09K50k08J65O2j61l2J10
6204D3Qm13L46R6j56N4J13j36J1j08K06l6J01k29l07M22J39k59K36J4j16J23j58
6227fJ14N5k51J21M9L0j19L4k3q6O9k01J22J49K23m46K25j12q3J78n7k71L17k7
$$ plain form
6055 48 -160 -89 28 288 165 89 132 -58 -184 -116 -85 -111 157 -4 9 23 235 13 106 35 -227 -136 29 28 -280
6080 -280 48 74 55 -55 137 -105 -145 -225 80 -72 -23 -35 9 64 -34 55 -106 130 -24 39 -34 -55 66 80 -10
6105 -10 212 -181 91 -60 23 187 184 40 258 52 -38 160 139 116 12 98 164 -156 0 -18 56 -9 -50 -141 -45
6130 -45 50 -52 25 -126 -88 -91 -145 150 194 82 -24 -37 -15 -146 136 -66 174 250 15 -87 -45 -65 69 60 4
6155 4 -196 -215 155 -33 27 -68 -123 -58 72 -28 80 -88 -35 12 -98 -174 -5 -30 -144 -68 -63 202 105 -114 152
6180 152 -11 44 108 -117 270 3 -48 -46 66 -27 191 167 200 28 30 -34 -143 107 -101 64 126 -35 -67 43
6204 43 51 -362 -16 80 -76 -22 91 -45 -34 -142 64 28 129 -100 -407 15 154 -105 131 145 29 152 -6
6227 -6 108 163 -88 33 82 112 -7 27 4 -82 -13 -214 -92 57 280 -166 59 -53 -136 42 -15 -286 31 4
6251DJ69k1o3j95m6L3K64kk95J52M9J28j84J1J65j41m8K8J00k66J37N3N5p7J73
6276A83j17j33K7r4j6K13L0n9P0j36O3l5j89Q2L04j54n5jN2k44K93L1J10l72J86
6301C9P2J65k51j77rK54J08j74Q1lj74K23k25N6p3n9J78j94K81l24p2L35j25J94
6325A26p9o5J94j85N9j01J76R4k19m7m9mJ09l5j56L91j52j6N6q4J0J8N4k46J88
6350C7j5N6p8q2K00k1l1p1k8J02Om2L9q2J82l5m2l91L46n8k30M23k73K6J16R8
6376A52l31l4M34n8J7J6k95J42jk81J80Nn6J93k59M9P2r9R1J71j84J05R8Mj17
6401A4k8J54j55K2l4J07p4K7m4J86l16K60j72R2Q5J20k53K08m12L63M7j03R3N1
6425B38m37r1J80J63j72J31K3l70R4M43j41m01K04j66K26N8m6O7R5rr1m6J15p8
$$ plain form
6251 4 173 152 89 -106 -152 -119 145 143 -152 0 49 177 -7 4 169 28 -20 8 108 -158 -21 32 87 10 183
6276 183 66 -67 -40 -134 -150 63 93 34 104 -32 31 -4 -193 -111 193 39 -16 -17 35 -209 84 115 225 -147 39
6301 39 111 276 25 -152 -161 93 201 27 108 105 -69 154 -71 -15 -88 -147 31 -163 118 -206 -278 57 -68 126
6325 126 47 -18 176 -9 50 -51 125 219 0 -47 -96 -100 9 -26 -182 209 57 41 97 13 23 41 95 -151 37
6350 37 22 78 0 -82 118 97 66 -5 -33 69 75 33 72 -10 172 137 95 -296 50 -8 -238 185 -88 -62 54 152
6376 152 -179 -213 221 163 180 196 -99 43 42 -239 -59 -54 -110 83 -176 -127 -55 -154 -63 108 -76 29 127 131 14
6401 14 -14 140 -15 7 -27 80 6 33 -11 175 -141 119 -53 39 124 244 -9 199 -213 150 197 94 187 238
6425 238 -199 -290 -110 53 -119 12 35 -335 -241 202 61 -340 -136 -302 -76 -18 -64 3 98 89 -2 -48 67 -11
6449a1j8J26j14k00l0J77J30K23o00K95K83p8l49K50j47K30jk79J09K97k53n6
6471a6K41l43k5L1j4P4J19k63L86j01ql57J92K37j26mJ0j01J88k0l62J78J11J11
6495A38k43L86k81j51L63j9l13JP9R5j46R5KnO8o3o5j40L79j18Q3j7Q3p8j96J05
6521D2r4J90l81M99l13j75L12j54K16j4l77R7L77k53O7k1k65J56L7L2L35q7m16
6544a90L83k59n1j24L34J8j26j76J41k64J18K86K9j11j43N8M7J55J09l87L64j40
6566G1k8J49l16Q1K78k43P9K9j27P8r4J11J1j15J5K19K4j36J9j21j03J89l40L78
6590A08j34j6Q9m8r1J43p9P8k29K5O0J07n0J11p0J58p0j0k86J5K35J85l82K65
6614A14O3j75k51K99k57K50J75k1r8O2k11R0j66J14K4q8M82m06J03M1p6j00M2
$$ plain form
6449 -11 -29 97 -17 -217 -247 -70 60 283 -317 -22 261 183 -166 84 -63 167 166 -113 -4 293 40 -16
6471 -16 225 -118 -143 -112 -126 -52 67 -196 190 89 81 -276 -84 153 27 23 33 -68 120 100 -262 -84 27 138
6495 138 -105 281 0 -151 212 193 -120 -119 -40 55 -91 4 6 1 69 6 -59 -199 180 62 145 128 211 133 -63 42
6521 42 -52 138 -243 256 -57 -232 80 -74 142 128 -249 -152 225 -28 39 18 -247 -91 -54 -22 313 226 -190
6544 -190 193 -66 -117 -241 93 111 -15 -191 -50 -314 -196 90 119 8 -135 -77 -30 125 234 -153 211 71
6566 71 43 192 -124 -43 235 -8 71 100 -27 51 -43 68 79 -36 -21 198 222 86 105 -16 -119 70 -270 108
6590 108 -26 -42 47 -1 -92 51 -28 50 -179 -154 -94 13 -37 74 4 162 92 82 -204 -189 46 231 -151 114
6614 114 177 2 -249 50 -207 43 218 197 99 161 -50 40 -126 -12 12 -76 406 0 103 144 68 -32 10
6637A0J12j37o5k1L8j70K20M8Rl1O6m7r0J78k81J21n2K1m4j8L10j82k24K86n3
6662DJ01J02k83j23L66o6j1j75R6R9j88j66L28k01J71l9j41J62l7j96K71m4J24
6685A54j85J68j94K12j06J40j61p4M4J80Mk44J8P8m5j5K40k32j19Q0p8K27k4j85
6709a17J53k3j25L8N1J46k40R2Q9p9K4j67J74k1M8O8j61k6M0o0K1K08k72L74k45
6734a0J47N4j80l5M5l26K63P0k35L27k54L09k12J42j17O1J66j39n3j39K90k00
6756b6J82Nk94J01J41q8P2o4k46M10k43J26j86K39n6m2j8k5J07k30P9J64o7o2
6780b1J99j93j44L72k99J24r5KK23j43m6jL9jj29J5J14J76j57l7r6J31j66NJ92
6805F4l2k01O0K11k44J72%J69j21Q5k13J45n9j11J4PO0j0K23k02j24K30j34L6
$$ plain form
6637 10 122 -15 -80 -101 -63 -233 -13 35 44 13 79 32 -58 120 -161 -40 -92 -71 -115 -133 177 -5 -229 57 4
6662 4 105 207 -76 -199 167 101 90 -85 11 110 -78 -244 84 -117 54 15 -126 36 -1 -197 74 30 154
6685 154 -31 137 -57 155 49 189 28 -46 -2 178 182 -62 -44 34 -11 -26 214 -18 -137 -57 -135 92 68 -117
6709 -117 36 13 -112 -74 -23 123 -117 -25 64 -15 9 -158 16 -5 43 111 -50 -76 -36 -96 -75 133 -139 235 -10
6734 -10 137 191 11 -24 21 -305 -42 28 -207 120 -134 175 -37 105 -12 49 215 76 23 -116 174 -26
6756 -26 156 161 -133 -32 109 21 93 29 -217 193 -50 76 -110 129 73 31 13 -12 95 -135 -56 108 41 -21
6780 -21 178 -15 -159 213 -86 38 -57 -55 168 25 -21 -22 17 16 -113 -98 16 192 35 -2 -98 33 -133 -128 64
6805 64 32 -169 -109 102 -142 30 30 199 78 163 -50 95 36 -75 -61 -54 6 -4 219 17 -107 123 -11 25
6829B5j1K15j82j77P0P2k45K40P6j70J61j16J67P2k19j23J35J5R9k84J70j9r6
6852a25J71j12J66M9K0k81L2K37j42j48K55j9k47J94l95M14PN6j5k13K77r5J02
6875A88l75L08j04j46K1j15K48P0j06M4J75k89K84k74l0N0L1m9Q8j30l5L71k04
6898B1k05Q7j23L16j68k9kK34J45m09KJ61J21o7J6L0k46J39Q5l45K12Q2p4K27
6922B10N2k94j2k8J05l4QJ42k48J53J84l09R4q0L68m05J2l1K56m3o2j3j69L4m5
6947a55K44o0K0J0j85J24J37j14l82L43J10o2q7M3j7J14M4J28k75o2R8j37J35
6970A4l4j7J36mQ8j21j02L5m7P2j6qo7J44N7P3r9P8K4j30p9J01j9k20qK8J83j01
6998c9O3j24lK10m0q6M9R2k43n1K32K75k76j32R6k13K11R8Q8j66j2J0O1q5P3o7
$$ plain form
6829 25 14 229 47 -130 -60 12 -233 7 83 -87 74 -42 125 197 -22 -145 -10 5 104 -180 -10 -29 -125
6852 -125 46 -66 100 149 169 -112 -80 157 15 -133 122 103 -144 50 -345 69 76 132 117 -96 181 86 188
6875 188 -187 121 17 -129 -108 -223 25 95 -11 33 208 -81 203 -71 -101 -51 -20 -69 19 -111 -146 225 21
6898 21 -184 -97 -220 96 -72 -101 -103 131 276 -133 -131 30 151 84 100 130 -116 23 108 -237 -25 57 -17 210
6922 210 262 -32 -44 -72 33 -1 7 149 -99 54 238 -71 23 -57 311 -94 -82 -113 143 100 38 25 -144 -110 -155
6947 -155 89 29 49 59 -126 -2 135 21 -361 -18 92 30 -57 -14 -31 83 127 255 -20 -82 16 -121 14
6970 14 -20 -37 99 95 183 62 -40 -5 -52 20 4 -4 -71 73 130 203 104 182 206 76 -3 98 79 -141 -149 -121 62 -39
6998 -39 24 -100 -103 107 67 -19 30 122 -121 -172 60 335 59 -73 23 -190 21 119 207 41 29 39 100 15 88 21
7024B1lJ44p4l7j7N1L5o9o5l3j85J01J68J56j51K32j72m5n8j32L34l20J40J0k22
7049a91K2J45M5M8j3k15M27l60K0m1K9k08J25J78Q9J5k6k72L47k8q7r3J1K4O5
7074E6j68p0M43l35RJ04l9k36L12j1o4r7K04j76j8o8L35m1r5j93L5L04k54Q2K1
7099D0j08K23j07l1N3j26j03L7K1Q3j10Q5l3J22n5J84m79O1L22r6j4K89j41l22
7123b05J66J3q9K54m7j17n6J66l9N2J0k05L4OJ58n9j9K28j07j61k3j13P9J80j03
7148Cj5l8J9J33mo4O6k9k78J24K6q3J37J90j58N1j45j5R9j29J6J48j08K47j95
7173bl8o4K16j32k0J02k8r8K09l54J62q8k3J89j79J91r3l1K68k51J76m6r3j13
7197a40n1J65J1J55j55l7P3j46n2L22j27J0N0j43j54N00j44m6j45nN2l5MN9J18
$$ plain form
7024 21 18 162 88 51 34 85 120 51 -14 -47 -232 -131 37 193 42 274 102 57 -1 -133 201 -119 21 31 -191
7049 -191 -169 -24 21 69 56 -159 268 -92 -72 -113 -84 -292 -167 11 100 115 89 -183 164 136 49 -44 -33 -9 56
7074 56 -112 -182 261 -74 -65 39 0 -236 76 65 1 -96 108 -68 -86 -154 181 140 45 -148 -113 191 -63 19 40
7099 40 -68 155 48 17 70 -56 -159 -122 -101 -18 -128 -43 -76 46 -9 175 -304 -243 79 -17 -31 258 117 -205
7123 -205 -39 -26 -115 139 92 -25 -81 85 46 98 108 -97 -63 -57 101 42 23 251 144 -17 -40 -153 -74 106 3
7148 3 -12 -50 -31 102 98 34 100 71 -207 -83 -57 -140 -3 187 29 80 -65 -80 19 -110 -94 54 -54 193 -2
7173 -2 -40 -104 112 -20 -40 62 34 -64 145 -209 -47 -135 -158 31 -148 43 -50 -81 187 -64 112 66 -27 -140
7197 -140 -191 -26 -15 140 -15 -52 21 -125 -177 145 18 28 78 -65 -219 281 137 91 -54 -59 -7 -42 -38 21 139
7222A39n2q9j28K10j60k1K48P9l79J06o9J80j61J46r4M5j00J10q9P7o3R5j91J08
7246e3o1l7L2j19L62l32K09m7M1L7k53J83Q0q1j74J24j44K21J1j7Q0q8J00J8o8
7271B4rQ7o5r4J05L9j4k40M06l65K42j42L1J13k5j29q5L92j13j45j37J3M0J96
7295A25l75N53m13P7O5R7k68M1K3o8Q4j1L08j9p5j31J8k10K97j81OK5R6j71K42
7320A35k60J64j5k6J22j74J39k7l7J60Ok53J15r0k53L30kj62L51m08L57j20N1
7343A03o5K5k4o5J72j63R3k91J63M5J38J0N1k15M7J8J9m8O3j27K24j61l3o9K06
7368A16M0j30k24K76L6j90L71k16k1R9j57J46j55L0k16K1K22q2J32n1O7q0M9P0
7392A53j60n6J28p5j36Q6M7m7J22K4l3J64l23J27j68J66O0l02M29k93r8K65l9
$$ plain form
7222 139 87 -2 -130 80 -80 -101 147 226 -153 -47 -116 64 -97 49 -45 0 -100 10 -79 -2 -65 30 -161 -53
7246 -53 -114 -151 -119 -238 124 -208 1 -46 -5 32 -221 -38 42 -39 -213 -89 -233 -12 -1 -18 62 -26 74 92 24
7271 24 15 102 37 -57 48 87 73 -167 239 -126 116 -26 5 118 93 -36 -121 271 158 13 -124 -111 -71 125
7295 125 -250 303 -110 -33 32 129 -139 -98 -75 -143 -59 -70 238 219 144 13 31 -179 118 -63 -57 -32 64 -107 135
7320 135 -125 39 24 -2 120 -54 85 58 21 181 187 -66 49 -41 -294 36 34 -128 223 -185 172 52 103
7343 103 38 63 39 -26 146 -17 76 -215 -52 -7 131 141 192 -23 24 42 61 13 76 -51 173 12 -21 -90 116
7368 116 156 26 -198 78 114 -76 295 79 58 157 0 146 -9 21 -195 -174 48 -34 98 47 114 34 83 153
7392 153 -7 -63 65 -10 -146 -60 -13 -60 62 86 53 217 -106 21 -147 19 79 -223 206 -87 -185 80 41
7415D1K3m3p0O2l10M37j12J77k51J91Q0k75Kk80L39P4l03Q0J54K4MKPq3K37j68
7441C9j65R3rr1M09k48p2O5o1K21k52J66k42J48l9l2J33P7o2p1O8k15K04l55K42
7466d9L4qJ31l62J02K29l8k7m6J22Q3k60K49k09j8J78k10n6j6K49j79J90O3J57
7490C09l40J30l52K69K0lJ8j40J78q3j31K26k3L3j81K07l50K15m1P0P5N7L5j74
7514B4m4K0N7JN6o3r8J74J47k12p9K18l02L5r8P5QO0r4K92J6o7k49J64P5j21j3
7541a8p9J11j9o5J03j29K18j00K5n1r0M9l1J89m03K17L21j22j53M9J5J3J61j10
7565A01j79Q8l1k5Q3O8j73l4J80o3M2q0k5J61J1j21P7M2k84K63j11J83j17j1J02
7590A47k94J60k10L85k9j40Rq5R6p0J87j88j04J37P5j51p3p5J02J24k6R1j2j04
$$ plain form
7415 41 64 21 -49 13 -297 140 28 205 -46 145 225 -50 -48 -328 11 85 -218 -138 16 40 44 46 53 -30 207 39
7441 39 -126 -33 -42 -133 276 28 -44 21 -40 181 -71 95 -147 1 -38 -70 63 140 78 7 75 -140 64 -291 -49
7466 -49 -15 -23 108 -254 -152 77 39 12 -34 88 171 -89 160 -49 -67 111 -99 -155 -171 78 -101 89 152 309
7490 309 -31 99 -253 16 36 33 51 -89 89 6 -125 101 78 111 -70 137 -213 2 -39 31 106 163 198 24
7514 24 -20 0 57 58 114 51 -47 127 274 62 -17 201 -101 -66 -164 -89 -81 -21 -115 177 193 126 -123 41 116 -5 -18
7541 -18 -97 14 -5 -70 33 -96 122 22 47 -4 -94 -45 -76 113 -290 -73 248 126 -27 22 37 50 211 101
7565 101 -78 10 -21 -46 37 105 -68 -102 78 15 57 -23 -48 113 124 3 80 122 -162 101 -10 173 56 45 147
7590 147 -147 13 -197 188 159 19 28 -57 39 -31 156 -32 -136 1 76 -75 -148 -223 -121 3 -23 68 56 -48
7614d8N8J9j10K24M4l15J09K4j5J49q0L6j70L05l90K76j59l1k73K16K8J38j16
7637h1N2J29q4j76J64K49k09j05o5J00l5J64j73K21l1j05j25l6M06l83J62p5j82
7660b18K51j54J32m6K56j83N9Q6k21LO2r4J71j68J28j36k0j13N0R0N2K51k55J05
7684H8j03l6j81K45K55l47K60o2j58J57K8j58P4O2k09J29J84o0l26J64r9L44j66
7707H5j19j32L36j37l25K76M5q2M7k66L04qN3k21l1L95k22NJ01k24L3K46k74P0
7731d5j85M08p3qk88K40J55m0k34K20l72L24p9J9J76k32N3M7j69j02P0K51j58
7754b2J8pj11Q7m8J02k71L23k39P0O8J91j19k03J19L67m46K21j05J40p9Nj60j2
7778a11M15k91O5N4j72L0O6J67J33k62M0q0M5j41j20K84k53o2J65n6J09j44L36
$$ plain form
7614 -48 10 29 -81 143 187 -128 -19 5 -10 139 59 95 -75 230 -160 116 -43 -74 -347 -131 -103 35 -81
7637 -81 -29 100 16 -160 4 253 44 -61 -126 -26 -61 103 -70 151 120 15 -110 -146 260 -123 39 -36 -218
7660 -218 33 -121 11 -35 221 38 97 183 -38 -35 27 -67 104 -64 64 -72 -92 -205 -155 -65 -13 238 -17 88
7684 88 -15 -51 -232 13 268 -79 181 119 -39 118 146 -12 62 124 -85 44 228 168 -158 6 -93 251 85
7707 85 -34 -166 170 33 -292 -16 29 -53 -6 -272 32 24 77 -144 -175 220 -2 3 104 -120 -87 159 -115 -45
7731 -45 -230 178 105 97 -191 49 204 164 -70 150 -222 102 23 42 218 -14 39 86 -83 -185 -115 136 -22
7754 -22 -4 -11 -122 -35 -83 19 -252 71 -168 -98 -30 161 42 -161 -42 325 -121 100 -5 135 56 61 -99 -111
7778 -111 304 13 78 132 -40 -10 56 223 356 94 134 54 99 -42 -162 122 -131 -193 -28 -84 25 -119 217
7801B17l20J42r7R7o7K86m01J27j38L44k77L9J00Pk84K94p7Q3o9N9j97L33k53
7824e2K32j57K3J25m70N35l26j1k8K77r9j57K54k85L20n6l86M10j60nQ3J20j57
7847C0O2J04j95O6J60k37j01J42L44k22n0j45M7j11R9j9j68J86N1J57k93J60r3
7870b6K31k98L17l51pmJ11N1j43K70j13k1j21K00j26K6R5k40J72J8P4m2nk15k10
7895c57M43q9MQq8J07k6M5o9K8L2j53J20N3q2r0J63J9L9J26j73K8j13j00J23J07
7921A05m0k68J20L2r8L47l82K15K48k58k09J85Q7j03j10M0j25K68L9j78P5j26
7943a36N4j9P4PL77l87o7K1M23o4m10J01j60K36P6k07M0K17j24p5O3J4r7J26k6
7968E7J13k33L49j80jl11pJ35J06Mm1K4L32m87J25p5J10M0l9J91j61mL1n6J26
$$ plain form
7801 217 -103 39 -58 39 -28 258 -143 -16 -154 190 -87 -48 52 59 -225 69 -8 75 6 65 -132 201 -52
7824 -52 180 23 46 171 -299 236 -90 -101 -129 148 49 -108 146 -139 181 125 -261 149 -11 -16 67 187 30
7847 30 92 196 1 67 227 -10 -111 31 375 153 103 -42 5 -106 -7 -26 -194 -8 43 200 -93 67 -26
7870 -26 205 -93 224 -127 -134 -138 -27 24 -119 151 38 17 -104 96 -30 -4 91 -149 23 41 115 73 68 -147 -357
7895 -357 86 -3 1 9 -79 28 2 47 -22 6 38 -115 5 58 -24 -114 49 68 107 233 60 88 -25 -125 -2 105
7921 105 65 -203 -83 -51 -149 198 -184 31 279 21 -188 -3 84 -19 -129 -89 -214 54 93 -85 -10 -136
7943 -136 -82 -101 -27 -20 357 -30 -97 -76 347 283 -127 -26 -186 50 126 -81 -41 176 52 -23 40 54 -43 83 57
7968 57 170 -63 286 106 105 -206 -213 -78 28 32 -9 15 347 -140 -15 -90 20 60 21 212 51 47 78 22 148
7993A48oj50J92j77N1j4j77K30j63j86K86j12N6M8l0J16k18P5l2kK21k08p4L20
8017A94j33j64J14j0l9K19l13K61j05P5q1k61J82o9M8P2Q6M1j09K62l0m02J40
8040b2R8o5ln9l6J61j50N2K13j29j33J64j8j61L2L0J45j30k0j98J84l1L2N3K59
8065B68l57N5J1N3k67J06J98oj5M5l07J90OJ0Q3m9o1j49J23j69j53K51qp3J67
8090d8k4J10j06J0K55k14K18j81J0M4q2P5q1o0J4M6J50k71L4L04l45J39K7J3Q8
8115A25j54K28o2j92J13l82M04M8k08M5k4M4K27k39J81l9k43K6n3L28j61P5J4
8138A01J86k73J17k52j0K07j00n0O1P3j55M7J20k38O4L12j96O0j27J84n0q3J31
8161A29j53m7K41q7M3o4j87J60o9RJ8K25k40K56j91k44L56j86J71j93L2k03J71
$$ plain form
7993 148 142 -8 184 7 58 44 -133 97 -66 -252 34 -78 -22 26 -4 112 -106 -31 -63 -65 156 -52 -126 194
8017 194 61 -103 11 1 -38 181 -132 129 24 99 18 -243 -61 -130 -82 -10 76 117 8 270 240 -162 -22
8040 -22 76 11 8 -51 -87 74 -76 -24 189 60 -73 91 73 -88 -56 -26 119 -11 -31 -229 -45 -76 -44 9 268
8065 268 -89 -34 -23 30 -237 -131 67 61 46 91 -216 -26 -20 -10 73 24 -37 -186 -63 -232 -385 -134 -142 -215 -48
8090 -48 -72 38 -68 -58 197 -17 201 20 30 74 -8 67 -14 -74 -60 -14 136 -135 -101 203 -142 -3 24 37 125
8115 125 -29 199 137 -55 58 -324 80 128 -80 -35 -59 -15 212 -27 154 115 -128 -102 -155 173 12 87 101
8138 101 287 14 131 -121 -131 76 -24 -74 -13 60 -95 -48 72 -166 -102 210 14 74 -53 131 81 -2 129
8161 129 -24 -71 170 83 126 62 -125 35 -34 -25 -7 218 -22 234 43 -201 155 -31 140 -53 -21 -224 -53
8184e3K10j56j42J58j5L6q3
$$ plain form
8184 -53 157 1 -141 17 2 38 -45
8191d5
$$ Imaginary data points
##PAGE= N=2
##DATA TABLE= (X++(I..I)), XYDATA
0@%%%%%%%%%%%%%Qj6J6j6K4l2L2m0N2o0P2q8J04j20J36j57J81k08K40k72L09l52
35a87L98m47N03n65O30p02P81q67R62j066J180j304J440j589J748j925K121k335
53a224K575k841L137l472L852m287M791n384O095o963Q047r453J1360j4114J8504
68A0623k7015P5718j48498J06122Q5349k12190J68288j7412r8243R8605p674p4164
80d0491M9803K7984m2877J1737K6557p2936M3989p58m4660O5373l9145J588K6015
93A2179q7001Q8880m97q5645J00996k7620o0274O9073l1829l3769N8318R724o7449
106e4914L7716K8253q8105P8147J7707r5930J08306l4385p4313J00746n4243p130
118c8145N8509n3093K8143k957k8047L7967j4630P199R588j8596K627K01R122
$$ plain form
0 0 0 0 0 0 0 0 0 0 0 0 0 0 0 8 -8 8 -8 16 -16 16 -24 28 -32 40 -48 56 -64 72 -85 96 -112 128 -144 165 -187
35 -187 211 -236 267 -298 332 -370 411 -456 506 -560 620 -684 756 -833 915 -1010 1111 -1224
53 -1224 1351 -1490 1647 -1825 2027 -2260 2531 -2853 3242 -3721 4326 -5127 6233 -7881 10623
68 10623 -16392 59326 -89172 16950 102299 -109891 58397 40985 -57258 41347 33673 -40491
80 -40491 9312 37296 -5581 6156 32713 -40223 3766 3008 -41652 23721 -15424 -13836 12179
93 12179 -74822 14058 13561 -72084 28912 1292 -58982 10091 -21738 -55507 2811 12535 -54914
106 -54914 -17198 11055 -77050 1097 18804 -77126 31180 -3205 -77518 23228 -31015 -38145
118 -38145 20364 -32729 -4586 -7543 -35590 2377 -12253 -5054 4534 -14062 -11435 -11234 -2112
131b112j0019J4274J1521k8502K6782j7032j7775M7502k9183N012K3196l7363
143a3699K0618j702j0182K6145j9130O176M545j7899J2046R01K753J40N147j744
157A4115k3911K5561p054j3766L9296l3154l141K9626m0076J9466J3582k4216
169c672K4383j4343q036J3696j7962J6618N267j8746J5048k978k0334J6515J0691
182A6147k4854J7633J3774m3806K5936J6943m8640M1796J0378n1751L9090l45
194A2301l9721L9358L483l1830K5487K726l1773K1055R110k5110K2529J433k4808
207a5760K0368q543p731K1895j7503O332Q309k7639K1905J716k3908L2756q462
220C735k7508L3504j2205k6182M1545r911k8494L9421j5753k9700M3876j3661
$$ plain form
131 -2112 -12131 2143 13664 -14838 11944 -5088 -22863 24639 -4544 468 23664 -13699
143 -13699 6919 5217 -4965 21180 2050 8226 12771 -5128 6918 7819 10572 10712 15859 14115
157 14115 -9796 15765 8711 -5055 34241 1087 -2054 27572 -12504 6962 20544 -3672
169 -3672 20711 6368 -1668 12028 -5934 10684 15951 -2795 12253 9275 -11059 5456 16147
182 16147 -8707 8926 22700 -21106 4830 21773 -26867 14929 25307 -26444 12646 12301
194 12301 -27420 11938 15421 -16409 9078 11804 -19969 1086 10196 -14914 7615 9048 -15760
207 -15760 4608 -3935 -11666 10229 -7274 -942 7367 -20272 1633 3349 -20559 12197 3735
220 3735 -23773 9731 -2474 -28656 12889 2978 -25516 13905 -1848 -31548 12328 -1333
232a333k4077M1426j8382k3746L5408j6043j4472L2673j4567j2997K3002j5346
244h454o974K1870j2266p00J3396j6591L196Q691j2729J2291L233j3585J3194
257D572n231j1019J8867o005p204J8414j2443q213J8582j2446j936J9568j5334
270A72j958J3878j5029K012J3852j1202K025Q182j2380J450Q670q218L297P840
284A2591j0680P78N814r510N511O510r204L733J479p981L798K791l585K117J606
299E768m841j450K591r34q08M024j942m488J912r06k733M375J877n840K383N28
315d84o067M409K501n295M542j198m961L227j205R81K110k614K148k334k674N542
331a372k789j009O868n437l257P599n112k249J0346n621m391J0389p030n179J3713
$$ plain form
232 -1333 -25410 16016 -2366 -26112 9296 -6747 -21219 11454 -3113 -16110 6892 -8454
244 -8454 -15428 6442 -5824 -6524 6872 -9719 -6523 2168 -10561 1730 4963 -8622 4572
257 4572 -659 -11678 7189 1184 -6020 12394 -49 -8262 10320 -2126 -4062 15506 172
270 172 -1786 12092 -2937 -925 12927 1725 3750 11932 -448 1002 9672 1454 4751 12591
284 12591 1911 2689 8503 -1007 4504 11014 1810 5543 7022 -959 2839 5630 2045 4162 5768
299 5768 927 -523 2068 1134 326 4350 2408 -2080 -168 -1074 -3807 568 2445 -3395 -1012 -484
315 -484 -6551 -2142 359 -4936 -394 -1592 -6553 -3326 -4531 -3550 -1440 -4054 -1906 -4240 -6914 -1372
331 -1372 -4161 -5170 1698 -3739 -6996 603 -4509 -6758 3588 -2033 -6424 3965 -3065 -8244 5469
346E469o466m883J2945q529n139J3065p741l254J3522r031m105J1409q842j453
360c033J1296q436n55P961q945J676O138p032L742K484o727M293Jm282N867j641
376B807l721O243m947k436P023m991j104O835o653j305O825o440j105Q258p411
391b122j047Q100q657l70R357r137P89Q166j0391K473P219r774M132N317r384
406e329M177L413o710L950K188n244L253J414m107K664J000k832K415M22k466
421a792K227J58j889K313m67j077K313j576j009L442k061j112L584l104n26M382
437C806m705R34M743o153K075L487o485L717K250n864L729J112m593L116M81k809
453a159K038M38k562O69J997k633jK842l081L55K381l855J757K606m789K104J442
$$ plain form
346 5469 -997 -5880 7065 -1464 -6603 6462 -1279 -4533 8989 -42 -4147 7262 -1580 -3033
360 -3033 8263 -173 -728 7233 -1712 -36 6102 -930 2812 5296 -1431 2862 2863 -1419 4448 2807
376 2807 -914 5329 382 -2054 4969 -22 -1126 5709 -944 -2249 4576 -1864 -2969 5289 -2122
391 -2122 -3169 4931 -3726 -4096 5261 -3876 -3087 5079 -5312 -2839 4380 -5394 -1262 4055 -5329
406 -5329 -1152 2261 -4449 -499 1689 -3555 -302 1112 -2995 -331 669 -2163 252 674 -1792
421 -1792 435 593 -1296 1017 550 -527 1786 210 -799 2643 582 -530 3054 -50 -576 3806
437 3806 -899 35 4778 -1375 700 4187 -2298 1419 3669 -2195 1534 2646 -1947 1169 1650 -1159
453 -1159 879 1317 -1245 -576 1421 -1212 -1213 1629 -1452 -1097 1284 -2571 -814 1792 -2997 -893 549
470E49l492K692K63l127L365o10k648K811o53j294K743k081k63K446k242N90J461
487E10k015J789j59j684J678K67o67O80O7op39J288n94q47L401k883o88L969m433
506a066J355L267n314L097J663m981L682K98l049L542q19k192K042p45j293J591
522A078j34r27Q35l92r82N56K98q75Q69l54j223L47K47o55O38O56j804J129l30
541a023j717K762j096j354L298l408j3L135l736K475J259l865L402j163j668L078
557C66j258N0J250j226M3J43L54L11l6Q22r53K60N49r38J294P13j337J104k21
576A290j182J406L36p26J371k45k069J689l80r95K585j485l35J353k484J079Q16
593B024j702J831p85j091P62j111Q20J73m29N84j448qL99r48J319m93q16J048
$$ plain form
470 549 -2943 -251 12 -3115 250 -360 -3008 -197 -850 -2144 599 -1482 -1745 701 -1541 -951 510
487 510 -1505 284 125 -1559 119 386 -281 399 466 460 -279 1009 415 -432 2969 86 -602 3367 -1066
506 -1066 289 3556 -1758 1339 3002 -1979 1703 2001 -1048 2494 1675 -517 1525 780 -513 1078
522 1078 944 17 852 460 -522 34 332 -543 326 -28 -1251 -904 -657 -1312 -674 -18 -1822 -693 -1023
541 -1023 -2740 22 -1074 -2428 870 -2538 -2551 584 -3152 -677 582 -3283 119 -1044 -2712 366
557 366 -892 -842 408 -818 -775 -632 -278 33 -3 819 -134 126 675 -263 1031 1744 407 1511 1290
576 1290 108 1514 1850 1124 2495 2250 181 1870 1490 495 3080 1595 1260 2613 129 1208 2024
593 2024 322 2153 1368 277 1039 -72 748 921 492 1076 -372 -380 19 -929 390 -103 -919 129
611A29j806O2J026j209J373l4j752Q48n14p40J550J24j131Q43r45l41J210q76
629b183N61J023j269K24j82l46J409k70N14k01p99P11j34J66R93o27O86j26q44
648f94R56j69M79Q19m15k66j94k28O22M38Q9K82l43l84Q3N2O61N71n34k53j44
669A428o83Q22k83K77P60j613Q4L66j135J684m22p91R07j491r9Q59q86J088m40
688D32o10P1o59j42L21M42j75k73j45m25j84Q09m34N07L4p59q6k99P78j45L38
709f04K80j039O46l07l42J601r32M41L13j559J052J05j38J512j248J49K58r95
727h07R67J69J77N14j296J111p14O9P99m78P34k61j167J010o28Q2J132q58K64
746H19j96l70k31N13M0m63P65r36j002J770j377M27J546k186P27L29j704J610
$$ plain form
611 129 -1677 -1615 -589 -1798 -425 -459 -2211 -1363 -1877 -2617 -1067 -943 -2074 -1231 -2176 -2517 -1307 -2183
629 -2183 -1622 -599 -1868 -1644 -1826 -2172 -763 -1033 -519 -720 -1519 -808 -942 -776 217 -410 276 150 -694
648 -694 262 93 572 1391 976 710 516 288 910 1348 1437 1719 1376 992 1075 1127 1788 2359 1825 1572 1428
669 1428 745 1567 1284 1561 2321 708 792 1158 23 1707 1285 494 1401 -90 -189 670 -216 872 432
688 432 -178 -107 -766 -908 -587 -145 -320 -593 -738 -1163 -1347 -538 -972 -465 -431 -1190 -1276 -1575 -797 -942 -604
709 -604 -324 -1363 -717 -1024 -1366 235 -697 -256 57 -1502 -450 -345 -483 1029 -219 -70 188 -807
727 -807 160 329 506 1020 -276 835 121 190 989 511 1245 984 -183 827 199 281 1413 555 819
746 819 623 253 22 535 575 112 877 -59 -1061 709 -668 -241 1305 -881 -154 175 -1529 81
764H1k48j39K14r25L57n31O44N5k29J091j296j36R63j574J445M26j144J435j036
783e47r74J710q27M77Q01q06l06N77l32L9J274l50j008J391r71k80J762j157M44
802I17J004j951P20L34m73J197m77p06L86O4n59J9J127r57J48R01k161Q37M55
821H25j262J714k38j728J245p69m89J096k68j62L2n65o76N30K69m18Q88q42n95
840a413O12o76J82Q91q41L11j00r57M60M47J0l1N74q29l40R05m96J83J233j302
860a177K22R87j836J261Q52j016R03N6j108J022L30o24Q75L21q32K67M85r63J020
879A045P03r61L89N11j337O17O39r98J042J49j622J172q7j034J756o86p26J374
897A946j348m77J456j388L98J240k083N73O57j801J233O49j819P84O6j687J484
$$ plain form
764 81 -167 -306 -92 -1017 -660 -1191 -547 -492 -721 370 -926 -1062 -99 -1673 -228 198 -946 489 -547
783 -547 -1521 189 -638 -161 640 -166 -472 105 -227 -188 1086 736 -272 1119 148 -132 1630 473 917
802 917 1921 -30 690 1024 551 1748 1271 565 951 1015 456 475 1602 645 793 1694 -467 370 825
821 825 -437 1277 1039 -689 556 -213 -702 394 126 -36 -4 -569 -1245 -715 -446 -864 24 -818 -1413
840 -1413 -801 -1477 -1295 -404 -1245 -934 -1034 -1991 -1531 -1084 -1074 -1105 -531 -1360 -1700 -795 -1291 -1108 125 -1177
860 -1177 -955 32 -1804 -543 309 -707 196 252 -856 166 496 -128 747 1068 236 503 988 25 1045
879 1045 1748 787 1176 1687 350 967 1606 608 1650 1799 177 1349 1262 228 1984 1298 572 1946
897 1946 598 121 1577 189 587 1827 -256 317 974 -827 406 1055 -764 20 86 -1601 -117
914a17L48j484J101J91j942J240N45j775J265N78j932J333R9j848K058l0j923
931b293K139q80j177K250j022o71K203j697l57J492j460R80J096j348L91M98r27
948g83P27M61r42R00K27r80R09k49o96J045L69m77J27L7r41J051M49j349J176
967A061J49j577J616j51j611K154p10r48J261j116m14J667j013k12P12q70k09
984b11P17l24m95M93J14o37K85l48m20P84K19p95R0n2l93R43l18o51J099n52q7
1005e39P28j130M19J004j133N58K16j295J375K11r62J056l74n30P64J54o39M21
1023C04M59m05j5J16p36N54R78j220P06J63j358J597j20j390J629m70j171J571
1041A192q88p64J849q35r08J539j480k43J431j327O20O68j828R65O8q61N88Q7
$$ plain form
914 -117 231 -1253 -152 39 -1903 -663 -118 -1893 -628 -50 -1982 -649 -550 -2398 -340 -370 -2293
931 -2293 -154 -1034 -2211 39 -983 -1654 549 -1148 -1505 -13 -1473 -493 603 -745 -354 144 -783
948 -783 -56 405 -537 363 590 -390 519 270 -426 619 988 511 638 675 -266 785 1234 -115 1061
967 1061 1210 -367 1249 1098 -513 1641 931 -17 1244 128 -286 1381 368 156 868 -2 -211
984 -211 506 182 -313 180 294 -343 -58 -406 -826 -42 177 -618 -528 -580 -973 -30 -348 -999 100 -452 -539
1005 -539 189 -941 -522 482 -651 -93 123 -1172 203 414 -548 508 134 -396 368 522 -117 304
1023 304 763 358 343 459 -277 277 1255 35 741 904 -454 1143 1023 -367 1262 792 -379 1192
1041 1192 304 -460 1389 554 -354 1185 -295 -538 893 -434 186 854 -974 -9 59 -802 -214 -127
1059a27m36L93j56k80r9O65j027P39R5j309R34K59j265J307j77j218J573r12p48
1078a789K124j130n70J852j504m60J837r50m18J743j564J72J441j436L67Q69j086
1095e02J039J69j045P53R9p0O01m16M9k05M86m29P5Q48p79K50K34r25R80j87q49
1116A76J583j139k88J111j096J63O04p23K2K54m16k05O33p87K19Q20j366K37N23
1135C25o67K59L10r29K52J47k11j69J47L22o06M64k45o83J116n78k38Q79j201
1154a306N62K48p57P35m9l14N03j95j75J6J12L28p0L45n49L29N35p87M61O5l06
1175b69O66j68k14N20k80J19J08L2oJ78k21k54Q16l13n27P90m14l14J040j253
1195C6K16J048j364M95M21q42N84P2o30J84K75n58QN89p44o7Q25j096J18N86j005
$$ plain form
1059 -127 -563 -170 -326 -606 -705 -40 -1067 -328 -233 -1542 -608 -349 -1614 -307 -484 -1702 -129 -1041 -1789
1078 -1789 335 -795 -1365 487 -1017 -1477 360 -590 -1008 735 -829 -657 784 -652 -285 584 -502
1095 -502 537 706 -339 414 513 443 1044 628 677 472 958 529 604 1452 673 923 1157 232 1212 1025 176
1116 176 1759 620 332 1443 347 510 1114 391 413 667 251 46 679 -108 111 931 -435 -198 325
1135 325 -342 -83 227 -702 -450 -303 -514 -683 -536 -214 -820 -356 -601 -1284 -168 -746 -984 -105 -1306
1154 -1306 -744 -496 -1253 -518 -567 -881 -378 -573 -748 -732 -620 -292 -362 -17 -566 -237 298 -489 -28 37 -269
1175 -269 397 229 15 535 255 374 482 514 508 686 465 211 1027 714 187 977 563 249 1289 36
1195 36 252 1300 -64 431 852 10 594 666 36 220 495 -63 -55 534 -210 -277 548 -548 -430 156 -849
1216h49Q78q6p47Q44n77j7M16n50K38K00l39l21M18L4l98P56n52j25R67q81J36
1237e55P78j097P71M16q02L41K99m03K77L16l74q4O10m82oO11o56M65N91r81M12
1258D47K77o02N60M7m11K87j63l33N86j1m5K6j63l04N25j53m22L72m34L9L33m75
1280a7J85J47l60O9j61%R9J71k81j79N7l82K07L11m18P0M67r86M45J28o94P67
1302c55M4n41J95J05j42M25k84m1L20P0k28O1J08k10M81n7o4K04l7k21K16K55
1324C04j43K48j73R7j86L01j89K24k11p9M98j06j38L65l67N5K79o25O07j20m48
1345A93M47k52M7J24l59k20K79O9k50m4K94l48M3J30k97J40j59J7l05J67l33K44
1367c73K64n15L84o7m86L70Q1l73M54k74k84N54m45K16L12j74N9p4j23J10K5J51
$$ plain form
1216 -849 29 -57 -804 40 -537 -554 -138 -688 -450 -250 -589 -910 -492 -458 -856 -100 -652 -777 190 -691 -555
1237 -555 223 -874 -103 313 -489 -148 151 -252 25 341 -33 -117 493 11 5 616 -40 425 1016 35 447
1258 447 724 122 682 729 318 605 442 109 695 684 639 665 502 198 723 570 148 520 86 125 458 -17
1280 -17 168 315 -45 24 -137 -137 -38 133 -148 -327 -270 -652 -445 -134 -552 -482 -15 -1001 -556 -428 -1122 -355
1302 -355 -311 -852 -657 -552 -694 -269 -553 -594 -274 -204 -432 -371 -263 -473 8 -49 -113 91 54 -167 49 304
1324 304 161 409 236 333 147 448 259 483 272 193 691 585 447 812 445 500 779 154 761 641 193
1345 193 640 388 435 559 200 -20 259 328 78 34 328 -20 23 153 -144 -4 -163 -146 -451 -284 -617 -373
1367 -373 -109 -624 -240 -307 -793 -423 -342 -715 -261 -535 -819 -265 -710 -494 -182 -356 -297 -371 -494 -384 -359 -208
1389b08N5n5L4o1L83j91R9P5l3J76n7j4o7M03k55J51Q7l12K13O8j39L68J36n21
1413C35M11j75j19K28j8j73J21l15qL93m41J59lj41r1k64M47m2m31J95j79j40
1435b51M07n33L62j67k18J67l23J98P2l05K07j1m46L18N3k15L65j08l41L60n4
1456d63l35K74j86Q5M54m87N14m58J37L24j86K36o0nO5R3l9Q8K7qK27m37M73J48
1480D81j57K64k21m9J88k65R5L37l94K24K6k95N26l95J2K61n2j00j89L7J06j75
1502B65k8K43j85r6j86P5J23l12L9K40l10k31K46j24n7j03O2l8K62n25N41j99
1524b98k60K98l17K30k02J7K64k44n1M88l10Q0m1o4N65n40q5L36j98O2L63m39
1546c46M87j72m6L60k66K05k15l3L00J87l17J74J28k89K74p9j81K46K1j32K70
$$ plain form
1389 -208 -153 -208 -174 -235 148 -43 56 131 98 274 217 203 136 539 284 435 522 210 423 491 352 720 856 335
1413 335 746 571 452 680 662 489 610 295 287 680 239 398 395 254 163 -101 346 304 -127 68 -111 -251
1435 -251 156 -377 -15 -182 -400 -233 -556 -358 -286 -591 -384 -395 -841 -523 -470 -685 -320 -428 -769 -409 -463
1456 -463 -798 -524 -710 -625 -171 -658 -144 -602 -465 -141 -327 -91 -151 -156 -91 2 -37 51 78 70 297 -140 333 481
1480 481 324 588 367 318 506 241 336 673 279 503 529 234 760 365 377 638 586 486 297 334 440 265
1502 265 237 480 295 199 13 88 211 -101 -62 178 -132 -363 -117 -241 -298 -401 -339 -377 -115 -640 -99 -298
1524 -298 -558 -260 -577 -347 -549 -532 -268 -512 -563 -75 -385 -305 -346 -410 155 -385 -470 -134 -332 -270 93 -346
1546 -346 141 -31 -77 283 17 222 7 -26 274 461 144 318 446 157 431 352 171 417 438 306 576
1567E76k62J42j08j20K44k82J97m3l84M18k54m87P08m07m1M60l96k9j62m4M94
1588B20n44k0R4k33L99m14K4K11J38k97R1l82J61L0J28rJ88l28K42Q%K8j3l8J77
1613a39j68j01P3J87J58j03K05q7j84J63J1K42j54oj81L06j29J79J27j68J27Q1
1635D39J51j19j37k4K61Q6k96O4l20L41L9r2m5J60n2l30O7J71j82J1O8p4j41Q5
1659A31J19k78M1J61n15J58j06m1Q8j14Mk22q7K44Q9j13n6j17K68L00m32j5J86
1682c07k30L55j74j47P9P8K04k1qn2MJ50p0R0J72j05j30L95j51j03j19N32l47
1705I5K22P3j95K6L72l64p9L00O2r2k97P9J12K64j34j97P0k66K71J36l80Q0k47
1728h9J44J03p6o0J38j25j6o7lJ0J22k83j4o6K39k10J65r7k06J58l50N19l44J82
$$ plain form
1567 576 314 456 348 228 472 190 387 344 -40 378 124 -363 345 -62 -103 357 -39 -68 -230 -274 220
1588 220 -324 -344 -250 -483 -84 -498 -474 -263 -125 -422 -331 -713 -552 -522 -394 -403 -215 -543 -301 -293 -293 -265 -278 -316 -139
1613 -139 -307 -408 -335 -148 10 -93 112 25 -159 4 15 257 103 97 -84 222 93 272 399 231 358 439
1635 439 590 471 334 310 571 657 361 425 105 446 485 393 348 508 456 126 193 364 182 193 261 187 46 131
1659 131 250 -28 13 174 -341 -183 -289 -330 -242 -356 -352 -574 -661 -417 -328 -441 -497 -614 -346 -46 -478 -493 -307
1682 -307 -537 -182 -356 -503 -424 -346 -142 -163 -171 -223 -219 -69 -139 -49 123 18 -112 283 132 29 -90 442 95
1705 95 317 390 195 221 593 229 150 450 512 420 123 202 314 578 444 247 317 51 322 458 78 158 -89
1728 -89 55 158 82 22 160 35 19 -48 -51 -41 81 -202 -216 -282 -43 -253 -88 -185 -391 -233 -583 -64 -408 -226
1752b26j24J01r6M5j32r6J07J81j52J24j8J0K99p4j36J61o7J23p9J33p1J38Mj71
1776a6N3J43j64K49M2j86Q7J58l5N5q8j6N1J76k23K21j71p2Q2j35J09q2J02m8
1800B92q4j9M2N9k33J00N7J3r2l02R8J54j84j10L48n58L18j9k6K11l68J35l02
1823d70L5K77j72o7M9j38L53k41o9K20k3j4J07j09k48K98M7k5Q3j9o6J64j83L54
1847A43j03j65K53k23K16N7j59J82l2Q2%o6J08k35L10M0l39J89K59m75K26Q4j43
1870B09L10j60j49K07l32J39p2J68k50J1J0o7L2R4l9r4N6k12L0l4J78m82J88R7
1894a62j7qJ10j32O7k24J20l2K5j46m2K50O7j61o2J41j97K36j85J91J49k57J48
1917a21J98k93k6R8R6k06L83q9j87J38J26J85j93Q5M9r7Q3M4Q2j96N5K1o0K48
$$ plain form
1752 -226 -350 -249 -345 -300 -432 -528 -421 -240 -392 -268 -286 -276 23 -51 -187 -26 -93 30 -49 84 13 151 155 -16
1776 -16 37 180 16 265 307 121 208 366 331 386 298 282 333 509 286 507 336 264 346 211 320 238 340 292
1800 292 208 189 231 290 57 157 214 227 135 -167 -69 85 -99 -209 139 -419 -101 -120 -146 65 -303 -168 -470
1823 -470 -435 -158 -330 -397 -348 -486 -133 -374 -443 -223 -246 -260 -153 -262 -510 -212 -165 -190 -107 -126 -192 -28 -211 143
1847 143 40 -125 128 -95 121 178 19 201 169 251 251 185 293 58 368 408 69 258 517 42 268 352 209
1870 209 519 359 210 417 85 224 152 320 70 81 91 24 56 150 111 17 73 -139 -109 -143 35 -447 -259 -162
1894 -162 -179 -187 -77 -209 -142 -366 -246 -278 -253 -399 -441 -191 -124 -285 -347 -206 -403 -167 -352 -161 -12 -269 -121
1917 -121 77 -216 -242 -144 -48 -254 129 40 -147 -9 117 302 109 194 243 146 229 273 355 159 214 235 175 423
1941D23k28l5K76J24m92R6L55m04J22N1k93O6j25L83r4k19J40j30P5No6l10J90
1964i0M6R5l36N4p7Q6n1n1J43k1l4j0j77J28k62N28l08q9J99q9K17k3l95L13J7
1989a87J25r3o9M9J83J0l65K35o5J4K13K1m7N0n0L37j71j08J78l09N34l09K2J55
2013C53m8p6R5r7J31j32o9L42k68J08k9q4M3k7q8J34j86p0J24rj69J76k96K62
2037A20j79j15K99l58J82j12J66k26J70p0J2k70j50N26k74j39L14n59M90K09l59
2058c23J37j56J24j41M4K68k3l04L30k2P1n4N5R3r8j01J5J00K14j10M0Qj33L46
2082C80k03oL0n08L70O9P9P1k17M7J29m4n4j36K10O2j07o2j07J29j00J31j43K86
2106C06k34j46RL4n1l8l3M8n5j31J41k6r3O5M9P9p0K6ok70J47j37m3J81j35j22
$$ plain form
1941 423 195 160 436 560 68 164 519 115 237 288 -5 61 -64 319 225 6 146 16 91 96 30 -280 -90
1964 -90 -44 51 -285 -231 -308 -222 -273 -324 -181 -202 -236 -246 -423 -295 -557 -29 -337 -426 -227 -316 -99 -122 -517 -204 -187
1989 -187 -62 -155 -224 -175 8 18 -347 -112 -177 -163 50 71 24 74 24 361 190 82 260 -49 485 176 198 353
2013 353 305 229 324 227 358 226 157 499 231 339 310 226 269 242 154 288 102 32 156 147 -22 154 -142 120
2037 120 -59 -174 125 -233 -51 -163 3 -223 -53 -123 -111 -381 -531 -5 -279 -418 -104 -663 -173 36 -323
2058 -323 -186 -342 -218 -359 -315 -47 -70 -374 -44 -66 5 -49 6 99 1 -100 -85 15 229 119 159 167 34 380
2082 380 177 171 201 -307 63 132 211 282 65 112 241 197 143 7 217 279 172 110 3 132 32 163 20 306
2106 306 72 -74 -65 -31 -82 -120 -153 -105 -160 -291 -150 -176 -269 -204 -155 -76 -146 -120 -126 -396 -249 -386 -429 -248 -383 -505
2132e05K57k15L31j91J72KK76k16j37J55P8J92k90K14j63L68k11k95L39jl1j37
2154hj02M34pj23nJ01k06j1K29j13K2L2L9q6p2J28n0j11P1Q1N1j87N8R9q9k84
2180a09J76L4n3n7j9j0j34M3j15j74M25Q3l03J48n2j64J32r4L3J34k32k03K34
2203b77k1j15P0J58J1k50K04l2J90L4j61j75J75q7M01j22K47k54L47n41O5K45
2225A12m1QO7k71P4L83m00L72k02Q2j04j8P2L27l83M44l48n5O6Rj16K65l7j85
2249A21j4J43l14l1J01Rn1K0J48pN5k71J74p8j91K11J04l40NK58k00l8R8j55J24
2274a19k75M5M7K89k68O3n8kK15j61O8j21M5J30o7J93j69KJ9kK05j08K23j82n8
2299d6pK03J3J7J46l37r3L04j4o3Q7k27K11q6K34P3l54pK30j0oJ9j09P1J01n32
$$ plain form
2132 -505 -248 -463 -132 -323 -151 -149 127 -89 -226 -71 7 199 -91 123 -40 328 117 -178 161 160 129 -8
2154 -8 -110 324 317 194 189 290 84 73 302 189 211 243 282 196 124 252 202 91 162 243 294 107 165 264 175 -109
2180 -109 67 101 48 -9 -28 -38 -172 -129 -244 -418 7 90 -213 -65 -117 -281 -149 -243 -210 -76 -308 -511 -277
2203 -277 -298 -413 -343 -185 -174 -424 -220 -252 -62 -28 -189 -364 -189 -276 125 3 250 -4 343 -198 -133 112
2225 112 71 79 146 -125 -51 332 -68 304 102 184 80 62 134 461 78 522 174 119 185 194 78 343 306 121
2249 121 107 250 -64 -95 6 15 -36 -16 132 125 180 -91 83 5 -186 25 129 -211 -206 52 -148 -186 -88 -243 -119
2274 -119 -394 -349 -302 -13 -281 -218 -276 -278 -63 -224 -156 -277 -232 -102 -169 24 -145 -143 -124 -126 79 -29 194 12 -46
2299 -46 -53 150 163 180 326 -11 -104 200 186 123 210 -17 194 108 342 415 61 54 284 274 268 287 178 249 350 -182
2325a82J20K32o9l7J38j41j65k7J07j12K71r8j6j44J51L5l08J98k59K55k4m46
2347e21L22N6J4J42k79J96kl3J10k03l6M7j66K89k26K99j56j94J54M3J55j94K94
2370A11L5k62J0J25p4JJ47j08O5K46p8Q5l0k03K0K27j83J47P8m17N0J34L0k66
2394a10K72J6O3q6J73O1k50k11P9J14j64J80j26n4P1L2j50l1J28k15K19j30R5
2417b4j48j23J34L19m89nJ96k34J66j11J03M3J06q3P0n0j37K28k39K94j76R0j11
2440a81J52l4Lm9K75j05P1j25m5J65k13JJ34N7k82N18k44r0P4O1j52L42l73J69
2464A29R3j13l5k0J7K34k19j70P6K81N2j05j6j10N0q4J27j55j23J27o9o1N6l91
2488d29K25K23r7q5PJ10j55J77l24L66l37J81j02J27j05J6Nj27p0K54m9p4K26
$$ plain form
2325 -182 -62 170 101 64 202 61 -104 -131 -24 -136 135 37 21 -123 28 63 -245 -47 -306 -51 -75 -521
2347 -521 -199 -143 -129 13 -266 -70 -72 -105 5 -198 -234 -187 -353 -64 -290 9 -147 -341 -187 -144 11 -183 111
2370 111 146 -116 -106 19 -55 -54 93 -15 50 296 218 303 273 70 90 317 134 281 359 -58 -8 126 156 -110
2394 -110 162 178 241 155 328 389 139 -72 7 121 -43 137 11 -43 28 60 -90 -121 7 -208 11 -119 -24
2417 -24 -172 -295 -161 158 -331 -336 -140 -374 -208 -319 -216 -173 -67 -150 -80 -130 -267 -39 -278 16 -160 -70 -181
2440 -181 -29 -63 -60 -109 166 61 132 7 -38 127 -86 -85 49 106 -176 342 98 8 82 143 -9 333 -40 129
2464 129 222 109 74 54 71 305 86 -84 -8 273 325 220 204 94 144 60 187 32 -91 36 -33 -94 -38 -429
2488 -429 -204 19 -78 -163 -156 -46 -201 -24 -348 18 -319 -138 -240 -113 -218 -202 -197 -324 -394 -140 -189 -263 -37
2511c7j12P8j28r0K46Lj08k1K11k55K12j56J01r9K42o5M6R8j28J94J21m4j91O
2535A24j88J12J13r0k6R9R0k0k40R4K24j05K01j97j0k5J59q7k48K6L14j47l73
2558b00K94P4k32J9j07np1L4J1L37l57K54m56J57K55j93j45J40k41L61J46l96
2580c21J35J26j3r2j07J76O7k33J65K04j78r3K87r8l4J63k43K11m7o1j19l9J74
2603C0J62q5R4J39n2j97P1M6k67M65k78K4q8j67PJ79P6N1K8j53J50J6P7k72j0
2628D6r6N45n11M2L8j15J59k07%P7j98J32J61j90J01K3j51k7J6j70R4R2k21K70
2652i0l1K8q2q9K8Q0k80L75l4K8j14K04m8k85K00J44rj15J06m6J83j73O2J61l86
2677a83M59m98L46K3J28J50j62k27N01k95l49M5L90j98n8J2O8j27L54j82Q5j70
$$ plain form
2511 -37 -149 -71 -199 -289 -43 -40 -148 -169 42 -213 -1 -157 -56 -155 87 22 68 166 38 232 353 309 118 124
2535 124 -64 48 161 71 45 144 234 214 -26 68 292 187 388 191 181 156 315 228 -20 6 320 173 -200
2558 -200 94 168 -64 -45 -152 -157 -228 -194 -183 154 -203 51 -405 -248 7 -186 -331 -191 -432 -71 75 -321
2580 -321 -186 -60 -73 -165 -272 -96 -29 -262 -97 107 -71 -164 123 25 -9 154 -89 122 75 14 -105 -144 30
2603 30 192 107 201 340 288 91 162 208 -59 406 128 152 64 -103 -96 83 159 210 238 85 235 251 328 56 46
2628 46 -50 495 -16 26 64 -51 108 -99 -99 -22 -220 -88 73 -117 -16 7 -144 -171 -155 -325 -231 -139 -360 -90
2652 -90 -121 -93 -175 -264 -236 -156 -436 -61 -95 -67 -181 23 -25 -310 -110 34 25 -90 16 -30 153 -20 42 203 -183
2677 -183 276 -222 124 147 275 425 263 36 537 242 -107 -62 328 130 72 84 152 25 379 197 282 112
2699A12K15j71l97K63P3J78m82L90k80J07j81k6K54j33J20j68M1P2J25k31Q9r
2721c9k53J04L4n0P4n1Q9l0M0k43K72K1QM9j15l18L77r5j5J59j39J47j34n2K50
2746I0J60j15l68lL50j47M0O9K8q5J31l9mKJ34j53RO2k37K06P0K0m8o5K7p2l4
2773B8J30O5K18n13J97K43l62J56M0p9k85K03J92j12j98R0j62J41k0j91N3j4J67
2796a3j47qj19K35l03nL97l90J37J50j41L27k61o4pk8J42J30l18r6K83M1m5k9
2820a32j5L24j21k4q8%O1K43k20J00m7n7K16k38P5%K0Q5n8q8j3R6K39k84N6j42
2846a2J44m5k52J24K49l55K92j91L31k18K06k60K10m51K78n0M4q2no3j99J85K00
2869H0k22K06k18j40J01j37J55K08j51M7j5j62Q4J98l06L1n2K52j74J47R8r9J4
$$ plain form
2699 112 327 156 -241 22 95 273 -209 181 -99 8 -173 -199 55 -78 42 -126 -85 -13 112 -119 -30 -39
2721 -39 -292 -188 -154 -204 -130 -181 -92 -122 -82 -325 -53 -32 -24 25 -90 -408 -31 -126 -141 18 -121 26 -108 -160 90
2746 90 250 135 -233 -236 114 -33 7 76 104 19 150 111 107 109 243 90 99 161 -76 130 200 220 172 107 134 62 28
2773 28 158 223 441 -72 125 368 6 162 202 123 -162 41 233 121 -77 13 -149 -8 -28 -219 -166 -180 -13
2796 -13 -160 -168 -287 -52 -355 -360 37 -353 -216 -66 -207 120 -141 -205 -212 -240 -98 32 -286 -382 -99 -58 -103 -132
2820 -132 -147 177 56 32 -56 -56 5 248 28 128 81 24 240 2 77 77 97 182 124 36 23 119 358 74 130 -12
2846 -12 132 87 -165 -41 208 -147 145 -46 285 67 273 13 223 -228 50 0 44 -38 -43 -106 -305 -120 80
2869 80 -142 64 -154 -294 -193 -330 -175 33 -118 -71 -86 -248 -164 34 -272 -241 -293 -41 -215 -68 30 -69 -55
2892e5Qo0P5P4KK10k01R9j7o9J04j65K10k28j22K11J94O4o2J76m58J85p4P4j50
2917B5N2J9K17J1j63k53J04R1j58L53j36J6l2j56Pp2M3j77mj36K48J59k79J92
2941b9l0j22J71j85J70k5j26j63M35l25p6K65o1J24k2n7J6J01j5k12jQ8K92k26
2965a3M2q7n8j18K07o4L4J05Rj48nN4LJ15o9J2Q9P2q8Q9m6q1J7j5J23N6k7n3p8
2994G7J33J34l15N7j12J24J38l99L17j4j08Q1k84K43k31J10R0N6j7k37J83J03
3016A29k9j85k8k52J23K6J63M8j10L3J3j14J13q0R9L8k08J4j18K31P3r3J11J31
3040A28q0l2j36P4K27k92K72Nj99J40n4r7R0J28r1L5Q1j07mJ87q5k5j08L2q2J26
3066A33k35L43r9r6L07p9P6k76r9J06J21j83j14K27j14J07o8k77K86k81R5k3P6
$$ plain form
2892 -55 -47 -107 -32 42 44 254 53 152 135 66 170 5 215 -13 -135 76 270 334 272 448 -10 175 101 175 25
2917 25 77 96 313 324 161 -92 12 103 -55 298 162 178 146 -10 -3 -75 -32 -209 -213 -349 -101 58 -221 -29
2941 -29 -59 -181 -10 -195 -25 -50 -176 -339 96 -229 -305 -40 -101 23 1 -56 -40 61 46 -166 -167 -79 213 -13
2965 -13 29 -58 -116 -234 -27 -91 -57 48 57 -91 -96 -42 -39 76 7 19 108 180 92 181 135 54 71 56 179 235 208 155 77
2994 77 210 344 29 86 -26 98 236 -163 154 140 32 113 -171 72 -159 -49 41 97 80 -157 26 129
3016 129 100 -85 -113 -365 -242 -216 -53 -5 -115 -82 -69 -183 -70 -150 -51 -13 -221 -207 -325 -94 -21 -114 -3 128
3040 128 48 16 -120 -46 181 -111 161 166 -33 107 53 -44 46 174 83 118 199 92 88 275 190 165 57 89 7 133
3066 133 -102 241 142 46 353 274 350 74 -25 81 202 19 -95 132 18 125 57 -220 66 -215 -120 -143 -67
3089f7J29P3j05k53J19n6J1j2n5O8K27o1k51L86k89j5N8P8j68L5jj73J84J84m27
3114c81L12O6l31J41J78j63J36R0k55L10k22J55j25P0J39j88O2J18o4n9J79J67
3136C35j96j42R4Qo0J04j04J78m0j16l0j1J45j64J0L10k16M9j09J44k76O4J06
3159H3o0J59j9k01R7j33k7k8k40L30j21m5j2J16N8p1L5J19k06j63J97j54K64r
3183c1K1j16j75J86JJ00j63J44j6Q6%j7J4O4j97n7J57r2K03j10K16j46m4J75k07
3208dj49M03l6j40K30l95J24O1j3J9o3N2M2j46K50j57j28j0N7J1q5J61n4j14K89
3233B05r3j71J00Q7k42J65j87K36l49O6J57N1j7k55N5K55R7k72J51r6jo2Q8q5
3257a17r5K29q8J38j86J67j57K2M3j22K50k4j24J14j7M1j50Q4J0Rk25J81k05P1
$$ plain form
3089 -67 62 135 30 -223 -104 -160 -149 -161 -216 -148 79 18 -233 153 -136 -151 -93 -15 -183 -148 -149 -322 -138 46 -381
3114 -381 -69 -3 -334 -193 -15 -178 -42 48 -207 103 -119 36 -89 -19 120 -68 -6 112 48 -11 168 335
3136 335 139 -3 91 99 39 143 39 217 177 61 31 20 165 1 11 321 105 154 45 189 -87 -23 83
3159 83 23 182 163 -38 59 -74 -101 -129 -369 -39 -160 -205 -217 -101 -43 -114 -79 40 -166 -329 -132 -286 -22 -31
3183 -31 -10 -126 -301 -115 -114 -14 -177 -33 -49 37 37 20 34 98 -99 -156 1 -91 112 2 218 72 28 203 -4
3208 -4 -153 250 214 74 304 -91 33 94 81 100 37 89 131 -15 235 78 -50 -60 -3 8 -77 84 30 -84 205
3233 205 112 -59 41 128 -114 51 -136 100 -249 -183 -26 25 8 -247 -192 63 160 -112 39 -57 -58 -120 -32 -117
3257 -117 -212 17 -71 67 -119 48 -109 -87 -44 -166 84 60 -64 50 33 74 -76 8 18 27 -198 -17 -222 -151
3281a51J51p4J95K3o0j09m3J78k00J10K18Jl49O9L22l22J67q0J55l15N01j64k66
3304d3K24On7l84J98M6J31M1k41Q0P8j04K61l38k1J82l07K00k03k6K46ml1O2j14
3329a18J31j1k13J08n6K3j13J52J03n6N5qNp7M2j62K04N0N4n5k04L29K4j51J07
3354A63j17J55j01q8J99j11k56K83r8kk31L04j01Q6K62k04k9p8K5J43J05j48k07
3377d6J01j20L2O7k6n6K5n3q5J73J79k69N1K9j19j7o9J68j6L19j61j30OK67l87
3402a37J35j91J51M5O8j45j15l4L21j04n0J23n8l10K53O3J56j15k36K09L6j52
3424h7K8j77J15K34N2n6j96K57r9J12M0j30K26j28j50m4N5L11l99J59n3j2J51
3447B09j36o8Q7n0P3j04j09R4k66K62O7j03K25Om15Q5J0N73m06j16J20J1Lj40
$$ plain form
3281 -151 0 -74 121 144 84 -25 -68 110 -90 20 238 239 -110 -41 281 -41 126 46 201 -114 387 223 -43
3304 -43 181 187 130 -254 -56 -10 121 162 -79 1 79 -25 236 -102 -123 59 -248 -48 -251 -277 -31 -35 -66 -4 -118
3329 -118 13 2 -211 -103 -159 -136 -249 -97 6 -50 5 -3 2 -75 -33 -195 9 59 113 58 -146 183 207 56 163
3354 163 46 201 100 12 211 100 -156 127 29 27 -204 100 -1 85 347 143 114 36 61 204 309 161 -46
3377 -46 55 -65 -33 34 8 -48 -23 -76 -161 12 191 -78 -27 2 -117 -134 -203 -35 -51 268 107 -23 -17 250 -137
3402 -137 -2 -193 -42 3 71 -74 -189 -223 98 -6 -56 67 9 -301 -48 15 171 56 -180 29 65 -87
3424 -87 -59 -236 -121 113 165 109 -87 170 71 183 223 93 319 191 41 -3 52 363 -36 123 70 58 209
3447 209 73 5 92 42 115 11 -98 -4 -270 -8 59 -44 181 187 -228 -143 -133 440 34 -82 38 49 52 -88
3471h8K79l16J49k6r8J63o3m7k19K09k5J98j03K6l35J06j05K03K30p7K0k34J60
3494Gl5N6J17l25K47o3J04P6l0j27O1J45k09L3J59k38R1O7j46J88k54J53m9o7
3518c9m2J28P0L0j03PJ98k23J16j77k4K5k1q0R5J83o2l46M00k01l5J12j08K22
3542A25k43MJ90j6n6k49J21K24k59j34M50r2j23j15MP7j03M72m63L01r2m9j5N4
3566A3q3K1j0J29j06k54M26k43oO3o9r4M05k89P2K1J12j94K10NJ1j70k1J03N3
3591A05R1j29N3q8R2p7q2L21m20K07R0Q9m0r6p8k10L32j49O3n4J32k03n9j7J57
3616C0k27O1L25m08J73M1NJ69j72l06K04M8O6j86K50j16p5R3j41N9k68L57j23
3639a41J5J40L06m03K00j41r3J64j8m6n5P9J72k72J44p1M2J47j79P1l3j3J58J59
$$ plain form
3471 -88 191 -125 24 -2 -100 63 0 -47 -266 -57 -82 116 13 39 -296 -190 -295 -92 138 61 81 -153 7
3494 7 -28 28 145 -180 67 4 108 184 154 27 88 233 24 57 216 -22 69 136 -10 178 -76 77 28 -39
3518 -39 -81 47 117 147 44 51 249 26 142 -35 -59 -34 -55 -135 -40 143 81 -265 135 -66 -101 11 -97 125
3542 125 -118 -114 76 60 4 -245 -124 100 -159 -293 157 65 -58 -173 -169 -92 -195 277 -186 115 23 -26 -41 13
3566 13 -70 -49 -59 70 -36 -290 136 -107 -113 -50 -119 -213 192 -97 -25 -4 108 -86 124 129 140 -30 -51 52 105
3591 105 196 67 120 32 124 47 -35 286 -134 73 163 252 212 116 38 -172 160 11 74 20 152 -51 -110 -127 30
3616 30 -197 -136 189 -219 -46 -5 0 169 -3 -309 -105 -57 9 -177 73 -43 -118 -25 -166 -107 -375 -18 -141
3639 -141 -126 14 320 -83 117 -24 -117 47 29 -17 -72 7 179 -93 51 -20 22 169 -10 61 28 15 173 332
3663C32l53J88j49J02p7m9M01n11J52k07N56n23k5J63k4K85j29L3k12K4j18J55
3685A4N4k1K21k37r1K44m19K76M5j50k11M33k60J23m7J47j89o1R6rk31K54J00
3708H1j42J5p1Nj14K57k44R6m7J69K26k26j19j04J36J69J18k99k7R0k4O9o7P8
3732B5K8r3K22k4r8r4K08j75K29pl22K07l64K80q2L15Kk1k33O7j33N7K2L6j91
3757a39O4K90k76Q1j53n7Q6M2k14L82q9Po7R5L8k49J00R8m58L08QJ23q9n0K48
3782A29l53K57j49llO9O8j74k5J11L0J48k38K81j25l8Q9m0q0m7N3j9n1L09k11
3807a2L58j16M9k68l3L24j74j49J17l3k6O2J00k26k7J36qj06J67o4l3m4lj61J37
3832c3M9o6L32l55j3J71k03Q3P1j80L7N5M5j14OL12j31j30k3K0k6L49k47O3l13
$$ plain form
3663 332 -21 167 18 120 43 -6 395 -116 36 -171 385 -138 -163 0 -24 261 132 165 -47 -23 -141 14
3685 14 68 47 268 31 -60 184 -235 41 86 -64 -275 158 -102 21 -26 121 -68 -129 -33 -42 -273 -19 81
3708 81 -61 -46 -117 -112 -226 31 -213 -117 -164 5 231 5 -114 -218 -82 87 205 -94 -121 -31 -55 14 -53 25
3732 25 53 -40 182 158 60 -34 174 -1 228 221 -101 106 -258 22 -60 255 257 236 3 70 -63 -6 16 52 -139
3757 -139 -75 215 -61 20 -133 -190 -104 -62 -276 106 17 24 -43 52 90 -159 -59 39 -419 -111 -103 20 -69 -119 129
3782 129 -224 33 -116 -119 -122 -53 15 -159 -184 -73 -43 105 -133 148 23 -15 74 34 -46 -93 -40 -59 -110 199 -12
3807 -12 346 230 279 11 -22 302 128 -21 96 63 37 99 199 -27 -54 82 74 -32 135 71 38 -6 -9 -170 -33
3832 -33 16 -50 282 -73 -86 85 -118 -35 36 -144 -107 -52 -7 -121 -115 197 66 -64 -87 -67 -93 256 9 72 -241
3857b41M5L54p9q0k66L82l33J73K27l21J31k90J98k9J63L4k97L82j58J90M9j03
3879A31k42N6k2L81m42K31K1j89K7J78k32J60l9k16J17P9J2N2M4P3j87k13K69
3902D9j44K65j40n5lP1n9l3k15J72R9m9jJ5k12K80Ok46K83m45L66k9J9r9j55J54
3928a06J62R5k28P0nj5R3q8j73J32J24j99J25k07L0L74j56K2n1j99L74m32L48
$$ plain form
3857 -241 -196 158 79 -1 -267 115 -218 -45 182 -139 -8 -298 -100 -129 34 68 -229 153 -5 185 234 131
3879 131 -111 -55 -77 304 -138 93 114 -75 -48 130 -102 58 19 -197 -80 -1 11 63 107 180 -7 -220 49
3902 49 -95 170 30 -25 -28 43 -16 -49 -264 -92 7 -42 -43 -28 -240 40 46 -200 83 -362 4 -25 -6 -105 -260 -106
3928 -106 56 151 -77 -7 -12 -27 66 -22 -195 -63 61 -138 -13 -220 -190 184 28 50 -1 -200 174 -258 90
$$ [...]
8191B29
##END NTUPLES=NMR FID
##END=
