##TITLE=1H_SR35
 CDCl3,8 sc, 
 3.03.2021
##JCAMPDX= 6.0         $$ Bruker NMR JCAMP-DX V2.0
##DATA TYPE= NMR FID
##DATA CLASS= NTUPLES
##ORIGIN= UXNMR, Bruker Analytische Messtechnik GmbH
##OWNER= root
$$ XWIN-NMR		Version 3.5
$$ Wed Mar  3 12:03:40 2021 Russian Standard Time (UT+4h)  she@DPX200
##.OBSERVE FREQUENCY= 200.1315066352
##.OBSERVE NUCLEUS= ^1H
##.DELAY= (6, 6)
##.ACQUISITION MODE= SIMULTANEOUS
##.ACQUISITION SCHEME= undefined
##.AVERAGES= 8
##.DIGITISER RES= 18
##SPECTROMETER/DATA SYSTEM= spect
##.PULSE SEQUENCE= zg30
##.SOLVENT NAME= CD3CN
##.SHIFT REFERENCE= (INTERNAL, CD3CN, 0, 15.7039)
##AUDIT TRAIL= $$ (NUMBER, WHEN, WHO, WHERE, WHAT)
$$ ##TITLE= Audit trail, XWIN-NMR		Version 3.5
$$ ##JCAMPDX= 5.01
$$ ##ORIGIN= Bruker BioSpin GmbH
$$ ##OWNER= she
$$ F:/spectra/data/she/nmr/H-F/1/audita.txt
$$ ##AUDIT TRAIL=  $$ (NUMBER, WHEN, WHO, WHERE, WHAT)
(   1,<2021-03-03 12:02:59.01 +0400>,<she>,<DPX200>,
      <created by zg, POWCHK disabled, PULCHK disabled
       configuration hash MD5:
       00 E9 B6 7A A2 85 ED C7 34 08 36 98 17 FE 4E 26
       data hash MD5: 16K
       61 F8 49 77 EE 41 D0 23 07 54 89 FE 2B E5 8C 31>)
$$ ##END=
$$ 
$$ hash MD5
$$ A5 A0 8C 6B 25 4D 22 F8 22 B8 22 22 25 E6 A4 B4
##$RELAX= 
##$RELAX= 
##$RELAX= 
##$RELAX= 
##$RELAX= 
##$RELAX= 
$$ Bruker specific parameters
$$ --------------------------
##$DU= <F:/spectra>
##$EXPNO= 1
##$NAME= <H-F>
##$PROCNO= 1
##$TYPE= <nmr>
##$USER= <she>
##$AMP= (0..31)
100 100 100 100 100 100 100 100 100 100 100 100 100 100 100 100 100 100 
100 100 100 100 100 100 100 100 100 100 100 100 100 100 
##$AQSEQ= 0
##$AQ_mod= 1
##$AUNM= <au_zg>
##$AUTOPOS= <>
##$BF1= 200.13
##$BF2= 200.13
##$BF3= 200.13
##$BF4= 200.13
##$BF5= 200.13
##$BF6= 200.13
##$BF7= 200.13
##$BF8= 200.13
##$BYTORDA= 1
##$CFDGTYP= 0
##$CFRGTYP= 5
##$CHEMSTR= <none>
##$CNST= (0..31)
1 1 145 1 1 1 1 1 1 1 1 1 1 1 1 1 1 1 1 1 1 1 1 1 1 1 1 1 1 1 1 1 
##$CPDPRG= <>
##$CPDPRG1= <>
##$CPDPRG2= <>
##$CPDPRG3= <>
##$CPDPRG4= <mlev>
##$CPDPRG5= <mlev>
##$CPDPRG6= <mlev>
##$CPDPRG7= <mlev>
##$CPDPRG8= <mlev>
##$CPDPRGB= <>
##$CPDPRGT= <>
##$D= (0..31)
0 1.2 0 0 0 0 0 0 0 0.06 0 0.03 0 0 0 0 0.0002 0 0 0 0 0 0 0 0 0 0 0 0 
0 0 0 
##$DATE= 1614758578
##$DBL= (0..7)
120 120 120 120 120 120 120 120 
##$DBP= (0..7)
150 150 150 150 150 150 150 150 
##$DBP07= 0
##$DBPNAM0= <>
##$DBPNAM1= <>
##$DBPNAM2= <>
##$DBPNAM3= <>
##$DBPNAM4= <>
##$DBPNAM5= <>
##$DBPNAM6= <>
##$DBPNAM7= <>
##$DBPOAL= (0..7)
0.5 0.5 0.5 0.5 0.5 0.5 0.5 0.5 
##$DBPOFFS= (0..7)
0 0 0 0 0 0 0 0 
##$DE= 6
##$DECBNUC= <off>
##$DECIM= 32
##$DECNUC= <off>
##$DECSTAT= 4
##$DIGMOD= 1
##$DIGTYP= 9
##$DL= (0..7)
0 120 120 120 120 120 120 120 
##$DP= (0..7)
150 150 150 150 150 150 150 150 
##$DP07= 0
##$DPNAME0= <>
##$DPNAME1= <>
##$DPNAME2= <>
##$DPNAME3= <>
##$DPNAME4= <>
##$DPNAME5= <>
##$DPNAME6= <>
##$DPNAME7= <>
##$DPOAL= (0..7)
0.5 0.5 0.5 0.5 0.5 0.5 0.5 0.5 
##$DPOFFS= (0..7)
0 0 0 0 0 0 0 0 
##$DQDMODE= 0
##$DR= 18
##$DS= 0
##$DSLIST= <SSSSSSSSSSSSSSS>
$$ [...]
##$SUBNAM2= <"">
##$SUBNAM3= <"">
##$SUBNAM4= <"">
##$SUBNAM5= <"">
##$SUBNAM6= <"">
##$SUBNAM7= <"">
##$SUBNAM8= <"">
##$SUBNAM9= <"">
##$SW= 16.9725356469052
##$SWIBOX= (0..15)
0 0 2 0 0 0 0 0 0 0 0 0 0 0 0 0 
##$SW_h= 3396.73913043478
##$TD= 16384
##$TD0= 1
##$TE= 0
##$TE2= 300
##$TE3= 300
##$TEG= 300
##$TL= (0..7)
0 120 120 120 120 120 120 120 
##$TP= (0..7)
150 150 150 150 150 150 150 150 
##$TP07= 0
##$TPNAME0= <>
##$TPNAME1= <>
##$TPNAME2= <>
##$TPNAME3= <>
##$TPNAME4= <>
##$TPNAME5= <>
##$TPNAME6= <>
##$TPNAME7= <>
##$TPOAL= (0..7)
0.5 0.5 0.5 0.5 0.5 0.5 0.5 0.5 
##$TPOFFS= (0..7)
0 0 0 0 0 0 0 0 
##$TUNHIN= 0
##$TUNHOUT= 0
##$TUNXOUT= 0
##$USERA1= <user>
##$USERA2= <user>
##$USERA3= <user>
##$USERA4= <user>
##$USERA5= <user>
##$V9= 5
##$VALIST= <valist>
##$VCLIST= <CCCCCCCCCCCCCCC>
##$VD= 0
##$VDLIST= <DDDDDDDDDDDDDDD>
##$VPLIST= <PPPPPPPPPPPPPPP>
##$VTLIST= <TTTTTTTTTTTTTTT>
##$WBST= 1024
##$WBSW= 4
##$XGAIN= (0..3)
0 0 0 0 
##$XL= 0
##$YL= 0
##$YMAX_a= 14131
##$YMIN_a= -8192
##$ZGOPTNS= <>
##$ZL1= 120
##$ZL2= 120
##$ZL3= 120
##$ZL4= 120
##$ABSF1= 10
##$ABSF2= 0
##$ABSG= 5
##$ABSL= 3
##$ALPHA= 0
##$AQORDER= 0
##$ASSFAC= 0
##$ASSFACI= 0
##$ASSFACX= 0
##$ASSWID= 0
##$AUNMP= <proc_1d>
##$AZFE= 0.1
##$AZFW= 0.1
##$BCFW= 1
##$BC_mod= 2
##$BYTORDP= 1
##$COROFFS= 0
##$CY= 11.3945322036743
##$DATMOD= 1
##$DC= 2
##$DFILT= <>
##$DTYPP= 0
##$F1P= 15.9154993809931
##$F2P= -4.1035820241983
##$FCOR= 0.5
##$FTSIZE= 0
##$FT_mod= 4
##$GAMMA= 1
##$GB= 0.15
##$INTBC= 1
##$INTSCL= 1
##$ISEN= 128
##$LB= 0.24
##$LEV0= 0
##$LPBIN= 0
##$MAXI= 10000
##$MC2= 0
##$MEAN= 0
##$ME_mod= 0
##$MI= 1.114404
##$NCOEF= 0
##$NC_proc= 0
##$NLEV= 6
##$NOISF1= 3.799351
##$NOISF2= 2.8
##$NSP= 1
##$NTH_PI= 0
##$NZP= 0
##$OFFSET= 15.70392
##$PC= 1
##$PHC0= -10769.2
##$PHC1= 28.20094
##$PH_mod= 1
##$PKNL= yes
##$PPARMOD= 0
##$PSCAL= 0
##$PSIGN= 0
##$REVERSE= no
##$SF= 200.130013532006
##$SI= 16384
##$SIGF1= 3
##$SIGF2= 2
##$SINO= 400
##$SIOLD= 16384
##$SREGLST= <1H.CDCl3>
##$SSB= 0
##$STSI= 0
##$STSR= 0
##$SW_p= 3612.71676300578
##$SYMM= 0
##$S_DEV= 0
##$TDeff= 0
##$TDoff= 0
##$TI= <>
##$TILT= no
##$TM1= 0
##$TM2= 0
##$TOPLEV= 0
##$USERP1= <user>
##$USERP2= <user>
##$USERP3= <user>
##$USERP4= <user>
##$USERP5= <user>
##$WDW= 1
##$XDIM= 8192
##$YMAX_p= 0
##$YMIN_p= 0
$$ End of Bruker specific parameters
$$ ---------------------------------
##NTUPLES= NMR FID
##VAR_NAME=  TIME,          FID/REAL,        FID/IMAG
##SYMBOL=    X,             R,               I
##VAR_TYPE=  INDEPENDENT,   DEPENDENT,       DEPENDENT
##VAR_FORM=  AFFN,          ASDF,            ASDF
##VAR_DIM=   8192,          8192,            8192
##UNITS=     SECONDS,       ARBITRARY UNITS, ARBITRARY UNITS
##FACTOR=    0.0002944,     1,               1
##FIRST=     0,             0,               0
##LAST=      2.4114304,     0,               0
##MIN=       0,             -8192,           0
##MAX=       2.4114304,     14131,           0
$$ Real data points
##PAGE= N=1
##DATA TABLE= (X++(R..R)), XYDATA
0@%%%%%%%%%%%%%%%%%%%%%%jPj4J6j6J6j6J6j8K5l1L2l4M1m7N1n8O5p1P8q7R6
44E0j07J20j32J45j60J76j93K13k34K57k85L16l50L90m36M89n53O31p28Q52j024
65e63J271j647K313l845J3892J856j5290J1075j368l005K926k49k076K525j26
80G689l96j773K668p80k992K959m48m032M110j663l751M280j539l754L248j425
96B401k616J610o78j480m01L17r05j957J570l63l168L067r83l939M322j525k617
113g345L460j623j555K196p81r21J065L50j9q87K167l24j669L226p14j830L825
130a379p22j936L567r82p25K797m87j68J426J61Q3l58J986j28r50K272m75j261
148B721K888j162j526K886j148q33K259j327p58J165n71k10j88J07j89j440J250
$$ y = [0, 0, 0, 0, 0, 0, 0, 0, 0, 0, 0, 0, 0, 0, 0, 0, 0, 0, 0, 0, 0, 0, 0, -1, 6, -8, 8, -8, 8, -8, 8, -10, 15, -16, 16, -18, 23, -24, 27, -31, 34, -37, 41, -46, 50, -57, 63, -69, 76, -84, 92, -101, 112, -122, 135, -150, 166, -184, 206, -230, 259, -294, 337, -391, 461, -563, 708, -939, 1374, -2471, 11421, 13277, -2013, 9062, 7694, 4689, 7615, 7366, 5290, 7815, 7689, 7293, 5520, 8188, 7408, 4416, 7375, 6927, 2895, 7005, 5342, 1591, 5871, 4332, 578, 3826, 2401, -215, 1395, 717, -763, -1164, -847, -1752, -3709, -2139, -2502, -5670, -2603, -3586, -7525, -3203, -4728, -7345, -3885, -5508, -7063, -4867, -5648, -6569, -5504, -5154, -5173, -6060, -3893, -4217, -5886, -2660, -3374, -5204, -1379, -2101, -4037, -470, -1452, -2177, 620, 133, -35, 1391, 1552, 1635, 1277, 3263, 3135, 2185, 4457, 3982, 2721, 5609, 4447, 2921, 5807, 4659, 3826, 6085, 4758, 4000, 5165, 4594, 4384, 4196, 4303, 4114, 2674, 3924]
165C924q17j698J998j367j704K349j817j310J764j724r38P05j002m43K58m74n05
182b801n98P34r14j024J836j264r92J969j383p77K109j620p0J513r41J01N97J05
200c420K07j44J056j39l00J467n68k29K218q63mJ698q16J35J786q76L54R07k29
219B240K99M99L27j2j07R29n34j70J269j133l69J605j296j46R53q99k74N53p74
238B960k85Qk85k32k68L52j171n46Q73j204q10J305j664l92P81j124m93O34r10
257b471j53J24k63k93n08O17n74l19R19q07k31J248j127kJ020j060M59J052p70
276c139M59N14Q8K95k7P92j08o7J017l34J91J412n24m2J363m73N4R76p38K94O69
297B672k14L03J40K62j36M9K89m47J36N65r49J33Q16j386M31N29j080K35k2o39
$$ y = [3924, 3107, 1409, 3407, 2040, 336, 2685, 868, -442, 1322, -402, -1340, -635, -1637, -2080, -1822, -2296, -2801, -3399, -2665, -3579, -4603, -2767, -4031, -5023, -3054, -4437, -5214, -3105, -4725, -4795, -3282, -4223, -4122, -3525, -3420, -3213, -3357, -2301, -2440, -2740, -1273, -1841, -2070, 148, -715, -719, 979, 163, 298, 2084, 1208, 1562, 2469, 2240, 2539, 3038, 3365, 3353, 3246, 4175, 3641, 3471, 4740, 3607, 3238, 4843, 3547, 3401, 4354, 3455, 3181, 3734, 2960, 2675, 2683, 2398, 2166, 1898, 2250, 1079, 533, 1406, 202, -608, 697, -967, -1359, -578, -1702, -2195, -1561, -2471, -2624, -2500, -2763, -3056, -3564, -2947, -3521, -3840, -2921, -3728, -3959, -2711, -3838, -3840, -2820, -3880, -3421, -2369, -3139, -2680, -2166, -2078, -1783, -1810, -1018, -1126, -1193, -176, -510, -319, 1093, 569, 527, 1890, 1417, 1471, 2447, 1709, 2003, 2672, 2458, 2761, 2901, 3163, 3027, 3076, 3365, 2918, 3054, 3619, 2670, 2803, 3619, 2233, 2664, 3193, 2113, 2348, 2326, 1687]
317A687r2j55n56J00l39j10m73m78M27r70p9N30j346L23O0j048J36K61q13K29
337b706L25p29L36p8j13N5j39M76k44p4Q34q12K99O27n45O76M22o49P86J37K0
358a096N58L01K0K68L86M23k68L08P98k86K49N06n95O33N13p32N03M10n59N67
378B907k19Q4Kk33K00j69k69L76o26R8L06p15J19O6j158N51pr24R9k81m76J28
400a41n73K04l77l14K45n88j01K10p35K91q2p02N54l12k08J87j85m2K99k26R1
421b505k2J81L35m74M00K72q0K99L63k71O44l1q4J003k19M8L98r1M68K95K61K9
443A219K46o7L82r1J98M81m79N97J52n08M59l21%K66j11j83J47j58q4j35k99O23
465B334r80jKn61o0J50o00P6r2m61K6j98m27j7k98q4m37j48J58m08N2J00l81K04
$$ y = [1687, 1595, 1440, 884, 984, 645, 535, 62, -416, 11, -959, -1038, -508, -1854, -1531, -1471, -2519, -2383, -2122, -2935, -2706, -2381, -3110, -2774, -2852, -2965, -2910, -3049, -2573, -2817, -2891, -2057, -2869, -2570, -1943, -2488, -1812, -1390, -2039, -1253, -1116, -1096, -538, -237, -217, 51, 437, 860, 592, 900, 1698, 1412, 1661, 2167, 1572, 2205, 2718, 1986, 2489, 2899, 2340, 2907, 2688, 2772, 2774, 2541, 2741, 2572, 2303, 2679, 2053, 2151, 2457, 1742, 1861, 1927, 769, 1320, 1313, 389, 488, 207, -269, -141, -714, -510, -887, -1201, -956, -1544, -1645, -1435, -2170, -1879, -1961, -2663, -2109, -2421, -2629, -2442, -2627, -2669, -2370, -2596, -2505, -2527, -2346, -2011, -2485, -2085, -1813, -1893, -1594, -1231, -1502, -858, -889, -973, 30, -189, -141, 257, 166, 634, 929, 1190, 1219, 1465, 1398, 1780, 1689, 1887, 2368, 1889, 2486, 2638, 2130, 2589, 2268, 2268, 2534, 2423, 2240, 2387, 2229, 2145, 2010, 1711, 2334, 1354, 1353, 1355, 794, 734, 884, 284, 360, 268, -193, -167, -365, -792, -809, -1107, -1191, -1628, -1776, -1618, -2026, -1974, -1874, -2255, -2051]
489b051o3l32L27k45q3L82k91o1N69k08K36Q0o2L99l13N53K72l37L10M29JJ88
511c00M72K6L97j86K96M56m38N29lJ42L69J5j23M29k94K88K80k12K79k31j12L91
533B470o18q7K54k59O7L0l91J88m75k07j34n44M99o0n04j70k78l09L17o28P1p
555g75o66J34k58on4k37J05j4l72L03l12j62L01J28o27Q14k44J27k6K8K14J74
577a425J49j69M40NM84k88M12L16l15O62J56j49M66K3o2O89l29r8N37j05R6K85
599A780n5J24lK06J52l72L37l47j69L91j47m75N97l00m71J45j33n2l19j50L5k98
621D76j76K79o58M4p6n02K00m24k31L70n99O9o2k37l52L07k58J16j28J70J6j2
643a668j36J50l45J19J74J8L20k39L23L67m36L23J66k8L45J00Q0M64j41K58L27
$$ y = [-2051, -2114, -2446, -2119, -2364, -2447, -2065, -2356, -2417, -1848, -2056, -1820, -1740, -1802, -1403, -1716, -1163, -891, -1228, -918, -489, -488, -300, 172, 198, 595, 409, 705, 1161, 723, 1252, 1249, 1391, 1760, 1775, 1652, 2081, 1787, 2075, 2355, 2143, 2422, 2191, 2079, 2470, 1852, 1765, 2019, 1760, 1827, 1857, 1466, 1654, 1179, 972, 838, 294, 793, 733, 229, 59, -219, -528, -211, -839, -768, -775, -1441, -1307, -1565, -1571, -1625, -1862, -1757, -1771, -2143, -1840, -2152, -2314, -2013, -1885, -2512, -1698, -1942, -1815, -1841, -1813, -1599, -1425, -1276, -1445, -1005, -1000, -516, -804, -392, -76, -391, 271, 427, 278, 744, 767, 705, 1394, 1065, 967, 1504, 1399, 1495, 1780, 1725, 1849, 1846, 2052, 2204, 1832, 2169, 1822, 1653, 2044, 1897, 1422, 2019, 1719, 1248, 1393, 1260, 1208, 889, 739, 774, 476, 300, 579, -79, -35, -111, -613, -413, -837, -1068, -698, -1297, -1228, -1290, -1527, -1879, -1572, -1830, -1714, -1842, -1672, -1656, -1668, -1804, -1654, -1999, -1880, -1706, -1688, -1368, -1607, -1284, -917, -1353, -1030, -864, -892, -547, -447, -367, 97, -44, 214, 541]
664E41l05N63J11n34Q19l19K29K27%R8J33k36K17J25O7K23k55l8J01q4m6N8k58
687A437P7l63P3J56k85r9r3l54p6k40o7%k20k94Ql25J73k61o1j81l04K20j88j79
711a446j94J98j41K35k76N8M8l47K25J52l48K84j21J69K60P4k3N55k92J6J31J24
733f59L36L47k22K39K1J90J26k8N99q6NK38K1n0K18r1K72J23j48J94J06k99J61
756A613k7k72L52k25p6L1m2Q1l31l38M4Q8l85L4j82k56Q8m53K11k12j07j3l87
779g64K32nm63n8K5m10K60l5l04L06l52j8J17j46J27N9J09Mj59K47k79K46L14
802i47J29o1K39j49j2M66kM06j80K5M20L23l92K62J79Q5M1K04J44n4jO9j68L61
826A387q5k54K18M92n01j5J18j66L69k31l08J37j85L5k12l10R9r4K3k55LO1m09
$$ y = [541, 236, 799, 910, 376, 1195, 876, 1105, 1332, 1332, 1430, 1563, 1327, 1544, 1669, 1736, 1959, 1704, 1666, 1767, 1683, 1637, 1695, 1437, 1514, 1151, 1224, 1380, 1095, 996, 903, 549, 473, 233, 166, 166, -54, -348, -340, -665, -492, -753, -814, -995, -1299, -1079, -1267, -1446, -1640, -1442, -1583, -1348, -1624, -1566, -1518, -1865, -1640, -1488, -1836, -1552, -1673, -1504, -1244, -1170, -1193, -638, -930, -914, -783, -659, -323, 24, -198, 41, 62, 252, 378, 350, 949, 863, 868, 1106, 1127, 1077, 1295, 1204, 1476, 1599, 1451, 1645, 1751, 1452, 1613, 1586, 1314, 1666, 1441, 1365, 1396, 1354, 1435, 1104, 766, 810, 898, 513, 547, 365, 109, 197, -256, -45, -257, -364, -377, -764, -532, -537, -1000, -1058, -1033, -1443, -1183, -1218, -1522, -1216, -1568, -1586, -1469, -1615, -1488, -1429, -1320, -1316, -1475, -1228, -1507, -1261, -947, -818, -879, -640, -789, -801, -335, -337, 69, -111, -86, 334, 657, 265, 527, 706, 791, 832, 1036, 1180, 1126, 1125, 1194, 1026, 1387, 1302, 1048, 1266, 1758, 1257, 1242, 1360, 1194, 1563, 1332, 1024, 1161, 976, 1011, 799, 489, 588, 494, 517, 262, 265, 326, -83]
849h3j15J28m48J46ol65j08L8L2lj64m41L19k70O4J70j08o6j96N6Q5P5k69P83
873g46n25o7K71r4K85J03P6K8R4J5L45p0Q7J48m8K51K62j5J19j93K21L24P0L2
897I73Q1q8O5L32j63J56r9r0L23l31J27K81n52l8J38k18J54j81j29M2j37j88K1
920D79k31k5M6k66N3m77J80O0l72j10P8l51P9J08j58j22r0n2J67r4m5l4Q7p8j37
945a305K78m47M27QJ78j78p4N56j86K64o9J30J66k4P4J87Q0J91J45j76L87N4j01
968E65l8K56K64n5k6J27n3M8l0J05j1k3M9J44p9k80L8n4j22P2lkn47O7J94J44
994G50n81L8j88J3o3p0o9j71j42j7m7k34Jp7k61J45O4j27K1j15J31n2k1j7j01
1019a190L7J95j04K66j05J46p2l53N66o9K66j82N38m86L57R0L74l21L75j5n1K4
$$ y = [-83, -198, -70, -518, -372, -378, -743, -851, -813, -781, -784, -948, -1389, -1070, -1340, -1276, -1106, -1214, -1280, -1476, -1420, -1335, -1260, -1529, -746, -1271, -1338, -1067, -1161, -876, -773, -697, -669, -575, -560, -215, -285, -198, -50, -98, 153, 415, 400, 519, 326, 547, 871, 941, 973, 1054, 966, 1031, 1363, 1200, 1356, 1257, 1167, 1490, 1159, 1286, 1567, 1015, 977, 1115, 897, 1051, 870, 741, 783, 646, 458, 479, 248, 223, 269, 3, 56, -421, -241, -181, -553, -663, -585, -936, -857, -749, -907, -1029, -1119, -1171, -1004, -1098, -1143, -1177, -1090, -1168, -1305, -1027, -1474, -1047, -1039, -861, -1039, -1113, -557, -743, -479, -548, -418, -252, -276, -202, -15, 65, 256, 401, 225, 612, 666, 565, 527, 783, 1047, 992, 966, 1093, 1040, 1088, 1058, 1163, 1152, 1129, 1178, 1322, 1243, 963, 1001, 947, 825, 897, 894, 892, 345, 412, 606, 750, 169, 207, 19, 32, -31, -101, -170, -341, -483, -500, -547, -781, -780, -857, -1118, -973, -909, -1036, -1015, -1130, -999, -1051, -1072, -1089, -1190, -1153, -958, -1062, -796, -901, -755, -827, -1180, -614, -683, -417, -599, -61, -547, -190, -100, 274, -47, 328, 313, 262, 286]
1041B86J2L68k8K26j58J93q2K97L2j57j32J95j92J68r7j45K81j0j3J23l97j19
1063F51J54m08R1p9J5m5j33n2J5k47J43m27J35n2j13l1j47n3j4l5K9j39L4o2p
1088g77j86j3j00k18K24K07NK32l43p7L13J09K09p3k02J75K26k23R9J77J03J63
1110C0J5J54O7L20l54J79J31O3J90k9P5l0o6M0L2j08K30j60N1J12K09j08j06k78
1134F59j0K82l24j45L27k12k43O7j60R2k65P5j54j90K9L1K6k94J88p9P8l03j28
1157f53j88J48m2J1j4j45M1j30j77L76q2j04J57J60j85k8L1L71p2O3Q4j56K66
1180b68R9J03k76R0J66M20Qr8L5NJ10K6J91M4L7J00J82l99L10p7k16K68K6J07
1204I93O1J5o38L08K24q2l28L2K74l02q6K2q3k85K41j22j50q1n7K5m6k54L8J6
$$ y = [286, 298, 666, 638, 864, 706, 899, 817, 1114, 1146, 989, 857, 1052, 860, 1028, 931, 786, 1067, 1057, 1044, 1167, 770, 651, 805, 397, 488, 409, 424, 379, 246, 194, 209, -38, 105, -322, -187, -239, -352, -383, -530, -583, -597, -632, -603, -742, -708, -770, -777, -963, -976, -1076, -1294, -1070, -863, -858, -626, -969, -1046, -733, -624, -415, -488, -690, -515, -289, -512, -413, -236, -133, 30, 45, 199, 266, 586, 232, 411, 542, 605, 795, 766, 841, 811, 745, 785, 817, 709, 939, 779, 830, 942, 1151, 1043, 937, 659, 649, 931, 607, 462, 789, 577, 334, 401, 241, 333, 68, 143, -11, -201, -172, -141, -115, -409, -221, -300, -222, -525, -653, -841, -693, -735, -724, -738, -883, -842, -972, -1149, -773, -855, -959, -802, -642, -827, -855, -824, -453, -525, -462, -378, -534, -268, -169, -66, -342, -252, -86, 334, 342, 244, 279, 284, 394, 420, 611, 655, 692, 792, 974, 575, 885, 808, 592, 860, 886, 993, 1054, 1069, 431, 739, 963, 881, 553, 585, 859, 557, 471, 493, 410, 125, 366, 244, 94, 13, -44, -19, -65, -319, -281, -265]
1228b65k31j2k83L70k80J56k22n5P8j75J01N2j49l9L07k41K82l0n1j45J4K89k10
1251g39K84P9j38K29M4j10M42k69K86J4r4K88k28M69k35r2M45j31j12J15J00K40
1273H87j94j57K52j37J62j2m1P3j85J0K4j26j48L11m2j24M2k25p8R3p8l45N6P6
1297I4l2l4j23r6j82J00k25J7j92J20j27L26j37m4N6l27P1L9q9j1P2J4l1k9L22
1322d48j95o5M1L62j04r5J78K04j64K21m2J16O2K29j65m3P7K18J69o8L5N5n8l9
1346D81p3L5K59m3J5j06R5k8K71k73j06J19l0r4J33j32j32Q2k03Q7k0j88Q4o5
1370A68k59L84l85P5R8m39L05m36J59J0n7n9r3q9J07qL4J9j49J25j00j16Q6K5
1394e95k04L16q2K38J42k42J19l1q4J95K96k20J64p3l5K08j51J50R1J24n3pP9
$$ y = [-265, -496, -508, -791, -421, -701, -545, -767, -822, -744, -919, -818, -766, -915, -954, -647, -888, -606, -636, -687, -832, -818, -529, -739, -455, -376, -514, -285, -241, -351, 91, -178, 108, 122, 28, 316, 88, 557, 322, 230, 675, 544, 432, 547, 647, 887, 693, 536, 788, 651, 813, 801, 760, 833, 648, 658, 682, 556, 408, 719, 677, 553, 595, 370, 292, 385, 307, -38, 18, 94, 62, 28, -95, -191, -373, -273, -498, -481, -673, -553, -680, -354, -491, -535, -479, -806, -735, -696, -785, -796, -724, -710, -741, -770, -448, -643, -708, -667, -305, -409, -504, -326, -122, -286, -65, -107, 9, 71, 300, 135, 92, 169, 387, 556, 488, 523, 578, 520, 481, 408, 443, 702, 659, 674, 568, 663, 635, 906, 633, 527, 646, 616, 522, 655, 523, 391, 473, 270, 357, 337, 149, 233, 168, -91, 293, -92, -17, 81, -358, -53, -489, -330, -320, -377, -436, -529, -618, -511, -519, -485, -466, -615, -490, -590, -706, -620, -595, -799, -483, -565, -327, -185, -427, -308, -339, -423, -228, 68, -152, 12, -61, -96, 112, -39, 111, 202, 326, 273, 266, 345]
1417C45o7K85r8R0j2Q1j61J77k87K31J67n5R3J3m35M4K81j20j44K09k55k4M7m01
1441DK72j69J76l44j48k2K12j49r5p8k07J18K69k63K6k32J68j29J00k57K3r6K41
1464e80Kr1J05r8J94k09K33n4K7K01k12J31k41K50J42j01J47J9K68o0j22K43p1
1487A23J90o5j6K46l03N1J34J26rL8J13J25k6j62k38K26N3j44j7kM1L1j8l95L97
1512D99k05J8j4qP3j65k02J39l55J76Q9j95M9j91k50N31k76k8j51K82k19J01j50
1535d52j6j01k7J72p2j27j0J69K4j83j5K08Q4j19j17R3O5M10k92kJ19L47k30j7
1559h9J29K52q9k27K37O8J48N9O7l36J27J01K79j78q0k1J63k75K93k13P0l7j68
1582B80Q7J00l13K15nJ45l30MJ59j50j03j12L25k31R7j56J2k67J69n6j10O7k75
$$ y = [345, 278, 563, 465, 555, 543, 624, 463, 640, 353, 584, 751, 696, 789, 802, 367, 411, 692, 572, 428, 637, 382, 358, 405, 4, 276, 107, 283, -61, -209, -231, -19, -168, -263, -341, -548, -430, -161, -424, -398, -630, -462, -591, -491, -748, -725, -821, -580, -578, -669, -564, -662, -468, -677, -444, -498, -471, -270, -482, -351, -592, -342, -200, -301, -154, -135, 133, 73, -49, 194, 123, 313, 248, 232, 478, 175, 226, 360, 486, 477, 515, 628, 753, 727, 565, 327, 553, 606, 462, 445, 443, 484, 515, 497, 102, 499, 294, 312, 298, 290, 363, 198, -4, 135, -220, -44, 45, -150, -101, -292, -542, -11, -287, -315, -466, -184, -403, -302, -452, -468, -569, -596, -424, -496, -623, -633, -464, -440, -623, -638, -430, -346, -465, -582, -489, -424, -14, -306, -308, -189, 158, -72, -89, 40, 292, 203, -24, 213, 281, 429, 488, 555, 219, 346, 447, 726, 548, 468, 447, 610, 335, 628, 415, 485, 448, 280, 367, 467, 154, 369, 364, 509, 179, 183, 342, 192, 89, -23, 302, 71, 168, 12, 24, -243, -74, -130, -240, -173, -448]
1605d48L4r6Q6m0K45j85j21M4J37j75L9j38q3K76N7J42M9j24J70Rq1pj27K60j72
1630b49J18J91p6k31L41J58pM7qj51K07K12j29J2j22N9j17K65L7k68K46o2N1K73
1654G97l93j52Q7J1j52O9k84P2J21K02k71p6K21j77q9mk37O2K10j75k29k8K16
1677a99m1q9m1J3l4jn1j24K03k6j21M5L1j72R8K63q1K5j68J0J37K06P0l21K30
1702a38l2q0J87k47M28j00J61k61P0K39J10k79K08j11L40l56K0J74m2k2n0R7J17
1725D33j41O5n6K20o3m5KQ9o0k39L8l3P0j68j11J34J2n1M7r3k73L6J6j85K17p9
1751b18J31r0Qj4k58P2p9P1QP4n6k6J1L5R0k8o5L26j39j82J40Km8J05k0J86k27
1778a91J00r6K52O8m8Rm2n0l0M9L62j33J0l5J5J61J08k88K17j26J69K5k02K3n3
$$ y = [-448, -414, -510, -424, -464, -219, -404, -525, -481, -344, -519, -480, -618, -701, -425, -368, -226, -177, -301, -131, -122, -203, -210, -337, -77, -249, -131, 60, -16, -247, 94, 252, 245, 292, 284, 133, 340, 552, 423, 435, 313, 372, 255, 520, 557, 289, 535, 473, 524, 797, 404, 252, 339, 350, 198, 267, -17, 55, 176, 378, 107, 31, 252, 75, -14, -18, -255, -193, 17, -158, -387, -415, -199, -240, -329, -370, -357, -391, -392, -443, -567, -364, -390, -511, -466, -435, -607, -509, -246, -327, -302, -470, -460, -323, -117, -47, -368, -138, -170, -250, -63, -310, 118, 18, 179, -82, -12, 227, 337, 58, 266, 155, 495, 139, 159, 333, 291, 269, 219, 316, 433, 292, 357, 301, 521, 458, 413, 415, 504, 444, 205, 243, 210, 280, 112, 1, 135, 147, 96, 143, 50, -223, -187, -171, -356, -139, -218, -87, -177, -169, -183, -441, -369, -448, -377, -369, -295, -351, -377, -366, -331, -241, -269, -334, -8, -147, -329, -189, -187, -235, -130, -150, 36, -191, -91, -187, 65, 133, 85, 94, 52, 2, -28, 21, 383, 250, 260, 225, 240, 401, 509, 221, 438, 312, 481, 506, 304, 327, 274]
1803B74L52k14q3R5k28L44m16qJ20q6M8N2k61J5Q0q8n1p9q3J92j01J1j13j12l2
1828c72K08j32K00p2j30r8NJ66m4j81kl0K49j20L8j88L47L19k36J9k04M5J33j05
1852a85K57k62q9L48k3j49L12q8R1j38j51L71j27j7J37p6K73q7j35k8J03k12J89
1875C14J1J66l10Q1oJ41j53j72J72k54K81r5n8n8J3M2k34K37j07j69m2O3J49j08
1899i6j63J39J0j55Mm8J53mn0k31J12r7M03m65J49J25P1Q6l24P1O0j69J01K66
1923e2l74J73K20j37J98l2N9J76j05j53J42j48J52j9j8n9K25m0k73K86R7j85M1
1946A74j9J51l2P5j09m8J6pk76M71j28p1J30l26K30P4k24r4J0N5j33J63j34K16
1970A64l85P8q4R6R7lk28J0j03J35K2k00n2PK97j60r6l0J64j6K13j80j74J73J63
$$ y = [274, 626, 412, 329, 424, 196, 540, 124, 116, 236, 150, 198, 250, -11, 4, 84, -4, -55, -134, -217, -25, -126, -115, -228, -340, -372, -164, -296, -96, -168, -298, -396, -391, -225, -269, -450, -452, -482, -233, -353, -315, -503, -156, 163, -73, -54, -258, -213, -80, -185, 72, -190, -279, 69, 46, -103, 209, 121, 212, 74, -77, 294, 167, 150, 287, 211, 484, 397, 262, 234, 337, 125, 314, 325, 491, 181, 262, 256, 397, 244, 72, 244, -10, 271, 176, 118, 60, 73, 115, -119, 118, 11, -158, -200, -137, 12, -96, -259, -120, -110, -265, -261, -309, -156, -160, -210, -441, -329, -426, -23, -488, -339, -214, -143, -57, -381, -310, -250, -419, -318, -52, -426, -253, -33, -170, 28, -4, 55, 231, 126, -27, 115, -33, 119, 100, 82, 23, 248, 208, -65, 221, 318, 133, 174, 155, 306, 274, 349, 240, 192, 208, 201, -75, 396, 268, 197, 327, 1, 231, 305, 81, -13, -3, 52, -81, 82, -52, 164, -221, -143, -227, -131, -34, -37, -265, -255, -358, -223, -201, -401, -453, -446, -149, -309, -405, -435, -271, -287, -74, -254, -428, -255, -92]
1995i2r7j14M48k63K36j33N9j28J59l5m0J0J87L6q2J2J54k88KL22j46j94K93k34
2019G2p0K90k01Q8J38k8l4J4j58m6K74j70j52Q6j75L84j92J01j82N9K95l93J02
2042A02j34j2j2q8J42J31J41l29j94J04o6K6J0l45K27O2k28K36NJ70k30%J6j11
2066c77J40N3lP7r1q0N7J46M8k81K86r5r0J24K02J0m4J37j39Q2l34M35lk38L04
2091C26M0m84K09J93R1k99K46m9R9k78M3OJ53j4k67R8n2k4j11K43j87M2J22j34
2115A2m5j76j78L44p1J14k4n2R2J62l91p2P5O5P6o0o6kj97Q2O7M7J0o4KR5K47
2142I2j87r1J25P3J21l12J02m0R3L4j55J98Nj68K71k45K84O2p9Q1lJ4k23O6M3
2167A61J98k19J64k00O9k33K85l1J57k43%q2K58P1k21p4J46o3j27J4l3N9q4r7
$$ y = [-92, -189, -303, 145, -118, 118, -15, 44, -84, 75, 40, 0, 10, 197, 233, 151, 163, 317, 29, 31, 353, 207, 13, 306, 72, 2, 292, 91, 179, 317, 289, 255, 269, 111, 65, 339, 169, 17, 103, -72, 312, 120, 221, 39, 98, 393, 0, 102, -32, -44, -56, -144, -2, 129, 270, -59, -253, -149, -215, -189, -179, -524, -297, -235, -463, -227, -222, -52, -282, -282, -266, -377, -237, -184, -187, -110, -201, -281, -224, -78, -30, -311, -25, -120, -210, -86, 116, 126, 82, 219, 80, 162, -172, 263, 260, 22, 326, 366, -118, 91, 284, 375, 76, 322, 273, 372, 94, 137, 143, 296, 282, 15, 113, 61, 37, -74, 169, -18, 24, 146, 12, -33, -209, -387, -43, -114, 0, -24, -76, 16, 178, -213, -285, -210, -145, -69, -129, -195, -197, -394, -312, -245, -198, -188, -252, -250, -155, 92, -95, -186, -61, 12, 133, -179, -77, -117, -24, 10, -145, 53, 58, -110, 161, -84, 200, 262, 183, 264, 261, 275, 52, 118, 161, 359, 140, 304, 104, 173, -60, 225, 194, 351, 108, 108, 26, 284, 355, 134, 60, 206, 143, 16, 30, -3, 56, -28, -125]
2191a25P5M8j69L3o2M7k6J3K57j77k03J55m3n0j10L9J27Mj71R0m0K20j52Q1R4
2216d5j44J13j23R8Q9J27j88l3L58j04l7j94J42L5o4M0J32oJ42l0n1j0j56J84
2240B75k48K00q9j23R1N8K28k27P8j42q7K8J29q0kJ01k61K15O8j98J5j81R6Q4
2264B8J15P6l81K11j39j18J7j04J34p1J02Pn1k01L54n0r8m8L0m4P8r0MJ40O1n9
2290i7M3p7J11J41j14qj39R5O9j47N1K84j62kK64l26J85L1Q5k7j49J38k91K13
2314A71r7J55R7k00j07RK76j88k1J77K3j74n9L52j82m00L47K0l1N9j97m8L8J03
2338A23Lj4k19J34j75K71m59R8j5J26J03k63R4J13j68R4j4J01k18M1N3L26k46
2361a11J16l29N8J27J22J05k03K69j59k27R4J80k14J00m9J76J32k34mJ51Q3P3
$$ y = [-125, -50, -2, -171, -138, -200, -153, -179, -166, 91, -86, -289, -134, -177, -227, -337, -298, -171, -167, -338, -248, -288, -68, -220, -139, -45, -189, -76, -199, -101, -12, 115, -73, -106, 252, 148, 111, -83, 59, 94, 30, 70, 202, 196, 338, 308, 257, 247, 91, 275, 27, 227, 138, 15, 106, 164, 392, 165, 243, 101, 14, 42, 171, 91, 89, 190, -71, 144, 212, 14, 29, -152, -56, 28, 143, 219, -162, 49, -90, -208, -191, -295, -161, -232, -130, -123, -174, -375, -21, -71, -169, -217, -187, -231, -153, -243, -239, -99, -38, -97, -54, -131, -20, 121, 7, -1, -140, -45, 24, -123, -72, 212, 50, 48, 312, -14, 171, 202, 287, 260, 111, 249, -42, 171, 74, 229, 326, 126, 19, 28, 304, 116, 95, 272, 295, 121, 62, 414, 232, -168, 179, 199, 168, 227, 30, -18, 20, 123, 126, 112, -107, 27, -148, 123, -336, -238, -253, -127, -24, -287, -193, -80, -248, -154, -168, -67, -285, -244, -191, 135, -111, 5, -324, -266, -139, -17, 88, -115, 154, -5, -232, -138, 42, -172, -72, -121, 55, 187, -47, -51, 100, 183, 256]
2383B56k33J33j99m9L3L62lo6j80J71J07m11L04L9r0O0j25Q4l0j17r3J78KQ4j69
2408D8k37M33k25l89N16j00j43j63J82n1L16k41P2Lj14J28Jk86K96j83r9M4r0
2431b82R1N4l6J7%o1K75j99k2q7J28m6N44m08J98r7k6j49N8oK64j97l3J30j09
2456AK33j27J2q0l5Q4j01J02M9j9N0R3q2K0oj98J03Q4k36O0J93J75j90j20l28
2481b63J90J32J2j70J14m1n7R6j7K18k95P1kj12J05M6k55Rl1L35k49p6M6pK00
2506aj32K02k39P2K13j44j6P5q0J32J60l54J29KJ71j42M4j09K05k29J13m2jQ1
2530A10k13J98j09J17j66K86r1M5j24J99J56k75j33l1J88M5j89k05M19j80J28
2551A75k62J83j49N9R6j79J33j60J03n6M3J0J05o3n83N17j22R2m0j51J10J31K3
$$ y = [256, 23, 156, -43, -92, -59, 303, 300, 234, 54, 225, 332, -79, 225, 264, 174, 234, 109, 193, 163, 46, -47, 131, 133, 217, 48, -189, 244, 19, -370, 146, 46, -97, -260, -78, -129, 187, -54, 18, 21, -93, 35, 36, -250, 46, -137, -236, -192, -282, -191, -137, -173, -156, -156, -217, 58, -141, -163, -250, -122, -168, 376, -32, 166, 69, 43, -106, -48, -54, 210, 13, -20, 110, 1, 234, 107, 119, 39, 4, 88, -13, 89, 138, 119, 169, 262, 180, 200, 194, -4, 99, 183, -53, 7, 200, 375, 185, 65, -263, -73, 59, 71, -99, 15, -26, -83, 13, -4, 214, -81, -10, -12, -124, -19, 27, -228, -219, -250, 85, -164, -240, -194, -201, -1, -133, 69, -170, -98, 115, -29, -45, 30, -50, 82, 242, -112, 17, 19, 190, 48, 92, -17, 188, -41, 72, 30, 29, 110, -103, 95, -14, 103, -63, 223, 132, 177, 53, 252, 408, 133, 0, -31, 157, 202, 13, -192, 227, 47, 175, -87, 96, -53, 6, 102, -77, 56, -104, -1, -57, -14, -4, 101, 38, -545, -28, -150, -58, -98, -249, -139, -8, 15]
2574A5k77O8j9n1K44p0O1j53J02n3J50M3k18L7J29l6L9K09j32j88J03mN0j90J16
2599b5J33l6q5J22k03K55J30j41R2j52J35k54K15q8k0J39m3r6P6Q2q4o6r1J95
2623A90j35p2J57j61n6K60j25K64k42j59j38J68O4j37J77j75l8K12J16n06L51
2644A5R8l3J4k60L7J61j9j95M29l46j20N6Q2RJ52j97K8j83O6M4J15K22j60n8N3
2669A0L5m0j60Q4L16l32K82j65O2n2r7J02Q5J35o1pl64M25k55Q5J28m1j21J47
2693B01N6k11j00j92K48R8k94k0M04p5k55K22k46J48J17n2j05j31J28J15j22J05
2715C9q7j09J62L8j30J15j77j4m1R9J02j59K12l04Q6R2m8k07J39K50k08j34J72
2738a12p1K82l01K59Nl5j84J69J36k55K71ol1p3Q3L1k83N1M25m10J06J42j38L3
$$ y = [15, -262, -194, -213, -264, -20, -90, -29, -182, -80, -133, 17, 60, -158, -121, 8, -28, 11, 220, 88, -100, 3, -1, 49, -141, -25, 108, 72, -13, 109, -94, 161, 291, 150, 242, 90, 225, -29, 186, 98, 78, 217, 174, 78, 154, 236, 152, 86, -5, 190, 55, -17, 140, -21, -77, 183, 58, 322, 80, -79, -217, -49, 15, -122, 55, -120, -158, 54, 170, -336, 15, 113, 80, 94, -166, -129, 32, 13, -182, 247, -99, -219, -163, -81, -72, 80, -117, -89, -272, -206, -162, -47, 175, 15, -43, 10, 45, 5, -155, -71, 245, -87, 195, 30, 92, 40, -57, 45, 130, 265, 204, 197, -167, 258, 3, 88, 216, 175, 54, 201, 257, 46, -54, -246, 2, 100, -194, -214, 190, 115, -140, 82, -164, -16, 101, 49, -56, -187, -59, 56, -66, 39, -48, -157, 5, 43, -87, 28, -149, -163, -204, -105, -3, -162, 50, -254, -168, -76, -124, -331, -192, 58, -150, -284, -112, -183, 99, -202, 57, 62, 27, -157, 12, 148, -107, 164, 158, 127, 54, 137, 168, -115, -64, 361, -49, 57, 199, 61, 94]
2762I4J06L8l68K23rM1j06L64r1j44l20L56j25p4K0r9l2l7q3K87p8K1J25k43R4
2787d0k62L15k02n4m8L26k22J21O7j76K66k6k78m1K78m0j93M5K03k15Q6P8j06
2810a18k3J44R3j4j21k0m5M1P1k3Q4k5j67J55J7l9K20l94L39r6q6j26J61rJ9K23
2836B61l21J07p5L09p9j98K45l49K52j3k68J42J24q1l2p9K43k66K28k75j32K39
2858a8N8j03k00L25l43L34r9k06J54r8K2J33L6k43J96Rm1K19l00J28q8J20j68
2881a73J60O3l61N5M64l8J5l13K49n5m0R4m3p2k85J82J4M2PM01l13K52l97N2K38
2906A98o3k89K13J60k6j13k34K76l15K66k44L15j28K20l54K12N1k47lL04l01J30
2928B8k20J77Mo9L16m68K50o2j11N4r5j00m1R6K93j72MJ0L14k87j9m2k96L09j8
$$ y = [94, 200, 238, -130, 93, 84, 125, 19, 383, 292, 148, -172, 184, 59, -15, 5, -94, -126, -163, -246, 41, -37, -16, 109, -134, -40, -302, 13, -189, -243, -291, 35, -187, -66, 1, -175, 91, 65, -213, -254, 24, -16, -209, -164, 39, -176, -90, -12, -118, -141, 3, 96, 82, -39, -59, -104, -63, 8, -15, 69, 44, -123, 32, 49, 10, 230, -164, 175, 79, -7, -133, 28, 19, 38, 261, -60, 47, -28, 281, 202, 4, 249, -100, 152, 139, -129, 13, 137, 56, 24, -55, 188, -78, 150, -125, -257, -18, 40, -63, -263, 62, -281, 53, -46, -252, -98, -196, -174, -41, -5, -248, -52, -43, -84, 135, -165, -37, -125, -5, -173, -13, 50, -311, -256, 208, 170, 185, -128, 121, 66, 26, 120, 77, 5, -280, -98, -84, -42, -35, 366, 53, 305, -92, -40, 198, 135, -154, 59, 219, 193, 80, -154, 122, -193, 73, -171, 144, 16, 236, -118, 94, 145, -102, -105, 199, -102, 28, -192, -15, -11, -80, 236, -232, 18, -44, -155, -101, -196, -296, -337, -241, 52, -120, -116, -106, 208, -79, -98, -140, -436, -127, -145]
2953a45J49j18J35R7l91K29m4N6nlP7J50Kj23j14J07k6kR3k95J43J8J29m8j49
2978g8%l6J40K38o5P6k01j40p0L59L0k59J13P2j38k53M37j56l90M32Ql76K73K3
3002C9j16J80r1j01K04j68P2n4j06n1J17J92k28n5J03J0j72M4j36K45LJ03k11
3025a77K11k49QK32l8Qk1k30O8l2R1M0m7J67n5j42R1J41j26J85jk6j05J36l5j15
3051b1J39P5j35R7k01J97j3K0M6L5r4k11R0R9Q0m19K47j06J7m2L01k46JO9O1j21
3077c5P9o9k2J58j34o7j42K8K93p7q9M2k80J87J00q5J3k08n8L25j64m8J03n9J32
3102g7J24n8J12j89J73j09j5j09K22p1J17j57j68L33p0R9m9j89J37K03k03j7O0
3125I9k7j6K4J18L0j79J12L4j2r6M9l23K06Q6j1k9J0m7N5L2j95J99j10m8j03R4
$$ y = [-145, 4, -114, 21, 118, -273, -44, -88, -32, -37, -40, 37, 187, 189, 66, -48, 59, 33, 31, 124, -171, -28, -10, 119, 71, -78, -78, -114, 26, 264, 199, 275, 74, -66, -136, 223, 253, -6, 107, 179, 41, -212, 225, 69, -321, 111, 119, -257, 16, 39, -77, 103, 12, -89, 115, -53, 19, -35, -141, -192, -75, 117, -111, -166, -63, -53, -225, -181, -317, -72, -69, 34, -177, 34, -215, -207, 25, -13, -5, -26, -256, -188, -220, -129, -89, -136, 31, -24, -166, -75, 66, -60, 125, 124, 98, -7, 129, 94, -21, 118, 193, 58, 155, -46, 151, 138, 158, 204, 239, 145, -66, 24, 123, 203, -216, 31, -75, -58, -100, 201, -45, -44, 25, 86, -35, 44, -25, -47, 111, -23, -90, -232, -204, 89, 12, -77, -35, -315, -128, -28, -113, -100, -308, -366, -41, -205, -253, -150, -209, -77, 47, -11, 101, -88, 85, -24, -39, -148, 74, 3, 120, -37, -205, 128, 58, 157, 108, -81, 56, 259, 56, 39, 99, 72, 56, 80, 198, 228, 49, 161, 195, 183, 87, 136, -187, 19, 105, 94, 65, 75, 28, 83, 115, -80, 119, 9, -39, -142, -48]
3151d8RO3j84L40p3k12L22l17j70L40j95O6Q0j09K3j41K17n4k9j2j21O0L15k40
3175g0k03K7M22k76J63j44nr1K42j28K36j40r2J93l06J66k90J82p2N0J50N8j9
3198E3P6k7K91m62J55J10r8L4r2J08q5m6K11j41J91l56P4J3j63M35k34q4r0K64
3222A37k16j03J82L9J2m5j10N6r1j2k04K90QJo3J66j39j36J80p5M7J30p4j21J21
3247b0j02P5l4K8o8j00k59K57K71j82j2M4o7J01K44k52J04KP2j29R4k8M1k04N6
3272f8J45P2J56l1j90m8o4N3R5L6K4M6Kj13j53K93l05P9J07j14K29l62L49l12
3296g4K26k0j92J6J57k6M5l63K78q0n9K68j93J03j40N4M2j41K6nM6k28j7L07J18
3321A48j09j5o4mN1j30m4L8K5K15k7J10k21q5J97O9k55J32K06k73J83k09K52l73
$$ y = [-48, -39, 24, -160, 180, 107, -105, 217, -100, -270, 70, -125, -59, 21, -88, -65, -206, 11, -43, -72, -84, -205, -145, 170, -70, -273, -246, 176, -100, 63, -81, -86, -177, 65, -63, 173, 33, -59, 134, -172, -6, -296, -114, -186, -136, 14, 72, 53, 129, 102, 393, -69, 86, 196, 98, 132, 40, 148, 63, 17, 228, 87, 278, -78, -4, 9, -154, 281, 47, -37, -127, 137, -79, -182, 0, 39, 51, 6, -104, -48, -139, -151, -355, -65, -57, -56, -119, 47, -92, -228, -48, -123, -76, 54, -20, -141, -20, -122, -47, -81, -53, -121, -221, -480, -223, 48, -134, -146, -102, -169, -68, 176, -76, 28, 30, 102, -27, 67, 39, 80, -124, -68, 77, 149, 305, 274, 84, 36, -28, 25, 120, 156, 180, 226, 228, 115, -38, 255, -50, 29, 136, 22, 251, -111, 238, -74, 152, 132, -60, -44, 113, 87, 132, -231, 47, -33, -92, 176, -17, 86, -54, 0, 42, -99, -73, -78, -32, -260, -277, 30, 148, 39, 24, -40, -44, 7, -123, -167, -129, -104, 111, 84, 194, -27, -112, 85, 154, -101, 31, 237, -36, 147, -62, 190, -183]
3345a83R2K53j89p0R8Q5j8m5J52j53K1J64j54R7j80K3L7K7o0j46J18K30j10L5
3369A24j69j35K34K33j24q2k01OJ74Q0k82L78k45J07k77j05J37N8j68J72R2j34
3391a27J19j24K05P4j44j66K75k79N5J06J72j51q1q3J77M7l33L7K45L7n0j84J42
3414c1J08K6j25KK74M2m10J99pq4J01k28K66P9l56N41j39j05m4k77M87l22J00
3437I7K6m9K18l11J48k61J24J5L9j67L28j12l1r1J94m56K02J7p2M8P8K3r5J69
3461H1o8m0K3J9j12n2q1J15O3n7K72k14J0l8l21J70K17Mo8J2K09m61K35Pk30L25
3487B0%K66m24Q3K05%J79k66J91k83J60j20Km3L7J35j23J72k66J6m1Q9J37j14
3511A2K02k08j78J82Mq6r1J36J17O8l35K2K92k42M6J67j95J32j22L3j0P3o0j81
$$ y = [-183, -91, 162, -27, -97, 1, 86, 68, 23, 175, 22, 43, 207, 53, 150, -30, -7, 30, 57, -3, -149, -31, 199, 89, 124, -45, -180, 54, 287, 163, 81, -120, -114, 60, 140, -142, 236, -9, 98, -179, -284, -147, -89, -257, -85, 7, -127, -8, -132, 73, 147, 3, -163, 112, -167, -112, -6, 166, 15, -66, -149, 28, 75, -258, -221, 24, 61, 11, -173, -31, 77, 103, -22, -20, 254, 296, -114, 85, 78, -6, 95, -133, 133, 212, -144, 397, 258, 153, 109, -168, 319, -3, 97, 123, 74, 292, -19, 129, -132, -8, 7, 46, -121, 207, 95, 64, -27, 167, -289, -87, -70, -142, -94, -16, 7, -88, 81, 13, -27, -4, 15, -97, -149, -230, -115, -52, -109, 163, -51, -41, -79, -400, -230, -13, -9, -77, -65, 144, -317, -82, -75, -305, 20, 20, 286, -138, -55, 150, 150, 329, 63, 254, -29, 131, 11, 13, -30, 7, 142, 19, 191, -75, -59, -100, -11, 126, 12, 214, 6, -172, 10, 14, -72, -163, -27, 90, 158, -177, -155, 137, -105, -59, 108, -87, 45, -77, -44, -54, 19, -41, -222]
3535b22P5R2J63k22%j93L14Lo5J35k1j04J0O3J24l9j93J80jj75m5m0J99j94M7
3560a09J81l07N9K49j99J74O7k87K10K14k34OJ65j57J85l94N06j78j2o6m9K05
3582B29k79L44k24M5k1K73k23j82o4J19j76L34l07K81j3j51j03K23k5p7m5m4j01
3605a87J29J45l09P4N5m0j55K45J87o7J6m31L44%p2Jk34Q5J82N7k71L07Q7k38
3629i0P9R0J38j47n6j40K21k70J66q4J97l48J97P2r0J27q9M9j33K03n7k00P5K22
3653A32l05J09J29J86k21j91J7K01J19n46L70P4J38j56j37J28K8R2l05J32K1k
3675A3K14q9m0j18K4nj01j51J25j80L35j7j8j85J41%P0o8M4k40K69N8m1j66lJ67
3701C8k35L41k13N6m1j87Q7L9L8P6j21J56J00J06p8O9k12J3p9q7M1m4L31J7j43
$$ y = [-222, -147, -55, 108, -114, -114, -307, 7, 10, -55, 80, 59, -45, -35, 28, 152, 113, -80, 100, 99, -76, -121, -161, 38, -156, -109, 72, -235, -176, 73, -126, 48, 115, -172, 38, 252, 18, 24, 189, 32, 217, -177, 329, 151, 139, 73, 24, 229, -50, 294, 70, 115, 94, 367, 144, -38, -102, 17, -159, 175, -132, 149, 136, -15, -118, 105, 80, 3, -42, -86, -187, -58, 87, -222, -148, -93, -133, -288, -43, 144, 77, 93, -338, 6, 6, -66, -65, -299, -214, -32, 25, -246, 61, 148, -90, -11, 79, 217, 70, 14, -126, 95, -175, -9, -93, 104, -244, -47, 25, -65, 62, -27, 22, -111, 92, 35, -165, -90, 132, -173, -64, 65, 251, 30, -161, -144, 57, 176, -370, 0, 74, 212, 56, -81, 47, 75, 167, -138, -6, 15, 13, 227, 138, 98, -20, 4, -1, -102, -253, -128, -308, 27, 10, -8, -193, -52, -52, 18, -50, -6, -246, 23, 81, 40, -126, -129, 38, -197, 144, -69, -13, -54, -241, -154, -115, -77, -1, -122, 34, 134, 240, 162, 231, 19, 32, -47, -134, -93, -137, 194, 211, 68]
3726F8j96N2J47j14J65j12j10K1O9l4R4j77K46Oj19M1p0J60o2m5J04N8O1o0k26
3751c3rk69K06P7j40K85k08J39J55m03O3J6M26l04J29j74mj27K5L8q5J05r5J19
3775f8RQ8l75L65j01J20l09K40k31O5K64j2J1M4J14j75k8j70J2L30j99O3K75j92
3799A40k27J13j5oQ3L61k57j85k5J22J23j65K42k32l8Q6q7j2N1j11N3K7l25K89
3823Ej01M40m19L5o8l9J21j17P1j7L1r2j6L22l17q2J96J63j96p3L6LJ68k6q1M6
3849gK9K38l34q8J63k46p4L50R7k69j19K07L78m54P1Q3K48m59K85K8o9n9l3j22
3873a56m2K80m7p0J33j36p8J17KJ11p5k2J05k00k2J26k38J27K7J60l8k45N8K41
3897A18j00K1N0j58O8J25k31L18l65o1K80j64N0J53q2k2P5P1l21M3j5K03ko1j36
$$ y = [68, -128, -76, 71, -43, 122, 10, -100, -79, -10, -44, 50, -127, 119, 125, 6, 47, -23, 137, 75, 30, 134, 192, 253, 193, -33, -42, -311, -105, -28, -168, 117, -91, 48, 203, -200, -137, -121, 305, 1, 130, -44, -48, -175, -150, -112, -197, -92, -187, -68, -59, 29, -346, 19, -82, 38, -271, -31, -262, -197, 67, 55, 66, 110, 224, 49, 21, -149, -137, 193, -6, 57, 332, 140, -87, 26, 11, 5, 88, 449, 192, 7, -18, 104, 227, 62, 304, 72, 34, 120, 33, 21, 72, -39, 14, 41, -284, 5, -96, 344, -75, -40, -108, -147, -26, -143, -72, -89, -58, -150, -166, 156, -161, -243, -47, 116, -80, -153, -117, -114, 54, 28, -53, -7, 22, 260, -74, -162, 1, -245, -319, 31, 128, -141, -260, -53, 325, -129, -58, 25, 273, -186, 99, 127, 58, -1, -34, -156, -198, 82, 35, -35, 98, -38, -116, 1, 3, 114, 39, 17, 122, -78, -100, 26, -212, -85, -58, 102, 64, -181, -123, 118, 18, 39, 89, -69, -1, 124, -107, 211, -154, -215, 65, -99, -49, 104, 22, 0, 75, 146, -175, -132, -147, 56, 54, -7, -143]
3922a43J71j64L2K51m20L41q5J02Lk15nL22m2l28J2K53m9P5k5m7J46m4O1k28j68
3947a94N1N8N0R6M8q9J0j08Q9n6k7J07q1J43lj60J92P5j3l04R8m1J33l58K04j09
3973a89q1K09k36K33k2K22k35K04q2Nj01K12k7j40l52L14p7P7R9oR3o1j52O9J54
3998A30j50K83j27j7j17k2j47r8J3J60J10N5J70l42J43j02M2o1m3K22l00M69l08
4021c7J97Kj05O0j13p3L13j66J24k05o2K07l08K95l09J08Q7o2K36l78K88j14j31
4044a46K37r4K2Q1j77K3K4j93K6J85l59M49l33n5R7J18N7j30L48j16j74K0M9J14
4068G3M6k13J17K3j24j94J3L49j81l9N3K80j69J27p9L3n6rJ59k90J92l6j10o5
4092a00K14r5o1l4n0K51k29L21m09J4n2J78K04k53K46j76l6l3N7M8K61k30p5N9
$$ y = [-143, 28, -136, -104, 147, -273, 68, -17, 85, 88, -127, -132, 190, 148, -180, -168, 85, 36, 111, 86, 39, 185, 141, 202, -26, -194, -143, -85, -35, 61, 109, 20, 30, -78, 11, -45, -72, 35, -46, 97, 94, -66, 126, 201, 188, -116, -18, -59, 74, -284, -80, -189, -270, -61, -297, -64, -86, 136, -99, 105, 23, 28, -73, 139, 112, -28, -380, -66, -143, -66, 33, 27, 120, 59, -93, -24, 130, -20, 263, 136, 119, 2, -20, -167, -265, -252, -92, 18, 73, 243, -99, 44, -58, -16, -77, -120, 102, -198, 271, -37, 160, 162, 57, 117, 4, -69, 244, 78, 202, -3, -65, 142, -166, 129, -180, -72, 15, -47, 189, -189, 99, -15, -146, 91, -3, 19, 100, -77, -54, -30, -223, -197, -12, -371, 78, -255, -310, -213, -95, -38, -168, 180, 64, -110, -90, -41, 73, 119, -94, 23, 46, -78, -272, -259, 90, -91, -130, -77, 203, 34, 161, 82, 115, 59, 50, 209, -81, 111, 75, -35, -100, 114, 19, -42, -76, -126, 125, -104, 217, -192, -178, -230, -52, 152, -101, 145, -31, -67, -100, -43, 5, 266, 36, -39, 20]
4116B0N5J38k08N8J9n4j21lJ69k93K05K31k24N8k34P0k0J75L4k90J36l7J58Mk06
4141a60J39J44l18J08J6q1j12J90L2l7R1P6j04M0K5o9Q4J51k30N0j37J8p0J25
4165b9J85L7k14M6J32rr1j72J61q2q5K0O2j69J94N8j3o7O2j81J40P0M5l9J90k73
4191b2l6J30J08k45m4k14R4L80j24j00J97k02K6O4j49J09M3Qk38J49J03M6j58
4214g5o4J79N7k94J90J08k51K14m0j16J82L3k20J01k41K33K2j9k55J43k0K66j47
4237a4L6K60m07M9J89k48L2J00j58J55q5k5K5j37K75P2l61J42K8L07j68l3l8J4
4261A0J60j77k22L79p5k87K77l7K10k22m8J29ml16K93k9Rj59j0j00K43j53J03
4284b6j71J30j2j32K11j73POJ28m3j48lK83K3K49k23k04K08j50k3Q7r4j8K12j62
$$ y = [20, 75, 213, 5, 63, 82, 28, -93, -96, 73, -220, -15, 216, -8, 50, -184, -114, -134, 41, 75, -215, -79, -116, 42, 46, -160, -21, 123, -195, -87, -71, -152, -264, -74, -42, -79, 12, 88, -16, 24, 49, -20, 64, 215, -15, 35, -102, -84, -154, -29, 156, 193, -21, 25, 157, 148, 57, -115, 46, -36, -121, -101, -39, -208, -14, 44, 31, -36, 26, -155, -15, 55, 100, 61, 251, -22, -58, 72, 180, -65, -109, -323, -229, 151, 27, -73, 124, -78, -52, 12, -137, -28, 15, 23, -215, -66, 37, 83, -75, -139, 40, 97, -197, -7, 101, -150, 64, 24, -92, 90, 123, -97, 4, -237, -4, 18, -1, -256, -113, -133, 133, -14, 22, 282, -125, -76, 113, -135, -103, -3, -161, -6, -91, -116, -91, -228, 47, 119, -242, -100, -72, 235, 67, 34, -4, 10, 170, -7, -229, 150, 75, -212, 65, 28, 238, 16, -32, 97, 93, -223, 70, 41, 50, -109, -119, -219, 24, -129, -26, -197, -67, -79, -211, 0, -173, -166, -160, -32, -75, -223, -226, 57, 80, 329, 106, -98, 110, -40, -63, 24, -70, -88, 124, -38]
4309c8P0L2J04l24L2J18M3K2j54J64j9q5J5p7K16o5R4j65j29Q2R8P4j13P7j0k2
4335D0l5J34j65K5L3J1j24P9J1J34j56K13j87r0J30n2N1j3J55j00J48l3m81K93
4359B1J4k27L4K34l07M48o12K32M7O6O4p1K42m30K04J24j68K30J26l68J25p0J94
4382A52l18J55n1J67k47J52j36k0k1L32k96J6lO9J15j33P3J10k08K31j78K48k74
4405f5M1P6K3J21%l30Q5K08k49K2m7L7L70k85k12K03rJ21k73K50r5j94L77k57
4429h2M3q4J55P8lk93K66j00k47K99k90O2K4J67J14o0j78L3L27l82P3K51j06k01
4453a34j42L66J00j48J48j70K1l5pj47K68k06J3K95P9j48k51L4M7j59J07J20J1
4476F2j29K20k27j12L74k70o3L68k17m2j4Q9j28j19j7K81j40L3Q1M3k39K03l8
$$ y = [-38, 32, 64, 168, -156, -124, -6, 37, 59, -95, 69, 50, -35, -20, -97, 119, 54, 148, -17, -146, -64, 34, 108, -5, 72, 62, 40, 5, 139, -26, -1, 32, 43, -81, -2, 9, 143, -13, 200, 13, -77, 53, 1, 52, 39, 194, 94, 242, 209, -272, 21, 35, -192, -158, 76, -231, 217, -395, -163, -116, -50, 14, -57, 185, -245, -41, 83, -85, 145, 271, -97, 28, -42, 152, -166, -11, -62, 105, -142, 10, -126, -146, -167, 165, -131, -115, -118, -49, 66, -67, 6, 116, -92, 139, -39, 209, -65, -24, 52, 75, 196, 196, -134, -49, 159, -90, -68, -115, -78, 292, 7, -205, -2, -11, 110, -163, 87, -8, -202, 175, -82, -39, -123, 32, 110, 107, -186, 80, -20, -267, 32, -258, -196, -172, -5, 109, 49, -129, -96, 231, -151, -78, 173, 67, -134, -276, 90, 190, 42, 190, 20, 41, 6, -1, -148, 120, -86, -73, 222, 301, 153, -98, -64, -17, -176, -69, 51, 62, -67, 153, -74, -186, 188, -82, -145, 223, 6, -36, -50, 39, -89, -208, -225, 56, -84, -51, 30, 73, -166, 37, -1]
4499ap9K71j98p9J78k46J55r9j47L54R7j88k66J35P4L2O4l7j31K70k22o2K92j
4523A66p1n9m0m3r4L81m91J73n9J48K8k03P9N2R8J6n8L3K8j25J76j32p9n8J67
4548C3O3j54o4K71j50k2J00j73J78j55J93M3j85K00j79q0L12j26j15O6j04q7K99
4571A64J3k36k19K77P7K7J88l84J82k30K43k45K39k32P2N2J8j42J55r8PJ08N3
4594H9j98N1j23K85j82J14o8J80J04j32l1j51O9j38L20j92j4O3o9k2K5J42q0R8
4618A40R0l79M79l47J23j12k1k32J77K9k7L77m78K47j25k41K34j03K51k7K08m3
4640B20k77l0J60Q5l2m5n03J86L34m3n9j34P0Q2j61J34r7K70k02J0P5j09J09l74
4664c31J82K96j31j44J50m2K37l20n2Q4J40kl1j90J35n7j9r7K94j95J15n1P7J85
$$ y = [-1, -80, 191, -7, -86, 92, -154, 1, -98, -245, 109, 206, 18, -248, -113, -39, -7, 57, 20, -111, 159, -63, -125, 167, 166, 95, 36, -4, -47, -141, 240, -251, -78, -137, 11, 39, -164, -85, -33, 65, 81, 23, 56, 84, -41, 135, 3, -76, -134, 33, 96, -58, -122, 149, -1, -23, 77, -96, 82, -73, 120, 163, -22, 178, -1, -81, 231, 105, -10, 56, -48, -135, 164, 177, -59, -278, -1, 76, 103, 291, -93, 89, -141, 102, -143, 96, -136, -64, -12, 6, -136, 19, -79, -72, 36, 89, -109, -58, -181, 104, -78, 36, -32, 148, 252, 120, 89, -62, 7, -131, 189, -3, -17, 46, -23, -45, -20, 122, 42, 140, 230, -149, 330, -17, 106, -6, -27, -259, -82, -53, -80, 297, -181, 66, -59, -300, -66, -169, 82, 55, 263, 220, -57, -87, 73, 158, 126, 81, -422, -236, 98, 55, -4, -138, -68, 14, -147, -13, -110, 160, -42, -32, 43, -66, 43, -331, -149, 147, 16, -128, 22, -20, 217, -103, -155, -71, 69, 67, 36, -154, -19, -76, -95, -192, 102, -93, 22, -29, 48, 233]
4688B33j95Q6m8J38l25J88M7l09J21O0M2J52p7J3N2j94K50j54O9Lq4j59J11m0
4712b0Q7j46q9L10M4Mm2k19k1K08q6k16M16m56R5J28M4k73J35mO8qj72R5P0J11
4738F3J27j71q6Pl07K48Q3J67j56K0j00L10j13k42J75K32k9k19p3r4J79M4k0k6
4762A9J97kk59K25j51p4J41n4R2k29q2J41J71j52o6J81N1j31J5j19m0M9RK03j45
4787a0m8K63l10K67Kj88P9j28q7K08l1R3j92O4j81K76j81q9K15k89K91l6j38L6
4811a14L05k15k34L11k4J25k90k4K57j07M9J25j32j2j4k15J91K5j05R5J90k73
4833h6J21J57l19J28L2K44k07p6J05pJ98k21j98K16Lj45K47k39R7j09K19j32j33
4856a05J41M5k04oL0P6K06j42j22J2K24l27m1K12k14R4R3J36q9K36m90K95k2K65
$$ y = [233, 38, 124, 76, 214, -111, 77, 124, -185, -64, -4, 38, 190, 113, 126, 178, -16, 234, 80, 149, 152, 68, -91, 20, -20, 67, -79, -168, 142, 186, 190, 148, -71, -92, 116, 30, -186, 230, -226, -131, -3, 41, -232, -97, -101, -33, -41, -213, -118, -48, 63, 190, 19, -67, -60, -367, -119, -36, 131, -25, -5, -105, 205, 92, -150, 25, 257, 228, 9, -64, -158, 21, 65, 45, 19, 216, 214, -45, 180, 29, -45, 96, 42, 134, -95, -177, -36, 135, -17, -83, 98, 149, 18, 33, -86, -126, -77, -68, 135, -10, -58, 205, -105, 162, 164, -24, 55, -73, -160, 48, 17, 110, -82, -18, -199, 77, -104, -193, 22, -267, 24, -12, -150, -114, 191, -24, -258, 53, 29, 154, -136, -160, 97, -10, 39, 164, 32, 20, 6, -209, -18, 7, -98, -3, 187, -86, 35, 192, -127, 1, 33, 277, 70, -6, 99, 92, 290, 69, -129, 87, 90, -55, 192, -47, 50, -59, 160, 28, -105, 36, 81, -123, -129, -99, -23, 183, 41, -81, -69, 155, -172, -213, -1, -215, -121, -28, 108, 19, 255, -235, 60, 38, 303]
4880C03l61Oo1J65J58l01J64Mj00K20k90J66J09P3k78O5l4l4kn3r9j2L21r8j16
4905h5J47n0K21k28o6J6J21j45J1N7m9J98j25K27k35o2%O6k06R4R1K0L5O4l5q0
4931BM9j68J99o8l6j06J32p1j47K45jJ37n1j28j59J94j04J41k19K78r3J11k36
4954i9j16L41J68k95o3K45k61R9k30K13n9J37j03K63j47m9j26M07k43N9j69l9
4976f7m9K81j95k5J65j30k16L35m9j44O7n2J55J33j84k16N46m92Q8J03k53L17
4998A18K8q1j50j61K95J17m2r4Qk30L53l53N00k39k34j2K09M3L0p1l2p6P4M0j03
5023f3J18N0m8o4o6N6J12j68p6J52R4j60J21l5k25K31j5k40J88R5j33O8j22L4
5047i6J74k31K10P4l75K71m2M5j8J8qL5Qj22P1Qp6o2J30p2R2m7j3J38m9l7p2N8
$$ y = [303, -58, -52, -113, 52, 210, -91, 73, 77, -23, 197, -93, 73, 182, 255, -23, 42, 8, -26, -28, -81, -180, -192, 129, 31, -85, 62, 12, 233, 5, -61, -45, 76, -69, -58, -1, -50, 148, 23, 250, 15, -47, -47, 19, -187, -93, -2, 18, 53, 117, 82, 2, 51, -117, 82, 14, -22, -128, 4, -67, -214, 31, 30, 167, 116, -12, -171, 23, -81, 60, -159, 119, 26, 137, -99, -215, 126, 294, -1, -64, 181, -80, 19, -211, 2, -57, 80, -23, 240, 93, 44, -82, 325, 82, 141, -28, -67, -116, 165, -30, -55, 110, -20, -236, 99, 50, -94, -27, -79, 76, 209, 25, -191, 355, -137, -49, 54, -199, 118, 146, 65, -85, -246, 49, 166, 124, 30, 38, -192, 161, -192, 308, 69, -165, -177, 32, 75, 105, 34, 2, -74, 0, 40, -63, 55, 105, 57, -7, -73, -17, 95, -73, -149, 3, 97, -63, 58, 23, -202, 29, 14, -226, -38, 57, -76, -8, -130, -96, 78, -153, 57, 131, -244, 27, -15, 30, 12, 30, 22, 57, 65, -57, 14, 22, -54, -116, 14, -58, 34, -13, -26, 112, 63, 26, -46, 12]
5075A2K3m8J07Qq4J8KPJ16j89p1M0K32k05o4K09k38K11J85j44j08J1k48M10k41
5100d9J13J26k27j94K60j29R1J01M8j87k13K48K2j04J87Pk62K22n0k3l8q6J19
5123a8Q0n4r1K0K06j74J40j46K78l79J72j34J37r4L4J30q3p8k24N07l48O6O4J05
5147A16k60L30k23J41K8k55O7pK02j87M0j29K22j58N9j37J82Q5k26J65j7k85Q7
5170a60K72k44L34k44k09L11j36N4J22p0m6LJ3j05k32K68O2q7K21m0J8j16J57
5193A46o1k00J32j60K24j84J84j08Q0j37J36j76R9J79j56j26J18R7R6J0p5j58
5215d0o3l0R4J42l39M7K5N8K69j22J38l9j4J0lJ16m01L75l38J55j30L3O1r0l9
5240a25K51j21l26J95L58l08OK59j00j64L33k09o6K3l2j35K73j19M1k12K59j82
$$ y = [12, 35, -13, 94, 102, 18, 36, 38, 45, 161, -28, -99, -59, 173, -32, -96, 113, -125, 86, 271, 127, 19, 30, -218, 192, -49, 64, 190, -37, -231, 29, -100, -9, 92, 140, -47, -260, -12, 10, -94, 93, 100, -162, 60, 10, -13, -51, -137, -18, 62, 8, -83, -63, 143, -31, 109, -37, 241, -138, 34, -100, 37, -57, -23, 107, 24, -54, -278, 229, -119, -53, 11, 116, -144, 186, -37, 104, 132, -123, -56, -63, 139, -48, -8, -137, 85, -73, -14, -151, 31, 116, -110, 55, 38, -247, -160, 112, -132, 202, -42, -251, 60, -76, -22, 100, 30, -16, -13, 0, -105, -337, -69, -7, -94, 127, 87, 105, -11, 146, 85, -115, 17, -143, 81, -103, 81, -27, 53, -84, 52, -124, -25, 154, -2, -128, -10, 87, 183, 193, 118, -40, -103, -133, -39, 103, -236, -189, -164, -106, 163, 41, 179, 140, 126, 136, 133, 249, -152, 223, -115, 40, -90, -57, 4, -86, -125, 126, 5, -321, -126, 232, -76, -70, 189, 89, -75, 258, 49, -17, 6, -26, -161, 112, -7, 34, -178, 81, -101]
5262a01KJ62N7K5j88K82l59p3L24j51p6p2k8J55P7q7qP8j10M5J40j37p6K76k37
5287h0j3P7J18j72P1K41j70j30O8j24K7JK7q5J15Q1j2j98K94Jk73j27M12J08l31
5312g4J34J68k12l4R1J29k26r2K20K1j67j4j67L01k22L4l6J1J74M7k45N8L7K06
5336A42k37M6J87j37j43J71k6j31Q8J02J4j82K57k81R4O9J7P5j68J91k12J37K95
5359C68k11J01j79j9j96L02j95o2o9O5L61j83k17L72R7k50Q3j76j76L63j35n1
5381gN9j46K40o6J40l71J42l3n3J8R3pJk76L66j91J37j02KQ0R4k34J62r4o0K18
5407A12j7k64K18j57J70r8j8M6P5j50qJ48N9k46m0K93l0j93o3M75l83J68j80M4
5431c9r3K49l5j48J89j27Q6j38K03j10k1Lj32K28l74J46K32Q1k34J5J09j53J20
$$ y = [-101, -99, 63, 120, 145, -43, 239, -120, -193, 131, -20, -96, -168, -196, -41, 36, -51, -59, 19, -91, -46, 94, -43, -119, 157, -80, -93, -16, 102, -70, 1, 242, 72, -58, 10, -114, -87, -86, -59, -144, -29, 52, 40, -158, 136, 137, -136, -263, 149, 257, -74, 60, 228, 16, -18, 73, 202, -24, -116, 104, 125, -42, -56, -223, 78, -144, -110, -146, -135, 39, 86, -159, -101, -64, 142, -95, -49, 138, 1, -142, 29, 3, -128, -40, 62, 76, -106, 151, -130, -36, 33, 50, 125, -43, 148, -64, 73, 368, 157, 258, 79, 60, -136, 166, -29, -91, -160, -95, 266, 83, -134, 238, 335, 85, 168, -8, -184, 179, 44, -7, 52, -94, 146, 80, 220, -151, -9, -42, -95, -77, 16, 9, 10, -266, 100, -91, 46, -56, -54, 26, 120, -114, 48, -46, -106, 112, 95, -169, 49, -108, 62, -36, -54, -8, 67, -83, -91, 57, 116, -130, -170, 123, 93, -100, -163, 312, -71, 97, -83, -39, -132, 117, 82, -66, 123, -4, 82, -56, 147, 37, 16, 19, -113, 115, -259, -113, 119, 200, -34, -19, 90, -63, 57]
5454E7k2J90lk91J05J38N0k05r8J51J32k82J58P2j88L8j3m5j09J41l0N2l8J15
5478G5j56K06j62l24L39j02l9J40j69J4q7J45K12Jj44O2L5N8j78P9K06m63J84
5501f8J4O1l2J61j12q3K12j14o4J03k13M5k1K87p6j66K23j00j64J50l99L02j14
5524a68J44J39n7j86J08L63l80K10k15J32L4n6o6N2J26k72P1j56K46k84K21K2
5546B8j59N7J74j33j05l6R9O4j13R2N3j25O3j78L10R7j7k39J56k09K50j31j65
5569a67K39J93k76J23j00j71J64K5N9j04O9p9r4j16K61o8N7J05j64L32j86k6j75
5592i9N6j25J22P1J91k22l7r9j7L03l4Ql9n6L9p3L1L03l03K99l92NL5K7J5j76
5618a67K53l55k1K86k16K08J8j13J56j28P2O6o8Q0J3J34k21K09k96J17N8k44M7
$$ y = [57, 35, 225, 222, -69, 36, 174, 224, 19, -79, 72, 204, -78, 80, 152, -36, 2, -11, -56, -165, -24, -54, -2, -40, 75, -81, 125, -37, -361, -22, -124, -163, -23, -192, -178, -265, -120, 92, 93, -51, 11, 46, 104, -74, 5, 211, -252, -68, -54, 7, -25, 136, 24, -59, 153, 39, -25, 78, -135, -90, -111, 176, 100, -66, 157, 57, -107, 43, -356, -54, -168, -24, 115, 58, -128, -20, 343, -37, 173, -42, 90, 124, 68, 2, 54, 180, -92, -21, -177, 69, -215, 6, 28, -131, -74, 100, -33, -138, -174, -75, -11, -124, -32, 21, -104, -41, -219, 91, 188, 171, -68, 88, -121, 129, -2, -167, 72, 265, -11, 112, 12, -159, 5, 30, 89, -15, 54, -25, -119, -235, 26, -42, 15, 120, -44, 288, 102, 76, -99, -43, -168, -46, 25, 216, -6, -43, -142, -159, 144, 110, 118, 79, 23, 62, -11, 20, 323, 20, 319, -73, -68, -33, -6, 9, -167, 86, -269, -290, -4, -220, -12, 6, -107, 49, -79, -7, 59, -9, 71, 84, 218, -3, 206, -90, 27, 85, -159, -112]
5641a12j28K96J19Kj6l21K13J94k90J48j96J12K5l00N45n15K48n9l00J10K82P3
5663A30j85M1l3k7J18j74R4n8J2K35j87Q2q0Oj04q0J57M4m4J13K5j7l74J62Q3
5688f1K33l78K87j13j35OL3J53p5K56m41L52j18m4K6jmkJ83m56L23N5k26K57j87
5713g7p2J94j61Q1J14j95p4J78j9k0m0J59J91j12j83l1J50k7Ro5j7m7j23K57J
5738G1k38K10j78M7K00o6P0l33P6K70k99J21K11j44J79l97L88m55K45j26J55P1
5760G8o0J84k85K51k9j76O4j2M4R2j19m18N29j6j34q0J00O6k46K4K52k08N6k3
5784f6M62m32p3kJ94k21J08J32lKR8k80O6J08j65K30l11j30K17q1K75j41L0J39
5808A56k0j67J38r5J00j54J34j35K6K17j94K0K12k65J15M0j27K3J65j16j0J79
$$ y = [-112, -240, 56, 175, 177, 161, -160, 53, 247, -43, 105, -91, 21, 46, -254, 291, -224, 24, -35, -335, -225, 57, 130, -55, -14, -47, -74, 44, -130, -36, -94, -82, 153, -34, 48, -32, -26, -130, -210, -53, -9, -53, 60, 85, 68, -306, -144, -61, 172, -206, 81, -32, -167, -161, -128, 25, -50, 206, -235, 117, -1, -45, -19, -20, -24, -26, 157, -299, 24, 79, -147, 110, -77, -149, 45, -116, -35, 79, -116, -190, -12, -31, -51, -91, 68, 259, 147, -36, -67, 83, 56, 65, 0, -17, -64, -187, 70, 71, -167, 43, -135, -88, 112, 46, 116, -217, -141, 129, -170, -49, 162, 18, 197, -200, 188, -267, -22, -148, 7, 78, 18, 202, -83, 168, 139, -37, 27, 15, 59, 151, 32, -386, 143, 127, -7, -87, 13, 79, -167, -143, 109, -99, -43, -66, 396, -36, -109, -111, 83, -138, -30, 102, 99, 101, 199, -81, -15, 93, -72, 158, -153, -283, -66, -147, 128, -13, 17, 156, 136, -31, 107, 12, 112, -42, 92, -43, -17, 200, 6, 26, 238, -27, 88, 128, 1, 24, 189, 73, 63, 242]
5830B42k62r5J15O1l21Q7N17n41M57j16l51K76o7K04k45m2L00k66%p4J94J36k73
5853f4K4j37M67k76j20J39j30J52m17N45k36P5N6j38K42m32L40J9P1pk65R7j67
5876a62j3PR4K28j20m0j07J80K7P4j05j30N0J00k43L56q3n9rl9L2L9j03j04L61
5901B31j27j40j0J98k74J32q2J24j09J51m5M6J7k86J48n6J09j02J63j17K34l20
5923a15K03k02J01n7o4M19k59L9r2L53l15j50K28M3o7j24K28K9k70K08j9q8j62
5946a33J88l8n4n9K60j40J15k88K64N4j70l2Q5J31kj82j32J2J29j04J85j08Q9
5969G0R2j57J18j01q0K88j08m48L07j22J53J97k6Q1l38p3K32l90L43p6Q3k08K09
5992D6k62L33j21MK3J28k99J89j15m8K1Q7K2J09k72L65j48j67J3J47k13j8J02
$$ y = [242, -20, -115, 0, 61, -260, -173, 344, -197, 260, 144, -207, 69, 2, 206, -39, -81, 219, -47, -47, -121, 73, 209, -64, -40, -177, 290, 14, -106, 33, -97, 55, -362, 183, -53, 22, 78, -60, 182, -250, 90, 109, 180, 173, -92, 5, -162, -175, -168, -74, 154, 34, -6, -113, 67, 94, 168, 63, -67, -17, 83, -160, 196, 113, 54, 45, 6, 38, 77, -26, -130, 231, 104, -36, -46, 152, -122, 10, -72, 52, -57, 94, 49, 95, 112, -174, -26, -82, 27, -75, 88, -29, 205, -115, 88, -114, -13, -70, -134, 285, 26, 65, -27, 326, 11, -139, 89, 132, 65, -59, 169, 198, -72, 136, 117, 29, -133, 55, 17, -37, -96, 164, 24, 139, -149, 115, 169, -1, -33, 52, 183, 181, -1, -133, -121, 8, -96, 89, -19, 70, 162, 5, 123, 22, -58, 230, 122, -326, -19, -141, 12, 209, 183, 264, -74, -147, 85, -305, 38, -38, 45, -163, 46, -216, 117, -4, 0, 23, 151, -148, 41, -74, -122, -101, -14, 8, 117, -155, 210, 62, -105, -92, 55, -158, -176, -74]
6015g4P2J7j51L99j83K0O9p3j98P4J49j98L8j01J38o8r4o3K55m6j16J51J15J26
6039B58l51mK27J9j99J0J00r2J65j18O8o9P4k09O4R4jQ9k4r1K44j70P2L1k55J45
6065G7k0j14J48O9k80O5L06k68P0q4J8L4k27n2J67J16n7J44j8j89MK56k45J68
6089H8k13j62K25M9J0k8R0k04J02L7m4l8M6M7m6N8r1Q8P1o5j04P2K31j67o1Jm7
6116e5k26K38pj1r3K37j51m3j06J89J21K7r5K2j77J80k9P3j58l27N45j97K86k15
6140B8J10j36k4q8M09l94R2J30k10K0Q3J09k14R4j68R5j55J93m3l6K55on1k66
6164a73L04p5r5J62k69J73J58l01j02J53J73K2j24O9L2j3k76J32N8j33J53j24
6186i6K17K4j35O7Mr5j36K60l29K86l6j59J02K6j42K75r1j00J17O6r8p4R1ql17
$$ y = [-74, -2, 15, -136, 263, 80, 100, 169, 96, -102, -28, 121, -77, -39, -140, -2, -70, -164, -227, 28, -18, -134, 17, 132, 258, -93, -97, 130, 149, -50, -40, 60, -32, 133, 15, 83, 14, 88, -121, -57, 37, 36, 125, 101, 10, 254, 84, 156, 187, -68, 77, 57, -57, 91, 160, -120, -55, 251, -17, 53, -31, -13, 21, -206, -258, -91, 25, -32, 112, 94, -95, -91, 165, -80, 88, -125, -287, -62, -13, -3, -31, 59, -145, -43, -6, -50, -88, -42, 5, -41, 17, -74, 14, 85, 20, -84, -12, 219, 52, -9, -8, -55, -281, -43, -50, -61, -154, 83, -68, -111, -217, -28, 93, 120, 25, 47, -130, 50, 21, 94, -64, -391, 154, -43, 243, 28, 138, 2, -22, -110, 299, -95, -3, 127, -83, -63, 20, 129, -85, 9, -159, -64, -219, -26, -69, -105, 150, 144, 93, -173, 131, 56, -39, 123, -146, 27, 185, -116, -218, -65, 108, 130, 6, 75, 107, 94, -182, -50, 8, -125, 28, -96, 121, 145, 10, 77, 81, -14, -150, 110, -219, 67, 31, -128, -26, 0, -142, 133, 42, -58, 59, 125, 27, -47, 44, 36, -281]
6211b81L72O5j52J27k12N1j94K25m1j43L4J40k3O9P0k69K22N8j90J85m09K33%
6234f3k35K61p3J73j5J12j55j15L66j27R5l17J69j09M0l5k2L62l68k2K60J2k78
6257h4J61j05J56j3j09j40J33O1j88R2Q8J51m77L47P4L3j95N3P5k29J29k14J48
6280e3K45k56J39P7k23K1k56J39J5J16J69m02L05J8n8o3j68K10j94K68m2J4l7
6303a6j8O5k9%j24J37nj24J78j22q2N9R2r5K39k44J83q9N0L1Q0j54l2l1K21k15
6329d5p3L55m01J66o6j9rK7j09K70O5j07lO6k55j0K75j68pJ09j0n1o6J36j76o
6355a12J1K2J11q2k3J60j44j35L02m03M30k96P6j05K76K24l06k09K98J18j60j37
6377h4K9N9j05J74j44Q4O5j99L4L5j2m6R4J26j04J2j25Q8J56j10J22J2j48l7O5
$$ y = [-281, 91, 156, 4, 131, -81, -30, -224, 1, -40, -183, -149, -9, -32, 37, 107, -162, 60, 118, -72, 113, -296, -63, -63, -298, -37, -110, 63, 48, 160, 5, -110, 256, 129, 224, -93, 76, -33, 7, -28, -50, 312, -56, -78, 182, 194, -84, 77, -28, 128, 115, 6, -134, -1, 60, -128, -36, 52, 203, -274, 73, 147, 180, -15, 38, 113, -116, 13, -201, -53, 192, -64, 75, 152, -71, -50, -306, -167, -152, -36, 133, -269, 36, 54, -4, -67, -235, -25, -219, 49, 7, 21, -16, -34, 31, 2, 2, -122, 15, 10, -114, 64, -58, -140, -81, 11, -84, 155, -89, 94, 5, 55, 86, 166, 12, -20, -51, 170, -45, -118, 237, -164, 2, -64, -83, -92, -65, -174, 96, 161, 54, 51, 117, -138, -148, 127, -41, -48, 61, 51, 0, -66, 70, -106, -112, -101, -79, 32, -50, -73, 87, -57, -192, 110, -293, 137, -159, -83, -188, 88, 312, 6, -203, 95, 213, 53, -84, -55, 4, -101, 73, -71, 13, 78, -121, -87, -52, -64, -110, -16, 110, 6, 18, -107, -19, 137, 27, 149, 161, 13, -24, 41]
6402D1J52q7k13KJ60k66M81j57j05J47J8k1r0j22J65j71l6M5K69Rk53J24q1n3
6426d2J38nN1oK98k64j26k05K37l7j36m0M6L7R2k40J2L13o8J9Kl5J44l41P3J40
6452E7k13j73L32P4j38J09k1M5J8j8k16j5K46k48L9K54j66q1J90J46k32%O7j55
6476i9j42J68J24k39J50L75k36j3m6J28j45j11Q5j27R0K2J37j19j29J72j09K14
6498A50Q0l27K17m2M1k66K50no2L2L43l27j29J78j7k16K29oq7J75k14o6K28k92
6522a33n5J78r5J53J9k06j2O2L8J7j96M60m22P0O9K32k14J9j21J07p4n7K05j87
6546a43N9J02J91l65J90k61L43r4j48n5K27j85P4J08j10J55q2r3M5N8j43n3J34
6569d6Q1J4l90K41Qj0Q4q3QJ23l0p8P9J63j62K28O8l61J81k15K04k46K17J30k44
$$ y = [41, 193, 106, -107, -105, 55, -211, 270, 113, 8, 155, 173, 152, 62, -60, 105, -66, -102, -57, 212, 221, -32, 92, 11, -42, 96, 91, 142, 136, 434, 170, 44, -161, 76, 39, -97, -137, -91, -54, 38, -202, -190, 123, 55, 74, 76, 41, 185, -156, -83, 57, -156, -329, 3, 77, -61, 48, 27, 72, 90, 72, -144, -159, 87, -161, -122, 132, -34, -115, 75, 221, -11, -11, 56, -99, -241, -73, 51, -188, -38, 337, 101, 88, 42, 170, 25, -86, -1, -128, -38, -16, 121, 2, -127, 45, -64, 150, 230, -97, 120, 78, 119, -147, 103, 98, 36, 68, 411, 84, -45, 133, 116, -100, 129, 123, 36, 211, -3, -69, 159, -133, -188, -10, -105, 48, 67, -139, -151, -89, -51, -34, -230, 230, -192, -122, -53, 179, -35, -16, -137, -30, -104, -161, 44, -143, -84, 18, 209, -156, 34, -227, 116, 22, -126, -181, 46, -139, -65, 43, -67, 88, 6, -87, -42, 16, -127, -180, -46, 35, 49, -341, -100, -92, -102, -18, -101, -93, 30, 0, -78, 1, 164, 2, 230, 298, -63, 118, -97, 107, -139, 78, 208, -36]
6594c6jJ74m18L69k33POO7n8K90J08m56J24k3j14J74J21j66k1LL11l18m5R1j15
6619a59K62n2m62L19J81j59r5j49L70j71N43l73j78J87j9J47J7l25j5m0K93J6
6641A38k52J72j43J8J08j80Q1K62k96L96k89m5j3J07o3N5qJ13k0k50J73j70J39
6664C3Pj53O8P9o0k21J03j7J04K39j34M6j61J05j96K38l0j26J14m9L2N7k18J76
6688C6l6j19o2J72K7j49K90%j62J2q4N3R9lj76J01K6J6K13j42p7J4p1k36L72l23
6714b09J26M7p4J30M9k18J26nq3J11K0J74j18k80K15p3N9o1J18J6n5l8K02k94
6738a15J48r1P9j80J73o5M9p5l0K15j16k3o9M4J22l61L08J26k4k19J92j58n3j2
6762a35Q0J23j43J93k43p7J14J54k70L58m39K39k8J16R1jR2j65O9Q7k78K7K93
$$ y = [-36, -37, 137, -281, 88, -145, -138, -132, -65, -123, 167, 275, -181, -57, -80, -194, -20, 101, -65, -86, -83, 228, -90, -135, -44, -159, 103, 51, -411, -92, 89, -70, -165, -314, 56, -115, 428, 55, -123, 64, 45, 192, 209, -116, -131, -171, 122, 138, -114, 58, -85, -67, 41, -139, -58, 204, -92, 304, 15, -30, -43, 64, 1, 56, 48, 161, 141, -109, 64, -106, 33, 40, -113, -45, 34, -26, -247, -144, -161, -57, 182, 48, 94, -67, 38, -158, 80, 50, -76, 38, -11, 21, 78, -140, 36, 0, -119, -181, -9, 18, -131, 159, 159, -3, 9, -75, -22, 77, 74, -102, -1, 25, 41, 254, 112, 35, 49, -22, -258, 114, -209, -83, -36, -110, 20, 69, -149, -23, -28, -111, 0, 20, 194, 76, -204, 11, -62, -3, -64, 54, 70, 15, -23, 179, -115, 33, -58, 21, -159, 14, -51, -2, -77, -107, 108, -8, -31, -100, -56, 66, -295, 13, 139, 115, -104, 88, -70, -123, -135, -55, 68, -75, 118, -125, -202, -88, 66, -204, 154, -285, -46, -74, 42, 133, 132, 224, 59, 128, 215, -63, -36, 257]
6785B57k54M9L1J30k37Q3J41q1l4l5r0l7J79j43p5K50k76L29k03n7O2p8M2J22
6809G5j58K6K36k43Rj32j5J33j10J37J40m2J82k00n0K43m20k2K68Q2j56r0K39
6832A32k22l6J06j7j21R9L1m7N5R1Q0j25J9N8j8J09r0j0j63K35j22J80P3l67j0
6857h0k9K59l1l76J53kJ60j74J95j31OK37k80J99n3r7Rm2PL58l66m4K43k7m9j58
6883a13J54o1j15Q6K7k3N2j08J02k64J44K24k88n2K33o8J52k41J73j3Mq3J83p6
6907B9J03l5oj21n5J55j14K9k01J46n3Q4k9n3K8j87J33j43K45J21P7k45M9J61
6931A18j01r9J64j54j7J1Q5o2lK58r1j03L7n2qR7p6j96K49j31K52R7k06j85J72
6956E6O9Q1j64k4l14K55J02l23J58K26r8p8J01o0r4L93l39J34%N1k53m2K85k04
$$ y = [257, 3, 52, 83, 213, -24, 59, 200, 119, 85, 50, -40, -77, 102, -41, -116, 134, -142, 187, -16, -73, -11, -89, -47, 75, -83, -57, 179, -64, -55, -187, -202, -69, -179, -42, 98, 56, 238, 38, -12, 231, -189, -211, 57, 139, -17, -107, 132, -90, -126, -20, -37, -158, -59, -28, -75, -20, 71, 151, 26, 45, 103, 85, 194, 104, 94, -69, 166, 44, 224, 297, -70, -80, -109, 150, 119, -257, -104, -106, 54, -120, 75, -56, -50, 187, -93, 106, 53, -44, -35, -77, -70, 288, -78, -122, 121, 94, 45, -113, 41, -20, -135, -49, -22, -45, 7, -101, 1, -263, -119, 105, -183, -235, -2, -70, 82, -159, 14, 1, 5, -78, 105, 29, 132, 97, 91, -30, -85, 70, -44, -15, -216, -70, -123, -39, -68, -121, -93, -280, -147, -290, -45, 76, 153, -92, -43, 118, 17, -82, 82, -72, -89, -78, 7, -55, -58, 200, 109, 6, 43, -9, -17, 80, 4, -192, 57, -74, 178, 275, 69, -116, 56, 125, 206, 42, 18, -296, -41, 61, -262, -104, 122, 24, -54, 47, -13, -107, 286, -53, 81, 81, 132, -121, -163, 122, -82]
6980h2J94J19k1j59k16K30j9l41N61l03K91k97N1j12R2j84L30j07M6l82L12M3
7002D6L9p0l1J11Nr5J56j84o5n9R2mL0J4L11k29j3K5j43J8k4k4q3O9J6j7oO2J35
7031H2j85K91k69L7K32m52K08O7L4j24K7M7o4J62K4p4j04j63K58o6J33k42P1J09
7055C9Q0K5j22j75K46j28l9P8J22j51J85n5k60J92j5m2j93J02L9m8n9K87L4k32
7079i0k2L00n7L2J03k94J53j75K5j63K93l51K57j47K32j81lm4J41M9P7j7M7j60
7103El8J96L3j81O4N6M6k82J88l16L61k37l9j58K68k25J72J43j36Q4K8p5J6p5
7127a02L1Rj8K13j65L1n9K0J18k60K88m2q0k26J66O9J33j19o2J72J5k19O5j2L39
7152C05k07K40k29j03N2j17JM2J11Q9N4k25J99j32Q1j54k31o8K55J14J3J05M6
$$ y = [-82, 112, 231, 210, 51, -165, 65, 46, -295, 266, -37, 254, -43, 8, -104, -12, -196, 134, 27, 73, -309, 3, 46, 85, 15, -16, 95, 100, 5, 161, -23, -88, -147, -55, -59, -29, -15, 296, 67, 54, 79, -64, -46, -70, -94, -177, -108, -92, -109, -115, -53, 82, -103, 188, -81, -44, 188, -264, -56, 11, 45, -79, -52, -5, -69, 93, 117, 43, -61, -224, 34, -32, 101, -141, -70, 39, 119, 144, 22, -153, 93, -35, -74, 4, 126, -25, 160, 105, -155, 37, 22, -20, -213, -111, -72, -120, -179, 108, 142, -90, -112, 188, 131, 163, 266, -28, 125, -50, -25, -188, 105, -246, 11, -136, 96, -85, -88, -132, 9, 58, 135, 118, 165, 5, -33, 163, 196, 15, 79, 135, 181, -101, 87, -229, 132, -105, -144, -302, -34, -259, -87, 56, -80, 4, 32, -43, -27, -102, -71, -62, -80, 133, -32, -1, -60, -40, 78, -182, 106, 64, -16, -242, -76, -7, 126, 7, -55, 117, 132, -87, -22, -34, 305, 98, 338, 109, 6, 58, -59, -58, -16, 95, 184, 238, 13, 212, 80, 161, 7, -224, -292, -37, 77, 90, 195, 241]
7175B41k60L4l5k07L52j67m9J84p8j04J53np5N9j94J5n4J45K38r9O6n1k01Q8l
7200gp1J95p9M6r8L3Q0j46Q3L2k93R3J18R0l22L35j72P3K02j22n4p2M8rO1q9J48
7227A03L2l3p0k9k1m8m9n1L00j72K21j72j14O3l9K58l89M7K1J05J26ORk6k61K13
7253C0K26k10o5J49K8j18J4j43j2K47k07J78j9j75J75k33K48k63J10k14K12Q3
7275D1p8j3J34k51k04K71J24k76p4O93l77j48J96J24k80J56m7Lm2J57k59L96k87
7298d1M1j7J51j45R6m6k58N5L22j27qJ02o0M2jj57LO1j38L26pk02k6R4Mj14J30
7325H0j39K5l1j36J58O6l0J41j70k4J01J12k15J10R7j51J23L3o2m29M50o3j29
7348h3P9j18P8K74m04K13o6J9j57J46J32Rl42j04M83L9l01j0J52j90K76J5k11
$$ y = [241, -19, 15, -20, -227, 125, -42, -91, 93, 15, -89, 64, 59, -16, 43, -151, -136, -190, -45, 193, 94, 160, 109, -92, -4, -7, -78, 117, 38, 84, -14, 19, 99, -47, 36, 68, -225, -132, -14, 76, -246, 89, -83, -10, 192, 70, 16, -56, -8, -17, 44, -45, 103, 135, 102, 32, 3, -18, -66, -115, -166, 134, -38, 183, 11, -103, -40, -79, 179, -210, -163, -142, -37, 89, 95, 104, 78, -183, 30, 256, 46, -19, 130, 158, 40, 54, -89, -101, 146, -61, 117, 98, -77, 98, -135, 113, -150, -40, -254, -42, 41, -37, -50, 84, -167, -371, -100, 24, -252, -326, 367, -10, -158, 38, 162, -118, 38, -9, -6, -48, 109, -150, 246, -41, 0, -17, 134, -11, 85, 39, -219, -164, 158, 31, 23, 125, 65, 107, 106, -51, -48, 13, -125, 201, 194, -8, -34, 60, 64, -50, 80, -59, -34, -65, -201, -43, 23, -7, 134, -36, -60, 41, 153, -62, 48, 145, -6, 117, 150, 88, -341, 109, 46, -83, -4, -122, -44, 230, -174, 39, -27, -8, -165, -19, 113, 122, -220, -324, 159, 198, -103, -113, 39, -151, 125, 140, -71]
7371g1K35k08P7m2j07l3K69k44m5J54J80k1j79j62K84Pj01K90j44j91Q7j75J64
7394B4K18k30R9j78P4k0k7J14k55J17J30M4l45K84J66O2l77N0K6j72J33Q4J48
7417A69j08J36k84P5k66L80j92J14R9j65j63j21K92k60L29om6j82L03j89j23o5
7439b73K56k11J98O6j40Q0n4LK02k43K46q7k8J2q9O1O9j03Q0O8K8L2j73K3m9J87
7465A61j29R8l1J9l05l9J01Q3r8K29r4n5KK2J64k6k03Qp4K78j66Lj29M17l54j55
7491b73L40k57M34m33K25M4Mj61MJ35j50J69k19K83j03q9O1J33j96P6Ok66J58
7514g5JJ19n1Q2l33K15K2l8j57K51P0k27J4J65q4P7J9k44K90J78j83k15J82k37
7538a59J63k76M24Q4j93j13Q0Q0k48J97r2N9q5j5J63j04R4j34j9J62k89M60r8
$$ y = [-71, 164, -44, 33, -9, -116, -149, 120, -124, -169, -15, 165, 144, -35, -197, 87, 94, -7, 283, 139, -52, 35, -140, 24, 242, 12, 111, -67, 7, -13, -40, 74, -181, -64, 66, 110, -235, 49, 215, 277, -100, -50, -24, -196, -63, 21, 169, 61, 197, -87, -12, -278, 102, -90, 24, 123, -42, -205, -326, -34, -294, 35, 29, -17, -199, 104, -85, -208, -273, -17, -228, -30, 36, -104, -24, -78, -75, 127, -116, 130, 43, 15, 27, -62, -1, 68, -35, 45, 113, 141, 173, 0, 23, -26, 161, 32, 130, 99, 118, -187, -226, -125, -42, -140, 89, -5, -60, -58, -36, 128, 102, -101, -93, -167, 111, -55, -52, -181, 236, -118, -273, 67, -190, 244, -189, 36, 80, 84, -77, -73, 62, -88, 81, -138, 145, 42, -47, 14, 147, -49, 27, 33, -233, -75, -74, 45, -6, 76, -257, -42, -20, -58, -215, 36, 106, -121, -107, 58, -26, 51, 70, -174, 116, 294, 111, -104, 78, -159, 4, -272, 152, 236, 43, -70, 10, 90, -158, 39, -53, 6, -79, -94, 69, -35, 59, -75, -94, 68, -221, 239, 141]
7561A41j65n1J53r9j69K34j38J77Q2l25K54j33L2j50J61J66k43O0r6J12P7k02
7583a22J23m9k24L72j45Q5l7r4n1K69k34J49J73k58%J00j37L27k46J61m8l47K54
7606B1j09J19j44R3K05l70J78j7o0K1K28O5l39kK78j74J60k71J76jl3J2J61k46
7630d9k3J30j50rR0J25k88K53j84J34Jj32K20k61K3J16K7j13J1P1K5j93K56Q7
7654A67m1k7k8o3j98J17J22p3K93k41q1j17K37J9r0J07j6M4P8k23J24j61oJ0j11
7679a58Q5k61M82l25m9K90m2p8J63j05J21k79K8J12K10j46L9k36J24K07j29K0
7701G3J95k83j07M9J97j79J41j44J67j70P%K08o2j97Q9J44m4j51R3J09J34k70
7724aJ15n2n2J44J4k40J20Q3p8k6j57m2Q3K66k94P9M2j36J30R4j9n4j24R8l5O0
$$ y = [141, -24, -75, 78, -21, -190, 44, -94, 83, 165, -160, 94, -39, -7, -157, 4, 170, -73, -13, -109, 3, 80, -122, 1, -48, -272, 100, -45, 40, 3, -91, -142, 127, -107, 42, 215, -43, -43, 57, -80, 247, 1, 162, 114, -233, 21, -88, 31, -113, -20, 185, -185, -7, -24, -84, -63, 165, 230, -109, -111, 167, -7, 153, -118, 58, 57, 24, 36, 197, -49, -72, 58, -92, -101, -11, 114, -174, 79, -105, 29, 30, -102, 118, -143, -120, -4, 23, -90, -79, -8, 17, -176, 80, 167, 126, 99, 71, 8, -190, -73, 49, -24, 269, 28, -53, -170, 67, 86, -4, 103, 87, 131, 209, -14, 110, -51, -57, -47, -158, -73, -334, 148, -177, -226, 64, 22, -56, 107, 2, 123, -156, -128, -16, 194, 48, 87, -149, -25, 182, 53, 73, 268, -15, -122, -73, 124, -55, 86, -58, 109, -61, -54, -54, 154, 92, -105, -16, 128, 84, -67, 26, 135, 269, -1, 114, 62, 10, 154, 168, -72, 48, 131, 53, 27, -130, -172, -89, 177, -117, -38, 4, -132, -2, 92, 73, 19, -105, -7, -42, 18]
7750A8j59K27k6m1Q2j40oj8o7J0K52l02J16J9J51j59j14m3P4J95ok56J82L23j30
7775A82p9j44M1Q7j96j70P6L25m7j16O7k28M42k88j9J72j13n7K72l37O6oj54K91
7799F7p6o4K1N4k0q2J4Km2J00J45l0k41J99K37k96q4L00k30J48l12L23pN3q1l25
7825b27M68l00K44j80l2n8K18j8j44lq1J86J40l57K51p8n8o0Q1J90M3m0p9J46
7849B52m41Q4J77j04k19L11j69J82o8n3K37p2k22K33j91p2nN8L4n6L12n13M58
7872A53q0M8j01r6J07k66M16l90K36O8J09k46O6j31L18k31k00L30j49K7K01j34
7894E5k16J9J51N3K07k65Kqj3J27j07j33N1l5J84j74K94l75M23k35R6m27N82o04
7918c48J48J86P6j0j40M34m68K07lj13J47k32N3J58q5j12K43j42J17k45J36r8
$$ y = [18, -141, 86, 60, 19, 101, -39, -45, -63, -130, -120, 132, -170, -54, -35, 116, -43, -157, -200, -126, 69, 63, -193, -11, 312, 182, 103, -41, 0, 87, -109, -279, -203, 122, 75, -41, 26, -202, 240, -48, -67, 105, -8, -65, 207, -130, -64, -70, -224, 67, -9, -73, -52, 2, -18, -100, -86, -84, -126, -26, 119, 89, -152, 47, 284, -12, -96, 204, -26, 122, -190, 133, 126, 179, 98, -227, 241, -59, 185, 5, -27, -85, 133, 115, -29, -32, -113, 73, 213, -144, 107, 29, -29, -89, -8, 182, 225, 185, 106, 252, -189, -105, 72, -32, -251, 60, -109, 73, 5, -48, 189, 117, -105, 128, -63, -135, -140, -82, -48, -104, 208, -305, 153, 73, 121, 20, -76, 31, -235, 181, -209, 27, 95, 204, -42, 24, -107, 211, -20, -220, 110, -39, -12, 189, 55, -161, -142, 9, 62, 269, 4, 6, -2, -15, 112, 5, -128, -77, -112, 72, -102, 192, -183, 240, 5, 101, -326, 256, -348, -200, -14, 62, 52, -88, 346, -122, 85, 82, -31, 116, -116, -63, 95, 10, -102, 141, -1, 116, -129, 7, -91]
7940i1k0K10j39J4j51mR0Q8q5JJ45NK0j26r1L36o1L2n24L26J33n5m2q3J06j33
7966i9K46k6k58M89q3l86O9M5j00K42J26m07K81om7qk57J75j06J36q7jK20l22
7990a64K63P5k10K62l86L26j55K03k02j6P9jO3k72K12l13L79k00K5q1l9J42l6
8013d6L5k57P2L01j03L8j03K46j15J37k03lj00J4j79K99r3n7J61J37j47P6k17
8036a07J4P6m0R9j16Q0j66K73j05K52l33J90j39n0K26j26j73J21N1N9o6J62k20
8059c8j29K22J52k00o4K47j91N4j60m5J46j49L85m2k42K45k71j10K18k41L56J6
8081A59j03j44l4J80k82L30Jp3K57k73m4o0q7Q0r6M5lP0J08JK9j16M2k9J77r7
8107C8Kj25J55j60j2nL7K27j91j84L78r1j01N3j35M2J99jl1k73O3K84j78J78l90
$$ y = [-91, -111, 99, -40, -26, -177, -181, -91, -3, -88, -87, 58, 63, 83, -43, -134, 202, 141, 173, -351, -25, 108, 53, 11, -72, 34, -99, 147, 121, -137, 352, 269, -117, -48, -3, -103, 139, 265, -142, 139, 133, 86, 78, -179, -4, -110, 26, -61, -62, 158, -164, 99, 174, -36, 226, -160, 166, 11, 214, 12, -4, 75, 74, 137, -135, 77, -236, 143, -57, -32, -113, -152, -10, -46, -11, -268, -196, 105, 2, 40, -63, 183, 68, 205, 2, -1, -101, -87, -266, 33, -60, -117, 44, 181, 34, 110, -107, -93, -17, -57, 42, -74, 6, -160, 113, 8, 260, -73, 117, -22, -72, 154, 28, -145, -24, 27, 86, 20, 182, -38, -167, 55, 207, 7, -57, 190, -1, 53, -107, -152, -6, -155, 230, 188, -54, 191, -80, -190, 28, -213, 143, 159, 56, -88, -122, 58, -224, 106, 107, 34, 291, 18, -26, -86, -173, -93, -189, -144, -147, -77, 31, 32, 61, -55, -13, -42, 135, 38, 40, -85, 70, -90, -102, -107, -70, 157, -34, -218, 160, 69, -32, 21, -114, -72, 127, 126, 95, -178, -115, 169, -9, 169, -221]
8132b21M02j48j00n5Q9l6k13M48j07j05p7J65k66K46K9j76K3P4J13q3R3k72K26
8155D9l07K56j22N3J56j18J86j79O2j21J86k62K47k45qK49k24kK08l02L27k87
8177a98K30k31J36n2K38k73K70Qk14L2K07P0l18L3
$$ y = [-221, 181, 33, -67, -122, -33, -69, -282, 166, 59, -46, -123, 42, -224, 22, 51, -125, -102, -28, 85, 2, 95, -177, 49, -258, -2, -124, -71, 85, -33, 153, -26, 36, -85, 101, -161, 86, -159, -167, 82, -142, -144, 64, -238, 89, -198, 32, -199, -63, -115, 123, -150, 120, 128, -86, -54, 153, 223, -95, -62]
8191f2
$$ Imaginary data points
##PAGE= N=2
##DATA TABLE= (X++(I..I)), XYDATA
0@%%%%%%%%%%%%%%%%%%%%%%jOj3J6j6J6j6J7j9K5l1L3l5M1m8N1n8O6p4Q2r0J00
44E2j10J23j38J51j64J80j99K19k41K66k94L27l64M02m44N00n66O41p35Q59j022
65e57J248j592K181l510J6361j0834j165O699q962M750q93l187R13O81k502r51
81a320J78J102l930J753J126m573K148J372n197L112O47m610K189J795l857J652
97f413O52j250N37O06j65j151J433J399k829K613J478l755L589J735l844L791
113a574Q51k490K748P22j138J524P18J38m34J271J240j862J901J359k693K732
129E013P06k719K812L49k691K435Q6j631J041L42q13l89L94j4j799J301K91k644
147B070J499M2k845J941m65k609J764p90j998J326n44j134j65Q7o70j068P73r4
$$ y = [0, 0, 0, 0, 0, 0, 0, 0, 0, 0, 0, 0, 0, 0, 0, 0, 0, 0, 0, 0, 0, 0, 0, -1, 5, -8, 8, -8, 8, -8, 9, -10, 15, -16, 17, -18, 23, -25, 26, -32, 34, -40, 42, -48, 52, -58, 65, -73, 78, -86, 94, -105, 114, -127, 139, -155, 172, -192, 210, -234, 266, -300, 341, -394, 465, -557, 691, -901, 1280, -2230, 14131, 3297, 2132, 8831, -131, 4619, 3726, 539, 1452, 2133, -369, -1320, -1142, -40, -3970, -2217, -1091, -5664, -3516, -2144, -7341, -4229, -3582, -8192, -6003, -4208, -8065, -6413, -5761, -7011, -6474, -5868, -6033, -7184, -5751, -4352, -7181, -4568, -3090, -6845, -3256, -1521, -5365, -1574, -723, -3213, -465, 257, -881, 643, 1361, 1499, 1065, 2336, 3576, 1714, 3615, 4974, 2281, 5013, 5719, 3000, 5812, 6161, 3470, 5905, 5991, 4360, 5401, 5743, 4930, 4541, 4935, 4921, 3122, 4423, 4714, 2070, 3569, 3611, 766, 2707, 2242, -367, 1397, 607, -1391, -65, -609, -1743, -1908, -1821, -2491, -3559, -2786, -2880]
165b880j974J475p2k064J913m19j722K008n42j273J825l86m87O29J11Q4J15O34
183c025N99j144J649M30j240K157nj334K406J1j097K111m84j49J593LKl6P08R9
203C254n26J328J50j271J707k73j066J641p57j102J566p85q91R93o70k96J25l28
221B799j81n64K64k47j487J101o61j418J090r55r18J186j002j303J054o10p45
238b597M58o99l77lR8l31p60J110l41p50J015m15o82J394n75k00Q36m40J50P12
258b397l66N93K56J07M26k33J228j40m20J674k89m37J650q51R5J413l37j84J055
277B843k43n1N47K40k1m35P57q9q11R78m60m08P79n25n18Q74q81k91M22o66k54
298A787K99o53l19k59j28l49o75N79q61p95R78o79p13O58p90k59M47j086PL17
$$ y = [-2880, -4854, -3379, -3451, -5515, -3602, -4021, -5743, -3735, -4277, -5550, -3725, -4111, -4598, -3969, -3858, -3774, -3659, -3025, -2426, -3570, -1921, -1491, -2731, -574, -579, -1913, 493, 504, -593, 1518, 1034, 885, 2478, 2481, 2483, 2447, 3155, 3254, 2728, 4056, 4206, 2935, 4642, 4369, 3303, 4944, 4187, 3085, 4651, 3866, 2975, 3968, 3298, 3002, 3127, 2799, 2618, 2054, 2318, 2071, 584, 1685, 1024, -394, 696, -259, -1177, 9, -993, -2296, -1242, -1852, -2597, -2139, -2838, -3215, -3218, -3120, -3451, -4211, -3101, -3442, -4192, -3177, -3592, -4274, -2880, -3455, -3655, -2819, -3259, -3109, -2397, -2763, -2170, -1914, -1807, -1381, -1614, -386, -526, -946, 728, 439, 2, 1652, 801, 896, 2309, 1972, 1788, 2843, 2600, 2549, 3096, 3336, 3315, 2880, 3637, 3548, 2737, 3715, 3255, 2847, 3626, 3101, 2583, 3457, 2576, 2285, 2707, 2041, 1787, 2086, 1433, 1114, 855, 727, 378, -297, 282, -579, -1374, -396, -1075, -1788, -1130, -1920, -2179, -1732, -2818, -2811, -2494]
318b494l28j75j30L58m33j03N96l76m78J197o19l3P33l46J13O84j81L30N69m1
338a157K00L45M2P24l46O11L4l0R97k62J25Q49n81p1J112n42M24M24m35N09P0
359C042l48K43j21K38m29p7M84m97l19N88j069j60Q91r08k09K87j123M12j53n37
379B35J7l22j24m07k78J90p00l04O40r23l59O34p38m8M22p84K15O2k54R8k00L16
401b612n9J43K20j69Q8O40m26L54O32o17M25P03n12P59J84k43O30L05L9J88L8
422G10M38K2r7O47j21K3O21l46r8Q04n53N17l8j14M53k64k09J90m25K51o3o52
444A696L53l00l14L55q40Q2l6l98Rk15m33o7n8l95K7l33p6j99n42L15l22m81L05
467a867j47j90K95p24M50K3l38P5O9m97O55M3J7L04j89N46l22P9N47J03K07L05
$$ y = [-2494, -2822, -2997, -3127, -2769, -3202, -3305, -2709, -3085, -3563, -2366, -2985, -3018, -2285, -2631, -2518, -1834, -2015, -1685, -1116, -1157, -957, -612, -570, 154, -192, 419, 453, 423, 1420, 1158, 1283, 2132, 1551, 1480, 2592, 2050, 2474, 2898, 2463, 2972, 3042, 2694, 2937, 2816, 3054, 2625, 2548, 3032, 2535, 2216, 2804, 1735, 1575, 2466, 1558, 1349, 1636, 513, 925, 772, 235, 252, -70, -194, -601, -879, -689, -1389, -1693, -1053, -1976, -2335, -1701, -2439, -2487, -2065, -2849, -2634, -2572, -2826, -2728, -2928, -2612, -2671, -2528, -2308, -2477, -2389, -1749, -2175, -1821, -1189, -1806, -1381, -678, -1190, -431, -247, -490, 140, 445, 484, 672, 710, 1148, 1170, 1073, 1720, 1599, 1622, 2243, 1897, 1799, 2603, 2050, 2567, 2529, 2415, 2868, 2604, 2395, 2585, 2160, 2411, 2348, 1696, 2049, 1749, 1435, 1790, 950, 1032, 996, 598, 607, 392, -41, -108, -166, -561, -534, -867, -943, -1142, -1684, -1369, -1691, -2172, -1867, -2014, -2204, -1909, -2633, -2183, -2160, -2498, -2423, -2354, -2851, -2196, -2153, -2136, -1832, -2021, -1475, -1797, -1718, -1171, -1068, -861, -556]
489e56l49Q25P6k59L53M42m01O47PJ19K59J12K42J84k5K83j70P1N03l88J56J34
511B265o2j3R9j75L8j77l25L43m45J28k1m62K04m95k82P1j36j45k93m93J91m73
533f58l7O5l08j50J34n07k98J30l36K10k39j35K23m26J58J9q8K55M7n20R40k70
555a791j11M41O5NJ92j86O09n1K57K38l98O03J90j20M64K45m24O40J08J70M83
576A629k05K8J82j06L91M0J23j39QJ94k28P7k06K96m25M12k59m35L11k00J7L7
598A542o63K2J72n21J77k96k81P6o57J47k74l35L7q6k46J17n23O5J88k95n3j30
620a817j48K14k05P3K75n26L50q4lL78R6k43L77j40J94L03n2K30K61o5Q6K13J1
643b22M05Q8K98J60j52L88R7L9L02p0R2L19o5j48L09k75L46j00k42p4M45l05J03
$$ y = [-556, -905, -80, -4, -263, 90, 532, 131, 778, 785, 904, 1163, 1275, 1517, 1701, 1676, 1959, 1789, 1860, 2363, 1975, 2131, 2265, 2203, 2190, 2289, 2114, 2152, 1975, 1650, 1993, 1548, 1676, 1655, 1193, 1397, 902, 620, 691, 555, 410, 117, -376, -185, -658, -695, -630, -938, -1088, -954, -1461, -1759, -1629, -1965, -1755, -1994, -2129, -1906, -2332, -2174, -2155, -2243, -1988, -1941, -2461, -1521, -1791, -1902, -1461, -1396, -1391, -1199, -1385, -776, -827, -570, -332, -730, -127, 63, -57, 407, 652, 228, 868, 976, 1146, 1629, 1424, 1452, 1634, 1528, 1919, 1959, 2082, 1943, 1951, 2145, 1917, 1994, 1788, 2084, 1659, 2071, 1812, 1377, 1688, 1488, 1505, 1542, 879, 901, 1073, 552, 729, 433, 152, 228, -429, -282, -556, -891, -854, -940, -1186, -1069, -1592, -1527, -1339, -1634, -1687, -1817, -1965, -1751, -1956, -1883, -1608, -2134, -1784, -1868, -1871, -1493, -1397, -1640, -1263, -1403, -1209, -906, -958, -728, -467, -532, -446, -233, -222, 183, 271, 569, 729, 577, 965, 1062, 1101, 1403, 1333, 1425, 1744, 1679, 1531, 1840, 1565, 1911, 1811, 1569, 1495, 1940, 1635, 1738]
666A738k09L4p1m25M70k21n45K25l44J03m7m77J57n46Q6k50J72l68k0p6j09k91
688a014k07J61j71l83J76r2k17O1k81K05K96l97R4j31J45L48k80N60k28j88N92
709i51l22J11M13q5J45J31K22K29K87k0m9O14k85K67j07K32L65k54L12Q2k9L3
731A341M1kP4K64j32N03o71O9J58j66L14m71J69k26k92K49j70l04J26l91K7k10
753C00j07q8Rl81J04l20M7l81m8n4j41j70Q1k34j59L91k40j42J35k44j93O81n46
776a700K05L3j36Q5J72J98K08n4K1K44J14kJ66j01M93J36j37O7K15L07M0k62L69
799F81J60l8K53RJ12Q5j95M90r8k12R3J71n3j24q7j3l5J64n7k92J45j4m4k43j45
824G13j76K19l11k36J74l25l23O0j87K50l55l15P5k96K56k37j29L7j76L2Q2k05
$$ y = [1738, 1529, 1563, 1492, 1067, 1537, 1316, 771, 996, 652, 755, 708, 231, 388, -158, -72, -322, -150, -518, -538, -614, -723, -1014, -1221, -1060, -1231, -1614, -1438, -1530, -1747, -1686, -1967, -1762, -1466, -1863, -1769, -1900, -1755, -1407, -1687, -1127, -1355, -1543, -951, -1273, -1162, -749, -834, -689, -558, -336, -107, 180, 160, 111, 725, 440, 707, 600, 832, 1197, 943, 1255, 1337, 1308, 1341, 1382, 1380, 1454, 1718, 1586, 2089, 1418, 1487, 1645, 1479, 1793, 1322, 1491, 1265, 973, 1222, 1052, 748, 874, 483, 510, 300, 193, 105, 114, -267, -163, -483, -436, -817, -865, -919, -1060, -1230, -1149, -1383, -1542, -1151, -1391, -1533, -1398, -1642, -1835, -1154, -1700, -1495, -1462, -1598, -1513, -1341, -1143, -935, -989, -968, -724, -610, -612, -446, -547, -54, 82, -55, 12, 227, 534, 574, 312, 681, 841, 803, 1056, 1065, 1177, 1262, 1067, 1557, 1459, 1247, 1340, 1511, 1458, 1334, 1247, 1234, 1199, 1363, 1306, 1014, 1159, 1145, 1101, 858, 713, 537, 756, 445, 209, 383, 58, -265, -205, -392, -142, -497, -812, -737, -1033, -777, -1014, -1143, -1106, -1282, -1250, -1168, -1373]
846a373l17N48l31j2L10k87J39k9q2L10O0K4K03n8J0N1K72L93k73K83n4j33L31
869a5K30O7K17J29K12Q3k4k52M56l7J77k04K27M2%r1K18P9k99J12l19K09k1j22
893A074J34k83M7o9l40p2J74l21q2L6l8j18k2l78l2p4j13kl62k5p4N9k07J78l46
918a256L67l74j06K91l43J42j14L14j13n2L46k26oJ91o5m5L48J32j25K48o2N15
940Gk9k02L86k2K27J7k42K75J70K29L5q6L10m8J93k43L1N4M98l85o6J35r9rq6
965A050l0k3j04r5Q6Ql48J40m0j03j44j09j08K8l75J3m4j2o4k42p4j51O7J64n75
990a085J16J24j1k79K71j79o5K46l13m5j4K28K46j80nL73m20M5O1K18L0L76j48
1013d10J94N3R9K1K36N1k04L35J01K29L6l58L58l5K34k17J02K71j9J32o5j76K03
$$ y = [-1373, -1690, -1142, -1473, -1485, -1175, -1462, -1323, -1352, -1434, -1124, -1064, -1040, -837, -895, -885, -834, -562, -169, -442, -159, -213, -346, -15, 215, 282, 499, 628, 840, 923, 899, 647, 1103, 1066, 1243, 1039, 1266, 1308, 1308, 1217, 1435, 1514, 1215, 1327, 1008, 1217, 1196, 1074, 1208, 925, 972, 903, 563, 491, 665, 344, 262, 298, 260, 142, 120, -258, -290, -364, -477, -479, -841, -866, -940, -881, -1088, -910, -1256, -889, -1263, -1369, -1078, -1421, -1279, -1393, -1079, -1192, -1244, -898, -1124, -1130, -939, -1004, -1049, -701, -569, -694, -446, -508, 7, -22, -224, 162, 140, 367, 384, 142, 417, 587, 816, 851, 765, 1075, 1027, 1220, 977, 1008, 1062, 1560, 1175, 1109, 1244, 1145, 1136, 1050, 1020, 997, 893, 798, 884, 892, 544, 684, 644, 541, 397, 288, 180, 208, -167, -154, -198, -210, -274, -516, -590, -741, -674, -510, -1085, -969, -845, -856, -1135, -864, -1043, -1108, -862, -1175, -1220, -1234, -1006, -760, -940, -945, -572, -992, -947, -886, -668, -638, -262, -410, -216, -163, -64, -43, 193, 244, 40, 375, 476, 705, 741, 383, 741, 706, 940, 723, 825, 1096, 1077, 1209, 1144, 968, 1171]
1036A171j0M6Pk99N2k6k05N5j59K58k30j46J91k41l9j64j13j66j81J45J2m65N3
1059d54J47k24l9l9j56o4J67k89M5l9l2k28N17l83J33k5j19J57L2j65K40M6o4
1082h36j27N93k80M22j09r2K76q1K99N3l1MK36P7o1P4L11l20K68p6J6J14O5K13
1106A008j23p2M28j15j14k19M5Q5Q1l7j66j22L6O2L8m18R2j17k3Pj10j09k67R2
1130c8Q0l83n2N0k34K67k67mPk50k29L28J3j66J4j55J51J2j90L86k86J32O8k3
1154g69RO7k83L23LK09j3j4L07j21J49K62M2N0j94J45K09J0J97l53J88K73k5J14
1178G85j1j06J83J5j68j23L19o7j45J11J07j13N5j13j99jj62K28j55j07M0k38
1200A35K0J64k66r9l31L23k90N2k39k4R4j69J75j51J3M4l23j01J45J32j38K00
$$ y = [1171, 1161, 1207, 1214, 915, 967, 941, 736, 791, 632, 890, 660, 514, 705, 464, 425, 261, 148, -18, -199, -54, -42, -507, -454, -307, -531, -570, -609, -765, -829, -662, -951, -906, -945, -977, -1205, -688, -1071, -938, -963, -1082, -925, -893, -1058, -818, -772, -836, -963, -370, -650, -228, -337, -429, -153, -234, 65, 118, 87, 91, 327, 404, 343, 417, 728, 408, 676, 600, 616, 730, 795, 1008, 885, 813, 1241, 1126, 1012, 793, 838, 923, 1004, 967, 801, 679, 715, 777, 815, 397, 489, 372, 349, 356, 246, 137, -130, -38, 42, -341, -393, -343, -577, -310, -577, -581, -574, -824, -1053, -725, -712, -878, -864, -1019, -868, -856, -1046, -660, -946, -814, -746, -769, -760, -693, -976, -653, -650, -441, -454, -468, -161, -282, -133, 129, 171, 221, 27, 172, 381, 391, 588, 235, 423, 696, 671, 785, 774, 668, 851, 866, 698, 575, 894, 827, 682, 793, 900, 787, 842, 729, 530, 529, 367, 595, 440, 333, 373, 135, 155, 319, 53, -46, -377, -54, -344, -292, -531, -555, -461, -630, -455, -606, -593, -549, -872, -973, -828, -696, -834, -634]
1222f34j3j15j91K08j15J09P5j04Q7R5N1K67l8N4O4j48N7J6J46K2L11J08K23l38
1246A97J29m7K77J21O5l52K20L16l87K62k9j81L03k0l3l0k58K44r6j58j3Q0j24
1269D86j06j62J21j27k2K26q5j55k72M2k2J43l71L9k6J4R1j27k83K2l6o4Nj63
1293h32J6L65k92Lj4j2L6lJ62n3m2J91j85K48OJ28N1k5j15K38K51j90m4L43j13
1318A18O4%J34K8k6J8J57K71p7m6k6j6O0J70l21J31N6J85k19m0J7Kn4k09J22R0
1344E89j00j79j42j5J82r9l16L75k12j09M7k72O9l19J73r2p8N7l1j57o9K71k53
1367f80K71j83j90J27k39L91j36L1rn4p9J45L8L09n12O81j35j78J80K27k5k33
1389b53M50r2NLM1m3L61j84m3J97m7l4K73R7j86J59j97N9n4n5K34N5k43N5J18
$$ y = [-634, -647, -762, -953, -745, -860, -751, -676, -780, -693, -598, -547, -280, -318, -264, -200, -348, -291, -275, -129, -107, 204, 312, 535, 197, 326, 279, 556, 677, 742, 390, 610, 926, 539, 801, 772, 591, 894, 874, 841, 811, 553, 797, 701, 543, 530, 610, 486, 380, 218, 339, 212, 190, 416, 331, 176, -96, -54, -76, 67, -304, -265, -291, -277, -186, -313, -596, -574, -610, -674, -669, -832, -816, -451, -743, -740, -754, -766, -730, -733, -571, -624, -666, -475, -660, -412, -406, -278, -227, -252, -367, -129, 122, -68, -112, 231, 118, 182, 182, 316, 344, 318, 336, 493, 764, 687, 641, 615, 599, 659, 829, 508, 639, 695, 880, 661, 621, 638, 640, 586, 377, 499, 589, 489, 310, 168, 153, 335, 236, -80, 295, 83, -26, 21, -251, -182, -501, -328, -420, -498, -441, -472, -629, -698, -427, -680, -409, -592, -782, -655, -894, -503, -639, -608, -617, -671, -750, -605, -567, -258, -770, -89, -224, -402, -222, 5, -20, -253, 197, 105, 110, 113, 154, 111, 472, 288, 245, 442, 395, 361, 634, 731, 545, 704, 507, 566, 512, 457, 691, 746, 503, 558, 676]
1414F76j43j07J94j26j02J64j79j94m9J1K38j76Q4j33j40j77OO9l11J8J42r1j11
1437d37L7p9Lk4k15M4O5j47r0R6J86J48ql40N00k38j19L06j33mJ38j34J79J47
1461a19nQ8j1j55K81k28K68M1j58K24J17O2p1L6J41L8j27Q8RN4OJ1n2K3k06K90
1487F45M5j45q2n8N3l38L78k5l55J6J39J3j28%j29j60o4K8K90l53Pl7k21L82k86
1512c85J3l18K59j43j10J76k74J74k3O0j27K69q2j01j34R8K84k74K75O5J74r2
1534b16j69K64Q5Q1J0p1p9L15m9K0J65j52J00J06k73L32k34K18K40j11J84l01
1556D65J38rk77K29J0l1o6L6j47K08k33m3J67k60K0k06j30K02j30kJ05l0K8j02
1580e8l47K15J51l59L33k43J59j83j63J78Mmk33j8J51k58L98j75p0L26k04J60
$$ y = [676, 533, 426, 620, 494, 392, 556, 377, 183, 134, 145, 383, 207, 291, 158, 18, -159, -153, -84, -395, -377, -235, -326, -437, -400, -479, -476, -500, -715, -671, -606, -753, -843, -747, -561, -413, -421, -761, -261, -499, -618, -312, -445, -449, -311, -445, -266, -119, -124, -36, -47, -202, 79, -149, 119, 160, 2, 226, 343, 405, 334, 370, 511, 549, 422, 510, 519, 573, 579, 590, 538, 561, 355, 645, 690, 545, 463, 405, 458, 120, 498, 473, 118, 134, 273, 286, 158, 158, 29, -131, -195, -167, 123, -230, -223, -260, -481, -99, -385, -372, -690, -431, -574, -684, -508, -782, -608, -631, -571, -698, -429, -511, -612, -746, -648, -364, -638, -363, -298, -124, -216, -385, -121, -36, 45, 55, -16, -95, 220, 171, 191, 356, 204, 304, 410, 137, 469, 235, 453, 693, 582, 766, 465, 603, 594, 317, 546, 556, 525, 459, 495, 348, 556, 323, 280, 447, 187, 207, 1, -129, 73, -57, -59, 46, 16, 44, -58, -405, -190, -39, -398, -65, -308, -149, -332, -495, -317, -313, -317, -550, -568, -417, -675, -277, -452, -522, -196, -400, -240]
1602b40P4j90P6j79J65OL13j74N5j80L66p9M6m6j4L72l61K79l1Q8K48k86R1L4
1626D33R7j24M1k17J93Lj72L24j46J84k55K59k61pJ70j85J06j23o9j42p3L7N6
1649A29r4m7n7J48p5k9l44K80J6j57rN5j74k78K61R0j36O1r6j06j14L54j35mL1
1674d30J23o4J99m4K3o1l8K32j81o9K33jp5J57j37Q5k8L70j11j00J79j43K52r9
1698B72m7O9J13p7J67k36J67P0p0n2J80k26J9L2p2P9j13j36J16q2P2o8n5L6j96
1723c8K65j92o2J80k39J44k82k7J19m3R8n2n8j55K17k14n6k8m4K69j84j1L8p5
1747d30K02r5l3K32k26O5k2J6O8K31l73K50J1L7R0N7O3M5J70m25J52J86J00j11
1771B60q2K40j36J3j23K43P1J05k34q9N6j98J88l4Q3j5j17o6P2k1P7p5K76l67
$$ y = [-240, -166, -356, -280, -459, -294, -288, 25, -149, -94, -274, 92, 13, 59, 13, -1, 371, 10, 289, 258, 346, 594, 308, 399, 433, 530, 406, 447, 230, 423, 426, 254, 578, 432, 616, 361, 620, 359, 352, 522, 337, 443, 320, 251, 109, 36, 73, 129, 35, -12, -69, 79, 4, -25, -369, -89, -73, -230, -239, -184, -358, -636, -375, -285, -421, -360, -456, -562, -676, -322, -457, -461, -430, -307, -371, -172, -216, -193, -254, -292, -60, -241, -310, -77, -78, -153, 4, -133, -48, -76, 294, 183, 83, 262, 119, 371, 272, 225, 294, 407, 330, 497, 261, 428, 498, 428, 376, 556, 330, 349, 381, 309, 388, 275, 139, 255, 173, 245, 177, 122, 158, -38, 227, 35, -27, 153, -86, 58, -224, -251, -132, -175, -77, -129, -187, -342, -125, -339, -395, -423, -467, -198, -382, -393, -355, -430, -228, -323, -356, -124, -350, -285, -307, -291, -223, 8, -365, -115, -104, -67, 23, 80, 143, 188, 358, -67, 85, 271, 371, 260, 178, 418, 282, 295, 172, 415, 486, 591, 357, 268, 324, 126, 314, 280, 363, 348, 231, 165, 237, 216, 293, 218, 494, 127]
1795A27k9j49K40M9k61K09q8j90j39Q5J03j00j16K25k02k8k21L34j55J27l8j91
1817d08m3O0%M28n16J31J17J38k62J10kL04k84L9O4J21k0j38J68j9O5LM0O8j26
1842C8J88J06R9j89Q2P0l47J32R7K05k19n8J2K45j12k00J38L8Q7j84K18j00j88
1865A58J53j97J60l00K20j75P2P9j81q4O7j19J34m9j18o9M0r9N7P9o4p5p7J27
1889b61l5J3J0O8J11j82l4J2J01N0Qk22J26N4k2k24K50J24j52J34n8M24l30n2
1913h7R3j8M6Q4K06l64K52m4L2k7Q1J8Q7m8q4K51j32j75l2J94j03n1j53L52j93
1938A85ll09K22j38J44O9k56l1L72n9l89J55M7K15k92j09J30q7p4m8q4K5O7k04
1962d52J65L4J80m5R1j16j55P4M3j49K20j80Mj9J91j09o7J88K4m2n5J97l16K34
$$ y = [127, 98, -51, 189, 238, -23, 186, 98, -92, -231, -146, -43, -143, -259, -34, -236, -264, -485, -151, -306, -179, -217, -408, -451, -391, -391, 37, -479, -348, -231, -93, -355, -245, -247, 57, -227, -188, -124, -3, -23, -161, 7, -12, 53, 56, 96, 164, 38, 226, 332, 431, 242, 324, 394, 47, 179, 276, 481, 262, 204, 216, 461, 349, 149, 287, 325, 412, 228, 446, 346, 158, 311, 114, 274, -26, 194, 19, 91, 170, -11, -95, -28, -147, -13, -62, -180, -249, -209, -308, -251, -172, -236, -311, -388, -261, -296, -283, -273, -205, -94, -276, -310, -298, -197, -147, -139, -361, -235, -181, -203, -427, -177, -53, -205, -71, -129, 295, -35, -87, 6, -12, 34, 118, 324, -40, 212, 168, 200, 173, 254, 272, 359, 311, 227, 478, 346, 171, 139, 333, 230, 179, 26, 378, 185, 182, -127, 95, -43, 101, 170, -86, -117, 255, 196, -193, -38, 9, 224, -68, -177, -47, -134, -208, -256, -340, -315, -248, -452, -287, -253, -73, -118, -27, -143, -298, -224, -181, -330, -110, -290, -286, -305, -114, -223, -290, -102, -78, -120, -175, 22, -294, -60]
1986f0J58m0nJ32k30K27j05l8Q7L55k46L5O2R0L3n3j56O5L5k92K60q6j0K92m20
2011I0P7q2k4L27m51J37j56J63j29J46j59OL1l4K14j42j41J01J44r9l04J71j5
2034a29j00K0j09K23l38J62J29j53O9l1j03K44lj23J35p6J29j15J0l7o6L24l55
2057b93K77j51j37K95Kk6K62j97L22m31L3J57k36K02K9klN0O6J29J54l71J60j45
2081A46m7K21l41L6J43K06l34J37L4k48J18p8J24k6l2%k19J90R7j63j92J39L8
2104e1j04J46j83J3l7J42j60P5k83L41o5j40k42K92K59n41K76J33L7L3P9l19K47
2127e2l0J1K39r6N9j68n1K61k03L15k79M0J11q0j57J53O6R0j95N5Jp4K70O0J1
2152C57k69J9K45k65j05K57M1j55l9K4j24J64j68l5R8Lj0J91n05P7R4L1r3N8P2
$$ y = [-60, 98, 58, 53, 185, -45, 182, 77, 39, 126, 481, 235, 270, 332, 422, 455, 402, 246, 311, 346, 54, 314, 228, 218, 510, 90, 167, 85, 61, 388, -63, 74, -82, 81, -48, 98, -61, -55, -24, -58, 156, 14, -127, -26, 118, 19, -285, -114, -129, -229, -209, -318, -95, -433, -271, -142, -295, -226, -257, -360, -116, -119, -242, -107, -183, -54, -169, -159, -196, -262, 62, -293, -16, -167, -304, -9, -7, -33, 229, 32, 354, -77, -44, 113, -123, 79, 108, 106, 103, 153, 219, 348, 502, 131, 291, 146, 99, 320, -21, 15, 158, 364, 30, 167, 201, -47, 71, -7, 117, 91, 59, 59, -160, 30, 127, -36, -228, -89, -51, -155, -9, -192, -179, -216, -74, -234, -159, -442, -101, -166, -306, -548, -256, 3, -538, -262, -129, -92, -59, 20, -299, -52, -82, -71, 168, 72, 131, -37, -88, 173, -30, 285, 6, 46, 157, 77, -80, 73, 139, 229, 34, 89, 90, 16, 286, 346, 357, 88, 107, 352, 87, -18, 239, 280, 125, 86, 110, -14, 150, -18, -53, 45, 48, 38, 229, -276, -199, -105, -74, -167, -109, -37]
2177c7l4j07m0j0L32k66J68j22m0R1q7k07N4K38q1K85m22J65J4o1j7J9L0R2j01
2202a44l8K24k5Kon3l3J7K47k26K33j30K14O1Ok00L6J70l45K93Kj21J5J02k18
2227H3p5j58K84M4k30K50j81K54k89j86R8K15P3Mr2n0K0j02K40k84P4K62l21J1
2251e6K72l07q4j40J38P3p1j18J39q9Jk5J53j67J45Q4q6j66J43k37L67q8o1K04
2275B4j77K26j85KJ23r7p4j2L01j20N4j51L33m29J54J94l3J91j28o6J22M4k84
2298A2R3%O4l3j11J95P4J6k54J53M2j64r5L96j64k27N2j14K40k20J73j15l2l2
2322e1m2K8J18j65j56RR8J09P6j36M7p5J41k87J88P6%kJ59j95j23J83j5J86j13
2347E8j88m07L26R2J1l4J13J0J85j41J43j20m4K92n18J87J49j21J75k10K23j07
$$ y = [-37, -71, -178, -218, -228, 104, -162, 6, -116, -156, -65, -152, -359, -305, -67, -148, 137, -285, -120, -106, -167, -184, -165, -135, -43, -144, -182, 42, 17, 19, 13, -40, -73, -56, 191, -35, 198, 68, 282, 343, 349, 149, 185, 355, 10, 303, 305, 184, 199, 301, 83, 8, -150, 134, 178, -52, 198, 17, 271, -18, -204, -106, 109, 182, 186, 94, 44, 64, -38, 202, -82, -8, 254, -67, -56, 216, -91, -175, -315, -177, -104, -175, -293, -154, -243, -242, -267, -114, -281, -136, -52, -138, -304, -161, -398, -31, -119, -180, 24, -153, 73, -112, -110, 13, -84, -158, -170, 131, 11, 65, -86, 247, -182, -28, 166, 133, 324, 196, 130, 252, 296, 12, 105, 105, 169, 136, 25, 220, 294, 310, 56, 209, 251, 87, -8, 388, 224, -3, 49, -65, 175, -45, 128, 13, -19, -51, -93, -65, 53, -112, -268, -259, -161, -52, 24, -112, -65, -140, 1, -286, -98, -22, -22, -24, 135, -60, -183, 0, -15, 171, 58, -130, -537, -211, -119, -108, -142, -29, -19, 166, 25, 168, 48, 4, 296, -222, -35, 114, -7, 168, -42, 181, 74]
2369G4p4K44l1j07M9k4j12l5K88l08Q1q7Q0R8J49l32K36j16q3q5K53j65l5M3J1
2394A2J04P3l25n9M8p0J41J85k68J01l1k7r8O9j91J31O0R6j46j56K85N1j57J60
2418a2P2j16M2j10K63n10M79k6k44L05l84J70M9M2J98l38J71R6r5P1J20j95L4
2441H2l01K32R9j15K38j10pQ4M0j64r4J39j54J53J89l01Q5ko0J3L0k29N6J15J2
2466C0l5o8l3k2K81j16j75jK34j78QJ36l0l16K19j89L5J18j44J23oP6j54J87K2
2491BK8R5j84J4p7J10J91l78J66J1J18k56K34nJ57o3Q1j35j22M3r5J24J57m9N0
2516B17k38O9J40k21J50qN1J08n8j8N1k16J62p9N3k31K02o9L7n8J70k96pK68l82
2541b03J34o6M69m41j41K58J98m36L5P1n9n4J0K57k13O8k09K10n1J76j71J44l2
$$ y = [74, 0, 244, 213, 106, 155, 131, 19, -16, 272, -36, 45, -42, 38, 136, 285, -47, 189, 73, -10, -95, 158, -7, -42, 1, 12, 116, 189, -136, -195, -147, -217, -76, 109, -159, -58, -89, -116, -214, -145, -336, -205, -145, -49, -195, -351, -66, -15, -172, -12, 60, -56, -14, -124, 139, -371, 108, 82, -162, 143, -241, -71, -22, 20, 218, -120, 51, 147, 52, 123, 243, 48, 82, -219, 13, 112, -3, 235, 125, 118, 202, 242, 78, -16, 123, -31, 122, 311, 10, 95, 93, 33, 46, 76, -153, -97, 18, 30, -5, -73, -106, -128, 153, 37, -138, -139, 95, -83, -75, 61, 31, -285, -66, -255, -220, -102, -246, -123, -129, -53, -207, -20, 2, 30, 125, -59, -45, -122, -12, 179, -199, -33, -22, 96, -160, 74, 69, 226, 163, 244, 109, -13, 30, -65, 59, 216, 167, 217, -21, 48, 188, -33, 117, 109, 160, 268, 210, 192, 243, 27, 189, 110, 163, -68, 134, 65, 102, 44, 214, -82, -89, 179, -203, -69, -135, 334, -107, -248, 10, 208, -228, -193, -122, -181, -235, -225, 32, -181, -113, -322, -112, -163, 13, -158, -14, -46]
2564d6j43K39l72J35R2M0k32L61o6J85l01R3J56j75J00Q3j23j56L25J57j96L0
2586A86r0j01K19j05K21k42J53k33Q3J42j10k07J6J92J25n0M7m89M70r2R0l20
2608i5K6M12k27o8o5k2j83J54%J28j91K34j83j74K09J47l26L11k64j51L74k14
2630a68J1J61l4r6r0J26j09J99j98m4R0j48K72o8k92M20K06k82j73qJ23K39m29
2653b92J77J67k64L99j32Q4j7n1j05K39j95lL26j65k01K90l5l9l52K64k0r2n6
2676g3P1O1k55P0O1K09p9q9j2m6k1K98k9o7J06p6l02M7MP9q7M8j53J24L72m83
2702b22P6r9L08m7j44N0j28K98k00L0Q4j2k8n5K6P5J45k60o5l0J3JJ50l4n1K96
2728A77k71J49P4o7K1N5kJ04p8j0J24k02K13l63J45j13j8K83l12K67L6j30j4M2
$$ y = [-46, -189, 50, -322, -187, -95, -55, -287, 74, 8, 193, -108, -15, 141, -34, 66, 149, 26, -130, 195, 352, 156, 186, 96, -5, 214, 109, 330, 88, 241, 8, 91, 233, 123, -84, -68, 124, 249, 199, 246, -243, 227, 135, 225, -95, -69, 343, 116, 48, -17, -39, -222, -68, -68, 60, -131, 103, -80, -254, -45, 102, -224, 87, -177, -328, 46, -168, -157, 4, -30, -126, -216, -90, -199, 0, -198, -242, -152, -300, -28, -96, -388, 32, 238, -44, -217, -225, -102, 137, -292, -115, 52, -212, 187, 55, 139, 122, 71, -34, 205, 10, 7, 333, 168, -33, 257, 222, 183, -169, 95, 75, -17, -73, -2, 59, -196, -126, -65, 144, 65, -24, -36, -82, -103, 195, 166, 99, 205, 129, -173, -126, -122, -43, -130, -82, -235, -111, 261, -222, -146, -245, 63, 16, -128, -78, -206, 92, -108, -78, 6, -6, -34, -89, -63, 12, 157, -103, -168, -198, -185, -184, -34, -68, -119, 177, -94, 55, 129, 62, 83, 138, 136, 240, 162, 152, 276, 74, 287, -76, 69, -44, -62, 221, -91, 176, 212, 82, 68, 110]
2752A10j8J2j42j7Q6M1J23j65l7j77K57o7r4k40J05Q1m6K32k52J30j32K90k03
2775a23k6J45n4k26K35k3m8p3J07o9N6rJ45k21J46j18pK1K69k30K32m20K56j39
2799a74R8N23l80n9n2j2J6j2r0j7M20j22r7j00R0L16j37R4j76p4j99O02n00J38
2823I6R5k32Q7o0j1O8k15J82p8%K70o0k95J56j73J38k13K24r0l7J25l7J23j14
2847e1j37K28kk39J06J2ok01K03k40K00P9j76K85j27O5j38r2J06j75J83K27j87
2870g7n4L4O1j01k3L01J44m48K88j37l2r2K49j50p6L5K83j24Q5j09k6J02L6l4
2894A35p8Lp1J04J32k71K67j89r5K1l4K64j50l1l6J97k91J25j48K08j86J2m3J23
2918c2N6p1J09P6k49j55J75J00j37K1j33J52j77J55J08p5M0k00L50q7m6j1K5q8
$$ y = [110, 92, 104, -38, -55, 31, 72, 195, 30, -7, -184, 73, 6, -88, -328, -223, -142, -188, 44, -208, -78, -210, 80, -123, -149, -4, -58, -284, -49, -72, -120, -193, -86, -155, -99, -108, 37, -184, -38, -156, -163, -142, 127, -103, 129, -291, -35, -174, -76, 447, 67, 8, -44, -56, -40, -52, -142, -159, 261, 139, 42, -58, 32, 348, 211, 305, 129, 55, -144, 458, -42, 96, 191, -41, 46, -14, -25, 43, -172, 10, -68, -68, 202, 142, -153, 3, -170, -32, -245, -21, -111, -148, -23, -60, 63, -51, -188, 40, 38, -201, -95, -83, -89, -290, -87, -327, -127, -48, -224, 61, -66, -1, -139, -231, -125, -300, -117, 110, -77, -131, -97, -36, -137, -160, 141, 285, -163, 125, -12, -44, -136, 113, -37, -113, -78, 205, 81, 166, 57, 31, 133, 169, 135, 57, 60, -11, 93, 225, -46, 221, 32, -63, -42, -76, 188, 38, 7, -29, 168, -123, 2, -146, 62, -124, -112, -155, -32, 24, -47, 62, 138, -111, -266, -91, 9, -128, -107, -240, -88, -265, -110, -2, -77, -37, -237, 113, 26, -20, -31, -6, -94]
2942i4O2Lo2O6j6p3K33j35k5J34J24k72J10j2J00k28J34J52k33J76J02j60jJ8
2966A03nO3L0j63J14k73K07J03J41j13n39N10k26k1j25K56p3p3J8K03k41N0J04
2989E0j27k4j00K16J32o4j92P7j29J47j01K1m7J57K32l00R1j74N2q4j43J84K37
3012A11k49L12j64J30j2r9p1J13j22L33l14q2J83J9q5J10J4L1k14K70l14K10J56
3035B66l44J00q6L35q3p4J15j3k46M3L8J08k68K09j28M04l82K04j19J28J8k70
3057d5j10K48j43m7K09j1j50L0j22qJ68k4o8j04J64j28o3J95Rj39j2J70l50N1
3081b80j6K09o2J86q2J17k74K47k12J94K30j93j72J08L3m8K34j56LJ96m6o5P0
3104B21L8%m5j16J39R6l73J92K01l53J01j04J38N6j71J99J39j92R0k27m5K8K1
$$ y = [-94, -32, -29, -91, -25, -41, -114, 119, -16, -41, 93, 217, -55, 55, 43, 143, -85, 49, 201, -32, 144, 246, 86, 85, 103, 98, 161, 191, 28, 142, -131, 76, 179, 320, 207, -332, 178, -48, -69, -194, 62, -11, -84, -66, 137, -104, -54, 50, -77, -101, -201, 15, 147, 83, -109, -32, -161, -14, -115, -94, -141, 16, 248, -52, 39, -135, -83, -167, -310, -126, 111, -138, 174, 10, 140, 128, 29, -42, 71, -51, 282, -32, -114, 69, 88, 3, 113, 127, 158, -56, 214, -100, 110, 266, -78, 22, -64, 271, 188, 114, 229, 216, -30, 13, 51, 159, -109, 100, -28, 376, -6, 198, 79, 207, 225, -45, -155, 93, -50, -97, 112, 101, -49, -19, -141, -149, 19, -5, -73, -177, -13, -141, -204, -9, 0, -139, -151, 19, -331, -280, -296, -87, -149, 37, -45, 72, -202, 45, -167, 27, 257, 64, -108, 0, 33, -15, 219, 63, 66, 262, 216, 151, 221, 259, 259, 214, 98, 237, 333, -40, 152, 353, 0, 101, -3, 135, 191, 20, 219, 358, 166, 256, 29, -16, 12, 33]
3127C3j83K63j75J8oj1K35j96j0J53K0j95j24K16j54K82l84K13j47J26l4M1n2
3150g1Po7l7J2J1O6L30m25O9K15l76M43l05j37N10m13J68J29n9l92K95l2J65L9
3174A45rl08K14L0Q9NL6j62j58J15k8j79N1L65k93J57k50M81j84j3j42j55K07
3197A4N5r3k09K23K56r3o0l07L83r6k30K78k35L7P3K31k41m9j23J19o3L05k62
3220h7j40K39l6j95K39J0p8j58J13j27M4K92k34qJ52O9o6J36l18l0J86K9oj7j26
3245a17K89l81L04j99J28J0J13j26j6K81l86L36l4k37K01l8k65K49j1j35P5K25
3267B66j26r9n4J23j6Nj51K1k04L60j1K8l22m9K35m12M54P8l67J53n8N9O6j94
3291b15K28j00q8J42j8Q1r6j03P1N3l6p9K43j87K58m78M27j99k42L27p4l6K28
$$ y = [33, -150, 113, -62, -44, -50, -61, 174, -22, -32, 121, 141, -54, -178, 38, -116, 166, -218, -5, -152, -26, -60, -19, -71, -64, -131, -168, -156, -145, -79, 251, -174, -105, 110, -266, 177, -128, -265, 245, -168, 0, 129, 70, -322, -27, -59, 106, 145, 136, -172, 42, 72, 161, 166, 202, 40, -118, -3, -31, -210, -159, 206, -87, 70, -180, 301, 117, 104, -38, -193, 14, 69, -24, -233, -10, 246, 153, 93, -214, 169, 73, -157, 121, -114, -77, -4, 227, -14, -63, -186, -67, -130, 175, -87, -227, 12, -24, -219, 20, 30, -48, -206, -93, -220, -176, 116, -118, -126, 26, 95, 29, 165, -153, -183, 3, 32, 26, 9, -117, 172, -209, 95, -104, 24, 34, 147, 21, 5, 286, -100, 236, 202, -35, 166, 128, -137, 112, 101, -34, 41, 266, 140, 41, -13, 110, 94, 99, -52, -31, -235, 125, 114, 142, -180, -229, 6, -406, 48, 126, -241, -88, -146, -87, -21, -215, 13, -87, -175, -33, -51, 30, -66, -169, -98, -45, -81, -160, 83, -104, 154, -324, 103, -96, -338, -11, -85, -121, 107]
3314A07k99K03J24k13J08k11K75j46p7K32q2r8J4K06j19m0M6J41k25o3J09K1J54
3337A67l09K88j06n4k5J35k62K50Ol31L90K24m91P1j0P2K4j76R4L24j85o3J29
3360A62m0j26N9j06mm2J21J00j32q2J40j78j63L4K56M7k47K06N3n4r7Q6P2Nm2
3385B8N4p1j13j0K45k13P0Q8J48k51R0j09L75r1q0j33j86M7J82r3L20n27Q2K35
3409H7M2k1J9j23J88l0l20L00j10j21P7j95M54k14K05k19NK13k53j95J67K62l98
3432a80L31k94J05J13Q2j18j18M1r0M4K0m9m5M28l52n2q4J08j32K61k69K8Q2J00
3456d0P8k05J93n9O4j17P9k96L07Q1j36N0j23J61K08k25P8MrR9j27p9K46l18M4
3481d2J52J30o4p0r9qj9RK1J22j57J81Jm8j68J26N4l07J82P2J48k77P9N2k09K41
$$ y = [107, -192, 11, 135, -78, 30, -181, 94, -52, -129, 103, 21, -77, -63, 143, 24, -16, 30, 171, -54, -117, -8, 13, 167, -142, 146, 40, -14, -39, 96, -166, 84, 90, -241, 149, 373, -118, -47, -57, 15, 39, -137, -43, 281, 96, 33, 162, 122, -4, 55, -51, -55, -97, 24, 124, -8, -90, 50, -128, -291, -257, -1, 46, -201, 5, 58, 4, -93, -7, 65, 70, 28, 82, 11, -102, -112, 133, -80, -10, 78, 226, -25, 65, -44, 331, 240, 160, 27, -159, -112, 70, -23, 297, -230, -148, 87, 129, 108, 127, 4, 192, 162, -158, 142, 32, -89, -12, -207, 247, 33, 238, 19, 24, 237, -16, -211, -44, 218, -180, 151, -143, -38, 75, 157, 39, -79, -38, -128, -84, -64, -113, -158, 270, -82, -134, -218, -110, -242, 19, -250, -222, -140, -40, 38, -167, 26, -33, 31, -86, -7, -303, 4, 85, -51, -1, -124, 37, 245, 20, 98, 102, 93, 192, 65, -14, 232, -86, -42, 110, 240, 176, 106, 7, -1, -20, -11, 10, 132, -25, 156, 157, 109, -59, 67, 121, -186, -4, 68, 216, -61, 18, 70, -139, 102]
3507A02r7r9N2QJ14k71M41k96N2k93K25L2k04K86q6j7l7O8j16J0L7J08k13R4j13
3532b13K55j56k28K64L8j53J35P7K68k07l0P8K66m18P0j23J37j03J06J35j97j51
3554a50K29K32l55J84k17J15L0P0q8Q3l2R7j27k69M81j71j48P2m5K06j42k58L74
3577A71j36j82K42J67k72j92J50K36j02j6j4k6J35j11R8k89R3q2j20k7L55q9r2
3600a03J51N5k3k50O0J2k45L58J53k46Q4j64Q4J9J56j15j57K33l0k01J77lK11
3623B16k30J49j10o8K77j12k86J80j2j77L62l9K2O3j92P5J0J30j72M8k7j28O0
3646C9k91L07J7k63L9L19j45O1m0J53jk84O6j10l7N3j34P6J73j09Q1j07Q5K9l4
3671e7P1k98M46j74oL6j68J38j50K28k67J52M3j58J52L07k37l33L44K99l55K5
$$ y = [102, 5, -94, -42, -34, 80, -191, 250, -46, 6, -287, -62, -30, -234, 52, -34, -51, -88, -20, -136, -126, -89, 19, -194, -100, -213, 42, -114, -342, -78, -40, -193, -58, 19, 287, 80, 50, 128, 394, -24, 46, -77, 60, -43, 63, 198, 1, -150, 79, 311, -44, 140, -77, 38, 68, 138, 50, 133, 101, 198, 71, -198, 283, 112, -36, 36, -9, 197, 55, -203, 171, 35, -147, 95, 262, -10, -202, -52, 184, 82, 66, 52, 26, 161, 50, 148, -141, -48, -130, -250, -277, 78, -11, -103, 48, 103, 80, -170, -110, -98, -343, 15, 168, -78, 6, -158, -74, -55, 101, -14, -171, 62, 32, -169, 8, 5, 216, -14, 135, 25, -43, 234, 122, -164, 16, 4, -173, 189, 150, 172, 235, 43, 118, 128, 258, 86, 134, 107, -21, 39, -252, 55, 72, -191, -152, 167, 22, 83, 43, 196, 195, -89, -23, -133, -170, -117, -251, -175, -2, -111, -30, -137, -52, -23, -57, 14, -284, 162, -12, -18, 18, -150, -12, -162, 66, -201, -49, -6, -164, -12, 295, 58, -275, 69, 368, 13, 38]
3693C8JQ7Lo1j39M5J47J95l84K06O4j21j07J90j35J59k16j80J81K25k84J68M2
3716A24K1j07J28q4L6kl99L17q5K08j32qK31m49J37J00J03j3r3k15Q2M4J17j0
3740E1j23J56p3m4K4r8J19m6R1%j89J21k6L4q3j35J96k7J5j95J94J35l19L16j28
3765c4K30l72K79Q8k50K80k99P3K03l2k13L1J54j0l10J20M1J26o9J9K4k2j24K03
3789A36j1QL7l37J53MN1Q9p1l0J29j1l5J5j75K00q5m0j15r2R5J52r4jR6j81K9
3816h4k7L31p9k00jl36L72K5j73n2K6J89n0J6j23J96j49J44J73j58J91j63k90
3839b22K69j00m4k3O0O8o2Lk8L43j96k07K15p6Q4R5j59r5J63l80L28j88K03p4
3863b3K70l84K25M0J85m29L79j76j83J17L0J32o5k57qK33Q7j01r6J65N4k52P7
$$ y = [38, 39, 126, 129, 68, -71, -26, 121, 316, -68, 138, 202, 81, -26, 164, 29, 188, -28, -208, -27, 198, -86, 82, 124, 145, 38, 166, 82, 118, 116, -283, 34, -51, 157, 25, 17, 248, -201, -64, 36, 139, 126, 33, -182, -100, -56, 61, 51, -72, 84, 11, -33, -9, -107, 12, -34, 57, 57, -132, -11, -37, -3, -86, -221, -25, -52, -37, -232, -38, 97, -222, 94, -34, 196, -176, 103, 191, -59, 221, -78, -5, 198, 166, -47, -16, 138, 128, -182, -62, -21, 105, 36, 55, 79, 57, -67, 136, 125, 133, 170, -167, -14, -10, 41, 130, 59, 29, 158, 147, 112, 127, -48, 152, 67, 27, -88, -180, -85, 67, -27, -28, 68, -113, -84, -111, 220, 141, -59, -60, -396, -24, 1, -172, -224, -198, -9, -59, -43, -166, 30, -119, 25, 198, 40, 231, 68, -222, 47, -53, -97, -120, -60, 8, -54, -51, -79, 264, 68, -139, 76, 0, 84, 179, 20, -75, 88, -292, 36, -152, 51, -23, 247, -137, 88, 128, 313, -116, 263, 87, -96, 21, 51, 183, 118, -139, -147, 86, 173, 72, -24, 141, 195, -57, 20]
3886B0R1m39K28r7K59J29J6l44RL7J03j05l3k5q1n7M11m67L28J3k51J47J23M4
3910E9j84K48k73M07l5p0o7k39J26j18Q1q1L50j73P9O9k01J77p3k21K52k27J13
3933al9j03K09j85J12J27j18r8j6q0K99K1ork04J57k81K63O5K2l61J85P0j56J35
3958HmK4l7L8m5J72j67n4M5j32N3N8O1j76J52k31J60J39k01O4J61k47K19R5Q0
3983B35k60R4m4RJ34k55qQ5J7M5k66K5J03M5j46J55k08L24nj33R6j31J54j20K65
4008B10k69J44J40j07O9j78k85J73L42j11k32N2K21j0k15J10r7J7Q4JQ9j69K9
4031Hj59K90j48J45k63K41j37nM6k03M02p6j77K35j45q8R4L3j9l3j74K90n0l16
4055b09Q4K26p6K9J9l27J86J08j04p8J51L3R6Jj50J9j31K64k0q2m76K62K10oP7
$$ y = [20, 111, -328, -100, -197, 62, 191, 207, -137, -128, -91, 12, -93, -126, -151, -232, -289, 122, -345, -17, -4, -255, -108, 15, 59, -125, 123, -150, 257, 222, 152, 85, -154, -28, -146, -65, -146, 204, 31, 110, 179, -22, 155, 82, -139, 113, -114, -1, -40, -143, 66, -119, -7, 120, 2, -96, -112, -192, 107, 128, 122, 113, -91, 66, -215, 48, 113, 135, -226, -41, 29, -127, 8, 4, 28, -9, 29, -16, 156, -11, -65, -20, -152, -99, -41, 20, -156, -4, -235, -75, 64, -137, -73, 88, -159, 60, 155, 235, -25, 69, 25, 34, 168, -87, -95, -10, 7, 52, -214, -189, -86, -41, -187, -32, -240, 84, 79, -54, 42, -89, 65, -55, 210, -59, 85, 225, 118, 187, 9, -276, -103, 239, 128, -104, -52, 169, 159, -56, 54, -43, -26, 58, 59, 148, -21, 8, -151, 139, -9, 136, -127, 114, -23, -28, 18, -185, 217, 141, -36, 199, 54, -34, 60, 93, 74, 41, -133, 157, 107, -209, -125, 101, 25, 54, 73, -254, -68, 40, -64, -142, 9, 42, 138, 139, -11, 8, -123, 141, 121, 39, -437, -175, 35, 29, 106]
4080A06j9P3o2k11K76j38p4L25j05j23q6ON4l6kr2p2L48j81L3j88K62M0k62K37
4105A09n4o9Q3Q7l14O3J51l59L25k33J55q5P1J52k68l1L5K64k45j1R8L0l24N41
4129A71m1n7lK8n6k28K38M3j19l4M2p8K69l18n9J30J34J0r5j73K60r7j11J90k4
4154B2n6j81L53j53R6p0Q0j48qLJ78j78J13j33K1K34j71RJ37K19j69k42o1J47
4178D2r3r4K58j08J25l30J05J67K08j38j63m6P2j9p1R5n2m7R3r0N8Q9j10J66k37
4203a20P3J98r1j74K67m5p7l4J70L1lj23q1mj07J53j06J33N0k8j58L60n3l68j33
4228b70K71O8j65L57l98J38P1J3j94m3J00R4j94K79M0r5n4P5l83L27k33Q1k4K87
4252A48j84r6J04k25L92r3l4jjJ7o2n4L1O3j04j97K88o3J12M2j46Kpk4k10M44
$$ y = [106, 87, 160, 98, -113, 163, 25, -49, 276, 171, 48, -38, -32, 22, -14, -16, -108, -180, 168, -13, 20, -168, 94, 134, -128, 109, 55, -14, 69, 156, -158, -95, 56, -303, 22, -211, -56, -141, -70, 82, -186, -217, -182, 82, -163, -174, -76, -46, -370, 171, 130, 73, 70, 98, 42, -186, 52, 95, -24, -58, -16, -94, 175, -143, -202, -72, 62, 72, -23, -196, 64, -33, -144, 46, 22, -34, -215, 138, -15, 81, 11, 91, -57, -65, -62, 116, -62, 51, -82, -61, 173, 2, 11, 148, 367, 198, -44, -105, 42, -51, -145, 113, 5, 130, -200, -95, 72, 280, 142, -21, -67, 5, -14, -85, 10, -42, -89, 4, -86, -28, 61, -49, 117, -120, -47, 151, 60, -114, 153, 108, 31, -3, 167, 198, 195, 72, -9, -13, -120, 33, -73, 60, 110, 82, -76, 284, 231, -137, -270, 1, 69, -96, 261, -137, 1, 72, 85, -109, -152, -52, 42, -152, 127, 167, 72, 18, 93, -290, 37, -196, -115, -139, 148, -36, -132, -28, -253, 139, 46, 12, 11, 10, 27, -35, -89, -58, 5, -99, -296, -8, -71, 41, 83, -63, -61, -68, -92, -302, 142]
4278A42r2j09J4J83j20j07K32l25P0K51j49ML43k90j66J39L26k09k08J49L2J14
4300B24j12P3l21M11rm12K77j82J60k9ll77N60j89K8j81K36j43j38K10r6J43k0
4323A10j55N6K04k78K06j95J11OK20m75J98l9l3p1J59mj59J10j83L03R7l06J11
4346gl6J46k04K37j56K20k44J30L0l24Q0K7K7n5J40K99n01K24M0j55R2j47KN2
4370h3J65k1j78K38k1pn5j9j57J49J36M0r8J55k48M7J79k15k9J30j77K32l09J69
4394B3j20L51l47J27q3J63p9J2j01L7r8L02k29O7n6j23K39M5k12j44K16r7J62
4417E5j77K71j54l03J1J77oj1J40k02K53K17k75J51j72O7J69p0m44K74j7j84J61
$$ y = [142, 50, -59, -45, 138, 18, -89, 143, -182, -112, 139, -10, -6, 337, 47, -119, 20, 346, 137, -71, 78, 110, 224, 112, 185, -136, 275, 266, -146, 131, -51, 109, 80, 77, -300, 260, 71, 99, -82, 154, 11, -127, 83, -13, 130, 110, -45, 11, 215, -63, 143, -52, 59, 65, 285, -190, 8, -31, -64, -135, 24, 20, -139, -29, -212, 91, 188, -118, -7, -43, 103, -101, 136, -20, 200, -44, 86, 116, -208, -128, -101, -74, -129, 11, 310, -191, 33, 73, -82, 10, -137, -135, -83, 82, 61, -117, 121, 100, 93, 38, 19, -138, 11, 147, 187, 89, 244, -4, 43, 222, 7, -22, 108, -69, 163, -146, 23, -97, 254, -93, 34, -49, 114, 35, 47, -54, -17, -115, 187, -42, 25, -31, -154, 85, 130, -82, -226, -10, -107, 55, -122, 149, -5, -308, -297, -120, -126, -137, 3, -199, 54, 271, -4, 147, -25, 42, 211, 141, -303, -29, -46, -230, -69]
$$ [...]
8191a11
##END NTUPLES=NMR FID
##END=
