##TITLE=1H_SR34_2AcCl
 CDCl3,8 sc, 
 4.03.2021
##JCAMPDX= 6.0         $$ Bruker NMR JCAMP-DX V2.0
##DATA TYPE= NMR FID
##DATA CLASS= NTUPLES
##ORIGIN= UXNMR, Bruker Analytische Messtechnik GmbH
##OWNER= root
$$ XWIN-NMR		Version 3.5
$$ Thu Mar  4 12:26:31 2021 Russian Standard Time (UT+4h)  she@DPX200
##.OBSERVE FREQUENCY= 200.1315066352
##.OBSERVE NUCLEUS= ^1H
##.DELAY= (6, 6)
##.ACQUISITION MODE= SIMULTANEOUS
##.ACQUISITION SCHEME= undefined
##.AVERAGES= 8
##.DIGITISER RES= 18
##SPECTROMETER/DATA SYSTEM= spect
##.PULSE SEQUENCE= zg30
##.SOLVENT NAME= CD3CN
##.SHIFT REFERENCE= (INTERNAL, CD3CN, 0, 15.7039)
##AUDIT TRAIL= $$ (NUMBER, WHEN, WHO, WHERE, WHAT)
$$ ##TITLE= Audit trail, XWIN-NMR		Version 3.5
$$ ##JCAMPDX= 5.01
$$ ##ORIGIN= Bruker BioSpin GmbH
$$ ##OWNER= she
$$ F:/spectra/data/she/nmr/H-F/1/audita.txt
$$ ##AUDIT TRAIL=  $$ (NUMBER, WHEN, WHO, WHERE, WHAT)
(   1,<2021-03-04 12:25:39.18 +0400>,<she>,<DPX200>,
      <created by zg, POWCHK disabled, PULCHK disabled
       configuration hash MD5:
       00 E9 B6 7A A2 85 ED C7 34 08 36 98 17 FE 4E 26
       data hash MD5: 16K
       46 A3 5A 19 EE D0 DB 11 E1 05 34 DC A4 07 D9 7C>)
$$ ##END=
$$ 
$$ hash MD5
$$ 15 68 18 C3 BB D5 45 7E 16 78 13 7D 4F 16 32 82
##$RELAX= 
##$RELAX= 
##$RELAX= 
##$RELAX= 
##$RELAX= 
##$RELAX= 
$$ Bruker specific parameters
$$ --------------------------
##$DU= <F:/spectra>
##$EXPNO= 1
##$NAME= <H-F>
##$PROCNO= 1
##$TYPE= <nmr>
##$USER= <she>
##$AMP= (0..31)
100 100 100 100 100 100 100 100 100 100 100 100 100 100 100 100 100 100 
100 100 100 100 100 100 100 100 100 100 100 100 100 100 
##$AQSEQ= 0
##$AQ_mod= 1
##$AUNM= <au_zg>
##$AUTOPOS= <>
##$BF1= 200.13
##$BF2= 200.13
##$BF3= 200.13
##$BF4= 200.13
##$BF5= 200.13
##$BF6= 200.13
##$BF7= 200.13
##$BF8= 200.13
##$BYTORDA= 1
##$CFDGTYP= 0
##$CFRGTYP= 5
##$CHEMSTR= <none>
##$CNST= (0..31)
1 1 145 1 1 1 1 1 1 1 1 1 1 1 1 1 1 1 1 1 1 1 1 1 1 1 1 1 1 1 1 1 
##$CPDPRG= <>
##$CPDPRG1= <>
##$CPDPRG2= <>
##$CPDPRG3= <>
##$CPDPRG4= <mlev>
##$CPDPRG5= <mlev>
##$CPDPRG6= <mlev>
##$CPDPRG7= <mlev>
##$CPDPRG8= <mlev>
##$CPDPRGB= <>
##$CPDPRGT= <>
##$D= (0..31)
0 1.2 0 0 0 0 0 0 0 0.06 0 0.03 0 0 0 0 0.0002 0 0 0 0 0 0 0 0 0 0 0 0 
0 0 0 
##$DATE= 1614846338
##$DBL= (0..7)
120 120 120 120 120 120 120 120 
##$DBP= (0..7)
150 150 150 150 150 150 150 150 
##$DBP07= 0
##$DBPNAM0= <>
##$DBPNAM1= <>
##$DBPNAM2= <>
##$DBPNAM3= <>
##$DBPNAM4= <>
##$DBPNAM5= <>
##$DBPNAM6= <>
##$DBPNAM7= <>
##$DBPOAL= (0..7)
0.5 0.5 0.5 0.5 0.5 0.5 0.5 0.5 
##$DBPOFFS= (0..7)
0 0 0 0 0 0 0 0 
##$DE= 6
##$DECBNUC= <off>
##$DECIM= 32
##$DECNUC= <off>
##$DECSTAT= 4
##$DIGMOD= 1
##$DIGTYP= 9
##$DL= (0..7)
0 120 120 120 120 120 120 120 
##$DP= (0..7)
150 150 150 150 150 150 150 150 
##$DP07= 0
##$DPNAME0= <>
##$DPNAME1= <>
##$DPNAME2= <>
##$DPNAME3= <>
##$DPNAME4= <>
##$DPNAME5= <>
##$DPNAME6= <>
##$DPNAME7= <>
##$DPOAL= (0..7)
0.5 0.5 0.5 0.5 0.5 0.5 0.5 0.5 
##$DPOFFS= (0..7)
0 0 0 0 0 0 0 0 
##$DQDMODE= 0
##$DR= 18
##$DS= 0
##$DSLIST= <SSSSSSSSSSSSSSS>
$$ [...]
##$SUBNAM2= <"">
##$SUBNAM3= <"">
##$SUBNAM4= <"">
##$SUBNAM5= <"">
##$SUBNAM6= <"">
##$SUBNAM7= <"">
##$SUBNAM8= <"">
##$SUBNAM9= <"">
##$SW= 16.9725356469052
##$SWIBOX= (0..15)
0 0 2 0 0 0 0 0 0 0 0 0 0 0 0 0 
##$SW_h= 3396.73913043478
##$TD= 16384
##$TD0= 1
##$TE= 0
##$TE2= 300
##$TE3= 300
##$TEG= 300
##$TL= (0..7)
0 120 120 120 120 120 120 120 
##$TP= (0..7)
150 150 150 150 150 150 150 150 
##$TP07= 0
##$TPNAME0= <>
##$TPNAME1= <>
##$TPNAME2= <>
##$TPNAME3= <>
##$TPNAME4= <>
##$TPNAME5= <>
##$TPNAME6= <>
##$TPNAME7= <>
##$TPOAL= (0..7)
0.5 0.5 0.5 0.5 0.5 0.5 0.5 0.5 
##$TPOFFS= (0..7)
0 0 0 0 0 0 0 0 
##$TUNHIN= 0
##$TUNHOUT= 0
##$TUNXOUT= 0
##$USERA1= <user>
##$USERA2= <user>
##$USERA3= <user>
##$USERA4= <user>
##$USERA5= <user>
##$V9= 5
##$VALIST= <valist>
##$VCLIST= <CCCCCCCCCCCCCCC>
##$VD= 0
##$VDLIST= <DDDDDDDDDDDDDDD>
##$VPLIST= <PPPPPPPPPPPPPPP>
##$VTLIST= <TTTTTTTTTTTTTTT>
##$WBST= 1024
##$WBSW= 4
##$XGAIN= (0..3)
0 0 0 0 
##$XL= 0
##$YL= 0
##$YMAX_a= 485339
##$YMIN_a= -530466
##$ZGOPTNS= <>
##$ZL1= 120
##$ZL2= 120
##$ZL3= 120
##$ZL4= 120
##$ABSF1= 10
##$ABSF2= 0
##$ABSG= 5
##$ABSL= 3
##$ALPHA= 0
##$AQORDER= 0
##$ASSFAC= 0
##$ASSFACI= 0
##$ASSFACX= 0
##$ASSWID= 0
##$AUNMP= <proc_1d>
##$AZFE= 0.1
##$AZFW= 0.1
##$BCFW= 1
##$BC_mod= 2
##$BYTORDP= 1
##$COROFFS= 0
##$CY= 11.3945322036743
##$DATMOD= 1
##$DC= 2
##$DFILT= <>
##$DTYPP= 0
##$F1P= 15.9154993809931
##$F2P= -4.1035820241983
##$FCOR= 0.5
##$FTSIZE= 0
##$FT_mod= 4
##$GAMMA= 1
##$GB= 0.15
##$INTBC= 1
##$INTSCL= 1
##$ISEN= 128
##$LB= 0.24
##$LEV0= 0
##$LPBIN= 0
##$MAXI= 10000
##$MC2= 0
##$MEAN= 0
##$ME_mod= 0
##$MI= 1.114404
##$NCOEF= 0
##$NC_proc= 0
##$NLEV= 6
##$NOISF1= 3.799351
##$NOISF2= 2.8
##$NSP= 1
##$NTH_PI= 0
##$NZP= 0
##$OFFSET= 15.70392
##$PC= 1
##$PHC0= -11124.32
##$PHC1= 14.20094
##$PH_mod= 1
##$PKNL= yes
##$PPARMOD= 0
##$PSCAL= 0
##$PSIGN= 0
##$REVERSE= no
##$SF= 200.130013532006
##$SI= 16384
##$SIGF1= 3
##$SIGF2= 2
##$SINO= 400
##$SIOLD= 16384
##$SREGLST= <1H.CDCl3>
##$SSB= 0
##$STSI= 0
##$STSR= 0
##$SW_p= 3612.71676300578
##$SYMM= 0
##$S_DEV= 0
##$TDeff= 0
##$TDoff= 0
##$TI= <>
##$TILT= no
##$TM1= 0
##$TM2= 0
##$TOPLEV= 0
##$USERP1= <user>
##$USERP2= <user>
##$USERP3= <user>
##$USERP4= <user>
##$USERP5= <user>
##$WDW= 1
##$XDIM= 8192
##$YMAX_p= 0
##$YMIN_p= 0
$$ End of Bruker specific parameters
$$ ---------------------------------
##NTUPLES= NMR FID
##VAR_NAME=  TIME,          FID/REAL,        FID/IMAG
##SYMBOL=    X,             R,               I
##VAR_TYPE=  INDEPENDENT,   DEPENDENT,       DEPENDENT
##VAR_FORM=  AFFN,          ASDF,            ASDF
##VAR_DIM=   8192,          8192,            8192
##UNITS=     SECONDS,       ARBITRARY UNITS, ARBITRARY UNITS
##FACTOR=    0.0002944,     1,               1
##FIRST=     0,             0,               0
##LAST=      2.4114304,     0,               0
##MIN=       0,             -530466,         0
##MAX=       2.4114304,     485339,          0
$$ Real data points
##PAGE= N=1
##DATA TABLE= (X++(R..R)), XYDATA
$$ plain form
0 0 0 0 0 0 0 0 0 0 0 8 -8 8 -16 16 -16 24 -32 37 -41 53 -64 75 -88 104 -122 143 -165 189 -219 252 -286 325
32 325 -367 417 -468 528 -589 660 -737 820 -914 1011 -1121 1241 -1372 1511 -1667 1838 -2026
49 -2026 2232 -2454 2705 -2984 3295 -3643 4038 -4488 5010 -5622 6347 -7228 8317 -9709
63 -9709 11551 -14107 17895 -24063 35738 -65142 283459 340169 -530466 30393 320954
74 320954 -135981 -247364 235926 278702 -296538 -68098 368094 -148294 -240619 174346
84 174346 196895 -160614 -121270 339348 -1152 -357886 200349 179597 -246520 -64924 271839
95 271839 61353 -317073 123912 288902 -358766 -96882 345503 -93731 -241311 162145
105 162145 213959 -258297 -144375 332610 -108172 -290897 219961 118380 -201701 -74511
$$ packed form
0@%%%%%%%%%Qj6J6k4L2l2M0n6O9p8R4j17J39j63J92k26K65l08L54m08M71n38O11
32C25o92P84q85R96j117J249j397J557j734J925k132K362k613K883l178L505l864
49b026M258m686N159n689O279o938P681q526R498j0632J1969j3575J5545j8026
63i709K1260k5658L2002m1958N9801j00880L48601N6710q70635N60859K90561
74C20954m56935j11383M83290M2776n75240K28440M36192n16388r2325M14965
84A74346K2549l57509L9344M60618l40500l56734N58235k0752m26117J81596L36763
95B71839k10486l78426M40985J64990o47668K61884M42385m39234j47580M03456
105A62145N1814m72256J13922M76985m40782j82725N10858j01581l20081J27190
$$ plain form
115 -74511 203398 18275 -308981 102558 222945 -262407 -85613 255135 -7246 -258032
125 -258032 67332 247606 -254172 -157550 331888 -55461 -255480 167565 157209 -196125
135 -196125 -117797 247099 -1103 -271611 166193 176007 -206108 -41151 190177 4287
145 4287 -200027 68399 217099 -171092 -101000 248248 3423 -203770 77041 198093
155 198093 -147726 -142470 272400 25121 -259184 145370 177893 -190656 -78854 215125
165 215125 14599 -223654 113094 188774 -197113 -63404 199296 -21706 -169556 58765
175 58765 163252 -128466 -123676 201385 14907 -213001 65321 157906 -133783 -130524 187715
186 187715 43758 -242553 71968 182745 -186740 -100391 193803 -1925 -201788 69531
$$ packed form
115g4511K77909j85123l27256M11539J20387m85352J76794L40748k62381k50786
125b58032L25364J80274n01778R6622M89438l87349k00019M23045j0356l53334
135a96125P8328L64896k48202k70508M37804R814l82115J64957K31328j85890
145D287k04314K68426J48700l88191P0092L49248k44825k07193K80811J21052
155A98093l45819N256M14870k47279k84305M04554L2523l68549J11802K93979
165B15125k00526k38253L36748P5680l85887J33709K62700k21002j47850K28321
175E8765J04487k91718M790L25061j86478k27908K78322R2585k91689L259L18239
186A87715j43957k86311L14521J10777l69485Q6349K94194j95728j99863K71319
$$ plain form
196 69531 161714 -165904 -95515 187232 -19029 -173857 68987 127350 -114720 -100028 155218
207 155218 31448 -183920 48829 155742 -114707 -108009 162974 52684 -194310 43597
217 43597 190407 -137487 -109899 198427 23085 -184666 71740 165703 -129184 -92173 186182
228 186182 15580 -168063 76700 138661 -106883 -75810 146158 36318 -151464 39074
238 39074 149628 -92203 -98210 143993 49993 -160775 23359 163787 -98798 -119874 162635
249 162635 41515 -181230 44381 153161 -118503 -102794 155229 20529 -169451 47617
259 47617 130049 -111748 -88392 128893 20997 -148387 22406 125535 -87935 -105067 119328
270 119328 43219 -154868 8452 142977 -86135 -120957 133823 50061 -169197 21882
$$ packed form
196F9531R2183l27618P0389K82747k06261j54828K42844N8363k42070J4692K55246
207A55218j23770k15368K32749J06913k70449O698K70983j10290k46994K37907
217D3597J46810l27894K7588L08326j75342k07751K56406R3963k94887L7011K78355
228A86182j70602j83643K44763O1961k45544L1073K21968j09840j87782J90538
238C9074J10554k41831o007K42203r4000k10768J84134J40428k62585k1076K82509
249A62635j21120k22745K25611J08780k71664J5709K58023j34700j89980K17068
259D7617Q2432k41797K3356K17285j07896j69384J70793J03129k13470j7132K24395
270A19328p6109j98087J63320J34525k29112l4822K54780q3762k19258J91079
$$ plain form
280 21882 151228 -100180 -107710 144094 34556 -157856 37977 134922 -94604 -84808 129715
291 129715 30750 -131343 30265 122319 -68612 -83822 111890 51083 -123581 10949 135451
302 135451 -57967 -101429 119140 63610 -138335 12746 148296 -71370 -104224 133518
312 133518 50552 -144930 29228 135737 -81896 -86309 122294 35069 -127952 23449 115767
323 115767 -68365 -83853 98630 42464 -117368 -625 115895 -53584 -103749 93581
333 93581 57085 -131113 -8422 127667 -61233 -112723 104223 52094 -141391 4285 125105
344 125105 -74527 -97612 105335 35436 -126999 11772 106995 -65590 -82804 89166 37120
355 37120 -107043 20 102092 -43685 -89147 80106 57409 -107843 -10846 118786 -39739
$$ packed form
280B1882J29346k51408p530K51804j09538j92412J95833R6945k29526R796K14523
291A29715r8965j62093J61608R2054j90931j5210J95712o0807j74664J34530J24502
302A35451j93418m3462K20569n5530k01945J51081J35550k19666l2854K37742
312A33518q2966j95482J74158J06509k17633m413K08603q7225j63021J51401R2318
323A15767j84132j5488J82483n6166j59832J16743J16520j69479n0165J97330
333I3581l6496j88198J22691J36089j88900n1490K16946n2129j93485J45676J20820
344A25105j99632k3085K02947o9899j62435J38771R5223j72585j7214J71970n2046
355C7120j44163J07063J02072j45777m5462J69253k2697j65252R6997J29632j58525
$$ plain form
366 -39739 -100773 92784 65463 -119638 -1689 129310 -51804 -94339 105531 52163 -116197
377 -116197 12821 115782 -53362 -77194 93797 44459 -98076 6457 101940 -37647
387 -37647 -76983 76238 55042 -92448 -11377 106474 -29268 -92569 76543 62782 -105913
398 -105913 -13159 114077 -41625 -96133 84753 51820 -112239 -3007 104811 -51238
408 -51238 -84163 78885 39116 -100505 -4606 90571 -42093 -80192 65014 44036 -91366
419 -91366 -17423 90594 -28620 -91550 60912 59200 -98883 -22230 104762 -33038 -95845
430 -95845 73315 58126 -104386 -11144 106591 -41204 -83978 78385 45778 -92431 -1847
441 -1847 92460 -32566 -71592 66205 48099 -77399 -9513 87153 -16972 -74359 56756
$$ packed form
366c9739o1034J93557k7321j85101J17949J30999j81114m2535J99870n3368j68360
377a16197J29018J02961j69144k3832J70991m9338j42535J04533R5483j39587
387c7647l9336J53221k1196j47490Q1071J17851j35742o3301J69112j3761j68695
398a05913R2754J27236j55702n4508J80886l2933j64059J09232J07818j56049
408e1238l2925J63048l9769j39621R5899R5177j32664l8099J45206k0978j35402
419i1366P3943J08017j19214o2930J52462j712j58083P6653J26992j37800o2807
430i5845J69160j5189j62512R3242J17735j47795m2774J62363l2607j38209R0584
441a847R4307j25026l9026J37797j8106j25498O7886R6666j04125n7387J31115
$$ plain form
452 56756 62606 -78283 -20023 99585 -16577 -84174 64657 64302 -87327 -16161 104471
463 104471 -27651 -84054 73848 50961 -88923 -5101 89916 -29959 -72683 61297 45708
474 45708 -79671 -11213 80015 -22829 -72170 46092 51966 -73925 -28695 84911 -15996
485 -15996 -86520 49384 57524 -83433 -28787 90077 -21357 -90272 57818 52398 -90066
496 -90066 -14982 84576 -29712 -74362 53486 44370 -76902 -14080 76074 -22668 -65523 44295
508 44295 45700 -62676 -24735 76491 -6882 -76095 44986 58562 -68815 -24271 84520
519 84520 -7175 -79681 51315 64198 -78260 -17180 91403 -19972 -69418 55921 50714
530 50714 -68119 -13974 81594 -15468 -64742 49597 46159 -58091 -18208 69698 -2369 -68957
$$ packed form
452E6756N850j40889N8260J19608j16162o7597J48831l55j51629P1166J20632
463A04471j32122n6403J57902k2887j39884Q3822R5017j19875m2724J33980j5589
474D5708j25379O8458R1228j02844m9341J18262N874j25891M5230J13606j00907
485a5996p0524J35904Q140j40957N4646J18864j11434o8915J48090n420j42464
496i0066P5084R9558j14288m4650J27848r116j21272O2822R0154r8742m2855J09818
508D4295J405j08376L7941J01226q3373o9213J21081J3576j27377M4544J08791
519H4520r1695p2506J30996J2883j42458O1080J08583j11375m9446J25339n207
530E0714j18833N4145R5568r7062m9274J14339l438j04250L9883Q7906p2067o6588
$$ plain form
542 -68957 37392 58386 -63135 -27208 76031 -4856 -74229 37100 59899 -69416 -29612
553 -29612 82515 -16418 -74910 45663 45551 -66964 -22443 69867 -14480 -70158 40724 42005
565 42005 -63063 -20110 59772 -7135 -65062 25599 52901 -58847 -33176 70336 -5693
576 -5693 -71691 31140 55459 -59819 -34849 77769 -5382 -77666 44268 51790 -65597
587 -65597 -19261 70833 -8168 -64593 39252 50041 -57921 -16530 65273 -5908 -53918 29201
599 29201 50397 -43792 -29304 67148 4884 -63538 30881 55460 -47405 -31128 69800 6901
611 6901 -71793 35764 59155 -60803 -22007 69978 -6278 -61972 33208 49828 -55311 -23285
623 -23285 65411 -8654 -57545 29325 41209 -44662 -29611 55369 4461 -65331 22172 50650
$$ packed form
542f8957J06349K0994j21521L5927J03239q0887o9373J11329K2799j29315L9804
553b9612J12127r8933n8492J20573j12j12515M4521R2310q4347n5678J10882J281
565D2005j05068M2953P9882o6907n7927R0661K7302j11748K5671J03512p6029
576e693o5998J02831K4319j15278K4970J12618q3151p2284J21934P522j17387
587f5597M6336R0094p9001n6425J03845J0789j07962M1391Q1803p1181m8010Q3119
599B9201K1196r4189J4488R6452o2264o8422R4419K4579j02865J6277J00928o2899
611F901p8694J07557K3391j19958L8796R1985p6256n5694R5180J6620j05139L2026
623b3285Q8696p4065m8891Q6870J1884q5871J5051Q4980n0908o9792Q7503K8478
$$ plain form
635 50650 -49967 -33484 57939 4998 -68766 20306 57043 -56624 -34554 67290 -5900
646 -5900 -66171 28509 46000 -51743 -28284 60719 -4244 -60423 28573 40507 -44321 -23775
658 -23775 49599 6040 -55284 17571 51414 -41119 -30675 56714 8488 -57295 18083 56632
670 56632 -41610 -35019 66085 6260 -62930 30155 51223 -45043 -24767 60215 4749 -57144
682 -57144 27643 48086 -43515 -21260 52845 4474 -49218 16844 48088 -35010 -32026 53213
694 53213 9674 -55716 15304 49964 -36542 -36767 54583 10603 -63662 19107 50440 -45905
706 -45905 -30080 53478 2017 -57183 18474 43874 -42956 -27535 48481 398 -50203 13353
718 13353 39303 -33266 -32956 43950 9900 -54726 10544 46250 -34420 -35422 47604 12973 -58607
$$ packed form
635E0650j00617J6483R1423n2941p3764Q9072L6737j13667K2070J01844p3190
646e900o0271R4680J7491r7743K3459Q9003o4963n6179Q8996J1934q4828K0546
658b3775P3374m3559o1324P2855L3843r2533J0444Q7389m8226o5783P5378L8549
670E6632r8242O591J01104n9825o9190R3085K1068r6266K0276Q4982n5466o1893
682e7144Q4787K0443r1601K2255P4105m8371n3692O6062L1244q3098K984Q5239
694E3213m3539o5390P1020L4660q6506k25R1350m3980p4265Q2769L1333r6345
706d5905J5825Q3558n1461n9200P5657K5400q6830J5421P6016m8083n0601O3556
718A3353K5950p2569L10P6906l4050o4626O5270L5706q0670j002Q3026l4631p1580
$$ plain form
731 -58607 12826 52331 -40272 -32779 54804 6426 -54527 19257 46413 -37156 -26610 51075
743 51075 5766 -48114 18587 41236 -29582 -24644 42991 13101 -44957 10464 46808 -26455
755 -26455 -30847 45307 16441 -48891 9154 50968 -30027 -34270 50661 12108 -53154 15313
767 15313 46266 -34389 -28173 46989 7008 -49086 14583 40032 -32228 -25992 39618 8032
779 8032 -44848 6722 40140 -27000 -33233 38638 13023 -49535 4014 44221 -28758 -37004 42042
792 42042 13419 -53570 8483 44949 -33305 -32348 43182 8159 -48909 10488 40395 -30382
804 -30382 -27387 39233 8707 -42043 7778 37887 -22719 -28724 35557 15683 -41847 4030
816 4030 43480 -20833 -32189 39484 18520 -45485 6363 47243 -25231 -30965 43749 14139
$$ packed form
731e8607P1433L9505r2603P493Q7583m8378o0953P3784K7156q3569J0546P7685
743E1075m5309n3880O6701K2649p0818M938O7635k9890n8058N5421L6344p3263
755b6455m392P6154k8866o5332N8045M1814q0995m243Q4931l8553o5262O8467
767A5313L0953q0655O216P5162l9981n6094O3669K5449p2260O236O5610l1586
779H032n2880N1570L3418o7140o233P1871k5615o2558N3549M0207p2979q246P9046
792D2042k8623o6989O2053L6466p8254R57P5530l5023n7068N9397K9907p0777
804c0382K995O6620l0526n0750M9821L0109o0606o005O4281j9874n7530M5877
816D030L9450o4313j1356P1673k0964o4005N1848M0880p2474n734P4714k9610
$$ plain form
828 14139 -45097 11068 42970 -26104 -26340 40374 11454 -40578 9069 38430 -21685 -26412 34211
841 34211 15095 -39274 2307 40235 -19466 -32574 34570 17366 -43984 1376 42941 -23090
853 -23090 -34518 37603 13923 -46608 5287 39310 -26395 -29684 35003 9724 -41771 4629
865 4629 34778 -22885 -27764 29634 11695 -37920 303 35106 -18041 -31633 29423 17185
877 17185 -40383 -1066 40671 -18955 -33595 34453 17480 -43252 3209 42171 -22402 -29723
889 -29723 37117 13689 -39868 7246 37783 -20170 -24856 32723 13631 -33806 3761 35473
901 35473 -14110 -26275 28982 18784 -34010 -967 39060 -12998 -30930 30898 20229 -38187
913 -38187 52 40831 -17929 -30848 33415 15476 -39238 3408 36146 -19765 -26910 29516
$$ packed form
828A4139n9236N6165L1902o9074k36O6714k8920n2032M9647K9361o0115m727O0623
841C4211j9116n4369M1581L7928n9701j3108O7144j7204o1350M5360M1565o6031
853b3090j1428P2121k3680o0531N1895L4023o5705l289O4687k5279n1495M6400
865D629L0149n7663m879N7398j7939m9615L8223L4803n3147j3592O1056j2238
877A7185n7568L9317M1737n9626j4640O8048j6973o0732M6461L8962o4573p321
889b9723O6840k3428n3557M7114L0537n7953m686N7579j9092m7437L7567L1712
901C5473m9583j2165N5257j0198n2794L3043M0027n2058j7932O1828j0669n8416
913c8187L8239M0779n8760j2919O4263j7939n4714M2646L2738n5911p145N6426
$$ plain form
925 29516 12288 -35289 1083 32259 -16173 -27628 24805 14849 -33976 -3975 33264 -13690
937 -13690 -32201 24862 18159 -37542 -4813 36946 -16018 -32792 28269 16647 -38691 -920
949 -920 35962 -18016 -28812 28175 13584 -34399 470 31964 -13978 -25633 24551 15632 -30022
962 -30022 -2755 32389 -9147 -27721 23468 20370 -31008 -4266 36529 -9924 -29637 26900
974 26900 20479 -33292 -1633 37534 -12964 -27406 28744 16623 -32144 768 33128 -12463
986 -12463 -24658 24371 15952 -28772 -1913 30983 -9085 -26348 20682 18558 -29470 -6471
998 -6471 32952 -8821 -30677 22105 19134 -33262 -5575 33816 -12471 -30336 23706 15795 -33214
1011 -33214 -2904 30473 -13784 -26204 21391 13338 -28993 -3589 27258 -9839 -25376 17945
$$ packed form
925B9516j7228m7577L6372L1176m8432j1455N2433r956m8825L0001L7239m6954
937a3690j8511N7063o703n5701L2729M1759n2964j6774O1061j1622n5338L7771
949i20L6882n3978j0796N6987j4591m7983L4869L1494m5942j1655N0184q919m5654
962c0022K7267L5144m1536j8574N1189l098n1378K6742M0795m6453j9713N6537
974B6900o421n3771L1659L9167n0498j4442N6150j2121m8767L2912L2360m5591
986a2463j2195M9029q419m4724K6859L2896m0068j7263M7030k124m8028K2999
998f471L9423m1773k1856N2782k971n2396K7687L9391m6287j7865N4042p911m9009
1011c3214L0310L3377m4257j2420M7595q053m2331K5404L0847l7097j5537M3321
$$ plain form
1023 17945 16247 -26715 -7759 29441 -6546 -28727 19145 20210 -29378 -7160 33323 -8400
1035 -8400 -29360 22898 19222 -30802 -2786 33105 -10459 -25256 23207 16294 -27180 -1775
1047 -1775 29493 -7957 -22669 19638 17616 -23454 -5266 29021 -3994 -25178 17730 20394
1059 20394 -24910 -7685 31330 -4504 -28201 19499 20691 -28232 -5916 31276 -8515 -26345
1071 -26345 20083 16429 -27400 -4487 27540 -8479 -24488 17098 14767 -24316 -7044 24997
1083 24997 -5508 -25926 14060 17685 -25289 -9759 27303 -4815 -28451 15158 19499 -27159
1095 -27159 -8930 29809 -7347 -27728 18165 17050 -26525 -6265 27681 -7002 -24435 16960
1107 16960 15987 -22867 -5772 24752 -3149 -22741 13633 19142 -20823 -8661 26869 -1201
$$ packed form
1023A7945j698m2962J8956L7200l5987k2181M7872J065m9588K2218M0483m1723
1035h400k0960N2258l676n0024K8016L5891m3564j4797M8463o913m3474K5405
1047a775L1268l7450j4712M2307k022m1070J8188L4287l3015k1184M2908K664
1059B0394m5304J7225L9015l5834k3697M7700J192m8923K2316L7192l9791j7830
1071b6345M6428l654m3829K2913L2027l6019j6009M1586k331l9083J7272L2041
1083B4997l0505k0418L9986L625m2974J5530L7062l2118k3636M3609M341m6658
1095b7159J8229L8739l7156k0381M5893j115m3575K0260L3946l4683j7433M1395
1107A6960r73l8854J7095L0524k7901j9592L6374N509l9965J2162L5530k8070
$$ plain form
1119 -1201 -24365 14050 21243 -21755 -9507 29479 -2287 -25901 17681 19748 -23518 -5959
1131 -5959 28045 -3938 -23452 16719 17341 -22263 -5025 24792 -3757 -21573 12812 17234 -19489
1144 -19489 -9433 24393 -1357 -24484 11428 18965 -20784 -11637 25438 -1201 -27494 12874
1156 12874 19288 -23782 -9263 25515 -4150 -25209 13171 16515 -22524 -8263 23012 -4704
1168 -4704 -22091 10894 14849 -18315 -9977 21018 -60 -22944 9218 18328 -18034 -11417 22884
1181 22884 1321 -24794 10116 21061 -20352 -10479 25936 -1053 -23495 13028 18791 -19613
1193 -19613 -8409 24828 -1335 -21426 13090 16867 -16646 -7336 21497 1184 -20017 9493
1205 9493 18955 -15298 -10100 21729 2475 -21881 8369 20527 -16673 -11898 23786 1092 -23512
$$ packed form
1119a201k3164L8415P193m2998J2248L8986l1766k3614M3582K067m3266J7559
1131e959L4004l1983j9514M0171O22l9604J7238K9817k8549j7816L4385M422l6723
1144a9489J0056L3826k5750k3127L5912P537l9749R147L7075k6639k6293M0368
1156A2874O414m3070J4519L4778k9665k1059L8380L344l9039J4261L1275k7716
1168d704j7387L2985L955l3164Q338L0995k1078k2884L2162R110l6362O617L4301
1181B2884k1563k6115L4910J0945m1413R873L6415k6989k2442L6523N763l8404
1193a9613J1204L3237k6163k0091L4516L777l3513R310K8833k0313k1201K9510
1205I493R462l4253N198L1829j9254k4356L0250J2158l7200M775L5684k2694k4604
$$ plain form
1218 -23512 10449 18276 -18317 -9950 22000 -626 -22200 9708 15850 -17578 -8733 19048 -304
1231 -304 -20019 6515 15976 -15427 -11869 18913 1524 -21975 5884 17383 -15805 -13257 20297
1244 20297 1680 -23651 7808 18170 -17688 -10804 20972 381 -21741 8663 16851 -16493
1256 -16493 -9159 19543 601 -18820 7317 16172 -12721 -10249 18283 4066 -18934 5664
1268 5664 18231 -12106 -11383 19286 5232 -20367 6262 19896 -14112 -11033 21044 2713 -20023
1281 -20023 8150 17654 -14325 -9596 19591 1880 -18380 7322 15336 -12524 -9363 16767 3241
1294 3241 -18001 4440 16519 -12046 -12137 16834 4267 -19991 3417 17601 -12915 -13487 18167
1307 18167 3147 -21116 5315 16476 -14605 -11204 17489 1351 -19205 5358 14504 -13105
$$ packed form
1218b3512L3961P827l6593Q367L1950k2626k1574L1908O142l3428Q845K7781j9352
1231c04j9715K6534R461l1403L558L0782j7389k3499K7859J1499l3188K548L3554
1244B0297j8617k5331L1459J0362l5858O884L1776k0591k2122L0404Q188l3344
1256a6493P334K8702j8942j9421K6137Q855k8893K472K8532j4217k3000K4598
1268E664J2567l0337P23L0669j4054k5599K6629J3634l4008L079L2077j8331k2736
1281b0023K8173R504l1979M729K9187j7711k0260K5702Q014k7860L161K6130j3526
1294C241k1242K2441J2079k8565r1K8971j2567k4258K3408J4184l0516n72L1654
1307A8167j5020k4263K6431J1161l1081L401K8693j6138k0556K4563R146k7609
$$ plain form
1319 -13105 -10008 15009 2258 -17251 3182 14752 -10558 -11637 14810 4676 -17941 2924
1331 2924 17037 -10405 -12381 16706 5072 -18869 4745 17739 -12275 -10943 18002 3368
1343 3368 -17790 5937 16224 -11378 -8971 16870 2933 -15500 4748 14730 -9299 -9746 14641
1356 14641 5288 -15781 2705 16205 -9051 -11585 15219 5916 -17511 2452 17084 -10400
1368 -10400 -12165 16039 4212 -17828 3870 15552 -11048 -10520 14479 2963 -16359 2975
1380 2975 13341 -9631 -10665 12431 4108 -15781 910 14111 -8597 -12174 12561 5363 -16847
1393 -16847 944 15500 -9324 -12652 14406 4605 -17478 2657 15274 -10180 -10647 14427 3876
1406 3876 -15889 3113 13995 -8819 -9557 12889 4600 -13594 1562 14127 -6008 -10636 12399
$$ packed form
1319a3105L097K5017j2751j9509K0433J1570k5310j079K6447j0134k2617K0865
1331B924J4113k7442j976K9087j1634k3941K3614J2994l0014J332K8945j4634
1343C368k1158K3727J0287k7602K407K5841j3937j8433K0248R982k4029m47K4387
1356A4641r353k1069J8486J3500k5256k534K6804r303k3427J9963J4632k7484
1368a0400j765K8204j1827k2040K1698J1682k6600N28K4999j1516j9322J9334
1380B975J0366k2972j034K3096q323j9889J6691J3201k2708l577K4735p198k2210
1393a6847J7791J4556k4824l328K7058r801k2083K0135J2617k5454m67K5074j0551
1406C876j9765J9002J0882k2814p38K2446q289j8194J5156J2565k0135m628K3035
$$ plain form
1419 12399 6977 -14303 700 15695 -6636 -11487 13500 6919 -15581 1597 16021 -7947
1431 -7947 -10538 13925 5156 -14948 2769 14160 -7888 -9503 12241 4704 -13223 1239 12954
1444 12954 -6659 -10411 10673 5952 -13720 -702 13794 -6325 -12097 11292 6085 -15534 -322
1457 -322 14847 -7600 -12321 11975 4869 -15769 642 13478 -8322 -10679 11183 4317 -13901
1470 -13901 361 12361 -6522 -10242 9862 5402 -12476 -733 12598 -4907 -11251 10203
1482 10203 7072 -13566 -759 14227 -5314 -11376 11624 6741 -13844 707 14323 -6209
1494 -6209 -10323 11854 5270 -12630 1314 13060 -5546 -9246 10488 6025 -11482 280 12770
1507 12770 -3975 -10045 9461 7201 -12105 -1180 13359 -4408 -11331 10014 6946 -13070 -775
$$ packed form
1419A2399n422k1280J5003J4995k2331m851K4987o581k2500J7178J4424k3968
1431g947k591K4463q769k0104J7717J1391k2048j615K1744p537j7927J4462J1715
1444A2954j9613l752K1084m721j9672J3018J4496k0119n772K3389n207k1619J5212
1457c22J5169k2447m721K4296p106k0638J6411J2836k1800k357K1862o866j8218
1470a3901J4262J2000j8883l720K0104m460j7878J1743J3331j7505o344K1454
1482A0203l131k0638J2807J4986j9541o062K3000m883k0585J4551J3616k0532
1494f209m114K2177o584j7900J3944J1746j8606l700J9734m463j7507J1762J2490
1507A2770j6745o070J9506k260j9306J0925J4539j7767o923K1345l068k0016J2295
$$ plain form
1520 -775 13288 -5672 -11171 10337 5474 -12988 -186 11899 -5469 -10030 8705 5263 -11877
1533 -11877 -1236 11194 -4418 -10345 7418 6094 -11617 -2582 12014 -3910 -11663 8602 6653
1546 6653 -12715 -1674 12972 -4694 -11049 9526 6110 -12798 -426 12572 -5054 -10003 8972
1559 8972 5772 -10674 -662 11464 -3256 -8968 7926 6737 -9789 -1648 12059 -2464 -9940
1572 -9940 8058 8022 -10728 -2241 12916 -2817 -10776 8999 7541 -11405 -1024 12584 -3976
1585 -3976 -9510 8796 5961 -10511 -873 11064 -3767 -9050 7358 5911 -9762 -2033 10222
1598 10222 -2679 -10052 6470 6965 -10220 -3123 11575 -2973 -11315 7090 7076 -11714 -2803 11554
1612 11554 -4027 -10550 7534 5677 -11122 -1752 10778 -3646 -9384 6769 5497 -9392 -2330
$$ packed form
1520g75J4063j8960n499K1508m863j8462J2802J2085j7368m561J8735l442j7140
1533a1877J0641J2430j5612n927J7763j324j7711R035J4596j5924p753K0265j949
1546F653j9368J1041J4646j7666o355K0575l416j8908J2372J2998j7626m949J8975
1559H972l200j6446J0012J2126j4720n712J6894j189j6526Q141J3707j4523p476
1572i940J7998l6j8750Q487J5157j5733p959J9775j458j8946J0381J3608j6560
1585c976n534J8306k835j6472R638J1937j4831n283J6408j447j5673P729J2255
1598A0222j2901p373J6522M95j7185P097J4698j4548q342J8405j4j8790Q911J4357
1612A1554j5581o523J8084j857j6799R370J2530j4424n738J6153j272j4889P062
$$ plain form
1625 -2330 9696 -2008 -9245 5781 6967 -8947 -3121 10571 -1170 -10290 6548 7618 -9633
1638 -9633 -2670 11640 -2061 -9713 7318 6932 -9626 -1540 10941 -2212 -8623 7029 6306 -8594
1652 -8594 -1929 10060 -1670 -8408 6127 6833 -8127 -2897 10005 -888 -9562 5439 7356
1665 7356 -9031 -3197 10428 -1520 -9891 6131 7161 -9437 -2916 9935 -2307 -9482 5846
1678 5846 6051 -9026 -2962 8685 -1790 -8729 4520 5953 -7849 -3730 8521 -963 -9220 4120
1692 4120 6889 -8265 -4112 9398 -819 -9793 4983 7110 -9063 -3110 10118 -1597 -9356
1705 -9356 5298 6482 -8464 -2449 9340 -1202 -8099 4956 6393 -6795 -2891 8509 229
1718 229 -8006 4125 7118 -6510 -3562 9030 371 -8653 4262 8168 -7357 -3664 9711 -187
$$ packed form
1625b330J2026j1704p237J5026J186j5914N826J3692j1741r120J6838J070j7251
1638i633O963J4310j3701p652J7031l86j6558Q086J2481j3153o411J5652p23j4900
1652h594O665J1989j1730o738J4535P06j4960N230J2902j0893q674J5001J917
1665G356j6387N834J3625j1948q371J6022J030j6598O521J2851j2242p175J5328
1678E846K05j5077O064J1647j0475o939J3249J433j3802M119J2251r484q257J3340
1692D120K769j5154M153J3510j0217q974J4776K127j6173N953J3228j1715p759
1705i356J4654J184j4946O015J1789j0542o897J3055J437j3188L904J1400q280
1718B29q235J2131K993j3628K948J2592q659r024J2915L906j5525L693J3375r898
$$ plain form
1732 -187 -8724 5103 7024 -7428 -3054 9188 -749 -8362 4395 6197 -6813 -3170 7827 -38
1746 -38 -7881 3178 6408 -6510 -4041 7619 113 -8802 2846 6818 -6972 -4951 8339 -259
1760 -259 -9376 3485 6419 -7445 -4072 8295 -576 -8760 3633 6025 -6802 -3337 7470 -162
1774 -162 -7540 3017 6275 -5633 -4014 7316 796 -7692 2878 6960 -5345 -4302 7836 1080
1788 1080 -8052 3352 7104 -5891 -3486 8310 623 -7652 3826 6420 -5753 -2911 7791
1801 7791 304 -7056 3273 6162 -4919 -3451 7188 1116 -7088 2585 6502 -4744 -4236 7021
1815 7021 1113 -7863 2549 6742 -5763 -4489 7300 562 -7933 2626 6339 -5738 -3826 7106
1829 7106 257 -7398 2352 5165 -5325 -3947 6001 736 -7178 1632 5866 -4893 -4501 6079
$$ packed form
1732a87q537J3827J921j4452M374J2242r937p613J2757J802j3010L643J0997p865
1746c8p843J1059L230j2918K469J1660p506q915J1648L972j3790K021J3290q598
1760b59r117J2861K934j3864L373J2367q871q184J2393K392j2827L465J0807p632
1774a62p378J0557L258j1908J619J1330o520q488J0570M082j2305J043J2138o756
1788A080r132J1404L752j2995K405J1796p687q275J1478K594j2173K842J0702
1801G791p487p360J0329K889j1081J468J0639o072q204R673L917j1246N08J1257
1815G021n908q976J0412M193j2505J274J1789o738q495J0559L713j2077J912J0932
1829G106o849p655R750K813j0490J378R948n265p914Q810M234j0759L92J0580
$$ plain form
1843 6079 1202 -7449 1445 6197 -4983 -4801 6894 1296 -7970 2357 6274 -5229 -3910 6994
1857 6994 720 -7095 2565 5816 -4789 -3293 6616 1122 -5933 1957 5811 -4116 -3629 5984 1835
1872 1835 -6244 1616 6639 -3693 -4251 6422 2200 -6788 1899 6628 -4271 -4147 6620 1296
1886 1296 -6836 2080 5912 -4477 -3844 5905 846 -6210 1540 5249 -4013 -3917 5215 1330 -6334
1901 -6334 953 5722 -3728 -4450 5409 1623 -7050 899 5957 -4327 -4529 6038 1287 -6802 1646
1916 1646 5381 -4268 -3799 5542 1101 -6230 1547 5219 -3952 -3541 4954 1387 -5646 863 5532
1931 5532 -3092 -4134 4860 2062 -5897 878 6126 -3320 -4039 5793 2311 -6042 1248 5973 -3370
1946 -3370 -3716 5558 1774 -5679 1395 5399 -3388 -3354 5130 1859 -5124 708 5360 -2617 -3794 4751
$$ packed form
1843F079m877q651Q894M752j1180J82J1695n598r266J0327L917j1503J319J0904
1857F994o274p815R660L251j0605J496R909n494p055P890L854r927M87R613m149
1872A835q079P860N023j0332n58J0673m222q988Q687M729j0899J24J0767n324
1886A296q132Q916L832j0389O33R749n059p056P750L709r262R6R132l885p664
1901f334P287M769r450p22R859l786q673P949N058j0284k02J0567m751q089Q448
1916A646L735r649M69R341m441p331P777L672r171M11Q495l567p033O509M669
1931E532q624j042Q994k798p959O775N248r446p19R832l482q353P290M725r343
1946c370l46R274l784p453P074M004q787L4Q484l271o983N832M652p977j177Q545
$$ plain form
1962 4751 2306 -5591 511 5532 -2922 -4437 4904 2226 -6277 471 5361 -3223 -4027 5133 1444
1977 1444 -5830 833 5053 -3500 -4187 4530 1303 -5408 343 4758 -2982 -4099 4196 1885 -5314
1992 -5314 -117 5003 -2606 -4315 4310 2387 -5474 -3 5555 -2832 -4172 4568 2032 -5612 587
2007 587 5037 -2758 -3478 4504 1677 -4830 767 4848 -2421 -3140 4209 1999 -4386 186 4908 -1709
2023 -1709 -3587 4192 2656 -4688 -119 5583 -1928 -4146 4215 2591 -5227 95 5045 -2387 -3901
2038 -3901 4156 1940 -4949 174 4679 -2170 -3659 3711 1716 -4446 -197 4235 -1899 -3581 3326
2053 3326 2321 -4793 -420 4787 -2050 -4235 3583 2100 -4896 -310 4842 -2287 -4279 3709 1897
2068 1897 -4693 30 4499 -2225 -3694 3335 2036 -4245 52 4319 -1504 -3568 2843 2366 -4051
$$ packed form
1962D751k445p897O102N021q454j515R341k678q503O748M890q584q04R160l689
1977A444p274O663M220q553o87Q717l227o711N751M415p740j117Q295k311p199
1992e314N197N120p609j709Q625j923p861N471N558q387j340Q740k536p644O199
2007E87M450p795p20P982k827o507N597M081p269p19P349k210o385M572M722o617
2023a709j878P779j536p344M569N702p511k218Q361j624p818N322M950p432j514
2038c901Q057k216o889N123M505o849j489P370j995o162M249M432o134j682O907
2053C326j005p114M373N207o837k185P818j483o996M586N152p129j992P988j812
2068A897o590M723M469o724j469P029j299o281M297M267n823k064O411m77o417
$$ plain form
2083 -4051 -559 4587 -1329 -3729 3541 2798 -4280 -427 4786 -1420 -3720 3822 2463 -4221 74
2098 74 4576 -1468 -3624 3639 2107 -3919 -261 4128 -1351 -3148 2963 2213 -3678 -262 4182 -1180
2114 -1180 -3613 2804 2533 -4148 -638 4383 -1602 -4054 3258 2424 -4554 -499 4479 -1855 -3590
2129 -3590 2934 1958 -3910 -504 3606 -1668 -3376 2612 2145 -3770 -682 3682 -1109 -3494 2298
2144 2298 2240 -3824 -1057 4046 -958 -4047 2565 2444 -4090 -658 4010 -1246 -3469 3122 2314 -3727
2160 -3727 -101 3809 -1352 -3020 2744 2116 -3201 -353 3880 -764 -2838 2453 2176 -3440 -900
2175 -900 3801 -827 -3544 2611 2583 -3346 -708 4238 -867 -3608 2694 2078 -3358 -576 4079 -888
2191 -888 -3157 2541 2046 -3397 -790 3421 -626 -3095 2102 2107 -3107 -973 3253 -679 -3369 1904
$$ packed form
2083d051L492N146n916k400P270p43p078L853N213o206k300P542j359o684M295
2098G4M502o044k156P263j532o026L658M389n479j797O111p50n891L416M444n362
2114a180k433O417k71o681L510N021n985k452P312q34o978M055M978o334j735
2129c590O524r76n868L406M110n274j708N988m67n915L088M364m791k385N792
2144B298n8o064K767N103n004l089O612j21o534L432M668n256k223O591q08o041
2160c727L626L910n161j668N764o28n317K848M233m644k074N291k77n616K540
2175i00M701m628k717O155k8n929K638M946n105k741O302o16n436K782M655m967
2191h88k269N698m95n443K607M211m047k469N197Nn214K134M226l932k690N273
$$ plain form
2207 1904 2250 -3329 -960 3670 -874 -3559 2271 1982 -3301 -850 3648 -976 -3153 2309 1977 -3060
2223 -3060 -714 3365 -683 -3098 1669 1996 -2799 -836 3208 -418 -3130 1895 2512 -2812 -1050
2238 -1050 3713 -458 -3103 2345 2633 -2935 -734 3629 -379 -2944 2416 2339 -2998 -592 3528 -567
2254 -567 -2778 2182 2162 -2883 -974 3420 -161 -2948 1775 2317 -2930 -1152 3286 -322 -3082 1762
2270 1762 2403 -3088 -1441 3334 -633 -3190 1590 2116 -3180 -1014 3225 -621 -3108 1603 1826 -2774
2286 -2774 -925 2661 -280 -2874 1323 2112 -2576 -1289 2686 55 -3078 1477 2514 -2675 -1414
2301 -1414 3296 -74 -3030 1668 2587 -2688 -1106 3249 -331 -2879 1951 2206 -2393 -1031 2826
2316 2826 -194 -2469 1532 2204 -2122 -1013 2887 -23 -2573 1536 2193 -2194 -1027 3149 59
$$ packed form
2207A904L46n579K369M630m544k685N830k89n283K451M498m624k177N462l32n037
2223c060K346M079m048k415M767L27m795J963M044l626k712N025O17n324J762
2238a050M763m171k645N448K88n568K201M363m008k565N360p7n337K406M120m095
2254e67k211M960k0n045J909M394l581k787M723N42n247J778M438l608k760M844
2270A762O41n491J647M775l967k557M780N26n296K166M239l846k487M711K23m600
2286b774J849L586k941k594M197P89m688J287L975k631l133M555J037n189J261
2301a414M710l370k956M698R19n275J582M355l580k548M830K55m599J362L857
2316B826l020k275M001O72m326J109L900k910k550M109O57m387J167M176l090
$$ plain form
2331 59 -3038 1212 2509 -2489 -1319 2883 -325 -2727 1619 2088 -2470 -1178 2621 -107 -2739 1227
2347 1227 1996 -2252 -1075 2490 -116 -2768 814 1972 -2243 -1232 2580 -161 -2919 930 2238
2362 2238 -2510 -1292 2708 -218 -2823 1394 2023 -2627 -1122 2939 -73 -2609 1584 1959 -2304
2377 -2304 -891 2627 251 -2437 1220 2298 -1942 -1189 2557 218 -2394 1202 2409 -2063 -1197
2392 -1197 2854 -14 -2488 1684 2322 -2210 -1010 2743 -14 -2518 1434 2158 -1861 -789 2532
2407 2532 -121 -2680 1189 1847 -1993 -1112 2676 -8 -2654 939 2053 -1951 -1263 2446 -27 -2814
2423 -2814 1174 2317 -2173 -1316 2597 -182 -2780 886 1742 -2093 -1037 2464 -28 -2507 1020
2438 1020 1766 -2144 -1332 2262 -71 -2427 1012 1861 -1909 -1416 2285 237 -2448 1028 2365 -2040
$$ packed form
2331E9l097M250J297m998J170M202l208k402M346M69m558J292L799k728k632L966
2347A227P69m248J177L565k606k652L582J158m215J011L812k741k758L849J308
2362B238m748J218M000k926k605M217O29m650J505M061l012k536M193L75m263
2377b304J413L518k376k688L657J078m240P53L746k339k612L596J207m472Q66
2392a197M051k868k474M172O38m532J200L753k757k504L952P24m019J072L321
2407B532k653k559L869O58l840Q81L788k684k646L593J114m004O88L709k473k787
2423b814L988J143m490Q57L913k779k598L666Q56l835J056L501k492k479L527
2438A020P46l910Q12L594k333k356L439Q49l770M93L701k048k685L476J337m405
$$ plain form
2454 -2040 -1334 2712 363 -2354 1301 2018 -1758 -1076 2590 215 -2330 1222 2007 -1649 -933 2341
2470 2341 275 -2271 938 1924 -1538 -1275 2315 356 -2361 999 2255 -1947 -1294 2350 72 -2415
2486 -2415 905 1996 -1831 -1146 2230 -29 -2349 949 1820 -1957 -1384 2069 330 -2223 639 1741
2502 1741 -1606 -1179 1830 195 -2655 707 1995 -1772 -1618 2107 328 -2465 687 2088 -1861
2517 -1861 -1247 2229 125 -2172 1001 1828 -1944 -1031 1935 55 -2044 1055 1943 -1333 -877 2143
2533 2143 336 -2141 818 1860 -1357 -1138 2380 531 -2339 621 2329 -1580 -1028 2253 95
2548 95 -2080 902 1830 -1631 -833 2302 261 -2045 844 1825 -1393 -1089 2004 297 -2067 479
2564 479 1602 -1480 -1151 2055 11 -2380 350 1867 -1524 -1276 1882 209 -2459 652 1609 -1699
$$ packed form
2454b040P06M046k349k717L655P17l776O82L666k375k545L552P85l656P16L274
2470B341k066k546L209R86l462K63L590j959k717L360J256m202O53L644k278k487
2486b415L320J091l827O85L376k259k320L298Q71l777N73L453j739k553K862J102
2502A741l347M27L009j635k850L362J288l767J54L725j779k793L152J401l949
2517a861O14L476k104k297L173Q27l772R13K966j880k099L099Q88l276M56L020
2533B143j807k477K959J042l217K19L518j849k870K960J708l909N52L281k158
2548I5k175K982R28l461P98L135k041k306K889R81l218L04L093j707k364K546
2564D79J123l082L29L206k044k391K730J517l391K48L158j673k668L111R57l308
$$ plain form
2580 -1699 -1275 1999 -21 -2245 716 1523 -1462 -1163 1795 309 -1918 437 1687 -1587 -1093 1852
2596 1852 450 -2080 574 1819 -1152 -1206 1959 393 -2295 730 2046 -1557 -974 2061 294 -1895
2612 -1895 800 1662 -1395 -1081 1990 240 -1809 699 1827 -1195 -1212 1923 601 -1877 705 1852
2628 1852 -1334 -1247 2082 614 -1995 584 1615 -1408 -1290 1945 271 -2236 493 1451 -1530 -909
2644 -909 1594 35 -1958 564 1309 -1478 -945 1627 206 -1955 254 1659 -1161 -1316 1589 214
2660 214 -2012 323 1674 -1363 -1350 1950 195 -2192 534 1674 -1318 -1301 1729 307 -1926 503
2676 503 1524 -1301 -1020 1747 317 -1703 517 1630 -1060 -1104 1916 448 -1784 322 1784 -1126
2692 -1126 -1346 2000 725 -1952 504 1973 -1169 -1156 1804 694 -1878 444 1820 -1211 -1040 1719
$$ packed form
2580a699M24L274k020k224K961Q07k985K99K958j486k227K355J250l274M94K945
2596A852j402k530K654J245k971n4L165j566k688L025J316l603N83L035j767k189
2612a895K695Q62l057L14L071j750k049K508J128l022j7L135j322k478K582J147
2628A852l186Q7L329j468k609K579J031l023J18L235j674k507K729R58k981O21
2644i09K503j559j993K522P45k787N33K572j421k161K209J405k820j55K905j375
2660B14k226K335J351l037J3L300j755k387K726J140k992J7L030j422k233K429
2676E03J021k825K81K767j430k020K220J113k690m4L020j468k232K106J462k910
2692a126k20L346j275k677K456J469l142J3K960j110k572K322J376l031J71K759
$$ plain form
2708 1719 188 -1905 277 1340 -1102 -1340 1405 380 -1956 368 1455 -1269 -1268 1538 363 -1966
2724 -1966 194 1569 -1610 -1480 1262 186 -1946 475 1382 -1167 -1083 1542 282 -1692 220 1326
2740 1326 -1165 -1063 1391 337 -1732 76 1284 -1013 -1268 1710 559 -2010 369 1852 -983
2755 -983 -1096 1853 521 -1824 486 1534 -1026 -1119 1415 567 -1524 590 1497 -806 -996 1510 369
2772 369 -1638 380 1635 -926 -852 1422 441 -1559 349 1702 -815 -1330 1246 403 -1730 436
2788 436 1512 -1035 -814 1429 209 -1804 326 1466 -1261 -1159 1283 372 -1595 197 1301 -947
2804 -947 -963 1307 511 -1668 0 1333 -1043 -1465 1370 485 -1594 153 1550 -893 -1323 1405 200
2821 200 -1681 118 1557 -838 -971 1451 462 -1256 310 1373 -664 -1087 1389 460 -1479 427
$$ packed form
2708A719j531k093K182J063k442k38K745j025k336K324J087k724JK806j175k329
2724a966K160J375l179J30K742j076k132K421R07k549Q4K625j260j974J912J106
2740A326k491J02K454j054k069J808J208k297k55K978j151k569K379J483k835
2755i83j13K949j332k345K310J048k560r3K534q48k091K114R07k303j90K506j141
2772C69k007K018J255k561P4K274r81k000J908J353k517n15K576q43k133K166
2788D36J076k547K21K243j220k013K130J140k727J02K442r11j967J792J104k248
2804i47j6K270p96k179J668J333k376m22K835q85k079J747J397k443m30K728j205
2821B00j881J799J439k395j33K422r89j718J566J063k037m23K476r29j939J906
$$ plain form
2837 427 1480 -627 -1073 1445 785 -1697 320 1444 -787 -1038 1246 451 -1597 481 1570 -888
2853 -888 -994 1378 194 -1397 299 1309 -787 -1076 1214 446 -1347 24 1478 -707 -1168 1255
2869 1255 349 -1324 -68 1398 -1038 -1241 1216 506 -1457 -3 1550 -863 -1212 1262 65 -1435
2885 -1435 404 1418 -800 -930 1358 368 -1481 138 1635 -825 -841 1090 498 -1435 59 1487
2901 1487 -691 -1028 1346 550 -1480 270 1596 -455 -1257 1171 589 -1535 115 1586 -863 -976
2917 -976 1277 427 -1207 37 1526 -562 -932 1092 445 -1132 262 1378 -576 -1223 1089 297
2933 297 -1610 133 1174 -740 -1430 1126 433 -1473 114 1331 -874 -1067 1169 142 -1296 -109
2949 -109 1368 -555 -993 1033 514 -1230 -23 1147 -651 -1100 1126 523 -1461 -213 1298 -734
$$ packed form
2837D27J053k107m46K518o60k482K017J124k231k51K284p95k048K078J089k458
2853h88j06K372j184j591J696J010k096k89K290p68j793J371J454k185m61K423
2869A255r06j673J256J466k436k03K457p10j963J454J553k413l49K474j197j500
2885a435J839J014k218j30K288r90j849J619J497k460j6J931n92j933J494J428
2901A487k178l37K374p96k030J750J326k051q02K428n82k124J650J471k449j13
2917i76K253q50j634J244J489k088l70K024o47j577J394J116j954o47K312p92
2933B97j907J743J041j914o90K556o93j906J587J217k205j93K236j027j438J187
2949a09J477j923m38K026n19j744J207J170j798m49K226o03j984J248J511k032
$$ plain form
2965 -734 -1131 1183 734 -1376 133 1557 -547 -1143 1222 588 -1499 135 1349 -509 -875 1133
2981 1133 822 -1146 98 1251 -541 -1152 964 833 -1331 -128 1411 -580 -921 1211 861 -1210
2997 -1210 -92 1180 -498 -1165 916 796 -1330 -157 1519 -511 -967 940 695 -1314 -61 1181
3013 1181 -414 -1188 917 683 -1191 -108 1349 -489 -1253 870 547 -1364 -181 1620 -316 -1238
3029 -1238 1046 641 -1522 7 1414 -836 -1157 952 489 -1426 -85 971 -443 -1256 807 544
3045 544 -1318 -282 1549 -260 -1127 1002 947 -1061 11 1341 -390 -938 1033 705 -906 105
3061 105 1319 -128 -985 887 791 -1425 39 1561 -325 -987 871 891 -1205 -139 1300 -75 -1134
3078 -1134 746 884 -1439 -291 1142 -102 -1022 892 775 -1441 -254 1214 -518 -1172 804 659
$$ packed form
2965g34l97K314m49k110J509J424k104n96K365o34k087J634J214j858l66K008
2981A133l11j968J244J153j792o11K116j31k164J203J539j991l41K132l50k071
2997a210J118J272j678o67K081j20k126J173J676k030m56J907k45k009J253J242
3013A181j595p74K105k34j874J083J457j838p64K123l23j911J183J801j936r22
3029a238K284m05k163J529J407k250l21K109m63j915J341J056j414q13K063k63
3045E44j862J036J831j809q67K129n5k008J072J330j731n48J971l28j611J011
3061A05J214j447q57J872r6k216J464J522j886o62J858K0k096J066J439j375j059
3078a134J880J38k323J148J433j244r20J914j17k216J187J468j732o54J976j45
$$ plain form
3094 659 -1501 -204 1257 -415 -997 568 643 -1354 -215 917 -240 -1218 610 675 -1186 -147 1129
3111 1129 -172 -1063 600 853 -1264 -301 1180 -254 -1136 783 731 -1092 -327 1275 -183 -1096 824
3128 824 594 -907 -209 1312 8 -873 864 1042 -824 -246 1209 -277 -1039 795 727 -864 -262
3145 -262 1343 -408 -995 649 988 -845 -439 1160 -171 -1133 757 880 -1158 -295 1199 -219 -1028
3162 -1028 425 708 -1031 -556 1266 -158 -1278 566 638 -986 -622 952 -261 -1093 611 687 -1120
3179 -1120 -438 931 -357 -990 525 718 -1008 -445 878 148 -865 438 656 -678 -84 1053 -395
3196 -395 -841 768 912 -1103 -396 885 28 -973 542 918 -589 -382 1301 -216 -1177 760 996
3213 996 -891 -433 1308 67 -1048 243 793 -869 -508 1022 107 -973 484 866 -769 -547 989
$$ packed form
3094F59k160J297J461j672n82J565P5j997J139J132j157r78J828O5j861J039J276
3111A129j301q91J663K53k117R63J481j434q82J919n2j823P65J602j458r13J920
3128H24k30j501O98J521j304q81J737J78j866N78J455j486p62J834o8j591O02
3145b62J605j751n87J644L39j833M06J599j331r62J890J23k038Q63J494j418q09
3162a028J453K83j739M75J822j424j120J844P2j624L64J574j213q32J704P6j807
3179a120O82J369j288o33J515J93j726N63J323p30j013J303K18j334N94J137j448
3196c95m46J609J44k015P07J281q57j001J515L76j507K07J683j517r61J937K36
3213I96j887M58J741j241j115J291N50j662L61J530r15j080J457L82j635K22J536
$$ plain form
3230 989 -175 -1051 393 655 -1109 -264 974 -197 -939 434 920 -857 -481 806 80 -1195 554
3247 554 929 -919 -272 805 -194 -854 468 641 -721 -769 866 -262 -1269 173 1220 -764 -413
3264 -413 734 -27 -996 351 726 -730 -385 1025 162 -1099 537 769 -612 -266 1066 0 -1076
3281 -1076 342 912 -651 -562 1042 266 -894 541 765 -729 -461 1088 -4 -968 431 857 -669
3298 -669 -527 994 114 -1004 391 720 -522 -422 947 282 -957 224 620 -910 -536 782 -173
3315 -173 -929 353 994 -699 -608 690 -15 -948 305 799 -622 -553 621 52 -924 271 662 -700
3333 -700 -591 574 125 -858 470 506 -524 -615 854 257 -676 299 683 -468 -644 842 64 -965
3351 -965 171 931 -552 -521 778 243 -749 455 863 -496 -278 875 39 -935 248 653 -605 -469
$$ packed form
3230I89j164q76J444K62j764Q45J238j171p42J373M86j777L76J287p26j275J749
3247E54L75j848O47J077r99o60J322J73j362m8J635j128j007J442J047j984L51
3264d13J147p61r69J347L75j456L45J410q63j261J636K32j381L46J332j066j076
3281a076J418N70j563Q9J604p76j160J435K24j494K68J549j092r64J399M26j526
3298f69J42J521q80j118J395L29j242J00J369o65j239J181L96j530L74J318r55
3315a73p56J282O41j693R1J298p05r33J253M94j421O9J174n69r76J195L91j362
3333g00J09J165m49r83J328L6j030r1J469n97r33R75L84j151j76J486p78j029
3351i65J136P60j483L1J299n35r92J204M08j359K18J153q36r74J183M05j258J36
$$ plain form
3369 -469 785 150 -1001 294 582 -554 -620 820 252 -719 17 662 -545 -454 627 84 -1040 176
3387 176 920 -655 -554 567 191 -770 175 814 -776 -566 485 112 -661 46 394 -571 -553 499 71
3406 71 -540 249 668 -662 -332 581 312 -839 64 822 -666 -637 779 122 -803 441 738 -591 -503
3425 -503 649 309 -744 18 589 -471 -185 816 144 -454 181 583 -321 -281 732 205 -669 255 892
3444 892 -380 -341 619 225 -592 83 836 -358 -633 749 365 -656 432 608 -394 -273 731 316
3462 316 -686 216 505 -229 -623 547 196 -751 37 544 -206 -636 525 252 -668 -179 587 -426 -628
3481 -628 597 195 -621 2 633 -591 -403 643 193 -284 79 621 -379 -576 576 352 -590 126
3499 126 703 -323 -364 648 358 -658 56 650 -240 -605 515 294 -512 211 852 -303 -373 528 70
$$ packed form
3369d69J254o35j151J295K88j136o6J440n68r71P36O45j207R1J081n43j124J216
3387A76P44j575J01J121l76r61R45O39j590K10J051l73p73P07L48r65J8J052m28
3406G1o11P89M19j330L30R13k69j151R03P58j488K9J416o57r25J244K97j329Q8
3425e03J152l40j053P62N71j060K86J001o72n98O35M02r04M0J013n27q74R24O37
3444H92j272L9R60l94q17O75P53j194k75J382l84j021J088J76j002J21J004m15
3462C16j002R02K89p34l94J170l51r47P88N07p50m30J161k73r20M89P66j013k02
3481f28J225m02q16O23O31j224J88J046m50m77L63N42j000j97J152k24r42P16
3499A26N77j026m1J012k90j016P14N94q90l65J120k21q06P23O41j155p0R01m58
$$ plain form
3518 70 -447 52 745 -137 -442 477 319 -494 129 609 -321 -422 549 291 -685 138 341 -166 -524 475
3538 475 117 -756 112 577 -306 -398 342 129 -460 69 595 -365 -464 366 109 -758 31 309 -193 -587 414
3559 414 287 -714 64 633 -138 -384 340 282 -728 -6 624 -272 -404 198 263 -547 158 736 -275 -303
3579 -303 605 156 -353 -26 540 -264 -219 267 250 -522 173 471 -135 -365 436 97 -564 -11 402 -191 -215
3600 -215 469 92 -705 -68 406 -126 -381 351 568 -403 -194 442 -137 -499 258 306 -497 -247 871 -115
3620 -115 -430 406 290 -576 -285 510 -81 -288 387 215 -249 0 324 -108 -458 374 37 -698 -10 481
3640 481 -120 -296 217 124 -171 -229 573 88 -333 299 501 -332 100 531 -123 -463 252 297 -301 -13 456
3661 456 -62 -623 348 286 -396 -10 289 -265 -337 354 268 -140 83 490 -78 -327 11 344 -368 -176 478
$$ packed form
3518G0n17M99O93q82l05R19j58q13O23M80r30j01R71k58r76Q23K03n07l58R99
3538D75l58q73Q68M65q83r2P40k13n89N29N26r60r9Q30k57q67P89K78n02l94J001
3559D14j27j001P78N69p71k46P24n8j010P22O30q96j32O02O5q10P05N78j011k8
3579c03R08m49n09L27N66q04M5M86j7p72O95K98o06k30Q01l39o61N53M13n93k4
3600b15O84l77p97O37M74n32k55P32K17r71K09O36n79l62P57M8q03K50J118r86
3620a15l15Q36j16q66K91P95n91k07O75j72m64K49L24m32l50Q32l37p35O88M91
3640D81o01j76N13r3k95n8Q02m85m21O32K02q33M32M31o54l40P15M5n98K88M69
3661D56n18n61R71o2o82L86K99n54p2O91q6m08K23M07n68k49L38L33p12J92O54
$$ plain form
3682 478 -175 -335 151 276 -48 -278 536 -207 -332 -9 169 -284 -160 491 -254 -409 180 23 -575 -173
3702 -173 222 -8 -551 156 265 -318 -196 367 40 -528 116 406 -349 -108 425 -117 -533 247 242 -109 61
3723 61 337 48 -498 269 355 -417 -297 462 34 -517 213 253 -329 -198 226 -89 -491 166 331 -402 -187
3744 -187 280 -86 -445 212 230 -287 -312 448 280 -227 187 181 -129 -289 411 -34 -95 29 133 -244 -105 289
3766 289 70 -471 103 402 -406 -317 203 120 -236 10 422 -443 -267 384 13 -418 -172 432 -120 -165 175
3787 175 -59 -564 -228 309 37 -239 92 175 -318 278 447 -107 -337 412 182 -180 69 335 -14 -232
3807 -232 392 35 -440 179 486 -183 -44 350 24 -218 39 156 39 -199 65 -218 -117 102 175 -277
3827 -277 -199 229 305 -320 124 433 0 -341 212 -30 -348 -43 195 -273 -318 265 -183 -198 -18 330 44
$$ packed form
3682D78o53j60M86J25l24k30Q14p43j25L23J78m53J24O51p45j55N89j57n98M02
3702a73L95k30n43P07J09n83J22N63l27n68O44K90p55K41N33n42m16P80nl51J70
3723F1K76k89n46P67Q6p72J20P59m28n51P30M0n82J31M24l15m02O57J65p33K15
3744a87M67l66l59O57J8n17k5P60j68n07M14ol10j60P00m45o1J24J04l77J39L94
3766B89k19n41N74K99q08Q9N20q3l56K46M12q65J76O51l71m31K46O04n52m5L40
3787A75k34n05L36N37k72k76L31Q3m93N96J69n54k30P49k30l62K49K66l49k18
3807b32O24l57m75O19L07o69J39L94l26k42K57J17j17k38K64k83J01K19P3m52
3827b77P8M28P6o25M44L09m33l41N53k42l18L05K38m68m5N83m48j5J80L48k86
$$ plain form
3848 44 -336 13 132 -371 -23 223 -53 -231 70 -7 -257 -145 277 -160 -221 367 -53 -300 -69 197 -202
3869 -202 -110 351 100 -138 -19 453 -134 -49 166 232 -19 25 450 8 -123 324 168 -423 144 201 -154 -224
3891 -224 552 49 -274 35 281 -125 142 108 307 -142 -3 254 -141 -87 42 219 -64 -207 144 -13 -221
3912 -221 232 -238 -42 -128 184 -109 -484 77 274 -156 -19 194 6 -136 208 50 -190 -33 474 -107
3932 -107 -196 126 29 -98 -146 190 41 -24 247 -7 -264 96 259 47 -145 140 208 -184 202 95 82 -133
3954 -133 212 167 -123 -72 197 -56 -168 310 222 -417 -53 124 -152 -313 103 -3 -212 26 213 12 -314
3975 -314 143 276 4 -55 114 29 -198 53 201 -119 -2 169 -171 -73 -39 106 79 -93 131 -122 -299 -15
3997 -15 17 -238 -48 -68 69 -215 87 158 22 -31 -11 -108 -51 -59 63 -179 -174 148 6 -186 11 43 -193 1
$$ packed form
3848D4l80L49J19n03L48K46k76j78L01p7k50J12M22m37o1N88m20k47K31K66l99
3869b02R2M61k51k38J19M72n87Q5K15O6k51M4M25m42j31M47j56n91N67N7l55p0
3891b24P76n03l23L09K46m06K67l4J99m49J39K57l95N4J29J77k83j43L51j57k08
3912b21M53m70J96q6L12k93l75N61J97m30J37K13j88j42L44j58k40J57N07n81
3932a07q9L22r7j27m8L36j49o5K71k54k57L60J63k12j92K85O8l92L86j07j3k15
3954a33L45m5k90N1K69k53j12M78q8o39L64J77k76j61M16j06k09K38J87k01l26
3975c14M57J33k72n9J69q5k27K51J48l20J17J71l40R8L4J45k7j72K24k53j77K84
3997a5L2k55J90k0J37k84L02P1j36n3K0r7N7qJ22k42NL22j42j92J97L2k36J94
$$ plain form
4021 1 138 -149 -188 49 53 86 -23 13 -61 -66 1 91 -239 14 113 -104 -110 40 123 62 -229 88 184 -133 -23 96
4047 96 -48 23 210 180 -191 -23 38 -203 -160 55 -107 -134 130 303 -160 -303 -42 151 -200 -104 350 -143
4069 -143 -419 -268 230 -202 27 67 -36 -224 75 -49 -360 47 18 -163 -174 192 -10 -86 -355 -197 82
4090 82 -49 101 12 -40 -114 133 90 -69 216 17 213 -47 34 93 -105 231 129 -45 -150 122 329 -111
4112 -111 24 152 -103 -96 176 225 -49 81 341 163 77 32 102 -76 190 109 127 -159 276 -189 -165 180 243
4135 243 -192 -421 136 13 42 -192 194 -16 -251 283 30 42 14 186 -103 -132 195 113 -171 -313 410 -47
4157 -47 16 -23 -136 -31 66 108 -126 -315 -46 67 -396 -86 294 -121 -89 233 59 -37 -7 394 -348 -55 28
4180 28 102 -67 0 289 162 -176 30 65 -159 -2 123 119 -136 54 -41 -164 -244 221 38 -221 55 -26 47
$$ packed form
4021AJ37k87l9K37ML3j09L6p4nO7R0l30K53R9k17oJ50Q3o1k91L17R6l17J10J19
4047I6j44P1J87l0l71J68O1k41M3K15j62k7K64J73m63j43K61J93l51R6M54m93
4069a43k76J51M98m32K29M0j03j88K99j24l11M07k9j81j1L66k02p6k69J58K79
4090H2j31J50q9n2p4K47m3j59K85j99J96k60Q1N9j98L36j02j74j05K72K07m40
4112a11J35J28k55PK72M9k74J30K60j78q6m5P0j78K66q1J8k86M35m65K4L45O3
4135B43m35k29N57j23K9k34L86k10k35N34k53J2k8J72k89k9L27q2k84j42P23m57
4157d7O3l9j13J05R7M2k34j89K69J13m63L10L80m15L2L22j74r6L0M01p42K93Q3
4180B8P4j69O7K89j27l38K06L5k24J57J25mk55J90r5j23q0M65j83k59K76q1P3
$$ plain form
4203 47 -61 35 20 -358 72 168 3 -129 188 207 -148 -81 214 -224 -112 411 -142 -60 151 248 -240 -127 225
4226 225 50 -243 -109 351 27 -78 217 160 -387 -72 191 -275 -256 259 105 -188 -27 272 -216 -105 131
4247 131 -73 -425 168 92 -182 -8 230 165 -493 225 126 -134 -130 265 -47 -152 80 284 -34 -132 312 144
4269 144 -376 51 412 -280 -67 230 -61 -186 -42 422 -22 -356 244 341 -400 -42 313 -113 11 181
4289 181 94 -335 -67 308 151 -341 116 1 -201 -184 171 -250 -120 320 86 -383 117 277 -100 -144 69
4310 69 74 -285 -118 271 -48 -203 45 93 -145 73 513 -286 -322 111 197 -144 -29 168 -233 -253 394 42
4332 42 -351 221 472 -319 -308 490 174 -515 104 402 3 -25 403 -19 -283 -179 119 -47 -299 273 181
4353 181 -220 -21 188 -181 -230 235 59 -296 -70 330 -144 -377 425 46 -163 303 496 -102 -238 308
$$ packed form
4203D7j08R6j5l78M30R6j65j32L17J9l55O7K95m38J12N23n53Q2K11R7m88J13L52
4226B25j75k93J34M60l24j05K95n7n47L15K63m66J9N15j54k93J61K99m88J11K36
4247A31k04l52N93p6k74J74K38o5o58P18r9k60ML95l12j05K32K04l18r8M44j68
4269A44n20M27L61o92K13K97k91j25J44M64m44l34O00R7p41L58L55m26J24J70
4289A81q7m29K68L75j57m92M57j15k02J7L55m21J30M40k34m69N00J60l77m4K13
4310F9Nl59J67L89l19j55K48M8k38K18M40p99l6M33Q6l41J15J97m01k0O47l52
4332D2l93N72K51p91J1P98l16o89O19K98l99k8M28m22k64J04K98j66k52N72r2
4353A81m01J99K09l69m9M65j76l55K26M00m74k33Q02l79k09M66J93n98j36N46
$$ plain form
4373 308 119 -219 30 352 231 -234 72 421 -257 -42 169 -253 -309 164 398 -267 8 428 -108 -340
4393 -340 173 313 -240 53 264 70 -419 246 306 -251 131 456 -52 -177 -15 310 -337 -151 356 89
4413 89 -253 193 46 -129 -102 265 42 -481 186 -20 -337 24 678 89 -270 149 232 -320 51 313 164
4434 164 -397 113 176 -273 -147 414 118 -260 -23 306 -255 8 530 27 -244 67 231 -635 -78 453
4454 453 192 -375 47 251 -273 -221 372 70 -438 62 413 -358 -90 232 -43 -316 84 386 -256 -91
4474 -91 648 -36 -475 131 316 -498 -214 438 42 -354 126 241 -131 -75 355 44 -519 202 423 -222 -243
4495 -243 405 -48 -252 25 377 -226 -385 339 163 -444 2 427 -206 -529 495 16 -323 77 245 -367
4515 -367 -351 176 152 -320 18 541 -413 -142 435 195 -386 271 377 -137 -115 296 -13 -422 310 526 -92
$$ packed form
4373C08j89l38K49L22j21m65L06L49o78K15K11m22n6M73K34o65K75M20n36k32
4393c40N13J40n53K93K11j94m89O65O0n57L82L25n08j25J62L25o47J86N07k67
4413H9l42M46j47j75K7L67k23n23O67k06l17L61O54n89l59M19Q3n52L71K62j49
4434A64n61N10O3m49J26N61k96l78K37L29n61K63N22n03k71L11J64q66N57N31
4454D53k61n67M22K04n24N2N93l02n08N00L51p71K68L22k75k73M00L02o42J65
4474i1P39o84m39O06J85q14K84O52l96l96M80J15l72N6M30l11n63P21K21o45k1
4495b43O48m53k04K77L52o03j59P24j76o07M46M25o33l23J024m79l39M00J68o12
4515c67J6N27k4m72L38N23r54K71N77k40n81O57J06n14K2M11l09m09P32K16o18
$$ plain form
4536 -92 -268 180 -197 -538 175 469 -227 -373 263 170 -386 24 404 -94 -292 538 7 -575 -29 399 -245
4557 -245 -77 682 -19 -474 157 287 -400 -287 709 -76 -415 40 282 -230 -284 287 298 -409 122 327 -35
4578 -35 -153 392 168 -687 -68 412 -229 -410 301 358 -385 435 85 -463 -167 418 21 -473 -102 463 -9
4599 -9 -374 508 109 -294 218 331 -305 -349 296 128 -551 8 341 -322 -293 499 241 -435 40 359 -208
4620 -208 -493 125 265 -548 -114 417 -14 -626 401 94 -440 97 101 -178 -193 169 50 -290 -5 354 -359
4641 -359 -286 308 115 -359 77 336 -209 -328 648 117 -512 25 305 -138 -569 388 163 -433 -122 472
4661 472 -160 -290 441 117 -571 81 391 -229 -531 466 219 -507 -50 462 -61 -435 376 311 -432 -115
4681 -115 429 -282 -325 502 352 -526 -161 385 47 -390 405 457 -305 14 540 -365 -620 309 379 -303 -266
$$ packed form
4536i2j76M48l77l41P13K94o96j46O36r3n56M10L80m98j98Q30n31n82N46M28o44
4557b45J68P59p01m55O31J30o87J13R96p85l39M55K42n12n4N71J1p07N31K05l62
4578c5j18N45k24q55O19M80o41j81P11N7p43Q20l50n48K96N85l97m94L71N65m72
4599il65Q82l99m03N12J13o36m4O45j68o79N59L33o63K9P92k58o76M75L19n67
4620b08k85O18J40q13M34N31m31o12J027l07n34N37Mk79j5L62j19l40K85L59p13
4641c59P3N94j93m74M36K59n45j19R76n31o29N37K80m43m31R57k25n96L11N94
4661D72o32j30P31l24o88O52L10o20l02R97k47p26M57N12n23l74Q11o5p43L17
4681a15N44p11m3Q27j50q78L65N46l38m37P95N2p62L19N26r05k55R29P0o82L7
$$ plain form
4702 -266 415 -208 -374 399 168 -536 -132 618 -33 -197 469 421 -400 -54 611 -279 -399 291 286 -429 115
4723 115 532 -292 -354 373 272 -500 91 502 -180 -141 426 188 -318 -91 312 5 -270 316 502 -423 49
4744 49 244 -93 -142 292 268 -150 -72 732 -152 -634 537 38 -625 172 283 -299 -255 268 379 -605 -42
4765 -42 584 -252 -119 502 116 -338 -101 436 -296 -662 482 367 -370 -102 862 -220 -611 292 450 -564
4785 -564 -214 417 -242 -404 286 268 -426 -197 527 -203 -483 341 477 -615 130 428 -31 -205 292 519
4805 519 -481 -113 766 -157 -538 440 331 -909 -424 566 -60 -531 335 409 -486 -268 515 -44 -628 128
4825 128 265 -469 -148 587 -287 -728 -6 316 -504 -305 557 -122 -443 123 320 -406 -161 679 -197 -587
4845 -587 334 251 -464 -160 309 -121 -467 258 618 -573 -142 513 -18 -650 318 542 -287 -174 320 23
$$ packed form
4702b66O81o23j66P73k31p04M04P50o51j64O66m8q21L46O65q90j20O90np15N44
4723A15M17q24o2P27j01p72N91M11o82L9N67k38n06K27M03l07k75N86J86r25M72
4744D9J95l37m9M34k4m18P8Q04q84m82J171m99o63P97J11n82M4N23J11r84N63
4765d2O26q36J33O21l86m54K37N37p32l66J144j15p37K68R64j082l91R03J58j014
4785e64L50O31o59j62O90j8o94K29P24p30k80Q24J36j092P45K98m59j74M97K27
4805E19j000L68Q79r23l81R78j09j240M85R90o26m71Q66P4q95K18P83n59n84P56
4825A28J37p34L21P35q74m41P22L22q20J99Q62o79l21N66J97p26K45Q40q76l90
4845e87R21q3p15L04M69m30l46P25L60j191M31O55n31o32R68K24q29J13M94k97
$$ plain form
4865 23 -752 249 562 -390 -476 550 121 -379 266 330 -183 -422 340 -136 -587 186 707 -338 -3 457
4885 457 2 -493 657 332 -497 -293 539 182 -601 434 395 -505 -90 454 -37 -761 289 619 -512
4904 -512 -305 756 50 -972 363 554 -614 -116 697 63 -393 244 420 -264 -233 561 169 -744 324
4923 324 399 -529 -246 763 -94 -501 118 343 -642 -470 536 22 -480 348 613 -315 -261 706 110 -626
4943 -626 336 511 -497 -404 581 43 -621 231 716 -497 -434 720 128 -683 316 539 -291 -163 594 117
4963 117 -416 307 428 -398 -369 636 193 -592 311 582 -289 -542 455 -300 -807 337 418 -427 -637 535
4983 535 51 -776 218 514 -484 -501 590 126 -775 298 629 -415 -309 322 152 -367 319 463 -136
5002 -136 -381 505 151 -599 -17 506 -170 -565 617 133 -478 92 413 -19 -241 459 328 -629 107 808
$$ packed form
4865B3p75J001L13r52q6J026m29n00O45O4n13k39P62m76m51P73N21j045L35M60
4885D57m55m95J150l25q29K04Q32l57p83J035l9r00M15N44m91p24J050L30j131
4904e12K07J061p06j022J335J91j168M98Q13o34m56O37J76o84L1P94l92r13J068
4923C24P5r28K83J009q57m07O19K25r85J72J006n14n02Q28K65r28N4R67n96p36
4943f26R62J75j008R3R85n38o64Q52M85j213O3J154n92q11R99K23q30J28P57m77
4963A17n33P23J21q26K9J005m43p85R03K71q71k53R97p55n07J144Q1q45k10J172
4983E35m84q27R94K96r98j7J091m64r01J073L31j044J06O31j70n19O86J44n99
5002a36k45Q86l54p50N82N23o76l95J182m84o11N70L21m32k22P00j31r57P36P01
$$ plain form
5022 808 -397 -531 454 329 -551 93 705 -328 -356 495 128 -613 279 703 -258 -25 414 256 -678 110
5042 110 683 -353 -438 376 173 -515 50 638 -279 -482 575 191 -769 125 618 -145 -397 652 383
5061 383 -539 10 603 -333 -547 373 263 -644 168 452 -201 -643 465 251 -506 37 793 -433 -532 675
5081 675 236 -610 -161 566 -226 -417 353 340 -621 166 699 -186 -518 388 437 -750 195 822 -256 -405
5101 -405 511 320 -580 21 548 -395 -569 497 513 -557 -34 652 -315 -212 665 381 -411 32 446 103
5121 103 -593 414 532 -463 -61 686 -184 -420 490 76 -579 -248 590 -381 -600 296 385 -752 -27 426
5141 426 -125 -538 413 143 -836 -291 799 -335 -413 475 217 -538 -213 699 -169 -528 613 206 -419
5160 -419 -83 674 -336 -454 302 300 -350 -237 456 -23 -462 419 442 -560 -164 757 -347 -758 368 174
$$ packed form
5022H08j205j34R85j25q80O44O12j033k8Q51l67p41Q92M24r61K33M39j58r34P88
5042A10N73j036q5Q14k03o88N65N88r17k03J057l84r60Q94M93p63k52J049k69
5061C83r22N49N93r36k14R20j10r07Q12K84o53m42J108k14p57N43P56j226r9J207
5081F75m39q46M49P27p92j91P70j3r61P87N33q85l32R06M9j187R45O27j078j49
5101d05R16j91r00O01N27r43j74J066J6j070N23O86r67J03Q77k84p92M43M14l43
5121A03o96J007J18r95M02P47q70k36R10m14o55L31Q38r71k19Q96Q9j137P25M53
5141D26n51m13R51k70r79N45J090j134p8Q88k58p55L25R12q68l59J141m07o25
5160d19L36P57j010j18P56ko50J13O93m79m39Q81K3j002L96R21j104m11J126j94
$$ plain form
5180 174 -605 -182 610 -137 -395 270 346 -298 -131 558 37 -342 433 316 -339 -329 342 -4 -570 379 432
5201 432 -502 -99 615 -79 -588 42 446 -528 3 567 35 -519 329 247 -335 -43 603 -190 -643 76
5221 76 222 -529 -115 645 -31 -480 295 528 -586 -266 558 -161 -622 246 167 -677 -116 498 221 -557
5241 -557 362 534 -414 -313 394 138 -592 256 348 -418 13 847 -4 -524 316 569 -344 -121 664 -197
5261 -197 -750 275 562 -728 -296 525 -87 -413 323 669 -387 -14 437 -157 -551 53 441 -411 -310
5280 -310 359 -120 -245 167 476 -527 -289 623 0 -470 270 412 -387 -142 624 317 -699 91 528
5299 528 -417 -139 694 -80 -562 212 211 -416 -135 523 127 -670 45 353 -204 -74 536 -11 -660 232 430
5320 430 -119 -212 583 12 -417 129 315 -250 -273 505 -69 -421 65 496 -323 -506 569 185 -406 25
$$ packed form
5180A74p79M23P92p47k58O65P6o44J67O89n21l79P75j17o55J0O71l46n66R49N3
5201D32r34M03P14o94n09O30M04r74N31N64n32n54Q48q2n82K92O46p93m53P19
5221G6J46p51M14P60o76m49P75K33j114L20Q24p19m61Q68p9q44N61O14k77p78
5241e57R19J72r48J01P07k56p30Q48R2p66M31Q34q51n20Q40K53r13K23P85q61
5261a97n53J025K87j290M32Q21o12l26P36L46j056L73M51n94l94O04L88q52J01
5280c10O69m79j25M12L09j003K38R12o23m70P40J42p99K45P66l07j016P90M37
5299E28r45K78Q33p74m82P74jo27K81O58l96p97P15L08n57J30O10n47o49Q92J98
5320D30n49r3P95n71m29N46J86n65k3P78n74l52M86M31q19j83J075l84n91M31
$$ plain form
5340 25 317 -347 -352 541 127 -511 223 433 -211 -260 134 116 -506 215 382 -302 -203 580 65 -479 301 446
5362 446 -223 -381 379 65 -618 -139 417 -316 -60 401 102 -396 174 494 -274 -222 482 133 -538 -294
5382 -294 573 10 -698 244 325 -649 115 297 -92 -203 725 127 -630 -26 328 -134 -151 565 49 -484 -127
5403 -127 666 -329 -382 437 243 -434 20 670 -390 -336 501 194 -534 -73 333 -220 -600 422 4 -310
5423 -310 -21 879 -237 -222 292 67 -466 205 393 -212 -425 477 329 -380 -73 418 -216 -372 518 200
5443 200 -661 -40 366 -149 -587 342 181 -560 187 607 -212 -473 396 267 -371 -6 447 -201 -402 370
5463 370 55 -521 -114 333 -335 -403 427 166 -542 57 435 -112 -270 393 496 -604 102 509 39 -366
5483 -366 446 -29 -266 6 409 -42 -352 366 49 -395 -96 288 -229 -367 380 295 -537 -246 545 -93
$$ packed form
5340B5K92o64nQ93m14o38P34K10o44m9L94j8o22P21J67o84R9P83n15n44P80J45
5362D46o69j58P60l14o83M79N56p33K56M61k99m98N70L20p68N2P04l49o71K44
5382b94Q67n63p08R42Q1r74P64J82l89j11R28n98p57O04L54m62j7P16n16n33L57
5403a27P93r95n3Q19j94o77M54O50j060N4Q37l07p28M61M06n53l80J022m18l14
5423c10K89R00j116J5N14k25n33O71J88o05k13R02j48p09L07M91o34j56Q90l18
5443B00q61O21M06n15m38R29j61p41P47M20q19k61Q69j29o38L65M53o48k01P72
5463C70l15n76M07M47o68o8Q30k61p08N99L78n47j58O63J03j100P06M07m70m05
5483c66Q12m75k37K72M03m51l10P18l17m44K99L84n17j38P47q5q32K91P91o38
$$ plain form
5503 -93 -422 395 374 -471 -46 892 -264 -588 352 176 -473 -86 172 -215 -394 424 162 -495 83 604
5523 604 -385 -226 189 371 -270 34 694 -292 -403 370 201 -525 -206 425 -126 -508 323 226 -566 -122
5543 -122 355 -118 -474 250 306 -509 -153 437 -273 -509 286 396 -471 -57 496 -54 -151 304 308 -688 49
5564 49 333 52 -430 365 555 -315 1 511 23 -413 338 290 -488 -214 458 -172 -353 33 205 -221 -109
5585 -109 234 -160 -282 491 380 -275 -294 425 -200 -299 270 306 -675 -135 275 -30 -316 276 189 -331 51
5606 51 400 -182 -259 164 439 -338 -198 311 14 -338 183 349 -275 46 657 77 -372 158 336 -172 -119
5627 -119 483 43 -466 255 288 -708 -69 487 -280 -436 103 356 -391 -217 192 -188 -426 178 250 -274 -204
5648 -204 297 -24 -503 347 384 -200 -367 408 -296 -405 -11 277 -291 -230 313 -201 -237 140 181 -380 -321 374
$$ packed form
5503i3l29Q17k1q45M25R38j156l24R40j76o49L87K58l87j79Q18k62o57N78N21
5523F04r89J59M15J82o41L04O60r86j11P73j69p26L19O31n51l82Q31r7p92M44
5543a22M77m73l56P24N6q15L56N90p10k36P95J10q67M14N53n50r7M55Mr96P37
5564D9K84k81m82P95J90q70L16N10m88m36P51m8p78K74O72o30j81L86J72m26J12
5585a09L43l94j22P73j11o55j9P19o25r9N69L6r81N40M10l05k86N92q7n20L82
5606E1L49n82p7M23K75p77J40N09k97l52N21J66o24L21O11n80m49N30J78n08N3
5627a19O02m40n09P21L3r96O39N56p67j56N39K53p47J74M09l80k38O04P2n24P0
5648b04N01l21m79Q50L7n84j67P75p04j09L94K88n68O1N43n14l6L77M1n61N9O95
$$ plain form
5670 374 20 -414 300 300 -396 111 455 -69 -385 301 420 -367 -62 370 -191 -414 254 183 -352 -258 381
5691 381 -67 -655 390 378 -263 -63 375 -89 -122 199 291 -544 -128 462 -192 -403 293 313 -153 -475 299
5712 299 -102 -311 183 504 -266 -239 306 -150 -395 261 275 -307 -330 363 127 -419 40 161 -440 -185 409
5733 409 27 -296 151 383 -380 -375 153 -62 -554 170 217 -323 -255 585 153 -390 164 519 -280 -87 352
5754 352 -26 -432 -1 363 -425 -292 288 245 -356 136 289 -24 -322 254 10 -342 -58 329 -155 -67 363
5775 363 -222 -490 329 505 -292 -188 303 -127 -353 202 206 -144 0 237 -66 -352 271 161 -287 -259 131
5796 131 -40 -359 191 122 -216 -164 505 24 -565 39 361 -293 -322 235 36 -578 10 136 -410 -290 190
5817 190 -66 -261 4 594 -434 -280 162 67 -361 129 252 -225 -328 252 262 -309 20 435 -120 -388
$$ packed form
5670C74l54m34P14%o96N07L44n24l16O86J19p87L05M32n61k23O68p1n35R4O39
5691C81m48n88J045j2o41K00M38m64l3L21R2q35M16N90o54k11O96K0m66l22P74
5712B99m01k09M94L21p70K7N45m56k45O56J4n82k3O93k36n46M59J21o01K55N94
5733D09l82l23M47K32p63NN28k15m92P24M7n40O8Q40m32n43N54L55p99J93M39
5754C52l78m06M31L64p88J33N80m3o01M92J53l13k98N76k44l52K84L87m84Q8M30
5775C63n85k68Q19J76p97J04M91m30k26N55Ml50J44K37l03k86O23j10m48K8L90
5796A31j71l19N50o9l38N2O69m81n89O04L22o54k9N57j99o14N88J26n46J20M80
5817A90k56j95K65N90j028J54M42r5m28M90J23m77j03N80J0n71L29M15n55k68
$$ plain form
5837 -388 304 59 -482 -80 284 -358 -315 317 9 -477 -3 405 -246 -242 159 176 -465 -26 146 -32 -182
5858 -182 145 113 -569 439 462 -307 -289 172 104 -209 15 643 -205 -264 338 168 -582 15 451 -199 156
5879 156 255 53 -158 -18 107 -149 -308 278 321 -331 -19 580 -323 -431 328 268 -456 67 283 -71 -317
5900 -317 289 229 -343 93 242 -367 -437 207 215 -336 -123 543 -177 -152 143 51 -608 142 412 -280 -293 269
5922 269 450 -207 227 466 -104 -289 404 295 -555 -25 329 -433 -56 388 103 -333 94 459 11 -156
5942 -156 194 71 -315 31 398 -52 -148 297 32 -363 -27 355 29 -400 388 288 -287 8 477 136
5962 136 -524 324 138 -609 -60 306 -159 -407 175 322 -516 -133 375 -32 -273 301 454 -333 -25 623
5982 623 -194 -502 276 128 -516 71 256 -138 -141 368 138 -121 119 399 -13 -142 336 269 -373 -212 590
$$ packed form
5837c88O92k45n41M02L64o42M3O32l08m86M74M08o51MM01J7o41M39J72j78j50
5858a82L27l2o82J008K3p69J8M61o8l13K24O28q48n9O02j70p50N97M36o50L55
5879A56R9k02k11J40J25k56j59N86M3o52L12N99r03j08P59o0p24N23K16l54k46
5900c17O06o0n72M36J49o09p0O44Qn51K13O66p20K5K95r2o59P50K70o92j3N62
5922B69J81o57M34K39n70j85O93j09q50N30L54p62L77M44k85m36M27L65m48j67
5942a56L50j23l86L46L67m50r6M45k65l95L36L82l26m29P88j00n75K95M69l41
5962A36o60Q48j86p47N49L66m65k48N82J47q38L83N08m07k41N74J53p87L08O48
5982F23q17l08P78j48o44N87J85l94lN09k30k59K40K80m12j29M78o7o42J61Q02
$$ plain form
6003 590 41 -167 243 66 -239 -4 420 -111 -188 208 221 -278 -25 266 -147 -347 126 264 -295 30 464
6024 464 10 -476 -94 284 -151 -20 311 -45 -208 -9 377 -315 -221 296 -299 -266 304 246 -402 16 245
6045 245 -225 -575 375 110 -188 -127 363 65 -360 226 150 -463 -164 482 -144 -592 400 247 -317 -373 346
6066 346 -46 -276 274 458 -259 -111 498 -248 -166 293 229 -206 -182 247 43 -367 172 231 -354 13 371
6087 371 -20 -314 134 188 -242 55 227 -44 -508 292 338 -314 -88 386 -34 -300 343 324 -244 -99 335
6108 335 -102 -426 -113 417 -254 -120 147 18 -418 151 353 -395 -20 404 13 -532 360 85 -545 -4
6128 -4 497 -134 -436 91 284 -568 11 347 -41 -268 177 215 -714 -188 233 -168 -223 322 298 -68 -153 433
6150 433 174 -321 93 307 -88 -105 256 -23 -296 398 443 -256 -48 553 90 -380 191 395 -238 -187 418
$$ packed form
6003E90n49k08M10j77l05K35M24n31p7L96J3m99K53K91m13k00M73J38n59L25M34
6024D64m54m86L82L78m35J31L31l56j63J99L86o92R4N17n95L3N70n8o48M18K29
6045B45m70l50R50k65k98O1M90k98m25N86p6o13K99O46o26m48R92j53n64n6P19
6066C46l92k30N50J84p17J48O09p46Q2M59o4m35K4M29k04m10N39N9n85L67L58
6087C71l91k94M48N4m30K97J72k71m64Q00M6o52K26M74m20k66O43j9n68J45M34
6108C35m37l24L13N30o71J34K67j29m36N69K02p48L75M24l91n45Q92k75o30N41
6128dN01o31l02N27J93q52N79L36l88k27M45L8r29N26M21m01n5N45k4l66q5N86
6150D33k59m95M14K14l95j7L61k79k73O94M5o99K08O01m63m70N71K04o33N1O05
$$ plain form
6171 418 -90 -628 219 353 -204 -347 372 144 -374 137 463 -157 -88 495 68 -355 70 138 -211 -202 469
6192 469 -89 -603 -31 339 -320 -287 242 -316 -130 215 324 -448 -205 579 -10 -323 174 353 -224 -310 170
6213 170 23 -491 297 278 -263 -242 567 201 -609 447 199 -225 -148 388 4 -404 105 134 -136 -128 370 132
6235 132 -204 223 317 -289 -192 709 102 -403 -164 320 -409 -47 425 -91 -342 -172 213 -60 -174 378 108
6256 108 -396 308 140 -377 -17 445 46 -244 145 383 -244 -95 125 103 -528 137 283 -411 -477 300 -17
6277 -17 -444 96 467 -282 -174 430 49 -260 76 23 -225 -44 275 3 -442 285 418 -324 -387 401 21
6298 21 -435 -109 210 -118 -139 216 -79 -253 153 446 -407 -80 200 62 -151 62 375 -157 -158 504 100
6319 100 -317 226 357 -17 -296 287 231 -240 25 504 -497 -184 484 165 -578 77 487 -370 -80 342
$$ packed form
6171D18n08n38Q47J34n57j43P19k28n18N11L26o20O9N83m27m23M25O8l49RO71
6192D69n58n14N72L70o59L3N29n58J86L45J09p72K43P84n89l13M97J79n77q6M80
6213A70j47n14P88j9n41K1Q09l66q10J056k48m24P7N36l84m08N09K9k70QM98k38
6235A32l36M27R4o06R7R01o07n05K39M84p29L62M72n16k51J70L85k73j14N52k70
6256A08n04P04j68n17L60M62l99k90L89K38o27J49K20k2o31O65J46o94o6P77l17
6277a7m27N40L71p49J08O04l81l09L36n3k48J81L19k72m45P27J33p42o3P88l80
6298B1m56L26L19l28k1L55k95j74M06K93q53L27K80j38k13K13L13n32jO62m04
6319A00m17N43J31l74k79N83n6m71K65M79j001L13O68l19p43O55M10q57K90M22
$$ plain form
6339 342 325 -517 81 231 -408 -118 325 96 -323 -117 228 -246 -337 -35 -21 -359 101 368 -300 -158 274
6360 274 150 -612 6 367 -314 -330 485 342 -612 -76 317 20 -210 254 236 -423 318 520 -43 -408 300
6381 300 273 -219 290 369 -345 -310 189 -20 -282 156 469 -279 -282 306 87 -351 264 400 -290 -350 324 212
6403 212 -296 -98 407 -370 -324 308 -36 -730 -109 414 -81 -382 406 15 -294 81 436 -155 -185 239 120
6424 120 -461 81 429 -107 -203 113 265 -380 -60 476 -334 -243 445 29 -670 13 147 -90 -86 378 73
6445 73 -170 19 383 -106 -202 264 78 -288 4 400 -175 -425 395 96 -318 128 412 -73 -230 357 124
6466 124 -255 -182 525 -140 -401 490 166 -401 -65 387 -324 -227 488 399 -264 158 501 -334 -187 395 179
6487 179 -416 -243 157 -83 -437 177 334 -527 82 508 -257 -345 142 391 -501 -79 275 -159 -63 362 333
$$ packed form
6339C42j7q42N98J50o39K90M43k29m19K06L45m74r1L02J4l38M60K67o68J42M32
6360B74j24p62O18L61o81j6Q15j43r54N36L93k97k30M64j8o59P41K02n63l65P08
6381C00k7m92N09P9p14L5M99k09k62M38L13p48lN88k19m38O15J36o90o0O74j12
6403B12n08J98N05p77M6O32l44o94O21N23m95l01P88l91l09L75L55n91l0M24j19
6424A20n81N42L48n36r6L16J52o45L20N36q10R1O88m16o99O83J34k37MM64l05
6445G3k43J89L64m89r6M66j86l66K92L96n75k50Q20k99m14M46K84m85j57N87k33
6466A24l79P3P07o65k61Q91l24n67L36M52p11R7P15q9o63M22L43q35J47N82k16
6487A79n95J73M00k40l54O14J57q61O09M26p65q8M87K49q92M22L54m34R6M25k9
$$ plain form
6508 333 -341 -255 278 84 -296 227 353 -469 74 250 -206 -171 281 62 -330 -59 442 -184 -310 308 -61
6529 -61 -396 48 409 97 -274 271 175 -387 -1 510 -149 -118 321 343 -362 -109 216 -190 -292 479 30
6550 30 10 45 314 -83 -360 155 275 -379 -104 136 -46 -481 216 254 -476 -93 260 44 -349 337 159
6571 159 -370 -137 216 -139 -358 295 245 -363 -128 235 -71 -322 51 234 -289 -173 315 -139 -490 318
6591 318 390 -300 -83 415 -125 -248 251 170 -382 -216 553 -42 -315 -62 189 -234 -206 577 -51 -196 -11
6612 -11 295 -248 -235 564 68 -283 259 367 -366 -201 301 -35 -235 290 368 -273 -12 693 224 -413 251
6633 251 118 -249 -211 430 8 -353 45 164 -419 -330 534 210 -413 237 304 -173 -133 459 -23 -358 190
6654 190 255 -208 18 379 -120 -381 263 389 -347 -213 178 11 -405 85 380 -243 -204 398 -7 -258 249
$$ packed form
6508C33o74Q6N33j94l80N23J26q22N43J76m56L5M52k19l92K71N01o26j26O18l69
6529f1l35M44L61l12l71N45r6n62L86N11o59L1M39K2p05K53L25m06j02P71m49
6550C0k0L5K69l97k77N15J20o54K75K40j82m35O97L8p30L83L53k16l93O86j78
6571A59n29K33L53l55k19O53n0o08K35L63l06k51L73J83n23J16M88m54l51Q08
6591C18P2o90K17M98n40j23M99q1n52J66P69n95k73K53K51m23K8P83o28j45J85
6612a1L06n43J3P99m96l51N42J08p33J65N02l36k00N25P8o41K61P05m69o37O64
6633B51j33l67L8O41m22l61L98J19n83Q9Q64l24o23O50O7m77M0N92m82l35N48
6654A90O5m63K26L61m99k61O44J26p36J34L91j67m16M90K95o23L9O02m05k51N07
$$ plain form
6675 249 206 -149 -76 228 127 -326 493 247 -195 -92 392 59 -588 221 590 -295 -83 42 -187 -209 37
6696 37 587 -203 -96 342 85 -414 273 333 -101 -141 124 20 -580 -49 344 -483 -296 509 103 -305 -134
6717 -134 453 -346 -300 359 252 -541 -96 441 -351 -212 325 212 -447 -117 468 -294 -423 428 60 -148
6737 -148 -27 544 -175 -19 328 86 -491 -131 330 -155 -70 337 18 -420 18 254 -263 -277 459 25 3
6758 3 97 392 -190 -269 404 93 -589 109 479 -153 -118 395 132 -451 -161 434 -12 -438 331 111 -226 344
6780 344 425 -125 69 142 253 -415 12 236 -30 -284 196 20 -231 7 630 -286 -164 396 65 -416 -157
6801 -157 553 -317 -275 326 101 -526 99 367 -264 -281 397 -3 -356 -5 284 -131 -113 112 84 -231 -32
6822 -32 359 -48 -214 289 143 -560 92 267 -186 -187 439 -48 -306 -20 336 -25 -458 317 116 -448 -60
$$ packed form
6675B49m3l55P3L04j01m53Q19k46m42J03M84l33o47Q09L69q85K12J25k29k2K46
6696C7N50p90J07M38k57m99O87O0m34m0K65j04o00N31L93q27J87Q05m06m08J71
6717a34N87p99M6O59j07p93M45N37p92J39N37j13o59L30N85p62j29Q51l68k08
6737a48J21N71p19J56L47k42n77L60M61m85Q5M07l19m38M38K36n17j4P36m34k2
6758CR4K95n82p9O73l11o82O98L70o32L5N13k63n83K90N95m46m26P69k20l37N70
6780C44Q1n50J94P3J11o68M27K24k66k54M80j76k51K38O23r16J22N60l31m81K59
6801a57P10q70M2O01k25o27O25K68o31j7O78m00l53L51K89m15J8K25k8l15J99
6822c2L91m07j66N03j46p03O52J75m53jO26m87k58K86L56l61m33P75k01n64L88
$$ plain form
6843 -60 538 -150 -189 128 225 -578 -211 323 -140 -301 393 154 -460 -11 462 4 -161 258 277 -486 25
6864 25 424 -14 -379 290 187 -274 83 318 -257 -302 312 217 -477 85 286 43 -459 230 229 -536 -185 256
6886 256 50 -173 572 443 -466 -48 472 47 -187 232 229 -275 -4 469 -165 -294 210 403 -593 -82 326
6907 326 -165 -397 238 109 -92 187 445 -143 -660 362 375 -299 -135 336 -29 -303 244 255 -388 -181
6927 -181 371 21 -247 242 238 -187 -61 509 42 -325 297 298 -169 -192 398 145 -398 287 400 -461 -116 321
6949 321 -70 -330 377 180 -142 -44 460 11 -506 103 268 -237 -150 319 13 -270 344 208 -361 -123 465
6970 465 -71 -392 123 181 -283 -98 466 10 -203 297 301 -266 -188 361 33 -59 169 318 -444 -24 477 -118
6992 -118 -391 360 276 -415 36 540 197 -204 163 152 -249 -345 263 136 -238 182 403 -317 -263 321 189
$$ packed form
6843f0N98o88l9L17R7q03L67N34m63j61O94k39o14M49M73m58j65M19J9p63N11
6864B5L99m38l65O69j03m61L57K35n75m5O14r5o94N62K01k43n02O89jp65L51M41
6886B56k06k23P45j29r09M18N20m25k34M19ln04K71M73o34j29N04J93r96N11M08
6907C26m91k32O35j29k01K79K58n88n17J022J3o74J64M71l65k74N47J1o43K07
6927a81N52l50k68M89mm25J26N70m67l67O22Jm67k3N90k53n43O85J13q61L45M37
6949C21l91k60P07j97l22R8N04m49n17O09J65n05Q7M69l06k83O14j36n69K38N88
6970D65n36l21N15N8m64J85N64m56k13N00Mn67P8N49l28r2K28J49p62M20N01n95
6992a18k73P51q4o91M51N04l43m01L67j1m01r6O08j27l74M20K21p20N4N84j32
$$ plain form
7013 189 -294 154 134 -344 -74 465 -271 -302 210 204 -192 -425 483 56 -291 235 360 -291 -119 318 -150
7034 -150 -336 231 222 -335 -49 523 -39 -304 157 91 -330 -188 644 -17 -387 184 356 -188 -188 426 57 -437
7056 -437 211 271 -130 -288 304 22 -264 324 230 -272 -286 183 -32 -181 145 343 -264 -364 244 58 -391
7077 -391 130 304 -153 -197 293 157 -244 -194 238 -185 -333 410 -38 -693 101 274 -243 -295 263 111 -205
7098 -205 116 275 -254 -266 374 -114 -326 250 430 -215 -283 293 2 -544 226 498 -29 -45 216 246 -446
7119 -446 240 400 -232 -210 254 127 -240 2 513 -67 -89 446 -4 -325 119 304 -54 -207 460 46 -326
7140 -326 40 345 -235 -110 361 162 -146 227 579 -113 -211 393 142 -441 180 155 -23 -365 475 208 -274
7161 -274 108 453 -185 -133 271 155 -379 -13 497 10 -469 166 292 -358 -101 442 -316 -412 504 166 -361
$$ packed form
7013A89m83M48k0m78K70N39p36l1N12ol96k33R08m27l47N26J25o51J72M37m68
7034a50j86N67rn57K86N72n62k65M61o6m21J42Q32o61l70N71J72n44%O14l69m94
7056d37O48O0m01j58N92k82k86N88r4n02j4M69k15j49L26J98o07j00O08j86m49
7077c91N21J74m57m4M90j36m01N0M32m23j48P43m48o55P94J73n17n2N58j52l16
7098b05L21J59n29j2O40m88k12N76J80o45o8N76k91n46P70K72n27j6K61L0o92
7119d46O86J60o32K2M64j27l67K42N11n80k2N35m50l21M44J85l58j53O67m14l72
7140c26L66L05n80J25M71j99l08L73L52o92r8O04k51n83O21k5j78l42Q40k67m82
7161b74L82L45o38N2M04j16n34L66N10m87m79O35J26o50K57N43p58r6R16l38n27
$$ plain form
7182 -361 -107 436 -36 -219 156 288 -570 32 527 -105 -274 291 289 -319 -103 85 -109 -309 271 174 -315
7203 -315 82 519 89 -458 163 184 -214 -287 407 -224 -557 372 94 -491 -123 359 -228 -477 283 240 -456
7224 -456 -53 592 -310 -200 139 427 -401 -120 315 -195 -200 92 230 -570 41 167 -55 -444 182 366 -494
7245 -494 -171 364 -47 -301 269 343 -319 -81 367 -401 -294 278 328 -542 -101 206 -275 -293 239 109 -548
7266 -548 17 454 -81 -164 479 312 -316 115 397 -61 -291 30 243 -337 -74 519 -277 -112 67 118 -261
7287 -261 77 556 61 -307 222 332 -230 52 247 -69 -400 338 428 -319 -84 112 -70 -184 207 287 -233
7308 -233 -69 383 -36 -464 15 70 -224 -185 567 -117 -461 38 71 -352 -265 370 -1 -215 210 249 -603 54
7330 54 411 -189 -287 254 420 -252 -97 350 67 -232 456 210 -450 -78 224 47 -465 268 318 -206 -153
$$ packed form
7182c61K54N43m72j83L75J32q58O02M95o32j69N65ko08K16J88j94k00N80r7m89
7203c15L97M37m30n47O21K1l98p3O94o31l33R29k78n85L68M82n87k49P60m3o96
7224d56M03O45r02J10L39K88q28K81M35n10nK92J38q00O11J26k22l89O26J84q60
7245d94L23N35m11k54N70P4o62K38M48p68J07N72N0q70M41L07m81j8N32j30o57
7266e48N65M37n35q3O43j67o28M31K82m58k30L21K13n80K63N93p96J65J79N1l79
7287b61L38M79m95l68N29J10n62K82J95l16l31P38R0p47K35J96j82j14L91Q0n20
7308b33J64M52m19m28M79N5k94L9P52o84l44M99L3m23Q7O35l71k14M25L9q52O57
7330E4L57o00r8N41J66o72J55M47k83k99O88k46o60L72L02j77n12P33N0n24N3
$$ plain form
7351 -153 250 -145 -405 350 238 -325 212 391 28 -176 112 322 -388 -61 302 -168 -171 414 270 -352 -127
7372 -127 372 93 -404 353 477 -515 -246 301 24 -342 85 180 -313 -138 375 -184 -326 213 224 -273 -195
7393 -195 527 -9 -321 155 211 -241 -71 707 -107 -182 50 387 -309 -168 336 -109 -313 292 299 -313 -74
7414 -74 156 -162 -284 128 341 -465 -315 542 107 -406 206 103 -208 -51 362 130 -621 207 457 -364
7434 -364 100 259 168 -283 212 291 -326 5 342 -7 -163 264 86 -93 -390 411 160 -326 181 366 -173
7455 -173 -299 325 -275 -310 149 205 -311 -239 344 48 -375 -131 333 -284 -209 77 3 -239 56 348 -100 -230
7477 -230 165 15 -201 94 305 -329 -227 446 94 -218 145 390 -177 -260 341 100 -367 320 234 -413 -356
7498 -356 535 197 -398 31 399 -169 -368 469 128 -496 280 4 -145 -280 256 4 -245 -15 339 -107
$$ packed form
7351a53M03l95k60P55j12n63N37J79l63k04K88K10p10L27L63m70lN85j44o22K25
7372a27M99k79m97P57J24r92K69N47k77l66M27R5m93J75N13n59j42N39J1m97P8
7393a95P22n36l12M76N6m52J70P78q14p5K32L37o96J41N04m45k04O05Po12K39
7414g4K30l18j22M12K13q06J50Q57m35n13O12j03l11J57M13k32p51Q28K50q21
7434c64M64J59r1m51M95P9o17L31L37l49j56M27j78j79k97Q01k51m86N07J85n39
7455a73j26O24o00l5M59N6n16P2N83k96m23K44M64o17P5K86p4k42K95K92m48j30
7477b30L95j50k16K95K11o34J02O73l52l12L63K45n67q3O01k41m67O87q6o47N7
7498c56Q91l38n95M29L68n68j99Q37l41o24P76k76j49j35N36k52k49K30L54m46
$$ plain form
7518 -107 -348 440 -54 -465 144 310 -87 -283 405 24 -605 125 214 -144 -221 542 -36 -440 26 371 -227
7539 -227 -282 551 170 -522 -29 443 9 -402 55 15 -169 -30 215 -331 -128 380 86 -485 172 382 21
7560 21 -211 194 163 -436 33 401 -302 -411 345 177 -416 -56 218 -206 -174 402 127 -192 315 284 -223
7581 -223 -258 240 366 -348 -115 458 -139 -283 349 -14 -257 124 303 -11 -453 416 -2 -420 131 398
7601 398 -287 -229 337 97 -400 25 536 -402 -169 281 -1 -378 136 507 -295 -272 42 182 -181 310 248
7622 248 -86 -211 281 148 -316 77 97 -10 -329 315 24 -529 55 692 -115 -63 265 83 -267 129 257
7643 257 -179 -199 285 -34 -27 74 466 -54 -351 425 174 -141 12 421 -211 -299 262 143 -445 120 170 -90
7665 -90 -200 273 185 -205 -149 129 -160 -352 323 46 -292 -51 525 5 -260 141 321 -257 61 341 -155
$$ packed form
7518a07k41P88m94m11O09J66l97j96O88l81o29P30Q9l58p7P63n78m04M66L45n98
7539b27n5Q33l81o92M93M72m34m11M57m0j84J39K45n46K03N08k94n71O57K10l61
7560B1k32M05l1n99M69L68p03j09P56j68n93L60K74m24L2N76k75l19N07l1n07
7581b23l5M98J26p14K33N73n97j44O32l63k43L81J79l14m42Q69m18m18N51K67
7601C98o85N8N66k40m97M25N11r38K33M50k82l77N14L71q02K3L14J40l63M91o2
7622B48l34j25M92j33m64L93K0j07l19O44k91n53N84O37q07N2L28j82l50L96J28
7643B57m36k0M84l19PJ01L92n20k97P76k51l15J53M09o32q8N61j19n88N65N0k60
7665i0j10M73q8l90N6K78k89j92O75k77l38K41N76n20k65M01J80n78L18K80m96
$$ plain form
7686 -155 -209 218 79 -166 -4 213 -168 -336 458 252 -309 -41 233 -7 -445 195 210 -438 -212 312 -164
7707 -164 -170 256 65 -286 -73 507 -61 -74 92 383 -494 7 164 14 -370 202 254 -285 -56 298 -63
7728 -63 -122 126 2 -237 -239 296 -96 -350 433 -45 -353 -51 132 -193 -248 83 280 -127 -115 425 163 -534
7750 -534 149 156 -425 -153 144 -284 -314 93 165 -211 -96 137 -99 -234 -40 240 -497 -140 259 45 -338
7771 -338 327 286 -114 -41 467 37 -536 100 142 -120 -18 145 16 -447 414 324 -253 -71 351 59 -88
7792 -88 247 403 -353 -10 323 75 -389 109 317 -441 -140 305 -19 -159 536 196 -216 -20 333 108
7812 108 -374 462 44 -13 -276 320 187 -559 154 281 -400 -243 288 204 -136 233 229 -197 -33 479 -29
7833 -29 -452 258 454 -4 -134 182 -13 -244 274 298 -76 56 139 32 -380 -29 195 -351 -263 404 -230
$$ packed form
7686a55n4M27j39k45J62K17l81j68P94k06n61K68K74k40m38O40J5o48K26N24m76
7707a64oM26j91l51K13N80n68j3J66K91q77N01J57j50l84N72N2n39K29L54l61
7728f3n9K48j24k39kN35l92k54P83m78l08L02J83l25n5L31J97m07J2N40k62o97
7750e34O83Pn81K72K97m28l0M07P2l76J15K33k36j35J94K80p37L57L99k14l83
7771c38O65m1m00P3N08m30n73O36M2k62J02J63j29m63Q61r0n77J82M22k92j47
7792h8L35J56p56L43L33k48m64M98K08p58L01M45l24j40O95l40m12J96L53k25
7812A08m82Q36m18n7k63N96j33p46P13J27o81J57N31q4l40L69mm26J64N12n08
7833b9m23P10J96m58j30L16j95k31N18K4l74J32Q3j07m12L51K24n46Q8O67o34
$$ plain form
7854 -230 -408 340 453 -306 -340 241 -44 -216 144 274 -194 -215 278 20 -297 84 310 -125 -198 303 -87
7875 -87 -47 149 57 -172 46 265 -21 -295 121 404 -334 -11 351 214 -439 -56 247 -314 -129 429 30
7896 30 -372 421 83 -336 -205 162 187 26 217 119 -208 -148 316 -40 -375 -41 -8 -262 -179 151 -183 -387
7918 -387 -94 113 -241 -12 277 64 -260 107 178 -263 -304 177 137 -405 -50 309 -142 -176 282 84 -186
7939 -186 -141 438 -196 -420 198 -283 -297 234 469 -368 -61 301 70 13 280 206 -40 23 373 330 -194 119
7961 119 278 -189 -264 198 19 -444 81 182 -465 -57 58 -6 -207 -41 365 -439 -226 215 -107 -109 135
7982 135 195 -58 -257 346 -238 -417 21 275 -314 -34 318 -133 -215 -156 275 -180 -443 236 141 -192 161
8003 161 -64 -221 -191 158 5 -316 223 306 -36 -356 329 -115 -262 288 199 -75 -64 263 -51 -334 233
$$ packed form
7854b30j78P48J13p59l4N81k85j72L60J30m68k1M93k58l17L81K26m35p3N01l90
7875h7M0J96r2k29K18K19k86k74M16K83p38L23L62j37o53L83L03n61J85N58l99
7896C0m02P93l38m19J31L67K5j61J91r8l27O0M64l56l35L34L3k54Q3L30l34k04
7918c87K93K07l54K29K89k13l24L67P1m41m1M81m0n42L55L59m51l4M58j98k70
7939a86M5N79o34k24O18m81j4N31K35q37L07L62k31n7K67p4k46O3L50m3n24L13
7961A19J59m67p5M62j79m63N25J01o47M08J15o4k01J66M06q04K13M41l22kK44
7982A35O0k53j99O03n84j79M38K54n89K80L52m51q2N9M31m55k63O79r5l33L53
8003A61k25j57L0L49j53l21N39Q3l42l20O85m44j47N50q9k74J1L27l14k83N67
$$ plain form
8024 233 287 -123 -39 235 286 -438 242 309 -62 -187 124 123 -105 114 318 -159 -320 307 216 -162 149 103 -58
8047 -58 -84 196 177 -422 65 330 -70 -196 304 27 -235 111 452 30 -259 -3 192 -296 112 289 -87
8068 -87 90 195 85 -175 4 221 -277 -191 184 -182 -157 -169 105 -240 0 86 -41 -313 139 265 -12 -103
8090 -103 233 115 -68 168 315 15 -272 34 113 -94 35 373 -409 -163 359 77 -159 23 216 -131
8110 -131 -114 266 50 -337 124 171 -124 -238 57 125 -163 158 389 -247 -168 298 198 -503 -70 207 -305
8131 -305 -181 357 590 -21 -200 357 -263 -182 297 48 -260 215 275 32 -155 168 -70 -279 -73 571 -29
8152 -29 -364 248 124 -283 -151 343 -224 -303 -3 86 -312 71 325 59 -92 306 95 -76 -46 357 -232
8173 -232 -232 254 306 -402 -4 331 -160 -308 256 94 25 10 400 -248 -321 263 14 -191
$$ packed form
8024B33N4m10Q4K74N1p24O80O7l71j25L11jk28K19K04m77j61O27r1l78L11m6j61
8047e8k6K80j9n99M87K65m00j26N00k77k62L46L41m22k89K56J95m88M08J77l76
8068h7J77J05j10k60J79K17m98Q6L75l66K5j2K74l45K40Q6j27k72M52J26k77r1
8090a03L36j18j83K36J47l00k87L06P9k07J29L38p82K46N22k82k36J82J93l47
8110a31J7L80k16l87M61M7k95j14K95O8k88L21K31o36P9M66j00p01M33K77n12
8131c05J24N38K33o11j79N57o20Q1M79k49l08M75O0k43j87L23k38k09K06O44o00
8152b9l35O12j24m07J32M94n67p9L00Q9l98L83K54k66j51L98k11j71L0M03n89
8173b32%M86N2p08L98L35m91j48N64j62o9j5L90o48p3N84k49k05
8191a91
$$ Imaginary data points
##PAGE= N=2
##DATA TABLE= (X++(I..I)), XYDATA
$$ plain form
0 0 0 0 0 0 0 0 0 0 -8 8 -8 8 -8 16 -16 24 -27 33 -40 48 -62 73 -88 104 -121 142 -167 195 -223 255 -294
31 -294 338 -382 434 -490 555 -624 700 -784 875 -975 1086 -1204 1335 -1480 1634 -1805 1989
48 1989 -2192 2416 -2662 2930 -3230 3561 -3931 4346 -4814 5347 -5964 6683 -7535 8560
62 8560 -9828 11440 -13565 16506 -20881 28144 -43138 142540 -352367 -107406 485339 -155919
74 -155919 -303867 106235 254280 -257731 -141377 407926 -11261 -314330 154439 147119
84 147119 -193608 -192541 255855 106643 -343992 125454 270084 -280406 -146750 210578
94 210578 51996 -288986 28190 346718 -250134 -221268 351477 -55055 -320952 117328
104 117328 221031 -187693 -183940 314418 18236 -356521 162909 175893 -232354 -79914
$$ packed form
0@%%%%%%%%qJ6j6J6j6K4l2M0n1O0p3Q8j10J35j61J92k25K63l09L62m18M78n49
31b94O32p20Q16r24J045j179J324j484J659j850K061k290K539k815L114l439L794
48A989m181M608n078N592o160O791p492Q277r160J0161j1311J2647j4218J6095
62H560j8388K1268k5005L0071l7387M9025p1282J85678m94907K44961N92745o41258
74a55919j47948M10102J48045n12011J16354N49303m19187l03069M68769p320
84A47119l40727J067M48396j49212m50635M69446J44630n50490J33656L57328
94B10578j58582l40982L17176L18528n96852K8866N72745m06532k65897M38280
104A17328J03703m08724L753M98358k96182l74757N19430J2984m08247J52440
$$ plain form
114 -79914 200037 75314 -247365 33791 280699 -213129 -167945 264840 33930 -232071
124 -232071 49559 278290 -144434 -223594 308078 42687 -309868 139460 217245 -159225
134 -159225 -116461 229404 74799 -277074 84495 238253 -194328 -83178 217725 32653
144 32653 -179256 23390 214489 -124018 -171723 228922 56697 -218545 49761 200613
154 200613 -109351 -188330 205342 88598 -285163 69993 228365 -177835 -125501 194514
164 194514 38394 -234124 34473 211666 -168558 -130781 206189 6397 -190655 29263
174 29263 152724 -98625 -160757 165975 70569 -219874 26741 179346 -109770 -153404 151448
185 151448 90825 -224833 12133 225463 -138697 -145097 194339 42748 -200670 35131
$$ packed form
114g9914K79951j24723l22679K81156K46908m93828M5184M32785k30910k66001
124b32071K81630K28731m22724p9160N31672k65391l52555M49328P7785l76470
134a59225M2764L45865j54605l51873L61569J53758m32581J11150L00903j85072
144C2653k11909K02646J91099l38507m7705M00645j72225k75242K68306J50852
154B00613l09964p8979L93672j16744l73761L55156J58372m06200N2334L20015
164A94514j56120k72518K68597J77193l80224L7777L36970j99792j97052K19918
174B9263J23461k51349o2132L26732r5406k90443K46615J52605k89116m3634L04852
185A51448o0623l15658K36966K13330l64160o400L39436j51591k43418K35801
$$ plain form
195 35131 190080 -114496 -129439 190350 39464 -183163 51970 152218 -86789 -108589
205 -108589 142304 78787 -167811 15344 180380 -80324 -127462 145369 89889 -173586
215 -173586 -1231 207425 -87519 -152276 179266 69138 -193180 30135 182177 -97882
225 -97882 -129831 164896 56715 -184132 33567 154517 -96404 -107290 126828 56129 -153336
236 -153336 -3396 150319 -72489 -131846 116166 70768 -158602 -19698 161421 -66444
246 -66444 -153785 128527 77292 -183719 -2682 166859 -89037 -135978 135372 57909 -172524
257 -172524 10142 149696 -86388 -113108 121132 52810 -142611 -1058 137615 -56911
267 -56911 -118099 106140 77315 -137950 -16697 154531 -45205 -133273 115404 91906 -152240
$$ packed form
195C5131J54949l04576j4943L19789j50886k22627K35133J00248k39007k1800
205a08589K50893o3517k46598J83155J65036k60704m7138K72831n5480k63475
215a73586J72355K08656k94944o4757L31542j10128k62318K23315J52042k80059
225i7882l1949K94727j08181k40847K17699J20950k50921j0886K34118p0699k09465
236a53336J49940J53715k22808n9357K48012m5398k29370J38904J81119k27865
246f6444q7341K82312n1235k61011J81037J69541k55896m6941K71350p7463k30433
257a72524J82666J39554k36084k6720K34240o8322j95421J41553J38673j94526
267e6911o1188K24239k8825k15265J21253J71228j99736q8068K48677k3498k44146
$$ plain form
278 -152240 -10400 169925 -58492 -128276 131008 77550 -151044 7737 155802 -63948
288 -63948 -106841 120848 62763 -129172 4934 132847 -47390 -101010 95474 72237 -116794
299 -116794 -18761 134337 -33025 -120900 90263 85441 -132144 -27226 146502 -43890 -132099
310 -132099 103235 77207 -146481 -13182 141281 -61783 -117173 101633 57015 -132768
320 -132768 -9738 119895 -52222 -105967 81050 59124 -114356 -26493 114776 -30668
330 -30668 -116831 71176 79377 -118058 -36771 130406 -29108 -125646 83300 83750 -127587
341 -127587 -25397 137539 -40992 -113872 94141 68953 -117804 -9014 122196 -37578
351 -37578 -93753 82970 63895 -96508 -14442 109785 -18020 -93187 66866 79238 -91706
$$ packed form
278a52240J41840J80325k28417o9784K59284n3458k28594J58781J48065k19750
288f3948m2893K27689n8085j91935J34106J27913j80237n3620J96484k3237j89031
299a16794R8033J53098j67362q7875K11163m822k17585J04918J73728j90392q8209
310a32099K35334k6028k23688J33299J54463k03064n5390K18806m4618j89783
320a32768J23030J29633j72117n3745J87017k1926j73480Q7863J41269j45444
330c0668q6163J88007Q201j97435Q1287J67177j59514r6538K08946M50k11337
341a27587J02190J62936j78531p2880K08013k5188j86757J08790J31210j59774
351c7578n6175J76723j9075j60403Q2066J24227j27805p5167J60053J2372j70944
$$ plain form
362 -91706 -31536 120338 -10111 -108874 71422 89166 -105890 -32012 131331 -23411 -112841
373 -112841 83685 76799 -112827 -18495 120201 -34231 -98668 75557 60991 -98980 -19758
384 -19758 100298 -24473 -93161 55550 64771 -88525 -37368 98346 -11932 -105641 50193
395 50193 76367 -97608 -43474 109329 -18274 -111943 61149 73191 -104930 -31255 108690
406 108690 -28443 -99673 64945 60295 -93868 -23467 96168 -20820 -88015 54315 63161
417 63161 -79454 -30905 93323 -4156 -91722 46815 79698 -79788 -40212 107181 -2771
428 -2771 -100263 57637 82591 -88183 -32249 112392 -12430 -94806 65796 69619 -84626
439 -84626 -20239 97690 -13075 -80770 53560 63362 -71155 -26750 85614 -2086 -80536
$$ packed form
362i1706O0170J51874j30449r8763J80296J7744j95056P3878J63343j54742q9430
373a12841J96526o886j89626R4332J38696j54432o4437J74225j4566j59971P9222
384a9758J20056j24771o8688J48711R221j53296N1157J35714j10278r3709J55834
395E0193K6174j73975N4134J52803j27603r3669J73092J2042j78121P3675J39945
406A08690j37133p1230J64618m650j54163P0401J19635j16988o7195J42330Q846
417F3161j42615M8549J24228r7479q7566J38537L2883j59486L9576J47393j09952
428b771r7492J57900K4954j70774N5934J44641j24822q2376J60602L823j54245
439h4626O4387J17929j10765o7695J34330R802j34517M4405J12364q7700p8450
$$ plain form
450 -80536 37634 71057 -68156 -42977 91662 1808 -95027 40887 75081 -79263 -43334
461 -43334 97039 -7490 -99968 50401 66666 -87246 -30820 88684 -16222 -85814 43289
472 43289 57333 -75757 -32029 78798 -9684 -79961 32174 60377 -62958 -44474 78879
483 78879 5014 -90462 32203 72547 -69457 -45126 88251 4230 -93329 40454 74465
494 74465 -76284 -32967 91121 -7451 -79386 44438 62319 -64646 -27653 81379 -2690
505 -2690 -69442 37628 58573 -50692 -33638 73062 13290 -76089 29320 72461 -56250
516 -56250 -39659 80802 11433 -81909 30734 77025 -65254 -41034 89422 -1839 -81348
527 -81348 39994 60885 -63171 -33534 76184 -1595 -76540 33188 54578 -56835 -33381
$$ packed form
450h0536J18170L3423j39213K5179J34639q9854r6835J35914L4194j54344L5929
461d3334J40373j04529r2478J50369J6265j53912N6426J19504j04906o9592J29103
472D3289J4044j33090M3728J10827q8482p0277J12135K8203j23335J8484J23353
483G8879p3865r5476J22665M0344j42004K4331J33377q4021r7559J33783L4011
494G4465j50749M3317J24088r8572p1935J23824J7881j26965L6993J09032q4069
505b690o6752J07070K0945j09265J7054J06700n9772q9379J05409M3141j28711
516e6250J6591J20461o9369r3342J12643M6291j42279K4220J30456r1261p9509
527h1348J21342K0891j24056K9637J09718p7779p4945J09728K1390j11413K3454
$$ plain form
538 -33381 62197 6701 -72737 16837 63874 -54180 -46452 68747 8456 -79198 17899 66342
550 66342 -56544 -49867 76535 4165 -84123 31010 59128 -59884 -36051 67991 3328
561 3328 -73499 27531 57241 -54945 -30717 62538 6200 -61791 16317 61271 -41228 -43893
573 -43893 68502 15177 -71086 21108 66355 -43550 -44676 72691 18609 -78522 28973
584 28973 69590 -55251 -32582 72229 7683 -66304 26156 61059 -48388 -31896 65828
595 65828 5559 -58568 19328 53222 -35179 -41068 57367 18834 -67823 13733 60338 -40615
607 -40615 -44525 58345 19643 -74524 12729 66975 -52474 -43219 65743 4698 -68995 17810
619 17810 54811 -47252 -40773 60503 4603 -65953 18241 46864 -39255 -37619 47972 16845
$$ packed form
538c3381R5578n5496p9438Q9574M7037j18054P728J15199o0291q7654R7097M8443
550F6342j22886O677J26402p2370q8288J15133K8118j19012K3833J04042o4663
561C328p6827J01030K9710j12186K4228R3255n6338o7991P8108M4954j02499k665
573d3893J12395n3325q6263R2194M5247j09905j126J17367n4082r7131J07495
584B8973M0617j24841K2669J04811o4546p3987R2460L4903j09447J6492R7724
595F5828o0269o4127P7896L3894q8401n889R8435l8533q6657Q1556M6605j00953
607d0615l910J02870l8702r4167Q7253N4246j19449R255J08962o1045p3693Q6805
619A7810L7001j02063O479J01276n5900p0556Q4194K8623q6119J636Q5591l1127
$$ plain form
631 16845 -64150 7081 58802 -39259 -43873 54319 18750 -64793 6389 65000 -39246 -47904
643 -47904 65173 14598 -67817 19635 57794 -39699 -36801 59192 14400 -61112 20120 53568
655 53568 -35853 -29782 49576 17501 -50938 7217 57343 -27940 -40081 52693 21512 -55989
667 -55989 6394 59709 -28180 -46867 56994 22707 -66653 13942 58774 -38669 -38302 53615
679 53615 15106 -60552 11161 53656 -38090 -35802 48500 10826 -52951 4484 47840 -27570
691 -27570 -43494 43560 19383 -57939 1246 51632 -28043 -46329 44162 23026 -63027 2370
703 2370 57366 -35599 -42462 49764 14803 -57549 7077 51352 -32381 -37439 46838 13215 -50726
716 -50726 7389 45383 -22953 -36174 39816 23192 -49678 1456 53020 -21865 -40463 43061
$$ packed form
631A6845q0995P1231N1721r8061m614R8192l5569q3543P1182N8611j04246q658
643d7904J13077n0575q2415Q7452L8159r7493K898R5993m4792p5512Q1232L3448
655E3568q9421O071P9358l2075o8439N8155N0126q5283j2141R2774l1181p7501
667e5989O2383N3315q7889j8687J03861l4287q9360Q0595M4832r7443L67R1917
679E3615l8509p5658P1713M2495r1746K288Q4302l7674o3777N7435M3356p5410
691b7570j5924Q7054k4177p7322N9185N0386p9675j8286R0491k1136q6053O5397
703B370N4996r2965o863R2226l4961p2352O4626M4275q3733n058Q4277l3623o3941
716e0726N8115L7994o8336j3221P5990j6624p2870N1134N1564p4885j8598Q3524
$$ plain form
728 43061 26855 -52445 759 59287 -25430 -42127 51154 21632 -54295 8873 53300 -27014
740 -27014 -35717 46888 17901 -49926 8546 46514 -23906 -32469 37480 20141 -44154 -1515
752 -1515 47260 -18742 -39930 36446 23975 -48723 -4771 50497 -20804 -45349 40328 22466
764 22466 -55108 682 49447 -27671 -39892 40152 16327 -51002 2375 44153 -26108 -35180
776 -35180 35063 15686 -44115 -2281 41986 -18069 -38941 32642 22999 -45695 -5089 47327
788 47327 -16990 -42141 36127 26293 -49209 -2114 51412 -20938 -39023 40561 21458 -46247
800 -46247 2575 46989 -19671 -33237 37509 19643 -39969 1409 42247 -13865 -32185 31024
812 31024 24487 -38127 -4652 45251 -11420 -37525 31896 27218 -42573 -5887 48658 -15547
$$ packed form
728D3061j6206p9300N3204N8528q4717j6697R3281k9522p5927O3168M4427q0314
740b7014q703Q2605k8987o7827N8472L7968p0420q563O9949j7339o4295M2639
752a515M8775o6002k1188P6376j2471p2698M3952N5268p1301k4545Q5677j7862
764B2466p7574N5790M8765p7118j2221Q0044k3825o7329N3377M1778p0261r072
776c5180P0243j9377n9801M1834M4267o0055k0872P1583r643o8694M0606N2416
788D7327o4317k5151P8268r834p5502M7095N3526p2350j8085P9584j9103o7705
800d6247M8822M4414o6660j3566P0746j7866n9612M1378M0838n6112j8320O3209
812C1024o537o2614L3475M9903n6671k6105O9421m678o9791L6686N4545o4205
$$ plain form
824 -15547 -40077 35931 23345 -45821 -1469 44943 -19828 -36006 33670 18383 -42425 -1744
836 -1744 39212 -17168 -34201 27138 19777 -38608 -8039 39045 -12199 -38845 25659 24154 -41870
849 -41870 -10177 43512 -13636 -41402 30004 23938 -44210 -5124 43429 -17317 -35850 31140
861 31140 19801 -39720 -2417 39018 -14109 -31643 27248 20463 -33863 -5450 38032 -8223
873 -8223 -33222 25077 26253 -34596 -8324 42726 -7481 -36736 28929 27932 -38729 -6024 45522
886 45522 -12025 -35559 31999 23250 -38263 -2083 40931 -13279 -30966 28176 19880 -33513
898 -33513 -4745 35641 -9025 -31264 21738 22801 -32200 -10739 36903 -6846 -36842 21522
910 21522 25367 -36467 -11720 39691 -10153 -38192 24947 22644 -38687 -7576 37545 -13580
$$ packed form
824a5547k4530P6008j2586o9166M4352M6412o4771j6178O9676j5287o0808M0681
836a744M0956n6380j7033O1339p361n8385L0569M7084n1244k6646O4504j505o6024
849d1870L1693N3689n7148k7766P1406o066o8148L9086M8553o0746j8533O6990
861C1140j1339n9521L7303M1435n3127j7534N8891o785n4326K8413M3482m6255
873h223k4999N8299J176o0849K6272N1050n0207k9255O5665r97o6661L2705N1546
886D5522n7547k3534O7558q749o1513L6180M3014n4210j7687N9142q296n3393
898c3513K8768M0386m4666k2239N3002J063n5001K1461M7642m3749k9996N8364
910B1522L845o1834K4747N1411m9844k8039O3139k303o1331L1111M5121n1125
$$ plain form
922 -13580 -33716 23990 18488 -34532 -6736 33232 -9693 -31367 19942 20571 -30872 -10199 33871
935 33871 -5001 -33950 19270 25902 -32272 -11899 38650 -5497 -35894 23396 26272 -33884
947 -33884 -8264 39388 -7796 -32255 24984 22707 -30914 -5193 35355 -6256 -28099 21068
959 21068 22224 -26440 -8097 32950 -2043 -29797 17465 25840 -26815 -12119 35382 -2032
971 -2032 -33662 19319 26217 -30792 -11401 36504 -5849 -33458 21339 22018 -31877 -8403 32983
984 32983 -7836 -30168 18217 19325 -28363 -10100 29275 -4657 -30306 14138 22003 -26586
996 -26586 -14205 30693 -2192 -33839 14820 24751 -29539 -13970 33551 -4231 -33880 18267
1008 18267 23177 -29762 -9680 32398 -5677 -29070 18008 20291 -25587 -8244 29327 -2516
$$ packed form
922a3580k0136N7706n502n3020K7796L9968m2925k1674N1309O29n1443K0673M4070
935C3871l8872k8949N3220O632n8174K0373N0549m4147l0397N9290K876o0156
947c3884K5620M7652m7184k4459N7239k277n3621K5721M0548m1611k1843M9167
959B1068J156m8664J8343M1047l4993k7754M7262Q375n2655J4696M7501l7414
971b032l1630N2981O898n7009J9391M7905m2353k7609N4797O79n3895K3474M1386
984C2983m0819k2332M8385J108m7688J8263L9375l3932k5649M4444P865m8589
996b6586J2381M4898l2885l1647M8659R931n4290J5569M7521l7782k9649N2147
1008A8267M910n2939K0082M2078l8075k3393M7078K283m5878J7343L7571l1843
$$ plain form
1020 -2516 -26364 14447 21939 -21836 -11484 29602 1540 -28833 14257 26341 -23920 -12961
1032 -12961 33440 498 -31057 17247 26016 -26845 -10156 33740 -3216 -28997 18293 22000
1044 22000 -25399 -8615 29411 -2896 -26237 14134 20254 -21906 -11534 26437 436 -28250
1056 -28250 10410 22977 -22328 -15149 27857 913 -31485 11402 24395 -25521 -14862 29940
1068 29940 -2582 -30574 13753 20766 -25339 -11863 27231 -3124 -27430 12623 18988 -21829
1080 -21829 -11608 24512 326 -26507 9328 22192 -20336 -14405 26975 2520 -28497 10415
1092 10415 24976 -21497 -14512 30030 1660 -28915 14040 23518 -21946 -10880 28503 741
1104 741 -25740 13267 21619 -19719 -9942 25154 1832 -23126 9139 22359 -16239 -13576 25100
$$ packed form
1020b516k3848M0811P492m3775J0352M1086k8062l0373M3090J2084n0261J0959
1032a2961M6401l2942l1555M8304Q769n2861J6689M3896l6956k5781M7290L707
1044B2000m7399J6784L8026l2307k3341M0371O120m2160J0372L7971k6001k8686
1056b8250L8660J2567m5305P179M3006k6944l2398M2887J2993m9916J0659M4802
1068B9940l2522k7992M4327P013m6105J3476L9094l0355k4306M0053O365m0817
1080b1829J0221L6120k4186k6833L5835J2864m2528N931M1380k4455l1017L8912
1092A0415J4561m6473O985M4542k8370l0575M2955R478m5464J1066L9383k7762
1104G41k6481L9007Q352m1338R777L5096k3322k4958L2265J3220l8598K663L8676
$$ plain form
1117 25100 4360 -25638 8449 23751 -17976 -15563 26763 3884 -28688 10315 23382 -21471
1129 -21471 -13418 25947 332 -26881 10170 20642 -20869 -12301 23362 -380 -24526 7320
1141 7320 18911 -17304 -14836 21485 3517 -25934 5485 21210 -17260 -16534 22610 4839 -27963
1154 -27963 6559 23724 -19693 -15032 24920 1993 -25982 8698 21443 -17974 -12918 23764
1166 23764 1796 -22823 8425 19009 -14200 -12254 20639 6055 -21780 5447 21903 -13140
1178 -13140 -14252 21877 7455 -23141 5078 24496 -14869 -15528 24736 5379 -24766 8087
1190 8087 22477 -16058 -13207 23091 3895 -23421 8186 19589 -15214 -11917 19228 4384
1202 4384 -21272 3708 19654 -12885 -15030 18806 5963 -22629 2044 20909 -13436 -17366
$$ packed form
1117B5100k0740k9998L4087J5302m1727K413M2326k2879l2572L9003J3067m4853
1129b1471Q053L9365k5615k7213L7051J0472m1511Q568L5663k3742k4146L1846
1141G320J1591l6215K468L6321j7968k9451L1419J5725l8470P26L9144j7771l2802
1154b7963L4522J7165m3417M661L9952k2927k7975L4680J2745l9417N056L6682
1166B3764k1968k4619L1248J0584l3209J946L2893j4584k7835K7227J6456l5043
1178a3140j112L6129j4422l0596K8219J9418l9365o59M0264j9357l0145L2853
1190H087J4390l8535K851L6298j9196k7316L1607J1403l4803L297L1145j4844
1202D384k5656K4980J5946l2539k145L3836j2843k8592K4673J8865l4345l930
$$ plain form
1214 -17366 20187 6108 -24994 4270 20704 -15613 -15361 19883 4076 -23655 4752 18776
1226 18776 -14962 -13269 18322 3663 -20397 3204 18099 -11411 -14585 17422 6913 -21179
1238 -21179 2045 20273 -10911 -15427 18975 8330 -22260 3372 22252 -12961 -14303 20841
1250 20841 6060 -21187 5190 20388 -12210 -12501 19125 5321 -18860 4375 18433 -9739
$$ packed form
1214a7366L7553j4079l1102K9264J6434l6317K52L5244j5807k7731K8407J4024
1226A8776l3738J693L1591j4659k4060K3601J4895k9510l174L2007j0509k8092
1238b1179K3224J8228l1184m516L4402j0645l0590K5632J8880l5213j342L5144
1250B0841j4781k7247K6377J5198l2598k91L1626j3804k4181K3235J4058k8172
$$ [...]
8191a78
##END NTUPLES=NMR FID
##END=
