##TITLE=1H_SR34_2
 CDCl3,8 sc, 
 4.03.2021
##JCAMPDX= 6.0         $$ Bruker NMR JCAMP-DX V2.0
##DATA TYPE= NMR FID
##DATA CLASS= NTUPLES
##ORIGIN= UXNMR, Bruker Analytische Messtechnik GmbH
##OWNER= root
$$ XWIN-NMR		Version 3.5
$$ Thu Mar  4 11:51:53 2021 Russian Standard Time (UT+4h)  she@DPX200
##.OBSERVE FREQUENCY= 200.1315066352
##.OBSERVE NUCLEUS= ^1H
##.DELAY= (6, 6)
##.ACQUISITION MODE= SIMULTANEOUS
##.ACQUISITION SCHEME= undefined
##.AVERAGES= 8
##.DIGITISER RES= 18
##SPECTROMETER/DATA SYSTEM= spect
##.PULSE SEQUENCE= zg30
##.SOLVENT NAME= CD3CN
##.SHIFT REFERENCE= (INTERNAL, CD3CN, 0, 15.7039)
##AUDIT TRAIL= $$ (NUMBER, WHEN, WHO, WHERE, WHAT)
$$ ##TITLE= Audit trail, XWIN-NMR		Version 3.5
$$ ##JCAMPDX= 5.01
$$ ##ORIGIN= Bruker BioSpin GmbH
$$ ##OWNER= she
$$ F:/spectra/data/she/nmr/H-F/1/audita.txt
$$ ##AUDIT TRAIL=  $$ (NUMBER, WHEN, WHO, WHERE, WHAT)
(   1,<2021-03-04 11:50:58.17 +0400>,<she>,<DPX200>,
      <created by zg, POWCHK disabled, PULCHK disabled
       configuration hash MD5:
       00 E9 B6 7A A2 85 ED C7 34 08 36 98 17 FE 4E 26
       data hash MD5: 16K
       17 E8 44 B1 AF 97 61 65 03 F4 2A 0E 52 1F 21 4B>)
$$ ##END=
$$ 
$$ hash MD5
$$ C8 45 D1 76 7F FA 44 48 32 6F B4 59 B0 71 3E 58
##$RELAX= 
##$RELAX= 
##$RELAX= 
##$RELAX= 
##$RELAX= 
##$RELAX= 
$$ Bruker specific parameters
$$ --------------------------
##$DU= <F:/spectra>
##$EXPNO= 1
##$NAME= <H-F>
##$PROCNO= 1
##$TYPE= <nmr>
##$USER= <she>
##$AMP= (0..31)
100 100 100 100 100 100 100 100 100 100 100 100 100 100 100 100 100 100 
100 100 100 100 100 100 100 100 100 100 100 100 100 100 
##$AQSEQ= 0
##$AQ_mod= 1
##$AUNM= <au_zg>
##$AUTOPOS= <>
##$BF1= 200.13
##$BF2= 200.13
##$BF3= 200.13
##$BF4= 200.13
##$BF5= 200.13
##$BF6= 200.13
##$BF7= 200.13
##$BF8= 200.13
##$BYTORDA= 1
##$CFDGTYP= 0
##$CFRGTYP= 5
##$CHEMSTR= <none>
##$CNST= (0..31)
1 1 145 1 1 1 1 1 1 1 1 1 1 1 1 1 1 1 1 1 1 1 1 1 1 1 1 1 1 1 1 1 
##$CPDPRG= <>
##$CPDPRG1= <>
##$CPDPRG2= <>
##$CPDPRG3= <>
##$CPDPRG4= <mlev>
##$CPDPRG5= <mlev>
##$CPDPRG6= <mlev>
##$CPDPRG7= <mlev>
##$CPDPRG8= <mlev>
##$CPDPRGB= <>
##$CPDPRGT= <>
##$D= (0..31)
0 1.2 0 0 0 0 0 0 0 0.06 0 0.03 0 0 0 0 0.0002 0 0 0 0 0 0 0 0 0 0 0 0 
0 0 0 
##$DATE= 1614844257
##$DBL= (0..7)
120 120 120 120 120 120 120 120 
##$DBP= (0..7)
150 150 150 150 150 150 150 150 
##$DBP07= 0
##$DBPNAM0= <>
##$DBPNAM1= <>
##$DBPNAM2= <>
##$DBPNAM3= <>
##$DBPNAM4= <>
##$DBPNAM5= <>
##$DBPNAM6= <>
##$DBPNAM7= <>
##$DBPOAL= (0..7)
0.5 0.5 0.5 0.5 0.5 0.5 0.5 0.5 
##$DBPOFFS= (0..7)
0 0 0 0 0 0 0 0 
##$DE= 6
##$DECBNUC= <off>
##$DECIM= 32
##$DECNUC= <off>
##$DECSTAT= 4
##$DIGMOD= 1
##$DIGTYP= 9
##$DL= (0..7)
0 120 120 120 120 120 120 120 
##$DP= (0..7)
150 150 150 150 150 150 150 150 
##$DP07= 0
##$DPNAME0= <>
##$DPNAME1= <>
##$DPNAME2= <>
##$DPNAME3= <>
##$DPNAME4= <>
##$DPNAME5= <>
##$DPNAME6= <>
##$DPNAME7= <>
##$DPOAL= (0..7)
0.5 0.5 0.5 0.5 0.5 0.5 0.5 0.5 
##$DPOFFS= (0..7)
0 0 0 0 0 0 0 0 
##$DQDMODE= 0
##$DR= 18
##$DS= 0
##$DSLIST= <SSSSSSSSSSSSSSS>
$$ [...]
##$SUBNAM2= <"">
##$SUBNAM3= <"">
##$SUBNAM4= <"">
##$SUBNAM5= <"">
##$SUBNAM6= <"">
##$SUBNAM7= <"">
##$SUBNAM8= <"">
##$SUBNAM9= <"">
##$SW= 16.9725356469052
##$SWIBOX= (0..15)
0 0 2 0 0 0 0 0 0 0 0 0 0 0 0 0 
##$SW_h= 3396.73913043478
##$TD= 16384
##$TD0= 1
##$TE= 0
##$TE2= 300
##$TE3= 300
##$TEG= 300
##$TL= (0..7)
0 120 120 120 120 120 120 120 
##$TP= (0..7)
150 150 150 150 150 150 150 150 
##$TP07= 0
##$TPNAME0= <>
##$TPNAME1= <>
##$TPNAME2= <>
##$TPNAME3= <>
##$TPNAME4= <>
##$TPNAME5= <>
##$TPNAME6= <>
##$TPNAME7= <>
##$TPOAL= (0..7)
0.5 0.5 0.5 0.5 0.5 0.5 0.5 0.5 
##$TPOFFS= (0..7)
0 0 0 0 0 0 0 0 
##$TUNHIN= 0
##$TUNHOUT= 0
##$TUNXOUT= 0
##$USERA1= <user>
##$USERA2= <user>
##$USERA3= <user>
##$USERA4= <user>
##$USERA5= <user>
##$V9= 5
##$VALIST= <valist>
##$VCLIST= <CCCCCCCCCCCCCCC>
##$VD= 0
##$VDLIST= <DDDDDDDDDDDDDDD>
##$VPLIST= <PPPPPPPPPPPPPPP>
##$VTLIST= <TTTTTTTTTTTTTTT>
##$WBST= 1024
##$WBSW= 4
##$XGAIN= (0..3)
0 0 0 0 
##$XL= 0
##$YL= 0
##$YMAX_a= 113700
##$YMIN_a= -163138
##$ZGOPTNS= <>
##$ZL1= 120
##$ZL2= 120
##$ZL3= 120
##$ZL4= 120
##$ABSF1= 10
##$ABSF2= 0
##$ABSG= 5
##$ABSL= 3
##$ALPHA= 0
##$AQORDER= 0
##$ASSFAC= 0
##$ASSFACI= 0
##$ASSFACX= 0
##$ASSWID= 0
##$AUNMP= <proc_1d>
##$AZFE= 0.1
##$AZFW= 0.1
##$BCFW= 1
##$BC_mod= 2
##$BYTORDP= 1
##$COROFFS= 0
##$CY= 11.3945322036743
##$DATMOD= 1
##$DC= 2
##$DFILT= <>
##$DTYPP= 0
##$F1P= 15.9154993809931
##$F2P= -4.1035820241983
##$FCOR= 0.5
##$FTSIZE= 0
##$FT_mod= 4
##$GAMMA= 1
##$GB= 0.15
##$INTBC= 1
##$INTSCL= 1
##$ISEN= 128
##$LB= 0.24
##$LEV0= 0
##$LPBIN= 0
##$MAXI= 10000
##$MC2= 0
##$MEAN= 0
##$ME_mod= 0
##$MI= 1.114404
##$NCOEF= 0
##$NC_proc= 0
##$NLEV= 6
##$NOISF1= 3.799351
##$NOISF2= 2.8
##$NSP= 1
##$NTH_PI= 0
##$NZP= 0
##$OFFSET= 15.70392
##$PC= 1
##$PHC0= -11121.06
##$PHC1= 10.00094
##$PH_mod= 1
##$PKNL= yes
##$PPARMOD= 0
##$PSCAL= 0
##$PSIGN= 0
##$REVERSE= no
##$SF= 200.130013532006
##$SI= 16384
##$SIGF1= 3
##$SIGF2= 2
##$SINO= 400
##$SIOLD= 16384
##$SREGLST= <1H.CDCl3>
##$SSB= 0
##$STSI= 0
##$STSR= 0
##$SW_p= 3612.71676300578
##$SYMM= 0
##$S_DEV= 0
##$TDeff= 0
##$TDoff= 0
##$TI= <>
##$TILT= no
##$TM1= 0
##$TM2= 0
##$TOPLEV= 0
##$USERP1= <user>
##$USERP2= <user>
##$USERP3= <user>
##$USERP4= <user>
##$USERP5= <user>
##$WDW= 1
##$XDIM= 8192
##$YMAX_p= 0
##$YMIN_p= 0
$$ End of Bruker specific parameters
$$ ---------------------------------
##NTUPLES= NMR FID
##VAR_NAME=  TIME,          FID/REAL,        FID/IMAG
##SYMBOL=    X,             R,               I
##VAR_TYPE=  INDEPENDENT,   DEPENDENT,       DEPENDENT
##VAR_FORM=  AFFN,          ASDF,            ASDF
##VAR_DIM=   8192,          8192,            8192
##UNITS=     SECONDS,       ARBITRARY UNITS, ARBITRARY UNITS
##FACTOR=    0.0002944,     1,               1
##FIRST=     0,             0,               0
##LAST=      2.4114304,     0,               0
##MIN=       0,             -163138,         0
##MAX=       2.4114304,     113700,          0
$$ Real data points
##PAGE= N=1
##DATA TABLE= (X++(R..R)), XYDATA
0@%%%%%%%%%%%%qJ6j6J6k4L2l9M7n6O4p2Q8j04J20j36J60j87K11k40K75l14L55
$$ 0 0 0 0 0 0 0 0 0 0 0 0 0 -8 8 -8 8 -16 16 -23 24 -32 32 -40 48 -56 64 -72 88 -99 112 -128 147 -167 188
34A88m00M51n06N66o31P03p83Q70r64J068j182J304j438J584j743J920k117K332
$$ 188 -212 239 -267 299 -332 371 -412 458 -506 562 -620 684 -754 830 -913 1007 -1110 1222
52A222k568K833l129L464l846M285m796N398o121P006q117R560j1514J4310j8638
$$ 1222 -1346 1487 -1642 1822 -2024 2261 -2535 2863 -3258 3748 -4369 5191 -6323 7987 -10651
67a0651K6235m3108J39023l8603k36034K76838j60016L1896J10001j41767R4406
$$ -10651 15584 -27524 111499 72896 -163138 113700 -46316 -14420 95581 -46186 48220
78D8220n6901j7997R1892q5174Q9032o7853o970P0140j36694J09392p310p3030
$$ 48220 -8681 -26678 65214 -19960 69072 1219 -5751 64389 -72305 37087 29777 -43253
90d3253J20148j17748N7341J9307j09980J49294q5787k5688R8370j13323P7392
$$ -43253 76895 -40853 16488 35795 -74185 75109 -10678 -36366 62004 -51319 26073
101B6073k6601l4541Q5837j12052P2060L052p8635J13073r5304M0565N0128j24758
$$ 26073 -528 -35069 50768 -61284 10776 13828 -64807 48266 -47038 -6473 43655 -81103
113h1103J22422n3939m4205J08020j11399O2168J1062p6214J06955p5275M851
$$ -81103 41319 -12620 -56825 51195 -60204 1964 13026 -63188 43767 -31508 -26657
124b6657N6734p3323N8668l0129l36L6874o3946P0673l5904k0909O9920q5315
$$ -26657 30077 -43246 15422 -14707 -15043 21831 -42115 28558 -7346 -28255 41665 -43650
136d3650O0591M235o8000R6239o2601J448N6502p5903N6736j7398k3407N5200
$$ -43650 16941 21176 -46824 49415 -13186 -11738 44764 -31139 25597 8199 -15208 39992
148C9992o0530L7779K250l5669N4396n0214K3198J6323m9982O0174l9449l629
$$ 39992 -20538 17241 19491 -16178 38218 -11996 11202 27525 -22457 37717 -1732 -5361
160e361M2255n8308M5330j3022k8755N2697n0873K2362J2877m0978M6388l2995
$$ -5361 36894 -21414 23916 10894 -17861 34836 -16037 6325 19202 -21776 24612 -8383
172h383M363K3867m4954M0881k0004j2459L6646m5002K9139p38k9142M2371l5743
$$ -8383 -4020 19847 -25107 15774 -4230 -16689 19957 -25045 4094 3356 -25786 16585 -19158
185a9158R013J9433l6182L4030j7281p311K6197l1236K2152m333j4820K6748k5007
$$ -19158 -10145 9288 -26894 7136 -10145 -17456 8741 -22495 -343 -4676 -19496 7252 -17755
198a7755J3700M462j9961K7937k0321M970J4396k5114K5010j0598o876K2626k4631
$$ -17755 -4055 407 -19554 8383 -11938 -6968 7428 -17686 7324 -3274 -10150 12476 -12155
211a2155J6619J604j5540K3080j7908O326R781j8173J9340j0408j894J4841j9043
$$ -12155 4464 6068 -9472 13608 -4300 2026 11807 -6366 12974 2566 672 15513 -3530
224c530J5029l695q950J7887j6692P464N100j4541J5869r878p88R334j3507J0429
$$ -3530 11499 7804 -1146 16741 49 7513 12613 -1928 13941 4063 3275 12609 -898 9531
238I531l978n172R876j1473O178Q8p898R645q965K415L108q536Q125n512j116
$$ 9531 5553 381 10257 -1216 4962 5050 -2848 6797 -2168 247 3355 -5181 2944 -2568 -3684
253c684N219q746O195k801l633O894p567L408J339n898O541m575n5L396m873M170
$$ -3684 1535 -7211 -1016 -3817 -7450 -556 -8123 -4715 -3376 -9274 -2733 -7308 -7363 -3967 -8840 -4670
269d670j233j595M093m234L188K04k546M768k980J168K498l329L437k85m18K141
$$ -4670 -5903 -7498 -3405 -7639 -4451 -4247 -6793 -2025 -5005 -3837 -1339 -4668 -1231 -1516 -1934 207
285B07j113J292K03K14J501r40J746n7m16J962p16O71M64p38J067r0N9L46l52
$$ 207 -906 386 589 803 2304 1364 3110 3053 2637 4599 3883 4554 5018 4280 5347 5257 5316 5662 5310
304E310M90l61j08j06k62o0k34Ql81p17O18j129J50p43n93n6o99m8m33j080L92
$$ 5310 5800 5439 5331 5225 4963 4903 4669 4677 4296 3579 4197 3068 3218 2475 1882 1826 1127 1079 646 -434 -42
325d2q59o98K48j287L49m60n02J23r17L51r24q3M54r51N87j86l91R46j077N01
$$ -42 -901 -1599 -1351 -2638 -2289 -2749 -3251 -3128 -4045 -3694 -4618 -4701 -4247 -5198 -4611 -4797 -5188 -4242 -5319 -4818
345d818M36o91Q92l10M23J335j387J079M39o31J763o84Q39P54n75J177N6K99J034
$$ -4818 -4382 -5073 -4181 -4491 -4068 -2733 -4120 -3041 -2602 -3233 -1470 -2154 -1315 -561 -1136 41 97 396 1430
364A430k34P36K27Q2R91k33J04Q45l73M84L08k38J86R3mL89p4q9m87R3k84j43
$$ 1430 1196 1932 2159 2241 3232 2999 3103 3948 3575 4059 4367 4129 4315 4408 4404 4793 4719 4630 4143 4236 3952 3809
386C809k10n2j53l35l78k44m54l64m8m63r93O93j014k81J00j474N58n62o73N64
$$ 3809 3599 3547 3394 3059 2681 2437 1983 1619 1571 1108 115 808 -206 -487 -387 -1861 -1303 -1865 -2538 -1974
406a974j306oM37j302J180p32p66J203j222M82Q4j042J982j459J97J187j852J834
$$ -1974 -3280 -3286 -2849 -4151 -2971 -3703 -4469 -3266 -4488 -4006 -3922 -4964 -2982 -4441 -4244 -3057 -4909 -3075
424c075j17m98J885j659R69J028q44J887j395O72J728j284J971q75J24J856j999
$$ -3075 -3192 -3690 -1805 -3464 -2495 -1467 -2311 -424 -1819 -1147 581 -703 1268 393 517 2373 374
441C74K214p51l70K564k226J860L91k018L066j902R2K009l154K716q40j349K606
$$ 374 2588 1837 1467 4031 1805 3665 4056 2038 5104 3202 3294 5303 2149 4865 4025 2676 5282
458E282l125J873J74k721L321l166N45J493l478K963k288j138L398m374J985l70
$$ 5282 2157 4030 4204 1483 4804 1638 2183 3676 198 3161 873 -265 3133 -1241 744 374
474C74k759L543l115L24J289l532L240j953p43J998l563L013j399j585L192l753
$$ 374 -2385 1158 -1957 -1633 -344 -3876 -636 -2589 -3332 -1334 -4897 -1884 -3283 -4868 -1676 -5429
490e429K271M57k944L745k972R64K448l724L790j973k56L484m263L730p36j953
$$ -5429 -3158 -2701 -5645 -1900 -4872 -3908 -1460 -5184 -1394 -3367 -3623 -139 -4402 -672 -1408 -3361
506c361M837m166K287J597l782N311k795m61M011m689M399o01k416M424l804K429
$$ -3361 1476 -2690 -403 1194 -2588 2723 -72 -533 3478 -1211 3188 2587 171 4595 791 3220
522C220R29l064L784k660P08K284l881L496j906o41L224m189K401l89k537L760
$$ 3220 4149 1085 4869 2209 2917 5201 1320 4816 2910 2269 5493 1304 3705 3316 779 4539
538D539l414P59J298l534L910l237k34K230m160L640k158j548L446m681K851m4
$$ 4539 1125 1884 3182 -352 3558 321 87 2317 -1843 1797 -361 -1909 1537 -3144 -293 -337
554c37l927M768l807M51K745m966L832j740j346L574m339K352K94k198L531l038
$$ -337 -4264 504 -3303 -2852 -107 -5073 -1241 -2981 -4327 -753 -5092 -2740 -2446 -4644 -1113 -4151
570d151P56K077l075L461j859l13K961l291L007o77j574L448k818J971R11k346
$$ -4151 -3395 -1318 -4393 -932 -2791 -3104 -143 -3434 -427 -1104 -2678 770 -2048 -77 834 -1512
586a512L394k090R19J632k940L208j054m15K870l555K850n05j594L588l402J548
$$ -1512 1882 -208 711 2343 -597 2611 1557 1142 4012 457 3307 2802 1208 4796 1394 2942
602B942J330l090L147k150n31K963l667K461m44j921K759k871J235M86k854K695
$$ 2942 4272 1182 4329 2179 1648 4611 944 3405 2961 1040 3799 928 2163 2649 -205 2490
618B490k113m2J219k895K354j199q62J621k825J575k43j370J947k364O94O19k055
$$ 2490 377 335 1554 -1341 1013 -186 -1048 573 -2252 -677 -920 -2290 -343 -2707 -2013 -1394 -3449
635c449K183j636j59J480k054J606p22n98J785j903J148K45j422K338j639P01
$$ -3449 -1266 -2902 -3061 -1581 -3635 -2029 -2751 -3349 -1564 -3467 -2319 -2074 -3496 -1158 -2797 -2096
651b096J312j929K052m77p68K298j877J350M82j240K083j390N94J523j550J570
$$ -2096 -784 -2713 -661 -1138 -1906 392 -1485 -135 347 -893 1190 -200 394 1917 367 1937
667A937o88nJ380j492J123K4m00J221j284O78N19j191J625j031M0N91j210O17
$$ 1937 1249 1244 2624 1132 2255 2279 1879 3100 1816 2494 3013 1822 3447 2416 2456 3047 1837 2454
685B454k63m46N05q71L56l37p35Q37j178K05J54r35Q25j019j55N27j109O29m41
$$ 2454 2191 1745 2250 1379 1735 1398 663 1500 322 527 681 -254 571 -448 -603 -76 -1185 -556 -997
704i97o45O30j347N58J99q52P82m99r7km33N56m31k08P67n75L48K56j71K50j84
$$ -997 -1642 -1012 -2359 -1801 -1602 -2454 -1672 -2171 -2268 -2270 -2703 -2147 -2578 -2786 -2019 -2594 -2246 -1990 -2161 -1911 -2095
725b095L91K89k40M61K06O9M40q4L89J23j80Q47l76O03J06q1M59n5J43L36l53
$$ -2095 -1704 -1415 -1655 -1194 -988 -919 -479 -563 -174 -51 -231 616 240 843 949 868 1327 1272 1415 1751 1398
746A398O12j20K66J22l17L30Q0j98k6RJ46j86k47J10j90K37m36l46J0k40P0n8
$$ 1398 2010 1890 2156 2278 1961 2291 2371 2173 2147 2156 2302 2116 1869 1979 1789 2026 1590 1244 1254 1014 1084 1026
768A026l37L9m01j98jn20J27l02k08p2k56Q5l93r1J53l28J20L1n08J55o6j17j32
$$ 1026 689 728 327 129 128 -392 -265 -567 -775 -847 -1103 -1018 -1411 -1502 -1349 -1677 -1557 -1526 -2034 -1879 -1945 -2062 -2194
791b194J48o6j05J3J38K60O8l79O25L3N2N46l09mM96k8M23J73k22M66N5K86K11
$$ -2194 -2046 -2112 -2217 -2204 -2066 -1806 -1738 -2117 -1492 -1459 -1407 -861 -1170 -1174 -678 -706 -283 -110 -332 134 189 475 686
814F86r1M30m13M45L65l6L58k90J91J33j85K58O1k12L27j27r5K44k41p1P2j47
$$ 686 595 1025 612 1057 1422 1386 1744 1454 1645 1778 1593 1851 1912 1700 2027 1900 1805 2049 1808 1737 1809 1662
836A662r1l20J63k12r9p0l82k6O5l08j16l62p1J26n86r3k36N3j56j02j7j51qJ82
$$ 1662 1571 1251 1414 1202 1103 1033 651 625 690 382 266 -96 -167 -41 -627 -720 -956 -903 -1059 -1161 -1178 -1329 -1337 -1155
860a155r64M47j09L9L3k32L36k20k22M56nJ2N1j21L63L3o4N52k02K85K25k03L78
$$ -1155 -2119 -1672 -1781 -1742 -1709 -1941 -1605 -1825 -2047 -1591 -1596 -1584 -1533 -1654 -1291 -1258 -1322 -770 -972 -687 -462 -665 -287
883b87K35m1K90j90L21K27j22M02L66j01P3K30mJ45j74K11j25K02R9k24N7j27
$$ -287 -52 -93 197 7 328 555 433 835 1201 1100 1173 1403 1399 1544 1370 1581 1456 1658 1757 1533 1590 1463
905A463P6j14K7R7k26lK6R5k94k75P2J2J84n82l35J51k28l49L18k76k81J30m58
$$ 1463 1539 1425 1452 1549 1323 1320 1346 1441 1147 872 944 956 1140 558 223 374 146 -203 115 -161 -442 -312 -770
928g70L2j92j22j16N2l13K83n15O7L14m29J73j79K0N9J17j88R1K48k75N77m25
$$ -770 -738 -930 -1052 -1168 -1116 -1429 -1146 -1661 -1594 -1280 -1709 -1536 -1715 -1695 -1636 -1519 -1707 -1616 -1368 -1643 -1066 -1491
950a491K12L49m6M21k19J57M00j22J83R7K18j16L22j36K61J45J61r1L47K09k95
$$ -1491 -1279 -930 -976 -555 -774 -617 -217 -339 -156 -59 159 43 365 229 490 635 796 705 1052 1261 966
971I66J70M39j91M0O0p1J42q2J69k63j19mJ80j00j35Kk19o4J27m54j0J6l57k9
$$ 966 1136 1575 1384 1424 1484 1413 1555 1473 1642 1379 1260 1256 1436 1336 1201 1203 984 920 1047 593 583 599 242 213
995B13K41n33J80o22M51q2p52L15j42k06K71k70k85K60m45K95l01r4J24o5K94
$$ 213 454 -79 101 -521 -70 -152 -904 -589 -731 -937 -666 -936 -1221 -961 -1406 -1111 -1412 -1506 -1382 -1447 -1153
1016a153j72M5j5M6r4KK4L97l0P5L06q5o3J20L01n3j05M66l36L54N6P2J98J20
$$ -1153 -1325 -1280 -1295 -1249 -1343 -1341 -1317 -920 -950 -875 -569 -654 -717 -597 -296 -349 -454 12 -324 30 86 158 356 476
1040D76N9M74n4N8K6k29M47m05N2N14j47j07K43l49K62j89J11J09l02KM5k2L7
$$ 476 535 1009 955 1013 1039 810 1257 852 904 1418 1271 1164 1407 1058 1320 1131 1242 1351 1049 1051 1096 1074 1111
1063A111n99J57M4j94j99j8o0Rl30n7M6j24p7k21j77j16J53l1k41p6R7j15l1o7
$$ 1111 512 669 713 519 320 302 242 251 -79 -136 -90 -214 -291 -512 -689 -805 -652 -683 -924 -1000 -903 -1018 -1049 -1116
1087a116j58j66L34n1j06Q5R8k70M55l4K9M9n2l8M30k01L68l70M18J45j12K83
$$ -1116 -1274 -1440 -1106 -1157 -1263 -1178 -1080 -1350 -895 -929 -900 -851 -903 -941 -511 -712 -344 -714 -296 -151 -263 20
1109B0O2k95N53J7o8M51n91M58K48n6R8L13n2j03j77L07j34K87k68j5Q4p2K4J07
$$ 20 82 -213 340 357 289 740 149 607 855 799 897 1210 1158 1055 878 1185 1051 1338 1070 1055 1139 1067 1091 1198
1133A198l93M6k0J47r6l13J37r2n3j26k99j27O3kl98P4O6M5l66K6j94MJ84l43
$$ 1198 805 851 831 978 882 569 706 614 561 435 136 9 72 70 -328 -254 -188 -143 -509 -483 -677 -673 -489 -832
1157h32P6k11R6j50o9J17J48j05o7j2j52K88j37L3P5J73J2K01j96L74k6m2o2J25
$$ -832 -756 -967 -871 -1021 -1090 -973 -825 -930 -997 -1009 -1161 -873 -1010 -977 -902 -729 -717 -516 -712 -338 -364 -406 -468 -343
1181c43K35mk4K09j52L98J42k57K32Q5q3M3J81O1J18K74p2k15J36M5k09N20l68
$$ -343 -108 -112 -136 73 -79 319 461 204 436 521 438 481 662 723 841 1115 1043 828 964 1009 800 1320 952
1204I52K30k95K29l87N4r0%n4k19L07Om51OK52k77l69N9m8j9k10q3O3j58J57j36
$$ 952 1182 887 1116 729 783 693 693 639 420 727 733 282 288 540 263 -106 -47 -95 -114 -324 -407 -344 -502 -345 -481
1229d81k63K33k37j07L57l11K7j3k4k95J0N0J88r3J33L9K88m42J8L93K3L44q1
$$ -481 -744 -511 -748 -855 -498 -809 -782 -795 -819 -1114 -1104 -1054 -866 -959 -826 -787 -499 -941 -923 -530 -507 -163 -244
1252b44k05L23k07J19j19J27K07Q3J14Q0r5L39J4j95J18K31l3O5J63o1l2j44M2
$$ -244 -449 -126 -333 -214 -333 -206 1 84 198 278 183 522 536 341 459 690 657 722 885 824 792 648 690
1275F90L6J64j87o3K03J16r5p2O6r2p9J58n95L70n3j87j57K1j3j57K9k66j79J40
$$ 690 726 890 703 640 843 959 864 792 858 766 687 845 250 620 567 380 223 244 231 74 103 -163 -342 -202
1299b02j37j91J43L2j17k36J30j08J32m0j49p8K10l12K05J87l84J15n3J31K12
$$ -202 -339 -530 -387 -355 -472 -708 -578 -686 -554 -594 -743 -821 -611 -923 -718 -531 -915 -800 -853 -722 -510
1320e10k01J08N1J36k0p7R9K54m2J82q2K78k02J99p9l8J38O9N3J22J99j73o1L6
$$ -510 -711 -603 -552 -416 -436 -513 -414 -160 -202 -20 -102 176 -26 173 94 56 194 263 316 438 637 464 403 439
1344D39J96j84K46J3k6P6L14l86N6k6j28J30M9l06K78l49J10J57l09j57J62p9
$$ 439 635 451 697 710 684 760 1074 688 744 718 590 720 769 463 741 392 502 659 350 193 355 276
1366B76J59j74j73n7J88k26m19K71j63j72J97L7r7k24J67j46j57J88j56j6k74
$$ 276 435 261 88 31 219 -7 -426 -155 -318 -490 -293 -256 -353 -577 -410 -556 -713 -525 -681 -697 -971
1387i71K13k26K35K77l71J67j17M8J35P3J32P2L4k63L96j90K20r7OJ42O6N8J16
$$ -971 -758 -984 -749 -472 -843 -676 -793 -745 -610 -537 -405 -333 -299 -562 -166 -356 -136 -233 -227 -85 -19 39 155
1410A55J06mJ9J1L61l51m8L76k1o0p0R6k1K10n7J02j73m5K09j23k32J53%q0j78
$$ 155 261 257 276 287 648 297 249 625 604 544 474 570 549 759 702 804 631 586 795 672 440 593 593 513 335
1435C35q8M18k02m17L13k09K81k35j53p1k03n9K25p0k9j96%j85J10J11r4q5j26
$$ 335 247 665 463 46 359 150 431 196 43 -28 -231 -290 -65 -135 -164 -360 -360 -545 -435 -324 -418 -503 -629
1458f29J83j92J1L7j48J38R2m2o8K72j52l0k6L23Q3m23M90l4k63K71k7R8P8k49
$$ -629 -446 -638 -627 -590 -738 -600 -508 -550 -618 -346 -498 -528 -554 -231 -148 -571 -81 -115 -378 -107 -134 -36 42 -207
1482b07J24N7O8O6J0L67k69J18N8p6K60k56J54QJ32j05J80k09R2J06j68R0m0j18
$$ -207 -83 -26 42 108 118 485 216 334 392 316 576 320 474 482 614 509 689 480 572 678 510 600 560 442
1506D42j38K25l98L40k74K67o1q3L7k49L18l53o0p6l5J29r7j3p7j68J57j56L5
$$ 442 304 529 131 471 197 464 403 320 357 108 426 73 13 -63 -98 31 -66 -79 -156 -324 -167 -323 -288
1529b88k67k33N23k40mN0j35j13J42k7J39k1k48J99p1O0K31Q7l14L54l12L7OL50
$$ -288 -555 -788 -265 -505 -509 -459 -594 -707 -565 -592 -453 -474 -722 -523 -594 -534 -303 -216 -530 -176 -488 -451 -445 -95
1553i5J51j92j31K89JNj21M20j55L08j61J55j30N3K11j01q1j87L10J0O0j44J24
$$ -95 56 -136 -267 22 23 28 -93 327 172 480 319 474 344 397 608 507 426 239 549 559 619 475 599
1576E99j56k3J00m4J08k31j27J24Lk54J42k28J44P6j46Lm8J5j80LN0k53P8N0k2
$$ 599 443 420 520 476 584 353 226 350 353 99 241 13 157 233 87 90 42 57 -123 -120 -70 -323 -245 -195 -217
1601b17j71j00O3J18k61K20J75l29J82J02m41L15j88k9K15r3J40j75Q7Q0M9j86
$$ -217 -388 -488 -425 -307 -568 -348 -173 -502 -320 -218 -659 -344 -532 -561 -346 -439 -299 -474 -387 -307 -258 -444
1623d44P6J49o3j3r3M89k58J99o4R7J62p0Q5k3O0k8J16L6p3j68J74R3O4n1j90
$$ -444 -368 -219 -282 -295 -388 101 -157 42 -22 75 237 167 252 229 289 261 377 413 340 172 346 439 503 452 262
1648B62J80PK29j21Q2j87n2l8L38n53Q9p9J40J26m11M3O5J62k47K08k53j7j54
$$ 262 442 449 678 557 639 452 400 362 700 147 236 157 297 423 12 55 120 282 35 243 -10 -27 -181
1671a81O2l7J17k0k29M1P9k28Q1L0j84K19m3j28K7k7P4q9J68j86L08l25N8p7K84
$$ -181 -119 -156 -39 -59 -288 -247 -168 -396 -315 -285 -469 -250 -293 -421 -394 -421 -347 -436 -268 -454 -146 -471 -413 -490 -206
1696b06J2j95N7K73o6j09J77o6R1j1J60r5K35r8J30K1m6n6K29j67J51j13q2n5
$$ -206 -194 -389 -332 -59 -125 -234 -57 -123 -32 -43 117 22 257 159 289 310 264 208 437 270 421 308 226 171
1720A71P8K17r2k55K58J5q4J43J48m19O3J4J27M3k45J6M1k96K0M49n16J06r8n2
$$ 171 249 466 374 119 377 392 308 451 599 180 243 257 384 427 182 198 239 -57 -37 412 -104 2 -96 -148
1744a48j8k9L4k16N0J37o6l7O0J17j18j93K49k58K73n1j57J72j67q6J88j23R7
$$ -148 -166 -195 -161 -377 -327 -190 -256 -293 -233 -116 -234 -427 -178 -436 -163 -214 -371 -199 -366 -452 -264 -387 -290
1767b90L9q5l1J31j84L81l2n3k31K14J2p1K80l4rlr4K18j6R7l6L1P8j49J07r0
$$ -290 -251 -336 -367 -236 -420 -39 -71 -124 -355 -141 -129 -200 80 46 37 34 -60 158 142 239 203 234 312 163 270 180
1793A80o5J68j1N8k0N5k80K50L3RL6p8j77j64L19k90Q1J10j75K66l01J55k51P2
$$ 180 115 283 272 330 310 365 85 335 368 377 413 335 158 -6 313 23 104 214 39 305 4 159 -92 -20
1817b0L6j11K67j79N9k73p2J50L0r2m0P5j99k4j89J34K48j50J40kj12L2j39J75
$$ -20 16 -95 172 -7 52 -221 -293 -143 -113 -205 -245 -170 -369 -393 -582 -448 -200 -350 -210 -212 -324 -292 -431 -256
1841b56J14O8k49J62q8J07K3J9l5K5N2k6o5K04J83k11L1J87p5k06K50m4O4r2J27
$$ -256 -142 -74 -323 -161 -249 -142 -119 -100 -135 -110 -58 -84 -149 55 238 27 58 245 170 -36 214 170 234 142 269
1866B69L5p7j89M00q6j03J22k29J55J04n8k21M1n6J1o5K21j05J9r9j04J58l66
$$ 269 304 227 38 438 352 249 371 142 297 401 343 122 163 107 118 53 274 169 188 89 -15 143 -223
1889b23R1J27l9k86K70j05q9J88K1J59m27J29j47N7n8R1p5oJ03M7K1p5J29j84
$$ -223 -132 -5 -44 -330 -60 -165 -254 -66 -45 114 -313 -184 -331 -274 -332 -241 -316 -322 -219 -172 -151 -226 -97 -281
1913b81L3J20q1N2j98J95K02k52L43k06J88op0k07J2J90k2K19r0j52J30m4o0Q9
$$ -281 -248 -128 -209 -157 -355 -160 42 -210 133 -73 115 109 39 -168 -156 34 12 231 141 -11 119 75 15 104
1937A04O5j39J56Q3N6l56L26j24k31L54K23l13o7J36jJ07k32J2j88K43k64K69
$$ 104 169 30 186 269 325 -31 295 171 -60 294 517 204 137 273 272 379 147 159 -29 214 -50 219
1959B19j89K4j19K35k65J12K6j50K0J42j87K66p6j83j53Q0NP8o2k58J85K73k35
$$ 219 30 54 -65 170 -95 17 43 -107 -87 55 -132 134 58 -125 -278 -198 -193 -115 -177 -435 -250 23 -212
1982b12m7q6K41j66n1P0K06M0l39k6K0J67mJ29o1J37j30R5j16L0l3L15j11j27
$$ -212 -259 -345 -104 -270 -321 -251 -45 -5 -344 -370 -350 -183 -187 -58 -119 18 -112 -17 -133 -103 -136 179 68 -59
2006e9K88k48N9J84m6r6P3J45l68K01n3O5J80l36K17l9M3N5o3O5pl38L69m32K85
$$ -59 229 -19 40 224 178 82 155 300 -68 133 80 145 325 -11 206 167 210 265 202 267 260 -78 291 -141 144
2031A44m3o7J31k08K1K46k39J53J0j76j2l02K83M1j39M4k36ML91k81k9J66j15
$$ 144 101 34 165 -43 -22 224 -15 138 148 -28 -40 -342 -59 -18 -157 -113 -349 -345 46 -235 -264 -98 -213
2054b13n8J32o6J1K1mM2j03K68k30J50l2m4j97K55m7O6J40k47NK43m1j34k17K13
$$ -213 -271 -139 -205 -194 -173 -177 -135 -238 30 -200 -50 -82 -126 -323 -68 -115 -49 91 -156 -151 92 51 -83 -300 -87
2079h7L32j51m3J42k91J91J40j32Pj9M2l5K29j99QQ0K0j0l34k6L54J56k00j96
$$ -87 245 94 51 193 -98 93 233 101 108 89 131 96 325 126 134 214 234 224 -110 -136 218 374 174 -22
2103b2N4j72M15l69J42K16k16K24k98P2O0j73K83Q0j83l16K09J7L6l27J88j58
$$ -22 32 -140 275 -94 48 264 48 272 -26 46 106 -67 216 296 113 -203 6 23 59 -268 -80 -238
2125b38K87n5j89Q4QM5k62K04j80N2j94N64m43K40J5k7K8j54%K07j11L3N7j11
$$ -238 49 -6 -195 -111 -103 -58 -320 -116 -296 -244 -438 126 -317 -77 -62 -89 -61 -215 -215 -8 -119 -86 -29 -140
2149a40P5L9l8J48Pk53r3L42J98j17j26L9L9j20M3J0J03J15j39j17L07k15K44
$$ -140 -65 -26 -64 84 91 -162 -255 87 285 168 42 81 120 0 43 53 156 271 132 15 322 107 351
2172C51k04n9o6L9j79K9Q3jK01n4L0J72k43r3P1q6J85l83J52J64j63J36j83J39
$$ 351 147 88 22 61 -118 -89 -6 -7 194 140 170 342 99 6 77 -9 176 -207 -55 109 -54 82 -101 38
2196C8k61K10n5q7J59j69j57K10J52j80j3M9o5j38J78J35J33j58j40K67j94J52
$$ 38 -223 -13 -68 -155 4 -165 -322 -112 40 -140 -153 -104 -169 -307 -129 6 139 -19 -159 108 -86 66
2218F6j05rl5q5J17J35N3R2l63KJ91O4r9K4K08j80K68j79l8j65L12j76k7Q1j3
$$ 66 -39 -48 -83 -168 -51 84 137 229 -134 -132 59 123 24 48 256 76 344 165 127 -38 274 98 71 152 139
2243A39p0o2J0J62L9k36J41j60K3m2j83K54Q8j57L6j32K87j13j14J17k26J81q0
$$ 139 69 7 17 179 218 -18 123 -37 -14 -56 -239 15 103 -54 -18 -150 137 24 -90 27 -199 -18 -98
2266i8Q9K3l1q4j75K40J8k01K22J80l26K20j59k0q1J3q6l4J28k04L73n1k3Kj07
$$ -98 -9 14 -17 -101 -276 -36 -18 -219 3 183 -143 77 -82 -102 -183 -170 -256 -290 -162 -366 7 -44 -67 -65 -172
2291a72M1j41M2K77p9j6J17l09K26RK7N5J33j7K11j08j25j93R6K8n3M2m2K06k23
$$ -172 -131 -272 -230 47 -32 -48 69 -240 -14 -5 22 77 210 193 404 296 171 -22 74 102 49 91 49 255 32
2316C2J13J58k71K6m9O8L6JP0J33l80QR8Pj07O0N3j85K35O6l5l41J18J47k12j20
$$ 32 145 303 32 58 9 77 113 114 184 317 -63 -55 43 50 -57 3 56 -129 106 172 137 -204 -86 61 -151 -271
2342b71K77k31P6R5k4j22j25J18K02k07O2j07K31j23K33k98L28j60k8q8L44l04
$$ -271 6 -225 -149 -54 -78 -200 -325 -207 -5 -212 -150 -257 -26 -149 84 -214 114 -46 -74 -162 182 -122
2364a22M09j68r4J0k7J0O5o6j43p6J90J23j06j44L77P3K1M0m52J68m7J26j40O7
$$ -122 287 119 25 35 8 18 83 17 -126 -202 -12 111 5 -139 238 311 332 372 -80 88 41 167 27 94
2388I4k22K21j4m7J36j48J35j5j00J72j48p3R7l6K8J49k35K30r6p3k20Q4n6K93
$$ 94 -128 93 79 32 168 20 155 140 40 212 64 -9 88 52 80 229 -6 224 128 55 -165 -81 -137 156
2412A56l47r7L84o6j71J98l09R8%K05j20n8J46j93J63n0p7N3PQL79l41N4k24j8
$$ 156 -191 -288 96 30 -141 57 -252 -154 -154 51 -69 -127 19 -174 -11 -61 -138 -85 -78 -70 309 -32 22 -202 -220
2437b20L24j26j65R4L29k01J33k82J14J50k69J57M9o3m3J16N4o9o2o0J58J04o5
$$ -220 104 -22 -187 -93 236 35 168 -114 0 150 -119 38 87 24 -19 97 151 82 20 -40 118 222 157
2460A57L2j38j65J48l2j4l9o4J59j51p7J76n9J55J59k60MkJ36j89k83K96P8m6
$$ 157 189 51 -114 34 2 -12 -51 -115 44 -107 -184 -8 -67 88 247 -13 -9 -11 125 -64 -347 -51 27 -19
2484a9J31k14k7Pm0q2l8L53j1j43N1j50L12j48k01K23l9l1j80M10q1k73J54k79
$$ -19 112 -102 -129 -122 -162 -244 -282 71 60 -83 -32 -182 130 -18 -219 4 -35 -66 -246 164 83 -190 -36 -315
2508c15M88l25J52P4P2k73K14o1L8J50M3j86j74R6J71r8j84L8K40J85j74j19J5
$$ -315 173 -152 0 74 146 -127 87 26 64 214 257 71 -103 -7 164 66 -118 -80 160 345 171 52 67
2531F7J00k08J14k16N6L2K26j13l03M87k37l8J30m7J9l6k4K84m24p3L99k27J0
$$ 67 167 -41 73 -143 -87 -55 171 58 -245 242 5 -33 97 50 69 33 9 293 -131 -204 195 -32 -22
2554b2J22j15j19K49j24j46O1K52j45k31J23j4L3j49K19k37m4Q8j24J70J61J35
$$ -22 100 -15 -134 115 -9 -155 -94 158 13 -218 -95 -109 -76 -225 -6 -243 -287 -199 -323 -153 8 143
2576A43k17m7j09P0j65K52J40l38M25k78R4Q2M9k2o5K30j23j19J98j61PJ20j75
$$ 143 -74 -121 -230 -160 -325 -73 67 -271 154 -124 -30 52 101 79 14 244 121 2 200 39 46 166 -9
2599ij5J79j99J81K11m23J10j51j19P0K61rl21M37n40L51k2j29P6L7K11p1J90
$$ -9 -24 155 -44 137 348 -75 35 -116 -235 -165 96 87 -234 203 -337 14 -8 -137 -61 -24 187 116 306
2622C06l72J86l14N18m98K5J25O7k31J49j04nm7J11J02Q6j37l18L46K34k28l28
$$ 306 -66 120 -194 324 -174 -149 -24 43 -188 -39 -143 -148 -195 -84 18 104 -33 -351 -5 229 1 -327
2644c27J97K8J02j47L2J14m6O4J01q6j94kM26l05R8r0J06m4K2M5J4j26K78j59
$$ -327 -130 -102 0 -147 -115 -1 -47 17 118 32 -162 -164 262 -43 55 -35 71 27 49 94 108 -18 260 101
2668A01j59k1J67L0q2J9p1M7O8K13k83M3O3j6l6nl6R0p1n4N5k01J52j56L41j02
$$ 101 -58 -79 88 118 36 55 -16 31 99 312 29 72 135 119 83 78 42 132 61 7 62 -139 13 -143 198 96
2694I6K7j41M0r8r4M8j2K47k55J89j76J32J77j90Q7k65J00J28k71J46R5j64J44
$$ 96 123 -18 22 -76 -170 -122 -134 113 -142 47 -129 3 180 -10 77 -188 -88 40 -231 -85 10 -154 -10
2717a0k8K12j41P6l18L20k0k89J34k00K31nJ03j49M15l07k28L72l25J75l5K55
$$ -10 -38 174 33 109 -209 111 91 -198 -64 -264 -33 -38 65 -84 331 24 -204 168 -157 18 -17 238
2739B38k52RN3J54K7k95K88j31l0J18j95L7J08j21j19J27J70P0j82J64k73J41
$$ 238 -14 -5 48 202 229 -66 222 91 61 179 -16 21 129 8 -111 16 186 256 74 238 -35 106
2761A06k26K91J72k68q7K28k60j13KJ92k21L9K11k16J71L4j07o4K66k00r3o0L61
$$ 106 -120 171 343 75 -12 216 -44 -157 -155 37 -184 -145 66 -150 21 55 -52 -116 150 -50 -143 -203 158
2784A58K0k24rL4P4k98K59k50J90J93q0J56j74Rk13J21K40m5j11k16L95k82J6
$$ 158 178 -46 -55 -21 53 -245 14 -236 -46 147 67 223 49 58 -155 -34 206 161 50 -166 229 -53 -37
2807c7o0J18k06K28j53o1N05k86n6MK31j09k2Rq6m1Q9M5j00o0J51j19k02K28%
$$ -37 -97 21 -185 43 -110 -171 334 48 -8 -4 227 118 96 105 19 -22 67 112 12 -48 103 -16 -218 10 10
2832A0J3m1N6j34K54j66q3J35M5l7R8k46J09J5j48N8o3K68k24P7j63K58j14J34
$$ 10 23 -18 38 -96 158 -8 -91 44 89 52 150 -96 13 28 -120 -62 -125 143 -81 -4 -167 91 -23 111
2856A11j30k1J09k68OJ50q4P7J02j23M4K7l13K95j02K98o4J0n7j56P8J0Ml9J69
$$ 111 -19 -40 69 -199 -193 -43 -127 -50 52 -71 -27 0 -313 -18 -120 178 114 124 67 -89 -11 -1 3 -36 133
2881A33k09J65k3n4K8j05J09j68J89j78N2p9m6L68k61Q8L02j85q8q0Q9L2j49J07
$$ 133 -76 89 66 12 40 -65 44 -124 65 -113 -61 -140 -186 182 -79 9 311 126 38 -42 47 79 -70 37
2905C7J73o7Q1j34n2K40m07K5K76j79r1L72j43l54L33q3m6J76P9m40L12j97kJ46
$$ 37 210 143 224 90 38 278 -129 -104 172 -7 -98 274 131 -223 110 27 -19 157 236 -204 108 -89 -91 55
2929E5l5j04K8l1J98k7q4r6l7l0L4K81k81J21N9q8K2j02K84j86m8N9p6QQ0J42
$$ 55 20 -84 -56 -87 111 84 0 -96 -133 -163 -129 152 -129 -8 51 -37 -15 -117 167 -19 -67 -8 -84 -76 4 146
2955A46k17P0M2o4J22r6J92j24K5n4p5J06k62J97k13L31j58J40j48l3j3J05J50
$$ 146 -71 -1 41 -23 99 3 195 71 96 42 -33 73 -189 8 -205 126 -32 108 -40 -73 -86 19 169
2978A69o9j2km9k48K26J20l4p7j41K08J53k34L5r5J92l2j55m0L7J16j09j93j3
$$ 169 100 88 86 37 -211 15 135 101 24 -117 91 244 10 45 -50 142 110 -45 -85 -48 68 -41 -234 -247
3002b47L96q0j37j61J17M3K8L03m09J09n7k1J89j63j93K48j25K60o8k7o0k15K93
$$ -247 149 69 -68 -229 -112 -69 -41 262 -147 -38 -95 -116 73 -90 -283 -35 -160 100 32 5 -55 -270 23
3025B3P5J6p6lP3q0n0J21j15n5J55J1k81J22N4J54k8K41j56j15j03J99Ol78K86
$$ 23 98 114 38 35 108 28 -22 99 -16 -71 84 95 -186 -64 -10 144 116 357 201 86 -17 182 188 -190 96
3050I6j95P6J64Q8m38J96J21L6j67j0L27m47J09K2RJ63r4k36J65J3P3M6j70K5
$$ 96 -99 -23 141 229 -209 -13 108 144 -23 -33 294 -153 -44 -22 -13 150 56 -180 -15 -2 71 117 -53 -28
3074b8k2J75k72Q5Q0k38QK19o1j45O8n5J06J30j45J18k03J85j51J95o0q5K27K0
$$ -28 -50 125 -147 -62 18 -220 -212 7 -54 -199 -131 -186 -80 50 -95 23 -180 5 -146 49 -11 -96 131 151
3098A51j54j08K12k54J19j60M88l51n2J20J3k9J22j13k2K6L48k04j2l8P0r7k92
$$ 151 -3 -111 101 -153 -34 -194 294 -57 -109 11 24 -5 117 4 -18 8 356 152 140 102 172 75 -217
3121b17M85k04N4o2j47k6K37k68L1K19J12k53J27k13L52r2j34R0l4k70L30m34
$$ -217 268 64 118 56 -91 -117 120 -148 -117 102 214 -39 88 -125 227 135 1 91 57 -213 117 -317
3143c17K59q2J42j4j67J02J09j67r2L12k66L40o9j60o8J49j85R0N7M5k06M33l46
$$ -317 -58 -140 2 -12 -179 -77 32 -135 -227 85 -181 159 90 -70 -138 11 -174 -84 -27 18 -188 245 -101
3166a01J91L3J0k01K02n1J42j36m19M75J86n04J83j36r2L17k00J14j20K37r1J1
$$ -101 90 123 133 -68 134 83 225 89 -330 145 331 -173 10 -126 -218 99 -101 13 -107 130 39 50
3188E0M2m2k07K50lJ00P3m9Q7m92J3K25R9k52J02j93K06Rk36M45l57J24j84L50
$$ 50 92 50 -157 93 90 190 263 214 301 -191 -178 47 146 -106 -4 -197 9 18 -218 227 -130 -6 -190 160
3212A60l78K37O6k20J77j77J75q3q2P2m9m7J34j34J75O1j10l7j52L71k74k2J95
$$ 160 -218 19 85 -135 42 -135 40 -43 -125 -53 -102 -149 -15 -149 26 87 -23 -60 -212 159 -115 -137 58
3235E8Nr8Q8K3k04K8l6rJ68j06P2mj46R4JJ54q0M8l4L4k4N4p2Q0J5J3j48%J38
$$ 58 63 -35 53 76 -128 -100 -136 -145 23 -83 -11 -15 -161 -67 -66 88 8 56 22 56 32 86 14 94 109 122 -26 -26 112
3264A12jJ52j96P2r2o5j76J04L30o8J35l43k9p9j48L70K5J20j09q9J11j67R0l5
$$ 112 111 263 67 139 47 -18 -194 -90 240 172 307 -36 -65 -144 -292 78 103 223 114 25 136 -31 59 24
3288B4j48rJ29o4O6j30J45Pq8m9m7J55N6j50q9O15l75k56K88l24J39L6J57k42
$$ 24 -124 -133 -4 -68 -2 -132 13 20 -68 -117 -164 -9 47 -103 -192 423 48 -208 80 -244 -105 -69 88 -154
3312a54K84k18J91j32J70k1k21J7K10p1k23L28j83oJ71j40P7r4K23j68J79k30
$$ -154 130 -88 103 -29 141 120 -101 -84 126 55 -168 160 -23 -29 142 2 79 -15 208 40 219 -11
3334a1J97j49n4P1j3m8K95l91J84Q1j47J81j72K68m99K73l8J99k92J44k19Q4M4
$$ -11 186 37 -17 54 41 -7 288 -103 81 162 15 196 24 292 -207 66 28 227 -65 79 -140 -56 -12
3357a2J23j74K03k18Nj93K36l37L26oq2J05K04k28m6Q4j76N7K48k23Rj75J50j02
$$ -12 111 -63 140 -78 -73 -266 -30 -367 -41 -47 -129 -24 180 -48 -94 -10 -186 -129 119 -104 -95 -270 -120 -222
3381b22J47qMP3j20R6N4J18R7l25m9J66P8q3M9j42M8J79k93J06K4J00k57k5K81
$$ -222 -75 -83 -79 -6 -126 -30 24 142 239 -86 -135 31 109 26 75 -67 -19 160 -133 -27 -3 97 -160 -185 96
3406I6l5J41Qp8m7n5l0j00K09k47M8q0K75k92L88J18l19n0P3o2p1j0K13n6m8O2
$$ 96 61 202 210 132 85 30 0 -100 109 -138 -90 -170 105 -187 201 319 0 -50 23 -39 -110 -120 93 37 -11 51
3432E1k9k6K73l99J39Pk59J30L1J70j29M5j9j2J72n5n2o0j38L17k83k8K7j09K21
$$ 51 22 -4 269 -130 9 16 -243 -113 -82 88 -41 4 -15 -27 145 90 38 -22 -160 157 -126 -154 -127 -236 -15
3457a5j05J01j67K42j86L4j33L17Pj25p3n9K23k89K06q2K33R5M8k58j7j38J98
$$ -15 -120 -19 -186 56 -130 -96 -229 88 95 -30 -103 -162 61 -228 -22 -104 129 224 272 14 -3 -141 57
3480E7o1j18J95nr4Q8O2L09k41k03J70j34J48n4K2j57p8n4J55J00L7j24j01Q8
$$ 57 -4 -122 73 68 -26 62 124 433 192 -11 159 25 173 119 141 -16 -94 -148 7 107 144 20 -81 7
3504GJ15KOj60J0J49J63m18K86j79kj04J10M0j75J18Q4j29N5j2j84K18p7m2r0
$$ 7 122 124 130 -30 -20 129 292 -126 160 -19 -21 -125 -15 25 -150 -32 52 -77 -22 -34 -218 0 -77 -119 -209
3529b09P1K63k40JK11O6Ml32J15J82L7k52K08j07J80j63O7j03O8j99J19k0J46
$$ -209 -138 125 -115 -114 97 163 167 -165 -50 132 169 -83 125 18 198 35 102 -1 67 -132 -13 -33 113
3552A13j62Q5kNj38J01J00k30L8L2J7N0J59m3j1M4l59J13j08M83k75j28k1j77
$$ 113 -49 36 34 39 -99 2 102 -128 -90 -58 -41 9 168 125 114 158 -201 -88 -196 287 12 -116 -137 -314
3576c14K25K0P8j25J90n1p3j19qJ06J1k16M36k69K96k97NO3L7R1k33n8K92j95
$$ -314 -89 -69 9 -116 74 23 -50 -169 -177 -71 -60 -276 160 -109 187 -110 -105 -42 -5 86 -147 -205 87 -108
3600a08J37l10L65k47J36o9J01k8k43L67k32M0jk0K94j99K50k20j07L08j07m3
$$ -108 29 -281 84 -163 -27 -96 5 -23 -266 101 -131 -91 -92 -112 182 -17 233 13 -94 214 107 64
3622F4m5K11j63l20L35J57j46K71l43L8K8l2l8L9J48k04J25l28K41n2M5n6J07
$$ 64 19 230 67 -253 82 239 93 364 21 59 87 55 17 56 204 0 125 -203 38 -14 31 -25 82
3645H2p6r7r6K05R7j39j39j2N2K99l24O7L6n8L8j30P1J30o3j25J08p4j26J63L50
$$ 82 6 -91 -187 18 115 -24 -163 -175 -123 176 -148 -81 -45 -103 -65 -195 -124 6 -57 -182 -74 -148 -274 -111 239
3670B39k15q9O6j04K10j0m01L3J51m1O5l8J80j54j0Q7j5J43J09k42LR8N9k23N3
$$ 239 24 -65 1 -103 107 97 -304 -271 -120 -161 -96 -134 46 -108 -118 -31 -46 97 206 -36 -33 65 124 -99 -46
3695d6J47k39J35j27J04O0j19J93O6J08m52M63n04K0K97k6Q1l09J86J9j14J50
$$ -46 101 -138 -3 -130 -26 34 -85 108 174 282 -170 293 -211 -191 106 80 161 -148 38 57 -57 93
3717I3K21m00J15l64L65j11L3J24J5n8j28p2R4J45l27L18k38J98j87J39P9j00
$$ 93 314 -86 29 -335 30 -81 -48 76 91 33 -95 -167 -73 72 -255 63 -175 23 -164 -25 54 -46
3739d6o5K8J73K3j22J09k65K37k17J15r4J26p5P5QJ38q8O3O6j98p9o1nO4J18J97
$$ -46 -111 -83 90 113 -9 100 -165 72 -145 -30 -124 2 -73 2 10 148 60 123 189 -9 -88 -149 -154 -90 28 225
3765B25j94K7r7m9O5J53j27l3K35l26l9J90J15K05k32K1m1j87K35j58K43k40J21
$$ 225 31 58 -39 -88 -23 130 3 -30 205 -121 -160 30 145 350 118 139 98 -89 146 -12 231 -9 112
3788A12pn0m5J58nj23O2J04j99L21k44l99N76m17M1j12L15j48rR1k48J55l8K43
$$ 112 105 55 10 168 163 40 102 206 7 328 84 -315 261 -156 -115 -227 88 -60 -69 22 -226 -71 -109 134
3812A34Qq9j40LK57l50K73j37j0j10K94k59R6q8L67k62K1J43j34J3j53RQ3J21
$$ 134 142 53 -87 -84 173 -177 96 -41 -51 -161 133 -126 -30 -118 249 -13 8 151 17 30 -123 -114 -31 90
3836I0M4l00K25j7K36l09P1r4K1k5J95K30m58J02j00R9j69J02J12k31K74K15n07
$$ 90 134 -166 59 42 278 -31 40 -54 -33 -58 137 367 -91 11 -89 10 -159 -57 55 -176 98 313 -194
3859a94L81j65l8j24P9MO0q7Q0K26k85Q6L1l5J0j5P9j69j08K75j20P9k97K09j48
$$ -194 187 22 -16 -140 -61 -57 3 -84 -4 222 -63 23 54 19 29 14 93 -76 -184 91 -29 50 -247 -38 -186
3884a86K1o0J44J09p6j56L12k33Q4N5k34J48j27r8L35k34O8J48PKk9R1k61L02
$$ -186 -165 -225 -81 28 -48 -204 108 -125 -41 14 -220 -72 -199 -297 38 -196 -128 20 27 29 0 91 -170 132
3908A32p4N8j38j16K37k21r3K13M6j2j3r2L33l96M54l32n4J06j32P9K7J62p8j19
$$ 132 58 116 -22 -138 99 -122 -215 -2 44 32 19 -73 260 -136 318 -14 -68 38 -94 -15 12 174 96 -23
3932b3J26m0l3j45j5R7p2J46J69M3k23j92K40M4o4JK1l34K82j85j49J70l8J81
$$ -23 103 63 30 -115 -130 -33 -105 41 210 253 30 -162 78 122 58 59 80 -254 28 -157 -306 -136 -174 7
3956Gq8M3O9j87J66N9n3m4j21Q3nR8k8o6Q3k71J42L52l80J79rO3r7J9J09j7O8
$$ 7 -81 -38 31 -156 10 69 16 -28 -149 -66 -71 27 -1 -67 16 -255 -113 239 -141 38 29 92 -5 14 123 106 174
3983A74Kj95K03k05j14J91O5n3j04l7R3K6J4k01j1J62R6k0j16j1N2K39j97K22
$$ 174 176 -19 184 -21 -135 56 121 68 -36 -73 20 46 60 -141 -152 10 106 86 -30 -41 11 250 53 275
4007B75p2k02J16J11j92J24q8j87lK06j84J01n7k4J05j57J31N8L1K07l85K52k99
$$ 275 203 1 117 228 36 160 72 -115 -118 88 -96 5 -52 -76 29 -128 3 61 92 299 -86 166 -133
4030a33J69J25k88K61j70m4l3OK21j43j7K23j91j58L1o8L17k24n7O1R8L5l5J79
$$ -133 36 161 -127 134 -36 -80 -113 -107 114 -29 -46 177 -14 -172 -141 -209 108 -116 -173 -112 -14 21 -14 165
4054A65j72k0Q3j71J48J72Rr5L1k53J62J74j06j89J80j15no4j5J96j07N1j13J14
$$ 165 -7 -27 56 -115 33 205 214 119 150 -103 59 233 127 -62 118 3 -2 -66 -81 115 8 59 -54 60
4078F0j83J81L8M8M0j65K71n2k14J64j93kJ07j0k87K76j51J93l5J66j66r0J06
$$ 60 -123 58 96 144 184 19 290 238 24 188 -5 -7 100 90 -197 79 -72 121 86 252 86 -4 102
4101A02j61J80j83J06J24k95R9j1K97k65j49R2j06J54P6N1j00m8M2j41Q9J3P9
$$ 102 -59 121 -62 44 168 -127 -28 -39 258 -7 -156 -64 -170 -16 60 111 11 -37 5 -136 -47 -34 45
4124D5q8O3J12j48j48K80n0R0m8k12J34O0j24K24o4rO9k75J63n1n4Q4j8J38r2
$$ 45 -43 20 132 -16 -164 116 66 156 108 -104 30 90 -34 190 126 117 186 -89 74 23 -31 53 35 173 81
4149H1K32l24m1O8J13M8j14P8j49Q1kK5k23K62j15K34j72o4L7j9K4l3P1o5k60
$$ 81 313 -11 -52 16 129 177 63 141 -8 73 71 96 -127 135 20 254 82 18 55 36 60 27 98 33 -227
4174b27L02j34k0K65k00j09J13M7j84P4N1M7j88K03j83j34J25j17J80N9qp4j06
$$ -227 75 -59 -79 186 -14 -123 -10 37 -147 -73 -22 25 -163 40 -143 -277 -152 -269 -89 -30 -38 -112 -218
4197b18J12L06k16j9J02q7J49l4j90K3KM7j78L24j1j73K26k64L82r8j24p9N3K
$$ -218 -106 200 -16 -35 67 -20 129 95 -95 -72 -70 -23 -201 123 112 -61 165 -99 283 185 61 -18 35 37
4221C7K4k9j22R4J7R2K1p9oO6j32K16m1j68M9Q5j36J56N0k20k5R1m5m0j41L23
$$ 37 61 32 -90 4 21 113 134 55 49 115 -17 199 158 -10 39 124 -12 144 194 -26 -51 40 -5 -45 -186 137
4247A37m44K08%oQ5j2M1j89K91l09L20N2j52jm3l3J08o9K36m98n0L25m8p2K72
$$ 137 -307 -99 -99 -105 -20 -32 9 -180 111 -198 122 174 22 21 -22 -55 53 -16 220 -278 -328 -3 -51 -123 149
4272A49j93J93j45J7M9J74l05o0J7j23L14j07J59k05l2mJ05r3PJ29P3j29J73k33
$$ 149 -44 149 4 21 70 244 -61 -121 -104 -227 87 -20 139 -66 -98 -102 3 -90 -83 46 119 -10 163 -70
4296g0r5J77l1J26M5j08K9Q7j27P8j45k3N7R1M3l8n6j52J98m6k22K18J10j64j90
$$ -70 -165 12 -19 107 152 44 73 160 33 111 -34 -57 0 91 134 96 40 -112 86 40 -182 36 146 -18 -208
4321b08K03l76K38J73j16j5J5K7l7K81k80K53k30n9j27J57J09j65Q7l4K91k55
$$ -208 -5 -381 -143 30 -86 -101 -86 -59 -96 185 -95 158 -72 -131 -258 -101 8 -157 -70 -104 187 -68
4343f8k36J71J10N4K2k04jJ50K79j45k35R9qm5J58l4j0j14K88l0j62pK25o5l28
$$ -68 -304 -133 -23 31 53 -151 -152 -2 277 132 -103 -4 -12 -57 101 67 57 -57 231 201 39 32 257 192 -136
4368a36K1K49k53J52Q7k77L73k80K63k10P6j30Q6J59k60K73P0k51L08m5m07J60
$$ -136 -115 134 -119 33 120 -157 216 -64 199 -11 65 -65 21 180 -80 193 263 12 320 275 -132 28
4390B8k1j55J14j0J93j18p2mN5n7J53j02m27M14k64J57Q9j01K74j49l7Q0n5j20
$$ 28 7 -148 -34 -44 149 31 -41 -45 10 -47 106 4 -423 -9 -273 -116 -27 -128 146 -3 -40 40 -15 -135
4414a35K9J55n6Kl12K37m0J20K0J5J77k86J61J9k11m9L26j62k5J07k72O3K15j60
$$ -135 -106 49 -7 -5 -317 -80 -120 0 20 35 212 -74 87 106 -105 -154 172 10 -15 92 -180 -117 98 -62
4438f2J00n7J37j09K4K87j96j76L67j18j08J9P6r1N1p6j3O5k52J42L9N1M6j64
$$ -62 38 -19 118 9 33 320 124 -52 315 197 89 108 184 93 144 68 55 120 -132 10 49 100 146 -18
4462a8k06J88j29J34O8m3k6p2m5K4mK17j55J70k39%K06K9L3j93J57j48j81L61
$$ -18 -224 -36 -165 -31 37 -6 -32 -104 -149 -125 -129 88 -67 103 -136 -136 70 99 132 -61 96 -52 -233 128
4486A28l04J24K03l48K01n3K4j73K52M0k67M18k51M1k1J9J38l78K17j3j5o2K16
$$ 128 -176 -52 151 -197 4 -49 -25 -198 54 94 -173 245 -6 35 14 33 171 -207 10 -3 -18 -80 136
4509A36o5N1j61NJ79j71J98j74j48N52k80l7j20l6P2j22K40K0j12j14J29N1O3
$$ 136 71 122 -39 -34 145 -26 172 -2 -150 402 122 85 -35 -71 1 -121 119 139 27 -87 42 93 156
4532A56j08M9k98M08k78J32J55j19j61J58%J04j31Q1j37K7m0N5l33J95Q7J47l02
$$ 156 48 97 -201 207 -71 61 216 97 -64 94 94 198 67 148 11 38 -2 53 -280 -85 2 149 -153
4555a53L3L75m66M4q1K56r4Q8J17m74L48k19K82k25l4L83l45k5l6j71L37n7j73
$$ -153 -120 255 -211 -167 -248 8 -86 2 119 -355 -7 -226 56 -169 -203 180 -165 -190 -226 -397 -60 -117 -290
4578b90K71M3R8l1J67m83L08l49K11J37j78O2J29k34K02k7L8l8j22N2l11L77J97
$$ -290 -19 24 122 91 258 -225 83 -266 -55 82 -96 -34 95 -139 63 36 74 36 -86 -34 -345 32 229
4601B29j49m0j10j98L36r8k27L40j13K10q3k52K95j84J85p6N8p4k34Q5J42k3j31
$$ 229 80 40 -70 -268 68 -30 -257 83 -30 180 97 -155 140 -44 141 65 123 49 -185 -100 42 19 -112
4624a12K7K6pJ79k05K12k34n1K58k02RJ16O8j47N7Lq9N6q6K7j2o7J91Q9K8k34
$$ -112 -85 -59 -66 113 -92 120 -114 -165 93 -109 -100 16 84 -63 -6 -3 -92 -36 -122 -95 -107 -174 17 106 134 -100
4650a00K37J0n3O3o7j1j20o3J63j93J36J07J18j0l59J39j13J73j7R6k12oP7k35
$$ -100 137 147 94 157 90 79 -41 -104 59 -134 2 109 227 217 -142 -3 -116 57 40 136 -76 -82 -5 -240
4674b40K99J60l13J09k4P2k69K36j00o3p3J97o1N3j34K21M1j72j18L12j84J54
$$ -240 59 219 -94 15 -9 63 -206 30 -70 -133 -206 -9 -70 -17 -151 70 111 -61 -179 133 -51 103
4696A03M3k24J8O4p8P4m7Kj35L04j68J6j19Q0k06P2L81j64k31K06j08N7J96j21
$$ 103 146 -78 -60 4 -74 0 -47 -45 -180 124 -44 -28 -147 -67 -273 -201 180 16 -215 -9 -117 -60 136 15
4720A5o5M5n6M2RQ1k48L34j24k4j11j38K27L8J63m5j28j66J92K09k03q4R3j75
$$ 15 -50 -5 -61 -19 -10 71 -177 157 33 9 -102 -240 -13 25 188 143 15 -151 41 250 47 -37 56 -119
4744a19K28k21J46K12m33K41J04j63j18K56j06K4K04m47L75j80O9L7k22L19k34
$$ -119 109 -112 34 246 -187 54 158 -5 -123 133 27 51 255 -192 183 3 72 109 -113 206 -28
4765b8r6L91m62J51k06K21J16j52R6j07J47j23K08M4l29J39r4KJ54k23K47l6l6
$$ -28 -124 267 -195 -44 -250 -29 87 -65 31 -76 71 -52 156 200 -129 10 -84 -82 72 -151 96 60 24
4788B4m7J37o5J0j6j19j10J64j9J76j06o2k46K21J82k2j43Q0J66j29O1k14J80
$$ 24 -23 114 49 59 43 -76 -186 -22 -41 135 29 -33 -279 -58 124 102 -41 39 205 76 137 -77 103
4811A03k07n0n2L25j61l4K58k32K31j42Qj24J63o6M3j87J15J02n6k0J33j44q4
$$ 103 -104 -154 -206 119 -42 -76 182 -50 181 39 47 -77 86 20 63 -124 -9 93 37 17 150 6 -78
4834g8K22q6o1j71L44M1n04L10j06O4r5R3k03M63k21m9O6k14L40j52l61M16r3
$$ -78 144 58 -3 -174 170 211 -293 17 -89 -25 -120 -27 -230 233 12 -37 29 -185 155 3 -358 58 -35
4857c5j32n7O1K43j97K44q2OM8k56J18j7j79l9L51K0l5o1m2J25Jj59p8J11LJ83
$$ -35 -167 -224 -163 80 -117 127 45 51 99 -157 -39 -56 -235 -274 77 97 62 1 -41 84 85 -74 -152 -41 -38 145
4883A45k47K21k11J69p5o5j28J50J11k26K37l5p5K16k00n9M0J82k17R9O8jk29
$$ 145 -102 119 -92 77 2 -63 -191 -41 70 -156 81 46 -29 187 -13 -72 -32 150 -67 32 100 99 -130
4906a30J51j00J45LKN0q7l8o3K00k65K44k7k43J8L47k45Q1m6l3j84K17J29j11
$$ -130 21 -79 66 69 71 121 34 -4 -67 133 -132 112 85 -158 -140 207 -38 43 -3 -36 -220 -3 126 15
4930A5j25K33j90J81j54J09J75j81q7kj5N8k21K04%l06M68p0j36RP2l0J06k85
$$ 15 -110 123 -67 114 -40 69 244 63 -24 -26 -41 17 -204 0 0 -306 162 92 -44 -35 37 7 113 -172
4954a72K11j03J66j47j03j19K87r7J19q7p4O9O2k9l6K00k0k90L22J24q9l93J88
$$ -172 39 -64 102 -45 -148 -267 20 -77 42 -45 -119 -50 12 -17 -53 147 127 -163 159 283 194 -199 -11
4977a1j09K51j02J31k02J08O0J30l00P2J5q7J52p2k7K08l42%L20j38K4j37O6L0
$$ -11 -120 131 29 160 -42 66 126 256 -44 28 43 -44 108 36 9 217 -125 -125 195 57 81 -56 10 40
5001D0k36K19j85J55j7n8l2L92j58l73K57J62l19L96l52K1p8O4n2L14j80j24L36
$$ 40 -196 23 -162 -7 -24 -82 -114 278 120 -253 4 166 -153 243 -109 -88 -166 -102 -154 160 -20 -144 192
5024A92j91j49J34j6P0J18l23K3K18j42K91l94K07K5q8N3J01m9q2l7m6j03K02
$$ 192 1 -148 -14 -30 40 158 -165 -142 76 -66 225 -169 38 63 -25 28 129 80 -2 -39 -85 -188 14
5047A4J44j53L5j40J63k19K94n6k09k8J92Q6k98J49P8o5J10o6j63J89N1j96Q9
$$ 14 158 5 40 -100 63 -156 138 82 -127 -155 37 123 -175 -26 52 -13 97 31 -132 57 108 -88 1
5070Apk62N0O9J53j04N1M7k13J98M8j90N4j74K82q9J98l02K64j76jR3l6j7j42
$$ 1 -6 -268 -218 -149 4 -100 -49 -2 -215 -17 31 -159 -105 -279 3 -86 112 -190 74 -102 -103 -10 -46 -63 -205
5095b05J96K25k31k11K17J14j66N6K06j97j28M6M42k75l05L57j71J28k34K95j28
$$ -205 -9 216 -15 -226 -9 105 -61 -5 201 4 -124 -78 364 89 -216 141 -30 98 -136 159 31
5116C1j29R8j34N5K08j77M3O2m9j29J48q8L16r7l48J37L97l11lk3k71M25k07P1
$$ 31 -98 0 -134 -79 129 -48 -5 57 8 -121 27 -61 255 158 -190 -53 344 33 30 7 -264 161 -46 25
5140B5R4o5j06l6J80q0J72O5l15Q5l07Q3N4J28K1l2rj41K31p6P4K5j01o0J40J70
$$ 25 119 54 -52 -88 92 12 184 249 -66 19 -288 -205 -151 -23 -2 -34 -43 -184 47 -29 45 70 -31 -91 49 219
5166B19l23J72j11lMJ19n7j3j43R2j48J42M5M2k8J07j49o3K51l7M2l44P8K07O8
$$ 219 -104 68 -43 -46 -42 77 20 7 -136 -44 -192 -50 -5 37 9 116 -33 -96 155 118 160 -184 -106 101 169
5191A69j56J61k05Q3k9J73q5j32l0j4M7Q0k01P0j03K55j90M18k72l6J52j47J07
$$ 169 13 174 -31 52 23 196 111 -21 -51 -65 -18 62 -139 -69 -172 83 -107 311 39 3 155 8 115
5214A15k24L06J10m37L17k89P2N4k95L97j26j12K39j07j55J61j24R1P3j64J92
$$ 115 -109 197 307 -130 187 -102 -30 24 -271 126 0 -112 127 20 -135 26 -98 -7 66 -98 94
5235I4k78K52m3N8j14j17J71J44j22k91K27j25o5K17p2r4K12J8k4j75r3J63L1
$$ 94 -184 68 25 83 -31 -148 23 167 45 -246 -19 -144 -209 8 -64 -158 54 72 48 -127 -220 -57 -26
5258b6r6n5J76J32oj74J55j39k26K49j43K30K59j26m4l03Ll4K81K5m6j47K56k31
$$ -26 -122 -177 -1 131 125 -49 106 -33 -259 -10 -153 77 336 210 166 -137 -134 -168 113 138 92 -55 201 -30
5282c0M37o01K32K8o4o1K70j31k29N4k05L02q5m5K83oK9k90J0lQ4jl0k9J22j84
$$ -30 407 -194 38 66 2 -59 211 80 -149 -95 -300 2 -83 -128 155 149 178 -112 -102 -105 -21 -22 -52 -81 41 -143
5308a43J50O8m6J64m33J87j18L05j14j86P0j0K02q4o6K70j76Oj48M7r0K64r7Q3
$$ -143 7 75 29 193 -240 -53 -171 134 20 -166 -96 -106 96 12 -54 216 40 46 -102 -55 -145 119 22 105
5332A05M4k20J03J36J03j42k72J6J73J46k38j26L37j67J27j01k16Q0L26J7j94
$$ 105 149 -71 32 168 271 129 -143 -127 46 192 -46 -172 165 -2 125 24 -192 -112 214 231 37
5353C7k23J61J05n6o2o8%j12K04K16p6j7j36K07j54r9K19N6l67R1j22J22Q7K18
$$ 37 -186 -25 80 24 -38 -106 -106 -218 -14 202 126 109 -27 180 26 -73 146 202 -165 -74 -196 -74 13 231
5377B31j26J94l50J4n1J23K6k9L4l6m0J00j62K77rl10K73k47Q0Q4j23L9J37l89
$$ 231 105 299 -51 -37 -88 35 61 32 66 30 -10 90 -72 205 196 -114 159 -88 -8 76 -47 -8 129 -260
5401b60m1K97L5K0j33K50J09k49q2K78j5k01k0k13J66j20J50O7o2m1K15p9k28
$$ -260 -301 -4 31 51 -82 168 277 28 -54 224 209 8 -12 -225 -59 -179 -29 38 -24 -65 150 71 -157
5424a57Q8K1j95L04k29k6K60k58K45p6J4ML4j76JK19o7K1rj28J82Nj0j93J40J54
$$ -157 -69 -48 -243 61 -168 -194 66 -192 53 -23 -9 -5 29 -147 -146 73 6 27 18 -110 72 77 67 -126 14 168
5450A68P5l13P5Jj9q9m9j1J99j5L2J28k89L23j64j86N2P5n8J35k01J41MM6Pj10
$$ 168 243 -70 5 6 -13 -102 -151 -162 37 22 54 182 -107 216 52 -134 -82 -7 -65 70 -131 10 14 60 67 -43
5476d3K43l04OR8j52J48J44K8j08J27J6j87M0L0n8j45L10j55k8j56P8N4Pk86M52
$$ -43 200 -104 -98 0 -152 -4 140 168 60 187 203 16 56 86 28 -117 193 38 10 -146 -68 -14 -7 -293 159
5501A59r5oJ46l02L6o2O6K14l84K02p5K58k11J62K0k74J69K3M5m7j97K0K38l86
$$ 159 64 58 204 -98 -62 -124 -58 156 -228 -26 -101 157 -54 108 128 -146 23 46 91 44 -153 -133 105 -281
5525b81p1K51J89m5J47j60o3l9K6M5J78j46k39L46K0k05Q9k7M2k32J11L4o4r0
$$ -281 -352 -101 88 43 190 30 -33 -72 -46 -1 177 31 -208 138 158 -47 42 15 57 -175 -64 -30 -94 -184
5549a84K61r3rJ76L5k32j3L16n40M00j62oq6K52J5l44K11r5r5J38oK4J54j29q7
$$ -184 77 -16 -25 151 186 -46 -59 257 -283 117 -45 -51 -137 115 130 -214 -3 -98 -193 -55 -61 -37 117 -12 -99
5574i9r7J43mK24k53P4q9k0J64J40j44m4p7J20j2k31O5m7J73j72K43j70J3K31
$$ -99 -196 -53 -57 167 -86 -12 -101 -121 43 183 39 -5 -82 38 26 -205 -140 -187 -14 -186 57 -113 -100 131
5598A31j3q5O6J05l49J28q6L01p6m20J26K37L8j88K90j04j95M6n9m3K10j1k1K04
$$ 131 118 33 99 204 -145 -17 -103 198 122 -298 -172 65 103 -85 205 101 -94 -48 -107 -150 60 49 28 232
5622B32k45p8J19p2K9K72j62k73J39m0N2Q7J37j63L1j9N7q7K4j53K34k00O5l1
$$ 232 -13 -91 28 -44 -15 257 95 -178 -39 -79 -27 60 197 34 65 46 103 16 40 -113 121 -79 -14 -45
5646d5K9J50j37n7k4J88j61o6J88k02K12m2K8J09j90L86r7j96o3L0o6J44p2j8
$$ -45 -16 134 -3 -60 -84 104 -57 -123 65 -137 75 33 61 170 -20 366 269 73 10 40 -26 118 46 28
5670B8n7r0P8J09j20k0j66K62m0Jn8J21r2L4R3j27j46K24J32j41P8J1K3j82J48
$$ 28 -29 -119 -41 68 -52 -72 -238 24 -16 -15 -73 48 -44 -10 83 -44 -190 34 166 25 103 114 137 -45 103
5695A03j13L9j18L6J17O1jk80J41R6q9n2M6r3J6J12J92l33K18j63j08K60j31O1
$$ 103 -10 29 -89 -53 64 125 124 -156 -15 81 -8 -60 -14 -107 -91 21 213 -120 98 -65 -173 87 -44 17
5719A7J72q3j67R4J05l95O4K0R9J42m9j40L6J25K2O3k81J64j31K33k74K55j33
$$ 17 189 106 -61 33 138 -257 -193 -173 -74 68 19 -121 -85 40 62 125 -156 8 -123 110 -164 91 -42
5742d2j14L06p5j22N6k60M02j0k48L10j61L4k17L13j51n8k59J10K11Op6J98k40
$$ -42 -156 150 75 -47 9 -251 151 141 -107 203 42 76 -141 172 21 -37 -296 -186 25 31 -45 153 -87
5765h7L56k33N9J7k88P2L08l05N4J16k09K88N1k51K70k27k6J40j05j39N2l9J18
$$ -87 269 36 95 112 -176 -104 204 -101 -47 69 -140 148 199 -52 218 -9 -35 105 0 -139 -87 -126 -8
5788hjj76K79J02l28K51K90o31K85j98J06L4k06J68J37j73K44%j49j22J39j96
$$ -8 -9 -185 94 196 -132 119 409 -222 63 -135 -29 5 -201 -33 104 -69 175 175 26 -96 43 -153
5810a53N76m40j46J74K4j86J93k16r6J72K10j34J51k41J94r5R2K10m55K74j69
$$ -153 423 -17 -163 11 35 -151 42 -174 -270 -98 112 -22 129 -112 82 -13 79 289 -166 108 -61
5831f1K0n1K15k18J40k32M49j88j03k2kj18J35L1n6j6R1J11J09l41Q2p6JJ78l56
$$ -61 -41 -92 123 -95 45 -187 262 74 -29 -51 -53 -171 -36 -5 -61 -77 14 125 234 -107 -25 -101 -100 78 -278
5856b78M33k61N7O1J03j94l6J81J02k56K22M2j17j30K35j79k9RN6L6n4j55J61
$$ -278 155 -106 -49 12 115 -79 -115 66 168 -88 134 176 59 -71 164 -15 -44 -35 21 57 3 -152 9
5879IJ79j55M6J11k02MJ36J56j79j23o4K21k41L77j94k55Nl6M82k69j88j58L57
$$ 9 188 33 79 190 -12 -8 128 284 105 -18 -82 139 -102 275 81 -174 -169 -205 277 8 -180 -338 19
5902A9L1j68J23N4j16R3J01o7k64J65j48J69J12l0k35K55k38R6R1k07K76j70j6
$$ 19 50 -118 5 59 -57 36 137 70 -194 -29 -177 -8 104 74 -161 94 -144 -48 43 -164 112 -58 -74
5925g4J59k05K30m01K77l0R7j23J73j40O5K7j90K39l30K82k69K67Q7j10J73j69
$$ -74 85 -120 110 -291 -14 -44 53 -70 103 -37 28 55 -135 104 -226 56 -213 54 141 31 204 35
5947C5k03k7J00J00j64K99j85O5P1k89K8J3Q3Q4k14K24Mj89j6P1J31j67m4L38
$$ 35 -168 -195 -95 5 -159 140 -45 20 91 -198 -170 -157 -74 10 -204 20 24 -165 -181 -110 21 -146 -190 148
5971A48k00L18l75K01j14J73j38K49l71J71o5K5j26O3J82k57K79j5J8k51J12j50
$$ 148 -52 266 -109 92 -22 151 13 262 -109 62 -3 22 -104 -41 141 -116 163 148 166 -85 27 -123
5993a23L16l04j01O3j7L07k24J8PM4j51J30J11J13j11j17j0j5K82n63N36k16q2
$$ -123 193 -111 -212 -149 -166 141 -83 -65 -58 -14 -165 -35 76 189 78 -39 -49 -64 218 -345 191 -25 -107
6016a07K01j58j02K74j34J07Rl35M65l50K52n4o5jJ82k18k30M47k00k54M22jp5
$$ -107 94 -64 -166 108 -26 81 90 -245 220 -130 122 68 3 2 184 -34 -264 183 -17 -271 151 150 75
6039G5j30j70K51oj0J54l5l06K28j94J75L11m23K8p3K03k30K8k9K79k32J10N4
$$ 75 -55 -225 26 20 10 164 129 -177 51 -143 32 343 -80 -52 -125 78 -152 -124 -153 126 -106 4 58
6062E8l9r8R1R3j44j6K3J00mj6j67j26L96j37j4j59J56K78k41m44M11RL3o5M7
$$ 58 19 -79 12 105 -39 -55 -32 68 64 48 -119 -245 151 14 0 -159 -3 275 34 -410 1 10 43 -22 25
6087B5o1R0j22J35Q9p4J49k50J04R%l09L06j85J91N1j36n2L76k96n2j1q5K0L3
$$ 25 -36 54 -68 67 156 82 231 -19 85 94 94 -215 91 -94 97 148 12 -40 336 40 -12 -23 -108 -88 -55
6112e5J42j43l8K49m42J63R6J63k93K04J8j65l5K5J68j00J73r9j24J66k55K53
$$ -55 87 -56 -94 155 -287 -124 -28 135 -158 46 64 -101 -136 -111 57 -43 130 31 -93 73 -182 71
6134G1k05o8J08Q9J09k00J35l3J87k63J99J54j54m4k43Q7nJ05J55m01L31j98K38
$$ 71 -134 -202 -94 -5 104 -96 39 6 193 -70 129 283 129 85 -158 -71 -76 29 184 -217 114 -84 154
6157A54j56o9N2J02m1L38l88q7q3KO0J95N2j14N6n5M9K41k35q7N9L5k47K01j40
$$ 154 -2 -71 -19 83 42 380 -8 -95 -178 -176 -116 79 131 17 73 18 67 308 73 -14 45 80 -167 34 -106
6182a06L43l18l0K53k10KJ25l1r8J83Kk89J42O6J18j46O0k03K9m2J22K81n05K42
$$ -106 237 -81 -111 142 -68 -66 59 28 -70 113 115 -174 -32 34 152 6 66 -137 -108 -150 -28 253 -252 -10
6206a0q7k1K32K8p2r4k8o4J5M2o4J27k7p7M9l5J90Ko4j78l1Q3j4P9k22J41K53
$$ -10 -97 -118 114 142 70 -24 -52 -116 -101 -59 -123 4 -23 -100 -51 -86 104 106 42 -136 -167 -84 -98 -19 -241 -100 153
6233A53k57J37J02p4q0p7m0K88Kr8k43K97m0m4Q4j23K99m53J36l0J76j70pM4l
$$ 153 -104 33 135 61 -19 -96 -136 152 154 56 -187 110 70 26 110 -13 286 -167 -31 -61 115 -55 -62 -18 -21
6258b1J16L8k04o2N7M5M7Q4J3k47K3K40j79m2L7m3J21O7Q0k89J48Jp0k01L21j13
$$ -21 95 133 -71 -133 -76 -31 16 100 113 -134 -111 129 -50 -92 -55 -98 23 90 170 -119 29 30 -40 -241 80 -33
6284c3NJ66m4k53K2K72j82J11J56l04J57p4l8J00n1L2J18j72k78M79j85J26j08
$$ -33 -28 138 94 -159 -137 135 -47 64 220 -84 73 -1 -39 61 10 42 160 -12 -290 189 4 130 22
6307B2j15K20l92K74J03n3N4l82N04m19L3J81Q1j41nJ88j23J29L3N8l31K89j11
$$ 22 -93 127 -265 9 112 59 113 -269 235 -184 -151 30 111 -30 -35 153 30 159 192 250 -81 208 97
6330I7J24k55J56j51L5j37R4j62J15K07J7l02L6N5n0k60L49j09J05K7o9o2L3J79
$$ 97 221 -34 122 -29 6 -131 -37 -199 -84 123 140 -162 -126 -71 -121 -381 -32 -141 -36 -9 -78 -140 -107 72
6354G2j99J95M1K3j41R2j79J94J13k43j99K73j3p7J14nj27p3J84K61l22J67m5
$$ 72 -127 68 109 132 -9 83 -96 98 211 -32 -231 42 29 -48 66 61 -66 -139 45 306 -16 151 106
6377A06j82K39j32m9j49L28j94J5J24l31L67k33l4M00k97J4j7K33k40j13J57k6
$$ 106 -76 163 31 -18 -167 161 -33 -18 106 -225 142 -91 -125 275 -22 -8 -25 208 -32 -145 12 -14
6399a4Q3j75K25k38L04m01K12K5q6R4L7ml53K92J41j90k28L69K19k59J46k63Q9
$$ -14 69 -106 119 -119 185 -216 -4 21 -65 29 66 62 -291 1 142 -48 -276 93 312 53 199 -64 25
6422B5j27J66n6l9j00K84k17j87K10kK27k06JJ38j44K05k34K02j30P9k11L3J50
$$ 25 -102 64 8 -31 -131 153 -64 -251 -41 -43 184 -22 -21 117 -27 178 -56 146 16 95 -116 -83 67
6445F7k05J73lk23J89J0J20j93O8n1l0L8K33k91K46j91L4l27J52J21n5K03k00
$$ 67 -138 35 32 -191 -2 8 128 -65 3 -48 -78 -40 193 -98 148 -43 -9 -336 -184 -63 -118 85 -115
6468a15K0R4K92l36Q5k86N37l64K1K27j27o9j5P3k07J58J04N4j73K00j89j92R0
$$ -115 -95 -1 291 -45 40 -246 291 -73 -52 175 48 -21 -36 37 -170 -12 92 146 -27 173 -16 -208 -118
6491a18M5J44J3k84J56J62j17K1p0L1m1l7P9q6J94k19N1Q0j03M06l61q5K74J5
$$ -118 -73 71 84 -200 -44 118 1 22 -48 -17 -58 -95 -16 -102 92 -127 -76 4 -99 307 -54 -139 135 150
6515A50M0k06K16l77K93k1Jl07J93m9J17r7R7j21JN4L1k7k88M31nN9k30J60l30
$$ 150 190 -16 200 -177 116 95 96 -211 -18 -67 50 -47 50 -71 -70 -16 15 -12 -300 131 126 185 -45 115 -215
6540b15L59p6j95J12k13O3K27n0j08J32k48J01J64q9j74K00o2k1K25l3rj62J68
$$ -215 144 68 -127 -15 -228 -165 62 12 -96 36 -212 -111 53 -36 -210 -10 -72 -93 132 99 90 -72 96
6563I6P4r8j56J01l7k5K78l70K14O4k39j4J30j2J07l66L25J83j07k47J58j71J5
$$ 96 170 72 -84 17 -20 -45 233 -137 77 141 -98 -112 18 6 113 -253 72 255 148 -99 59 -112 -97
6586i7J03k01J98l22M06O6j38k9O0J04O9m25K74j96K60m8j79J58j74K26k22m2
$$ -97 6 -195 3 -319 87 153 15 -14 46 150 219 -206 68 -128 132 84 -95 63 -111 115 -107 -149
6608a49J70M9k47K64NP4j4k40j17L30j80j56L95j14k18K3l5J68J68j39L1q6J06
$$ -149 21 70 -177 87 92 166 152 -88 -205 125 -55 -211 184 70 -148 -125 -160 8 176 37 68 -18 88
6631H8j62p3J24J35k00K86k0J95m57N5p0J45Q9k85J07J07J36q9k72L07j64P6k4
$$ 88 -74 -147 -23 112 -88 198 178 373 -84 -29 -99 46 135 -150 -43 64 200 111 -161 146 -18 58 34
6654C4k03K69L3K8k01J42j96LJ72k40J34k2K51j12j66J9J01k05K6P7Q8o1J47j52
$$ 34 -169 100 133 161 -40 102 -94 -91 81 -159 -25 -47 204 92 -74 -55 46 -159 -133 -56 32 -29 118 -34
6678c4J09j38QQ1k26K48j7r5J96j76L45m71K32j22p0J29r9M6P6L8m05J69L08j95
$$ -34 75 -63 -55 26 -200 48 31 -64 132 -44 301 -170 62 -60 -130 -1 -100 -54 22 60 -345 -176 132 -63
6702f3j76K10k26J21j6J38K32r9l14J36k1K28k85J37K1O1n1j70L05j78j2K82l03
$$ -63 -239 -29 -255 -134 -150 -12 220 121 -193 -57 -78 150 -135 2 23 84 33 -137 168 -10 -22 260 -43
6725d3K23j70J6k8n7k10K64mM7j04J88k01K24m8r8l7q7J84j65J6K31k90j54L69
$$ -43 180 10 26 -2 -59 -269 -5 -9 38 -66 122 -79 145 97 -1 -38 -125 59 -106 -90 141 -149 -303 66
6749F6j49n6N0k6K70j28j13J96l40K83k58L22j50J16l9k0N5p3m7j96L59k28K49
$$ 66 -83 -139 -89 -115 155 27 -86 110 -230 53 -205 117 -33 83 44 24 79 6 -41 -237 122 -106 143
6772A43p7l04L37r5j63Q9K0j9L5q3J41o5O1l2O5l17J95P7J2J29j37op7J25r9J16
$$ 143 66 -238 99 4 -159 -70 -50 -69 -34 -117 24 -41 20 -12 53 -264 -69 8 20 149 12 6 -71 54 -45 71
6798G1J40j97j20J81J7j02k17L16l4N8j21NK62k72j16J19n5J43Rp6l0N5J98k71
$$ 71 211 14 -106 75 92 -10 -227 89 55 113 -8 -3 259 -13 -129 -10 -65 78 87 11 -19 36 234 -37
6822c7R5l3j6P2m7J1nm7J04k24J31J19N6j63j3l3k7L2M2J16r2N6j57K75l38P5
$$ -37 58 25 9 81 34 45 40 -7 97 -127 4 123 179 16 3 -30 -57 -25 17 133 41 97 -60 215 -123 -48
6848d8K11k38J51j96J04k7R9k10J87O0Nj97j1J96k2j9p9j8p8k7m7J1kJ26l7J13
$$ -48 163 -75 76 -120 -16 -43 56 -154 33 93 98 -99 -110 86 64 45 -34 -52 -130 -157 -204 -193 -195 -69 -106 7
6874Gp2L5N3J5R0j31J14l43K05J11j84K48k5k24J48K5j16J43M6l5j47J6k20K32
$$ 7 -65 -30 23 38 128 -3 111 -232 -27 84 -100 148 123 -101 47 72 -44 99 145 110 -37 -21 -241 -9
6898iM01m69P4j1M5p6q3j36L98j98R3r3J93J06l95J97rj95J00J4J37k51K18n8
$$ -9 392 -77 -3 -14 31 -45 -128 -264 134 -64 29 -64 129 235 -160 37 28 -167 -67 -53 84 -167 51 -7
6922gp8J51p5k5N9k24R2J72j97o4K18p8P2k5k35K65o0r5R9j25J86P1k2j21J56
$$ -7 -85 66 -9 -34 25 -199 -107 65 -132 -196 22 -56 16 -9 -244 21 -39 -134 -35 -160 26 97 75 -46 110
6947A10j11k19J87q2J7MJ37J18p6l7O3j73J34j18j43n5L56j31P5p1P0P2j2n6J30
$$ 110 -1 -220 -33 -115 -98 -94 43 161 85 48 111 -62 72 -46 -189 -244 112 -19 56 -15 55 127 115 59 189
6972A89l05O9j16K09j30m4L34j02j78K03jj94O6j33Q9J34j12j8Q9j2J04l22L75
$$ 189 -116 -47 -163 46 -84 -128 206 104 -74 129 128 -66 0 -133 -44 90 -22 -40 49 37 141 -181 194
6995A94l53O2L42j08m3j11K36q7J0j03j69O8j15J57J58J7m9o5J37j38j09PQ2j13
$$ 194 -159 -97 245 137 94 -17 219 132 142 39 -130 -62 -177 -20 138 155 106 41 178 40 -69 -62 20 -93
7019i3L2J2J92q4k9j12J34J01j74j89J40K02K0k48K9K8mK6M0q8K09O1k06L3p2
$$ -93 -61 -49 143 59 30 -82 52 153 -21 -210 -70 132 152 -96 -67 -39 -43 -17 23 -65 144 205 -1 32 -40
7044d0K06j02k09K40j63j74K44qL67k93pJ30m9k65M9r5k1K50p3J32L4q6k75J60
$$ -40 166 64 -145 95 -68 -242 2 -6 361 68 61 191 142 -123 -74 -169 -190 60 -13 119 153 67 -208 -48
7068d8J51K3r9m4P9J07j57k7P0q8O5m2N1M3k99L00l15K82L9N1k37J51p4j7kr8
$$ -48 103 126 27 -17 62 169 12 -15 55 -33 32 -10 41 84 -215 85 -230 52 91 142 -95 56 -18 -35 -37 -135
7094a35K15j80J40J9j12l2J94j10R8J15l71J16K5j52J82jj59J76r1o1K16j67J77
$$ -135 80 -100 40 59 -53 -85 109 -1 97 212 -159 -43 -18 -170 12 11 -148 28 -63 -124 92 -75 102
7117A02J86m2n14L95j17J18k70K51k94N03l72J63j00m8J62k02L11l81P7O0J16
$$ 102 288 246 -268 127 10 128 -142 109 -185 318 -54 109 9 -39 123 -79 232 -149 -72 -12 104
7138A04l67J78j28L85k48N1J12j93Q9Q2j17K6P2k4R8n4k3p0J41j3j9j83K51j76
$$ 104 -263 -85 -213 172 -76 -25 87 -106 -17 65 -52 -26 46 22 120 66 43 -27 114 101 82 -101 150 -26
7162b6j2P1j76L64l00J42q7J3J59q3j58l6K06j51J90k49J23Q4J4j5l58K38L3R0
$$ -26 -38 33 -143 221 -79 63 -24 -11 148 65 -93 -129 77 -74 116 -133 -10 74 88 73 -285 -47 -14 76
7186G6p8j11L25l39j22K97k63L88k27j59J35O9m0o7j39K79Jj53P6m8J54j47J72
$$ 76 -2 -113 212 -127 -249 48 -215 173 -54 -213 -78 -9 -49 -116 -255 24 25 -128 -52 -100 54 -93 79
7209G9m7L6P8n1r4o6J71j3m9j11J3K29O5n8j56n2J38p1j84J48K34K0j78j8K83
$$ 79 32 68 146 95 1 -65 106 93 44 -67 -54 175 240 182 26 -26 112 41 -143 5 239 259 81 63 346
7234C46m48K38m6N7p5m25N58k90N3n0R2J04j14j8L9j6J05k6j35l2l5J68j88L6
$$ 346 -102 136 90 147 72 -353 205 -85 -32 -82 10 114 0 -18 21 5 110 84 -51 -83 -118 50 -138 -102
7258a02J64j21J49j73K15k3M9J4k75PR0k35J71M9J47j17L6j93K21j15k1Qj47J06
$$ -102 62 -59 90 -83 132 109 158 172 -103 -96 -6 -241 -70 -21 126 9 45 -148 73 -42 -63 -55 -202 -96
7282i6k27K21OK04N0j78J11j33J29n0j05J63j43k9j58K70o5K63l21J56j88J37
$$ -96 -323 -102 -96 108 158 -20 91 -42 87 37 -68 95 -48 -77 -235 35 -30 233 -88 68 -120 17
7304A7n8K97k43p6K4O6P6k83L20l95J96J9L48k03M6j05O1n1j37K34j18K9j89J08
$$ 17 -41 256 13 -63 -39 27 103 -180 140 -255 -59 -40 308 105 151 46 107 56 -81 153 35 64 -125 -17
7328a7Q1q8q7N2J49j77O8J5k4j09K6J01j9k8q2P3N7m9L4K66k36%r7j81J25K42
$$ -17 64 -24 -111 -59 90 -87 -19 -4 -28 -137 -111 -10 -29 -57 -139 -66 -9 -58 -24 242 6 6 -91 -272 -147 95
7354I5r9K61m6k23J46m9l1q1n3P0m3Q3j19L34n15K10N2l5K0j90J64r1J36J45o5
$$ 95 -4 257 211 -12 134 85 54 -27 -80 -10 -53 30 -89 245 -270 -60 -8 -43 -23 -213 -49 -140 -4 141 76
7379G6j46p6P9J02oP2j96J60j68k6L31k20J5p9M8O1pJ11q2j61K21k01k8p6K66
$$ 76 -70 -146 -67 35 29 101 -95 65 -103 -129 202 -18 -3 -82 -34 27 20 131 49 -112 109 -92 -120 -196 70
7404G0K9l15Q3J72L2o3O7L51k63j15j37K50Qk78J30N5L4l2R9q4N8j41J83j52o4
$$ 70 99 -216 -133 39 71 8 75 426 163 48 -89 161 169 -109 21 76 110 78 177 93 151 10 193 41 -23
7429b3J19j20K3j77j10J43J83k35K27J75j16K1j50J13o7m4r6J62j57K1N4lR9m1
$$ -23 96 -24 -1 -178 -288 -145 38 -197 30 205 89 110 -40 73 6 -38 -134 28 -129 -108 -54 -57 42 1
7453AJ00k87J22J46k1j23M8J07k48N9J44j10j59K21j64LL59l70Q8J63m9j99K38
$$ 1 101 -186 -64 82 61 -62 -14 93 -155 -96 48 -62 -221 0 -164 -161 198 -172 -84 79 30 -169 69
7476F9o3P4q8N8J49m41O6K26p4J86Q9l27J09m9NJ6o4J09r2K38k44Q2J96m16K16
$$ 69 6 80 -8 50 199 -242 -176 50 -24 162 251 -76 33 -16 -11 5 -59 50 -42 196 -48 34 230 -186 30
7501C0q1J06jk0l87K53mJ28Q6j74R1r4P7p4J84J60l20P9k53J91j08K69Pk08J84
$$ 30 -51 55 54 34 -353 -100 -104 24 110 -64 27 -67 10 -64 120 280 -40 39 -214 -23 -131 138 145 -63 121
7526A21k14L5M6P5P5j95J77o1k43L7N6K1l2K23j91n4L74l05K28N5r5j52R1j5K1
$$ 121 -93 -58 -12 63 138 -57 120 59 -184 -147 -91 -70 -102 121 -70 -124 250 -55 173 228 133 -19 72 57 78
7551G8o3j39J91j85J03M9K47m30K24NJ1j65J69l0l8j1J51k53J0J24qM8k52K34
$$ 78 15 -124 67 -118 -15 34 281 -149 75 80 91 -74 95 65 27 16 167 -86 -76 48 40 88 -164 70
7575G0J20j67j04J40J19p9j32oj66M3K28L1j23J18n8j09j02M00j26k7P8k83K41
$$ 70 190 23 -81 59 178 99 -33 -39 -205 -162 66 97 -26 92 34 -75 -177 223 97 70 148 -135 106
7598A06j58J40L6p1R3k46J93j2N3k02J43j06N4J54k05K3j87J15KL7K55l99L23
$$ 106 -52 88 124 53 146 -100 93 81 134 -68 75 -31 23 177 -28 -5 -192 -77 -75 -38 217 -182 141
7621A41K3j04j96K15j2r2K4o1K38q2j48q9R9J07j94j61M41J06m35K99k17J17p2
$$ 141 164 60 -136 79 67 -25 -1 -62 176 94 -54 -143 -44 63 -131 -292 149 255 -180 119 -98 19 -53
7644e3K49k57L8n3J80k17kK0Q8O1j42K23k01P3J37m4j01J4j77K72q6J90k11J5
$$ -53 196 -61 -23 -76 104 -113 -115 -95 -7 54 -88 135 -66 7 144 100 -1 13 -164 108 22 212 1 16
7668A6l1j9L7p8K7J97k96kJ2K02o6q1j9N4J71k37K35j15J11Mq5o0m7r8J53M6j57
$$ 16 -15 -34 3 -75 -48 149 -147 -149 -137 65 -1 -82 -101 -47 124 -113 122 7 118 122 37 -23 -70 -168 -15 31 -126
7695a26R8J63l92P3L24j63m3M3J00j62J99j94M5K80j71j39K29m1p8k43J69J58
$$ -126 -28 135 -257 -184 140 -23 -66 -23 77 -85 114 -80 -35 245 74 -65 164 123 45 -198 -29 129
7717A29j25q0J96l65L32o1j47K64Jj91J32l52K3K56R7q4L8k05l0K2J52k06Q1L5
$$ 129 4 -76 120 -245 87 26 -121 143 144 -47 85 -267 -244 12 109 25 63 -142 -172 -150 2 -204 -123 -88
7741h8j8K62k00J54k14J01K53k43l5J88j02j91J45R3J72l19l6K5R8j59J11J66
$$ -88 -106 156 -44 110 -104 -3 250 7 -28 160 58 -133 12 105 277 -42 -78 -53 45 -114 -3 163
7763A63l23K50k37L94l87K07k65J15m5L80j93J04k06K40j68r3j2NJ42M0mk91J73
$$ 163 -160 90 -147 247 -140 67 -198 -83 -128 252 59 163 -43 197 29 -64 -76 -71 71 111 107 -184 -11
7786a1j47M47k42j6J6J56j33l5m8J25j4Q9k09L1O7j85R2k14J25l7J62J58n7k36
$$ -11 -158 289 47 31 47 203 70 35 -13 112 98 187 -22 9 76 -109 -17 -231 -106 -143 19 177 120 -116
7810a16K51j65j26r5K69j09K52N3j98M8Rj01L8r9o8J54j07P0j89r8M30k17J56
$$ -116 135 -30 -156 -251 18 -91 161 214 16 64 73 -28 10 -89 -157 -3 -110 -40 -229 -327 103 -114 42
7833D2m0J40k18J16p4Q7J24l60O0JJ20k8M6K5o7J35j17L2j24J44l3j16P2P4L5
$$ 42 2 142 -76 40 -34 53 177 -183 -123 -122 -2 -30 16 41 -26 109 -8 24 -100 44 11 -105 -33 41 76
7858G6k44n2J97Q4k17J18j24R2O9j3J24M1j30k24L18k9j29K59j49j7j3N6J77k29
$$ 76 -168 -220 -23 61 -156 -38 -162 -70 -1 -14 110 151 21 -203 115 86 -43 216 67 50 37 93 270 41
7882D1j38o7L70m06L53j05m13L30J05j25j4Q7L3j98P5j3Q9k63L73n9K02k70J12
$$ 41 -97 -164 206 -200 153 48 -365 -35 70 -55 -69 18 51 -147 -72 -85 4 -259 114 55 257 -13 99
7905I9J47k94j7m0J74j13QK09j33j7Q4j48P7J76p1j24P4k32K44p7O0j31M3J1n8
$$ 99 246 -48 -65 -105 69 -44 -36 173 40 23 107 -41 36 212 141 17 91 -141 103 26 86 -45 -2 9 -49
7930d9J4l60L55r4LR1P3j18L02j21l17K36O8J11j27m8n2R2J85k57p6P6jP1k23
$$ -49 -35 -395 -40 -134 -131 -40 33 -85 217 96 -221 15 83 194 67 19 -33 59 244 -13 -89 -13 -14 57 -166
7955a66Q5q4L3K5j1J93j74r8K67j47Q2K0J61k35L8k5p9J74q4K93l73QL0oK9L53
$$ -166 -81 -165 -132 -107 -118 75 -99 -197 70 -77 5 25 186 -49 -11 -36 -115 59 -25 268 -105 -97 -67 -73 -44 309
7981C09l48r0J56o0Q7J72k87J34J5l14N81k94k04R7j34O8J2J52L9j99q3P1J46
$$ 309 -39 -129 27 -33 54 226 -61 73 88 -226 355 61 -143 -46 -180 -112 -100 52 91 -108 -191 -120 26
8004B6J13q4p2p1J76k61K09j27L3j27N6O0l8L9J75j47J60p5j11Q9O8j40r4K27
$$ 26 139 55 -17 -88 88 -173 36 -91 -58 -185 -129 -69 -107 -68 107 -40 120 45 -66 23 91 -49 -143 84
8028H4j27o0K0Q4l57N24j47OP1j58J00K4K0j47J37j80l5j7j87N12o1M3k66L8K01
$$ 84 -43 -103 -83 1 -356 168 21 27 98 -60 40 64 84 -63 74 -106 -141 -158 -345 167 106 149 -117 -79 122
8053A22j25j02k5Q5Q1J16k4Q8j04r0k1l7p3K88n2j74j39K19j65K0P2L01j14k78
$$ 122 -3 -105 -130 -45 36 152 128 216 112 22 1 -36 -109 179 127 -47 -186 33 -132 -112 -40 261 147 -131
8077a31rr1L88q1K7j15K27m1o7q6L8k88L27k38j7J72q0J6J29Pr2J25J40r6l07
$$ -131 -140 -231 157 76 103 -12 215 174 107 21 59 -229 98 -140 -157 15 -65 -49 80 87 -5 120 260 164 -143
8102a43M1P1K11j56J9j19P9j83K79j52O1j63p0L57j35K39l21R8J66j78J46O2l24
$$ -143 -102 -31 180 24 43 -76 3 -180 99 -53 8 -155 -225 132 -3 236 -85 13 179 1 147 209 -115
8125a15Q5l9N0j17N6Q4k21O7J6j16L51P6k31K9nL0j10Q7K16n0k66j4K23o4O1j69
$$ -115 -30 -69 -19 -136 -80 4 -217 -150 -134 -250 101 177 -54 -25 -30 0 -110 -23 193 143 -123 -137 86 22 83 -86
8151h6Q7Nj9j75J37J79l24J97M4p5M4J94m8k64Q4p9J34k46K89j39J23j98k8r2
$$ -86 1 6 -13 -188 -51 128 -196 1 45 -30 14 208 160 -104 -20 -99 35 -211 78 -61 62 -136 -164 -256
8175b56L01j03N0K27l31K80J59m14j9J0K00l8k11L95m52K96
$$ -256 45 -58 -8 219 -112 168 327 -87 -106 -96 104 66 -145 250 -202 94
8191I4
$$ Imaginary data points
##PAGE= N=2
##DATA TABLE= (X++(I..I)), XYDATA
0@%%%%%%%%%%%%qJ6j6J6j6K4l2M0m8N6p2Q7j01J18j36J57j81K08k40K74l14L58
$$ 0 0 0 0 0 0 0 0 0 0 0 0 0 -8 8 -8 8 -8 16 -16 24 -24 32 -40 47 -54 64 -72 85 -96 112 -128 146 -168 190
34A90m05M58n17N82o52P28q12R04j005J115j236J368j513J671j841K029k235K461
$$ 190 -215 243 -274 308 -344 384 -428 476 -529 586 -650 718 -795 876 -965 1064 -1171 1290
52A290k709K985l293L636m021M458m960N537o213P018p995R212j0778J2877j5860
$$ 1290 -1419 1566 -1727 1909 -2112 2346 -2614 2923 -3290 3728 -4267 4945 -5833 7044 -8816
67h816K0525k9342P8914j47341J60161p620k03418K16754j24046N3957N1274j05257
$$ -8816 11709 -17633 61281 -86060 74101 66481 -136937 79817 -44229 9728 61002 -44255
79d4255Q6190p6077P363M8349p1904J19289j04187Q858Q1427j32050J06299k8500
$$ -44255 41935 -34142 -26779 21570 -50334 68955 -35232 -26374 55053 -76997 29302 802
91H02n2062J04552j36698Q7234J9560j13504J40475p1601p459O2406r7076R3003
$$ 802 -51260 53292 -83406 3828 23388 -90116 50359 -21242 -28701 33705 -63371 29632
103B9632n5722j2603Q8367j15777Q2202j2515n8100J15384j17107N2181N1082
$$ 29632 -26090 -38693 49674 -66103 16099 3584 -54516 60868 -56239 -4058 47024
114D7024j19737J20690n3614k7935R2027j05870P3292k660p1562R7619o4143J3618
$$ 47024 -72713 47977 -5637 -33572 58455 -47415 25877 23217 -48345 49274 -14869 -1251
126a251L0846n0112O0021n0882K1877K7090p1029P9141m6879j0805O7935r3668
$$ -1251 29595 -20517 39504 -11378 10499 37589 -33440 45701 -1178 -11983 55952 -37716
138c7716O5703K292o6291Q7216o1109O050M0554o3194N7831l0811j2779M7118
$$ -37716 27987 30279 -36012 51204 -9905 -3855 36699 -26495 31336 525 -12254 34864
150C4864n8856M1176j2421k6437N1978n6378L2191Q286m8049O0248m2805L329
$$ 34864 -23992 17184 4763 -21674 30304 -26074 6117 14403 -33646 26602 -16203 -12874
162a2874L3087n6988M9631j8396k1679M7320m9559K7213M809l2202M4238l7975
$$ -12874 20213 -36775 12856 -5540 -27219 20101 -29458 -2245 2564 -29638 14600 -23375
174b3375J3694J8847m0847M3446k4773n183L4014m4084L3368n164k4170M1464
$$ -23375 -9681 9166 -31681 11765 -13008 -18191 15823 -28261 5107 -57 -24227 17237
186A7237l4133J3350J3644l0057L4037j9398r81K1089k8814K5274q341q948K3867
$$ 17237 -16896 -3546 10098 -19959 14078 -5320 -6301 14788 -14026 11248 2907 -6041 17826
199A7826k6380J8507J78j7010K7090k3052Q708J1101k4157K5444j4012m006J9512
$$ 17826 -8554 9953 10131 -6879 20211 -2841 5867 16968 -7189 18255 4243 237 19749
212A9749k4376J7053k383j3284K0930j9130P713N163j6402J8939j3684O4J1129
$$ 19749 -4627 12426 10043 -3241 17689 -1441 6272 11435 -4967 13972 288 352 11481
225A1481j9129J5859o410p752J5553j7160Q206K128j2431J3898j0463J210O498
$$ 11481 -7648 8211 1801 -5951 9602 -7558 648 2776 -9655 4243 -6220 -5010 1488
238A488j2040J0394n801k713Q626j1009P065r93n494R089q456M075J956o461Q217
$$ 1488 -10552 -158 -5959 -8672 -46 -11055 -3990 -4983 -10477 -1388 -9844 -5769 -3813 -10274 -2057
253b057n588R37M686p219P608k634k037O754o387M494J079l954O109l947J750
$$ -2057 -7645 -6708 -2022 -9241 -1633 -4267 -6304 450 -5937 -1443 -364 -4318 1791 -2156 -406
268d06L161m169M850k150J21L738m006L847k13k292M306k989J075J830k484K238
$$ -406 2755 -1414 3436 1286 1407 5145 1139 4986 4773 2481 6787 3798 4873 6703 4219 6457
284F457p94l98J207j221J053j193K14N29j950J331r16r30P71j310Pk71q32J42
$$ 6457 5663 5265 6472 5251 6304 5111 5325 5854 3904 5235 4319 3389 4160 2850 2857 2586 1754 1896
302A896r94l58m85n71j41n97l99m17n96J99j055R1l96m60p5l87Q4l04m25P40r29
$$ 1896 902 544 59 -512 -653 -1250 -1649 -2066 -2662 -2463 -3518 -3427 -3823 -4283 -4358 -4745 -4661 -4965 -5390 -4650 -5579
323e579N66L3n26R02j76nJ97K0R00l63N90Q08k81J002k21M11J052n00J111M75
$$ -5579 -5013 -4980 -5506 -4604 -4780 -4785 -4588 -4568 -3668 -4031 -3441 -2633 -2914 -1912 -2133 -1722 -670 -1170 -59 416
343D16l08J566n67O02O94k88J029k61M22R94j048R42K54l55J081n49J15L84p93
$$ 416 108 1674 1107 1709 2403 2115 3144 2883 3305 4299 3251 4193 4447 4092 5173 4624 4739 5123 4330
362D330O05k72m80N41r08L48l15m46m0q51j07o1p20l6k08m15n83m34l60k70k84
$$ 4330 4935 4663 4183 4724 3816 4164 3849 3403 3363 2512 2405 2344 1624 1588 1380 965 382 -52 -412 -682 -966
383i66m49l97m79l45j76j88m98l25O0j31n71M65p06N68Pp11Q98m81J18P05r33
$$ -966 -1415 -1812 -2291 -2636 -2812 -3000 -3498 -3823 -3763 -3894 -4465 -4000 -4706 -4138 -4131 -4842 -3944 -4425 -4307 -3602 -4535
404d535J209q7m10J297o64Q15Q05r50J529l24J31J468j495J757L66p11J858r77
$$ -4535 -3326 -3413 -3823 -2526 -3190 -2375 -1570 -2520 -991 -1315 -1184 284 -1211 546 912 201 2059 1082
422A082N89J291j484J836n17k12K050j839J148M02j099J636j636N25P32j523J786
$$ 1082 1671 2962 1478 3314 2797 2585 4635 2796 3944 4346 3247 4883 3247 3772 4504 2981 4767
439D767j401m6Q11k220K071j177q32J715k974J553j14k483K677k849O03J118l368
$$ 4767 3366 3320 4131 1911 3982 2805 1973 3688 714 2267 2153 -330 2347 -502 101 1219 -2149
456b149K627j995p56K504l803K129p81k259L697l597J008J219l204L502k262o01
$$ -2149 478 -1517 -2273 231 -3572 -1443 -2224 -4483 -786 -4383 -3375 -2156 -5360 -1858 -4120 -4721
472d721K856l699K757l37k030L479l036J961Q73k702L655k398J090K102l457L452
$$ -4721 -1865 -5564 -2807 -3144 -5174 -1695 -4731 -2770 -1897 -4599 -944 -3342 -2252 -150 -3607 -155
488a55j008n49L413l785L034l6j871M438l574J953J380l160M535k952l8L204m073
$$ -155 -1163 -1712 1701 -2084 950 914 -957 3481 -93 1860 3240 80 4615 1663 1625 4829 756
505G56M110j514j856M078m151K740M61l841M640l282L48K734m807L754j644j646
$$ 756 4866 3352 1496 5574 1423 4163 4624 783 5423 2141 2489 5223 416 4170 2526 880
521H80L463m364J967J15k865L522l689P41J522l644L725l037o31K480l837L125
$$ 880 4343 -21 1946 2061 -804 2718 -971 -230 1292 -2352 1373 -1664 -2295 185 -3652 -527
537e27j173k206L502l619J894L80l364L904l014J041J560m103M367k087q68L776
$$ -527 -1700 -3906 -404 -4023 -2129 -1749 -5113 -1209 -4223 -3182 -1622 -5725 -1358 -3445 -4313 -537
553e37n011L704K98l071M958l875J239K726l884M385k044r03L949l815L146l76
$$ -537 -5548 -1844 -1546 -4617 341 -3534 -2295 431 -3453 932 -1112 -2015 1934 -1881 1265 889
569H89k123M165l079J904J156l117L969k005L49K175l517L174q80j164K827l328
$$ 889 -1234 2931 -148 1756 2912 -205 3764 1759 2108 4283 766 3940 3060 1896 4723 1395
585A395K271j61j884K973l124J292P74k671K934k493k63K631l968K911j427j926
$$ 1395 3666 3505 1621 4594 1470 2762 3536 865 3799 1306 1043 3674 -294 2617 1190 -736
601g36L245l624J732J20l153L508k413j54J660l743K822r00j934L103l239J271
$$ -736 2509 -1115 617 737 -2416 1092 -1321 -1475 185 -3558 -736 -1636 -3570 -467 -3706 -2435
617b435O92k215K555k311N56J436k216K101j441k02J992k104J793j66r90K304
$$ -2435 -1743 -3958 -1403 -3714 -3158 -1722 -3938 -1837 -3278 -3480 -1488 -3592 -1799 -1965 -2955 -651
633f51j891J429L84j794K756j287J95J624k045K584p01m39J826j928J925j28j300
$$ -651 -2542 -1113 -729 -2523 233 -1054 -859 765 -1280 1304 603 164 1990 62 1987 1859 559
650E59K411k020J077J176k027K129r82l49K000k135R17L07j480J571j102L09M18
$$ 559 2970 950 2027 3203 1176 3305 2323 1974 3974 1839 2756 3063 1583 3154 2052 2361 2779
667B779j525J211q42k49Q67j728J202r33n02P95j234M20k61r69J091j179j21M25
$$ 2779 1254 2465 1623 1374 2241 513 1715 782 280 1075 -159 261 0 -969 122 -1057 -1178 -753
685g53j152P33q51j37O41j176P20k43l60Q25j051O30k4m21Q86q15L80L95r56J023
$$ -753 -1905 -1172 -2023 -2160 -1519 -2695 -1975 -2218 -2578 -1753 -2804 -2174 -2198 -2619 -1733 -2548 -2168 -1773 -2729 -1706
705a706j12k46R97o89L69N69j67M85q4P0N30p3M70j40L24M05j91N45NL4M98j28
$$ -1706 -1818 -2064 -1067 -1756 -1387 -818 -985 -500 -584 -514 16 -57 413 273 597 1002 811 1356 1361 1395 1893 1765
727A765L29j39r4Q02n86l3L92m06J95q5L0J60l96L9N7k94J23l25k5j85l64J7k61
$$ 1765 2094 1955 1861 2663 2077 2044 2436 2030 2225 2140 2170 2330 1934 1973 2030 1736 1859 1534 1509 1324 960 977 716
750G16k41K8k60k01j13k46k47J63m38k64j08Jl55J80k27j27m7k50o9J61k22m9
$$ 716 475 503 243 42 -71 -317 -564 -401 -839 -1103 -1211 -1210 -1565 -1385 -1612 -1739 -1786 -2036 -2105 -1944 -2166 -2215
772b215o5J63j12K2J86J74Q3m5J52L02J3q6L45m2M45%K70J10m2L41J74j1M13P4
$$ -2215 -2280 -2117 -2229 -2207 -2021 -1847 -1764 -1809 -1657 -1355 -1342 -1428 -1083 -1125 -680 -680 -410 -300 -342 -1 173 162 575 649
796F49K66K40J1M8p6L10K7L29J46k29K61j84q6L50J04j79J20n45K52j56j38J45
$$ 649 915 1155 1166 1214 1138 1448 1475 1804 1950 1721 1982 1798 1712 2062 2166 1987 2107 1562 1814 1658 1520 1665
818A665k73K6J34n50J56m44L9Mm75k4j73j43k7n72K0j95j27j71l3R0j84n48L55
$$ 1665 1392 1418 1552 1002 1158 714 753 757 282 258 85 -58 -85 -657 -637 -832 -959 -1130 -1163 -1073 -1257 -1805 -1450
841a450m39J55J92l41j12J82m88N62j08j6L98m39M61m05M19J91j64L39j11L30
$$ -1450 -1889 -1734 -1542 -1883 -1995 -1813 -2301 -1739 -1847 -1863 -1465 -1904 -1443 -1848 -1429 -1238 -1402 -1063 -1174 -844
861h44J75r6N23k27M31K72m29L85M08J7L97l06L21K12k07M27L1k9M45n41KL07
$$ -844 -669 -765 -242 -469 -38 234 -195 190 598 615 1012 706 1027 1239 1032 1459 1490 1461 1906 1365 1367 1674
883A674q7M9K58l15M6r8J64oj71N2k68j78%p8N8j75m46q9r9l46l4l5j60Nq2l18
$$ 1674 1587 1636 1894 1579 1625 1527 1691 1685 1514 1566 1298 1120 1120 1042 1100 925 479 390 291 -55 -89 -124 -284 -279 -361 -679
909f79l09J71j80m8k55N4j04q2j56o8O6J5jJ06j10M2K05l18K6N01j64rL92l95
$$ -679 -988 -817 -997 -1045 -1300 -1246 -1350 -1432 -1588 -1656 -1590 -1575 -1576 -1470 -1580 -1538 -1333 -1651 -1625 -1124 -1288 -1297 -905 -1300
933a300M34p8N7L14P6J19J90j69M34J86K99p5M3J91K01k0R8J54J45J07l54K3M03
$$ -1300 -866 -944 -887 -573 -497 -378 -188 -357 77 263 562 487 530 721 922 902 1000 1154 1299 1406 1052 1075 1478
956A478N9K2r9j9J1J8n4O9j22r5L1j02j02K56o20J22k86L6N6m39K8l2k65o3lk78
$$ 1478 1537 1559 1460 1441 1452 1470 1416 1485 1363 1268 1299 1197 1095 1351 731 853 567 603 659 220 248 216 -49 -112 -115 -393
982c93j75L6j60l32J09m5k8k37l86M94j88j16L08m57L45l8l55K80mm4K83j14L79
$$ -393 -568 -532 -692 -1024 -915 -960 -988 -1225 -1611 -1117 -1305 -1421 -1113 -1570 -1225 -1263 -1618 -1338 -1342 -1386 -1103 -1217 -838
1005h38k85K18K50j49m1K23j05M33J69l03M91k44L55Q1r3K05L02p6L41R2n0J56
$$ -838 -1123 -905 -655 -804 -845 -622 -727 -294 -125 -428 63 -181 174 255 162 367 669 593 934 1026 976 1132
1027A132k26L11J09j84j80J70O0L02j38k29J45K6k62K33j21k29K67o11K53K7o31
$$ 1132 906 1217 1326 1142 962 1132 1192 1494 1356 1127 1272 1298 1036 1269 1148 919 1186 575 828 855 224
1048B24L46j14j23l3o28M17j98j76J28m95j5Lj85J24p6k55L34l20k21J18J1Q4
$$ 224 570 456 333 300 -328 89 -109 -285 -157 -652 -667 -664 -849 -725 -801 -1056 -722 -1042 -1263 -1145 -1134 -1050
1070a050l06o4J54q2K17l8J65k08K19M0K3K45j7N9J91k95L74k2J90j91K36L32
$$ -1050 -1356 -1420 -1266 -1348 -1131 -1169 -1004 -1212 -993 -953 -930 -685 -702 -643 -452 -747 -373 -395 -205 -396 -160 172
1092A72j16J83K17J00k81N89l32J12M77k78k6K07m4K21j93l2K80l52K85J95k35
$$ 172 56 239 456 556 275 864 532 644 1121 843 817 1024 980 1201 1008 976 1256 904 1189 1384 1149
1113A149J02j33jm4j76K45m75l5j08J14j7l69L5r2j93J05k45l62M04m33J2j10
$$ 1149 1251 1118 1117 1073 897 1142 667 632 524 638 621 252 287 195 2 107 -138 -500 -96 -529 -517 -627
1135f27j10r2n9N5ok49J89k18j8J57l93M10j89p7L90k99J33Q2J10J18Rj33L13
$$ -627 -737 -829 -888 -833 -839 -1088 -899 -1117 -1135 -978 -1371 -961 -1150 -1227 -837 -1136 -1003 -921 -811 -693 -684 -817 -504
1158e04O8k10J97O9K60j54J64K83j43L14R0j58K69j41J77K29k39L11m0J38r2m3
$$ -504 -436 -646 -449 -380 -120 -274 -110 173 30 344 434 276 545 404 581 810 571 882 842 980 888 845
1180H45J4J25K1R6k35jJ52j49L52l49n2R3k59K01l64o8K30n87J47k75K16j17o3
$$ 845 859 984 1005 1101 866 865 1017 868 1220 871 819 912 653 854 490 422 652 65 212 -63 153 36 -27
1203b7k33J0K0j98N2k6Q7l47J68k09k6J75k77J11p2k79K16p5J21k56p9L24O2L81
$$ -27 -260 -250 -230 -428 -376 -402 -315 -662 -494 -703 -729 -554 -831 -720 -792 -1071 -855 -930 -809 -1065 -1144 -820 -758 -377
1227c77k79j79K19k7JqK47K6M3O2J99K8K1J73K8j88K34O4K2p2O53q0m8R8j25J25
$$ -377 -656 -835 -616 -643 -642 -650 -403 -377 -334 -272 -73 -45 -24 149 177 -11 223 287 309 237 890 810 762 860 735 860
1253H60j39K02j74l7L8k3K06o7J59j82k04J29k42K65j12k27j1p0j5j86j9Q8r9
$$ 860 721 923 749 712 750 727 933 866 1025 843 639 768 526 791 679 452 441 371 356 170 151 239 140
1276A40k05K8n3j91j79J22j65p1P2m6k6q0J55p2q7l43L55j30p2m6j22K75J53j68
$$ 140 -65 -37 -90 -281 -460 -338 -503 -574 -502 -548 -574 -654 -499 -571 -658 -1001 -646 -776 -848 -894 -1016 -741 -588 -756
1300g56n4J99K34k14J59j46QK22o2J18J60k49K46M2M5KJ95J10M5k07K69K20J0
$$ -756 -810 -611 -377 -591 -432 -578 -570 -348 -410 -292 -132 -381 -135 -93 -48 -46 149 259 304 97 366 586 596
1323E96k7o1K03J20l32q6M50l68L53l09K92j06j75J61Jj65J29j66k9J90l1l47
$$ 596 569 508 711 831 499 413 863 495 848 539 831 725 550 711 712 547 676 510 481 671 640 293
1345B93N3J29l88J14M0n7j83m6N3k20o6L8j3l6m36M0K8P3q6O1r9j97J81N1KK4
$$ 293 346 475 87 201 241 184 1 -45 8 -212 -278 -240 -253 -289 -725 -685 -657 -584 -670 -609 -708 -905 -724 -673 -671 -647
1371f47k33L11J83l71qJ30Q5q3K53k01J69K23n5rJ25j17p0K67L60j32j40K29m6
$$ -647 -880 -569 -386 -757 -765 -635 -550 -633 -380 -581 -412 -189 -244 -253 -128 -245 -315 -48 312 180 40 269 223
1394B23P8l2k0K58k83J57J75nJ6L60o2l70J83j8k05J84j0Q4l8k05K48k50L10l85
$$ 223 301 269 249 507 224 381 556 551 567 927 865 495 678 660 455 639 629 713 675 470 718 468 778 393
1418C93J71K6l09p8j7o3R9l14m8J08J3n4j24p0L1k10J6J94l86L04j4k24l3pK5
$$ 393 564 590 281 203 186 123 222 -92 -140 -32 -19 -73 -197 -267 -236 -446 -430 -236 -622 -318 -332 -556 -589 -596 -571
1443e71j41J40m0L9K3j15K73k77K57k00K02r7L69l08Q7K0K0K29N1K05J15j77J75
$$ -571 -712 -572 -612 -573 -550 -665 -392 -669 -412 -612 -410 -507 -138 -446 -359 -339 -319 -90 -39 166 281 104 279
1466B79K8j52Q1J31j24K22o7L8j44J88J7j6R6p5J78k46J69k70K53M5j89K41j28
$$ 279 307 155 236 367 243 465 398 436 292 480 497 481 577 502 680 434 603 333 586 631 442 683 555
1489E55j76j68L74l83J00k02L69l60q7J28k00J82Q8k96r4j84J51N5j09j79J49
$$ 555 379 211 585 202 302 100 469 109 22 150 -50 132 220 -76 -170 -354 -203 -148 -257 -436 -287
1510b87k08K5o5j98K86m2Ok65M63l67r1J32M0J40j01K14j58J33rk25L00j57L18
$$ -287 -495 -470 -535 -733 -447 -489 -483 -748 -285 -652 -743 -611 -571 -431 -532 -318 -476 -343 -352 -577 -277 -434 -116
1533a16k92L32K0j65J88J01j12j9K84J94k04N3J46j28K30K7p7L2K3q5R2j15L36
$$ -116 -408 -76 -56 -221 -33 68 -44 -63 221 415 211 264 410 282 512 539 462 494 517 432 524 409 745
1556G45l78J1L6O5j20L37l19J17O4j26O4j74j99O4j5k8m90K48J33N0k41qJ58J7
$$ 745 367 378 414 479 359 696 377 494 558 432 496 322 123 187 172 144 -346 -98 35 85 -156 -164 -6 11
1580A1k52M6j42j84L27k83r0M9j47M40l05k5J28p6J39k43J80m2j11K76P6j67K49
$$ 11 -241 -195 -337 -521 -194 -477 -567 -518 -665 -225 -530 -555 -427 -503 -364 -607 -427 -469 -580 -304 -228 -395 -146
1603a46q9j4k6Q0o6J05n8Q2J74p2J65J09j17J9P9j82J78J08j70J46M4J1j15M5
$$ -146 -235 -249 -275 -195 -261 -156 -214 -132 42 -30 135 244 127 146 225 43 221 329 159 305 349 360 245 290
1627B90J58RLJ72j59m1O2j34Nk66K79k04P5J20j10j39qJ04Jn0k13J07Q1j34j59
$$ 290 448 457 460 632 473 432 494 360 365 99 378 174 249 369 259 120 112 216 217 167 -46 61 142 8 -151
1652a51j3K78l42J30K1k78l7J71r9pL6k18L18j74j30Q8R7k9q4K87j04k0P3k85
$$ -151 -164 114 -228 -98 -77 -355 -392 -221 -320 -327 -291 -509 -191 -365 -495 -407 -310 -339 -423 -136 -240 -260 -187 -472
1676d72L22l46K72k3j45J47R2l0J43q2K3L29l9j06R9lJ91k72L0N5J46j5o2J38
$$ -472 -150 -496 -224 -247 -392 -245 -153 -183 -40 -122 -99 230 191 85 184 181 372 100 130 185 331 316 254 392
1700C92r7p2J72j13R0Lj03N2J38k33K4Q3J26j39Nq3N7k05J50Qj86L19n07J70l4
$$ 392 295 223 395 282 372 375 272 324 462 229 253 336 462 323 328 245 302 97 247 255 69 388 -119 51 17
1725A7k61J30m3q2k50K89m4Nl09L81j73O0p3l4l9j06N9J05J9J62Q4p6k75L6R6
$$ 17 -244 -114 -157 -239 -489 -200 -244 -239 -548 -167 -340 -280 -353 -387 -426 -532 -473 -368 -349 -187 -103 -179 -454 -418 -322
1750c22j25J26Q7r7K75j13l2m2K37k45J44K45j36K50k18L1j60M42j88n9J83J15
$$ -322 -447 -321 -234 -331 -56 -169 -201 -243 -6 -251 -107 138 2 252 34 65 -95 347 159 100 283 398
1772C98n7j49J03l01M74j65K01l45QN1J03j85J5M80k06n7k66R0M8J6J0j63j49
$$ 398 341 192 295 -6 468 303 504 159 167 218 321 136 151 631 425 368 102 192 240 256 266 103 -46
1795d6J38l7Rp6j63K55j71O0j35j05k79K60P0j30J81o3R6J9L9k68R8L3O0j71j03
$$ -46 92 55 64 -12 -175 80 -91 -31 -166 -271 -550 -290 -220 -350 -169 -232 -136 -117 -78 -346 -248 -215 -155 -326 -429
1820d29L43j34pR9MJ65j94P0o6K60k30m2J52J51j00Q6J04j12j03K86k31r0K55
$$ -429 -86 -220 -227 -128 -124 41 -153 -83 -149 111 -119 -161 -9 142 42 128 232 120 17 303 72 -18 237
1843B37j7j52J76J9p8K23j5k19J60O6j25K8j27J58k62L75k28o3O1K7n9l6J08l6
$$ 237 220 68 244 263 185 408 393 174 334 400 275 303 176 334 72 447 219 156 217 244 185 149 257 221
1867B21J23k63N4o3j30l0J53j22J22k68J16j48m9OL39m02J92j84n8J37kJ59j76
$$ 221 344 81 135 72 -58 -88 65 -57 65 -203 -87 -235 -284 -278 61 -341 -149 -333 -391 -254 -256 -97 -273
1890b73q3j0M77l38J41p8n3L4q6j6J24l2mp6J42j89M09k68J67K8l01M05jK5k1
$$ -273 -356 -366 111 -227 -86 -164 -217 -183 -269 -285 -161 -193 -197 -273 -131 -320 89 -179 -12 16 -285 120 119 144 123
1915A23o8k7KK26j28R7j3j29p9K69j8J97k69K28k72L06l79K2K41j55j76L09j1
$$ 123 55 28 30 256 128 225 212 83 4 273 255 452 183 411 139 445 66 88 329 174 -2 307 296
1938B96Lk09j2j69K29k66j12L80k14N6j09K31l98K37K4Q6Mj91k18N5R2Q3j91J80
$$ 296 299 90 78 -91 138 -128 -240 140 -74 -18 -127 104 -294 -57 -33 53 57 -134 -352 -297 -205 -122 -313 -133
1962a33N2j34J16J4m25N10m08K06k38J19K88l47L02L4R3j62j8R2Q2j40R8J45r6
$$ -133 -81 -215 -99 -85 -510 0 -408 -202 -440 -321 -33 -380 -78 -44 49 -113 -131 -39 43 -97 1 146 50
1985E0J5K8j06K06m71L53j5l5j9K69j03l5J30j98P6j04K62j07r9J76k50M69k37
$$ 50 65 93 -13 193 -278 75 60 25 6 275 172 137 267 69 145 41 303 196 97 273 23 492 255
2008B55j37l9k70L40r7j7J48O8k47j7j57J64%k32L65o9k51K98l32k04L19q4K35
$$ 255 118 79 -191 149 52 35 183 251 4 -13 -170 -6 -6 -238 127 58 -193 105 -227 -431 -112 -196 39
2031C9q2n5j12k11J64o4N2K37n9o0o5q7J52J42j86l1L5L84l99K36q5n4K00k29
$$ 39 -43 -98 -210 -421 -257 -321 -269 -32 -91 -151 -216 -303 -151 -9 -195 -226 -191 193 -206 30 -55 -109 91 -138
2055a38Q5j6M70m63J65J22q0j4J20k90K05j02k1J72M8l83L73k08K68j46j91K37
$$ -138 -53 -69 401 -62 103 225 145 131 251 -39 166 64 43 215 263 -120 253 45 313 167 -24 213
2077B13Q8o0j85Q2P4n3j4p3Np7J21P4j19Q4j20kM7M9k84l7M16j54j84K43n4J5
$$ 213 301 241 56 138 212 159 145 72 77 0 121 195 76 160 40 38 85 134 -150 -187 229 75 -109 134 80 95
2103I5o9o8p9M8j95%J59j05P9J41q9j08J13j6j83M6j59L84k37M9J8N7K80l32J60
$$ 95 26 -42 -121 -73 -268 -268 -109 -214 -135 6 -83 -191 -78 -94 -277 -231 -390 -6 -243 -194 -176 -119 161 -171 -11
2128a1K41Ol75R1J0N1r3j23L75j96MQR4r9R4j10q3R7J86O6j10n8m0O3j15J9J13
$$ -11 230 236 -139 -48 -38 13 -80 -203 172 -24 -20 -12 82 -17 77 -33 -116 -19 167 233 123 65 25 88 -27 -8 105
2155A05R2k51R2K4p8J94k39J80l8o2j74J8K97p3k2j18O2j03J09n1j93l1k3K07
$$ 105 197 -54 38 62 -16 178 -61 119 81 19 -155 -137 160 87 65 -53 9 -94 15 -36 -229 -260 -283 -76
2179g6mk20L22j86j28L61j05K00k64J28k81J48q9J16l3K0M6L9k06K69j28N2k38
$$ -76 -80 -300 22 -164 -292 69 -36 164 -100 28 -253 -105 -194 -78 -111 -91 -45 -6 -212 57 -71 -19 -257
2202b57M7J13J49m1Q8j17K44j73j9J92j72O1N9J92j56j28o3J01J66J7j7p6k03
$$ -257 -210 -97 52 11 99 -18 226 53 34 226 54 115 174 366 210 82 19 120 286 303 286 210 7
2225GP3O0J24k96J18j13K67j08k9k08J18j33J61O4K4j99J73k27J29P0q4j68L2
$$ 7 80 140 264 -32 86 -27 240 132 103 -105 13 -120 41 105 129 -70 103 -124 5 75 -9 -177 -145
2248a45Q0L9r0OpM1J01m09K35O9n5J86l77K2K49p5J82o6N1j63K40p2O5j76p6K0
$$ -145 -65 -26 -116 -110 -117 -76 25 -384 -149 -80 -135 51 -326 -304 -55 -130 52 -14 37 -126 114 42 107 -69 -145 -125
2274a25P7j5J67j34m9J76J6k56K50l2k73K61O2jj21j84N59l33M2O6j43L09n43
$$ -125 -48 -63 104 -30 -79 97 113 -143 107 75 -198 63 125 124 3 -181 378 45 87 153 10 319 -224
2297b24J94J81j03r7N8K64k00l8M4K8o2J3p7P4J3j07L5J74j53P1l44K21l15K96
$$ -224 -30 151 48 -49 9 273 73 35 79 107 45 58 -19 55 68 -39 -4 170 17 88 -256 -35 -350 -54
2321e4J77j67j51K05J1j47m5P8j21J00j95L44Nr1P0M5k8j25r5J07Q6j48J28J02
$$ -54 123 -44 -195 10 21 -126 -171 -93 -214 -114 -309 35 40 -51 19 64 36 -89 -184 -77 9 -139 -11 91
2345I1j91j74M83j12k32K35j67j57K22L4K2k70L04L4O8l02J98k33O8n7J63J11
$$ 91 -100 -274 209 97 -135 100 -67 -224 -2 32 54 -216 88 122 190 -112 86 -147 -79 -136 27 138
2367A38j39O9O8J47j81M6j77K39j82%Q1j62J03K4J54l16J76j64K08k24J9M0O3
$$ 138 -1 68 136 283 102 148 -29 210 28 28 109 -53 50 74 228 -88 88 -76 132 -92 -73 -33 30
2390C0j10J24k14O7J73M7l18L51L4m94L02J5J69k54l8o6L40j98J0j66Q9k48L30
$$ 30 -80 44 -170 -103 70 117 -201 150 184 -310 -8 7 176 -78 -116 -182 158 -40 -30 -196 -107 -355 -25
2413b5J5k51J90L12j87l3n4K07r7pj40O6O9j31L25j01k27J27j57L87j14j24Q0
$$ -25 -10 -261 -71 241 54 21 -33 174 77 70 -70 -4 65 -66 259 158 -69 58 -99 288 174 50 130
2436A30l4j02L12m34R9K8P8l3J09M0o1j52K47p9j39p4M6N4J2JJ23j84j9Q9L8o2
$$ 130 96 -6 306 -128 -29 -1 77 44 153 193 132 -20 227 148 9 -65 -19 35 47 48 171 -13 -32 57 95 33
2462C3l4J58j56J63k27J48l60M71k71o9J7L85j72j20OO0n4j9m2J64k4k12l6K39
$$ 33 -1 157 1 164 -63 85 -275 196 -75 -144 -127 258 86 -34 -28 32 -22 -41 -83 81 57 -155 -191 48
2486D8j6j10J01j49K22o7%lp9m4R5J19o1n7R9J0p9p5L25k60K2q2J22N8l07K07
$$ 48 32 -78 23 -126 96 29 29 26 -53 -97 -2 117 56 -1 98 108 29 -46 279 19 41 -41 81 139 -168 39
2512C9K82l55nJ38o6j40K26o2l6J9J90k17j81R0Q1k4R4j18J10O1N5k78K61k67
$$ 39 321 -34 -39 99 33 -107 119 57 21 40 230 13 -168 -78 3 -21 73 -45 65 126 181 -97 164 -103
2536a03K6o3K12j09j76K99J79k17N7j88j2K32j77O8P7j69K23k16j19mK79J13n41
$$ -103 -77 -140 72 -37 -213 86 265 48 105 -83 -95 137 -40 28 105 -64 159 -57 -176 -180 99 212 -329
2559c29K82j58K58j74Ol5o9K06J35j68Q4J68m21q5L55J0L9Q0j49P7J3Pj14n5k
$$ -329 -47 -205 53 -121 -115 -150 -219 -13 122 -46 38 206 -215 -300 55 65 104 184 35 112 125 132 18 -37 -39
2584c9M5K2K14k03Rk74M31j82km9l0J36j80J77k88K85j0k22J75j84kJ97j07j1
$$ -39 6 28 242 39 48 -226 205 23 21 -28 -58 78 -102 75 -213 72 62 -160 15 -169 -171 26 -81 -92
2608i2j91L11m0q5n0J57J40l84J04J02K75r9l05K63k60J43Jq8j9J18l5k2j50r1
$$ -92 -283 28 -12 -97 -147 10 150 -234 -130 -28 247 148 -157 106 -154 -11 -10 -98 -117 1 -34 -56 -206 -297
2632b97O10k91j01J48k80L52k36R9K6Q8n3j01k4j42L28j22q4O4J75j33R7j00J96
$$ -297 313 22 -79 69 -211 141 -95 4 30 118 65 -36 -60 -202 126 4 -80 -16 159 26 123 23 219
2655B19j75j47J24j32l9J4K81j00L5qj97Q0Q3J81l75J71k05J67m9q1P2j44J79
$$ 219 44 -103 21 -111 -150 -136 145 45 80 72 -125 -45 38 219 -156 15 -190 -23 -72 -153 -81 -225 -46
2678d6J24j67J59j28J97k08J12j45O5J7J43p8j79J64j35J05j2K8Jk52J16J28k07
$$ -46 78 -89 70 -58 139 -69 43 -102 -37 -20 123 45 -134 30 -105 0 -12 16 17 -235 -119 9 -198
2701a98K76j19K8K2p9j23J54n5k38J83J08J7J16k78J72J80j32l1Q0k72J85k29
$$ -198 78 -41 -13 9 -70 -193 -39 -94 -332 -149 -41 -24 92 -186 -14 166 34 3 83 -189 -4 -233
2723b33L16r4q3L26k27K29j22j49J55n2K8k01L12j69l5ln4M6n3%j9J54j00L05
$$ -233 83 -11 -94 232 5 234 112 -37 118 66 94 -107 205 36 1 -2 -56 -10 -63 -63 -82 72 -28 277
2747B77k53N8J23j11J8r5o4Q6k0j04N3q1K45j74r9oJ64k79M90l83n1L78j70j77
$$ 277 24 82 205 94 112 17 -47 39 19 -85 -32 -113 132 -42 -141 -147 17 -262 228 -155 -206 172 2 -175
2771a75J05M1J4Q2j9lQ8l47K07N1j34k8p1L37n7J13k34R4j01K63k28k3J00J2j75
$$ -175 -70 -29 -15 67 48 45 133 -214 -7 44 -90 -118 -189 148 91 204 -30 64 -37 226 -2 -25 75 87 -88
2796h8j01K23q9J72j93Q2L1M6j60J12M4l9Q8k44K51k98O9J4J46p8J35K6k39M5
$$ -88 -189 34 -55 117 -76 6 37 83 -77 35 79 40 128 -116 135 -163 -94 -80 66 -12 123 149 -90 -45
2820d5Q1r3KN0J99k84k6J11j19j49J15L08j05k62K07j01K63j00j63L6O7Pm4q7
$$ -45 36 -57 -55 -5 194 -90 -116 -5 -124 -273 -158 150 45 -217 -10 -111 152 52 -111 -75 -8 -1 -45 -132
2844a32Q3L6j2qk13N38j48k43J11J61j14m9N4k04j22M90k55J5M4K03n5j37j6m7
$$ -132 -49 -13 -25 -33 -246 292 144 -99 12 173 59 10 64 -140 -262 228 -27 -12 32 235 180 43 27 -20
2868b0j39K03j39N4l6K2L23k83p9J59o7q1K03J59l01k18K61P6o9J00O0l5k02j16
$$ -20 -159 44 -95 -41 -77 -55 268 -15 -94 65 -2 -83 120 279 -22 -240 21 97 28 128 188 153 -49 -165
2892a65J72J3k0j35J47m6k00K46Kq7O7JK6j42P4J13J9j38M6j9PM7j7k43R1j3M8
$$ -165 7 20 0 -135 12 -34 -234 12 14 -73 -6 -5 21 -121 -47 66 85 -53 -7 -26 -19 28 11 -232 -141 -154 -106
2919a06J56J01l76J96kM1k53L37m5k08J89O0k18l7L54k95K82l55L3Q3o7L20m9
$$ -106 50 151 -225 -29 -31 10 -243 94 49 -159 30 90 -128 -165 189 -106 176 -179 -146 -63 -130 190 141
2942A41J62k18j67J40j43j55J78k6l8K46l4j34M7L67m55J61J21j31j59l1L04J17
$$ 141 303 85 -82 58 -85 -240 -62 -88 -126 120 86 -48 -1 366 -89 72 193 62 -97 -128 176 293
2964B93k71l3P7M0n6R3p4j09j55J98J7k87M83M9m68K98j75r7J3J36J01q5p9L5
$$ 293 22 -11 66 106 50 143 69 -40 -195 3 20 -267 216 265 -203 95 -80 -177 -164 -28 73 -12 -91 -56
2988e6R6j08j15n6J70M7O5l3m4k18K04p5PK05j31K4k8r3O1O4J14p1L4j32O9K3
$$ -56 40 -68 -183 -239 -69 -22 43 10 -34 -252 -48 -123 -116 89 -42 -18 -46 -139 -78 -14 100 29 63 -69 0 23
3014B3m9J39l9R3j01q9L6R3J07j91QJ28j2m3q4k2j65J91J92p0j45r9J57l80N07
$$ 23 -26 113 74 167 66 -23 13 106 213 22 30 158 146 103 19 -3 -168 23 215 145 0 -99 58 -322 185
3039A85k14o9J40r3K06k26P0p5Q5K6k11L74r7k72J19RP4m6P0p1K2j12N4j61Q7
$$ 185 -29 -98 42 -51 155 -71 -1 -76 9 35 -176 198 101 -171 -52 -43 31 -15 55 -16 6 -106 -52 -213 -126
3064a26K34j85j14K09M7j80J55K90l82J55k49J07Q2k9J54j98K44j86j56mJ59j68
$$ -126 108 -77 -191 18 65 -115 40 330 -52 103 -146 -39 43 14 168 -30 214 28 -128 -132 27 -141
3086a41K8J35J34k33K21j77rQ3L1j47L31K7m85Q0K69k48L46P5l42K46k39J37m6
$$ -141 -113 22 156 -77 144 -33 -42 41 72 -75 256 283 -202 -122 147 -101 245 320 -22 224 -15 122 76
3109G6k9J5M1j09J6J61j95J18j13J78r2j82J8J4M61l10o5k1j46L25r6k79K82j10
$$ 76 47 62 103 -6 10 171 -24 94 -19 159 67 -115 -97 -83 378 68 3 -18 -164 161 65 -214 68 -42
3133d2L5J12j90J78j99l4K34o1r1J5L2J78q4N3l06K28n3P2N1j55r4K45j53j64
$$ -42 -7 105 -85 93 -106 -140 94 33 -58 -43 -11 167 83 136 -170 58 5 77 128 -27 -121 124 -29 -193
3157a93K25M9j44j38R8K30o2j62K35K18k32p3j63J56j16R2P0Pl5J42J4m9k5j00
$$ -193 32 81 -63 -201 -103 127 65 -97 138 356 124 51 -112 44 -72 20 90 97 62 204 218 169 144 44
3181D4K18l27J98J61j83k78L58k9k07q3N6P6L1k31K73qk21m8J75k03K85l1l3j00
$$ 44 262 -65 133 294 111 -167 191 162 -45 -128 -72 4 35 -196 77 69 -152 -200 -25 -228 57 26 -7 -107
3205a07L78k26j30K9Q0km7k5q0j5j4K59l7j6l06L51l70K59j1J16jj55j90J40K32
$$ -107 271 45 -85 -56 24 22 -25 -50 -130 -145 -159 100 63 47 -259 92 -278 -19 -30 86 85 -70 -260 -120 112
3230A12m1j70Q7M1o2J97j66k63N18j93Mj58JL42l49k4rK59j22l6O7K08k59M2J02
$$ 112 71 -99 -12 29 -33 164 -2 -265 253 60 64 -94 -93 249 -100 -124 -133 126 4 -32 35 243 -16 26 128
3255A28j08j65K13o9J75k9n29N69k31j31L6M1J06j9qj65K39j95K03j63J59p1r5
$$ 128 20 -145 68 -1 174 145 -384 185 -46 -177 -141 -100 6 -13 -21 -186 53 -142 61 -102 57 -14 -109
3278a09K97l99Q8l9K30j82O2q9J70k31M3Q5QJ30L4n2J93j06l1j54j17K09j38J78
$$ -109 188 -211 -123 -162 68 -114 -52 -141 29 -202 -159 -74 -66 64 98 46 239 133 102 -52 -169 40 -98 80
3302H0oJ4l21K00P5J18k28O9N3l8K87m06j9J31J2R2j80m4P5L2k00J39J19J50j55
$$ 80 74 88 -233 -33 42 160 -68 1 54 16 303 -103 -122 9 21 113 -67 -111 -36 -4 -204 -65 54 204 49
3327D9N4L21k80r2qL2j99K23J9j51J06q2J92m6j87j10L9k08J97K38l14K90j92
$$ 49 103 424 144 52 44 76 -123 100 119 -32 74 -8 184 138 -49 -159 -120 -328 -131 107 -207 83 -109
3350a09J10o4k77R5p6L46k04J25M7j0R6k35J71p2o3j44J52m1L3P2Q7mR7j53O6
$$ -109 1 -63 -340 -245 -321 25 -179 -54 -7 -17 79 -156 15 -57 -120 -264 -112 -153 -120 -48 39 35 132 -21 45
3375D5R3l1k03K20j1j0K5J70m03J45o7M3J6j57J02K91l73J02J04J64j14J4j60
$$ 45 138 107 -96 124 113 103 128 298 -105 40 -27 16 32 -125 -23 268 -105 -3 101 265 151 165 5
3398ER6l2J17j71O7r0pl08M00j2J0l5Q2q4r9J36q9K25k64JjP9j44J49J7j35q3
$$ 5 101 69 186 15 82 -8 -15 -323 77 65 75 40 122 38 -61 75 -14 211 -53 -52 -53 26 -118 31 48 -87 -170
3425a70L4p7K35Rp5N1j2j77J30L2Q7j08j95j2J24K26j12j46K07o0J85j13j07p5
$$ -170 -136 -213 22 31 -44 7 -5 -182 -52 -20 67 -41 -236 -248 -124 102 -10 -156 51 -9 176 63 -44 -119
3449a19k19L00J06n9J0J44o5j80P0P6j2J48p1j44K5j3Q1j09J82k53M3m1M18l77
$$ -119 -338 -38 68 9 19 163 98 -82 -12 64 52 200 129 -15 10 -3 78 -31 151 -102 -59 -100 318 -59
3473e9l2J45j7k3L7K12l84K63m1j3r6o0K9N1j13j3K80k82K37m9j07j36J00K8j44
$$ -59 -91 54 37 14 51 263 -121 142 101 88 -8 -68 -39 12 -101 -114 166 -116 121 72 -35 -171 -71 -43 -187
3498a87M11k88m1j22K94j57j21K37m0p6K02j70j51K75j27q5o4L62j06J23k24K55
$$ -187 224 -64 -105 -227 67 -90 -211 26 -14 -90 112 -58 -209 66 -61 -146 -210 152 46 169 -55 200
3520B00k33J46m1k65K53L6k94M43r4j86J20m0J11j04P3qj74K78k02J2N0q7O0q4
$$ 200 -33 113 72 -193 60 96 -198 245 151 -35 85 45 156 52 125 117 -57 221 19 31 81 -6 54 -30
3544c0l1n9K51k00K34q3j01J4J51m5j32k9k05M42j81J12k16j75K44M9q9j56L75
$$ -30 -61 -120 131 -69 165 82 -19 -5 146 101 -31 -60 -265 177 -4 108 -108 -283 -39 10 -79 -235 140
3567A40k25P8n0k7m7P3k01K56N5N3j82k37M67Rk89O5J22q3J32k34K0j18K36k0
$$ 140 -85 -7 -57 -84 -131 -58 -259 -3 52 105 -77 -314 153 162 -127 -62 60 -23 109 -125 -105 -223 13 -7
3591gj20K05jk56K21k1j47K79k28j29N46k99J19L1k30r9M02j66K7k35K42nk51
$$ -7 -127 78 77 -179 42 21 -126 153 -75 -204 342 43 162 193 -37 -136 266 100 127 -108 134 129 -122
3614a22L47j6j74J40m8K5o8j06J30j17K77k98k01K81Q6j38N7L4j14J35k04K61
$$ -122 225 209 35 175 127 152 84 -22 108 -9 268 -30 -231 50 136 -2 55 89 -25 110 -94 167
3636A67l05J05R0l38L56k17P9j2N3j35O8J5J6J20j82J09j09P0j13K42k88K47J15
$$ 167 -138 -33 57 -281 75 -142 -63 -75 -22 -157 -89 -74 -58 62 -120 -11 -120 -50 -163 79 -209 38 153
3659A53m70L83k9j82M16k58p1M7o2o4R0J40j93K19k03O2j4j32P2K2J18J33K15
$$ 153 -317 66 37 -145 271 13 -58 -11 -73 -137 -47 93 -100 119 -84 -22 -36 -168 -96 -74 44 177 392
3682C92l77J94j90J4Q9j6J20N8k68r9N2R7mQ3j73J92O8k03J8K85n1k80l1J28j6
$$ 392 15 209 19 33 122 106 226 284 16 -83 -31 66 62 145 -28 164 232 29 47 332 281 1 -30 98 82
3707H2j77J27O8j35l2n3J4k00J27K7J03j1KR5N2j30K0p5J00l2J94l48L51l40P0
$$ 82 -95 32 100 -35 -67 -120 -106 -306 -179 -152 -49 -60 -58 37 89 -41 -21 -96 4 -28 166 -182 169 -171 -101
3732a01NJ41j90L0P8j64J35k43J78L5OJ03J21j00R7m4K1K30k66j55J30r6J5R0
$$ -101 -96 45 -145 -115 -37 -201 -66 -309 -131 -96 -90 13 134 34 131 87 108 338 72 -83 47 -49 -34 56
3756E6J51J06l79JQ0J21m3p5K82l7m23L48k20J04o9r2O3J66K0j65J7J28J6j3k25
$$ 56 207 313 -66 -65 15 136 93 18 300 263 -160 188 -32 72 3 -89 -26 140 160 -5 12 140 156 143 -82
3781h2O5p0K99p3m3j82K41j60k15L91k96J02p3k13L32k75J40p9p7J45K84l71J96
$$ -82 -17 -87 212 139 96 -86 155 -5 -220 171 -125 -23 -96 -309 23 -252 -112 -191 -268 -123 161 -210 -14
3804a4l0oJ28l13J40J54J21l97L05P9j05j45jk62K57J41j32K29P1r6k3m2k84L01
$$ -14 -44 -50 78 -235 -95 59 180 -217 88 167 62 -83 -84 -346 -89 52 -80 149 220 124 101 59 -225 76
3828G6k20K29L4j37J5J78%%r5j62m1L27M7j36l6N9p1P9n3r2J69n0k86J22j0k3
$$ 76 -144 85 119 -18 -3 175 175 175 80 -82 -123 204 251 115 79 138 67 146 93 1 170 120 -166 -44 -54 -77
3854g7J07r8l4J30j58P1J79k1j15Q3P8l79J23J12k7k67L78Kj40J63j52J18j63
$$ -77 30 -68 -102 28 -130 -59 120 99 -16 67 145 -234 -111 1 -26 -293 85 87 -53 110 -42 76 -87
3877h7R7o6oJ68l98O4L75J7k16J31k8m21K13J62p5q2j08L53j01K68j67j01N2j03
$$ -87 10 -56 -62 106 -292 -228 147 164 -52 79 51 -370 -157 5 -70 -152 -260 93 -8 260 93 -8 44 -59
3901e9Q6LJ8n9Q7J16l58K01J01j27L02j76j11j4K40Qj58p4K29j77k3K29k18J27
$$ -59 27 30 48 -11 76 192 -166 35 136 9 311 135 24 10 250 258 100 26 255 78 55 284 66 193
3925A93j54j17J43j44J06P5j62lL9k27J47J80j7j54J16L8K8o2j64P2N4J7J22k01
$$ 193 39 -78 65 -79 27 102 -60 -63 -24 -251 -104 76 59 -95 21 59 87 25 -139 -67 -13 4 126 -75
3949g5R8j32N4r2K48j56j03M2pJ10J29J66k67j36Q3K83j73k10K46k6m6K14J3j23
$$ -75 23 -109 -55 -147 101 -55 -158 -116 -123 -13 116 282 15 -121 -38 245 72 -138 108 82 36 250 263 140
3973A40n1J16j19m3O8j61j3J28lJ00j76J40j00NN9O4l5j93Q9J0M5Q7Rj38P2k5
$$ 140 89 205 86 43 111 -50 -63 65 62 162 -14 126 26 31 90 154 119 -74 15 25 70 157 166 28 100 75
3999G5m7J7k0j62K89%k79m3K75r2q6K10l05J28Q9j4k16K1J34pj08R6j6j51K14
$$ 75 28 45 25 -137 152 152 -127 -170 105 13 -73 137 -168 -40 49 35 -181 -160 -26 -33 -141 -45 -61 -212 2
4024Br1J16m0l77M21kn4J3q8k1K51m00M02J94m19L08k94P8j80K34K5J09n5J33
$$ 2 -89 27 -13 -390 31 29 -25 -12 -100 -121 130 -270 132 326 -93 215 -79 -1 -181 53 78 187 132 265
4048B65k06o0R5M2o3P2L4k73J71j91K92j17M2j33J16k20L09k04J9q0m2K35J10
$$ 265 59 -1 94 136 73 145 179 -94 77 -114 178 61 103 -30 86 -134 175 -29 -10 -90 -132 103 213
4071B13o8l72M36q4p8j5K70k71J34k10K6j3M7j15j63K04p5l8J44n9jO5j34K18
$$ 213 145 -227 209 125 47 32 302 31 165 -45 -19 -32 15 -100 -263 -59 -134 -172 -28 -87 -88 -23 -157 61
4095F1o3r4Nm9J32o8j8o0J06M9NM7o1j17K7J04j73L0R8K41j40N5p9l2k11J81j51
$$ 61 -2 -96 -91 -140 -8 -76 -94 -154 -48 1 6 53 -8 -125 -98 6 -167 -137 -39 202 62 117 38 6 -205 -24 -175
$$ [...]
8191d8
##END NTUPLES=NMR FID
##END=
