##TITLE=1H_SR34
 CDCl3,8 sc, 
 3.03.2021
##JCAMPDX= 6.0         $$ Bruker NMR JCAMP-DX V2.0
##DATA TYPE= NMR FID
##DATA CLASS= NTUPLES
##ORIGIN= UXNMR, Bruker Analytische Messtechnik GmbH
##OWNER= root
$$ XWIN-NMR		Version 3.5
$$ Wed Mar  3 13:34:48 2021 Russian Standard Time (UT+4h)  she@DPX200
##.OBSERVE FREQUENCY= 200.1315066352
##.OBSERVE NUCLEUS= ^1H
##.DELAY= (6, 6)
##.ACQUISITION MODE= SIMULTANEOUS
##.ACQUISITION SCHEME= undefined
##.AVERAGES= 8
##.DIGITISER RES= 18
##SPECTROMETER/DATA SYSTEM= spect
##.PULSE SEQUENCE= zg30
##.SOLVENT NAME= D2O
##.SHIFT REFERENCE= (INTERNAL, D2O, 0, 15.7039)
##AUDIT TRAIL= $$ (NUMBER, WHEN, WHO, WHERE, WHAT)
$$ ##TITLE= Audit trail, XWIN-NMR		Version 3.5
$$ ##JCAMPDX= 5.01
$$ ##ORIGIN= Bruker BioSpin GmbH
$$ ##OWNER= she
$$ F:/spectra/data/she/nmr/H-F/1/audita.txt
$$ ##AUDIT TRAIL=  $$ (NUMBER, WHEN, WHO, WHERE, WHAT)
(   1,<2021-03-03 13:34:01.00 +0400>,<she>,<DPX200>,
      <created by zg, POWCHK disabled, PULCHK disabled
       configuration hash MD5:
       00 E9 B6 7A A2 85 ED C7 34 08 36 98 17 FE 4E 26
       data hash MD5: 16K
       22 F6 B1 D5 D3 B7 0E 09 17 C1 28 92 70 2A 4D 33>)
$$ ##END=
$$ 
$$ hash MD5
$$ A2 AE D4 A2 BA F1 DC B8 D8 0D 21 14 81 2B E9 E8
##$RELAX= 
##$RELAX= 
##$RELAX= 
##$RELAX= 
##$RELAX= 
##$RELAX= 
$$ Bruker specific parameters
$$ --------------------------
##$DU= <F:/spectra>
##$EXPNO= 1
##$NAME= <H-F>
##$PROCNO= 1
##$TYPE= <nmr>
##$USER= <she>
##$AMP= (0..31)
100 100 100 100 100 100 100 100 100 100 100 100 100 100 100 100 100 100 
100 100 100 100 100 100 100 100 100 100 100 100 100 100 
##$AQSEQ= 0
##$AQ_mod= 1
##$AUNM= <au_zg>
##$AUTOPOS= <>
##$BF1= 200.13
##$BF2= 200.13
##$BF3= 200.13
##$BF4= 200.13
##$BF5= 200.13
##$BF6= 200.13
##$BF7= 200.13
##$BF8= 200.13
##$BYTORDA= 1
##$CFDGTYP= 0
##$CFRGTYP= 5
##$CHEMSTR= <none>
##$CNST= (0..31)
1 1 145 1 1 1 1 1 1 1 1 1 1 1 1 1 1 1 1 1 1 1 1 1 1 1 1 1 1 1 1 1 
##$CPDPRG= <>
##$CPDPRG1= <>
##$CPDPRG2= <>
##$CPDPRG3= <>
##$CPDPRG4= <mlev>
##$CPDPRG5= <mlev>
##$CPDPRG6= <mlev>
##$CPDPRG7= <mlev>
##$CPDPRG8= <mlev>
##$CPDPRGB= <>
##$CPDPRGT= <>
##$D= (0..31)
0 1.2 0 0 0 0 0 0 0 0.06 0 0.03 0 0 0 0 0.0002 0 0 0 0 0 0 0 0 0 0 0 0 
0 0 0 
##$DATE= 1614764040
##$DBL= (0..7)
120 120 120 120 120 120 120 120 
##$DBP= (0..7)
150 150 150 150 150 150 150 150 
##$DBP07= 0
##$DBPNAM0= <>
##$DBPNAM1= <>
##$DBPNAM2= <>
##$DBPNAM3= <>
##$DBPNAM4= <>
##$DBPNAM5= <>
##$DBPNAM6= <>
##$DBPNAM7= <>
##$DBPOAL= (0..7)
0.5 0.5 0.5 0.5 0.5 0.5 0.5 0.5 
##$DBPOFFS= (0..7)
0 0 0 0 0 0 0 0 
##$DE= 6
##$DECBNUC= <off>
##$DECIM= 32
##$DECNUC= <off>
##$DECSTAT= 4
##$DIGMOD= 1
##$DIGTYP= 9
##$DL= (0..7)
0 120 120 120 120 120 120 120 
##$DP= (0..7)
150 150 150 150 150 150 150 150 
##$DP07= 0
##$DPNAME0= <>
##$DPNAME1= <>
##$DPNAME2= <>
##$DPNAME3= <>
##$DPNAME4= <>
##$DPNAME5= <>
##$DPNAME6= <>
##$DPNAME7= <>
##$DPOAL= (0..7)
0.5 0.5 0.5 0.5 0.5 0.5 0.5 0.5 
##$DPOFFS= (0..7)
0 0 0 0 0 0 0 0 
##$DQDMODE= 0
##$DR= 18
##$DS= 0
##$DSLIST= <SSSSSSSSSSSSSSS>
$$ [...]
##$SUBNAM2= <"">
##$SUBNAM3= <"">
##$SUBNAM4= <"">
##$SUBNAM5= <"">
##$SUBNAM6= <"">
##$SUBNAM7= <"">
##$SUBNAM8= <"">
##$SUBNAM9= <"">
##$SW= 16.9725356469052
##$SWIBOX= (0..15)
0 0 2 0 0 0 0 0 0 0 0 0 0 0 0 0 
##$SW_h= 3396.73913043478
##$TD= 16384
##$TD0= 1
##$TE= 0
##$TE2= 300
##$TE3= 300
##$TEG= 300
##$TL= (0..7)
0 120 120 120 120 120 120 120 
##$TP= (0..7)
150 150 150 150 150 150 150 150 
##$TP07= 0
##$TPNAME0= <>
##$TPNAME1= <>
##$TPNAME2= <>
##$TPNAME3= <>
##$TPNAME4= <>
##$TPNAME5= <>
##$TPNAME6= <>
##$TPNAME7= <>
##$TPOAL= (0..7)
0.5 0.5 0.5 0.5 0.5 0.5 0.5 0.5 
##$TPOFFS= (0..7)
0 0 0 0 0 0 0 0 
##$TUNHIN= 0
##$TUNHOUT= 0
##$TUNXOUT= 0
##$USERA1= <user>
##$USERA2= <user>
##$USERA3= <user>
##$USERA4= <user>
##$USERA5= <user>
##$V9= 5
##$VALIST= <valist>
##$VCLIST= <CCCCCCCCCCCCCCC>
##$VD= 0
##$VDLIST= <DDDDDDDDDDDDDDD>
##$VPLIST= <PPPPPPPPPPPPPPP>
##$VTLIST= <TTTTTTTTTTTTTTT>
##$WBST= 1024
##$WBSW= 4
##$XGAIN= (0..3)
0 0 0 0 
##$XL= 0
##$YL= 0
##$YMAX_a= 132984
##$YMIN_a= -194706
##$ZGOPTNS= <>
##$ZL1= 120
##$ZL2= 120
##$ZL3= 120
##$ZL4= 120
##$ABSF1= 10
##$ABSF2= 0
##$ABSG= 5
##$ABSL= 3
##$ALPHA= 0
##$AQORDER= 0
##$ASSFAC= 0
##$ASSFACI= 0
##$ASSFACX= 0
##$ASSWID= 0
##$AUNMP= <proc_1d>
##$AZFE= 0.1
##$AZFW= 0.1
##$BCFW= 1
##$BC_mod= 2
##$BYTORDP= 1
##$COROFFS= 0
##$CY= 11.3945322036743
##$DATMOD= 1
##$DC= 2
##$DFILT= <>
##$DTYPP= 0
##$F1P= 15.9154993809931
##$F2P= -4.1035820241983
##$FCOR= 0.5
##$FTSIZE= 0
##$FT_mod= 4
##$GAMMA= 1
##$GB= 0.15
##$INTBC= 1
##$INTSCL= 1
##$ISEN= 128
##$LB= 0.24
##$LEV0= 0
##$LPBIN= 0
##$MAXI= 10000
##$MC2= 0
##$MEAN= 0
##$ME_mod= 0
##$MI= 1.114404
##$NCOEF= 0
##$NC_proc= 0
##$NLEV= 6
##$NOISF1= 3.799351
##$NOISF2= 2.8
##$NSP= 1
##$NTH_PI= 0
##$NZP= 0
##$OFFSET= 15.70392
##$PC= 1
##$PHC0= -10756.34
##$PHC1= 5.600937
##$PH_mod= 1
##$PKNL= yes
##$PPARMOD= 0
##$PSCAL= 0
##$PSIGN= 0
##$REVERSE= no
##$SF= 200.130013532006
##$SI= 16384
##$SIGF1= 3
##$SIGF2= 2
##$SINO= 400
##$SIOLD= 16384
##$SREGLST= <1H.CDCl3>
##$SSB= 0
##$STSI= 0
##$STSR= 0
##$SW_p= 3612.71676300578
##$SYMM= 0
##$S_DEV= 0
##$TDeff= 0
##$TDoff= 0
##$TI= <>
##$TILT= no
##$TM1= 0
##$TM2= 0
##$TOPLEV= 0
##$USERP1= <user>
##$USERP2= <user>
##$USERP3= <user>
##$USERP4= <user>
##$USERP5= <user>
##$WDW= 1
##$XDIM= 8192
##$YMAX_p= 0
##$YMIN_p= 0
$$ End of Bruker specific parameters
$$ ---------------------------------
##NTUPLES= NMR FID
##VAR_NAME=  TIME,          FID/REAL,        FID/IMAG
##SYMBOL=    X,             R,               I
##VAR_TYPE=  INDEPENDENT,   DEPENDENT,       DEPENDENT
##VAR_FORM=  AFFN,          ASDF,            ASDF
##VAR_DIM=   8192,          8192,            8192
##UNITS=     SECONDS,       ARBITRARY UNITS, ARBITRARY UNITS
##FACTOR=    0.0002944,     1,               1
##FIRST=     0,             0,               0
##LAST=      2.4114304,     0,               0
##MIN=       0,             -194706,         0
##MAX=       2.4114304,     132984,          0
$$ Real data points
##PAGE= N=1
##DATA TABLE= (X++(R..R)), XYDATA
0 0 0 0 0 0 0 0 0 0 0 0 0 8 -8 8 -8 16 -16 16 -24 24 -32 40 -48 56 -64 72 -87 96 -112 128 -145 167 -189
33 -189 214 -240 270 -303 340 -377 421 -468 518 -574 636 -702 774 -854 941 -1036 1140 -1257
51 -1257 1385 -1527 1686 -1864 2066 -2297 2564 -2876 3247 -3696 4252 -4959 5894 -7181 9073
66 9073 -12105 17711 -31278 125311 79860 -194706 132984 -43733 -13551 104610 -69727
77 -69727 39468 -14214 -23692 86569 -20149 69497 -14358 -20119 74826 -74796 50199 35629
89 35629 -60476 76587 -52169 20457 51160 -80569 83889 -16308 -49071 71148 -54580
100 -54580 34193 4535 -42113 56269 -69995 12449 22234 -69529 57984 -51064 -8976 52829
112 52829 -89527 49947 -7872 -63729 60332 -65773 2638 19802 -69666 51733 -31926
123 -31926 -29990 36265 -47507 18860 -14653 -16592 26985 -48040 32089 -6766 -32980 48137
135 48137 -49652 16860 25663 -54728 54806 -15027 -16288 50060 -37195 26858 8531 -20283
147 -20283 43355 -24963 16427 21120 -21044 40889 -15112 9590 29605 -27765 40030 -3208
159 -3208 -8710 39928 -26098 24609 11310 -21846 38213 -18844 5760 21487 -25404 27074
171 27074 -9545 -5064 22636 -27924 17840 -3698 -18605 23605 -27052 5493 5504 -28051 20679
184 20679 -19601 -10232 12673 -28752 9502 -9082 -18066 12111 -23650 1006 -2868 -20338 9965
197 9965 -18624 -3115 2355 -20697 10823 -12176 -6951 9333 -19266 8682 -3190 -11421 14189
210 14189 -13827 4608 6802 -11178 14634 -5398 1507 12168 -8297 13711 1890 -265 15777
223 15777 -5666 11457 7414 -2557 17218 -1698 6982 12252 -3727 14243 3162 2278 12714
236 12714 -2750 9078 4749 -718 10280 -2360 4659 5106 -3241 7250 -2507 219 3698 -5619
250 -5619 3425 -2866 -3514 2190 -7298 -279 -3154 -7042 638 -7892 -3997 -2611 -9156 -1868 -6817
265 -6817 -6496 -2771 -8736 -3130 -5437 -6676 -2564 -7287 -3444 -3686 -6569 -1153 -4668 -3532 -751 -4558
281 -4558 -981 -1251 -2248 322 -1158 314 559 419 2334 1017 2922 2648 2192 4363 2934 3424 4795
298 4795 3766 4796 4568 4734 4938 4495 4681 4594 4777 4717 4365 4564 4119 4028 3960 3387 3272 2619 2635 2178 1638
319 1638 2079 682 866 572 -308 38 -1026 -1255 -1063 -2267 -1742 -2462 -2943 -2825 -3728 -3243 -3841 -4147 -3481
338 -3481 -4445 -3967 -4075 -4677 -3389 -4549 -4143 -3771 -4354 -3246 -3893 -3587 -2564 -3540 -2451 -2330 -2551 -1074
356 -1074 -1851 -1164 -211 -1051 318 261 248 1487 938 1717 1923 1797 2648 2674 2863 3229 3154 3641 3756 3560 3620
377 3620 3952 3804 4020 3911 3694 3760 3704 3402 3371 3378 2938 2686 2643 2505 2028 1703 1049 1201 562 -108 638 -383
399 -383 -500 -394 -1763 -1165 -1174 -2554 -1609 -2426 -2744 -2407 -3737 -2492 -3437 -3888 -2807 -4220 -3265 -3427 -4563
418 -4563 -2636 -4025 -3397 -2807 -4352 -2371 -2933 -3216 -1546 -3037 -1483 -1134 -2194 -6 -1241 -725 583
435 583 -898 1454 483 623 2675 198 2390 1851 1303 3870 1276 3074 3653 1637 4740 2560 2891
452 2891 4796 1665 4581 3384 2290 5131 1741 3774 3602 1195 4224 886 2181 3412 -360
467 -360 2863 680 -392 2785 -1544 915 178 -2197 1348 -2129 -1070 -339 -3803 -148 -2729 -2929
483 -2929 -923 -4873 -1329 -2833 -4192 -1090 -5158 -2513 -2159 -4973 -1015 -4411 -3009 -1095 -5132
498 -5132 -901 -3290 -3233 431 -4024 -551 -1321 -2869 1781 -2382 106 1115 -2357 2934 -243 -6
514 -6 3338 -1120 3238 2068 6 4381 225 2804 3817 348 4712 1805 2738 4800 734 4650
530 4650 2352 1771 5232 548 3435 2900 142 4864 450 1821 2901 -828 3362 -148 233 2080
546 2080 -2139 2028 -164 -2140 1918 -3204 -212 -377 -4102 788 -3130 -2355 -118 -5139 -810 -2699
562 -2699 -4183 -158 -4925 -1913 -2135 -4540 -371 -4076 -2706 -1170 -4236 -342 -2838 -2789 -163 -3667
578 -3667 57 -1053 -2589 1287 -2168 105 911 -1857 2289 -509 934 2317 -761 2861 1054
593 1054 1004 3846 -87 2910 2620 699 4554 1270 2643 3763 582 4473 1891 1463 4175 699
609 699 3206 2478 370 3648 488 1824 2189 -712 2576 256 389 1767 -1609 968 32 -1493
625 -1493 707 -2144 -397 -675 -2408 -164 -2736 -1836 -1028 -3131 -1122 -2756 -2588 -1338 -3791 -1451
641 -1451 -2177 -3108 -918 -3047 -1603 -1719 -3115 -763 -2391 -1955 -805 -2942 -105 -1121 -1476 383
657 383 -1495 -224 296 -908 1374 -65 300 1513 -41 1984 1182 1075 2216 1070 2293 1867 1539
674 1539 2726 1731 2285 2437 1487 2945 1880 2077 2648 1209 2487 1900 1365 2155 694 1608 1294 687
692 687 1463 108 573 653 -380 560 -600 -760 114 -1335 -456 -737 -1600 -764 -1627 -1579 -1252 -2338 -1310
711 -1310 -2120 -2405 -1908 -2265 -1701 -2085 -2194 -1616 -2252 -1755 -1859 -2051 -1404 -1594 -1038 -1160 -1288 -977 -955 -546
731 -546 -333 -556 -11 -145 22 579 97 640 803 656 1110 1154 1449 1624 1352 1725 1606 1656 1846 1653 2042
752 2042 2028 1863 1765 1695 1706 1863 1748 1766 1419 1462 1327 927 1236 1184 789 802 449 566 321 304 -156 -200 -359
775 -359 -897 -565 -924 -1170 -1010 -1250 -1281 -1204 -1590 -1366 -1775 -1647 -1852 -1768 -1545 -1678 -1678 -1544 -1500 -1704 -1494 -1667
797 -1667 -1184 -1160 -1542 -874 -1322 -935 -909 -636 -461 -459 -494 -57 88 246 -110 469 532 684 1124 922 1069 1196
819 1196 1158 1463 1169 1291 1685 1398 1962 1487 1403 1625 1409 1530 1608 1267 1489 1163 974 1205 738 1047 764
840 764 842 760 185 202 252 -37 275 -315 -208 -424 -482 -468 -766 -733 -857 -1120 -1073 -1285 -1222 -1107 -1431 -1231 -1314 -1275
864 -1275 -1447 -1552 -1417 -1383 -1195 -1166 -1430 -1162 -954 -1083 -918 -926 -1049 -665 -638 -658 -226 -423 -130 -44 56 91 325
887 325 373 482 600 881 762 905 892 929 1239 1471 1292 1200 1178 1503 1542 1354 1324 1220 1254 1240 1414 1264 1001
910 1001 1213 1093 688 939 648 748 615 354 216 181 117 27 -326 -180 -251 -403 -382 -662 -686 -953 -1056 -972
932 -972 -1020 -972 -833 -1179 -1270 -1197 -1435 -1346 -1182 -1450 -1223 -1195 -1354 -1289 -996 -1177 -916 -1001 -547 -652 -920 -291 -711
955 -711 -477 -306 -259 40 17 509 204 372 322 627 503 987 945 897 832 1005 966 1097 1252 1049 1258 1488 1030
978 1030 1265 1199 1036 1170 1025 1114 1094 627 900 653 920 772 589 5 686 5 302 -18 -179 10 -258
999 -258 -135 -231 -496 -531 -609 -959 -439 -1031 -723 -1234 -1079 -793 -1323 -1194 -1250 -1313 -1018 -1045 -1003 -987 -1140 -870 -969
1022 -969 -866 -635 -737 -537 -344 -756 -286 -364 -170 -316 -256 13 28 205 3 223 504 361 715 820 583
1043 583 1193 902 836 812 796 880 1080 1156 1257 992 1118 1239 804 1253 740 771 993 686 512 721 238 667
1065 667 626 141 409 173 264 -3 -171 -115 -168 -281 -394 -339 -434 -865 -696 -824 -713 -790 -753 -847 -982 -865 -985
1088 -985 -1032 -958 -962 -971 -1036 -985 -1031 -684 -832 -1067 -696 -705 -411 -471 -472 -199 -296 -221 128 -138 -37 392 -14 36 247 388
1114 388 781 480 577 463 437 860 819 750 750 843 785 985 717 710 846 861 800 748 925 657 880 510 526 490 451
1139 451 449 518 388 218 125 -60 -19 -267 -162 -25 -327 -188 -641 -397 -548 -776 -622 -738 -803 -707 -684 -606 -854
1162 -854 -767 -931 -930 -827 -697 -624 -576 -637 -559 -783 -878 -407 -488 -493 -251 -446 -255 -277 -139 -67 279 -46 -2 218 3
1187 3 299 339 151 305 506 572 336 603 637 711 958 776 569 802 652 960 886 649 749 604 659 334 327
1210 327 585 433 567 582 530 366 387 33 19 26 238 -174 -77 -301 -369 -174 -207 -165 -569 -390 -638 -548 -680 -607
1234 -607 -436 -796 -690 -774 -646 -689 -661 -463 -704 -529 -538 -485 -282 -486 -597 -501 -154 -288 -106 -278 -461 -249
1256 -249 -60 -19 181 375 113 293 402 290 467 509 649 719 465 565 637 539 630 592 596 672 517 793 721 674
1280 674 752 587 376 267 643 430 615 163 122 370 324 218 137 202 110 -2 54 -19 -280 -215 51 -250 -352
1303 -352 -400 -453 -447 -466 -529 -398 -471 -584 -433 -362 -746 -462 -681 -580 -748 -461 -581 -490 -320 -532 -305 -387 -341 -137
1327 -137 -3 -121 -96 -287 -25 -67 89 191 266 178 299 95 288 190 593 546 643 586 614 314 546 521 373
1350 373 582 524 565 528 741 559 392 396 521 491 436 167 128 129 118 330 154 39 27 10 -41 -16 -168 216 -357
1375 -357 -344 -154 -367 -405 -610 -510 -396 -751 -699 -375 -535 -278 -644 -663 -425 -378 -375 -592 -423 -186 -619 -286
1397 -286 -465 -115 -239 -219 -274 -229 -7 -134 -55 -76 28 -216 98 44 121 85 103 79 464 350 452 156 551
1420 551 335 329 354 424 322 376 389 135 475 219 314 292 443 179 392 193 192 340 173 -23 222 121 -44
1443 -44 10 154 94 -3 -247 -187 34 -242 -578 -291 -329 -316 -97 -241 -584 -738 -364 -531 -495 -526 -513 -342 -221
1466 -221 -234 -457 -537 -356 -524 -259 -192 -150 -221 -115 -418 -348 -206 -208 8 -29 5 41 118 -81 373 220 141 427
1490 427 158 210 289 257 271 591 366 296 393 263 449 388 291 498 464 413 420 550 208 135 254 -9 197 34
1514 34 42 5 356 190 -56 111 -58 78 51 -187 -332 -84 -53 -189 -231 -326 -304 -524 -134 -131 -242 -278 -44 -335
1538 -335 -173 -481 -132 -388 -178 -453 -215 -373 -486 -90 -93 6 -504 13 -204 -217 58 -23 -17 91 100 22 169
1561 169 296 140 270 242 317 240 394 313 220 295 36 311 274 429 95 176 337 158 15 185 174 231 459
1584 459 380 88 -95 152 -87 119 -1 233 -163 138 99 -165 16 -97 -300 -2 -65 -218 -235 -130 -427
1605 -427 -440 -489 -261 -201 -149 -23 -439 -422 -260 -326 -227 -434 -358 -291 -339 -69 -200 -290 31 42 179 38 -89 -113
1629 -113 -22 -135 79 54 -54 -19 235 71 259 354 75 323 -79 161 189 57 307 129 521 389 401 582
1651 582 88 155 141 246 161 208 138 142 66 159 324 44 53 98 -4 -223 -167 131 141 -147 84 -22 -83 -227 -114
1676 -114 -7 -274 48 -432 -155 -109 -226 -351 -529 -256 -361 -272 -231 -322 -95 -347 4 -213 -214 -126 -67 -39 -227
1699 -227 -124 -72 -157 -41 59 -18 -93 44 -52 -36 115 99 -193 296 102 -52 397 79 139 247 180 297 294 272
1723 272 36 143 444 241 124 3 241 305 50 102 184 54 29 12 -23 -254 -18 64 15 114 -31 -63 13 -21
1747 -21 -118 -110 196 -72 -184 -96 -30 -248 -246 -239 -315 -142 -120 53 -169 -41 -373 -115 -47 -168 -270 -312 -53 27 -48
1772 -48 40 -87 57 192 -100 -66 -216 304 -136 -99 68 73 -73 -207 122 210 134 127 357 115 273 261 90 293
1796 293 -47 213 30 230 204 9 257 235 -29 192 -9 99 82 68 43 151 -21 85 38 -155 74 -129
1818 -129 122 86 -52 115 -190 72 -20 -69 -121 -117 -173 -82 37 -134 -273 -136 -354 -206 -73 32 -96 98 -143
1841 -143 -182 -228 -59 -158 35 -173 -111 1 -452 -226 -66 91 13 213 -165 39 84 83 -51 125 -1 -3 -70 307
1865 307 74 45 216 347 53 122 300 114 231 125 271 35 196 44 203 296 40 109 25 193 142 199
1887 199 -76 -179 -139 -219 58 93 35 -47 84 -26 6 -74 -87 -15 -340 -234 -169 -13 -259 -17 -299 -246 -103 -112
1911 -112 -150 -96 95 -273 -3 470 -25 -58 197 53 -70 -283 -21 41 -46 -114 76 179 -3 157 -129 -59
1933 -59 193 107 -121 51 -50 129 204 167 49 -90 0 284 228 -59 -109 -44 -2 150 69 319 61 -64 82
1956 82 112 91 -94 -129 248 170 -137 48 158 213 -46 10 -120 71 17 -185 -308 -118 117 -99 -31 -115 -333
1979 -333 -241 -231 -203 -113 -114 -133 -84 -317 -32 25 48 -49 -123 -105 -156 -72 52 73 9 103 179 9 33 -32 39 69 76 115 188
2008 188 88 -32 -119 58 222 1 24 59 -123 8 94 208 150 -118 17 266 32 63 81 -10 171 121 -92
2031 -92 125 97 127 -29 104 -181 4 36 0 26 15 -110 -28 178 -12 -157 59 -238 -26 -219 -17 -151 -175
2054 -175 -120 -311 -147 -203 -216 -45 76 -209 -138 -144 -121 114 -23 -208 176 -110 86 -43 -31 83 -83 80 -204
2077 -204 232 23 218 -34 22 -85 -16 64 -9 115 -109 267 106 357 160 42 -222 224 4 214 5
2098 5 -142 7 -49 287 -51 56 50 -149 -161 11 89 134 -1 249 -201 -20 41 -133 -19 -6 -53 -266 -145 -280
2122 -280 81 108 79 -215 -229 -242 -66 -98 14 -95 -141 -312 -8 -227 -128 -45 88 109 158 109 57 -28 73 127 124
2147 124 -109 -71 -45 187 -19 261 249 86 87 18 148 111 218 85 170 -25 143 157 334 108 -85 266 14
2170 14 228 -192 -25 -9 32 176 -131 34 -48 -114 -126 -111 8 -2 -152 183 -54 -53 -125 -157 -87 -33 -213 -7 3
2195 3 -175 -105 -129 -110 -90 -311 -69 -198 -44 130 -134 -178 -19 84 -264 82 -144 -13 156 22 -33 -29 -126 96
2219 96 -29 136 152 29 172 -35 253 -61 78 110 90 -83 93 168 175 -92 356 -4 219 6 175 49
2241 49 -135 135 -128 179 -1 -181 -48 110 -60 0 -18 36 -136 -34 77 -70 -103 149 -120 -54 99 144
2263 144 100 -116 -72 258 33 -189 -11 -5 -96 -268 -7 -212 -130 62 -101 75 101 28 -243 -262 -35 -84 -116 -14
2287 -14 -180 41 55 -117 2 120 -60 21 -52 51 45 38 52 -73 -17 -113 182 -44 -56 60 121 64 123 -227 91
2312 91 -98 98 51 194 -68 39 112 53 223 58 31 -5 -98 86 127 112 37 -35 194 66 196 -144 -12 -123
2336 -123 206 175 -77 26 265 76 -29 -178 -39 46 -200 9 -29 -72 101 125 -123 -49 -168 -45 -15 32 -309
2359 -309 98 173 118 -278 141 214 251 -26 78 57 11 -177 -113 83 -86 -12 49 188 -95 -56 -48 135 237 136
2383 136 100 123 90 277 63 12 68 -79 -101 -49 -143 -143 84 58 -53 -45 -211 -89 -118 -64 41 58 62 -15 32 -122 -99
2410 -99 48 -266 -81 29 -102 -127 -184 -201 18 -191 -291 -183 134 -20 14 34 -82 -110 -352 -192 44 -100
2432 -100 -82 25 164 24 102 0 83 75 194 169 30 -89 -63 178 -27 221 30 332 -104 112 155 105 -17
2455 -17 -40 -93 216 75 177 -1 160 1 283 -22 -113 -40 -197 -7 -74 14 222 -137 -148 -18 -60 -121 7
2478 7 42 -46 -126 21 85 -84 -138 71 27 -72 53 -136 -150 -150 -257 97 3 -46 37 71 -67 -175 -55 -109 -123 -166
2504 -166 -153 -47 141 26 218 92 -2 25 -1 8 -57 220 83 75 -2 -71 5 214 177 -81 -57 173 -62 2 -27
2529 -27 99 139 -12 4 -34 195 -2 -4 -5 23 277 5 -10 -43 171 70 113 -120 109 104 -57 0 -97 -8 111 103
2555 103 108 269 -97 -192 -251 76 352 25 -20 63 -88 -260 -106 -5 -364 -139 256 22 -69 249 -147 27
2577 27 -153 -137 179 -149 49 -153 177 89 -32 95 -207 34 -14 -58 -117 113 -74 -3 -1 102 -53 25 209
2600 209 64 -231 -29 246 -186 12 194 17 82 61 98 14 21 -31 -112 200 178 6 -97 27 56 -237 2
2623 2 -117 -200 -49 -57 -21 187 -224 134 -8 -54 -101 89 -52 5 -156 -82 7 -212 -151 -239 148 -12 96 -10
2647 -10 86 -56 -242 234 -101 -132 143 -170 104 242 166 -132 -262 -49 3 -43 -6 -48 97 52 1 123 34 -34
2671 -34 173 104 235 207 78 128 -153 59 173 173 105 122 229 -106 2 60 -99 132 136 51 236 -176 114 23
2695 23 -65 -17 35 -111 112 -161 -95 27 -21 -99 2 -226 93 -182 -77 56 57 -142 -264 -221 -236 -87 -184 -165
2719 -165 -19 -18 17 -262 3 -189 -79 -99 13 91 155 118 -34 166 188 83 -37 -60 0 161 103 45 195 -6
2743 -6 -13 40 393 -210 166 -31 -23 31 46 135 -47 265 -315 75 -161 42 -68 -27 25 -20 -68 -91 47 69 -54
2768 -54 46 167 -2 -186 102 18 -7 -125 -176 -116 29 -148 -87 -59 -114 -25 34 93 29 -239 -102 -214 -18 -108
2792 -108 -13 -32 -178 -131 -237 -171 -73 111 -162 -22 62 -97 65 67 93 137 -2 -39 -26 318 -77 -89 46 70 -112
2817 -112 11 13 120 0 -19 145 -202 73 216 108 -23 44 -155 37 140 179 80 60 -163 203 60 -13 49
2840 49 -24 156 -97 61 -69 145 -83 147 -301 136 -172 -18 -46 -90 -65 -28 -350 -148 -145 -326 -103 308 -34
2863 -34 -11 -69 -140 -189 -133 100 35 -96 116 5 -111 87 315 98 -42 1 52 6 12 9 155 -57 155 -51 -82
2888 -82 -129 140 35 -106 123 274 -20 -14 42 42 37 -74 346 -26 85 9 318 82 53 71 88 -53 -177 -40
2912 -40 40 131 4 141 -79 112 -21 57 223 92 -102 25 -100 -175 15 -274 -194 -34 -127 82 -58 -159
2934 -159 -223 38 -107 -22 179 -3 -252 -117 -111 -145 -66 16 -9 68 -5 -82 -81 -22 -99 -73 252 -111 148 180 37 40
2960 40 87 35 -43 -38 -99 -89 171 129 -273 139 -148 164 232 190 217 10 218 -43 178 41 184 24 42 -128
2984 -128 73 -9 -63 256 109 232 -221 -166 30 -120 103 86 192 -98 -43 -61 96 -91 132 38 -94 90
3006 90 -21 148 20 -146 71 -151 -5 -232 -50 -12 -92 32 -153 -193 -109 -121 -148 130 -63 -1 47 -125 87
3029 87 49 99 105 45 -198 67 231 -103 83 -74 42 28 245 -45 32 23 -352 -251 73 124 171 33 31 -16 1
3054 1 40 -42 145 -38 -96 -141 -93 -9 -105 68 -39 -284 6 98 -110 -132 -85 182 -60 195 -335 -26 149 80
3078 80 -121 -31 -3 -129 -267 -117 233 -222 136 -244 54 -117 42 -57 112 -107 -61 -224 71 -3 -46 55
3100 55 -21 -180 -178 81 -41 -57 -111 -56 71 -33 53 -13 23 -172 -64 7 -74 133 -73 -29 148 72 79 165 -36 -108
3126 -108 98 82 333 -23 -44 -18 135 16 -54 -148 7 84 100 147 -31 51 29 190 -89 74 -231 -150 35 -38
3150 -38 33 -160 -122 -72 -169 110 -114 -184 -175 61 10 -71 17 -79 160 -286 4 -334 -46 39 95 -64 -50 -110 60
3175 60 -216 -39 144 88 115 106 -89 -42 33 -21 60 312 -178 -40 67 197 136 53 353 160 139 -83 -23 231
3199 231 -23 15 181 -35 52 -86 -246 45 179 204 -111 -39 -85 -113 -63 -11 44 10 129 110 -1 -173 91 -21
3223 -21 -58 238 -96 -156 -10 -161 -71 10 -76 -26 -195 -7 -112 -167 131 150 -124 -45 -132 -101 -183 -78 -118 4 -243
3248 -243 65 -31 -7 -132 39 9 -88 131 -7 -28 -113 96 161 152 110 -364 -5 14 -109 -67 17 23 -40 187 -42
3273 -42 -337 -127 85 335 -152 -15 163 -55 -30 19 -188 90 196 -165 131 83 -13 -49 25 -200 82 -12 -198
3296 -198 -307 -21 -98 -213 -74 -289 -129 131 -14 154 75 35 6 -212 -13 47 -93 5 115 -22 268 161
3318 161 -124 -140 185 48 17 -34 -13 -43 -182 73 -29 -168 -93 155 125 -6 205 119 -66 127 209 -23 -279
3341 -279 46 27 280 -98 -10 -111 172 130 79 1 132 16 -32 -32 69 149 46 184 205 -162 -99 -134 -1 7 -68
3366 -68 -69 -105 311 245 -50 18 80 166 -7 -17 241 -16 16 70 8 348 -116 27 87 -206 -7 -177 221 -55
3390 -55 42 -33 -126 -236 -58 212 20 -211 -24 130 112 -126 159 35 49 -79 -18 -94 16 58 -187 76 78 -12
3414 -12 75 184 236 218 96 79 40 -90 62 50 104 79 80 -8 -87 -178 1 138 213 -200 100 -18 -142 -115 -112 -184
3440 -184 108 93 -108 -29 16 -8 -133 120 -182 -226 153 198 -91 -95 -119 82 -19 66 -43 -37 -187 -407 -84 -77 -68
3465 -68 152 93 -277 74 -181 18 29 131 -62 -213 63 114 -126 192 -121 25 34 60 -83 128 -13 -42 -80
3488 -80 31 40 123 -117 -68 225 -26 174 73 -41 216 -3 -372 220 208 194 14 66 82 -8 -77 -19 101 160
3512 160 -143 -51 82 24 18 -104 -173 -8 -83 35 136 -189 -283 -12 1 82 60 122 70 2 -41 35 -45 69 99 13
3538 13 -95 137 184 48 -115 95 -112 -79 -221 -203 -179 32 -285 -53 -10 -10 196 -68 22 -120 -129 54 55 83 -16
3563 -16 -102 197 74 -114 36 232 -72 -96 0 -11 13 91 202 -74 15 -64 62 292 -21 -215 -12 -130 131
3586 131 -178 143 31 -163 -48 -83 -125 -293 -218 16 26 153 149 -315 60 125 -215 -110 -114 42 5 -64 185 -189
3610 -189 37 32 -190 52 -92 -82 57 -44 -164 61 23 6 15 -76 -179 53 43 -12 -198 4 20 24 -62 213 -98
3635 -98 -187 96 86 24 139 -72 -18 148 -103 81 62 228 -89 154 -90 211 -307 28 260 172 -8 44 22
3658 22 114 140 -33 53 40 185 100 88 4 19 223 14 156 -103 42 -10 35 -120 82 66 -141 2 31 76 58
3683 58 32 125 -120 -80 -19 -171 4 44 20 211 -207 26 -44 -13 481 -78 -91 -9 255 -146 -137 -88 23 -97 -251
3708 -251 122 5 -243 4 -135 -137 -249 162 27 -53 321 -9 73 -136 -50 72 -110 5 13 127 248 14
3730 14 81 -57 -52 28 28 -99 -53 54 -146 46 -117 111 -115 -106 -72 -59 102 34 -180 -134 -91 99 -46 -129 -159 38
3756 38 -109 41 120 -190 42 -80 17 -15 -46 -185 -108 34 -51 -149 -75 -13 82 14 -53 71 33 -119 213 62 -86
3781 -86 -56 14 -95 -112 7 -13 29 -115 111 -103 -1 24 193 -87 -201 79 10 100 97 -115 -11 234 168 274
3805 274 -88 -223 163 36 69 83 48 -181 53 222 44 187 -165 299 11 178 22 -37 115 -17 -5 -42
3827 -42 -30 65 -210 -35 -50 -68 -48 -198 -91 191 34 -62 -115 52 123 197 -77 218 105 13 46 -233 98 51
3851 51 223 -89 113 -83 5 65 -111 -70 124 -65 120 -41 -53 -22 -13 105 -57 199 225 -231 76 -59 -71
3874 -71 147 -157 10 -64 280 83 -28 -123 72 189 98 64 51 171 -312 -68 -57 -165 2 -32 -201 -164 172
3897 172 -132 6 -55 -113 2 -170 -75 -141 75 33 -140 -176 -114 58 -222 -271 70 -15 -224 205 57 122 10
3920 10 -100 10 30 -18 43 -97 77 -5 386 16 82 -49 100 -71 -214 -346 -40 -189 -105 15 178 181 -11
3943 -11 -132 -216 180 50 -38 50 132 -177 -112 -156 116 76 189 225 -58 113 -35 -87 121 219 14 8 -70 -104 30
3968 30 64 243 -134 184 -40 -122 -296 -166 167 121 94 64 19 -68 -266 194 -257 30 -280 -39 273 -101 4
3991 4 172 -148 9 -161 -11 92 -85 68 -94 10 -57 -155 131 -76 153 74 101 40 104 -92 139 -46 -72
4014 -72 17 12 -5 62 85 154 91 -93 -198 -27 34 185 -67 -11 -82 112 399 -161 -23 104 46 -212 338 -9
4038 -9 151 -142 -142 -5 -92 -23 -5 -22 125 256 -108 -154 71 222 -138 14 -297 -153 -29 23 -110 74 -134
4061 -134 -41 -90 85 -209 -250 14 -141 -86 117 -20 -11 296 -34 141 -42 -94 -99 63 -15 167 239 78 126 -116
4085 -116 -43 -59 50 97 -128 -104 -26 -17 -3 -182 -94 186 -23 58 -153 24 108 112 -44 -123 355 -111 -180 99 244
4110 244 -21 -54 -134 -40 38 -38 57 -283 -2 -57 -89 -149 -153 5 -109 6 -163 6 48 -34 -48 -139 -95 -166 -86 1
4136 1 99 344 117 38 -45 -106 71 -35 127 -220 -17 -59 25 161 112 59 148 87 221 -7 107 -173 -2 -114
4160 -114 -56 89 55 170 44 -251 -250 -51 -104 83 107 -55 -111 -7 14 165 -115 -181 -13 -40 -13 50 -67 -25
4184 -25 115 -53 88 -119 -2 30 -155 58 29 -46 -62 -40 32 89 -52 -175 87 -118 -10 -39 43 92 131 129 -33
4209 -33 97 -127 -132 -129 -36 120 36 -46 -126 139 -176 -77 184 -78 -241 162 21 -139 -142 -89 -209 -171 -73 53 7
4234 7 30 32 85 79 146 90 -118 -20 174 -92 78 159 42 137 19 179 -59 -279 -99 62 -36 -26 -31 192 28 66
4260 66 285 -225 49 -64 159 -132 -7 -144 -207 -88 -78 188 -108 24 -29 -57 -106 78 -76 215 100 260
4282 260 118 74 -106 -106 -15 -92 175 -31 29 408 35 2 38 225 -53 -99 30 -16 31 -21 162 -257 -81 24
4306 24 30 48 202 -31 24 85 -114 15 -32 -89 13 -89 0 -2 -104 -172 27 -99 49 -21 214 -89 -45 -138 283
4331 283 -12 39 -121 -35 159 -163 82 -133 83 45 239 -9 92 -116 -102 71 194 140 57 -120 187 -10
4353 -10 -84 150 90 -139 130 -97 -53 20 -136 78 111 122 -156 -66 9 -2 24 -112 -31 65 26 35 -17 45 -353 214
4379 214 -2 14 -153 -182 108 -82 155 5 77 112 -13 -216 104 -22 63 153 -35 -186 39 61 3 97 -170
4402 -170 37 -201 -98 128 102 113 -102 -4 -20 39 -155 -116 -91 104 152 197 -170 102 32 -11 -39 43 -237 -113
4426 -113 296 -144 36 46 -185 -147 -255 42 63 -177 -14 -10 -181 -51 103 -92 -20 84 19 -26 -229 -58 67
4449 67 -129 -97 109 -209 39 -168 100 214 34 -24 -187 -113 178 -24 58 87 46 204 268 52 102 171 199 -67
4473 -67 134 -53 -80 9 -1 -212 115 22 85 17 -53 -143 -16 116 16 205 -61 -31 95 191 21 76 27 5 -173
4498 -173 -61 46 78 -86 -76 -144 -126 57 150 97 -29 105 107 183 -12 -84 27 38 65 56 -71 104 -203 19 52
4523 52 130 -40 98 -80 -86 -139 -15 4 -151 124 -68 148 -2 80 -126 -257 -108 46 -123 141 138 -216 -48
4546 -48 -20 -7 -127 72 -102 -22 -181 -8 -75 -248 -43 51 188 -16 -116 79 -137 177 143 136 -111 33 133
4569 133 131 7 58 -37 66 59 166 1 -195 -243 107 19 -69 -228 56 160 -17 -213 -25 -118 -340 13 -117
4592 -117 -61 -224 -22 -213 -25 250 205 -38 75 -250 51 -162 132 220 113 306 -232 20 43 -76 -5 158
4614 158 165 129 274 -3 -202 -172 25 16 -60 -34 -86 39 -172 135 102 96 356 -94 -201 -146 24 -96 82 -4 -30
4639 -30 -100 204 -88 -19 -218 5 13 -71 57 -26 70 237 97 -50 57 107 135 247 32 -11 49 57 156 122 139 -100
4665 -100 76 -30 -33 -157 -26 10 113 -185 -100 -104 -92 -107 32 69 -3 82 -71 -119 110 -129 -7 111 -54 -169
4689 -169 55 127 213 45 -193 -295 -102 -57 -7 14 260 -14 -278 -44 48 -18 84 136 -233 97 -103 -54 23
4712 23 144 59 -104 123 46 -183 200 28 169 71 -19 -137 168 -45 -47 -227 -223 -57 54 -130 -120 224 -210
4735 -210 -73 132 -182 -66 -165 41 -43 302 -27 100 -107 -14 44 109 138 -208 -38 -112 -106 -66 28 -126 18 -281
4759 -281 222 -22 127 100 -30 44 -329 89 -154 -143 169 -365 43 -57 -43 31 -56 -98 -29 17 37 -286 -90
4782 -90 -45 -62 23 243 118 120 -168 -259 112 21 -27 20 468 -108 -15 -131 -27 28 43 -52 41 -41 107 15 -89 100
4808 100 -166 205 -53 53 -8 -17 -35 -82 116 93 172 -158 -125 -60 -49 83 5 70 -5 -141 -65 76 97 38 -70
4833 -70 -119 -1 -87 -154 1 69 -205 57 -178 4 -82 -108 -61 -62 140 59 -118 137 68 -72 148 35 115 -85
4857 -85 103 -74 115 -16 82 48 29 48 46 14 39 47 205 -70 -119 115 -95 -80 -176 -275 -87 -72 94 -161 275
4882 275 -323 213 87 -104 109 -54 184 148 199 52 149 -86 -68 104 130 62 146 -124 -37 -157 -198 197 -31
4905 -31 3 74 79 -62 18 147 -45 -146 -20 -37 -255 -158 -80 123 147 -68 -225 174 179 -317 -14 295 -61 115
4929 115 -123 -290 -133 -304 30 -9 -81 67 80 38 -54 -61 -317 -12 56 -39 -49 57 5 10 -151 -151 204 -98 193
4954 193 35 -60 62 11 -8 2 -304 53 115 -131 153 -79 -22 -35 209 239 311 119 -9 -186 -3 -77 -46 277
4978 277 51 39 -40 18 170 191 -175 15 160 -5 262 -101 215 -185 -142 105 13 113 2 5 -139 -43 -259
5001 -259 125 -50 -35 -334 26 -36 -29 13 149 -64 -121 20 -60 -48 24 -32 -330 146 -223 -59 278 92 -85
5024 -85 19 51 -187 -122 -72 167 -8 75 -68 -45 109 0 76 128 33 81 9 -42 -49 -9 207 176 269 -99 -46 172
5050 172 33 -41 -110 -97 -32 -85 11 95 145 48 -200 -159 19 106 79 -117 2 -22 -146 14 -162 14 83 87 29 -15
5076 -15 -97 -104 -32 191 -105 70 273 -210 116 -75 19 135 -61 98 -125 -80 -33 54 140 173 -12 199 249 -121
5100 -121 5 131 -96 166 -111 69 16 -147 25 204 -71 -25 -142 -199 31 129 -15 -248 110 133 285 13
5122 13 -32 210 240 305 98 -248 89 8 32 104 238 -24 -385 -108 -110 27 -45 219 50 -92 128 32 192 34
5146 34 -68 -177 -11 -42 -65 95 -173 -124 151 -145 116 -52 -349 108 -40 -23 117 59 245 -81 161 93
5168 93 18 223 45 -112 25 220 14 -78 99 -8 281 -3 33 -122 271 -129 26 148 -122 141 -103
5189 -103 -79 3 -34 -108 95 147 141 -14 105 32 -53 182 -8 73 167 -115 -33 -49 93 226 -13 -34 8 -224 238
5214 238 68 -182 -208 168 153 -123 -122 28 -237 -134 -25 -149 -114 59 54 -67 -35 107 -101 95 57 -198 -120
5237 -120 -206 95 -264 71 140 -97 -114 -56 -192 -5 291 -100 -39 -28 55 -39 149 -54 -36 -29 156 193 -144 -98
5261 -98 303 93 24 4 -153 -159 -198 116 172 152 -61 16 -32 230 -70 -182 -57 -36 198 109 -46 29 32 80 -23
5286 -23 40 -232 -205 -17 -66 -144 88 124 29 130 -56 -101 144 174 -99 -101 -34 27 59 224 170 -98 -82 -229 113
5311 113 -147 -144 -22 -167 48 236 -102 -112 -55 -277 32 -187 -55 203 121 -160 -115 -8 -30 149 7 35 -78
5334 -78 94 36 42 80 -74 21 -186 21 67 -183 122 -5 287 -14 -132 56 57 -109 -124 -48 -40 201 -291 245
5358 245 -83 -47 156 113 -47 -208 -289 254 13 256 33 -103 192 -67 -16 -5 -3 51 17 68 48 48 -12 -239 80
5383 80 53 268 88 188 72 -32 -171 34 -108 112 -119 -93 258 65 147 -64 -72 -69 73 118 -210 -154 39
5406 39 -38 -62 -58 64 75 46 94 174 -182 272 129 110 325 -3 -10 75 83 -166 -175 -52 96 126 22 -30 71 -26 25
5433 25 -18 127 86 -273 -79 99 -101 -36 -138 74 -26 175 -168 206 98 107 188 -114 -39 -156 -93 152 -234
5456 -234 -133 104 95 40 94 -163 -179 270 -225 -115 164 -56 -94 -120 -79 54 3 -11 103 13 43 -208 133 215
5480 215 -169 67 17 402 9 1 -64 23 -16 188 -41 52 -107 -135 -27 153 32 -10 -4 -195 126 21 -45 -10
5504 -10 76 206 -65 -118 -121 -193 26 -139 -53 -19 33 -109 -155 40 13 -7 -65 19 32 -76 3 100 56 -71 -85 -41 41
5531 41 109 -100 -345 -90 -223 -101 79 56 48 45 145 67 -42 -59 -15 243 -280 43 -143 -207 14 58 134 -27
5555 -27 -9 -29 -73 107 118 5 -2 -36 -56 86 137 -42 148 72 226 15 4 32 -30 37 -120 110 -87 83 -122
5580 -122 -251 235 152 150 3 -88 -190 -113 42 -64 124 15 188 -142 201 32 -25 -44 3 235 -174 -26 301
5603 301 126 -163 147 -263 -37 50 -98 -22 73 0 108 28 -74 -89 323 -101 -5 90 -12 191 152 -22 -40
5626 -40 -24 124 88 -30 265 99 3 -157 -142 -193 -127 81 -112 -110 263 -275 -55 -44 -114 -104 -80 161 -112 58
5650 58 11 53 197 65 -4 -48 27 129 75 120 100 143 -64 13 -25 -185 9 -160 -77 -99 232 36 -46 130 -121
5675 -121 193 56 -62 -291 -146 -170 -126 -14 3 141 5 -246 121 67 -73 87 -78 97 -225 -50 33 -165
5697 -165 11 206 170 -121 96 1 96 -250 29 167 -39 86 60 74 41 256 -41 73 -11 -6 -145 72 113
5720 113 -78 209 24 164 50 -9 52 134 -130 -48 21 -51 155 -274 -75 305 -120 -193 32 -1 221 -122 -52
5743 -52 -29 -32 -76 -40 -243 -182 -96 -60 89 -260 -178 30 -145 -204 -96 -122 125 -78 -44 -98 -76 6 244 -172 11
5768 11 -309 -40 189 202 -71 139 41 107 -56 -191 36 259 -58 108 -51 -145 9 -56 48 48 -123 133 -168
5791 -168 -197 -14 -111 -84 158 126 95 -137 -96 127 137 -9 45 -141 35 113 -185 124 121 -59 -46 -28 43 -149 -104
5816 -104 -129 60 214 -39 47 -85 -277 -42 112 155 127 -60 -17 -10 140 182 -3 66 -132 -35 240 -149 78
5839 78 95 -31 147 -22 57 134 194 -102 -3 66 -296 49 159 5 52 136 -172 143 214 -36 -108 59 52 -17 -35
5864 -35 -18 69 -60 -129 -68 -6 -240 106 39 54 -11 -9 52 23 -28 -101 -75 -69 101 -140 -126 -26 247 123 -20 115
5890 115 -145 -39 -266 255 -83 -202 94 -95 -139 -173 159 -90 111 -92 -84 311 24 36 -24 -2 -51 -140 -3
5913 -3 -37 203 -247 157 335 148 -131 149 224 15 136 -177 -130 56 74 152 123 79 -98 -122 48 120 190 -106
5937 -106 80 51 265 -161 22 125 -92 -134 71 -106 8 -87 0 -165 252 61 11 -173 -30 105 -9 36
5959 36 40 -35 189 -156 -4 4 213 -83 129 -2 -57 98 -151 -75 -150 -92 -202 -57 -37 -172 312 215 147 -73
5983 -73 -232 72 -103 90 293 -134 235 26 90 7 -77 123 -50 40 -183 -139 174 -14 -61 -63 23 44 -193 207
6007 207 -83 29 -53 -45 138 23 184 72 126 -138 -18 93 -156 -184 -178 37 -22 -148 -39 -3 145 44 -102
6030 -102 -158 -122 -11 50 -17 61 39 -156 33 -192 -161 -127 70 -134 -121 -230 129 -30 -164 -35 63 237 55
6053 55 215 183 115 -20 111 -56 0 256 15 53 -202 50 -38 70 71 -167 105 174 -14 -80 -74 -45 195 31
6077 31 116 63 -71 -195 -9 71 151 -6 -47 222 2 1 -43 7 32 48 -46 -278 -172 32 9 -128 -23 118 -296
6102 -296 66 56 71 80 -176 -131 -225 21 -129 34 -12 111 -124 -22 -82 -5 -15 21 7 46 -91 53 65 159 40
6127 40 -40 24 -214 328 -131 136 -54 -2 -36 64 -2 -6 -40 -126 117 208 44 204 -115 134 126 35 -107 34 51
6152 51 -128 -64 -23 219 -30 190 -55 30 -28 18 62 344 170 28 -179 140 31 162 92 106 127 -149 49
6175 49 43 -127 -14 76 164 -112 134 -265 -171 277 -134 -96 -37 -61 -33 -101 141 15 75 3 60 187 -112 -72 20
6200 20 -46 54 123 115 58 365 -153 -88 91 -185 66 -65 27 19 248 -18 -17 86 -74 -64 223 -86 152 -13
6224 -13 9 81 53 118 -10 -84 150 -40 74 135 220 18 -73 -110 -115 -200 -130 28 79 -22 -211 42 21 -348 12
6249 12 -284 317 51 87 24 126 130 -11 -173 -222 -35 48 85 45 -18 47 175 142 12 -227 1 -211 98 186
6273 186 -216 142 -102 -173 -84 115 21 -176 -232 -26 -136 -118 -143 -68 24 -74 199 68 49 -152 -30 -86 -240 158
6297 158 112 44 -240 36 -123 -55 185 108 11 37 -65 192 -20 -223 33 96 -76 -127 189 152 -289 143 205
6320 205 271 236 -1 -246 -109 -21 198 -195 -89 152 -229 -116 -111 30 -61 -246 -181 -135 97 -21 -82 -57 -51 33
6344 33 -80 -43 250 -121 26 -65 -108 11 108 125 -71 -241 -90 -196 -86 190 141 203 186 -152 77 -122 40
6367 40 5 -84 84 198 260 199 53 418 41 217 81 -42 -125 25 98 -1 -21 -225 36 66 75 -197 -22 125
6391 125 207 9 64 10 122 99 -197 89 163 31 -193 -42 -43 181 -150 88 7 52 60 137 190 74 171 -243 62
6416 62 -146 142 190 -18 -95 -144 150 -35 -114 -119 141 -171 40 84 127 154 48 -96 38 196 230 -199 199 285
6440 285 255 -23 -305 88 99 106 153 211 40 -53 169 149 28 -53 100 -31 -31 129 62 49 -37 179 154 -79 213
6465 213 290 -58 188 -45 105 -45 -146 85 -26 319 -29 -153 -21 197 49 105 87 20 -139 59 43 -307
6487 -307 -120 69 29 -190 -76 28 -103 -156 -84 2 -105 -151 -186 5 119 128 174 49 163 146 -252 -137 26
6510 26 50 154 -45 92 -90 90 71 42 93 60 108 -177 122 50 137 -23 -109 207 -111 -105 -25 71 47 94 -43
6535 -43 -213 104 -336 -49 67 -14 82 27 1 144 97 -78 4 -16 101 242 -125 -202 -166 41 -10 139 5 -275
6559 -275 48 -5 -3 -35 -185 -15 -278 -113 302 68 52 19 -56 40 80 162 -106 -190 -160 58 158 101 44 46 123 -11
6585 -11 38 216 -175 -154 121 43 -80 -91 -98 191 147 -206 166 127 146 44 13 16 127 112 105 87 153 -81 -160 15
6611 15 -232 -56 100 201 -218 197 25 31 25 -171 -49 323 -105 79 -129 42 -14 181 62 -188 -38 -21
6633 -21 140 -234 28 17 -45 198 -157 -37 -55 -135 8 -29 -96 18 65 67 73 91 -82 164 -95 -10 212 50 328
6658 328 85 -236 -3 104 -51 105 -126 23 -13 60 -102 29 45 -75 -294 9 -138 79 -2 182 362
6679 362 154 -94 -16 95 -22 79 -125 -297 56 215 -59 60 -3 -157 -183 -11 13 -137 -159 79 -106 -121
6701 -121 48 -8 48 155 105 23 116 22 131 8 -84 -125 -79 -71 -105 -35 98 -125 122 43 -48 -163 -93 20 -39 72
6727 72 -57 28 166 59 -12 163 346 236 189 31 64 71 -27 -157 154 154 -26 189 7 132 -102 203 -221
6750 -221 -35 -1 157 6 -73 120 47 -130 115 -26 -201 138 45 -314 -165 47 170 -34 -127 217 36 237
6772 237 322 31 -247 38 -149 42 -2 -89 135 48 -76 -136 67 -142 165 -71 -17 -63 62 -139 -292 -249 -6
6795 -6 34 -86 -59 78 -70 76 -44 -328 115 1 35 -134 -78 62 37 37 1 -9 345 256 208 -3 -17 46 89
6820 89 139 0 50 97 -221 -326 -64 9 76 58 137 -189 61 -34 174 -286 59 69 -172 188 284 -147 65 -124
6844 -124 -142 -160 170 61 -60 457 -107 -56 72 275 1 6 -64 -144 -33 60 108 -114 -98 -70 127 141 -149 165
6868 165 -21 39 157 98 -105 5 -108 18 -73 131 64 -108 121 1 9 171 152 -57 -91 22 -35 -251 -99
6891 -99 -129 -42 73 75 -1 167 89 15 106 -126 11 -39 46 58 -77 128 59 -34 157 73 -87 -91 33 266 80 -7
6917 -7 95 39 44 -228 -68 -110 -64 45 -434 9 -87 44 -37 136 -68 309 -127 54 11 87 -142 52 -68 137
6941 137 11 -29 -93 -107 45 -140 53 -97 -39 -18 39 -270 -267 -77 -115 1 12 -36 -114 -101 -52 -83 174 -39 -29
6966 -29 -94 -22 -5 -118 -186 242 -208 -50 64 1 -63 127 91 56 199 119 85 -17 -57 115 -137 -21 -100 119
6990 119 87 -62 2 -6 32 -37 21 195 -10 -271 19 -15 -67 -51 172 218 106 -34 188 14 -40 -197 34 -71
7014 -71 -20 -21 -185 129 58 34 68 43 13 123 -184 -42 0 -221 22 135 -72 -28 -139 -175 41 -70 99 -84
7038 -84 70 -121 -116 -5 78 -59 171 121 73 -114 30 219 54 77 26 302 205 281 -61 -54 297 -37 225 -90
7062 -90 31 -333 -64 79 76 73 24 -121 -2 18 152 -51 160 84 -115 -56 -114 -125 -110 45 -130 -68 -27 146 20
7087 20 238 149 -117 -145 -96 -36 -142 216 -10 -58 -212 -68 73 -128 246 97 -137 196 -280 65 -21 -95 72
7110 72 -123 -180 -62 264 391 -51 133 16 -146 -149 -46 61 11 46 1 -45 136 -64 80 -37 -81 21 285
7133 285 -9 -124 195 -60 -110 65 -54 45 103 -63 56 -37 -179 47 114 -8 -27 -108 -37 -14 -97 213 -9
7156 -9 30 -79 -36 -89 46 -262 281 22 60 -162 -39 319 63 184 -1 -6 -148 -17 224 132 170 61 -12 1
7180 1 174 74 108 -149 -72 49 175 17 -173 -8 71 -61 -47 -30 46 -157 134 -90 23 -124 -6 -10 -25 -97
7204 -97 -77 85 0 -25 -103 10 39 78 -25 -106 -49 -236 -106 212 5 5 269 169 199 -216 -24 -226 44 -10
7228 -10 -25 -46 -166 53 -67 51 -20 -82 86 48 -82 49 191 32 146 22 -56 23 -109 -43 89 -154 -104
7251 -104 73 -26 -206 0 131 31 37 10 6 38 328 -39 -247 247 -98 56 -129 -120 -174 106 81 50 -12 210
7275 210 -209 -240 -59 -14 169 428 -58 40 50 312 82 -250 190 -139 56 68 47 108 -60 -18 -97 -319 1
7298 1 -33 -23 34 201 33 98 63 16 134 -13 -62 -136 283 -64 -177 88 51 38 -89 169 113 -84 114 39 83
7323 83 -220 -98 26 125 -8 30 162 107 -1 -105 119 33 -168 -44 79 -62 -179 -8 -203 3 126 95
7345 95 -54 -58 100 112 57 -201 33 -145 -79 154 -74 -192 260 -18 61 68 160 34 49 -75 436 -188 167 389
7369 389 89 -11 -226 88 9 124 61 -31 76 -11 179 160 -165 -178 31 130 53 -172 111 20 -13 129 17
7392 17 -238 -101 36 1 -63 -148 82 30 62 216 327 53 64 105 -20 52 -199 -48 102 -80 -329 -104 4
7415 4 -210 46 38 -139 -132 -6 -92 254 67 -131 -9 140 81 46 14 -201 78 -41 112 -87 41 -98 -31 -41
7439 -41 -176 188 -68 -83 77 125 -18 -44 -80 -156 -97 -21 -91 -37 99 -196 -104 -114 20 -95 -186 -16 -150 73
7463 73 -183 23 -97 -106 188 52 -80 -83 2 219 40 -33 -33 -41 172 160 -48 127 142 -103 92 84 246 -106 40
7488 40 76 -355 -90 -37 -34 -150 146 103 69 202 65 82 83 -28 130 103 146 -116 144 -95 9 -140 91 -17
7512 -17 -264 68 -152 310 -50 209 -86 -52 -25 -222 -141 196 -142 150 -78 -98 72 -45 -100 -63 36 141 -57
7535 -57 110 -44 9 141 -40 159 51 57 2 146 11 -224 -358 -197 10 -98 317 52 -114 -140 -178 -88 -84
7558 -84 190 -41 -48 70 -225 143 227 -105 -147 -49 -79 36 16 14 -54 -37 -47 42 -46 -85 -27 109 -129 -92 -80 23
7584 23 42 34 159 -44 -19 -9 2 -20 146 -175 176 184 67 -83 164 73 51 -89 97 -93 -8 -96 -7 -156 62
7609 62 -68 -24 147 -26 -18 80 -99 -6 70 -128 233 70 120 -36 47 -152 -113 -38 -38 -54 10 -133 354 -85 22
7634 22 -36 85 42 48 -139 -176 -92 -5 -100 -72 58 -21 -113 137 134 -26 -41 93 -38 -157 163 -56 -42 -249 186
7659 186 -24 -140 -27 -51 -67 -28 -56 -84 -46 -143 -239 -160 71 84 35 -283 -132 -279 22 -8 -173 44 -194 82
7683 82 -148 5 131 -32 -36 -102 3 63 -150 72 -36 39 32 -113 -66 52 114 134 24 244 -16 154 -79 6
7707 6 -12 -57 -57 -18 -255 -35 144 -63 -40 -24 257 -161 110 109 204 -54 38 -54 -33 -138 -29 -196 14 17 -246 159
7733 159 -15 72 -24 -145 133 78 271 -63 -2 28 122 -142 -294 -1 -198 144 -73 73 242 153 143 51 161
7756 161 -42 38 80 -58 293 146 -155 20 118 -10 120 -58 2 -191 -55 -80 -133 281 -118 43 -35 106
7778 106 -28 17 -84 143 178 178 2 -76 24 23 20 114 25 -155 -12 -17 48 189 263 315 -59 100 75 121 -154 -52
7804 -52 198 47 -26 -185 -33 -147 34 -199 -33 49 8 -92 -108 205 -20 18 73 24 196 -120 46 -54 26
7827 26 -51 -1 -30 -178 -53 -96 -23 -52 48 -73 -69 -119 107 -30 -136 19 -21 -161 341 -56 -153 23 142 6
7851 6 38 -268 -241 -53 76 35 116 -37 46 166 -33 -75 -171 0 32 22 -10 -96 -105 -5 -236 -193 131 86 0 161
7877 161 72 -13 64 -92 -112 -117 19 77 129 -28 -17 -116 160 82 47 2 66 45 44 158 -47 -13 203 -133 -39 9 77
7904 77 160 83 -187 152 58 61 79 26 -128 -86 -102 -89 34 -40 99 -66 -71 104 65 -106 -289 216 147 6 -21 -86
7930 -86 -18 -204 -21 -37 47 -49 -26 148 138 -48 85 -223 206 92 70 112 251 76 18 145 46 77 35 -40 40
7955 40 162 205 52 -147 38 -130 -118 -10 -17 109 55 -260 -5 62 2 -4 -28 -124 -55 -149 -33 -18 -9 -94 -23 52 -39
7982 -39 -91 -6 63 -167 29 -262 -28 -133 -60 13 -71 144 88 203 -151 -61 -243 107 173 -69 2 -36 -177 45
8006 45 -78 166 21 101 363 137 51 67 -223 -139 -259 -102 151 -28 -193 94 -146 23 124 54 289 -54
8028 -54 131 -32 2 -44 103 26 116 -261 -11 166 6 178 -200 29 -10 -90 63 107 126 -67 -87 -95 -83 -23 44
8053 44 -193 -43 -107 -17 -6 -37 172 -15 -101 -349 160 70 -74 65 25 -340 -338 -112 37 -1 -84 -135 -11 -45 47
8078 47 84 -170 -308 6 -126 19 16 -224 -83 24 45 -46 -81 72 56 117 -69 -199 118 112 28 -39 -145 41
8102 41 118 -28 130 153 133 9 4 -96 57 18 -88 -210 33 -44 -84 -168 21 138 -97 -309 49 238 88
8125 88 234 -181 19 -87 -110 170 -40 82 -140 -134 -201 40 198 74 42 209 18 -82 37 -314 -73 29
8147 29 154 21 205 -67 151 36 -66 -54 -42 80 -23 -105 -77 -94 23 173 307 -7 86 161 101 -14 -123
8170 -123 -108 -145 -245 -198 68 168 -84 207 66 -263 251 190 -98 -19 0 20 -40 10 -63 33 21
8191B1
$$ Imaginary data points
##PAGE= N=2
##DATA TABLE= (X++(I..I)), XYDATA
0 0 0 0 0 0 0 0 0 0 0 0 0 2 -8 8 -8 8 -16 16 -24 24 -32 40 -44 52 -64 72 -84 97 -112 131 -151 172 -195 221
34 221 -251 284 -318 357 -401 447 -500 556 -617 685 -757 838 -924 1019 -1124 1239 -1365
51 -1365 1502 -1656 1824 -2012 2223 -2463 2732 -3044 3407 -3832 4346 -4975 5768 -6801 8218
66 8218 -10290 13673 -20600 71356 -103250 75996 70113 -161945 99741 -38607 15414 63509
78 63509 -66339 37820 -35773 -16684 39865 -55250 70938 -51006 -35415 71994 -75548
89 -75548 42427 3690 -65830 57032 -93632 10446 39549 -97218 57724 -25544 -36032
100 -36032 43260 -65665 39311 -24501 -46171 56138 -74368 19507 9614 -60563 70557
111 70557 -63285 -7517 55703 -82231 54243 -4044 -40734 66090 -54437 26030 27148
122 27148 -56073 54082 -17790 -4444 31853 -25662 43165 -15066 8116 41534 -41167 49077
134 49077 -2856 -17870 62175 -45130 27868 33763 -43653 55940 -11932 -7338 41086 -31739
146 -31739 33556 552 -15810 38875 -27809 18296 6246 -24835 34850 -28831 6445 17753
158 17753 -37701 31369 -16336 -14088 25025 -39651 15737 -3867 -29249 24554 -30888 -657
170 -657 5123 -31848 19182 -23755 -9442 12704 -34015 15197 -12664 -19475 19519 -30352 6490
183 6490 1446 -26468 20243 -17962 -3739 12536 -22530 15926 -5662 -7728 16446 -16070 11749
196 11749 2822 -8001 19214 -10407 9749 10265 -9300 21100 -4455 4827 17481 -9701 19059
209 19059 3439 -1326 20427 -6916 12201 9467 -4983 18356 -3048 5727 11892 -6798 14286
222 14286 -606 -240 12065 -9164 8940 1668 -6953 10643 -8615 1128 3545 -10593 5629
235 5629 -6566 -5054 2629 -11042 831 -5520 -8399 1055 -10998 -2535 -4027 -10143 -140 -9597
249 -9597 -5062 -2734 -10360 -667 -7433 -6166 -772 -9152 -922 -3829 -6350 1255 -6112 -1085 55
264 55 -4628 2200 -2321 -211 2923 -1865 3609 907 997 5161 149 4805 4168 1891 6493 3150
280 3150 4170 6289 3285 5782 5090 4523 5700 4200 5650 4687 4407 5275 3396 4430 4041 2819 4151
297 4151 2617 2428 2550 1436 1717 954 666 16 -415 -472 -1196 -1312 -1871 -2005 -2122 -2976 -2975 -3444 -3652 -3478
317 -3478 -4111 -3818 -4099 -4666 -4261 -4920 -4232 -4291 -4879 -3969 -4590 -4428 -3664 -4048 -3155 -3205 -2759 -2586 -2663 -1538 -1990
338 -1990 -1568 -778 -905 130 45 3 1276 503 1711 2239 1463 3289 2313 2634 3991 2839 4209 3812
356 3812 3229 4528 3713 4035 4317 3636 4512 4044 3740 4081 3486 3442 3529 2604 3159 2431 2076 1980 1571 1302 721
377 721 504 336 -109 -414 -856 -931 -1332 -1746 -2056 -2192 -2369 -2691 -2987 -3268 -3185 -3470 -3708 -3618 -3927 -3558 -3521 -3833
399 -3833 -3426 -3867 -3799 -2919 -4005 -2829 -2905 -3109 -2084 -2628 -1904 -1282 -2278 -761 -1075 -887 493 -994 630
418 630 720 66 2298 686 1652 2800 1295 3099 2263 2192 4184 2303 3739 3624 2629 4443 2923 3547
436 3547 4222 2427 4372 2647 2880 3808 1433 3633 2236 1444 3397 298 1998 1896 -452 2292
452 2292 -622 -53 1143 -2107 684 -1173 -2090 371 -3481 -1148 -2270 -3867 -528 -4311 -2872 -1670
468 -1670 -5108 -1369 -3896 -4193 -1505 -5175 -1773 -2687 -4575 -1309 -4250 -2043 -1383 -4258 -284 -3098
484 -3098 -1854 372 -3490 519 -1152 -1628 2183 -2052 1201 1028 -1369 3471 -12 1581 3065 32
500 32 4284 1537 1521 4460 427 4846 3185 1058 5300 978 4011 4227 305 5115 1541 2095 4956
517 4956 -297 3895 1998 392 4244 -882 1743 1734 -993 2994 -912 -48 1243 -2509 1486 -1685
533 -1685 -2353 751 -3789 -337 -1720 -3848 -24 -4160 -1873 -1647 -4910 -345 -3992 -3098 -1114 -5227
549 -5227 -874 -2945 -3884 229 -5011 -1254 -1476 -4384 753 -3394 -1697 842 -3635 1197 -1276 -1697
565 -1697 2180 -1899 1441 999 -1004 3123 -223 1893 2434 -519 3680 1191 2036 4300 245 3950
581 3950 2717 1709 4471 759 3315 3265 1198 4539 1006 2450 3658 228 3756 942 977 3230
597 3230 -689 2224 1194 -1033 2647 -1221 589 823 -2481 1536 -1591 -1437 496 -3186 -182 -1540
613 -1540 -3022 -398 -3697 -1796 -1810 -4023 -1124 -3788 -2821 -1504 -3871 -1200 -2855 -3220 -979 -3522
629 -3522 -1568 -1796 -2983 -274 -2722 -904 -212 -2219 541 -1195 -502 691 -1194 1263 469 -215
645 -215 2213 -230 1572 1620 594 2833 866 1816 2813 794 3493 2066 1639 3239 1346 2618 2462
662 2462 1283 3344 1533 2136 2357 731 2331 1215 1048 1804 126 1548 665 -182 1093 -514 291
679 291 301 -974 -43 -937 -888 -560 -1922 -1010 -1425 -1979 -1185 -2137 -1422 -2041 -2367 -1616 -2584 -1995 -1910 -2520 -1304
700 -1304 -1982 -2096 -1553 -2447 -1217 -1397 -1898 -968 -1286 -923 -721 -1034 -114 -594 -471 121 -141 554 322 466
720 466 956 667 1278 1029 1147 1675 1177 1872 1749 1541 2094 1797 2073 2127 1634 1970 1852 1619 2191 1831 1766
741 1766 1853 1232 1589 1427 1342 1110 638 667 189 346 481 -2 18 -243 -239 -164 -564 -904 -958 -1074 -1223 -1374 -1212
764 -1212 -1685 -1161 -1602 -1756 -1492 -1848 -1958 -1645 -2038 -1899 -1975 -1788 -1388 -1750 -1369 -1390 -1275 -1005 -1410 -1132 -892
785 -892 -956 -844 -478 -205 -10 -132 51 114 347 387 893 1055 1169 1082 1370 1031 1370 1407 1338 1656 1826 1718
807 1718 1544 1688 1671 1635 1375 1721 1470 1449 1343 1384 1512 1054 907 898 758 866 525 495 404 -84 358 18 -165
830 -165 -119 -708 -488 -604 -829 -843 -1056 -1061 -951 -1169 -1491 -1264 -1573 -1363 -1544 -1359 -1600 -1662 -1408 -1529 -1444 -1369 -1324
853 -1324 -1160 -1052 -1086 -860 -958 -674 -727 -437 -367 -465 -188 -86 -77 180 273 478 620 466 876 858 862 1140 967 1114
877 1114 1310 1139 1592 1409 1451 1323 1254 1498 1483 1476 1331 1230 1131 1100 830 1280 1199 1055 981 527 550 537 245 296
901 296 46 29 -54 -231 -246 -482 -454 -795 -582 -875 -1087 -896 -1126 -1107 -1220 -1270 -1114 -1188 -1221 -1309 -1123 -1291 -1025
924 -1025 -1326 -1106 -1118 -1041 -854 -919 -1078 -826 -544 -731 -419 -808 -267 -140 -415 -27 -50 252 541 310 493
945 493 549 522 802 865 559 1033 815 950 1240 1115 1172 1289 1556 1373 1024 1061 1083 917 1288 1088 1078 1081 802
968 802 767 569 802 637 738 446 263 347 -34 66 -291 -518 -222 -303 -724 -472 -653 -882 -774 -1074 -845
989 -845 -786 -1119 -831 -1040 -1323 -1036 -1342 -1251 -1052 -1159 -906 -1236 -894 -940 -992 -616 -651 -1142 -460 -767 -530 -208
1011 -208 -178 -21 114 8 316 0 203 318 201 524 490 559 722 703 749 963 873 952 994 1111 1238 895 1020
1034 1020 890 1092 966 933 1088 866 970 797 546 898 434 482 249 206 396 85 -14 274 -145 84 -159
1055 -159 -499 -226 -769 -462 -589 -744 -699 -644 -805 -737 -1059 -1160 -839 -923 -831 -988 -1015 -975 -1115 -1059 -663 -984 -898
1078 -898 -636 -752 -748 -499 -467 -471 4 -379 -307 42 -233 117 169 -2 320 363 293 597 651 602 578 789 921 737
1102 737 633 808 905 956 564 998 1063 629 1298 679 471 762 445 524 820 576 449 312 768 279 341 450
1124 450 41 -20 102 -67 -107 -49 -110 -153 -188 -712 -540 -768 -574 -714 -1022 -581 -891 -937 -680 -910 -1019 -780
1146 -780 -707 -887 -788 -901 -830 -711 -301 -854 -496 -698 -550 -113 -440 -331 -56 -462 -14 -72 -223 149 86 376
1168 376 317 344 610 607 784 689 586 663 476 724 761 722 849 776 552 771 849 798 621 643 839 552 588 557 394
1193 394 485 349 288 122 108 211 135 191 -154 -1 -46 13 -391 -150 -387 -403 -376 -547 -436 -453 -779 -670 -721 -773
1217 -773 -825 -849 -935 -735 -486 -795 -710 -669 -700 -610 -671 -440 -523 -493 -434 -289 -331 -501 -27 -253 -129 56 12 149
1241 149 275 262 353 280 318 412 456 507 444 812 693 846 623 556 725 736 817 835 634 698 555 542 460 614 497
1266 497 306 465 522 384 335 406 214 53 292 51 -185 157 -157 -357 -280 -318 -180 -394 -448 -364 -681 -472
1288 -472 -614 -561 -619 -512 -603 -604 -851 -648 -641 -707 -423 -800 -311 -378 -471 -593 -415 -714 -402 -477 -263 -398 -238 -97
1312 -97 -205 112 -238 0 247 333 135 278 337 246 381 521 495 464 571 405 462 462 623 565 458 630 694 577
1336 577 443 580 722 477 422 436 228 403 425 272 73 87 32 111 -134 120 -219 -204 -156 -318 -128 -560 -314
1359 -314 -477 -319 -496 -416 -368 -452 -373 -566 -332 -272 -501 -546 -360 -435 -569 -446 -357 -492 -194 -565 -316 -487 -106
1382 -106 -400 -225 -100 -128 -97 -35 -70 -45 -145 72 82 90 136 308 329 286 470 339 222 510 237 453 373 482
1406 482 452 315 587 458 335 440 588 621 536 295 222 430 298 310 134 117 -106 185 91 143 -74 -159 -43
1429 -43 -259 74 -252 -164 -436 -422 -320 -427 -423 -430 -358 -319 -294 -477 -276 -362 -664 -529 -434 -369 -346 -128 -248 -174 -255
1454 -255 -428 -221 -154 95 -138 34 145 -25 -183 6 33 8 217 216 301 209 51 233 248 263 -71 163 518
1477 518 600 455 492 556 520 419 284 301 547 474 305 235 163 203 146 267 182 96 305 13 208 91 -108 0
1501 0 -126 -234 127 -289 -138 -472 -105 -340 -378 -489 -213 -399 -344 -358 -210 -540 -381 -457 -421 -190 -306 -172
1523 -172 -402 -230 -346 -303 -13 -150 -307 -356 -373 -317 -87 -210 -305 274 17 -25 -98 134 227 223 101 176 153 230
1547 230 99 149 232 206 321 433 264 375 246 218 294 511 114 172 361 282 232 173 91 -243 114 -1 46 -34
1571 -34 -62 185 -4 81 143 75 -104 -165 -254 -126 -230 -295 -55 -266 -409 -143 -356 -128 -322 -366 -308 -227 -271 -140
1595 -140 -422 -226 -257 -354 -316 27 -387 -342 48 -95 27 -162 -51 171 -152 56 -104 -40 170 261 50 258
1617 258 249 146 19 97 336 142 208 123 409 209 270 163 303 266 429 249 360 393 374 471 49 112 225 323
1641 323 118 303 462 204 -29 173 225 37 97 -179 139 206 -38 -218 -227 -293 -12 -77 -121 -218 -155 -125 -243 -197
1665 -197 -134 -111 -154 -226 -247 -123 -42 -427 -137 -100 -16 -143 -194 -391 -269 -103 18 -73 -12 35 23 119 -25 -38 125
1690 125 -92 94 271 141 78 272 154 38 235 203 279 -27 244 174 320 117 5 281 229 244 249 389 139
1713 139 -7 39 24 471 98 177 221 102 197 -137 -98 120 2 12 -267 44 -33 -179 156 -138 -71 33 -81
1736 -81 -106 1 -141 -120 -107 -251 -143 -178 -312 -308 -122 -172 -170 -239 -194 -56 -52 -119 -116 -95 -87 -192 -154 -39 -209 322 -84
1763 -84 221 -13 -2 262 176 28 104 277 148 19 189 -10 121 247 64 167 300 21 195 134 78 40
1785 40 8 195 85 122 -149 220 226 61 -24 -240 139 -157 35 26 -64 125 -141 -14 94 -89 -177 -124 -120 -117 -88
1810 -88 106 -181 15 -136 -182 -17 -259 -398 -353 -188 -13 -341 -124 -179 -221 -196 -201 116 -204 -63 -169 -146 -153 -14
1834 -14 -42 67 172 -1 -17 -1 -192 128 81 265 -162 214 117 302 217 180 128 -23 283 197 150 82 59 108 232
1859 232 40 55 -13 254 140 -53 -8 42 -44 98 123 -17 -187 -35 70 -29 -121 -97 -111 -136 -188 -126 127 -108
1883 -108 59 -81 -185 -182 -25 -123 -178 -77 -48 -163 -383 -150 54 18 36 35 -42 -24 -75 50 -149 -267 68 -153
1907 -153 55 25 -12 -45 -26 -75 15 199 106 52 68 118 169 296 -12 -2 28 170 49 165 6 24 170 135 219
1932 219 161 227 32 125 67 30 -28 44 -25 147 122 -100 38 113 -192 -248 -274 145 -10 12 109 -94 7 -106 21
1957 21 39 -56 -100 -167 -194 -309 99 40 13 -328 -93 -55 -209 -177 22 119 86 113 0 -91 52 -202 93 -111 -29
1982 -29 57 30 40 2 113 -13 154 89 31 -111 91 91 34 -245 98 374 -221 32 147 94 223 174 -130 30
2006 30 251 150 112 92 177 17 -77 -2 -54 164 -101 88 136 103 13 -356 -201 -169 -25 -13 -13 -191 -67 -87 -339
2031 -339 -200 -39 -282 -29 -44 -207 -119 -198 -232 -120 -99 -138 -32 -17 61 144 140 -54 -244 -63 -122 -404 104 -342
2055 -342 -29 289 -42 69 31 -85 108 -257 193 72 -8 -92 41 342 -150 33 -34 223 270 203 -217 14
2077 14 93 -113 -133 -117 132 180 -41 -157 -66 143 124 102 -228 -57 70 257 -80 -314 153 -135 -43 1 11 -186
2101 -186 1 112 -145 -59 -275 -108 -117 -373 -51 -146 -71 -279 -54 141 19 -34 21 175 -39 80 -61 292
2123 292 30 -59 62 159 -134 -27 -49 -176 -39 -26 114 249 80 210 -40 -108 92 101 79 -159 -50 -87 56
2146 56 71 -301 -36 -30 -51 -64 3 40 -61 87 90 36 81 83 85 231 59 -64 -107 52 101 -115 240 35 -276 36
2172 36 -225 -159 -111 -133 -149 112 81 -50 -33 -17 -55 88 -346 -170 37 -191 15 -140 -58 -101 -71 41 -244 -36
2196 -36 -107 57 82 75 -16 -131 -33 -25 162 52 -76 -159 102 261 111 67 2 154 145 93 -62 -17 196 120 -55 -59
2222 -59 -168 85 221 -169 50 77 -34 -30 123 -370 -10 2 -81 -69 90 132 -149 -27 109 -17 -240 -186 -13
2245 -13 -226 -12 98 -45 -31 -218 108 -79 -69 -72 27 122 -257 -178 116 -205 183 126 -53 -29 143 -58 -8 -67
2269 -67 -40 55 -278 -12 -8 -36 -78 -27 87 -183 -61 83 8 39 60 -124 111 19 373 165 258 -25 -106 247 149
2294 149 120 -182 152 170 -99 166 -74 -122 -83 -139 268 -99 162 273 -158 199 75 187 129 -46 123 -16
2316 -16 -110 -124 -229 -77 -115 -139 -110 -92 -201 111 -123 -4 84 -271 -65 -168 -74 -29 203 -22 147 106 -64 -29
2340 -29 -108 10 145 28 -242 -15 -174 94 106 3 -38 -171 54 -27 -147 -19 12 -116 -116 -108 315 61 -10 22
2364 22 167 69 64 124 -109 186 283 -128 40 92 288 144 -230 -43 175 -106 -65 -53 129 -45 101 8 -5 -190
2388 -190 -162 -277 63 168 -19 4 -196 -155 -13 -117 -121 -240 -102 44 -299 -229 143 -11 137 73 26 337 84
2411 84 -227 111 -100 -1 -127 72 99 87 -163 -172 270 149 -184 43 8 -17 79 -225 -66 223 -5 45 37 -195
2435 -195 87 73 -254 -40 -11 -106 7 -30 -71 55 35 -61 32 47 76 149 32 124 -50 -107 14 -58 -99 163 -145
2460 -145 -168 3 -30 -22 -150 -30 25 -130 112 -134 -103 214 -172 -74 -180 110 -49 -29 -282 -213 -165 -51 17 -50
2484 -50 86 -188 -1 175 122 190 -143 108 -9 44 -80 -353 -174 -284 22 52 -166 -71 198 222 230 62 -17
2507 -17 102 35 141 94 174 -55 105 65 102 184 -16 158 111 171 42 113 -63 -76 -210 -52 115 56 45 6 187
2532 187 -82 248 -19 -128 -97 24 -26 55 138 -64 -113 -56 -38 12 19 -267 83 -164 96 -21 -169 15 101 -126
2556 -126 -215 107 -187 -20 -137 -229 -80 -5 -11 -52 293 -17 105 117 3 52 138 -211 94 53 238 197 22 172
2580 172 82 -42 188 -98 134 -333 -78 204 249 -76 93 -259 -162 29 76 -49 66 25 2 101 2 -173 -119
2603 -119 146 -130 190 89 -134 191 17 -11 -43 -25 28 -311 -109 15 -238 -76 -119 -146 93 -204 -254 -88
2625 -88 -131 -74 -406 -206 -184 57 -162 -45 -85 -158 -32 156 -72 86 47 -131 55 46 -150 203 114 101 157 307
2649 307 116 -118 -32 1 72 217 -246 -71 26 -103 87 -39 12 315 14 -19 81 -118 12 179 -73 92
2671 92 -218 -423 -168 302 -95 51 -38 -157 -2 145 -142 229 24 -75 -176 -50 -98 -295 -145 -12 202
2692 202 -103 114 27 -199 -22 80 -39 174 -9 -160 -108 -65 -183 -7 -55 -208 106 28 101 151 78 46 7
2715 7 -23 -29 -34 201 259 117 37 244 -48 -61 -4 208 2 201 65 -46 266 146 -120 70 79 -146 -40 -17 -109
2740 -109 -67 156 -204 -5 99 246 -144 -81 -67 -255 1 -50 124 109 26 206 -27 -263 -33 -120 -48 -119 45
2763 45 68 310 -176 -204 36 -157 -185 31 52 210 194 36 -5 97 -111 -155 -126 -274 -234 -235 50 -219 0 106
2787 106 269 275 77 -59 68 28 -108 -159 91 -34 36 47 -149 62 108 -39 345 97 37 -1 156 189 93 90
2811 90 -194 282 115 72 -94 -46 140 132 101 -73 50 -44 184 -16 -157 -112 -201 -63 -231 -13 111 -61 -277
2834 -277 87 -1 -34 15 -11 -254 -224 -50 -155 -69 -325 -64 -222 -106 182 46 -181 134 81 83 -164 28 -37
2857 -37 -49 -7 -43 -77 -234 -125 69 92 -96 -34 16 -147 167 -19 227 22 -88 148 139 30 29 -1 -5 263 113
2882 113 68 148 111 -1 -49 135 63 -327 200 124 -65 -29 19 -95 -5 2 -74 -2 -168 21 -184 -189 -142 162 -209
2907 -209 -39 -69 -63 -36 29 12 160 187 -50 -55 -11 61 -185 -199 -54 -99 81 -61 -166 85 102 -78 174 129 -64
2932 -64 117 -87 -60 -193 183 -59 -44 70 127 100 -156 -144 73 -157 -118 95 -248 137 58 67 -9 7 92 -50
2956 -50 48 214 -32 -64 6 -70 -2 48 -84 -24 101 102 180 96 32 -114 242 -60 -122 141 -199 46 -37 -114 -147 -52
2982 -52 79 48 4 125 -95 14 -9 -62 40 -47 -239 -99 -233 -72 -119 -82 -160 9 -89 -170 18 -42 121 -49
3006 -49 182 213 -20 22 213 -30 59 -16 -98 108 128 9 117 110 128 -27 -113 24 146 211 243 53 40 -63 78
3031 78 -70 135 258 100 -139 69 51 -9 236 -93 -72 14 -48 11 -296 13 46 -103 183 -244 -114 19 113
3054 113 113 -169 -57 48 -164 -86 99 -148 -52 37 -28 -13 -78 131 -210 13 -171 -45 -49 97 -49 -179 4
3077 4 -56 -95 74 94 164 -107 -97 -242 76 -140 125 -249 -77 -41 21 32 65 155 124 145 59 -44 161 176 131 121
3103 121 -28 222 129 20 99 202 -75 95 171 -17 43 116 -8 -300 -112 -98 134 -4 -140 -175 -104 67 -138
3126 -138 48 -236 -260 10 -72 -165 -133 53 -117 -117 -152 -88 56 -270 43 -273 -152 -44 -267 -90 -84 -103 -196 57
3150 57 67 -68 117 -115 -107 -98 125 -126 76 33 -55 51 -94 -97 -106 -194 14 -38 248 -1 51 -203 313 -85 43
3175 43 153 -61 262 -31 -101 -48 99 -7 98 130 -106 -67 178 -94 -170 -98 -52 43 53 63 190 115 135 129 -168
3200 -168 -33 44 110 -14 -137 54 -73 -9 153 -128 -267 9 -97 -60 -140 -12 217 -125 116 -13 -157 -133
3222 -133 55 -133 -140 -70 81 -170 248 285 -13 -85 99 -336 35 151 0 -177 -82 213 70 157 123 17 256
3245 256 220 131 -222 -18 -54 44 118 -31 202 -137 33 56 196 129 1 66 202 52 207 -286 -175 175 -158
3268 -158 64 147 -86 116 -147 75 -87 106 -96 -40 -149 86 -27 -354 3 -273 100 -55 34 -104 -36
3289 -36 -276 -190 -17 -18 -46 -119 239 -18 17 137 -61 -68 -167 -165 -202 33 -157 -202 83 66 199 -152 23 -64 84
3314 84 0 -187 110 245 -109 -109 -44 150 1 -32 122 -26 305 -11 209 -122 45 -17 112 375 115 -20
3336 -20 -44 -15 -149 -87 8 303 89 -61 -209 -223 92 77 70 -103 -30 82 -13 -168 55 -52 -38 -52 -44 0 124
3361 124 -52 -40 -164 25 -47 -16 -19 -7 58 28 1 -80 -52 -110 -103 -28 -4 -80 -157 148 -56 73 -78 -54 45 184 81
3388 81 -45 131 131 -75 -32 19 -291 6 -20 -117 73 227 38 -67 15 -46 114 200 -99 44 144 31 148
3411 148 180 -73 137 172 231 -29 -95 -8 -181 -94 111 -97 6 -218 0 48 -6 -272 -133 -77 -37 -149 -271
3434 -271 111 -164 -2 -110 123 183 299 -72 -124 -121 -268 -272 -14 -53 123 105 -87 -12 -50 -149 149 -11 100 -5
3458 -5 28 -40 -182 -107 47 39 132 71 -60 301 -3 95 278 49 154 45 179 14 241 83 -43 21 136 137
3482 137 -91 -22 39 67 70 140 -86 -39 -39 161 160 -68 154 18 163 -160 148 113 -3 51 3 16 -46 -113 234 -283
3508 -283 99 -84 42 -38 -233 -164 8 -85 -181 -177 -231 -44 -1 -75 -222 -47 -132 133 157 -124 -165 39 -27 -210
3532 -210 38 212 28 -139 11 -112 40 199 42 -129 -170 195 114 -15 -77 -17 -6 196 -249 -6 42 85
3554 85 42 25 -41 -105 62 190 -35 151 46 17 136 -231 51 197 18 110 -114 -67 45 -30 227 -3 -185
3577 -185 211 86 -177 22 74 24 -38 68 0 -60 -135 49 59 -179 -45 111 -107 202 -241 -121 -22 81 22
3600 22 -104 80 -258 -124 -294 -128 -163 -22 -166 143 -20 -227 -44 -78 28 -25 242 22 234 114 158 8
3622 8 -41 185 99 160 -66 -6 37 -34 80 -75 167 -142 264 -24 121 -1 -174 207 -45 107 -67 200 136
3645 136 99 -191 64 -168 -62 172 148 -35 50 16 -235 -132 3 80 -148 152 10 -4 -151 125 116 -143 -68
3668 -68 158 59 145 97 89 -52 -191 -303 -61 -143 -76 154 24 207 -99 133 58 -49 97 -164 -71 -25 -30 -24 -19 15
3694 15 135 -117 -174 178 129 84 264 -42 -180 -7 -82 37 33 52 -64 -29 -137 39 -48 167 -109 -379 -108
3717 -108 234 93 -53 -90 -45 -214 63 36 30 -47 -244 25 -236 -57 72 257 41 -83 -275 -93 -253 -483
3739 -483 61 -183 -92 -305 -202 69 107 50 -12 -90 -25 -186 -118 -182 -31 -7 6 149 -199 -59 -95 -165 -1 79
3763 79 11 -37 110 96 140 73 -50 -389 -180 56 -20 44 74 -189 226 -145 160 -4 -118 50 106 15 18 -3 -44
3788 -44 -13 -22 -17 6 -138 29 -13 -15 60 49 16 -207 141 -56 -143 38 117 -168 -52 -152 -50 0 248 118 134 -38
3814 -38 -9 284 -15 -62 -145 32 59 35 11 -123 101 12 10 173 20 -75 -124 58 -20 11 -54 115 119 93 -38 49
3840 49 162 -99 41 -12 -11 -54 2 168 21 -32 102 24 -32 80 -46 132 -288 13 76 129 -66 111 -29 93
3864 93 -41 -289 132 97 85 57 6 -114 -21 -81 88 9 -132 267 42 77 36 -56 122 -16 36 -62 87 140 -80
3889 -80 46 44 -279 -36 -188 -24 -21 -94 -8 118 -166 -159 -148 214 -122 -33 -43 -119 89 237 84 -83 23 -48 107
3914 107 138 -1 65 85 -50 2 248 161 -133 -62 51 -30 66 216 -115 -68 -16 19 -91 103 252 -121 38 205
3938 205 110 191 -17 -19 90 -6 252 -14 168 -5 39 -11 -32 -74 370 107 99 165 -341 31 -122 -170 159 113 47
3963 47 -49 217 -86 -103 -48 -21 67 68 144 137 181 61 172 -130 -115 97 -75 -125 -112 164 37 -119 -11 -49 -100 -17
3989 -17 -47 -29 123 -187 -23 -33 65 -8 -23 5 194 -11 120 16 77 116 58 41 150 118 128 -54 55 55 -70
4014 -70 -132 52 118 128 1 -32 75 89 -258 76 42 89 172 -59 57 -92 25 -9 7 -51 125 72 -55 28 -109
4039 -109 -40 -234 23 63 133 -41 23 -67 152 34 -11 -37 -156 -136 -15 -17 -28 105 -220 86 -140 28 -214 -2
4063 -2 138 -266 64 -357 33 70 -138 37 -36 -170 64 182 274 163 10 -19 53 66 6 99 -142 -101 -147 -159
4087 -159 -270 14 -4 -21 -60 -219 340 6 161 157 176 -129 79 118 -33 85 4 -4 122 239 185 -8 -14 124
4111 124 -131 -78 -1 185 -151 -23 -84 -85 94 -70 1 278 -151 -200 54 154 100 54 -91 -8 -19 276 -100 -14
4135 -14 146 20 1 -216 62 33 -1 155 -22 48 32 310 -30 -71 189 38 -145 79 -219 -91 -9 39 -143
4158 -143 -193 10 -346 109 -10 61 47 168 25 -7 189 150 240 -122 104 127 17 153 208 127 -284 279 -42
4181 -42 191 265 28 97 113 125 6 18 -65 173 146 -67 -66 83 -11 120 -29 137 35 32 50 -34 -146 38 -89
4206 -89 -71 -71 -164 -203 180 -99 153 -257 -30 -289 77 -11 -83 -69 14 -105 -106 359 -219 9 64 -105 -45 -131 36
4231 36 13 -127 -343 -35 -208 -27 9 -14 59 -299 132 -88 -162 165 -71 -9 78 -23 -42 -99 118 18 132
4254 132 -27 -158 39 12 76 -106 188 235 42 -44 -78 276 229 286 -44 30 -86 -96 -142 -195 -118 304 248 242 17
4279 17 -259 74 84 -125 -166 -24 -77 -34 75 145 -151 -49 -11 12 -22 -51 -142 -238 -113 -80 -53 -182 -61 -100 -74
4304 -74 -39 13 23 25 61 -85 -436 -145 -23 112 -173 -98 -39 -30 314 178 114 25 170 166 290 -185 31 -92 270
4329 270 37 89 -170 198 30 44 -105 -166 -150 -8 2 60 127 -174 96 -123 -191 -130 304 -102 -137 -246 -75
4352 -75 -21 -185 114 -238 80 92 -180 66 -24 56 -160 12 30 -70 -142 -310 -25 88 112 -38 46 47 27 76
4376 76 -50 -150 -13 0 -128 54 -181 -26 -105 -115 79 73 -37 -70 143 53 -362 14 52 4 -137 19 147
4399 147 -28 -16 -78 124 -116 62 -27 90 114 132 48 -59 63 104 72 41 35 -285 103 225 -33 16 114 18 108
4424 108 -68 5 -71 -342 -173 -19 -53 -27 -116 -142 85 85 31 59 -185 -146 6 -47 130 175 129 167 -70 -141 -29
4449 -29 -59 19 -70 -23 80 163 237 57 6 104 -48 -56 8 18 176 17 -43 -152 79 5 68 -116 91 -247 153
4474 153 100 -180 -261 63 21 -75 -113 -206 -177 -138 120 -114 68 180 189 6 -11 15 -26 -55 -23 -58 24 -125 -63 -82
4500 -82 -37 185 -4 -138 2 -2 -147 89 61 70 -162 -102 -153 -217 12 33 -259 48 100 -6 83 -112 171 26
4524 26 41 -42 -157 -112 2 56 81 143 0 108 10 128 -103 153 210 32 -103 -19 -71 -62 -153 -59 -139 -176 3 -66
4550 -66 -30 14 88 -13 -39 110 255 -7 21 -369 -70 -228 -93 -43 92 158 197 -170 178 38 2 66 -56 24
4574 24 49 -31 87 -83 31 147 293 23 -47 43 214 -14 172 35 -141 -94 -174 -65 -75 -131 -76 27 -172
4597 -172 87 144 80 -19 89 -55 -116 100 -20 23 29 -55 -121 -15 -11 -144 -217 10 92 223 -406 -188 212 173 35
4622 35 74 101 -220 -8 -59 -18 192 42 10 143 -176 -114 168 20 -286 -54 84 55 145 63 76 -149 71 3
4646 3 -77 -10 83 -185 139 -110 -87 -50 108 -58 59 110 123 86 -162 -81 -8 -97 43 -20 -11 -196 99 98 49 -69
4672 -69 -62 13 -157 -127 -202 -120 -178 183 -95 -139 144 -86 31 163 240 -41 176 28 -22 -48 125 -37 -40 143 80
4697 80 -81 -259 -83 178 -7 92 -144 -51 -56 100 -31 -77 186 60 107 -109 -218 -157 203 76 120 157 -118
4720 -118 49 -71 -94 -98 -34 -113 -99 -172 37 -4 -176 -41 188 -6 77 -52 -80 118 -248 1 -135 21 -102
4743 -102 10 10 98 59 -272 -90 24 -50 162 -172 -77 -64 -181 53 -140 -85 -116 73 85 -35 -51 -92 -80 -180
4767 -180 78 -55 0 -80 191 21 162 -210 -135 146 -49 -286 -115 -67 -8 17 -211 200 -135 294 61 71
4789 71 -159 -5 173 144 49 -40 -28 131 101 -239 -9 -102 -2 163 36 -38 106 -174 103 45 148 -27 -104
4812 -104 -120 118 150 -36 123 66 2 -134 7 17 157 -195 314 -115 17 -199 -136 -141 -215 49 51 -54 31 41
4836 41 8 -13 100 38 -117 54 -50 -44 -148 21 42 34 -18 -21 61 89 -113 60 24 -95 17 -1 -71 124 -102 9
4862 9 -206 112 223 -99 -114 -176 137 166 172 273 41 -142 103 -22 125 0 -4 -47 92 79 -95 -20 -69 245
4886 245 50 71 26 -115 -222 57 44 -9 -102 -77 -41 49 -164 -266 -3 -99 -346 -167 40 -177 218 -83 107
4909 107 22 234 -143 -188 0 -212 -18 158 7 22 249 260 188 23 116 -101 -107 9 101 -103 21 73 128 284
4933 284 -140 41 190 -2 4 65 236 97 -273 -110 -44 99 224 -166 82 170 196 169 -145 -50 -92 -169 81
4956 81 -250 9 -221 152 142 12 95 -36 150 -86 69 -69 -6 37 -78 93 -32 95 -10 178 39 -218
4978 -218 22 106 -54 -267 -220 -56 -159 -245 -26 -176 12 -222 -80 -129 -119 -159 66 266 -113 87 22 31 273
5001 273 -63 148 33 126 130 -239 10 63 232 -24 -78 58 121 -38 74 18 -19 -51 17 77 84 74 83 181 -122 -40
5027 -40 81 30 216 -103 -22 122 -83 -21 38 -222 -112 143 -97 127 255 -206 48 109 -311 153 -217 115
5049 115 40 53 120 68 111 109 -20 -98 31 29 -78 -44 -80 -235 -51 111 -7 174 -147 -77 -13 59 163 -13 62
5074 62 -98 97 -154 11 30 7 -165 18 120 -65 -60 75 -141 109 138 123 -117 25 -121 -165 196 -250 -40
5097 -40 -40 -87 -113 30 -3 -57 -62 -48 -121 -90 -54 150 9 267 0 -31 7 -194 54 -112 -58 86 -87 -2 -73 7
5123 7 5 -108 -124 -33 -212 32 -18 -140 -109 -102 -3 -12 190 229 -211 171 -132 71 -94 -98 -77 -31 162 -111 -30 -262
5149 -262 67 -142 -209 -26 -224 -113 -32 50 207 136 51 -38 -229 -61 76 -67 -122 25 85 108 265 102 71
5172 71 63 -149 -3 10 -90 -37 169 -143 22 9 34 13 206 -189 199 80 -281 264 -64 -219 231 39 -60
5195 -60 -148 317 50 -60 -119 -188 -217 -221 -60 -51 117 70 112 -1 26 115 138 -195 -215 -31 3 -90 147 54 235 2
5221 2 -90 123 -135 32 -91 -26 -96 -105 106 66 214 -123 -78 -142 282 147 130 -37 57 -54 -111 144 -1 -265
5245 -265 28 211 -55 -50 51 101 -5 -74 19 248 -118 -69 -111 105 40 -145 -203 -4 -49 131 -85 164 183 125
5269 125 -27 7 63 -162 49 -183 -134 -119 121 -174 -235 -126 191 -113 200 66 -75 -92 132 14 -23 148
5291 148 241 200 46 35 3 106 -209 -108 7 95 279 -32 -41 -80 -61 221 102 35 -89 93 59 -100 20 -77
5315 -77 -161 111 -57 128 22 183 -193 -33 -63 184 51 22 38 -171 87 25 264 -29 77 -110 1 -74
5337 -74 -43 -159 42 26 13 -104 -75 -62 73 117 133 140 -16 73 -114 20 -101 -20 -54 -178 93 118 -170 -180 -147
5362 -147 103 -21 -132 -5 -36 90 69 82 -26 -172 -90 -232 63 85 -178 95 141 121 -29 37 -47 -115 62
5385 62 225 -151 -50 -6 -135 -247 126 130 -237 121 81 -18 224 -339 -22 -60 -157 64 -34 -120 33 147 -54
5408 -54 -154 7 29 -53 -46 85 64 14 197 32 -145 -50 -7 -66 148 -72 -83 -59 66 -177 -127 -122 -85 -72 109 -75
5434 -75 -209 42 104 -190 -77 111 15 14 -114 36 -122 -34 -45 62 62 -140 11 -71 103 228 -96 62 229
5457 229 -100 234 -52 73 259 6 -51 -30 -111 -369 -20 284 -224 25 37 29 -183 -222 -131 -9 -100 -88 233
5480 233 -124 221 -26 80 141 -171 75 -169 -14 -83 165 228 -6 4 27 41 63 178 -167 63 -18 104 232
5503 232 9 0 28 -89 -102 -84 89 85 -96 -166 95 -176 -147 34 -123 197 -81 48 258 183 141 26 0 -28
5527 -28 -233 -11 -36 -218 4 -51 54 152 -151 131 204 23 54 -176 -115 -15 -176 -230 48 115 -200 -225 -91
5550 -91 204 -67 -177 -16 -77 157 -192 -179 46 -317 -46 -140 -77 -83 1 194 281 175 -23 49 -40 -47 -134 28 -119
5575 -119 68 72 -47 -154 -64 64 163 -34 -129 -24 -48 -68 90 -110 121 -83 196 -71 104 176 -106 69 -9
5598 -9 180 255 177 -186 -109 151 -135 -3 -79 -79 -35 -265 62 135 -62 2 -138 -28 12 -31 -223 -44 -85 -134 -22
5623 -22 -128 136 11 31 121 69 -158 -8 2 93 188 -10 48 -164 -8 -94 -319 -191 -194 -24 -160 62 -173 -132
5647 -132 141 -226 302 180 78 29 -186 100 27 52 -162 171 -8 -62 -91 -91 -194 202 146 -85 -14 43 -3 185
5671 185 14 -45 36 221 -53 78 -45 106 253 -236 -26 79 269 283 -125 -73 -180 1 94 -30 36 -143
5693 -143 -150 211 73 -69 184 -165 -137 -23 -211 -184 -50 -22 -82 49 43 239 29 -96 -96 -39 -155 -16 -18 13 149
5718 149 35 62 -157 -36 -2 -10 -288 162 133 -29 59 52 140 -12 -66 -23 -159 -98 155 -9 -1 -63 -44 111 79 194
5744 194 -198 102 -32 340 -182 -31 80 -63 40 43 -114 -133 21 -85 -14 69 -218 -125 -47 53 152 86 -303
5767 -303 110 -172 -22 -64 48 163 -143 179 40 75 36 70 169 148 -138 -46 81 -160 -94 -95 -15 45 326 -129
5791 -129 20 -32 -30 -76 -67 -164 -22 -195 -95 115 -108 15 51 76 52 -74 -76 125 95 10 -209 -90 41 -163 79
5816 79 41 179 -118 200 14 -177 -147 -246 -12 48 171 6 99 8 -91 1 143 -12 50 -13 41 138 -66 275
5840 275 123 -23 -153 133 26 -67 -30 77 -187 -181 235 -93 -158 200 -105 -235 36 176 -132 236 26 105
5862 105 -173 107 -162 -103 97 -12 -18 118 41 -40 -109 51 26 5 30 6 80 103 -115 -105 194 -4 122 11
5886 11 215 44 -70 -35 -78 89 56 -183 42 109 -125 -23 -158 141 -141 143 145 142 -52 -60 345 28 -146 -88
5910 -88 -4 -47 44 30 -56 -59 -157 191 -150 173 -167 55 -15 -13 -68 -304 72 -56 -82 54 -132 -49 130 -61 96
5935 96 -114 -238 141 63 94 -147 -76 -169 38 31 -116 119 99 40 32 59 168 -124 89 49 -188 209 61 -49
5959 -49 230 -29 -11 149 -166 -166 36 111 -79 107 7 -271 -6 210 48 -270 84 204 0 -165 -41 -54
5981 -54 22 -116 -141 310 1 -33 22 133 -43 -47 -56 64 -22 161 80 -93 -79 100 34 -279 -6 -156 -93 65 -165
6006 -165 -76 -304 -34 -18 -44 58 -257 -61 15 225 -90 154 -189 -136 228 -19 215 -7 35 -8 -65 -21 195
6029 195 -25 -82 199 -56 -104 56 119 6 -126 -66 -75 -57 224 183 -106 -115 -91 -37 -74 -85 -15 250 -191 -48 103
6054 103 -101 60 6 -149 3 78 40 -85 41 91 -198 49 37 -65 171 -70 169 96 64 -228 152 -248
6076 -248 -152 -152 -96 -16 11 -120 80 -13 29 -31 -75 64 -295 124 61 -22 0 135 -3 179 93 -84 -94 -117 -40 -205
6102 -205 -231 62 186 -175 -24 204 -136 -261 -116 131 82 -164 -60 17 83 -104 78 108 78 -133 29 17
6124 17 -68 114 -95 89 -103 124 -272 -128 398 -29 135 -30 -75 -93 62 -334 -286 -148 160 110 191 54
6146 54 27 -55 -124 41 48 -247 108 -74 -157 -38 -64 104 47 -144 30 157 -29 -74 -28 -157 -22 -116 64 -67
6170 -67 157 -156 -60 -45 61 74 12 -130 -244 201 169 -225 -5 174 142 57 -107 20 3 -84 135 -18 -64 -103
6194 -103 18 35 -58 -60 112 226 -18 -161 61 34 -84 17 -37 -52 -56 -1 -234 -219 -82 112 -64 -141 107 -125
6218 -125 78 199 152 -87 -36 37 -36 0 43 -51 30 22 -50 13 -17 0 135 118 77 -154 -18 -46 59 -65 8 -100
6244 -100 -85 -4 110 207 -91 -78 -111 93 224 -59 -278 -42 95 -59 -137 -9 -75 221 27 53 96 172 -34
6267 -34 60 34 264 154 235 -11 -65 284 193 22 66 -250 3 -35 10 86 43 -109 62 148 204 208 187 39 61 -48
6293 -48 -21 287 44 35 11 -104 96 52 -96 183 44 -212 -92 129 27 226 -226 -37 -240 -38 -51 52
6315 52 -162 109 -110 93 80 213 11 25 118 -123 -58 -211 0 -41 -131 -133 -82 163 -201 -87 -11 196 137 -112
6339 -112 39 -96 58 208 -122 -76 -9 100 -207 2 -50 -45 128 -58 -81 75 36 1 -24 -3 36 116 -127 -5
6363 -5 66 -21 -16 -53 36 -56 -236 -12 126 21 -85 -224 2 -295 6 32 80 -13 43 143 30 -70 80 159 -261
6388 -261 46 -197 -255 -51 66 -97 -107 -167 26 7 -58 -35 39 -30 -148 101 -35 255 -171 61 9 -9 54 2
6412 2 -74 87 -143 89 -44 -165 44 64 169 -156 94 -5 77 -7 -11 -149 -96 202 -76 -119 -86 17 194 -76
6436 -76 181 -271 -203 -149 46 -42 73 -153 -12 -22 -113 104 -127 33 -27 -226 166 -122 88 288 265 54 39
6459 39 93 -58 3 -249 44 -160 -50 -22 -134 -86 -5 79 103 -195 -53 -38 -151 -272 -191 -86 -167 -57 12 -169
6483 -169 -247 -22 -41 -69 106 -56 145 30 -127 5 51 18 227 150 10 -48 -28 156 96 21 -216 -189 -28 -89
6507 -89 95 52 -66 72 227 165 -131 214 -118 42 -147 -134 82 -280 52 73 23 -71 108 -141 -173 -140 -72
6530 -72 -40 170 -145 54 -86 296 -72 4 -9 26 36 4 190 -10 168 -103 -10 128 -2 126 240 -131 50
6553 50 173 165 -20 62 118 -6 -35 210 -93 -78 -94 133 179 -32 9 -179 -230 99 244 -84 -246 79 -47 -2
6577 -2 189 93 -21 -66 143 -212 -23 -117 227 150 12 -60 24 209 -203 -180 138 133 114 -70 -180 -272 36 156
6601 156 -32 -57 -61 141 -272 45 -212 -184 -52 -15 -136 -119 -171 283 -94 -207 38 -270 110 -16 179 18
6623 18 -57 -23 33 44 -195 -139 -19 -289 100 -131 57 46 91 227 -136 -25 10 -42 322 -109 -42 182 -47 -94
6647 -94 -237 -165 -211 80 -96 3 34 29 -60 111 -72 8 94 -133 -135 -79 168 23 199 22 -13 -67 -137 17 -119
6672 -119 210 276 299 40 50 -10 11 -39 -5 185 -335 138 -4 -71 36 -32 41 -48 -250 -245 69 -40 1 41 -66
6697 -66 -110 -68 101 -74 90 -80 68 -160 -49 -173 23 -32 -153 103 -70 3 -13 -78 223 86 170 -18 -10
6720 -10 -150 62 136 70 -6 -7 14 66 88 -111 218 68 36 -282 19 79 -228 167 -274 -150 120 -94 -331 -78
6744 -78 61 -75 148 45 -11 238 118 234 -11 -133 -86 14 -50 -28 -172 -62 26 24 -81 115 -101 174 -24
6767 -24 156 179 -181 -30 -117 157 -129 167 238 79 18 130 -167 20 -27 -165 -101 -50 53 -94 89 -33 -2
6790 -2 -38 25 -72 -3 -254 195 110 213 -59 52 -24 -164 285 -96 304 251 -107 -14 -16 43 -232 218 11 -5 33
6815 33 163 97 117 5 29 -23 -38 44 5 47 -86 -56 19 73 27 12 4 -15 -114 -69 145 69 -36 105 -21 -109 107
6842 107 152 -143 -86 -162 101 8 44 5 -99 -70 12 15 130 60 -284 -49 -32 -13 56 140 7 82 -116 8 -87 -127
6868 -127 30 11 21 -53 -136 -23 -117 -72 -20 -45 139 19 -128 -62 102 193 9 7 -38 21 156 -181 -180 -151 7 90
6894 90 -36 -43 -139 -5 -88 248 65 -110 181 -150 104 137 -84 -289 -265 -244 80 -77 -24 -273 116 -100 147
6917 147 44 58 -41 59 -7 -170 78 -151 48 11 36 -228 -26 -115 67 27 6 10 70 -100 113 -179 283 -34
6941 -34 76 84 -11 21 44 41 -259 152 53 -113 -5 50 81 216 -106 10 -84 -38 -75 102 254 34 -143 -48 118
6966 118 -127 -27 113 -165 68 -103 -24 98 -104 -105 104 -17 -138 137 102 59 69 4 -140 -221 89 -108 -67
6989 -67 -142 9 -60 43 152 -11 -20 -14 169 -135 224 126 91 -14 1 -201 -243 75 -46 182 3 -47 -57 -51 -70
7014 -70 61 107 -18 -86 -47 -215 -40 -100 -31 163 13 261 -137 122 261 -48 -98 -195 -179 -77 -94 6 -243
7037 -243 -79 -87 29 63 -15 22 -285 -59 -57 67 94 -47 83 -100 -129 -202 129 123 37 89 187 -73 37 -131 -183
7062 -183 94 140 98 202 -30 -37 -11 -119 -39 25 -105 -55 120 134 -7 99 -116 -159 181 -63 -247 200 -181
7085 -181 -14 113 97 -89 47 -175 -26 24 -55 -144 160 133 -111 119 -25 -43 131 -106 -9 -91 18 223 87
7108 87 24 173 7 -249 189 -208 59 -134 123 -36 -102 31 126 -143 -77 219 -44 189 136 115 35 -166 -55
7131 -55 -279 -167 328 -2 124 -101 72 -57 -126 -119 81 168 -35 117 89 -215 -25 -110 -72 82 -33 188 -47
7154 -47 -81 30 5 -72 84 39 115 46 -241 8 -122 -85 40 -60 -94 -94 60 78 -106 -40 -92 -73 -86 -251 116
7179 116 -6 175 190 106 93 -30 116 102 -101 144 -116 -183 65 194 53 75 -227 -153 36 116 129 7 -57
7202 -57 -50 113 0 -50 -38 149 -184 -213 119 156 -20 -127 -12 22 -83 111 75 146 -40 -7 -18 32 -63 21 127
7227 127 -182 -17 -96 100 152 169 122 75 -90 35 -57 26 -72 213 54 -109 164 -25 126 104 -264 7 -67
7250 -67 -14 128 -55 -60 160 49 -273 -42 57 95 -29 43 -21 286 -31 96 23 104 151 104 82 197 25 -217
7274 -217 74 83 -70 65 -124 40 67 18 51 9 -48 -119 -57 -203 -45 205 37 79 31 221 -76 -65 100 -86
7298 -86 15 -40 -110 76 -45 -185 -55 -24 22 44 114 -143 28 259 -152 -352 -71 -120 51 80 -99 143 -138
7321 -138 -66 6 -149 -12 106 -153 26 -6 -109 -133 -111 118 11 15 -40 -119 27 110 103 -112 215 -56 82 -112
7345 -112 -214 -76 -77 -64 -39 -219 152 113 92 -21 -55 49 248 69 -126 12 -162 -51 -129 -53 124 -88 -39
7368 -39 -129 8 -98 -181 -34 -47 -105 -159 -54 198 65 54 -76 65 -138 42 57 -43 65 69 -50 -61 -61 130
7392 130 109 253 37 102 19 -46 -235 -202 26 -9 34 19 -115 108 -25 138 88 -181 -113 -124 -199 -302 -75 91
7416 91 28 -103 105 -204 29 150 -144 -309 -92 -153 114 -60 181 -194 73 -143 -204 -176 21 -296 299 157
7438 157 -232 32 268 -100 249 38 -39 -56 -18 170 96 81 -42 -41 11 32 95 36 -190 -159 -142 74 -67 -52 65
7463 65 69 -129 67 -156 -7 195 -178 -64 -205 -62 -65 -77 128 -84 80 216 6 -15 31 -52 -26 90 -65
7486 -65 -281 -102 30 -94 -109 95 73 77 126 25 -164 60 -20 95 -29 -42 186 -86 -275 -40 -165 -95 -17
7509 -17 135 42 45 25 192 -243 0 -57 103 246 91 -62 -113 146 -211 -28 -28 -138 -116 28 34 -24 -73 -242 -34
7534 -34 -19 -33 30 82 -108 22 -21 38 168 -32 15 -185 -88 -129 -71 -132 117 -95 174 -105 -126 105 -94 -260
7558 -260 -79 112 -136 -41 83 39 -49 -137 1 -36 31 -8 55 -55 42 25 -93 51 -6 -21 129 40 -270 25
7582 25 233 213 21 -221 -113 -49 4 -232 -145 -11 -107 85 34 -70 -58 36 161 -141 45 58 34 -8 50 -17 -39
7607 -39 -97 -72 160 -19 64 -58 -20 59 156 -106 17 -145 -103 140 -55 125 -103 -104 124 -266 13 125 -52
7630 -52 103 -170 -81 54 150 -140 -138 105 -132 -159 -146 -78 73 109 -101 -28 -69 -75 8 18 -69 -75 201 -8 -31 -171
7656 -171 11 -366 91 123 19 50 -35 -54 35 -88 198 -88 -84 97 31 -35 174 116 -201 -140 -193 31 -40 -15 -50
7681 -50 53 -188 -11 65 -39 -80 79 -6 -172 93 142 -176 151 -207 292 -7 66 -58 -140 250 -83 -89 21
7704 21 149 65 -210 -256 62 -160 38 -64 -117 -27 -206 191 -78 45 -119 59 129 -1 -22 -61 -19 -86 -145 56
7728 56 16 55 -62 -71 -131 -139 -61 -206 -14 -4 229 -125 -72 1 90 -85 16 -94 34 -91 189 -26 -103 -15 -146
7753 -146 -1 7 -194 -11 194 106 -300 44 38 -177 23 -107 -52 -126 -119 108 -161 -334 -182 236 158 -34 36 -73
7777 -73 -81 145 -59 -11 -208 52 24 79 -89 103 -67 -123 -94 -83 -23 87 -27 32 157 25 83 -94 8 132
7801 132 53 271 -1 65 -196 -192 -45 -24 0 -38 -82 -31 -170 -31 -5 78 -62 48 107 65 -174 -96 76 56 -317
7826 -317 -78 44 -115 108 -12 32 239 66 49 105 -49 -184 193 -4 -64 -139 -90 -157 15 -59 36 279 -111
7849 -111 129 198 101 35 134 -12 253 180 -227 216 41 -81 -156 -310 35 137 -150 -334 286 13 69 19 30
7872 30 -15 -38 -151 29 181 -76 0 -3 -161 64 52 -162 31 -125 48 -11 257 -107 174 151 202 -112 15
7895 15 -38 -74 103 -89 90 -15 123 -14 170 32 51 91 75 -60 -159 59 16 2 186 254 -64 -136 -8 -7
7919 -7 63 -203 117 221 -103 -138 26 -151 -222 142 -30 186 -79 362 -69 305 -64 -1 -99 60 -42 -40 -103
7942 -103 81 -119 36 25 -25 178 239 -55 49 -120 -30 -161 -46 79 -54 -266 69 -115 -19 148 -186 -28
7964 -28 -89 -79 111 192 -27 -65 243 -165 -284 -210 13 98 -197 47 -15 146 87 173 27 147 -218 186 -99
7987 -99 120 150 -134 254 177 57 -35 159 -163 -121 31 -12 -50 188 -67 -86 107 23 -180 -71 83 318 -97
8010 -97 -79 117 69 -111 -111 -141 -87 -52 -179 -65 -185 51 -61 27 -88 -141 -124 -172 -43 90 6 186 164 -47 -154
8035 -154 -32 -24 193 65 -140 38 118 12 -279 162 -1 -103 237 -86 -89 0 -103 303 -86 2 -145 -55 -178
8058 -178 156 -138 40 -138 57 72 -143 290 90 -174 -202 133 -110 -96 -31 121 229 64 39 -221 154 -75
8080 -75 103 44 5 -112 219 -87 -104 -156 95 -147 -233 129 -52 -139 112 39 -27 84 -151 96 -113 79 99
8103 99 256 -99 -227 -54 -14 -19 -16 -47 61 -4 11 -20 -161 166 140 108 131 164 181 -51 129 24 134 64 158 69
8129 69 66 -175 -272 78 23 133 116 67 -319 -93 -24 -9 123 -53 -100 -112 0 -208 -190 86 -54 32 197 141 182
8154 182 250 183 -28 -7 10 94 -185 -36 -10 61 -225 16 -14 86 187 38 91 161 3 -29 146 -225 -144 201
8178 201 204 -14 149 122 26 99 -112 195 -123 120 -118 171 -109
8191a09
##END NTUPLES=NMR FID
##END=
