##TITLE=1H_SR34+C
 CDCl3,8 sc, 
 4.03.2021
##JCAMPDX= 6.0         $$ Bruker NMR JCAMP-DX V2.0
##DATA TYPE= NMR FID
##DATA CLASS= NTUPLES
##ORIGIN= UXNMR, Bruker Analytische Messtechnik GmbH
##OWNER= root
$$ XWIN-NMR		Version 3.5
$$ Thu Mar  4 11:04:33 2021 Russian Standard Time (UT+4h)  she@DPX200
##.OBSERVE FREQUENCY= 200.1315066352
##.OBSERVE NUCLEUS= ^1H
##.DELAY= (6, 6)
##.ACQUISITION MODE= SIMULTANEOUS
##.ACQUISITION SCHEME= undefined
##.AVERAGES= 8
##.DIGITISER RES= 18
##SPECTROMETER/DATA SYSTEM= spect
##.PULSE SEQUENCE= zg30
##.SOLVENT NAME= CDCl3
##.SHIFT REFERENCE= (INTERNAL, CDCl3, 0, 15.7039)
##AUDIT TRAIL= $$ (NUMBER, WHEN, WHO, WHERE, WHAT)
$$ ##TITLE= Audit trail, XWIN-NMR		Version 3.5
$$ ##JCAMPDX= 5.01
$$ ##ORIGIN= Bruker BioSpin GmbH
$$ ##OWNER= she
$$ F:/spectra/data/she/nmr/H-F/1/audita.txt
$$ ##AUDIT TRAIL=  $$ (NUMBER, WHEN, WHO, WHERE, WHAT)
(   1,<2021-03-04 11:03:45.51 +0400>,<she>,<DPX200>,
      <created by zg, POWCHK disabled, PULCHK disabled
       configuration hash MD5:
       00 E9 B6 7A A2 85 ED C7 34 08 36 98 17 FE 4E 26
       data hash MD5: 16K
       9C FC 79 A4 B6 F2 D7 02 27 6A 92 C7 FD 0C DD C6>)
$$ ##END=
$$ 
$$ hash MD5
$$ 44 52 20 F6 1A 1B 75 20 02 57 9C BF E3 D7 C7 5D
##$RELAX= 
##$RELAX= 
##$RELAX= 
##$RELAX= 
##$RELAX= 
##$RELAX= 
$$ Bruker specific parameters
$$ --------------------------
##$DU= <F:/spectra>
##$EXPNO= 1
##$NAME= <H-F>
##$PROCNO= 1
##$TYPE= <nmr>
##$USER= <she>
##$AMP= (0..31)
100 100 100 100 100 100 100 100 100 100 100 100 100 100 100 100 100 100 
100 100 100 100 100 100 100 100 100 100 100 100 100 100 
##$AQSEQ= 0
##$AQ_mod= 1
##$AUNM= <au_zg>
##$AUTOPOS= <>
##$BF1= 200.13
##$BF2= 200.13
##$BF3= 200.13
##$BF4= 200.13
##$BF5= 200.13
##$BF6= 200.13
##$BF7= 200.13
##$BF8= 200.13
##$BYTORDA= 1
##$CFDGTYP= 0
##$CFRGTYP= 5
##$CHEMSTR= <none>
##$CNST= (0..31)
1 1 145 1 1 1 1 1 1 1 1 1 1 1 1 1 1 1 1 1 1 1 1 1 1 1 1 1 1 1 1 1 
##$CPDPRG= <>
##$CPDPRG1= <>
##$CPDPRG2= <>
##$CPDPRG3= <>
##$CPDPRG4= <mlev>
##$CPDPRG5= <mlev>
##$CPDPRG6= <mlev>
##$CPDPRG7= <mlev>
##$CPDPRG8= <mlev>
##$CPDPRGB= <>
##$CPDPRGT= <>
##$D= (0..31)
0 1.2 0 0 0 0 0 0 0 0.06 0 0.03 0 0 0 0 0.0002 0 0 0 0 0 0 0 0 0 0 0 0 
0 0 0 
##$DATE= 1614841425
##$DBL= (0..7)
120 120 120 120 120 120 120 120 
##$DBP= (0..7)
150 150 150 150 150 150 150 150 
##$DBP07= 0
##$DBPNAM0= <>
##$DBPNAM1= <>
##$DBPNAM2= <>
##$DBPNAM3= <>
##$DBPNAM4= <>
##$DBPNAM5= <>
##$DBPNAM6= <>
##$DBPNAM7= <>
##$DBPOAL= (0..7)
0.5 0.5 0.5 0.5 0.5 0.5 0.5 0.5 
##$DBPOFFS= (0..7)
0 0 0 0 0 0 0 0 
##$DE= 6
##$DECBNUC= <off>
##$DECIM= 32
##$DECNUC= <off>
##$DECSTAT= 4
##$DIGMOD= 1
##$DIGTYP= 9
##$DL= (0..7)
0 120 120 120 120 120 120 120 
##$DP= (0..7)
150 150 150 150 150 150 150 150 
##$DP07= 0
##$DPNAME0= <>
##$DPNAME1= <>
##$DPNAME2= <>
##$DPNAME3= <>
##$DPNAME4= <>
##$DPNAME5= <>
##$DPNAME6= <>
##$DPNAME7= <>
##$DPOAL= (0..7)
0.5 0.5 0.5 0.5 0.5 0.5 0.5 0.5 
##$DPOFFS= (0..7)
0 0 0 0 0 0 0 0 
##$DQDMODE= 0
##$DR= 18
##$DS= 0
##$DSLIST= <SSSSSSSSSSSSSSS>
$$ [...]
##$SUBNAM2= <"">
##$SUBNAM3= <"">
##$SUBNAM4= <"">
##$SUBNAM5= <"">
##$SUBNAM6= <"">
##$SUBNAM7= <"">
##$SUBNAM8= <"">
##$SUBNAM9= <"">
##$SW= 16.9725356469052
##$SWIBOX= (0..15)
0 0 2 0 0 0 0 0 0 0 0 0 0 0 0 0 
##$SW_h= 3396.73913043478
##$TD= 16384
##$TD0= 1
##$TE= 0
##$TE2= 300
##$TE3= 300
##$TEG= 300
##$TL= (0..7)
0 120 120 120 120 120 120 120 
##$TP= (0..7)
150 150 150 150 150 150 150 150 
##$TP07= 0
##$TPNAME0= <>
##$TPNAME1= <>
##$TPNAME2= <>
##$TPNAME3= <>
##$TPNAME4= <>
##$TPNAME5= <>
##$TPNAME6= <>
##$TPNAME7= <>
##$TPOAL= (0..7)
0.5 0.5 0.5 0.5 0.5 0.5 0.5 0.5 
##$TPOFFS= (0..7)
0 0 0 0 0 0 0 0 
##$TUNHIN= 0
##$TUNHOUT= 0
##$TUNXOUT= 0
##$USERA1= <user>
##$USERA2= <user>
##$USERA3= <user>
##$USERA4= <user>
##$USERA5= <user>
##$V9= 5
##$VALIST= <valist>
##$VCLIST= <CCCCCCCCCCCCCCC>
##$VD= 0
##$VDLIST= <DDDDDDDDDDDDDDD>
##$VPLIST= <PPPPPPPPPPPPPPP>
##$VTLIST= <TTTTTTTTTTTTTTT>
##$WBST= 1024
##$WBSW= 4
##$XGAIN= (0..3)
0 0 0 0 
##$XL= 0
##$YL= 0
##$YMAX_a= 124371
##$YMIN_a= -153733
##$ZGOPTNS= <>
##$ZL1= 120
##$ZL2= 120
##$ZL3= 120
##$ZL4= 120
##$ABSF1= 10
##$ABSF2= 0
##$ABSG= 5
##$ABSL= 3
##$ALPHA= 0
##$AQORDER= 0
##$ASSFAC= 0
##$ASSFACI= 0
##$ASSFACX= 0
##$ASSWID= 0
##$AUNMP= <proc_1d>
##$AZFE= 0.1
##$AZFW= 0.1
##$BCFW= 1
##$BC_mod= 2
##$BYTORDP= 1
##$COROFFS= 0
##$CY= 11.3945322036743
##$DATMOD= 1
##$DC= 2
##$DFILT= <>
##$DTYPP= 0
##$F1P= 15.9154993809931
##$F2P= -4.1035820241983
##$FCOR= 0.5
##$FTSIZE= 0
##$FT_mod= 4
##$GAMMA= 1
##$GB= 0.15
##$INTBC= 1
##$INTSCL= 1
##$ISEN= 128
##$LB= 0.24
##$LEV0= 0
##$LPBIN= 0
##$MAXI= 10000
##$MC2= 0
##$MEAN= 0
##$ME_mod= 0
##$MI= 1.114404
##$NCOEF= 0
##$NC_proc= 0
##$NLEV= 6
##$NOISF1= 3.799351
##$NOISF2= 2.8
##$NSP= 1
##$NTH_PI= 0
##$NZP= 0
##$OFFSET= 15.70392
##$PC= 1
##$PHC0= -10751.75
##$PHC1= -1.799057
##$PH_mod= 1
##$PKNL= yes
##$PPARMOD= 0
##$PSCAL= 0
##$PSIGN= 0
##$REVERSE= no
##$SF= 200.130013532006
##$SI= 16384
##$SIGF1= 3
##$SIGF2= 2
##$SINO= 400
##$SIOLD= 16384
##$SREGLST= <1H.CDCl3>
##$SSB= 0
##$STSI= 0
##$STSR= 0
##$SW_p= 3612.71676300578
##$SYMM= 0
##$S_DEV= 0
##$TDeff= 0
##$TDoff= 0
##$TI= <>
##$TILT= no
##$TM1= 0
##$TM2= 0
##$TOPLEV= 0
##$USERP1= <user>
##$USERP2= <user>
##$USERP3= <user>
##$USERP4= <user>
##$USERP5= <user>
##$WDW= 1
##$XDIM= 8192
##$YMAX_p= 0
##$YMIN_p= 0
$$ End of Bruker specific parameters
$$ ---------------------------------
##NTUPLES= NMR FID
##VAR_NAME=  TIME,          FID/REAL,        FID/IMAG
##SYMBOL=    X,             R,               I
##VAR_TYPE=  INDEPENDENT,   DEPENDENT,       DEPENDENT
##VAR_FORM=  AFFN,          ASDF,            ASDF
##VAR_DIM=   8192,          8192,            8192
##UNITS=     SECONDS,       ARBITRARY UNITS, ARBITRARY UNITS
##FACTOR=    0.0002944,     1,               1
##FIRST=     0,             0,               0
##LAST=      2.4114304,     0,               0
##MIN=       0,             -153733,         0
##MAX=       2.4114304,     124371,          0
$$ Real data points
##PAGE= N=1
##DATA TABLE= (X++(R..R)), XYDATA
0@%%%%%%%%%%%Qj6J6j6K4l2L2m0M8n6P2q8J04j20J36j60J84k08K40k76L16l60
33a92M08m59N16n80O48p22Q08r01J000j108J227j357J497j650J819k006K210k433
51a275K680k954L258l599L983m420M923n504O187p008Q013r269J0892j3083J6203
66I027k1008K9396m7933J53631m1406k35440K78104j63226L0125Q7997j23619
77d4352R3706m7266k3639P9666p6934P2028m6667o706N5454j03850P6063j176
89B6327n9379R1451p9849L3604J5448p6855R8511n5754j7174O8431p5854M9417
101A8324j8293k2934N2405p3365N1771k169n2353P5681o6466L0428L2371q2924
113e7524Q3732l8617k9734P3035p5452M1259P802m8850P0110n3422N431L9289
$$ y = [0, 0, 0, 0, 0, 0, 0, 0, 0, 0, 0, 0, 8, -8, 8, -8, 16, -16, 16, -24, 24, -32, 40, -48, 56, -64, 72, -88, 96, -112, 128, -148, 168, -192, 216, -243, 273, -307, 341, -381, 427, -474, 526, -582, 645, -712, 785, -865, 954, -1052, 1158, -1275, 1405, -1549, 1709, -1890, 2093, -2327, 2596, -2908, 3279, -3729, 4284, -4985, 5907, -7176, 9027, -11981, 17415, -30518, 123113, 81707, -153733, 124371, -38855, -8730, 79267, -44352, 49354, 2088, -21551, 58115, -18819, 53209, 6542, -164, 55290, -48560, 27503, 26327, -33052, 58399, -21450, 12154, 27602, -49253, 49258, -6496, -23670, 44761, -31093, 18324, 31, -22903, 29502, -43863, 7908, 5739, -46614, 29067, -37399, -6971, 25400, -57524, 26208, -12409, -42143, 30892, -44560, -3301, 4501, -44349, 25761, -27661, -22230, 17059]
125A7059n2826M1934j5655n152K7167l9155M1244j9468j2924M0328n0316L7754
137I990j83l7386N9790m2249O167L4361m8772L7351j1655j2691L2765l7447K5586
150A5627j122j9656L2932l3196J7370P083k9299L9570k8750J710K5243l8309L1445
163B0648j2032j6122L2508l5116J7346O119k6271L0280k2272L863J3266k8059
175a5842K6286j4827n832K1750k9361J9636l264j6412K5937k4513P801J0476k2246
188b0411K2326j2603k857J5470j9341J4445m609p841J6011j5967J0503N55j0257
201a4576J7252j3711N774O636j4573J7289r123n75J2712j6117J3261j676p890
214e317J5512j3448O329N280j1086J3695p770N70Q502j1669J0307l583m162J0495
$$ y = [17059, -35767, 6167, -9488, -14640, 12527, -26628, 14616, -4852, -17776, 22552, -27764, 9990, 9807, -27579, 32211, -10038, -3871, 30490, -18282, 19069, 7414, -5277, 27488, -9959, 15627, 14505, -5151, 27781, -5415, 11955, 19038, -10261, 29309, 559, 2269, 27512, -10797, 20648, 8616, -7506, 25002, -10114, 7232, 13351, -12920, 17360, -4912, -1049, 12217, -15842, 10444, -4383, -10215, 11535, -17826, 1810, -1454, -17866, 8071, -16442, -8641, 1835, -20411, 1915, -10688, -13545, 1925, -17416, -2971, -7580, -15421, 590, -15377, -4874, -4319, -14576, 2676, -11035, -5261, 1375, -13198, 4091, -5032, -5607, 7105, -9012, 4249, 2573, -5317, 10195, -3253, 3076, 8356, -2730, 10965, 3195, 3765, 12267, 598, 10905, 7322, 3160, 13655]
228A3655j0853O453J603q490J0463p459K19N495q564O207k596k937M970o440L423
243E149j164l421M201n609K377K06m450M759m461l5K311n104L291k539j481K888
259c082m465K687r49k281L668l989J552J051l319L939j961q03L177k731J848L70
275e288j057K352j564J271J309j326K411n28K54J636o30P30J202p6P50O16L49
292B411K31J100j73L10J168j02M11N71m50O85k83L89K26l24J39n22K92j49q35
311E095O08n60m36J92j199J91q55m94o8p11p03m40m45l77q28J05r13o58K20j268
331c544K35k07r07M37q35n1M0j016P18o15n1P95j067Q30j85o66J583p63N43R11
351c815r72J332J35j32J314N5L73O94l08J325J82K03J167l08M43O31J15Q71K76
$$ y = [13655, 2802, 9255, 10858, 2368, 12831, 5372, 5591, 11086, 2522, 8729, 6133, 3196, 8166, 1726, 5149, 3985, 564, 4765, -844, 1533, 1739, -2711, 2048, -2413, -2448, -137, -5241, -1950, -4489, -5970, -3082, -7547, -4860, -5809, -8090, -4422, -8411, -6859, -5808, -9127, -5188, -7149, -7952, -4775, -7506, -5658, -5288, -6345, -3993, -5557, -4286, -2977, -4303, -1892, -2420, -2166, -530, -1160, -430, 772, 696, 1446, 2062, 2411, 2642, 3742, 3569, 3879, 5047, 4945, 5356, 5927, 5477, 6162, 5879, 6268, 6494, 6170, 6309, 5787, 6079, 5930, 5095, 5703, 5143, 4707, 4899, 3700, 3891, 3036, 2542, 2474, 1763, 1060, 620, 175, -202, -1030, -925, -1838, -2496, -2276, -3544, -3309, -3516, -4423, -3986, -4821, -4872, -4832, -5848, -5130, -5745, -5796, -5001, -6068, -5238, -5423, -6089, -4506, -5269, -4726, -3815, -4787, -3455, -3320, -3452, -2138, -2083, -1710, -1016, -1324, 1, 183, 386, 1553, 1245, 1688, 2319, 2434, 3305, 3581]
370C581J9N96l29O87M01j21J96L17k37K08P5l64J09j42k07n1j39l77r5l34k51
391C542l61m57k70m44r52j5j75r19j90l76r82M00j059k23K68j359L52l70p67Q74
411c483j153j17O67j378J133l38r48J469j326P72O79j576K203j131J00J827j680
428d280J685L54n51J562j049J211Q40r33J954q03O69J139j036J860q46K55J627
445C658j316J758l16p64K535j971J131K87j856K772j664K79J240k924K479r14
461D414j375K089k985J422K08k490K323k446R4J198k853K017j714r83K005k924
477b000J203m29j963K070k260N26L61k259K609k258J56J167k996L092j148j437
493e566K659l046K407K99k215L363k621J458J751k665K932j533J2K872k748K394
$$ y = [3581, 3600, 4196, 3867, 4554, 4955, 4834, 5030, 5347, 5110, 5318, 5393, 5029, 5138, 4996, 4789, 4738, 4599, 4222, 4127, 3793, 3542, 3181, 2724, 2454, 2010, 1058, 1043, 868, -51, -241, -617, -1599, -1199, -2258, -2481, -2213, -3572, -3220, -3590, -4357, -3483, -4636, -4753, -4086, -5464, -4331, -4669, -5617, -4148, -5474, -4702, -4023, -5599, -3396, -4527, -4427, -2600, -4280, -2595, -2241, -2792, -1230, -2279, -1068, -228, -1161, 793, -10, 659, 1798, 762, 2622, 1776, 2031, 3658, 2342, 4100, 3784, 3020, 5555, 3584, 4715, 5002, 3146, 5918, 4254, 4533, 5773, 2849, 5328, 4414, 3039, 5128, 2143, 3565, 3773, 1283, 3606, 1160, 1254, 2452, -401, 1616, -98, -1081, 924, -2000, -797, -1226, -3189, -1119, -3379, -2853, -2492, -4751, -2142, -4400, -4244, -3077, -6073, -2981, -4129, -5566, -2907, -5953, -3546, -3247, -5462, -2099, -4720, -3262, -1511, -4176, -1244, -2777, -2765, 107, -2641, -247]
509b47m3j057L292k679J617J288k631L826j747P2K525l073K902m48j183K997k926
526B485J859M82j988K569k348J077J165k945K433j565m84K559l882K261r72j776
542I30K989l776J226L76k752L239l004j7J779l759K616j467j735K938l632K134
558a915k25k665K932k484P04J281k792K265j478n7K446k967J753j55r62K596k629
575d352J480P88j766L185k216Q74J777k353L082j182m76K977k538K111J10j614
591a13L317k005J055J033k334L014j378K9K108k868K248m04j136K593k675R53
607C437P83k121K505k007j37J458k448J743j201q39J323j933Q09j95j458J423
623A142j870N09J80j750J475j550j60Q97j788J152q35l28J061k276J220Q0j323
$$ y = [-247, -290, -1347, 1945, -734, 883, 2171, -460, 3366, 1619, 1691, 4216, 1143, 4045, 3597, 2414, 5411, 2485, 4344, 4826, 2838, 5407, 3059, 4136, 5301, 2356, 4789, 3224, 2740, 5299, 1417, 3678, 2706, 930, 3919, 143, 1369, 1745, -1007, 2232, -772, -789, 990, -2769, -153, -1620, -3355, -417, -4049, -1915, -2140, -4805, -1873, -4357, -3653, -2372, -5164, -2899, -4377, -4434, -1988, -4955, -3202, -3357, -4319, -1723, -4352, -2872, -2084, -3850, -665, -2881, -2007, -230, -2583, 499, -683, -1159, 1818, -720, 1391, 1501, -113, 3204, 1199, 2254, 3287, 953, 3967, 2589, 2618, 4726, 1858, 4106, 3702, 2566, 5159, 2484, 3437, 4220, 2099, 4604, 2597, 2460, 3918, 1470, 3213, 2012, 1173, 2496, 563, 1372, 1177, -281, 1142, -728, -219, -39, -1789, -314, -1864, -2024, -1127, -2915, -1763, -2598, -2926, -1865, -4141, -2921, -2841, -4164]
640d164J914j548L13Q65j632J859r92k99J594j473J602M4j021K044j171N77O03
657h85j003J847m13Q8J155j056J336j00QJ001m91O11J69l82J075p95P72J15p26
676B326J432r85K96L89q97J010n59m50Q49q19L38k53r06P72q95j55L36j113O35
695A351m84o58L65r04L36k56q73N55j026K11l19o10L48k41l36p1k69M47p90R9
715c125M31o15M39j02q6M66k33L14M6j19P33o54O95L96m08O21J25J42O22j64O11
736A35J77O2K93K10K8N98P6K28qL31K00K15r5L5M23m7q6K29j55R2k19m0J19m66
760B335j06K75m52O1m37k23J90n36m7l77l32K91l98l23j75n26R6j87k17m23p4
781a585r9o9l66J82k45l51J13m07L88l87J08J05l01N63l7K50l9k10K47K09K23
$$ y = [-4164, -2250, -3798, -3485, -2620, -4252, -2393, -3385, -3684, -2090, -3563, -1961, -1917, -2938, -894, -2065, -1488, -885, -1888, -41, -454, -366, 789, -267, 1069, 969, 977, 1978, 1487, 2098, 2267, 1885, 2960, 2165, 2937, 3052, 2326, 3758, 2773, 3069, 3458, 2561, 3571, 3012, 2562, 3411, 2592, 2930, 2677, 1771, 2543, 1648, 1493, 1829, 716, 1351, 867, 209, 574, -330, 6, -250, -1123, -568, -1594, -1383, -1702, -2312, -1964, -2205, -2541, -2612, -2881, -2434, -3224, -3125, -2694, -3309, -2870, -2972, -3058, -2592, -2825, -2511, -2465, -2584, -1851, -2505, -1810, -1414, -1822, -1201, -1076, -934, -312, -476, 135, 312, 374, 667, 877, 905, 1503, 1579, 1807, 1799, 2130, 2330, 2545, 2450, 2485, 2908, 2861, 2775, 3004, 2849, 2941, 2722, 2682, 2801, 2335, 2229, 2504, 2052, 2113, 1676, 1453, 1643, 1107, 1060, 683, 351, 642, 244, -79, -254, -780, -684, -871, -1088, -1511, -1585, -1684, -1753, -2119, -1937, -2182, -2533, -2420, -2827, -2439, -2826, -2718, -2613, -2914, -2351, -2388, -2138, -2177, -2387, -2140, -1931, -1708]
802a708J43QL78L73j27M47l14Q90K62j27O34n73P85m0J12J94K50K25M08m38L55
823B137K66l32N56m13L36j10l24N37J0k53r8k14l8k48o5J35m74o8q9k40pn18j74
846C12Ro49L03n98N8j27m46J15m96N1K3n73J13p8k14K90l86k1J74l79K98Lj40
869b358K76p3R7K07k0P1J39M7M47n9J63M09k9K77K76k4K41K24K52K46R7J04L46
892A356q0J90P4k0L91O1j46K51p3l1M32k2k81J33j0j48j11k21J98m24Q4n3m27
915A123J73m99J75k43m12K6j98k17j12j12l08M9m56j24J6m69L89k25n49K87k74
936a960j56K10j52j27K14l7J89k06k16M96m4j42L44M3K69N5J75K13o4O0j4L89
958d61K54J85N9J32M20MJ02L01K3M30j88J39J58J09l9K66j00J53j59J01K10J3
$$ y = [-1708, -1565, -1557, -1179, -806, -933, -486, -800, 90, 352, 225, 859, 286, 1071, 1031, 1143, 1337, 1587, 1812, 2220, 1782, 2137, 2403, 2071, 2627, 2214, 2550, 2440, 2116, 2653, 2663, 2410, 2312, 2098, 2060, 1812, 1747, 1882, 1408, 1340, 1251, 1011, 1004, 486, 312, 321, -328, -25, -623, -565, -692, -1138, -1023, -1519, -1468, -1445, -2018, -1905, -1983, -2197, -1907, -2293, -2314, -2140, -2519, -2221, -2218, -2358, -2082, -2155, -2058, -1851, -1871, -1800, -1661, -1614, -1167, -1226, -1063, -654, -683, -406, -130, -154, 87, 311, 563, 809, 906, 1010, 1356, 1276, 1466, 1540, 1520, 1911, 1972, 1826, 2077, 2004, 1973, 2405, 2383, 2102, 2235, 2225, 2077, 1966, 1745, 1943, 1519, 1603, 1550, 1123, 1296, 797, 972, 729, 317, 343, 145, -72, -184, -296, -604, -555, -1011, -1135, -1119, -1588, -1199, -1424, -1973, -1686, -1960, -2116, -1906, -2058, -2185, -1971, -2008, -1819, -2025, -2241, -1745, -1789, -1931, -1587, -1544, -1275, -1220, -1045, -832, -896, -836, -850, -461, -207, -22, 37, 169, 589, 593, 695, 996, 1019, 1449, 1261, 1400, 1558, 1667, 1628, 1894, 1794, 1947, 1788, 1889, 2099, 2112]
980B112J17n17K49k68m0l71L36l77l1k05j68M3k29j67J07p65J54J04l18l7l57
1001f28j49j50p2k30j94o9r1k72Q2Lj45P4j22j6L55k55J99n2O4l3K35J21l02M00
1025a247J45j01L10k02L06L69J07J79j10L25K60k39L40M20k62N26j40j84O53n
1045A450j9J37k80J85K04J32j83L5K89l09p3K65k36k72l8J03k21P2j90l3j57Q6
1067I47n52L7j68o1k8l46k14r9M7l37k57k47L62k62r2%l25QN3k32L09k94K1J89
1091a541j43K91m02K70L0j2L43k75L04N7K19k41N57J5J45M6K28o3K71K23K38M6
1113F06j57L65P1J06J06j28M60r1K82r9j06n6L05o2k31N8k32K80L10o38K10o5
1135A294j71j76P9k34j24l3j74j23l40M4m6o0k59J11k58j10l5j57k62m5Q6j03
$$ y = [2112, 2229, 1712, 1961, 1693, 1653, 1282, 1618, 1241, 1210, 1005, 837, 880, 651, 484, 591, -174, -20, 84, -234, -271, -628, -777, -927, -999, -1229, -1423, -1492, -1583, -1855, -1773, -1770, -1915, -1841, -1963, -1979, -1624, -1879, -1680, -1732, -1668, -1701, -1466, -1345, -1647, -1247, -1102, -1203, -893, -1095, -789, -420, -313, -134, -244, 81, 341, 102, 442, 862, 600, 1126, 986, 802, 1455, 1450, 1431, 1568, 1288, 1473, 1677, 1809, 1626, 1661, 1950, 1641, 1568, 1833, 1597, 1325, 1287, 1390, 1169, 1241, 1051, 1018, 861, 947, 395, 432, 264, 203, 175, -171, -385, -484, -437, -774, -1031, -1278, -916, -1178, -1270, -1270, -1595, -1587, -1534, -1766, -1457, -1751, -1730, -1541, -1684, -1393, -1795, -1525, -1495, -1507, -1164, -1439, -1135, -1078, -859, -1100, -543, -528, -383, -337, -109, -172, 99, 322, 560, 606, 449, 814, 885, 991, 1097, 969, 1429, 1338, 1620, 1521, 1415, 1359, 1664, 1602, 1371, 1429, 1197, 1477, 1787, 1149, 1359, 1294, 1123, 947, 1026, 792, 668, 635, 461, 338, -2, 42, -4, -64, -323, -212, -470, -580, -615, -772, -1034, -1079, -993, -1096]
1157a096m9m6k19l3M4k48PJ34J37O6k76M6M50l39J10M3K05J3M0N21k80L86J15
1180b69K52j49K51OM6J28R4K59j58J68L0K43K07p3K91J95l70K41k35M18j87OJ83
1203A577k50K84k27j32o2j89r3K5j5n1l10j23L55m38q7Q3j84k85l0Ok06m1J3k97
1227f77j75O3j74o3l95Q3K23q6k48J1J08j45K57r5Q3L6K2j21L04L4l26N36P8q6
1251g53J75l3J72K60k69N89o9J03J45p1M07j00k4K70k1K37J02j59J16pK95o8K0
1274A317J2m3J38j59lm7n1r4NL0l82r1J31o6q5j09K1j62j26k15m9m6m45M38j84
1299b65n45L22ml68L4l83L35j94JJ20m12L55j52o2j17Q9Q1l7R2L84l78P5J19J4
1323h96M0m2K48O7K8L01QJ10K18l4K4k34M23NJ57L24J13k67L8K12K53l39K50J63
$$ y = [-1096, -1145, -1191, -1410, -1443, -1399, -1647, -1640, -1506, -1369, -1303, -1579, -1533, -1083, -1422, -1312, -1269, -1064, -1051, -1011, -490, -770, -384, -269, -17, -166, 85, 91, 137, 265, 359, 618, 460, 628, 658, 901, 1108, 1035, 1326, 1521, 1151, 1392, 1157, 1575, 1388, 1394, 1577, 1327, 1611, 1384, 1252, 1190, 1001, 908, 933, 918, 867, 557, 434, 789, 351, 264, 347, 163, -122, -152, -146, -352, -393, -380, -677, -852, -789, -963, -1026, -1421, -1338, -1115, -1201, -1449, -1438, -1330, -1475, -1218, -1313, -1230, -1194, -1172, -1293, -989, -955, -1281, -745, -667, -753, -578, -611, -439, -179, -448, 141, 72, 175, 320, 249, 656, 556, 532, 802, 781, 1018, 1120, 961, 1077, 1070, 1365, 1297, 1317, 1329, 1286, 1424, 1265, 1262, 1215, 1164, 1070, 1075, 1105, 723, 632, 763, 697, 612, 503, 524, 362, 236, 21, -28, -74, -519, -81, -265, -810, -488, -492, -860, -826, -1209, -874, -1068, -1067, -947, -1359, -1004, -1156, -1218, -1335, -1246, -1165, -1202, -1110, -726, -1104, -1029, -910, -896, -856, -898, -650, -583, -555, -254, -246, -136, 82, 48, 72, -162, 261, 266, 423, 747, 860, 593, 631, 843, 1096, 757, 1007, 1170]
1347A170j60J13l3PRl9J41o9l02M70l67J20m07J58l20K01j92n4j72N0j51M1qk48
1371d2k51L1L2k07j04k64J79k84J15k3l02l4K84J1r5j27J68m05J00NK36M8Q9k65
1395a105L27k26kO58m48K41K86J1l8J90R3Ok06O64j10j23J40K09j29NQ6P6K22
1418H27k0J19J17k03K60j89K16O7j02m2j5j50j32P2K7m6l44O5mk7P1j55l10J55
1442B57j81n5j91J7j85m1k57P7J6kk78k8J69J31j65k50J16K9j81L2Q7j18J14k51
1466a138L14n2r7N8J73J40J63q5J84Q0m2L6N7L7K96J43k33M14m25L31q3J75%J28
1490E74l0K50k42q2M65j45K13o7j59K82n5j65J1p6k38L39l3j47k77L16m09J9J01
1513D45j74q6K18l16p3j20Qp2L5j99j61m9O7j67J40J4Mm44K42k40J37J73k07J19
$$ y = [1170, 1010, 1123, 1090, 1097, 1106, 1067, 1208, 1139, 837, 1307, 940, 1060, 653, 811, 491, 692, 500, 446, 274, 324, 173, 214, 206, -42, -293, -262, -230, -437, -541, -805, -626, -910, -795, -818, -1120, -1154, -870, -859, -954, -1081, -913, -1318, -1218, -1213, -977, -929, -840, -1105, -778, -1004, -1006, -348, -796, -555, -269, -258, -296, -106, -13, -7, -213, 451, 341, 218, 358, 567, 438, 443, 529, 605, 827, 807, 926, 1043, 840, 1100, 911, 1127, 1194, 1092, 1050, 1035, 885, 753, 825, 852, 806, 462, 527, 523, 496, 567, 412, 102, 257, 76, 21, -170, -153, -338, -379, -636, -559, -543, -545, -823, -851, -682, -551, -716, -966, -850, -821, -1002, -970, -883, -1001, -887, -1138, -824, -876, -973, -915, -742, -602, -439, -524, -340, -260, -302, -266, -209, -172, 124, 267, 34, 448, 23, 354, 271, 446, 446, 574, 544, 794, 552, 470, 935, 790, 1003, 936, 777, 1059, 1004, 839, 850, 774, 536, 875, 842, 695, 418, 734, 325, 344, 445, 271, 185, 403, 87, 14, -106, -98, -170, -135, -334, -495, -544, -477, -644, -504, -490, -486, -930, -688, -928, -791, -618, -825, -706]
1537g06r8l2n1P8r6J67K37k20K22k27J20K96k03L19j39m1L11K3k1K82p8Q2L46
1560E71l08K77Q4j29P8M4nL1J62J59K4l55J98J3l7j95K52l08M24j54n86L84J06
1583G30Q8l74k12L37k63j04K17j83p8j06l25k1J89l44M00l80j5j19j91K50k4l46
1605h74j2K52n1K45l94J15r4P5j2L6j05J05M0K07n2l1K10l7K68l89L12n8J40o7
1629a71j02N53m8j20K22j77K33j59L00l2J31p7J02J01j83k45M14R1j38J08j29
1650F74J2M7k73K93j79o8N3l70K00k6K2j34l8j93K79l37J88j48j75J06pj80j71
1673d25k31K29j97K47k13Qk30L40l64K13Po3J73k03J84j81Ok7m5M20o0j50K3L73
1697a66J8j06k6N9J36M6n1J51K83lm0J8j63L6K5K64j60J26N3O4J18m7P9k06J94
$$ y = [-706, -804, -836, -887, -809, -905, -738, -501, -721, -499, -726, -606, -310, -513, -194, -333, -374, -63, -40, -61, 221, 143, 225, 571, 263, 540, 624, 495, 573, 617, 612, 643, 805, 964, 988, 633, 831, 844, 807, 612, 864, 556, 980, 826, 240, 624, 730, 818, 444, 232, 569, 306, 202, 419, 236, 158, 52, -273, -294, -105, -449, -49, -429, -444, -563, -754, -504, -528, -874, -886, -634, -685, -440, -834, -719, -813, -738, -750, -714, -819, -714, -674, -467, -519, -550, -340, -377, -109, -498, -186, -244, -104, -171, -273, 280, 232, 112, 334, 157, 390, 231, 531, 499, 630, 553, 655, 756, 573, 328, 742, 833, 695, 803, 674, 686, 733, 460, 753, 574, 506, 559, 189, 389, 363, 385, 251, 213, 20, 299, -38, 150, 2, -173, -67, -74, -254, -425, -656, -427, -624, -377, -590, -582, -812, -472, -836, -623, -616, -679, -506, -709, -525, -706, -700, -727, -772, -352, -412, -562, -539, -166, -148, -254, -280, -221, -85, -39, -90, 61, 344, 341, 301, 319, 156, 192, 217, 481, 321, 447, 500, 564, 682, 635, 714, 508, 702]
1722G02l73L40Q0j38M0P6q8r5L9q3k55J97n4l26M27m63N8J12j68j34K4k01Kr8
1746c79J55J54j88k27rj32Q5J47k18K3N7j96J07Q9n9L07k51O0j11L6lO7L27k76
1770d35k03K24K05m2N0K74j9PJ62Mj11N7K3O9j28K49K2pJ37J4J6j04J89q8J2j28
1796D49K02k10J77k5O1j20k25N2P5J50j62m16J98J08k40J52j40L4j88J44n2r4
1818g0n2q0l7j7l0j10j46K13Q5j06k65K39j74L3M2n3q8J52J94p9j76j33L07q8
1842d39o3l5K42k7K15l53M07m6K13o6j05J37o3P0K12m2J23k8j54N6J12l0J08L03
1866G47k13L6k36K28j01K39m02L00k3l15N7n8J99j17K52k46k2M5n4l72K64k06
1888Bj10J86j02k3j26M9J3k93k7M15l15l00L95j39m1j2q4k1M5l4N8Q8P2j11Rj91
$$ y = [702, 329, 669, 749, 611, 651, 727, 639, 544, 583, 500, 245, 442, 388, 62, 489, 26, 84, 196, 28, -106, -82, -283, -281, -379, -224, -70, -258, -485, -494, -626, -541, -394, -612, -589, -532, -728, -621, -532, -591, -284, -535, -475, -586, -550, -553, -486, -159, -435, -638, -414, -209, -251, -201, 73, 54, 61, 223, 227, 116, 173, 196, 265, 137, 386, 408, 401, 538, 552, 568, 464, 653, 565, 577, 449, 651, 441, 618, 593, 654, 534, 309, 361, 436, 586, 424, 8, 206, 314, 74, 226, 86, 120, -68, 76, 24, -70, -122, -202, -239, -256, -286, -396, -542, -329, -244, -350, -615, -376, -550, -517, -475, -528, -616, -464, -270, -349, -525, -658, -351, -439, -502, -537, -295, -322, -107, -460, -53, -99, 114, 48, -57, 80, 17, 87, 299, 257, 380, 352, 198, 254, 366, 336, 444, 747, 534, 570, 334, 562, 461, 700, 298, 598, 575, 260, 317, 259, 458, 341, 593, 347, 325, 370, 316, -56, 208, 2, -108, 78, -24, -47, -173, -124, -111, -404, -431, -16, -331, -631, -236, -375, -416, -428, -512, -533, -488, -522, -464, -376, -304, -415, -406, -597]
1914e97j34L78J03j3O8J8kj69L85k45Q4K3n9L55j22j7J82J02L0m8Mq1l7N5K30
1939D93j20P1K8l1p5qN7n5J4J32j8J0k80J18J27l00M9K6j63J28j30q3o8J21P7
1964A20j57J2J39k54K40k69O4rk39M04k11j90q1r8L0l4K84n4l12N52k87j04q3
1987e37L50N0k86J0L1P3L1J53OP9j26P3J09k13K37p3L26j02j76K4K49j88J19R3
2011C12k07J00K80pP1j03j30K93l27qJ2J52j67J41k2j65J57j51K29j96J09q3q
2034B82m5k78J85l86J39j19J35j32j19K6J65Pk57N1r9L07j47Jj85R7O4j61K98
2057a71k78q4J07k9J87j8j56K00Q4j40K45m3j5J99k61M04j88O6j4l01M89j72L
2080A14Q1J64q7%r6J20J9j20K57Kj89J09j3j99K15N8k07o8J86k80K72L1N0l83
$$ y = [-597, -731, -353, -250, -263, -195, -177, -179, -348, 37, -208, -124, -101, -160, 195, 73, 56, 238, 340, 370, 322, 326, 245, 208, 263, 493, 373, 444, 472, 441, 366, 358, 415, 360, 374, 506, 488, 498, 218, 336, 463, 163, 212, 238, 75, 203, 73, -10, -78, 43, 120, -37, -25, 114, -140, 100, -169, -105, -114, -353, 51, -160, -350, -431, -529, -499, -533, -249, -303, -615, -63, -350, -454, -537, -187, -137, -423, -413, -382, -309, -278, -125, -119, -40, -166, -93, 16, -197, 40, -33, 293, 191, 15, 39, 288, 100, 219, 312, 105, 205, 485, 478, 549, 446, 316, 609, 282, 274, 286, 438, 271, 412, 390, 225, 382, 231, 460, 264, 373, 290, 282, 237, -41, 144, -242, -103, -222, -87, -219, -338, -312, -147, -140, -397, -346, -445, -138, -285, -284, -469, -372, -308, -469, -171, -449, -533, -426, -455, -268, -286, -442, -242, -158, -298, -53, -96, -111, 88, -173, 231, 43, 109, 95, -206, 283, 111, 114, 195, 359, 272, 272, 176, 296, 315, 195, 452, 454, 265, 374, 361, 162, 377, 435, 228, 160, 346, 66, 338, 369, 419, 36]
2104C6J33P0k80J43p3J00j59m8p3M9J01Rj93J16m1o3j20P7l9j33J86o0o4J15J1
2129b00p3O1m3j74K08p7Q3n9j17L30J32k34O1l5j68K85l4N1J26l1j9J22Mk69Q0
2154A0R6Q3K7k18L43r6M2r9K75j31m1N6J19j32J72l15R8k32nK36k47N11l67k85
2178a00J25P5j85M2Lk1J50J37j44j59k4j03J22q0Kl48N12k49J11k04K03j17q3
2201c35J4M6j02M1J38j19J35r8%O4j30J25J18j47J3J84j09R1M6j38P6M5L9k7K13
2226A83j03q6K75k12kK08L46l31m7j67K63M4k18q6J50m6J5J05K31n1k08r9K83
2249D47k99%J78p3q7j04J52j96j37J84k24J41J1k28J89q5K80j74k05N5j86O8O6
2272b27p8K24k56K1J41k5N4k32J2JJ48k4J72j84J04p0k6O0J43p6L87l60J12k7
$$ y = [36, 169, 239, -41, 102, 29, 129, -30, -78, -151, -102, -1, 8, -185, -69, -110, -173, -293, -216, -255, -388, -202, -262, -326, -211, -200, -273, -212, -255, -429, -221, -298, -215, -274, -391, -61, 71, -163, -102, -137, -305, -20, -54, -3, 123, 92, 73, 195, 199, -70, 10, 106, 189, 216, -2, 341, 245, 287, 188, 463, 332, 291, 347, 466, 334, 506, 191, 289, 57, 52, 288, 41, 552, 185, -100, 25, 100, -85, -43, -40, -61, 89, 226, 82, -77, -101, -204, -82, -162, -160, -508, 4, -245, -134, -338, -135, -252, -335, -321, -275, -377, -336, -198, -317, -182, -280, -280, -216, -346, -221, -103, -250, -237, -53, -162, -71, -25, -163, -87, -42, -3, -30, 183, 80, -6, 269, 57, 55, 263, 609, 278, 231, 64, 327, 371, 153, 67, 217, 171, 186, 291, 522, 471, 263, 164, 447, 148, 148, 326, 253, 166, 62, 214, 18, -119, 65, -159, -18, -7, -235, -46, -131, 149, -25, -230, -175, -361, -293, -227, -305, -81, -337, -316, -175, -200, -146, -378, -366, -365, -217, -241, -69, -253, -149, -219, -245, -185, -42, -118, 269, -91, 21, -6]
2296fm3pJ9K80K2k29L15q5M5q9j31J64q2K62j24J05j68p0Q7r5M4K6q5m2j02L19
2322C30k62J29k22R7K1O8O4o6p8n1O0j39o4J41N5r2j07j9o0J33k63jK25k49L13
2347c7n3jQ7l82K37j06j00J61J94nj39j5k39M41k2rk24K20k75L54N9n28K88J16
2371B2o4J42l8j26j00P7K73j76J94p2k9m9j02O4M3J51k56K33l2m3J33L6j26O7
2395B22j75K25l48J08j0L6L56k98j05p2j22K42M4j97K84k50j60J61j13R2L30l30
2417h0J6k82O7n6K40n7j08L04j31m0k18L14j20L2m6O1r5n6K36O1M7l64K21o1j13
2442b28P8J35L4MJ5nJ77q0n8O9j49j10K44j13N2n4J62o2M2%N7p1l2J96o3m7j28
2469F5J27k73K45k28j6K39J79j67j65K79k47k18K43j16K0R3j21K72j44k34k32
$$ y = [-6, -49, -56, -37, 243, 265, 36, 351, 266, 311, 222, 91, 255, 173, 435, 311, 416, 248, 178, 265, 170, 214, 240, 155, 113, 11, 330, 68, 197, -25, 72, 93, 161, 225, 159, 81, 30, 90, -49, -113, 28, 83, -9, -116, -135, -195, -62, -325, -326, -101, -350, -37, -90, -91, -4, -386, -149, -255, -355, -194, 0, -5, -144, -159, -398, 43, 21, 12, -212, 8, -267, 87, 146, -382, -94, 22, -42, 100, 62, -64, -164, -87, 186, 10, 204, 132, 103, 54, -48, 16, 59, 210, -46, 187, 155, 112, 245, 281, 155, 222, 47, 272, -76, 32, 22, 58, 414, 116, 11, -61, -183, 59, 103, -94, 190, -60, -220, -59, -172, -80, 250, -80, -64, -346, -279, -335, -95, -152, -260, 44, -87, -127, -345, -31, -151, -119, -165, -104, -199, -255, -19, 42, 89, -275, -54, -115, -228, -150, -15, 19, 23, 38, 33, 210, 130, 72, 141, -8, -118, 126, 13, 65, 11, 173, 111, 153, 153, 210, 139, 107, 303, 240, 193, 65, 192, -81, 164, -64, -80, 159, 338, 171, 6, 285, 38, -180, 63, -53, -33, 60, -61, 211, 67, -167, -399]
2490c99L78q1O9l2p2J47n1r6R5k14K16p0P8j2j4j56r5N5N8L30l83Q2L27p2l9q8
2516c9K72k48K35j92m3J10jk41L44O6k65J32j3l7J35O5K0j91j67K79J84l58K21
2539B68l3j55j09J10J38P2k14M4M7K8j72J77j77j4n5J88m5n5j14Q8k10L58j34
2562C1j16kJ97l1k41K08l03J53L5J8l91K48l6K52j85J43q3j58J52n7M12k29l9
2585b2j91J49K8j83K85j37M3k1K90K1m13K14O5K2p4K9K26n15L54J19m32K32j33
2608d4J47L67l47k21J94j80K18j66l1K22P9q3k9q9j27O6J89j04Q1j45l9o0j09
2631b11K98k02m0P0K95j24K9j49j62P1j88K47K75j87j01N7j46k3M76l15J37J8
2653A25m31j24M59rj13o4K72l17Q4Q6j12J25j9J94l01R9J15p3k12L11K0J13r3
$$ y = [-399, -21, -102, -33, -65, -137, 10, -41, -137, -42, -256, -40, -110, -32, -44, -58, -214, -309, -254, -196, 134, -249, -167, 160, 88, 49, -39, 233, -15, 220, 28, -15, 95, 94, -147, 197, 263, -2, 130, 117, 80, 215, 280, 300, 109, -58, 221, 405, 47, 268, 235, 80, -29, 81, 219, 291, 77, 121, 168, 196, 24, 201, 24, 10, -45, 143, 98, 43, -71, 17, -193, 165, 31, -85, -87, 110, 79, -162, 46, -257, -104, -69, -51, -442, -194, -230, 22, -163, -20, -103, -261, -109, -166, 246, 17, -22, -213, -64, -36, -219, 66, -71, -28, -49, 241, 262, -151, 63, 128, 150, 76, 105, 331, -184, 170, 289, -143, 89, -44, 103, 470, 123, -98, 96, -84, 134, -32, -63, 159, 238, 155, 126, 37, -90, -24, 165, 61, 142, -3, -42, -102, -211, 87, -115, -155, -85, 210, 86, 115, -34, -196, -125, -313, -66, 209, 22, -79, -22, -168, -191, 285, -30, 107, 125, -306, -430, 29, 20, -93, -157, 115, -202, -118, -32, -144, -19, -38, 156, -145, -46, 69, -4, -216, 95, 115, 228, 135]
2676A35j47J46N6j56O1N0k12L68k93r1o9J35N4j22K70q7j9l52K20K5m5k0J04r
2700Bo4J7pJ62j51L0J52l00K95k05j04J32P8K6rj33j09Q0N4J58j37O3mj09J09
2725B6M3j8J7k17p9J77J99l31k9N7J44J26j29m6J24p3m2P1j0n6Q1K85k60j90J37
2750GK16k54J42K20k38l9J12Lo9K02j85l7l1Pj69K23j47J66j5n5j39L2l8K54j32
2775C6k5k71J88K2j3j5J9J35l53R2J46l6j13m9K58j10N4J35j12j33K70l63J65
2798g3o9J78k20J69l0j67r2L65k16R1K54l73M01j80j2j41J70J75k47Qj22L59%
2821B28k32R2j50R1K53l02M2J87l26J57p8O3k20K55m60M88j14l7J51n1P9r0j12
2844h6l5n8q4J06J85j01J14k14r9J91J78k20K30Rk36Mo7L85j67l07K45J4j32N6
$$ y = [135, -12, 134, 190, 34, 95, 145, -67, 301, 8, -83, -152, -17, 37, -85, 185, 98, 79, -273, -53, -28, -73, -93, 11, 2, -62, -45, -52, 110, -41, -11, 141, -159, 136, -69, -173, -41, 37, 63, 54, -79, -188, -108, -54, 104, -33, 30, 26, -83, 26, 69, 51, 68, -149, -228, -51, 148, -183, -212, -155, -11, 115, -14, -60, 64, -9, -51, 20, 10, -46, 35, 320, 60, -130, 7, 223, -31, 111, 331, 93, 54, 166, 169, 100, 302, 117, 80, 49, 56, -113, 110, -37, 129, 114, 59, -80, -48, -86, 168, 36, 11, -260, -72, -50, -63, -78, -59, 76, -277, -185, -39, -75, -188, -237, 21, -89, -35, 100, -12, -145, 125, -238, -73, -142, 36, -184, -15, -45, -212, -304, 61, -155, -64, 190, -183, 218, 38, 26, -115, 55, 230, -17, -9, -131, 228, 228, -4, 88, -62, 29, 282, -20, 22, 209, -117, 40, -38, 25, -195, 60, -400, 88, -26, -63, 88, 37, 116, 26, -86, -121, -179, -263, -157, 28, -73, 41, -173, -272, -81, 97, -123, 107, 116, -120, -116, -183, 202, 35, -272, -27, -13, -145, -89]
2868h9J75n9Nj69J34j23M29l26K89m43N8J46k2k43J33n7L69j66l4O6j19J11k35
2891a70J43K40j80J13j98MR3j25J29N1k80L04j42J3j27r8L88j49l4O9M4o6oj22
2915a06J83j10N3j25j08L59l18l2k9L57k08k41M25j28%N3q2P4O3k15J34l7j15
2938a53l5J0K25r3Q7J48j01j84m3M06k02%l0l49J37N1J05j99K80Oj24K22k5Qk53
2963a06K46k15J51R4o1Nl29J11J53K68j68j86J52j40J64q7j9Q8Rj82P3P7j21R5
2987G2j6j99J54K9r9N7q5Q8M1m1N5k17K6Q8J3J85k74RJ57l20J88J6j21l4P0J45
3013a3J16j38J76r3K3k4k97L12j84p6J47j9j19K71k2J7K58o06K72L6R8j5O3j04
3037G9L2nj37J82k76K13j73J63J0m3J47k2J08j10k15K50l59O3J87j3k01K06j37
$$ y = [-89, 86, 27, 32, -137, -3, -126, 303, -23, 266, -177, -119, 27, 5, -238, -105, -162, 207, 41, 7, 73, -46, 65, -170, -27, 213, 33, 146, -52, -48, 45, -80, 49, 100, -180, 124, -18, -5, -132, -230, 158, 9, -25, 44, 88, 22, 16, -106, 77, -33, 20, -105, -213, 146, -172, -204, -233, 124, -84, -325, 100, -28, -28, 25, -57, 17, 80, -135, -1, -38, -153, -188, -178, 47, -46, 41, 189, 88, -96, -139, 267, 65, 65, 35, -314, -177, -126, -21, -220, 60, 66, -58, 164, 139, 147, -106, 140, -75, 76, 170, 109, 114, -215, -104, 49, 317, 149, -37, 115, -25, 139, 52, 33, 121, 130, -52, 21, 98, -23, 72, 56, -143, 11, 40, -59, -2, -87, 1, 42, 1, 56, -161, -135, -47, -34, 151, -123, -114, 43, -277, -89, -73, -194, -228, -158, -13, 103, -35, 141, 48, 71, 47, -250, 62, -122, -198, -51, -70, -189, 82, 60, 77, 335, -271, 1, 37, 135, 120, 183, 79, 111, 106, -31, 151, -125, 88, -85, 78, 88, 45, 192, 170, 278, 168, -47, 203, -156, -93, 94, 81, -120, 86, -51]
3060e1l6k2R1nk5m2k4J36j51J52p3K9j30R7j58Q9k0J77k04K55l03R0L13o6j37
3085a8J9Q4p0P8k7j51J79j12O3n0M9N9J49l06o8M4J7J1N3J20J2M1J94l04K1j4
3111G3Nj71L79k04j0K93k52j22m9K04K7J2k26j56K15k23J31O2j00J51j64J82k7
3134C0R1j96p1J36o8l5l9M8P1l3j89L12p3Q1l05R9J15n9J20l24K96n7j16K66m0
3159F0j59q1MR7M6N4K5k70K30J08j10q6N2lJ31P4j17k56K89LJ61k92M5M0N7J61
3185B63k42M3Kqm5n4K0M6J03k5J15l66O2m6q4N07l24P7j09o8L9M6k6r7k3O6j9
3212a47L9m0O1o7Q2L0j55j20L50k49J4n0J40j8N2P8mj98J34J89l55J80L3j15P0
3237f6PJ15J82l52J70j06Q1K56l50J62Om6m7J68k14J31J82m22J09O9K33n8p2o6
$$ y = [-51, -87, -109, -18, -23, -48, -90, -114, 22, -129, 23, -50, -21, -151, -54, -212, -123, -143, 34, -170, 85, -218, -128, 185, 119, -18, 1, 85, 15, 93, 66, -85, 94, -18, 45, -5, 44, 103, 252, -54, -122, -78, -61, -50, 3, 123, 135, 176, 370, 66, 87, 73, 78, -93, 286, 82, 72, 365, 113, -9, -58, 146, 173, 185, -41, -197, 18, -205, -74, -12, -112, 39, -125, 57, 30, 121, -75, -146, -10, -78, -113, -152, -104, -33, -66, -255, 57, -16, 65, -240, -141, -26, -85, 35, -289, 7, -50, -166, 100, 60, -99, -180, -176, -79, -33, 21, 46, -224, 6, 114, 4, -82, -30, -33, 98, 172, 55, -201, 88, 91, 252, -40, 5, 45, 102, 263, 21, 64, 66, 58, 13, -41, -21, 25, 128, 103, 218, -148, -86, -132, -216, 291, -33, 44, -65, -133, -94, -48, -74, -171, -194, -128, -147, -108, -148, -87, -154, -72, -42, -197, -317, 33, -216, -202, -252, -112, -130, -78, 0, -4, -202, -68, 121, -234, -54, -21, -136, -66, -59, 56, 238, -114, 56, -50, 31, 287, -63, 99, 105, 59, 12, 180, -34, 97, 279, -143, -34, 35, 268, 210, 138, 72]
3261G2r0R9k49L73j34J00m2qk19J27R5J32p1j08k72L5R3k25K66o4k3j83M98j28
3285G4j61j1j90qK46l03P2K58M0j65J23m9R4j54j35J72J85j05L5j87j76L02n3
3308i6P2R6p2q3n3K28k52J87k38K55Kq1J62r7K1r2m5O5P0p2J13J70r9j07k30K05
3334B9L80n7l83K50m13J27K21K29l72P7j69r8J44j34Q7K6m4j19K76q1M3n9j79
3357b19O2K95j11J69Ll11J20M0j08j94M70l30J07J12j63RJr5p4J52j00K79j06
3380Hq6O2J08P6r2j37P6J6O0Q1k62M21q3m58M96j64K8k51R0L38o3k62k7j83L89
3405A81l38O4K55L8k23K01o7Mk56K28k2j11J47n1q6j34O4Q3J49j65K00l6j11r9
3429h5J69j6l98O1J55l3J38Q6k29J43Q6k70m3J63p9J33J38j40r8K85k69p8J01
$$ y = [72, -18, 81, -168, 205, 71, 171, 129, 121, -98, 29, 124, 256, 185, 77, -195, -160, -67, -292, -26, -90, -113, -296, 202, 74, -87, -98, -288, -296, -50, -353, -281, -23, 17, -148, -25, -74, 20, -134, -269, -97, 88, -17, 18, -169, -345, -43, -96, -24, 72, 0, -83, -136, 92, -160, 27, -211, 44, 46, -35, 127, 30, 51, -41, -86, -21, 49, -23, 90, 260, 161, 54, -176, 29, 409, 352, -31, 219, -194, -67, 154, 383, 11, 88, -81, -179, -35, -169, -82, -56, -100, -219, 57, -24, 19, -40, -219, -157, 138, 27, 196, 199, -112, 8, 48, -60, -254, 216, -114, -7, 105, -58, -49, -48, -143, -217, -65, -165, 114, 8, -78, -16, 92, 168, 76, -61, 15, 31, 91, 172, -90, 331, 248, -210, 286, 122, 150, -101, -11, 327, 264, 2, -25, -208, 181, -157, -93, 162, 200, -23, 178, 111, 115, -141, 87, 65, -46, 101, 50, -36, -170, -106, -23, 126, -39, 161, 125, 14, -85, 84, 68, -330, -269, -114, -147, -9, 77, -152, -9, 77, -193, -236, -73, -152, -19, 119, -21, -119, 166, -103, -181, -80]
3452h0J54N7j41j17L31k09J27n8m1J23p2Q3q8j60J04P9j09M86l30k07J91J06p2
3475A57k03K63o9j08l2r9J89P9o3j97K13L4k11j30K95j18j47J25J01M4r7J2l47
3498c09L75pO3q9n5k9K0j13J00o2K94l05OL49k77r9j31K82k30m1J00j4K60j55
3522f7q9J44p6J32P9l5j54p0K18j48L27j78m0P7o1J02k69K44j30j70K36q4K69
3545B57qk34k1k7J59K5n9Nn2k02K26O1Oj27K02j71O9k4r3q5L6O4O0p4N9jK79m52
3573a22m5J48O1j65k4P5R1k26J75p8j21L12p3j45J95M2j95OJ45q3j67J17j10M5
3597a42l4R2O5J38j77l7L19k3k44Q9j13J48j05J15K9j31Q3K3k26K04o1p6nJ98
3621A29k55K16Qj60J34KM9j02PK94l79K28j43O8l41J53J23j81J43J9Rq7K0J20
$$ y = [-80, 74, 131, -10, -127, 204, -5, 122, 64, 23, 146, 74, 157, 69, -91, 13, 92, -17, 469, 139, -68, 123, 229, 157, -46, 217, 148, 40, 8, -91, 98, 177, 114, -83, 130, 164, -47, -177, 118, 0, -147, -22, 79, 123, 26, 38, -309, 66, 59, 122, 33, -22, -51, -31, -144, -44, -106, 188, -117, -111, 238, -39, -138, -269, 13, -217, -258, -158, -172, 88, -67, -156, -12, -88, 44, 123, 88, -66, -136, 82, -66, 261, 83, 43, 120, 59, 161, -108, 136, 6, -164, 72, -12, 257, 249, 15, -6, -33, 126, 151, 92, 97, 45, -157, 69, 130, 136, 9, 211, 40, 109, 85, -8, -93, -57, 7, 67, -7, 52, 51, 330, -122, -167, -19, 42, -123, -147, -72, 19, -207, -32, -110, -231, 81, 8, -137, 58, 100, -95, -89, 56, -27, -194, -77, -187, -142, -176, -84, -19, 119, -58, -95, 224, 201, -43, 46, -67, 81, -24, 91, 120, -11, 72, 95, -131, 73, 12, -64, -69, 129, -126, 90, 98, -62, 72, 74, 123, 21, 28, 322, -57, 171, 28, 96, -245, -92, 31, -150, -7, 12, 21, -66, -46, 74]
3645G4j53n7J05p1L6j82J94PK48j31j31l7lm7J36n3mo7J83p4q8j21L07n6k38J19
3671a04o0P6k25J71O2J95k06K07n6j94K54O2o3M0j55N3K4R9j62N0j26L33j84J9
3695A10J2M7M5m65J7K13K92Kk08k6K43p6Mk18Q0Kl5j43J0Q9P5j29J7L8m6k71k
3722c23K28J37j02O7p1O1m4l8j8r4K67j90mJ99l33M91k65p7p1O4L4O6J55k35l5
3747a31m0n8M07l10l7R3K41k15N2n8M4J54l32J61Q0L4k68J28J0J71j45K29l93
3770a83K84R9k02J80p0m3j01k7J13j96R7J91l8M6J4k26J11k45J21J27j83K23j61
3793f9K21k74q2K26j07J2p2j1k7J71r3o3O4j70J87J53j33r4O6J51k5l1j5k14K28
3818aK9J19m53J83J16lj95K86j78p1O6J83r3l5J13O3j9j48j7o1J78m5P0k32K67
$$ y = [74, -79, -136, -31, -102, -66, -248, -54, -47, 201, 70, -61, -98, -101, -148, -12, -65, -69, -136, 47, -27, -115, -236, 71, 15, -223, -104, -164, -88, -313, -142, -80, 115, -91, 116, 60, -134, 120, 182, 119, 159, 4, 57, 81, 180, 18, 68, -58, 275, 91, 110, 122, 169, 214, -251, -234, -21, 271, 273, 65, 39, 282, 206, 210, -8, 72, 74, 39, -104, -94, -5, 70, -59, -42, -4, -50, -321, -323, -95, 42, -60, 7, -64, -3, -47, -85, -103, -197, 70, -120, -124, 75, -258, 233, -32, -109, -180, -116, -82, -16, 139, -96, -131, -171, -229, 178, -132, -169, -76, 165, -50, 2, -56, -12, 142, -190, -29, 51, 85, -183, -55, -45, 126, -19, 210, -183, 101, 200, -2, 178, 108, 65, -36, -63, 50, -146, -49, 142, 104, 150, 164, -62, 49, -196, -75, 52, -131, 92, -69, 152, -122, -204, 22, -85, -73, -145, -156, -183, -12, -105, -168, -104, -274, -87, 66, -67, -161, -95, 56, 31, 0, -15, -229, -1, 28, 147, -306, -123, -7, -10, -205, 81, -97, -168, -102, 81, -12, -47, 66, 129, 110, -38, -55, -116, 62, 17, 87, -145, 122]
3843A22k56K89J32j68j74J72L1j08q4L6J46j47J17J62m72J15J56j14O5l4J23k3
3865H6K13n32J13m0K96j67LM2j09Mj59J59k3M80k36j58%k23J62Pn8K63j26pJ7
3890Gj18K81n10M14o3j69L20r2m2K41k21R7j00k26L71j27m6o1K46m22J69K89j57
3913H1j85L29j14k5j28J35N9m3qJ49k26o3K53L8j27j81J42m5J3j72J50K1p6j13
3937a36J00J54k40l6N7J63k86O3J62N3M8l49K52JL7m8P4j36N4O9j92P0m3m9N1
3962a07M7OP5L1j07jJ26j03k5P0j66L24j5k38M1j9L2R2l0J02j11J52k76L73k14
3987E9o4K5N2K1j57O9J63j27R5k3K0M7j88k59K79J40l2k31J63p9j49K22o7p6M9
4012d8j53J26J84n4O9M2j62L0qj87m4P4m4N0PpK17j11m5K2q3K10k64M7L04k13
$$ y = [122, -134, 155, 287, 119, -55, 117, 148, 40, -44, -8, 138, -9, 108, 270, -202, -87, 69, -45, 20, -14, 109, 86, 299, -233, -120, -160, 136, -31, -28, 14, -95, -91, -250, -91, -114, 366, 130, -28, -28, -251, -89, -82, -140, 123, -3, -10, 7, -111, 170, -340, 74, 11, -158, 162, 70, 28, 269, 48, 145, 45, -181, 190, 63, 17, -44, 202, -220, -51, 238, 81, -104, 225, 111, 86, -42, 93, 152, 109, 101, 250, 24, -39, 214, 252, 125, -56, 86, 41, 54, -118, 32, 53, -23, -136, -36, 118, -122, -158, -101, 62, -224, -161, 1, 54, 102, -247, 5, 6, 43, -5, 69, -67, -13, 56, -136, -66, -109, -158, -107, -60, -54, 21, 52, -55, -56, 70, -33, -58, 12, -154, 170, 155, -83, -42, -61, -29, 63, 33, 135, 24, 176, -100, 273, 59, -5, 20, 72, 93, -64, 5, 168, 41, 136, 113, 133, 180, -8, -267, 12, 152, 120, -111, 52, -27, -176, 46, -21, -97, -48, -201, -75, 109, 55, 124, 166, 4, 34, 26, -161, -205, -131, -175, -125, -118, -125, 92, -19, -64, -42, -125, 85, -179, -132, 172, -41]
4038d1j58K20P3n2k17P6J83j41R8K59k15k15O8j22K49J7Q0j06J51l64K81J48K2
4061B94j9l36n2L59k44J48j30j3J46p2k2k4k0j2J00j80K39L1k23J38J13r1j76
4084d6K7N6m9K5JJ7r2K33k44k35L16p7K0k26j37L29r4j12M0K09PJ7j78m4L52J2
4110A27k32k8R2K06l78J90M3l15J69R5k2K5l9j28K57p9K54k72N2N%J53L3%j09
4135I9N0Kk19K65j43j1nK17k90K07O6j02P9j60J97m63K73K2j90L3Q7K23k91J42
4159H8r7m5J84k69O0K99n22K98M8j28j87K57q7o3J90P0O4k08j58Q6k1r3K17j0
4183b7J63r5k92J06J79j89J07J10JK0j0o2OR2K67k03n2j60J03J8Lk83L05K15l27
4208eM0o4J00L9k55M53l88K08J9j82K35l48L3L5Q1K39k10N1p6j49L11j94J65k4
$$ y = [-41, -199, 21, 94, 42, -175, -99, 84, -57, 41, 300, 85, -130, -62, -184, 65, 82, 162, 56, 207, -157, 124, 272, 294, 275, -61, -113, 246, 2, 150, 20, 7, 153, 81, 59, 35, 15, 3, 103, -77, 162, 193, -30, 108, 221, 130, -46, -19, 37, -12, 13, 14, 31, -61, 172, -72, -307, 9, -68, -48, -274, -411, -82, -176, -288, -248, -39, -32, -15, -193, -237, 115, 127, -105, -133, -41, 165, -213, -23, 20, -295, -126, -31, -53, -28, -67, -195, 62, -17, 237, -35, 17, 22, 22, 175, 208, 208, 99, 149, 151, -68, 197, 54, 43, 38, 255, -35, 172, 238, 136, 215, 55, 252, -211, 62, 84, -106, -73, 14, 237, -54, 88, -9, -54, 130, -139, -79, 220, -302, -4, 44, -84, -271, -14, -101, -164, 26, 96, 160, -48, -206, -120, -141, -234, -17, -27, 136, 41, -251, -145, 34, -155, -48, 62, 63, 83, 73, 11, 17, 109, 376, 173, 121, -39, 64, 82, 85, -198, 107, 322, -5, 35, -29, 71, 110, -145, 308, -80, 128, 147, -35, 200, -148, -115, -80, 1, 240, 30, 81, 5, -144, 167, -27, 138, 114]
4232A14k68J10k30K9L67k34P6j11Q6J46k23J41n2j74K4J75j44j25P0J16j60L69
4254A02l38J79R9qK2J04j33j5r4k1j53J69m4P4L8r2K43p6Qj87J01m3j58J15J44
4279C6q0K44j78O5Q7K4o5Ol0j39M8K2m5n9J0J62P0l14K14j42J56j32j09K68l0
4304H9J04k59K60l85N0J60k57P2M20k95o7j63L4K11n9J2j44J31R6lk48J33n4J09
4328e3LN7J73k92O0k8M1k09Q9K18O6q1k76L69j62j06L1J42R5P8j57j27L6M1J38
4353A46m8mJ41j60k4j5n7J96j91J48j64J6O9j7J42p2q7K1j59J79k08K01j61M06
4377B98k57R1j04k32Q4J94M0o6j51M8j11R5K4kM1O8O2j13j87J7k7J59j97J67O
4402e3q2J20o9m8K10k82N1Q3O2l6m8k8J40R6O5j51J08Kk70M7m9M39Q9l27J36k59
$$ y = [114, -154, -44, -274, -245, 122, -112, -36, -147, -61, 85, -138, 3, -49, -223, -199, -24, -168, -293, -223, -107, -267, 102, -236, -57, 42, 34, 56, 160, 27, 12, -82, -103, -256, -87, -131, -57, -19, -111, 132, 56, 64, -123, -22, -65, -223, -108, 36, -44, 200, 22, 87, 174, 198, 133, 139, 109, -30, 18, 40, -5, -64, -54, 108, 178, -136, 78, -64, 92, -40, -149, 119, 89, 193, -66, 194, -191, -141, 19, -238, -166, 254, -41, -108, -271, -237, -26, -85, -73, -217, -86, 10, 7, -241, -108, -162, -53, -50, 7, 180, -112, -52, -80, -39, -248, -159, 59, 125, 44, -232, 137, -25, -131, -100, 42, 137, 215, 58, -69, -33, 8, 146, 98, 94, 235, 75, 51, 36, -21, 175, -16, 132, -32, -16, 53, 36, 178, 106, 19, 40, -119, 60, -148, 53, -108, 298, 41, 132, 28, -204, -120, 74, 114, 48, -103, -55, -166, -71, -47, -49, -8, 60, 122, 9, -178, -161, -188, -29, -226, -59, -53, -135, -15, -84, -132, 78, -204, -153, -70, -8, -44, -92, -120, 20, 116, 181, 30, 138, 140, -130, -83, -132, 307, 396, 69, 205, -54]
4428e4O5oK03k18K22J39k24K07k83J62k94J45J46k95K11K11r1k44J56j58j47J76
4450B9J63j35j38K27j10K84l28J83k80P4k88L70o9m5Q0r0k9l5R2K56l96m8M04
4473A71k25J86l90K70k3q4J29J36j86j88J37o5J97m5k14K51r9k4K1P6K49k35k15
4496a70K11k7r6P3M13j95j72p2L43l20J92k63J05J15k62J57r3K83lj56k3L9j04
4519b5j4K4j88K60Q0p6k55L11j54J70r1j86J0K99j92m5j22J93O5j38q2J98p6j28
4543a62O9J00o2j97O5J7n1K30N1j90O9J45j69R4k7L84n65L05k6m4k6J14q9j6J19
4568A38Oj75K7l3N8Q8Mj69R5Qj82L00l6lJ50j93J95m4j71P4m6j31J89r8K05j26
4594A30p6O3j5j34K05L5l00j4l2O2p2l8J20J10k25P7L8J10p3O1j69j06j4K53l30
$$ y = [-54, 11, 5, 208, -10, 212, 351, 127, 334, 51, 213, -81, 64, 210, -85, 126, 337, 246, 2, 158, 0, -147, 29, 192, 57, -81, 146, 36, 320, -8, 175, -105, -31, -319, 51, -18, -63, 17, -73, -102, -137, -45, 211, -185, -233, 171, -54, 132, -258, 12, -11, -95, 34, 170, -16, -204, -67, -132, 65, 20, -194, 57, -42, -66, -45, 31, 280, 45, -170, 41, 14, -82, -9, 404, 209, 37, -35, 308, -12, 180, -83, 22, 137, -125, 32, -61, 222, 219, 63, 40, 79, -25, -39, -15, -203, 57, 137, 61, -194, 117, -37, 133, 42, -144, -134, 165, -27, -72, -194, -1, 64, -74, -156, 42, -34, -162, -93, 7, -55, -252, -187, -170, -221, 9, 60, -130, -61, 84, -85, 9, -18, 366, -199, 106, 80, 36, 10, 124, 35, 19, 138, 144, -31, -4, -37, 21, 109, 113, -56, 39, 47, -135, 165, 129, 126, 276, 83, 278, 234, 63, 137, 91, -40, 149, 51, 256, 130, 54, 117, 102, -32, 173, 208, -92, -106, -138, -76, -148, -186, -66, 44, -181, -104, -66, 44, -29, 32, -137, -243, -257, -4, -334]
4619c34L67j47J50l23L25m06J79J50j7Q0j58J64M2j6Q6j52j81J89j46J60kk78
4641b68J70K57k11J41j39J14n0nJ58k5M0j34J15j9k1j91R5N3j14L4n7J83j68L3
4665iL12k99k0l2K2J09p0j07qK30j15k7Q1j23J18k00K8k6K03j30m3pr1J67j85
4690b22K25j99K18q8P5m1n1J25j92Oj6J37J29k63Q1j57K45J43j58j02K66O9k4
4713B06k32m6M0j95L70j98L34k64N6n5p4Q9K29m39L22j04N9Q2p1q9k81L86J91
4736C16k06Lj02L4L6R4J1q6k03N8m2j6J13k23M3j02J90L1m2J85k41J8j47M5J48
4761h5J40k32r8J79J62Mj46M3o0J1N8LK3M0p2o1j66K95Q1l62J59p2J55N3q8R4
4787E8k16K0L90j38J36l80J87k27Q0J56J76k23j16L37K05j86k61M6o1K13j61L0
$$ y = [-334, 33, -114, 36, -287, 38, -368, -189, -39, -56, 24, -134, 30, 72, 56, 142, -10, -191, -2, -148, 12, 10, -268, -98, 159, -52, 89, -50, 64, 14, 9, 167, 142, 182, 48, 163, 144, 123, -68, 27, 80, -34, 0, -57, 126, -42, -9, 303, 4, -16, -48, -26, 83, 13, -94, -102, 128, 13, -14, 67, -56, 62, -138, -110, -136, 67, -63, -106, -113, -204, -37, -222, 3, -196, 22, -66, 9, -32, -83, 42, -150, -144, -160, -23, 106, -157, -76, -233, 12, 155, -3, -105, 161, 230, 206, -26, -72, -32, -227, 143, -55, 279, 15, 71, 16, -58, 31, 260, -179, 143, 39, 98, 180, 109, 20, -261, 125, 316, 110, 113, 11, 45, 81, 175, 186, 100, -103, -45, -87, -103, 10, -213, -170, -272, -82, -51, -93, 92, -149, -131, -278, -233, -85, 55, -177, -275, -96, 66, 70, -76, -33, -93, -82, -24, -21, 2, 42, -30, -91, -257, 38, 119, -243, -84, -156, -1, 52, -36, 58, -158, -138, 252, 114, 250, -130, 57, -170, -90, 66, 242, 19, -97, 240, 445, 259, -2, 44, -17, 196, 35, 65]
4809F5j2N7J41n8j75l2k0J71L1M5j28j73L22k46p9J19J9j39nK9j03Q9J06k60K30
4834fp1r5J88j90R6j09n0J28J15p5J37j82P3k16K76K5m14K38J2j29J13n9K36K66
4858C07l07J11r2o2l6M2J54j7P2j59J1K20L4j86o6O6j04L09j12n3P6l01Q6M2J16
4883A51j47R2K45k30l1j4j03p8rK96l11J17J85O1q4l23J34j20J65l5k40J76L2
4906g1j61K32o3N2J18j01l69K47o2J82k84K63R1k29p3Q7L7M5J35p0N7n3o1J47
4930I6j24pm2J21j28J57R5J3j35j34L12j4j92j57L73j13P6l0j80K10j15jK9k37
4954a27K18L9p1m1P9r2j29p2K27J6J35j62k19Q6J75q2K4j52L29k30j40j2K07J0
4978A6k35K99k52J2J58k85j17L44l8P7k28L93k96k45L77j60n4K85j70m5M22l29
$$ y = [65, 53, 110, 251, 193, 18, -14, -34, 137, 168, 213, 85, -88, 234, -12, -91, 28, 47, -92, -97, -68, -171, -82, 24, -236, -6, -77, -172, 16, -174, -78, -187, -237, -109, 6, -69, 68, -114, -41, -257, 19, 44, -370, -132, -120, -249, -136, -195, 41, 307, 0, 111, 19, -43, -79, -37, 117, 100, 172, 13, 24, 244, 278, 92, 26, 92, -12, 297, 185, 132, 208, -93, -7, 35, 151, 4, 96, 341, 111, 80, 66, -37, -115, -124, 172, -139, -22, 163, 224, 140, -183, -49, -169, -4, -39, -279, -103, -71, -232, 0, -63, -11, 107, 6, -363, -116, -178, 4, -280, -17, 74, -155, -228, -141, -104, -59, 76, 6, 63, 10, -51, 96, -28, -35, -77, 44, -84, 73, 168, 181, 46, -88, 224, 210, 18, -139, 234, 121, 197, 167, -13, 197, 82, 81, 110, -127, 91, 130, 59, 18, 97, 5, -124, -196, 31, 47, 182, 20, -199, -113, 62, -20, 4, -148, 181, -49, -189, -201, 6, 16, -219, 80, -172, -160, -2, -287, -404, -60, -98, -21, -249, 144, -152, -397, -20, -180, -234, 51, -119, -164, 258, -71]
5000g1J62l4J18k09J53l5q6K29l2m2r9R2qj5N5k26J40L2q6Q4q0p2J23J20j64J4
5026F3J77J42m22k7L02l4n9O6k35m6R4O1o8J09j09j46M09k75L9k69J40j26K66
5049E2k70K74j60k69K58N1J84k99p7L89j07k72L55j55J04k89O1J39r1P5J27j56
5071g6j19J10O9R3j18j35K61rl59L24j02L14k00O0J28k09L7lJ35q1RN1k80J49
5095D9J15j67L31k70O1j22K77k23J42k64J83r5J82j8j42K54k70N9j48K4J61k21
5117a02J54r2J05j13q2r5J92J00k00J20K61n19J70o8R2k84N23k18K5j39K00k19
5139a89J42j64Q6R8j10K9J19O9j12m6N7Q4l8J02j02J36k04n9K2N6l4O0L6P7j89
5164g4J94k18J42k16K64N8M2j81J20Q2j72R3j19r8J59N2j12r9N8J16j05K93j70
$$ y = [-71, 91, 57, 175, -34, 119, 84, -2, 227, 195, 153, 54, 146, 138, 123, 178, -48, 92, 124, 38, 122, 42, -30, 93, 213, 49, 63, 240, 382, -40, -67, 235, 201, 142, 208, -27, -73, 21, 82, 14, 123, 14, -132, 277, 2, 41, -228, -88, -214, 52, -218, 56, -104, -373, -115, -64, 120, -179, -256, 133, 26, -246, 109, -46, 58, -231, -170, -31, -122, -47, 80, -76, -195, -85, -16, 77, -41, -176, 85, 76, -283, 41, -61, 253, 53, 113, 241, 32, 69, 66, 201, 120, 129, 180, -100, 49, 164, -3, 328, 58, 119, -3, 274, 51, 193, -71, 112, 17, 199, 181, 39, 293, 23, 82, -66, -42, 119, -102, 52, -40, 65, -48, -130, -225, -33, 67, -133, -13, 248, -271, -101, -169, -77, -361, 162, -56, -31, -170, 30, -189, -47, -211, -125, -27, -137, -108, 11, 80, -32, -78, -21, 63, 25, 127, 25, 161, -43, -102, -80, -24, -58, 2, 38, 115, -74, 120, -98, 44, -172, 92, 150, 192, 11, 131, 213, 41, 134, 15, -83, 76, 128, 16, -83, -25, 91, -14, 279, 109]
5187A09j4k19k03L58j15J52J23j73j85P1J5m5j07J01K1l0J10K45l14l7J20J25
5209A08m36K4L51p0j16N1L8j87Q3K20R0m82L08J07J2l4p8k1P9q0Q7J6O3L3p0M6
5235A42k65K31J27P1l22o0K4M4J90o1j32P1P9M3n0k32L47j06Nj6L1p4o9L10m34
5260a06J62J13j69Q3N3j33j11R0K1rj09K0J4j26Mj0Q9n1J44J09j02K85l65J73
5284F9k22k06K11m9J16j02J41K03k79J80p7k43K64J18k34R9L0J9j3K39l33R7K
5307C0j0l8j6k4OK08n0k5M3j06K26K8k32j25j3K53k6j52O9J3nq1J55n5J46r7j68
5334d6O5j28J27K2M9k4k82J90PJ31k01J30J15j42N0R3j92K43l68r6O2j90L84k46
5358b47J99j19p7K58k55K28k90M31l24N8Q9r1p0J28J03j64K1J08j1k04K86L8m8
$$ y = [109, 95, -124, -327, 31, -84, 68, 191, 18, -167, -96, -81, -126, -233, -132, -111, -141, -31, 214, -100, -137, -17, 108, -328, -304, 47, -23, -139, -88, -50, -237, -154, 66, 156, -326, -18, 89, 101, 67, -11, -32, 47, -33, 54, 70, 133, 166, 96, 142, -123, 108, 235, 306, -16, -76, -52, -8, 182, 121, -11, 60, 139, 182, 132, -100, 247, 141, 146, 130, 161, 87, 18, 328, -106, 56, 169, 0, 83, 136, 3, -108, -18, 3, -6, -115, -95, -81, -207, -203, -213, -124, -175, -31, 78, -24, 261, -104, 69, -153, -359, -148, -197, -81, -183, -42, 161, -118, 62, -15, -258, 6, 124, -110, -11, 19, 38, 25, 264, -69, 28, 30, 20, -18, -34, -58, -52, 156, 106, 81, 124, 18, 244, 272, 40, -85, -98, 155, 129, -23, 46, 59, 54, -27, 128, 73, 219, 122, -46, 19, -109, 18, 40, 89, 65, -217, -27, -20, 111, -90, 40, 155, 13, 63, 156, -36, 207, -161, -257, -195, -385, -1, -247, -48, -167, -244, 14, -241, -13, -303, 128, -196, -138, -49, -140, -210, -82, 21, -143, -122, -14, -25, -229, 57, 95, 47]
5381D7N3j42J26o5j9m2K4K25k96M66j79k93J02r9N7R7J81j33Q4O0j28J34k40j96
5405a76Q5j5P2j64K57J32k16J22j88J40j75Q7Q6J41j66j22K88j51j89r0K27l59
5427c74J86P7J22p6J2K3p0j2k29K15j21L02j15j0K4m1K84k72K57j90j0L7K8j47
5451a00P1r1J27J27q1K2P3P2r2k9l2j14J75Lr4L3O5j33lQ5P3p3Q3r0j20J71k59
5478a31Q9K18l53K44j5J66l6k70mJ9L13l10K94l73J11k1j79K02j48j01J70j43
5500b58J15R3j26J47j23P5n5N2J23k13L06k13k4J17k74R8J73O7r8k91J37J79j88
5523a81J27K12j77j82J94%K8M7O5r7r3K56j83J42n2R4N9j68P3j13k59N15l26K54
5547B35k49j20K44n8O6o8j39M9K47l9l2j44Q7Q2j03j30J69j24j43L74k36P1l6
$$ y = [47, 100, -42, 84, 19, 0, -42, -18, 207, -89, 377, 198, -95, 7, -92, -35, 62, 243, 110, 194, 254, 126, 260, 20, -176, -91, -106, -34, -198, 59, 191, -25, 97, -91, 49, -126, -39, 47, 188, 22, -100, 188, 37, -152, -242, -15, -374, -188, -111, 11, -65, -53, -30, -100, -112, -341, -126, -247, 55, -60, -70, -46, -87, 197, -75, 182, -8, -18, 19, 47, -100, -29, -120, 7, 134, 53, 75, 148, 220, 128, 99, 67, -47, 128, 131, 37, 70, 135, 2, -1, 84, 157, 84, 167, 77, -43, 128, -131, -42, 176, -177, 67, 52, 218, 182, -88, -92, -73, 240, -70, 224, -149, -38, -59, -238, -36, -184, -285, -115, -258, -143, -50, -176, -29, -152, -77, -132, -80, 43, -170, 136, -77, -101, 16, -258, -160, 13, 80, -18, -309, -172, 7, -181, -54, 158, -19, -201, -7, -7, 21, 68, 133, 36, -57, 199, 16, 158, 106, 200, 259, 91, 164, 51, -208, 307, -19, 235, -14, -134, 110, 52, 118, 50, -89, -40, 207, 168, 136, -8, 79, 161, 58, -72, 97, -27, -170, 204, -32, 39, 3]
5570Cj20p0J25k0J60j42l1K13l46NN7R3J51r0l9j33J14J44q1L9j99J32q6K63k56
5595a14J63j23n7L03k57J56l85K51K03j09N3p9M8jJ21k08M3R8m9P1R0J18m50L69
5619B55Om1j29j44K5J14r0k3R7J74l44K50k57Q8J26j37K95j45k84L88l15O5J92
5642A66k33j0n4J49o4nj29j1J64P5mj08O3J78l27p3J05LJ64K4k08P6l6P2j86L19
5668A10j00N7k87L41j22k03J43P3o5q4L27j34R0R8j60M1lJ48k28J51l36L55l20
5691a08l0k9K40j2M3k0j31O6N6j07N5J20l07J15P6Nj19J84k84M74j96J6j46P9
5715D0J20k63r5q3M07m35J44K76j76Ln4j15J6J33j23K75j40ko7L9R2P4q8j6j2
5740e0k66L45k35L12k55J30J61j44r3M8J77R1j52K0j46J96j10J5r8K03k33P1J44
$$ y = [3, -117, -187, -62, -82, 78, -64, -95, 118, -228, -223, -166, -73, 78, -12, -51, -184, -70, 74, -7, 32, -167, -35, -121, 142, -114, 49, -74, -131, 172, -85, 71, -314, -63, 140, 31, 84, 5, 53, 52, 173, -35, 8, 106, 57, 128, 218, 336, -114, 255, 261, 220, 91, -53, -28, 86, -4, -27, 70, 244, -100, 150, -107, -19, 107, -30, 265, 120, -164, 224, -91, -26, 166, -67, -77, -131, 18, -46, -51, -180, -191, -27, 48, 44, -64, -1, 177, -150, -223, -118, -115, 49, 73, -135, -59, -95, -23, -209, 110, 10, 67, -220, 121, -1, -204, -61, 12, -53, -137, 190, 56, 146, 244, 84, 125, 122, 270, 42, 193, -143, 212, -108, -138, -167, 73, 61, 104, 84, -47, 19, 75, -32, 23, 143, -164, -49, 27, 32, -87, 97, -187, 287, 91, 107, -39, 40, 160, -103, -198, -281, 126, -309, -165, 111, -65, -62, -116, -231, -215, -82, -205, 70, -70, -72, -139, -100, -8, 66, -22, -38, -50, -316, 29, -206, 106, -149, -19, 142, -2, -95, -47, 130, 221, 69, 89, -57, 139, 29, 44, -54, 149, -84, -13, 131]
5763A31r2L59j32k89J89o8j23K68j91q1k5K13k68K80j07j17J11r5k1J23Jj29N9
5786dP3l27L36j12j28Q9l8P1J43k97J8l9j0K01J75l11J20j23JK11k46ML38l77
5810b32K01M4j32J76m3o3K01q2j97m9K21k44M71n15l0K73k41K29M8r7K37k47J13
5833D2J81j83L89l67j52K67k8j76j51M81j43q0m0R8P4j63j22J10J43j68q0l1L65
5856B66k87J96l45M4PJ14N2q9j14K76l25N5P3J05o8k2O2L8j17J86k36K52j14k31
5880b22K49j98P8M8J34j93l23K73L00k80J28o8R6P2m6j70K27j00j78K52N2R7j23
5903A05p8O8R5r4j17J35n5M9l5J80k54R5m5l8k4J79j66j01K68j00J2Q8K1k5k04
5928d1q9K07j03j00J34J54k04Q6nj93K48l14K48j06n7L26l36r6N7K11R3j72l8
$$ y = [131, 39, 398, 266, -23, 166, 98, -25, 243, 52, -29, -54, 159, -109, 171, 64, -53, 58, -37, -58, 65, 66, -63, -4, 69, -258, 78, -34, -162, -73, -111, -40, 103, -194, -176, -215, -225, -24, 151, -160, -40, -163, -162, 49, -197, -193, 145, -232, -31, 13, -119, 57, 14, -49, 152, 70, -127, -176, 45, -199, 272, -243, -273, 0, -241, -12, 36, -61, 176, -71, 42, 223, 40, 429, 62, -90, 177, 149, -27, -178, 303, 160, 80, 40, 138, 212, 49, -73, 37, 180, 12, -68, -99, 266, -21, 175, -170, -126, -119, -5, 47, -42, -156, 120, -205, -150, -77, 28, -40, -62, 0, 38, -79, 107, -129, 123, 9, -222, 27, -171, -93, -45, 89, -104, -427, -154, 146, -134, -6, -74, 22, 94, 48, -122, 105, 5, -173, 79, 131, 228, 105, 27, 95, 190, 96, -21, 114, 59, 108, 73, 253, -1, 94, 49, 11, -13, 166, 0, -101, 167, 67, 79, 167, 188, 163, -41, -130, 77, -26, -126, 8, 162, -42, 44, 39, -154, 94, -220, 28, -78, -135, 191, -145, -241, -184, 27, 120, -52, -90]
5951i0j62J01J38k02o1J13p2K36qj7Q3k22R8L3K3j00J89l07J26J4L13q4j11R8
5975A29k21L09J1l55Q3lRJ18qq5J71K1k94Q8K97l14O0J93L7m71J66J24M0j73K24
6000A56k55L28n6k81J68J54k34j79K91k71K80q1q9J73j34j05K55j34l5M4m8j37
6022a90K90k14N6m0J1N2Q2R4k89MJ65j9p6Om8K8J61j40L3%j0J34oj42q7J72p8
6049e1Q8N4q6m5p6j28K57J85l17L01o8j27J4j15Q1K6o7l8N2J50L8j56K5m5J11
6074F3j95L33l0k63J38j56J2J88j93n6J66J08j73k3J33r2J28k43N2O8N3J17l59
6097b24J62J36j13l5j04Q1j7n6J28j57K06J7l06M06l74J35j6L83l82K49k17jK19
6120A20r3J32j0j31l0Q3j27N4J18r4P5j7pM8j45r7mJ43K21k44J28j69J77k03J19
$$ y = [-90, -252, -151, -13, -215, -276, -163, -235, 1, -7, -24, 59, -163, -65, -32, -9, -109, 80, -227, -101, -87, 226, 142, 31, 129, -92, 217, 228, -127, -44, -47, -38, 80, 72, -13, 158, 179, -115, -27, 270, -44, 16, 209, 246, -225, -59, 65, 105, -68, 156, -99, 229, 173, -108, 60, 214, -20, -199, 92, -179, 101, 20, -69, 104, -30, -135, 120, -14, -49, -5, -53, -190, 100, -114, -58, -98, -87, -35, 47, 141, -148, -144, 21, 2, -74, -68, -116, -88, 73, -67, -34, -34, -44, 90, 84, -58, -145, 27, -51, 37, 91, 5, -40, -116, -244, 13, 198, -119, 182, 114, -13, 1, -114, -33, -7, -74, -112, -60, 90, 128, -28, -3, -48, 63, -132, 201, 171, -92, 46, -110, -98, 90, -103, -159, 7, 115, -58, -81, 52, -40, 88, -155, -103, -35, 18, 135, -224, -62, 74, -39, -74, -178, -97, -114, -170, -42, -199, 7, 24, -282, 124, -250, -115, -131, 252, -130, 119, -98, -99, 120, 27, 159, 149, 18, -12, 71, -56, -2, 116, 22, 97, 80, 73, 121, -24, -121, -125, 18, 239, -5, 123, -46, 131, -72, 47]
6145D7k2K08m7O8l32R6K2J2j88K40ol77K81O9l23J55J96k96R1O7Q2j3K1K56k22
6170H5k03J81k26K84k05P7L5j05L5K10k96lM7K11j04r0j35J91r7J83l1j35K34
6193A43m2J5j36J29nj64O3rqp5K93nr5k02K68l7j01R7K10k48Q1l57L18j89K47
6218A91j10k94L67P6pl4j5O2l11j96J78L6J56k39J46l26K35J01J44q0q1J8p5J32
6242G4q2oJ6q5J78p6l9n0Q2k6K87l85k7J59l00K49J16J9q3R1N1k43J2Ll2J28l1
6269@k7l5L09j91j29K29j99R2R6Rj05J2j44j7N4N6J15ln4Q7j18J2K60k33m2J19
6295A53j55J02p1K4j70P4p9L06j20L9k64J24k3K29k57j55K46L0r0j9o1K37j05
6318em7l1J19N5j75j47P2O4kk12J30J65k32J97J72j46J01j18j98K69J10o3j33
$$ y = [47, 25, 233, 186, 254, -78, 18, 40, 52, -136, 104, 98, -279, 2, 71, -252, -97, 99, -197, -106, -39, 43, 30, 51, 307, 85, -118, 63, -163, 121, -84, -7, 28, -77, -42, 168, -128, -131, -84, 127, 23, -67, -202, -11, -108, 75, 44, -91, 143, 101, 116, -20, 109, 104, -60, 3, -6, -14, -89, 204, 199, 104, -98, 170, 133, 32, 129, 339, 91, 172, -185, 133, -56, 191, 81, -213, 154, 230, 223, 189, 174, 236, -75, -271, -93, -57, 99, -140, 6, -320, -85, 16, 160, 80, -1, 17, -58, 74, -8, -14, 2, -83, 95, 19, -20, -70, 12, -14, 273, -112, -139, 20, -280, -31, 85, 104, 21, 112, 163, -80, -68, -65, -97, 31, 0, -27, -62, 247, 56, -73, 156, -43, 49, 145, 154, 49, 61, -83, -100, -46, 10, 125, 122, 68, 155, 37, 49, 309, 76, 34, 153, -2, 100, 29, 53, -117, -43, -122, 184, 64, 103, -161, -37, -60, 169, -88, -243, 3, 33, -57, -76, -137, 100, -5, -52, -83, 36, 91, -84, -231, -159, -95, -97, -309, -179, -14, -246, -49, 123, -23, 78, -40, -238, 31, 141, 78, -55]
6341e5J26k5k7N3K8n6l03L76l0L6j14Q6N1l3o5k82K94K45k87M5p1J17j36R5j47
6366g9J11n5ko1K09j51J81j27L4J43k37J14j59J94k28R8j46P6K38l27n9O0k7J47
6390e3k89M79j13j31M9o9m0J98j45n8L6L30j67L33k29j71j38J56l2r9K07j43K18
6413A29k65L20k72L3P4J65j31J05j02Q9j0P0k01K04j30k58M26Q5k14j02J1P5j80
6436g9K54L6l99K62J9Q2k28J54k45o1K84L4J5m13K23N8j07J91Q2L2j33J30o1l25
6460a95p3K68r5k0PQ7j20O8J06j0j43N7J38p4j66K90q7j57L35m37O0K33j5q8K2
6485iq1K62l73Q2L42l01K19p4j09M44k14Nm69L23J40j38j82K84M3n3j35lJ14J46
6509B63q7lm01K38K54k91P3k1J80l03O6J8n0L0j30K41n6k30n0K39r3j17J10J17
$$ y = [-55, 71, 46, 19, 72, 100, 44, -259, 117, 87, 123, 9, 95, 146, 113, 48, -234, 60, 305, 18, 63, -8, 109, -27, 68, -79, 32, -23, -25, -86, 123, -28, 153, 26, 60, 203, -34, 80, -79, 115, -113, -15, -161, -85, 153, -174, -233, -173, -200, -53, -342, 137, 24, -107, -58, -127, -167, 31, -114, -172, -136, 194, 27, 360, 131, -40, -178, -22, -54, -153, 54, -89, 129, -136, 184, -88, -55, 19, 184, 53, 158, 56, 145, 135, 205, 4, 208, 78, -180, 246, 331, 117, 15, 26, 101, -79, 175, 211, -188, 74, 93, 175, -53, 101, -144, -205, 79, 113, 128, -285, -62, -4, -111, 80, 162, 194, 61, 191, 130, -195, -268, 0, -95, -115, -108, -21, -141, -73, 33, 23, -120, -63, 75, 1, -165, 125, 38, -119, 216, -221, -161, 72, 57, -31, -9, -90, 172, -201, -119, 223, -78, 141, 67, -42, 402, 188, 193, -276, 47, 187, 49, -133, 151, 194, 141, 6, 3, 117, 263, 176, 173, -228, 10, 264, -27, 46, 25, 205, -98, -32, -14, -64, -34, -164, 77, 21, -209, -259, -20, -113, -230, -120, -3]
6533cn4k1j84J23K75o3k34N11j67j80k06J09O6P0j92L19j50K49l09pj2O3Q7k26
6557a36J4n4L50l05J73j38J14J38l06K82p3l7J45K2r6q1K43l0n4k26L14l47R4
6580Fp3LR3Q4j97J67K1j20Q0j77M0R6O4n7j4J03k41R2n4J67j30QR1j44k8L8Q4
6607Bk3J14J7k18J62J08k22k1n7m1LK40m9LJ5l4mk19J01Q7J4j56M3K39k3k01J05
6634a5j17K8J43J9k71M40m21K23po9J71m8q3J44n1J66k25R9j53RJ98j85j90K82
6658H7J54k33L29k97q2J82k92K50k43o9J61m4J3J19k25M07j49J23j40j83j9OJ9
6681a26J42Jm4P5J59k43L8k7j14J47j31J62N7kk45J58j62nR0Q2q5Q6k29J95N0
6706B9K6j17l5J29k13J3J55J08j30j7J41q0k12K51n7R9j79n2J67j44k40M34j63
$$ y = [-3, -57, -78, -262, -139, 136, 73, -161, 350, 183, 3, -203, -94, -28, 42, -150, 169, 19, 268, -41, -48, -60, 3, 90, -136, -122, -176, 174, -131, 42, -96, 18, 156, -150, 132, 59, 22, 167, 189, 93, 12, 255, 225, 171, -55, 259, -88, 6, -67, -64, 29, 113, -84, 83, 104, -16, 64, -113, -73, 23, 87, 30, 16, 119, -122, -30, -84, 83, -47, -39, 52, -92, -120, -82, 2, -21, 93, 110, -108, 54, 162, -60, -81, -138, -179, -176, 64, 15, 18, 33, -1, -5, -224, -123, -36, -22, -178, -135, 104, 81, -120, -15, -132, -104, 39, 58, -213, 227, -194, 29, 22, -47, 124, 76, -7, 137, 86, 252, 27, 126, -27, -18, 180, -5, -195, 87, 241, 8, 337, 40, -42, 140, -152, 98, -145, -214, -53, -97, -84, 35, -190, 217, 68, 191, 51, -132, -151, -145, -126, 16, 17, -27, 48, 207, -36, 2, -25, -139, 8, -123, 39, 96, 94, -151, 7, -155, -160, -70, 12, -73, 13, -216, -21, 29, 55, -62, -97, 32, -181, -168, -13, 95, -35, -52, 89, 9, -203, 48, -9, 90, -89, -141, 26, -118, -358, 76, -87]
6729h7J50L7k19K40j88l4K62l81J45M9p9J75j33L06l20j68K69lJ54o70L69K80
6751A54O4k35k27kM20J7n48J88R6K3j15LM63k96j03n5J60p2lm9r6J32JJ94l75
6776b61J53M5P0J0j19J16m0k10K91k9j2P3k3k2K6j41L28p9q0j02k1J24RM8N4j3
6802A95l4j12p7J75j7j56j8J18JM8m1N6j69K3K0l1O8lk35P8J25k52L0K64q8J26
6828I4j82m3J88j85P3q0m6J12QMK68j02l59Q5L81j82k14J44J04NNk06j63K70r1
6853a12L32m4K2k61n8L0K3l1L5K10k0j60N3m1J61p6O1k31K23Q1j69O8j74Q1J24
6878A27j01j13o6J89J33m30L07P9k39J42K53m5l56o9K21n3n3K08j06J1j44j14
6900b19l2J42J29Lk42L9Q7k9J0m5K82k45K0jn0J48K15l65R5J20J00l16J23r9J48
$$ y = [-87, 63, 100, -119, 121, -67, -101, 161, -220, -75, -26, -105, 70, -63, 243, -77, -245, 24, 21, 175, -495, -126, 154, 218, -17, -244, -246, 174, 191, -357, -169, -73, -50, -165, -162, 301, 5, -98, -153, 7, -65, -68, -117, -213, -81, -80, 114, -261, -108, -63, 7, 17, -102, 14, -26, -236, 55, 26, 14, 87, 64, 42, 68, -73, 255, 176, 96, -6, -27, 97, 106, 154, 208, 195, 161, 49, -28, 147, 130, -26, -44, 74, 75, 123, 82, 138, -31, -8, 12, -19, 49, 46, -189, -111, 14, -238, -208, 56, -32, 94, -88, -131, 57, -128, -55, -135, -181, -69, -61, -57, 211, 109, -250, -165, 216, 34, -180, -36, 68, 73, 78, -128, -291, -21, -112, 220, 176, 198, -63, -121, -91, -68, -99, -64, 146, 126, -34, 19, -22, 139, 63, 124, -107, 116, 197, 28, 96, -78, 3, 127, 26, -87, -153, 36, 169, -261, 46, 125, -114, 28, 281, 236, -120, -189, 32, -21, -74, 134, 28, 39, -105, -219, -251, -109, 20, 23, -219, -180, -93, -122, -112, -157, 125, -120, -100, -101, -151, -3, 212, -153, -58, 62, 162, -154, -31, -130, 18]
6925A8j16M64m29N2N6n5J28j36P5J8J22l66r2L31j24j83K92j1j70r1M65j54k30
6948a36K29k37L49j42j42J35j29P5N5k0j56K0K9p1k2J41N9k16K48p5j05m8L7J62
6972D0J23k05m1n4q7K22J24j46N7j2k11K11K7j0L1j79J23lj94R1p0L53j4j56M
6997B4J42k30j45L61l1j08K94k09j60L5P5k69K28p8J71q6L43l09J2j19Q5k44J44
7020g4K8R2n6P1j0R1p3j92J66j10k1J23q3M8J8j4K24k54P0j29L9J42l89R6l4J34
7046i7o5J2LKK79j45j1r6j4N5OM6q1J05L0j41K3L67l43o0L25j46j94J95R6k24
7072g3K2Q2l5j76K26J14j85k6J44j23M3j19J39n5J25o0P1Oj97n5J39J51j96P0
7096C2jK19J1p0l5N4k23J5O2k88J57J67j5j86j39K95k52J89J47l86J61N9J60k60
$$ y = [18, -98, 366, -63, -11, 45, -10, 118, -18, 57, 75, 197, -169, -261, 70, -54, -237, 55, 44, -126, -217, 248, 94, -136, 93, -144, 205, 63, -79, 56, -73, 2, 57, 37, -119, -99, -70, -141, -163, -22, 37, -179, 69, -6, -111, -159, -122, 40, 163, -42, -83, -137, -224, -2, 122, -24, 33, 21, -190, 21, 48, 38, 69, -110, 13, 10, -184, -93, -163, 190, 176, 20, 24, 166, -64, -209, 152, 121, 13, 307, 98, -62, -27, 48, -221, 7, -71, 100, 14, 357, 48, 60, -59, 26, -218, -74, -46, 46, -10, 61, 51, 142, 69, -123, 43, -67, -88, 35, -48, 0, 18, 4, 228, -26, 44, -85, -46, 96, -293, -197, -231, -97, -162, -150, -147, -145, 134, -11, -22, -118, -132, -77, -71, -25, -106, -1, 29, -112, -89, 278, -65, -125, 200, 54, -140, 55, 151, -73, -51, 31, -4, -180, 46, 160, -25, -51, 93, -30, 13, -106, 33, -22, 103, 43, 114, 120, -77, -132, 7, 158, -38, 32, 31, 250, 261, 191, 156, 210, -13, 2, 64, -224, -67, 100, 85, -101, -240, 55, -197, -8, 139, -247, -86, -27, 133, -127]
7120a27K1J3rJ91j03r6q9RK80k71K27q0P1R5r8j39k12M02k82K04R4j09K52j08
7144A36j61PQ2k00K03k36J79k91L96R3k63O6k0jJ04J60j65o5Q8l3k56K52m2L76
7168D09l29J1%r5k9Q8l07J36J36J64k06J03k00o7K25p9k4J52m8J02j17j55K07
7191G7k33j34L49M2j39O6j77O5L5Q0J37o3k76K84j92R8O7j62R2j57K40k2k60Q7
7215i6J21K3k34k9L31j50r6J04J41j52j34N9J85j22J9J07j6k51J51PLJ63k52J84
7239F6jL2j78K59m50K68M2Q1j3q9J22L9j95R5J07k33J63k6Ro6o1J90m25K33J68
7264A37mj30M1j6J68k38j68O9KJ24J46j02N1j8j25l7j18J9M5J14O0o1o4J09j90
7289a86J42q5K01ONr6j06J86J00l6J1L9l72J86P3j8Q0j17J94KL8l55o9K26K7j09
$$ y = [-127, -106, -93, -102, 89, -14, -110, -199, -190, 90, -181, 46, -34, 37, 132, 34, -105, -317, 85, -197, 7, 101, -8, 244, 136, -25, -18, 64, -136, 67, -169, 10, -281, 115, 208, -55, 11, -9, -10, 94, 254, 89, 24, 112, 79, -177, 75, 33, 409, 80, 91, 91, -4, -33, 55, -252, -116, 20, 184, -22, 81, -119, -186, 39, -40, -64, 88, 40, 142, 25, -130, 77, -156, -290, 59, 101, -38, 28, -149, -84, -49, 31, 168, 105, -171, 113, -79, 19, 86, -76, 16, -141, 99, 77, -183, -96, 25, 48, -186, -215, 116, -34, -130, -26, 115, -37, -171, -112, 73, -49, -30, 77, 61, -190, -39, -32, -29, 134, -118, 66, 65, 97, -81, 178, -272, -4, 38, 119, 106, 17, 139, 178, -17, 78, 185, -48, 115, 89, 98, 32, -29, 161, -264, -31, 137, 133, 3, 44, 28, 196, -42, -210, -141, -139, -15, 131, 29, 80, 62, -63, -100, -218, -199, -154, -40, 20, -41, -105, 4, -186, -44, -129, 72, 78, 83, -13, -119, 67, 167, 131, 142, 181, -191, -5, 68, 50, 130, 13, 207, 209, 247, -108, -177, 49, 76, -33]
7315c3O9j53O1R3O7r4k8K2k11K70J11k59J11J19o4j88L84k75J11j02q9P9k1P8
7339E8k31M41k92n3J32K3p9K7j44J31k22K04l8M4K1k14JK17o5K4J30r4K29l86
7363a36K11p8L8q3K60j96k4J85l08m0L88l07K70k37N0j3m1qJ53M4K0q8p6J58J3
7388A55rmq1pl9L04l36Q1J10j63o7R6j47J23J09j65O5J63m8l06L10j36m2M6j85
7413a73O7p9K79K0j56p3O1%j96L98k19R7P0p8N8r4j3M3j7k13P1J40J24k42R5j85
7439b15L94j30k1M4k18J56K6j33rQ4J40k80J98n4J37j47K79j89J11j6l4q4J30
7462A69K3r4j17P2P2j91J83J72j84k83K70n3m8N4j21P1M1k47J60J78l81K47oj72
7486a85K07q0J22M3l04K08j15J35j30L0Oj36J51Rk07K31K8m7J54j82l6J09r4J31
$$ y = [-33, 36, -117, -56, 37, 104, 10, -18, 4, -207, 63, 174, -85, 26, 145, 81, -107, 277, 2, 113, 11, -78, 1, -20, 58, -173, 268, -24, -77, 55, 78, -1, 26, -118, 13, -209, -5, -43, 1, 22, -192, -191, 26, -39, -15, 115, 21, 250, -136, 75, -3, 35, -48, 212, 16, -8, 177, -131, -171, 217, -90, 180, -57, -7, -20, -61, -69, 84, 128, 148, 60, -16, 142, 155, 146, 142, 61, 54, 15, 319, -17, 64, 174, 11, -56, 40, -107, 16, 125, -40, 25, 188, 140, -166, 144, 8, -34, 12, -173, -106, -185, 94, 114, -42, -115, -54, -54, -250, 148, -71, 26, 96, 18, 76, -18, -31, 12, -5, -218, -147, -7, 117, -125, -30, -215, 179, 49, 28, 72, -146, 10, 36, -97, -106, -22, 118, -162, 36, -18, 119, -28, 251, 62, 173, 157, 123, 39, 169, 192, 98, -19, 53, 125, -66, 117, 289, 105, -178, 92, 39, -9, 45, -76, -5, 36, -211, -51, 127, -254, -7, -13, -185, 22, -58, 64, 107, -197, 11, -104, 31, -99, -69, -63, -199, -48, -39, -246, -15, 13, -34, 120, -62, -98, 11, -83, 48]
7510D8n5J4p8L2Rl6J81k10m2jJ33j39J21k5k12L87m12M47O8k85Q5J78l03P9J65
7535A49j3p3j14M6n3L5P1j5M0j75J3j6L25j96l73K86o8o2n0LK59q6J12Q6k13K1
7561f1K6r2Q7J60m40L20j17qj26p6J13Q2J3L2O5nm5K08M0R7k23n5O8l04J46L5
7587f0M5J36l4k12RJ65j9k2J33j91K06n8j03K08k00j42J6L75o2q6R7l51R8L86
7611C34k57R0n4J5M8m2j02O8j07J74k49J62m2q4J4J06lk38Qk16K77O2j16R9Q7
7636C4j71J73L2l9q5j8L08m33J26K42k51K9M4r1R3j23L32m7k67J33r7J37m2j30
7660a11R8J77p4p6k05K09P5M2r6k74M04m7j70J78K22m53r7Q4J77J35J5J0J3j88
7684D8QJ0o5J32j6j84K39n3O8m3l27J77K8J70m5j16j44K77q1N9q0p3Q3R1q1o9
$$ y = [48, -7, 7, -71, -39, -30, -66, 115, -95, -137, -138, -5, -144, -23, -48, -260, 127, -285, 162, 230, -55, 30, 208, -95, -16, 149, 136, 63, -51, -5, -58, -23, 48, 33, 73, -102, -89, -105, 220, 24, -349, -63, -131, -193, -243, -240, 19, -67, 45, 131, -82, -61, -35, -127, -40, 120, -320, 0, -117, -125, -251, -327, -214, -132, -119, -87, -22, -27, -72, 136, 176, 273, 50, -5, 63, -241, -95, -60, -15, 121, 87, -125, -116, 49, 30, 8, 141, -50, 156, 98, -5, 203, 3, -139, -123, 252, 190, 104, 201, -150, -52, 334, 77, 167, 113, 128, 176, 134, 32, 100, -7, 167, -82, 80, 38, -46, -32, 74, 71, -167, -159, -375, -98, -36, -152, -53, 34, -137, 36, 68, 29, -56, -74, 234, -199, -73, 169, -82, -53, -9, -100, -7, -130, 202, 155, -112, 21, -76, 61, 19, -111, -13, 164, 90, 14, -191, 18, 93, 135, 39, -235, 169, 122, -48, 130, 352, -101, -198, -114, 63, 198, 213, 223, 236, 48, 56, 66, 1, 133, 117, -67, 172, 119, 187, 144, -183, -6, 22, 192, 147, 31, -113, 164, 83, 142, 62, -11, 72, 163, 82, 13]
7710A3j43P2J20j12K04j81N3q6K17o9k71J84O7k41R3j20o6L02j53J97j25p9L18
7733A94q2r7J01k24n2L36j32k81K46K6j02K35k14J33Q7o3l0J26k24Q2P4p2L8k02
7757i7K52j52l8R9p4%K72m22K49k41K18L6j54L1N7J33l48K32j0j50J46k0j1O6
7781G4j64p1M8P2p8M9l08J67J5Q9M8j55J02J53O7n6p6J60k3k11J19j3O2j21K72
7806B21l16K09l63K71Q4j09K40q8j49J2K3J57n1j57J7J48k33K45m21M22l18K07
7828E1K07q4p8j11J58o7k01J96P1q6j37J61M9Ll6P2j25j36J08P4k64J66L9j07
7852g7J6N7j75P0q0J63J85J13l11K3K14k02j55j5M07k54l8j19K18Rj76j7K60j29
7876a3j7N3j05N4J23j87K3M66n14J56k2K38j89j47k9M20k87rj73P8J31k7r7K27
$$ y = [13, -130, -58, 62, -50, 154, -27, 26, -60, 157, 88, -183, 1, 68, -173, -80, -200, -266, 36, -117, 80, -45, -124, 194, 112, 15, 116, -108, -160, 176, 44, -237, 9, 35, -67, 168, -46, 87, 174, 111, 81, 207, -17, 65, 139, 67, 105, -97, 155, 3, -35, 64, -10, -10, 262, -160, 89, -152, 66, 102, -52, -21, 36, 169, -179, 53, 43, -107, 39, 19, 8, 74, -90, -161, -113, -41, -119, -70, -378, -211, -196, -107, -59, -214, -112, 41, 108, 52, -24, 136, 113, -98, 21, 8, 70, -51, 221, -95, 114, -249, 22, 106, -3, 237, 149, 0, 12, 35, 192, 141, -16, 1, 149, -84, 161, -260, 162, -156, 51, 258, 174, 96, -15, 143, 76, -125, 71, 142, 56, -81, 80, 129, 132, 96, 168, 43, -93, 15, 89, -175, -9, 30, -77, -61, -4, -179, -109, -189, -26, 159, 272, -39, -16, 198, -4, -159, -174, 233, -21, -59, -178, 40, 49, -127, -144, 116, -13, -30, 23, -82, -28, 95, -92, -69, 397, -117, 39, 17, 255, 66, -81, -110, 310, 23, 14, -159, -81, 50, 23, -74, 153]
7900A53L4k09j9j8K15l18Q9O4M14m14J08j92l4K50M3j88J33p6J38j87J02j09J93
7923A72k27K4J34j52J46k24L12k88J16K81j79k86J08j12l9O7Q8p9o7N9L5l9J20
7946c0L2r8R2j38L28k13kJ04j68J95j71J30J09j54J9L35k77m0O8l2Q6j04Qj95
7970a16K07Q4j99J0L27l35r4P5o6J93q2L3k4p3m6L8q3J08P6J19N1k54J09r8j50
7995a90L48j80J31l14K54J07j66r8Q5%k05K32r1J07j77RJ84k57J12nR2L0k61J92
8019f1LJ77k97J11J44q9J00r6k01M20j36K6j27J68r9k8J57r2P5j04L3L4rj64L16
8044B61l79L44q4m44L35j33L18p9k27L94l52L2m1l1J36L8j88P9R4j94J06p2K11
8067A24j54j32M02l01M0n6K56j97j9J3q8J97k65K39n0j93K80j43J34k35O5J32
$$ y = [153, 187, -22, -41, -59, 156, -162, -73, -9, 405, -9, 99, -93, -127, 123, 166, -22, 111, 35, 173, -14, 88, -21, 172, -55, -31, 103, -49, 97, -127, 185, -103, 13, 294, 115, -171, -63, -175, -214, -147, -59, -138, -205, -146, -111, -150, -30, 2, -96, -4, -142, 186, -27, -29, 75, -93, 102, -69, 61, 170, 16, 35, 370, 93, 53, 121, 89, 175, 71, 79, -116, 91, 175, -24, -14, 313, -22, -116, -41, -107, 86, 4, 37, 13, -60, -106, -68, -151, -43, 33, 152, 203, -51, 58, -40, -190, 158, -22, 109, -205, 49, 156, -10, -108, -23, -23, -228, 4, -87, 20, -157, -148, 36, -221, -109, -114, -22, 8, -253, -61, -58, 119, -178, -67, 77, -12, 88, -8, -209, 211, 75, 101, -26, 142, 43, 15, 172, 80, 155, 51, 84, 118, 109, -55, 261, -118, 226, 142, -302, 33, -100, 218, 139, -88, 306, -46, -14, -55, -86, 50, 88, -100, -21, 73, -121, -15, -87, 124, -30, -162, 240, -61, -21, -77, 179, -18, -37, -24, -112, 85, -180, 59, 9, -184, 96, -47, 87, -148, -83, 49]
8089D9J12k94K35r3lj12K77l79P6O6J47m0Q0k04R0j30K80k39J85M0n7l6j73M9
8113g4J64P2k41J79nn8J14j09N2P4J09l59Q4P1N9j64n1j2lK20j88oJ17Kj29J38
8139E6J92m80J45N5o3M8QK9n0J87j54j38L18Om58L59k93J09J67j53K16P1k71k1
8163a15J11R3k4j81N4K55j44K2j56j1J08r2QL6J09j72P4J1j47J22m1Q9j19K60
8187A50M2l51O5N0
$$ y = [49, 161, -133, 102, 9, 6, -106, 171, -208, -132, -66, 81, 41, 121, -83, 7, -123, 157, -82, 103, 143, 86, 50, -123, -74, 90, 162, -79, 100, 95, 37, 151, 42, 94, 168, 277, -82, 2, 73, 132, -32, -83, -95, -98, 122, -66, -72, 45, 47, -82, 56, 248, -232, -87, -32, -95, -47, -39, -10, -60, 127, -27, -165, 153, 159, -299, 60, -233, -124, 43, -110, 106, 177, -94, -115, -4, 89, 65, -116, -62, 193, 49, 71, -85, -96, 12, -80, -72, -36, 73, -99, -25, -14, -161, -39, -80, 9, -110, 150, 192, -159, -94, -44]
8191d4
$$ Imaginary data points
##PAGE= N=2
##DATA TABLE= (X++(I..I)), XYDATA
0@%%%%%%%%%%%%qJ6j6J6k4L2l2M0n3O1p2Q8j04J21j44J68j93K24k57K94l37L84
34B04m34M90n53O23o98P80q72R70j078J198j326J465j620J790j974K174k395K637
52A381k905L202l528L895m308M777n314N932o655P519q571R879j1561J3822j7053
67i488K2147l1947R0149j53852J52285l001j81314K02445j30129N0725M4034r0021
79c7967P8578o1333m240M3394o2203R2846p4990N540O3466j00617P2144j4372
91B46m4193P6101r0818N5940J3249p7896R3540m6046m995M3700o3604N9166l8756
104b4366l664N6250p7142N8845j1028l8625P6878q1180L8394L3958p9451Q3409
116C2278l6646j8592O2080o8730M9004m384m5704O6850m6783R585K5189l6482
$$ y = [0, 0, 0, 0, 0, 0, 0, 0, 0, 0, 0, 0, 0, -8, 8, -8, 8, -16, 16, -16, 24, -29, 32, -40, 48, -56, 65, -79, 89, -104, 120, -137, 157, -180, 204, -230, 260, -293, 330, -368, 412, -460, 510, -568, 630, -696, 769, -851, 939, -1035, 1139, -1256, 1381, -1524, 1678, -1850, 2045, -2263, 2514, -2800, 3132, -3523, 3996, -4575, 5304, -6257, 7565, -9488, 12659, -19288, 70861, -82991, 69294, 66293, -115021, 87424, -42705, 8020, 52054, -37967, 40611, -20722, -24962, 18432, -43771, 49075, -25915, -20375, 43091, -57526, 14618, 246, -43947, 32154, -58664, -2724, 10525, -67371, 26169, -19877, -24872, 18828, -44776, 14390, -24366, -28030, 28220, -48922, 9923, -1105, -39730, 37148, -44032, -5638, 28320, -51131, 32278, -4368, -22960, 39120, -29610, 19394, 15010, -30694, 36156, -10627, -1042, 24147, -12335]
128a2335L9378k8307J0241J8466m2771M6554k7359m294L7953n6075M2791m135
140B0107l7890N4742m2142N950K5049l8906L6299k0987n162K6788l6955K6877
152A3770j1440j3975L0561l6774K3644N16k8723L9819l0991M555J9671l6547L3239
165G325j4931j1399K9586l3435J9204J114k0271K8068k5136J0322J0620k4647
177b3580K8672j7498j223K0097k7135K2202n770j3123K6426k2686J0582P443j8217
190a3810K2021j2616J145J1752j6613J6800o374l143J3342j6265J3355k502q323
203a231J6486j5110Q172M246j3220J6790j1137K98J0583j5832J2739m559o481
216A744J3316j3741O449J766j0282J2257r877J252N529j1405J0356n825l643Q383
$$ y = [-12335, 27043, -1264, 8977, 27443, -15328, 31226, 3867, -427, 37526, -18549, 24242, 20107, -17783, 36959, -5183, 767, 25816, -13090, 23209, 2222, -2940, 23848, -13107, 13770, 2330, -11645, 18916, -17858, 5786, 6302, -22421, 17398, -13593, -9038, 10633, -25914, 7325, -7606, -19005, 10581, -22854, -3650, -2536, -22807, 5261, -19875, -9553, 1067, -23580, 5092, -12406, -13629, 6468, -20667, 1535, -4235, -17358, 9068, -13618, -3036, 4407, -13810, 8211, -4405, -3260, 8492, -8121, 8679, 2305, -838, 12504, -3761, 9594, 7092, -1231, 15255, 145, 8317, 12563, -657, 16133, 4996, 5294, 15877, 45, 12784, 8225, 1744, 15060, 1319, 7768, 9534, -748, 11509, 1632, 2884, 8413, -2992, 7364, 1539, -2104, 6279]
230F279j1406O194j46p906Q911p401Q00L705p468O125l466j392L387n564L976
245e372j615j827M395n245L138J00l188N337m114J853J802l424M603k227L75L116
261b293l416L644m20j346M255l043K577J547k282L853j482R7K824k280K492l91
277D336m22K045j294J133Q13j703J959m69n71J366r62J56K55o67k48J61n19n78
295D791K28p21n47J67j244J1q02m47rj191j78m81p94j6r38l07j69j043J87q29
315d332l27K03p04j21k44m84M28l27J41l08M35m4k90R91m04K7J016m09P79O17
335c357k07J027k47Q90O46k56J447m30L71J439p61J459K53l05J645n54N70J244
353D874j030J178n3k46R91o38L63K72p11Q39l99j80J98n25j70j39o91K11n59n61
$$ y = [6279, -5127, 1067, 921, -6985, 1926, -5475, -4675, -970, -8438, -2313, -5779, -7171, -3784, -9348, -5372, -6987, -8814, -4419, -9664, -6526, -6426, -9614, -4277, -8391, -6538, -4736, -8160, -3557, -5784, -5409, -2293, -5709, -2065, -2485, -3831, 424, -2619, -42, 1505, -777, 3076, 1594, 1691, 4515, 2235, 4727, 4336, 3914, 5959, 4665, 5798, 6611, 4908, 6867, 6398, 5827, 7193, 6231, 6387, 6642, 5975, 5727, 5888, 5369, 4791, 5019, 4298, 3751, 3918, 2674, 2685, 1883, 1436, 1427, 236, 58, -423, -1217, -1233, -2171, -2478, -2647, -3690, -3503, -4332, -4659, -4456, -5160, -5281, -5525, -6009, -5581, -5908, -5767, -6075, -5640, -5684, -5974, -4983, -5387, -5360, -4344, -4753, -3974, -3357, -3564, -2537, -2784, -1894, -1248, -1504, -57, -487, -116, 1323, 562, 2021, 2274, 1969, 3614, 3060, 3630, 4874, 3844, 5022, 4969, 4723, 5714, 5076, 5439, 5711, 5000, 5839, 5440, 5260, 5458, 4933, 4763, 4624, 3933, 4144, 3585, 3024]
373C024O9p67m04m23k13n75m73p11j49l17m38p17k11l95l73m01j45k94n39j16
393d568j55J5n43J63j92m9L06m49Q26p6k14R69n11J43R68n44J160J62n71J804
413a356q19P83J120j163K095l19k00K120j533J423P94q65J718j095O47J462j332
430C480J138j24m44J425j563R98L37j057J124j041J23K99j533J414j117o9O55
447D045k266J570j311j035J729k877J161j6k434K018k265J73J329l358K367j703
463b873n25J832l216J456q3j985K715k537Q49J021k599L016j497n09K232k839
479e542K279j54r51K341k188J936O57j850L095k122J439J668k735L326j244l5
495h0L188l221K334L03j509L521l133J749J062k353L680k193k67K565l195K822
$$ y = [3024, 3093, 2326, 1922, 1499, 1286, 711, 238, -473, -622, -939, -1377, -2094, -2305, -2700, -3073, -3474, -3619, -3913, -4452, -4568, -4723, -4708, -5251, -5088, -5280, -5329, -5023, -5472, -4646, -4722, -4936, -3967, -4478, -4335, -3367, -3911, -2751, -2589, -3160, -1356, -2175, -1392, -272, -1435, 660, 341, 141, 2261, 728, 2151, 2945, 2080, 3798, 2703, 3350, 4812, 3480, 4618, 4494, 4050, 5475, 3912, 4910, 5247, 4190, 5314, 4273, 4396, 4695, 3162, 4576, 3459, 3390, 4045, 1779, 3349, 2038, 1003, 2732, -145, 1016, 1000, -1434, 584, -1681, -1508, -179, -3537, -1170, -2873, -3398, -1566, -4782, -3326, -3409, -5394, -2679, -5216, -4367, -3346, -5945, -2929, -4426, -4935, -2703, -5542, -3263, -3417, -4368, -2027, -4215, -2279, -1622, -3472, -377, -2499, -1060, 608, -2127, 1199, -45, -80, 3108, -113, 2221, 2524, 1015, 4536, 1403, 3152, 4214, 1861, 5541, 3348, 3081, 5646, 2451, 5273]
511E273j126j646L276l304J852M42k895K971k452J17J688l475K402j675p63K172
527B857l703J869m27j935K606l718J304M03k705L331l160J61J787l454K762j722
543c744j321L412l485J976n9k817L762k665P98J956l205L276j350o91L096l320
559d381K751M1j812L646k461R40J756k077L156j713J33K254k192K782j064q82
575H77K782k195K090o4j795K977j972J008O22k177L046j786m25K085l142K394
591D325o61j513K684l155J286K67k321K579k450l22J560k987K175j372j440K288
607I43k910J316j32k035K135k048P0R75k156J755j203n75J342k028J670k49r74
624d104J843k072J507Q3j483K278j341N15J146j636K142j125J33J905j868J745
$$ y = [5273, 4147, 2501, 5777, 2473, 4325, 4767, 1872, 4843, 2391, 2508, 4196, 721, 3123, 1448, 685, 2857, -846, 1023, 596, -1339, 1267, -2451, -1147, -744, -3449, -118, -3278, -3117, -1330, -4784, -2022, -3744, -5065, -1653, -5138, -3162, -3221, -6038, -2276, -4941, -4143, -2187, -5392, -2116, -3466, -4157, -1061, -4381, -1630, -1589, -3401, 245, -2216, -1276, 480, -1597, 1559, -154, -21, 2233, 41, 2823, 1759, 877, 3659, 1464, 3554, 3490, 1695, 4672, 2700, 3708, 4330, 2153, 5199, 3413, 2988, 5073, 1931, 4325, 3664, 2151, 4835, 1680, 2966, 3233, 912, 3491, 1041, 719, 2279, -708, 1467, 95, -1345, 943, -1967, -651, -783, -2818, -683, -2731, -2661, -1686, -3842, -2087, -3290, -3865, -2523, -4551, -2881, -3130, -4104, -2261, -4333, -2826, -2743, -4226, -1948, -3289, -2774, -1628, -3264, -1122, -2247, -2114, -209, -2077, -332]
640c32Q9q63K100j194R38P89j536K582j217K04J253j408J882n43o66J785j377
657B486R06M40j241J155q36M18L21j144R01o43j32L95j143P25n06m93J92r93N04
676A312n6j072N88j101J00J59j486R97o50p82O60j189M28R0q53M29o00K26K59
695b541r79P69m25J29M88p94O49j90o2N58j02J51N50m13P42l25M95J95q2P50k51
716f88O76L38r9O22m1K21M17k75R02L5l13O82j51J40M62o20P50k34M8K64n68L79
738B947k69j65K72P6n13q9n3j29n12L95n50o5m9n99k57l09l08J22m49p9j42p39
760a464M03o25k87L17p11J77p9k11K07n42L92l25K4K60l78L16m3q1M91k92J49
781b302N11j73M16R4j41N92R3L66J87OL17K03R6L80J59J97K78J98L5N1M58l5P1
$$ y = [-332, -243, -1106, 994, -200, 738, 1527, -9, 2573, 1356, 1560, 2813, 1405, 3287, 2744, 2078, 3863, 2486, 3392, 3832, 2591, 3746, 2910, 3328, 3649, 2505, 3406, 2763, 2631, 3026, 1883, 2608, 2102, 1609, 1801, 808, 1312, 1256, 184, 772, -329, -229, -70, -1556, -559, -1209, -1991, -1331, -2520, -2092, -2002, -2855, -2426, -3026, -2800, -2541, -3520, -2751, -3176, -3047, -2559, -3353, -2704, -2894, -2956, -2398, -2500, -2349, -1799, -2212, -1470, -1795, -1300, -1105, -1187, -437, -688, -12, 326, 227, 849, 808, 1029, 1446, 1171, 2073, 2108, 1795, 2477, 2326, 2466, 2928, 2308, 3058, 2824, 2872, 3136, 2568, 2947, 2678, 2513, 2785, 2861, 2348, 2259, 2206, 2077, 1565, 1960, 1410, 1345, 1296, 697, 440, 131, -177, -55, -504, -583, -725, -1464, -1061, -1686, -1973, -1656, -2367, -2190, -2269, -2480, -2273, -2815, -2423, -2748, -2724, -2464, -2842, -2526, -2569, -2650, -2159, -2451, -2302, -1791, -1964, -1548, -1454, -1595, -1003, -910, -544, -357, -351, -34, 169, 265, 645, 804, 1001, 1279, 1477, 1512, 1563, 2021, 1986, 2057]
804B057J84l0K82j35K45J42l86J89J46m79L93n85L31j50n47K25o28J15Q4p03K33
825I83k78l34K65n37q2k37j71m92Rj62j62l87K9k40k62J78m83K94M4k93R7k37
847b458q0L72j19O7l1L02j91L4M83l5J64J79pL71J49n1K07L30j28O64Q0L33k13
870D22L63K02Q5K11K89J67J42k28M00L53o74N92j66K9m5R3j85M1j81J94j84J6
892A936j30j65k12m9l27J81l53j24k69n9l46j97j15k58l3l74O5j50k99o6r0m22
914a856J17J99o55L05m38N0K00k47J28J54j19L3K03j02M36k99J28M83p5j28N01
935i82L6K49K0l1N54J39J39J64j58M42J84P7N80k00K70J88J55oJ12j66N7R0J83
958B096Q3k88L06j51P0l73K87k80N2j63j10j70m70J78j63l02L5k87qj51k60m63
$$ y = [2057, 2241, 2211, 2493, 2358, 2603, 2745, 2359, 2548, 2694, 2215, 2608, 2023, 2354, 2204, 1657, 1882, 1254, 1369, 1453, 750, 983, 705, 371, 636, 99, 17, -220, -391, -883, -874, -1036, -1198, -1585, -1556, -1796, -2058, -1880, -2363, -2069, -2025, -2318, -2221, -2458, -2538, -2166, -2285, -2218, -2249, -1947, -2138, -2104, -1621, -1656, -1492, -1313, -1320, -949, -800, -851, -644, -314, -442, 222, 302, 635, 422, 785, 987, 1072, 1283, 1572, 1739, 1881, 1653, 2053, 2406, 1732, 2324, 2158, 2187, 2142, 2235, 2050, 2091, 1910, 2104, 1920, 1936, 1806, 1641, 1429, 1380, 1053, 1234, 881, 757, 488, 429, 83, -114, -229, -487, -520, -894, -829, -979, -1278, -1344, -1434, -1856, -1739, -1540, -2195, -1890, -2328, -2278, -2078, -2325, -2197, -2043, -2162, -2129, -1926, -2028, -1592, -1891, -1763, -1280, -1355, -1483, -982, -946, -697, -677, -708, -154, -15, 124, 288, 130, 572, 756, 833, 1413, 1213, 1483, 1671, 1826, 1820, 1932, 1766, 1823, 1913, 2096, 2179, 1891, 2197, 2046, 2116, 1743, 2030, 1750, 1802, 1639, 1529, 1359, 889, 1067, 904, 602, 637, 350, 342, 191, -69, -532]
980e32m1k75J88k39k68J02k07j68j9l73m8L58l63K72j74n8q3Q9J4J23j13K61k74
1003a828L14K19k72K51K95K61l23L07Q0K10K84N8N7K12M04Q1j00L03L88l46L32
1024A187L74j58R9J14M5J93r0k03L47j06J58j92k22L69j89lj57j13j13J0j47k51
1046I52j7j72J62m86m6m31j5K08m81K8m36q9q2l0J13m59p9m8q3j40R7j17j65k4
1070a840M57k67j70j95L21K55q9L7J15N7K52O4J00J1K26O0J29J79J36K96J0J70
1092C14n9K29K90j64K25L70l35K35L02j83K83K19j03m0L19l37m3J52J8J66l00
1113A558o4J4k06k07L1k06j17J88j20k40k42M8l7j98m26rk9j69r1j38k13j79P1
1136i81j27j18j51j55K82M8l22k65K81j36Q9K27j46j88K54J7J61J48k25L25J07
$$ y = [-532, -573, -848, -660, -899, -1167, -1065, -1272, -1440, -1459, -1832, -1880, -1522, -1885, -1613, -1787, -1845, -1928, -1839, -1825, -1702, -1815, -1554, -1828, -1514, -1295, -1567, -1316, -1021, -760, -1083, -776, -696, -486, -202, -144, -87, 125, 529, 610, 510, 813, 1201, 855, 1187, 1561, 1403, 1502, 1616, 1661, 1854, 1764, 1561, 1908, 1802, 1960, 1768, 1546, 1915, 1726, 1723, 1566, 1453, 1340, 1350, 1203, 952, 935, 763, 925, 439, 393, -38, -53, 155, -326, -298, -734, -823, -905, -935, -822, -1281, -1360, -1408, -1491, -1631, -1534, -1651, -1816, -1840, -1383, -1650, -1820, -2015, -1694, -1439, -1528, -1491, -1376, -1319, -1067, -1003, -903, -892, -666, -606, -477, -298, -162, 134, 144, 314, 255, 484, 774, 610, 835, 1205, 870, 1105, 1407, 1224, 1507, 1726, 1623, 1583, 1902, 1565, 1522, 1674, 1692, 1858, 1558, 1494, 1508, 1302, 1095, 1126, 920, 803, 991, 871, 631, 389, 437, 400, 202, -224, -233, -262, -431, -522, -660, -873, -1052, -981, -1108, -1226, -1377, -1532, -1250, -1202, -1524, -1789, -1508, -1644, -1555, -1328, -1474, -1662, -1408, -1391, -1230, -1082, -1307, -982, -875]
1157h75M6L0p3L30J43j14M90j94M28K15R0J30J8J43j5O8L01m5J01L43j17j34J49
1180A458L7J33l14m9J8K42j06P6j91j50J24k61K1m05J77k70K17k72k89Q1j09j5
1202A53p2m67l7l25OJ89r4j08k76R2k98J18K09o36R3K46l27P3M0j91K79K7L28
1225i78k77Q6K7p2K16J81K50j00K76j42P2Q6K49%o4M80j51J86L8L58K06j0q3J4
1249H48L54j60J22J0L00l34K49J54n26L13J87k23L66m08j35q6l7K84m74J32l20
1270F16j42N9l48o8M1k77J28k56j56K28m71N5J9j65p4j93K18q6j11j19l16K71
1292a147M4j87K75k60j7K14k38l6L51j3K84k40Q2K25o3O6r8L41K79K8K75j9j53
1315gP6K02R2Q1J00J78N0k23L17j3L11O6k15J0k2J61J90m00K36j5p1q2Jm0k13
$$ y = [-875, -829, -799, -872, -542, -399, -513, -23, -217, 211, 426, 516, 646, 664, 807, 792, 860, 1161, 1116, 1217, 1560, 1443, 1309, 1458, 1495, 1628, 1314, 1265, 1283, 1525, 1419, 1495, 1304, 1154, 1278, 1017, 1038, 633, 810, 540, 757, 485, 196, 277, 168, 153, 81, -386, -423, -748, -742, -553, -647, -755, -1031, -939, -1237, -1119, -910, -1546, -1453, -1207, -1534, -1461, -1421, -1612, -1333, -1306, -978, -1255, -1169, -1142, -1214, -998, -817, -567, -667, -391, -533, -461, -375, -126, -126, -190, 290, 139, 325, 363, 721, 927, 917, 834, 848, 1202, 1042, 1164, 1174, 1474, 1140, 1389, 1543, 1017, 1330, 1517, 1294, 1660, 1252, 1117, 1031, 994, 1278, 804, 936, 616, 474, 533, 185, 117, 158, -119, 9, -247, -403, -175, -646, -591, -572, -737, -811, -1004, -786, -872, -983, -1102, -1418, -1147, -1103, -1290, -1015, -1275, -1292, -1078, -1316, -1352, -1001, -1014, -730, -970, -888, -663, -726, -660, -758, -417, -138, -110, 165, 146, -7, 69, 271, 363, 444, 544, 722, 772, 549, 866, 853, 1164, 1230, 1015, 1025, 1003, 1164, 1354, 954, 1190, 1175, 1104, 1022, 1023, 983, 770]
1340G70J87p2n4n6j50n2j96J36j63l6l41K31k12l73P8j72j42N0r4J60m75L9k56
1363a193N8K93k75L59l62l3M6KK16j93K83l1j91J72m8K04n8K79j90Q0QJ89J54
1386b31K59k17K81l6J56m5L58j84L2N48l56J61J9L2j00M29K16j70j01j37J8J10
1408A042n2M5r8K7P4k08J00k00l1j98j83K25l96K16q8M0k61Q0m85J08j76J76l26
1431e69j61L24k77Oj64K08k84J30j6k42ll9J99p7j60K48M0j16J25J05J19j22L29
1454c97j99J1k3L92k5J28R3J62K7k15L24J53l1j11O8L5J9K91j39L40j22k52L46
1477H75p8R9M0J53P3j09K2l15J90j69J29j57J29k15k40K1j45k3j28M5l18J90l6
1500C3j08j19J34l28J01k79K65k52j0l01L31j94P4k70J55Lk28J92m6k33K94j62
$$ y = [770, 957, 885, 831, 775, 625, 573, 377, 513, 350, 314, -27, 204, -8, -381, -303, -475, -617, -567, -661, -501, -976, -937, -1193, -1135, -842, -1117, -758, -1120, -1153, -1107, -1105, -889, -1082, -799, -830, -1021, -849, -897, -693, -751, -472, -662, -582, -574, -385, -231, 28, -189, 92, 56, 212, 167, 525, 341, 373, 921, 565, 726, 745, 777, 677, 1106, 1322, 1152, 1051, 914, 932, 1042, 990, 1035, 937, 964, 1038, 830, 930, 730, 699, 501, 318, 543, 147, 363, 275, 315, 54, 134, -351, -243, -419, -243, -569, -730, -406, -683, -677, -841, -633, -917, -787, -803, -1045, -1048, -1087, -888, -965, -1125, -877, -837, -953, -828, -723, -604, -726, -397, -596, -585, -608, -216, -241, -113, -20, 142, 169, -46, 278, 431, 400, 289, 357, 392, 411, 702, 563, 903, 781, 529, 875, 797, 896, 936, 1089, 1162, 1053, 1075, 760, 950, 781, 910, 753, 882, 667, 427, 448, 303, 280, 152, 197, -121, 69, 33, -75, -194, -60, -388, -287, -566, -301, -553, -563, -864, -533, -727, -653, -923, -768, -765, -993, -801, -847, -1080, -786, -948]
1522i48k8Q4J87m1K36K0j55J02m0K22n8L47J8j65M53k09J34J7J08P8o4K9J39J62
1546F28j42K25J56j40Q7j47J40l3K37q9qq4j05j9J06m7J32l06r0j07J21Pk39R1
1570C74j91J48j47l24J4J38k97J08J07m69J9m6J49j07l6P5l22r8L28k54r4J78
1592g47J0k0p6N7N8K93J2l95j5N72j10L7j38J53l1m7L62j7O3OL9J55p2Q3p1K18
1618C79J81j72J57J54j23J14K13l64J50L05l07K43k83J49q4q8l9J08m20K58R9
1639F30j52p6K5J37k75j70J2j76K58j84M2q5l89K12j76M2k66K52o3o2l01J64L40
1662b61m43n4K7l4O7O9n8n1J09j50k2Q8K91o9j77L34p8K66j77J73jJ09J14n2P7
1687I7J9J88j88J07r5K43j4J48P2r8m1J70J13n01N06N2j38k6K4j02K48l68L19
$$ y = [-948, -976, -892, -705, -746, -510, -490, -645, -543, -583, -361, -419, -72, -54, -219, 234, 25, 159, 176, 284, 362, 298, 327, 466, 628, 486, 711, 867, 727, 814, 667, 807, 774, 1011, 922, 914, 830, 725, 706, 812, 765, 897, 591, 501, 394, 515, 522, 283, 374, 183, 331, 184, -140, -126, 12, -285, -177, -70, -539, -520, -566, -417, -524, -560, -485, -807, -905, -577, -831, -925, -747, -737, -757, -833, -776, -718, -425, -413, -808, -823, -251, -361, -324, -462, -309, -340, -387, -25, -42, 21, 27, 66, 221, 149, 232, 161, 379, 560, 388, 545, 699, 576, 690, 903, 539, 689, 994, 687, 930, 647, 796, 712, 624, 585, 693, 273, 531, 630, 478, 402, 427, 564, 289, 119, 131, -45, 213, 29, 71, -14, -403, -191, -367, -325, -591, -339, -402, -464, -765, -601, -261, -704, -758, -731, -765, -698, -629, -687, -738, -629, -779, -801, -713, -422, -491, -668, -334, -412, -146, -323, -150, -151, -42, 72, 20, 97, 116, 304, 116, 223, 128, 371, 357, 505, 577, 479, 438, 608, 721, 220, 726, 778, 640, 614, 638, 536, 784, 416, 735]
1710G35k13K44J5n10K30j52k05J37j65K07m38K24J20l70k28M06k03K5k35r7K1
1731d52K21k50q0K19k26j43q1K95j13K60m54K35J02j15o8K7R2j58P2J07L44l99
1753e65L39j76K80L0p8N8J32PR2m3Q0K41o4K77j12l7P5j38J72q8L0K72k42Q6L0
1778F58o4j72r1L01lr3o3k42K4J32j8J8n8kj33M3M0j81r1o8j45k24l8K54R3k15
1804c38j56p9Q4k3J10Q4k64N0j30L53l13L0J15j7k38L01j82L3L26JK9j41J44n3
1828b74m6J91k72L38j8J2K01M6rn6J14J65j1o9j9J35mj15rL39k9l7M9j40n0J4
1854D46O9J36l37L40l10J84l10K23k46J24j52j01m4K59p3o3l44L77n46L08l07
1875c67K34j63o1J9K58O1l42j62J00j9j55O1K81n4l78L44k68L30j12k9L7O6J38
$$ y = [735, 522, 766, 781, 271, 501, 349, 144, 281, 116, 323, -115, 109, 229, -141, -369, 37, -166, -141, -376, -473, -452, -231, -481, -561, -342, -568, -711, -792, -497, -610, -350, -804, -569, -467, -582, -650, -623, -531, -689, -617, -510, -166, -565, -226, -402, -122, -92, -170, -112, 20, 27, 119, 76, 156, 397, 333, 610, 498, 461, 536, 398, 570, 482, 512, 784, 542, 628, 658, 594, 422, 331, 632, 629, 536, 473, 231, 255, 387, 369, 387, 329, 327, 194, 237, 277, 96, 5, -63, -208, -432, -470, -216, -123, -338, -494, -573, -489, -512, -402, -318, -582, -532, -662, -309, -622, -592, -477, -494, -732, -431, -613, -580, -254, -253, -224, -365, -221, -274, -320, -129, -401, -63, -81, -69, 132, 178, 169, 113, 227, 392, 381, 312, 293, 428, 424, 309, 300, 639, 610, 573, 622, 482, 432, 446, 515, 651, 314, 654, 344, 528, 218, 441, 195, 319, 167, 66, 22, 281, 208, 145, -199, 178, -368, -60, -367, -133, -296, -357, -338, -80, -19, -361, -523, -423, -442, -597, -536, -255, -309, -687, -343, -611, -281, -393, -422, -385, -319, -181]
1898a81j5mj07J12j40K06oK01o6m6r3Q2L42k49K04M8M5O3J8j2J28o0p4P3K56l32
1924C93k3L9L1P4j40j1J5l9K06p1J5j58k8K9k2j37Ok3J31o2j86n2k57J75j17J74
1950c8l53k6O1o0K72l00K45j54l31K82p3J39k42j25K42pKK07j40N3J73k68J37
1973c04J27o3M5J91k47J45j05J58K1j39J41L01l38L03l3LL1K2J60M4J4J52k40
1996C89k80K29M8J05l7j4mJ7l20K42N7j54q1J45r2J26r5k53N5L5p9k41K27m7O4
2021D2L8j23j89p8K3j17J75Q6l68J92J85k54J20j28J20OQn2l20K63OJ93j33n8
2045c63K5K5J7J90j31l0J12P2j22L84j43K8J61q1r3K85q6R7q9Q4KJ7j3kj19J62
2071C89j7j73R6RJ42j86j18K04J34j20k1j30j42J68n04L92K52m22q9J26L4P8j68
$$ y = [-181, -196, -200, -307, -195, -335, -129, -135, 66, 0, -46, -139, -57, 285, 36, 240, 288, 333, 396, 414, 402, 530, 470, 396, 469, 725, 393, 370, 409, 440, 514, 374, 363, 378, 339, 545, 474, 489, 331, 303, 332, 310, 173, 179, 156, 287, 225, 39, -13, -270, -95, -212, -38, -391, -417, -356, -416, -144, -444, -199, -353, -684, -402, -475, -336, -578, -703, -461, -468, -466, -259, -399, -346, -173, -441, -304, -177, -240, -195, -4, -251, -106, -211, -53, -32, -171, -30, 271, -67, 236, 203, 206, 237, 259, 419, 463, 477, 629, 389, 109, 338, 386, 491, 454, 440, 436, 453, 133, 375, 432, 278, 197, 342, 250, 376, 281, 28, 83, 118, 39, -202, 25, -22, 42, 80, -43, -232, -310, -287, -404, -229, -143, -511, -319, -134, -388, -268, -396, -276, -270, -262, -314, -634, -371, -365, -172, -305, -363, -338, -313, -296, -106, -237, -267, -155, -83, -205, 179, 36, 64, 225, 144, 51, 336, 250, 347, 258, 342, 344, 361, 348, 346, 227, 389, 372, 199, 295, 304, 446, 260, 142, 346, 480, 360, 339, 209, 67, 235, -269, 123, 375, -47, -136, -10, 24, 102, -66]
2094f6n1K10j46qm00J2R6R9mPJ59k00j25J21K50k04j66J83R6k81K35l2j42j11
2118d68J62J56j98J63k3M0n0K76M2j6l32J70n4J23L57k05J67k44R5M5p1K55j55
2141B35J27j24K52m32K44J47j16q5J21J9r8n9L31n95L46K7Mm0n5j50J3J99k35
2164G6q4N8L6j92J61j95R1q5j1r7N6j75J76R3j64q9L23l8j69o2N1N5k65K63k79
2189d66R7L20m04K52J67p8r1J58k5R9r2q8n0j55M02N2J18l15M41j73M8L2j86L30
2213C93l05q5J9J00K5J15J48q3k54K42L5j09r2K96q6j53K4Mj48J8Q3j93R4k47
2237a59L84qp1n1k10J29j94M5j50K92j05J4O4l72J08J1k8k4K42k73k1K11o2J09
2261a19l33J88M7J08q3l5Q7K51k22n3K68l88K02Q6j16J47k1J60j18l4r2P2J67
$$ y = [-66, -117, 93, -53, -61, -461, -449, -353, -254, -258, -251, -92, -292, -417, -296, -46, -250, -416, -233, -137, -418, -183, -215, -357, -468, -306, -150, -348, -185, -208, -168, -218, 58, 100, 84, -248, -78, -132, -9, 348, 143, 310, 66, 161, 206, 135, 390, 235, 362, 238, 490, 58, 302, 449, 333, 248, 369, 388, 290, 231, 562, -33, 313, 340, 344, 304, 249, 99, 112, 311, 76, -8, 50, 86, -106, 55, -140, -49, -134, -145, -242, -186, -361, -185, -92, -256, -345, -22, -60, -229, -291, -240, -185, -450, -187, -466, -369, -49, -453, -201, -34, -112, -203, -45, -70, 29, -63, -151, -201, -356, 46, 98, 216, -99, 342, 169, 217, 249, 63, 393, 88, 3, 22, 122, 147, 262, 410, 327, 73, 315, 350, 241, 149, 445, 359, 206, 230, 234, 86, 104, 187, -6, 88, -159, 225, 217, 146, 95, -115, 14, -180, -135, -285, 7, -98, -84, -20, -392, -284, -273, -301, -325, -83, -356, -377, -166, -228, -119, -452, -264, -217, -109, -192, -227, -140, 111, -111, -164, 104, -284, -82, 4, -112, 35, 14, 174, 56, 22, -70, 2, 169]
2284A69k34K61P1R2j65j72k6J1K33r5o3J93K58m95j8L99j62j01M0q3K21j72J36
2307B98R0k27k09N4L3M1o2K05k1l0k04Q3l10J86J08j35j93J88j5j42J04J18j61
2330b01j38R5L34m81mJ62NO7o4Jj42L97q2j52l8P2l4M5Q2J91j87Q1O0m8K7r1R4
2357E1M3J6j66J51QQ2k14L41j90R8N6MJ0j49K9p4J99r8k18J60k65L31J78l13K58
2382C28k39j89J10J12m8j30N1p1Q0M1q2J2JO6l16J74Jj75K43j26j39n6L56j98
2406a94j8j9R0N1p9K23l63K04J33k19J3J37k38N64l41j20M9K24j10j2l08L83L5
2429H5k32J88L28j88j84k0J05R4J47l63K50N3Rk49M0L7l7K19k99J48M1J56k53
2452G5R9l8O8r3r2O9m4L9Rj37J6l41L98R6j6j31r6J12j48n7J98j75J38m3r4K8
$$ y = [169, -65, 196, 267, 359, 194, 22, -4, 7, 240, 145, 82, 275, 533, 38, 20, 419, 257, 156, 196, 113, 334, 162, 298, 388, 161, -48, 6, 39, 80, 18, 223, 202, 172, -32, 51, -259, -73, 35, -100, -293, -105, -120, -262, -158, -40, -201, -339, -244, 90, -391, -395, -233, -228, -161, -225, -224, -366, 31, -51, -203, -241, -169, -203, -158, -76, 115, -72, 9, 69, 21, 48, -43, 51, 94, 110, -56, 95, 103, 185, -29, 312, 122, 220, 276, 280, 290, 141, 170, 96, 295, 197, -21, 139, -126, 205, 383, 70, 328, 89, -100, 10, 122, 74, -56, -5, -76, 4, 45, -37, -25, -24, 42, -274, -100, -99, -274, -31, -157, -296, -352, 4, -194, -212, -231, -141, -90, -169, 54, -309, -105, 28, -191, -178, -41, -279, 285, -56, -176, -127, 97, -13, -25, -333, 50, 85, -147, 41, 369, 181, -3, -23, 82, 176, 323, -40, 210, 263, 272, 23, 63, 100, 63, 282, -17, 131, 172, 328, 75, 174, 136, 204, 111, 19, 88, 44, 83, 92, -45, -29, -370, 28, 124, 108, -23, -119, -7, -155, -212, -14, -189, -51, -94, -188, -160]
2478a60J18N3k68J08j25J4J86j67J52m1O7J18j3J64k49L3M9m0j65J27n5m7P5J44
2502G8J75j56j47J7J46K32j45J9R1k56Q8k36J05K29p8j51J27k5k0k72L75j68n6
2525b8J32K79k11k45K46k31Q0J47k04J74k83K02M1k32K19q1j59j23L14j50J34
2546B1j11n0J54j57N1r9OK80l41J90p3M0r2n8m6M5j7J59q0M7Mj53K86j00j63J12
2572a45L08j50lL2j55K86l07QQ0K62k72NP7P7J24j8mj53N1jj45J12j38L52L0j01
2598B12j65r1J86q8J13j0k69p7L23j89k23L22J75j94q2N9j9k02J54J6Q2k63J23
2621a07j04J08K4k21J00q4O4J5J24j07k4J81Q2j58J74l1r7K35k03p0l9K64j55
2644b9j8L7K87l41r5j5K92p2o7qP0j9K11p4j72Q4j1M6q7M6n4j03K61j15P5j36
$$ y = [-160, -42, 11, -257, -149, -274, -260, -74, -241, -89, -130, -63, 55, 42, 206, -43, -10, 39, -1, -166, -39, -94, -141, -66, 78, 253, 97, -50, -33, 113, 345, 200, 219, 310, 54, 142, -94, 11, 240, 162, 11, 138, 113, 93, -179, 196, 28, -28, 104, 383, 172, -73, 173, -58, 22, 169, -35, 139, -144, 58, 99, -133, 86, 5, -154, -277, 37, -113, 21, -90, -140, 14, -143, -92, -191, -185, 95, -246, -56, -129, -89, -181, -239, -285, -240, -257, -98, -178, -131, -127, -280, 6, -94, -257, -145, 163, 13, 10, 42, -113, 173, -134, -126, -46, 216, -56, -51, 26, 103, 227, 209, 205, 52, 103, 102, -43, 69, -69, 283, 313, 212, 47, -44, 142, 54, 167, 157, -112, -189, 134, -55, -278, 44, 219, 25, -57, 2, -17, -219, -65, -49, 33, -230, -107, -211, -103, -79, -300, -200, -284, -220, -205, -81, -188, -212, -31, 51, -107, 67, 36, -61, 174, -29, -99, -138, 126, -29, -47, -10, 277, -64, -159, -174, 118, 46, -21, -29, 41, 22, 233, 159, -13, 71, 60, 106, 19, 65, 11, -92, 169, 54, 129, -7]
2670gj8K5J43j00k00L28l66M02k85K24l41R6R3j04J4o6O9N0%N3J20m6j49L3j34
2695a66ML9R1J61k87R6j47J62n8J44k76j4J97J4K02j42j21O4%l6l5J1R2nO2N6
2721A08j32j91kJ22j30J47J92j4j94o5K62j14RJ6J16o5p6M8N6o5j90J69J0K01
2745B18k42j58L12K0k3m5J10M0j63O2j20J67l32j4nM26j12l01Q1K26l17J62r1
2768i9J91r6J10j58rJ17o6R6j34o2j13K39r0r3pj95N23m0mk71K63j11J02l02K13
2793Dn0J41J3j01K05j31q0K04l40K87lj39J49k90K53q2K2J00k11j10K13o9L24
2816C09j44k51P3N6k53L02k05J36j44n8J21Q8j45LJ63j52K7j71J66O8j94J85J53
2839A33k02N8k67K87j73J09n5M2j52K61l36P5J01j11J25L6PK3l7K2j2J23j37q4
$$ y = [-7, -25, 0, 143, 43, -157, 171, -195, 207, -78, 146, -195, -99, -6, -110, -96, -162, -93, -43, -43, 10, 130, 84, -65, -32, -166, -162, -123, -32, 129, -158, -62, -209, -47, -105, 39, -237, -251, -54, -40, 162, 20, -101, -37, -37, -73, -108, -97, -5, -10, 52, 108, -24, -215, -217, -95, -225, -78, 114, 100, -94, -159, 103, -11, -2, 14, 130, 65, -11, 37, 93, 28, -162, 7, 17, 218, -24, -182, 130, 150, 127, 82, 192, 232, 69, 131, 11, 178, -154, -168, -173, 253, 141, -160, -79, 147, -170, -8, -99, 92, -4, 106, -52, -61, 56, -10, 86, -48, -110, -223, 16, -74, -167, -174, -369, 154, 114, 110, -161, 102, -9, 93, -209, 4, -46, 95, 108, 7, 212, 81, 1, 205, -135, 152, 149, 10, 159, -131, 122, 40, 62, 162, -49, -159, 54, -15, 309, 165, -86, -13, 43, -210, 92, -113, 23, -121, -179, -58, 30, -115, -112, 51, -101, -74, -245, -79, -11, -205, -20, 133, -69, -11, -278, 9, -164, -55, -110, -68, -220, 41, -295, -220, -119, -230, -105, -69, -62, -39, -76, -54, -66, 57, -80, -164]
2863a64K71m3L4L4k35J76n2J07j21N6r5Q4L0r2K6QJ14r2k91L18m0J13QR0m73J62
2889f7Q1R4j54K0r9J76OK37m54J84J03k32M7Q5j55J50j44j17J07K2N0J77m8j5
2913E4k64K59l38J56M4m7K06n0j36J08k7j53J01N6j9J5m5R9n1P9j01j64K07J40
2937A29n5k9P4r2Q8k61J66L20o0l63l3j0J12k94J97N3P5j31J77q7p4J21j16P7
2961a6L6L0o4mk73L66j25n8q6J2R6K33r2j76L17j48j30M3j78K76R5l26J75n1J06
2986E8J61m93ON17n48K95j39J27l2Rln0K60k93J77J65J94l70j96K38j78Q7j23
3009a31P2m9K27j50J08J16l76K74j40O7k88M60p3q0N9k12l2k1M63m8m12K19n3
3032@j03J19m6L9j71Oj31K66L3l04K47o0J82j32p6J48j26Q0j43L29j24k03J12
$$ y = [-164, 107, 64, 98, 132, -103, 73, 21, 128, 7, 63, -32, 52, 82, -10, 16, 24, 138, 46, -245, 73, 33, 146, 154, 244, -229, -67, 14, 108, -46, -26, -125, 51, 57, 294, -160, 24, 127, -105, -58, 27, -128, 22, -122, -239, -132, -110, -60, 117, 69, 54, -210, 49, -289, -133, -89, -136, 70, 20, -116, -8, -35, -188, -87, -31, -50, -35, -80, 19, -32, 47, -54, -218, -11, 129, 74, 45, 119, 27, 115, -146, 20, 340, 280, -83, -116, -126, -14, -308, -111, -58, 17, -114, 63, -24, -98, 23, -93, -16, 20, 50, -14, -18, -291, 75, -50, -108, -194, -182, -86, 147, 55, -121, 196, 48, -82, -39, -217, 59, 154, -172, 3, -48, 58, 219, -274, -268, 249, -299, -4, -143, -16, -48, -39, -42, -92, 168, -125, 52, 217, 411, 41, -155, 83, -95, -8, -131, -59, -108, 119, -31, 77, 193, -183, 91, -49, 18, -270, 190, 117, 37, 96, -116, -148, -169, 294, 246, -166, 53, 0, -103, 16, -30, 9, -162, -156, -287, -21, 12, -292, -45, -105, 77, -55, -131, 17, -109, -29, -172, 157, 33, -170, -58]
3055e8R7O7p7j74j84M6J78RM0J46j32p5q9J91J43q5K2K9n9N7n8p6p2J61j23O6
3081a0n7R8O9Mj9j97K05K8q9R4p8l4J47o5j99J09j48J70n4m6L43m05J86j3r1j52
3107b04K47l2P0q0l5J06K00k62p7J41j00j23L0J40l39M39l70K50j08j60Q5J00
3129h2K45k43N5M4j7p1J6q5Q7r3m5J86M9j41K19q6J1nO5j11k1K97k90N9j2o7J18
3156H2q4N1J08m7L7m8QO9n2n1J41j26j88J28J19k15j8J37J42k2o3J07m8q2r4N4
3182D5j40L81k73M3r8P6J8k93J42rJ17r5J23J73m61J9K19j13J63J74k87M6r9O8
3206f1M3p4J81M2k24N6j51J93j63J59j06J13N4q9J42k6j53P9j37J25j4L10q7O
3230B18k30L2M3P0J9l23K29l8J29L8K9j65J99k54K65k96J57j75K0K54K1l6j65
$$ y = [-58, 39, 106, 29, -145, -329, -283, -105, -96, -56, 90, -42, -117, -206, -15, 128, 43, 65, 94, 35, 92, 34, -42, -114, 47, -76, -10, -67, 31, 100, 104, 85, -112, 93, 121, 32, 126, 48, 14, 161, 96, -103, 6, -142, 28, -26, -72, 271, -134, 52, 39, -52, -204, 43, 11, 81, 1, -34, 72, 272, 10, -67, 74, -26, -149, -119, 21, -318, 121, -249, 1, -107, -267, -182, -82, 163, -80, -25, 19, 2, -69, -53, -138, -51, -144, -189, -3, 46, -95, 124, 38, 49, 44, 109, -2, -23, 274, -16, 43, 31, -36, 82, -2, 49, 157, 110, 147, 99, 107, 176, 124, 73, 214, 88, -100, 28, 147, -68, -86, 51, 193, 171, 108, 215, 167, 85, -9, 45, -95, 286, 13, 56, -42, 34, 52, -241, -99, -108, 9, -86, 37, 210, -251, -232, -13, -126, 37, 211, -76, -30, -129, -61, -18, -92, 89, 131, -93, -37, -188, 5, -158, 1, -105, 8, 62, -27, 115, 89, -64, 15, -122, 3, -11, 299, 212, 218, -12, 20, 63, 133, 152, -171, 58, 20, 149, 187, 216, 51, 250, -4, 261, -35, 122, -53, -33, 221, 242, 206, 41]
3253D1N8k34L63l80J08o5O2J41Lj64n2M8R3J7O4l98N5K18j20N5K0J61m2l03L35
3278H4j43J46l23M52j0j57j28q4Q9J13q3O0o6m8O2M4J6p7K40j64l6K33r3J2L4
3303A73m1m8N9k50M9L52j19L8k52L2j57L02K2l39K32j58J21J07l9j81K77r3M3
3326A30n9j2M7o2k27J01K06k3j25n6R3q6M4JN5o3l01K64j22J34J18j67M6J45k02
3351a21J38j45l6L27k77J45J85l90K16J36r1j40j55K32j4J04J1R6r2j07J69l06
3373a15K42K7j36o9L6pM2R4J16l3q4n0J80k23N2o1M30m57J06J1j61J17j57J17
3397A7J06l7j11J61j33Q0j18K0L51l41k6K6l0J23q9Q6k56L01o0r7Q8k82R7J32
3421Ho8l6k6L12k93j60K30P7j8K14l47K45j50P4m6j10L40l17R8O5j37L61l63m6
$$ y = [41, 99, -135, 228, -152, -44, -109, -47, 94, 97, -67, -119, -71, 22, 39, 103, -295, -240, -22, -142, -87, -67, 94, 52, -251, 84, -59, 87, -236, 216, 206, 49, -79, -163, -74, 39, -44, 16, -50, -98, -36, 8, 24, -53, 187, 23, -13, 220, 127, 139, 173, 132, 84, 143, -107, -58, 294, 175, 213, -39, -7, -164, 138, 160, -179, 53, -105, 16, 123, 84, -97, 180, 87, 130, 71, 59, 106, 44, -183, -82, 124, 101, -24, -80, 13, -73, -29, -28, 27, -36, -337, -73, -195, -61, 57, -110, -64, 81, -121, 17, -128, -164, 163, -114, 31, 216, -174, 42, 178, 87, -53, -208, 24, 10, 114, 125, 221, 129, 22, 191, -115, 127, 154, 18, -51, -15, -22, 20, 114, 230, 197, 113, 63, 243, 20, 72, 11, 441, -16, 90, 101, -60, 57, -100, 17, 123, 86, -25, 136, 3, 83, -35, -15, 336, -5, -31, -5, -35, 88, -1, 85, -171, 130, 70, -27, 61, -221, -124, 8, -60, -96, -122, 190, -103, -263, -33, 44, 26, 240, -107, 138, -12, 62, 16, -94, 246, -71, 27, 92, -45, 316, -47, -93]
3445i3P4m1r2K00J7p8O3J20q6m9k25K89J65n3K7k40mj4N0rj40K94j99J5Q8KJ38
3472B19k03N1M0k38J49l4P4l70J09M1J55oL8k7K0j66k39M16n0l9L7k92K08j18
3496b25J32R3j02J8N5J14p3k31P3J39R4l00M30j58l7k21J40K3K86j42L6k48J68
3519F4Q9m23K74k7K27p7j50m7L75l65J42p2o0J05n8J89k52k7K04o2M0m2J64j28
3543H3k19K90j18J22nj81J67q6j40M3j25K39j47r9O6k1N0K12j97K8J65j97k83
3566c53L83j63k2J30k1J23k45J83M8l94L74Lp0J38n2j08K57j69k12J98j69K65
3588A24j12M2j65J14k28L03J06j72P8L0l27P1L44Jj80K22p0j39r7J81j04L0m4
3611Hj9R8m53K46K90k89L07k80J31J73m00M4K89r2k6M8j04j43J4q0L03j44rJ09
$$ y = [-93, -19, -60, -152, 48, 65, -13, 50, 170, 84, 35, -190, 99, 264, 211, 238, -2, -6, -20, 30, 21, -119, 175, -24, -9, 79, 81, 219, 16, 67, 107, -131, 18, -16, 58, -312, -203, -162, -7, -13, 25, -2, 18, -148, -387, 29, -21, -60, -23, -315, -107, -225, -93, 0, -102, -84, -29, 85, 12, -219, -146, -7, 87, -213, 217, 59, 22, -199, -59, -36, 250, 108, 144, -104, 64, 153, -270, 4, -23, 204, 127, -23, -70, 305, -60, 82, 10, -50, 55, -3, 186, -66, -93, 111, 49, 89, 47, 211, 83, -136, 154, 36, 158, 153, -28, 139, 53, -87, -44, -169, 70, -77, -176, -110, -131, -81, 131, -66, -38, 127, -70, -353, 30, -133, -155, -25, -46, 77, -168, 15, 63, -331, 43, 46, -24, 114, 62, -46, 211, 42, -170, 28, -141, 124, 12, 54, -111, 3, -225, 78, 184, 12, 90, 120, -207, -136, 208, 209, 29, 251, 181, 42, -55, 126, 22, 52, 8, -11, 87, -366, -120, 170, -119, 188, -92, 39, 212, -188, -144, 145, 53, 27, 75, -29, -172, -158, -238, 65, -79, -88, 21]
3635B1k9j57j1Mj5L9r2j07K50OJ7K35k52J34k76J06J83n2o7j30J87N8j96K04m6
3660A4J98l82L01j74K42o7J1q6o6J82J27r5J19m10P1K10q0j45K04j09J46q5o2
3683F4PJ83l61N4j01K81k72K48l5j08J0K9J0Q1l22J47j0R5J72l86K12k4l90L93
3707b3r7J64k54J72J09n2j03J10J77l94R3K32n40M49n3K1q1J5j86K56r4N4K28
3730B03j54k5m9P0k11J65J33j21J74j04L7k7j31J2K39J28j53L3q4J36k32K09k94
3753d6m6K69k62J90j51R1J49j82M6o8n9k0K19j64m2%K55n7Pk63J45K5k40J59M
3778d1j55R8J29r1J23k74m1K24k80R2R0o3P0K48k81m4p6J58J70M0j81o6OJ79o3
3803b9K6J57j57j09R5L9j86J80r2J00k3K40j66RM5l63K91K75l30k49K78J25n4
$$ y = [21, -8, -165, -176, -172, -187, -148, -240, -347, -97, -91, -74, 161, -91, 43, -233, -127, 56, 4, -63, -193, -6, 52, -144, 60, 14, 212, -170, 131, -43, 199, 132, 143, 57, -9, 173, 300, 205, 324, -86, -15, 195, 115, -30, 174, 65, 211, 126, 64, 71, 254, -107, -53, -154, 127, -145, 103, 68, -40, -30, -1, 9, 90, -232, -85, -95, 0, 172, -214, -2, -26, -416, -23, -120, 44, -210, -38, 71, 19, -84, 26, 203, -191, -98, 134, -406, 43, -10, 11, -70, -55, -241, 15, -79, -25, 203, 49, 24, -25, 45, -166, -1, 132, 11, 185, 81, 118, 91, -40, -28, 211, 339, 186, 219, 135, 271, 39, 248, -46, -92, 177, -85, 105, -46, 45, 194, 12, 58, -10, -69, -89, 130, -34, -76, -76, 179, 122, 129, -134, 11, 36, -204, -45, -41, -196, -98, 31, -60, 63, -211, -252, -28, -308, -216, -126, -189, -119, 129, -152, -196, -272, -114, 56, 96, -85, -151, -145, 34, -29, -3, 154, -3, -112, -17, 22, -164, 16, -76, 24, 1, 241, 75, 84, 129, -234, 57, 332, 2, -247, 31, 156, 102]
3826A02j54J54L2r1r4K09k92J50q2J77k27J15L9j62K56j77N4J31k59J93Kj62j49
3849b35L28j12J30j06j36p2n6R4J17J40K15m18j44M12l08J86nn9q8Q6o4J11j39
3872a23P3R2k5q4M1K17m2l3R3n3j46j35L51k07k3J78k37P8oP3r8L30j15n5k1k49
3898a26J55R9j14lJ67k5k32L00l02K14k89J60p2R8J4l2R2j22qN1J01k26J8J22
3922D0k07K20n7p8j72R2P9rj76N5n2K25k9j01kJ09nm3K17l60L59q8l26K34j8o
3948i9pJ26j77O0L6r2J91NK16j04l19L41n2J43o0P7j66K6o2L6j05p0J22K98m62
3973i8J68q9J21n0j70J23L8j9K49k75K76l02J18Lk21Q6l3j17K11J20n4o3J0J63
3997A95l57n8J89J64l08L16j75K4oj39nl7J55J62j73P8n9k96K76P8o7l14K92J45
$$ y = [102, -52, 102, 134, 43, -51, 158, -134, 16, -66, 111, -116, -1, 38, -124, 132, -45, 9, 140, -119, 74, 76, -86, -235, 93, -19, 111, 5, -131, -203, -259, -165, -48, 92, 307, -111, -255, 157, -151, 35, 30, -29, -117, -31, -95, 16, -123, -50, 42, 17, -67, -26, 191, 149, 116, 209, 156, 10, -125, 226, 19, -4, 174, -63, 15, 9, 82, -16, 314, 199, 144, 123, -126, 29, 128, 14, 11, 178, 153, -79, 221, -81, 133, -156, 4, -68, 30, 44, 12, 104, -18, -26, 25, 126, -100, -82, 40, -167, 53, -4, -82, -254, -162, -83, -92, -268, -213, -265, -40, -69, -170, -172, -63, -68, -111, 106, -254, 105, 17, -309, -75, -93, -99, -106, 20, -157, -97, -61, -153, 38, 43, 259, 155, -164, 177, 125, 268, 208, 285, 119, 145, 83, 119, 14, -56, 66, 364, -98, 70, -19, 102, 52, -118, 5, 43, 24, 273, -2, 274, -28, 90, 93, -128, -42, -75, -192, 19, 139, 85, 22, 32, 195, -162, -220, -31, 133, -175, 141, -34, -10, -16, -155, -160, -197, -42, 120, -53, 25, -34, -330, -54, 24, -43, -357, -65, 80]
4021H0j87k1k0l6P9L68k68K03k29K42j83mK71k69k3K65k38j53K94k09K25k10K32
$$ y = [80, -107, -128, -148, -184, -105, 263, -5, 198, -31, 211, 28, 24, 295, 26, 3, 268, 30, -123, 171, -38, 187, -23, 209]
$$ [...]
8191E4
##END NTUPLES=NMR FID
##END=
