##TITLE=1H_SR32_pk
 CDCl3, 8 sc, 
 1.02.2021
##JCAMPDX= 6.0         $$ Bruker NMR JCAMP-DX V2.0
##DATA TYPE= NMR FID
##DATA CLASS= NTUPLES
##ORIGIN= UXNMR, Bruker Analytische Messtechnik GmbH
##OWNER= root
$$ XWIN-NMR		Version 3.5
$$ Mon Feb  1 11:17:16 2021 Russian Standard Time (UT+4h)  she@DPX200
##.OBSERVE FREQUENCY= 200.1315066352
##.OBSERVE NUCLEUS= ^1H
##.DELAY= (6, 6)
##.ACQUISITION MODE= SIMULTANEOUS
##.ACQUISITION SCHEME= undefined
##.AVERAGES= 8
##.DIGITISER RES= 18
##SPECTROMETER/DATA SYSTEM= spect
##.PULSE SEQUENCE= zg30
##.SOLVENT NAME= CDCl3
##.SHIFT REFERENCE= (INTERNAL, CDCl3, 0, 15.7039)
##AUDIT TRAIL= $$ (NUMBER, WHEN, WHO, WHERE, WHAT)
$$ ##TITLE= Audit trail, XWIN-NMR		Version 3.5
$$ ##JCAMPDX= 5.01
$$ ##ORIGIN= Bruker BioSpin GmbH
$$ ##OWNER= she
$$ F:/spectra/data/she/nmr/H-F/1/audita.txt
$$ ##AUDIT TRAIL=  $$ (NUMBER, WHEN, WHO, WHERE, WHAT)
(   1,<2021-02-01 11:16:09.15 +0400>,<she>,<DPX200>,
      <created by zg, POWCHK disabled, PULCHK disabled
       configuration hash MD5:
       00 E9 B6 7A A2 85 ED C7 34 08 36 98 17 FE 4E 26
       data hash MD5: 16K
       4B BD 9C 99 B8 F5 DA BC 2D A2 4E 14 D1 60 91 C4>)
$$ ##END=
$$ 
$$ hash MD5
$$ 3A 90 EB E5 15 A9 50 F2 B8 CA B5 13 DA 5C 53 D1
##$RELAX= 
##$RELAX= 
##$RELAX= 
##$RELAX= 
##$RELAX= 
##$RELAX= 
$$ Bruker specific parameters
$$ --------------------------
##$DU= <F:/spectra>
##$EXPNO= 1
##$NAME= <H-F>
##$PROCNO= 1
##$TYPE= <nmr>
##$USER= <she>
##$AMP= (0..31)
100 100 100 100 100 100 100 100 100 100 100 100 100 100 100 100 100 100 
100 100 100 100 100 100 100 100 100 100 100 100 100 100 
##$AQSEQ= 0
##$AQ_mod= 1
##$AUNM= <au_zg>
##$AUTOPOS= <>
##$BF1= 200.13
##$BF2= 200.13
##$BF3= 200.13
##$BF4= 200.13
##$BF5= 200.13
##$BF6= 200.13
##$BF7= 200.13
##$BF8= 200.13
##$BYTORDA= 1
##$CFDGTYP= 0
##$CFRGTYP= 5
##$CHEMSTR= <none>
##$CNST= (0..31)
1 1 145 1 1 1 1 1 1 1 1 1 1 1 1 1 1 1 1 1 1 1 1 1 1 1 1 1 1 1 1 1 
##$CPDPRG= <>
##$CPDPRG1= <>
##$CPDPRG2= <>
##$CPDPRG3= <>
##$CPDPRG4= <mlev>
##$CPDPRG5= <mlev>
##$CPDPRG6= <mlev>
##$CPDPRG7= <mlev>
##$CPDPRG8= <mlev>
##$CPDPRGB= <>
##$CPDPRGT= <>
##$D= (0..31)
0 1.2 0 0 0 0 0 0 0 0.06 0 0.03 0 0 0 0 0.0002 0 0 0 0 0 0 0 0 0 0 0 0 
0 0 0 
##$DATE= 1612163768
##$DBL= (0..7)
120 120 120 120 120 120 120 120 
##$DBP= (0..7)
150 150 150 150 150 150 150 150 
##$DBP07= 0
##$DBPNAM0= <>
##$DBPNAM1= <>
##$DBPNAM2= <>
##$DBPNAM3= <>
##$DBPNAM4= <>
##$DBPNAM5= <>
##$DBPNAM6= <>
##$DBPNAM7= <>
##$DBPOAL= (0..7)
0.5 0.5 0.5 0.5 0.5 0.5 0.5 0.5 
##$DBPOFFS= (0..7)
0 0 0 0 0 0 0 0 
##$DE= 6
##$DECBNUC= <off>
##$DECIM= 32
##$DECNUC= <off>
##$DECSTAT= 4
##$DIGMOD= 1
##$DIGTYP= 9
##$DL= (0..7)
0 120 120 120 120 120 120 120 
##$DP= (0..7)
150 150 150 150 150 150 150 150 
##$DP07= 0
##$DPNAME0= <>
##$DPNAME1= <>
##$DPNAME2= <>
##$DPNAME3= <>
##$DPNAME4= <>
##$DPNAME5= <>
##$DPNAME6= <>
##$DPNAME7= <>
##$DPOAL= (0..7)
0.5 0.5 0.5 0.5 0.5 0.5 0.5 0.5 
##$DPOFFS= (0..7)
0 0 0 0 0 0 0 0 
##$DQDMODE= 0
##$DR= 18
##$DS= 0
##$DSLIST= <SSSSSSSSSSSSSSS>
$$ [...]
##$SUBNAM2= <"">
##$SUBNAM3= <"">
##$SUBNAM4= <"">
##$SUBNAM5= <"">
##$SUBNAM6= <"">
##$SUBNAM7= <"">
##$SUBNAM8= <"">
##$SUBNAM9= <"">
##$SW= 16.9725356469052
##$SWIBOX= (0..15)
0 0 2 0 0 0 0 0 0 0 0 0 0 0 0 0 
##$SW_h= 3396.73913043478
##$TD= 16384
##$TD0= 1
##$TE= 0
##$TE2= 300
##$TE3= 300
##$TEG= 300
##$TL= (0..7)
0 120 120 120 120 120 120 120 
##$TP= (0..7)
150 150 150 150 150 150 150 150 
##$TP07= 0
##$TPNAME0= <>
##$TPNAME1= <>
##$TPNAME2= <>
##$TPNAME3= <>
##$TPNAME4= <>
##$TPNAME5= <>
##$TPNAME6= <>
##$TPNAME7= <>
##$TPOAL= (0..7)
0.5 0.5 0.5 0.5 0.5 0.5 0.5 0.5 
##$TPOFFS= (0..7)
0 0 0 0 0 0 0 0 
##$TUNHIN= 0
##$TUNHOUT= 0
##$TUNXOUT= 0
##$USERA1= <user>
##$USERA2= <user>
##$USERA3= <user>
##$USERA4= <user>
##$USERA5= <user>
##$V9= 5
##$VALIST= <valist>
##$VCLIST= <CCCCCCCCCCCCCCC>
##$VD= 0
##$VDLIST= <DDDDDDDDDDDDDDD>
##$VPLIST= <PPPPPPPPPPPPPPP>
##$VTLIST= <TTTTTTTTTTTTTTT>
##$WBST= 1024
##$WBSW= 4
##$XGAIN= (0..3)
0 0 0 0 
##$XL= 0
##$YL= 0
##$YMAX_a= 51729
##$YMIN_a= -47501
##$ZGOPTNS= <>
##$ZL1= 120
##$ZL2= 120
##$ZL3= 120
##$ZL4= 120
##$ABSF1= 10
##$ABSF2= 0
##$ABSG= 5
##$ABSL= 3
##$ALPHA= 0
##$AQORDER= 0
##$ASSFAC= 0
##$ASSFACI= 0
##$ASSFACX= 0
##$ASSWID= 0
##$AUNMP= <proc_1d>
##$AZFE= 0.1
##$AZFW= 0.1
##$BCFW= 1
##$BC_mod= 2
##$BYTORDP= 1
##$COROFFS= 0
##$CY= 11.3945322036743
##$DATMOD= 1
##$DC= 2
##$DFILT= <>
##$DTYPP= 0
##$F1P= 15.9154993809931
##$F2P= -4.1035820241983
##$FCOR= 0.5
##$FTSIZE= 0
##$FT_mod= 4
##$GAMMA= 1
##$GB= 0.15
##$INTBC= 1
##$INTSCL= 1
##$ISEN= 128
##$LB= 0.24
##$LEV0= 0
##$LPBIN= 0
##$MAXI= 10000
##$MC2= 0
##$MEAN= 0
##$ME_mod= 0
##$MI= 1.114404
##$NCOEF= 0
##$NC_proc= 0
##$NLEV= 6
##$NOISF1= 3.799351
##$NOISF2= 2.8
##$NSP= 1
##$NTH_PI= 0
##$NZP= 0
##$OFFSET= 15.70392
##$PC= 1
##$PHC0= -10770.48
##$PHC1= 24.40095
##$PH_mod= 1
##$PKNL= yes
##$PPARMOD= 0
##$PSCAL= 0
##$PSIGN= 0
##$REVERSE= no
##$SF= 200.130013532006
##$SI= 16384
##$SIGF1= 3
##$SIGF2= 2
##$SINO= 400
##$SIOLD= 16384
##$SREGLST= <1H.CDCl3>
##$SSB= 0
##$STSI= 0
##$STSR= 0
##$SW_p= 3612.71676300578
##$SYMM= 0
##$S_DEV= 0
##$TDeff= 0
##$TDoff= 0
##$TI= <>
##$TILT= no
##$TM1= 0
##$TM2= 0
##$TOPLEV= 0
##$USERP1= <user>
##$USERP2= <user>
##$USERP3= <user>
##$USERP4= <user>
##$USERP5= <user>
##$WDW= 1
##$XDIM= 8192
##$YMAX_p= 0
##$YMIN_p= 0
$$ End of Bruker specific parameters
$$ ---------------------------------
##NTUPLES= NMR FID
##VAR_NAME=  TIME,          FID/REAL,        FID/IMAG
##SYMBOL=    X,             R,               I
##VAR_TYPE=  INDEPENDENT,   DEPENDENT,       DEPENDENT
##VAR_FORM=  AFFN,          ASDF,            ASDF
##VAR_DIM=   8192,          8192,            8192
##UNITS=     SECONDS,       ARBITRARY UNITS, ARBITRARY UNITS
##FACTOR=    0.0002944,     1,               1
##FIRST=     0,             0,               0
##LAST=      2.4114304,     0,               0
##MIN=       0,             -47501,          0
##MAX=       2.4114304,     51729,           0
$$ Real data points
##PAGE= N=1
##DATA TABLE= (X++(R..R)), XYDATA
0@%%%%%%%%%%%%%%%JrJ6j6J6j6K0k8L2l3M1m8N6o4P2q8R8j08J22j38J57j75J96
38A04k20K46k75L05l37L73m12M54n00N52o08O69p39Q13q95R89j093J208j341J496
58G89j674J883k136K447k837L346m035N025o567R291j5423N1784n078q4316R9230
73E1729o1653j435N4700o8452L4934J758l9141O6785m7153j3382M6606m7186K3371
86A481J5527m7075M1292p597k0027M7518l6558j3516N0910l7093K699K5037m0171
99a7573K4425M429k2815K9207l7878P879L6472n3705L0149R407m4321N4829j8296
112B209k1654M0007m0676K0052K1237m6940L3646l785k0865L6989k6746j297J8257
125A0434k6907K6081n025k7984L4894j4389j0835L0172k6950r75K3809k1852J2952
$$ y = [0, 0, 0, 0, 0, 0, 0, 0, 0, 0, 0, 0, 0, 0, 0, 0, 1, -8, 8, -8, 8, -8, 12, -16, 16, -17, 24, -24, 32, -32, 40, -48, 50, -58, 64, -74, 83, -92, 104, -116, 130, -145, 160, -177, 196, -216, 238, -262, 290, -318, 351, -388, 425, -470, 519, -574, 634, -707, 789, -885, 998, -1138, 1309, -1528, 1818, -2217, 2808, -3759, 5532, -9891, 41893, 36815, -47501, 51729, -9924, -11359, 43341, -25111, 9823, 11581, -27560, 39225, -7928, -21310, 25296, -21890, 1481, 17008, -30067, 11225, 3628, -16399, 31119, -5439, -18955, 31955, -5138, -2439, 22598, -17573, 6852, 11281, -11534, 17673, -20205, -12326, 24146, -29559, 590, 9997, -34324, 20505, 2209, -19445, 20562, -20114, -62, 21175, -25765, 7881, 4096, -16769, 20220, -6526, -7823, 10434, -16473, 9608, 4583, -23401, 11493, -2896, -13731, 16441, -10509, -11484, 12325, -9527, 3425]
138C425L251k0719K7577q411j0630K3253k7135Q048J7384k8924J9609m197j6744
151a4213L2612k1955l151K2728k9778J8686P726k6627K4245j0203o048K2964k4424
164g438P579J0332k1262K0399n081j5466K2004j3516k34J4016k1177R222O340
177E718j6893J6099o277r852K0235j2949K69J2520j9268J2412M019j6517J6314
190E830q543n479J7414j6324M688P711j7120J7283m748j1242J8089j2645J384
203c702J2994j7811R873J422j1750J4905p290n497J4861j2013M973O324j3140
216e851J0196j499q114J2405r906r37J1985j3165O181M838j2649J1993k647p036
230d206J2430j0402K129Q775j3957Q956M09j0413J3093p670l416J0927j0936O088
$$ y = [3425, 6676, -14043, 13534, 5123, -5507, 17746, -9389, -1341, 16043, -12881, 6728, 2531, -14213, 18399, -3556, -6707, 16021, -13757, 4929, 12655, -13972, 10273, 70, -5978, 16986, -7438, 141, 10473, -10789, 9610, 4529, -10937, 11067, -2449, -2683, 11333, -9844, -622, 5718, -11175, 4924, -1353, -11205, 9030, -3919, -3650, 8870, -10398, 2014, 6033, -10484, 5830, -2713, -8192, 9222, -7102, -2414, 5297, -11823, 5460, 712, -10530, 7559, -5086, -3702, 9292, -8519, 1354, 2776, -8974, 5931, -1359, -6856, 8005, -4008, 965, 7289, -5851, 4345, 2846, -5268, 7137, -2769, -3706, 8279, -4886, 1295, 6133, -6516, 5477, 2830, -4206, 8224, -2178, -49, 8726, -5231, 3725, 4134, -6279, 6814, -856, -4272, 6655, -4281, 1807]
244A807M223j1746J0351l202p178J0535q038J51P258j0051P309R01q505J0826
258D641o560k230Q822r788L670N253j0382Q611j860p334J0691p531j23Q169r871
273e822O064K585q853R143l831m128R117q247K038N649r070P464M6o648R182n599
289i10j512P939q922M043L583q430Q012k432m579Q526p000Q79O216q583O125Q27
305C782o760Q403m820k625P640q352K941M089q188P305j508n076Q058n769p04
320a584N950p855M350J734p021P739l623l157P542p424J741M568p469N674on239
336d080O735m478j313N810p059L146K925p242P086j350m503P694n785L29N224
351C139p482M625J016o184P259l105k562O549n590J904K935n857N662j028m132
$$ y = [1807, 6030, -5716, 4635, 1433, -5745, 4790, -3248, -3097, 4161, -5890, 1419, 2320, -6185, 4641, -1919, -4149, 4673, -5115, -1445, 3808, -6574, 2037, 177, -7157, 3534, -3997, -4120, 4049, -5822, 242, 2827, -6026, 3117, -714, -4842, 4275, -3972, -1934, 3715, -5355, 2109, 2155, -4493, 4689, -910, -2422, 5517, -3405, 638, 4221, -4209, 3803, 1371, -3208, 5318, -1682, -803, 5413, -3170, 2955, 3782, -2978, 5425, 605, -2020, 5620, -2732, 209, 4298, -3890, 3415, 1907, -3169, 4889, -880, -1584, 4366, -3489, 861, 2595, -4426, 3313, -310, -3467, 4075, -3349, -1608, 2960, -4509, 1165, 1159, -4080, 2655, -1823, -3136, 2674, -4385, -1239, 1686, -5556, 1530, 180, -4323, 3371, -2414, -2085, 3139, -4343, 282, 1298, -4886, 2373, -732, -3294, 3255, -2335, -431, 2504, -3353, 2309, 1281, -2851]
366b851O872n409K13N329o715K725K494n823O214j629l420O412n046O27M266p029
382b770M086J261n036O109l592j600N379n072J488L071n814M685m46m454N929
397C224m080o99M635n614K182J473m867N693j613l174M880m181R49L298n594K766
413g22J169l835M926k622j867M512l990J898K229n968M195Q61l485M611l140j143
429b371L854l378J775Q10m349N607j299k316M251m087O25L777m428K531q50j794
445a642N075l320k169M579l360J320L330m241P09O25j020L136m041R98K276l431
461a176K340J119m952L666L96j410J603k963P58K840l236J933m93l083M047m71
477I18j371L53j680K410P41l507L095k159j701N466k894k671K616m38K32J192
$$ y = [-2851, 4021, -1388, -1175, 4154, -2561, 164, 2658, -3165, 3049, 1420, -2000, 4412, -634, -7, 4259, -2770, 1316, 2577, -2459, 3650, 58, -1542, 3837, -1235, 253, 3324, -2490, 2195, 1749, -2705, 3224, -856, -1555, 3080, -2534, -352, 1121, -3746, 1947, 334, -2840, 2040, -2141, -1192, 2106, -3488, -722, 447, -3388, 1538, -1084, -2951, 1561, -2429, -531, 1698, -4270, -75, 786, -2699, 1912, -1228, -2371, 1483, -1895, -120, 690, -3659, 1948, 649, -1667, 2584, -1503, -878, 2899, -1529, 1002, 152, -1642, 3433, 113, -2056, 2523, -837, 483, 3813, -428, 281, 906, -114, 3022, -1019, -21, 2255, -1176, 1164, 2283, -2669, 997, 1393, -17, 1586, -1377, -619, 2221, -1015, 918, 425, -2658, 1389, 918, -453, -100, -1780, 630, 1371, -2136, 959, -1200, -2901, 2565, -329, -3000, -384, -822, -590, 602]
493F02k087N28m15J022J931l068k24K246q43R50j651j414K236q39Q14K498m820
510b534J924L488k485o64J046q60P78NQ9p92j822L845O3k332Q96l74K62K535j815
529A253j586L35o78L338n51l843J529J036L33j12p51p26K9J927L75k655j93J680
547G40l32J9K92j752J5K121l64j075p35n1J546m82m10n80j98J240L62n66j071
566a281j033K131J265k529P98l84j1K077j053j018l79Q14J643j606l48O98p72
583i88J521K46k113P56K58Q93N95j610j31Q08N39M10r62n35L70P36L86n53r34
602c08N42R26j63j38m48r14K010n57p74N76j032J172O19j777P20m97j59J768j972
621d06R4O44j082J854m25j846J156o49O44O13k030J152j36l13J513j525r88J626
$$ y = [602, -1485, -957, -1372, -350, 1581, -1487, -1711, 535, -308, 642, -1009, -2423, -187, -1026, -212, 2286, -2534, -610, 2878, 393, -271, 775, -85, 693, 698, 787, -5, -1827, 2018, 2081, -251, 645, 271, 533, 3068, 1253, -333, 2, -676, 2662, 2111, -1732, -203, 833, 1166, 1054, 303, -423, -394, 1533, 1908, -747, -940, 740, 408, 427, 719, -1033, -1018, 1103, 739, -336, -1071, -1122, 424, -58, -468, -1048, -1246, -6, 356, -210, -1281, -2314, -183, 1082, -1447, -649, -1033, -1044, 1033, -20, -1038, -1417, -603, 1040, -566, -914, -216, -988, 533, 779, -1334, -578, -320, 573, 1168, -442, -573, 235, 774, 1184, 222, -313, 57, 793, 1179, 626, -308, 234, 1160, 997, 859, 411, -503, 1507, 950, 176, 752, -280, 892, 1511, -266, 454, -43, -202, 1566, -406, -312, 332, -750, 1104, 679, -1167, -11, -660, -16, 597, -1433, -281, -417, -730, 783, -742, -1730, -104]
639a04l31J15L50j511J094N76j054Q97j034o58K412j430M2N71j312J596K20j603
657a164K009j573P8J996k420R79P43j560K142r12r18J626j637R61J177k664K006
674H69k36r09K000j264o12J457j214M20L03j199J530k12j201J561j142m89J940
691A602j961P58N20j765J667o02j233K054j514OJ535j884R62J85j564K031j287
708d90o64J867k042J045Q67k257J782n45q94K142j734J40J144j586R26L35j217
725a181J320l62j105J976j191k5J211j689J385J24j753K031o85o50J793j802O28
742B5J064k079J930l16j025J769j390LJ452j903J186M23j881J821p27m79J512
759A385j453N18Q25j732J016L25j335J669j261m92J530j492L73P44j785J354K5
$$ y = [-104, -435, -320, 30, -1481, -387, 189, -865, 32, -1002, -1660, 752, -678, -636, -65, -1377, 219, 439, -1164, 845, -728, -650, 1346, -1074, -95, 648, -912, 1230, 318, -600, 1026, -611, 350, 1527, -1137, 869, 633, -276, 1724, 460, -152, 1305, 91, 511, 814, -385, 1145, 933, -268, 1293, 151, -338, 1602, -359, 399, 919, -846, 821, 219, -1014, 1040, -474, -468, 1067, -817, 145, 330, -1234, 797, -490, -1154, 713, -1329, -284, 583, -1674, 108, -437, -1331, 811, -923, -783, 361, -1225, -299, 36, -1181, 139, -223, -1328, 648, -543, -568, 643, -1046, 339, 463, -1290, 741, 56, -594, 1199, -603, 25, 1089, -990, 940, 624, -401, 1368, -22, -19, 1433, -470, 716, 1139, -742, 1079, 352, -127, 1385, -68, 450, 1275, -457, 559, 884, -451, 1218, -43, -535, 995, -497, -124, 620, -1165, 189, 214]
776B14j289J683r32j97J141j462Q69J37j453J675r99n31J734j720Q02P48j827
793a407J456m9j055J182q72K29J115j604O82P37j569J688q79p06J968j348J48
810b84J104j469J081j02j086J375o41j39J063j165N88O19j540J563m15r90J695
827A257j375K77J162j488J165l53r67J090o85p1J254j176L92M23j613J778j138
844f8m23J553j648L48J127j859J404k05j177J361q07j37J185j506M98N46j514
861a322J604n94p52J521j214M4R59j325J053O3j161J490q47o29J661j446P00O07
879D12j343J017j67o58J538j455J88J425j740J202K73j265J246p93p9J434j585
896c50P41P62j627J431m54r51J672r16l74J108j517J333J15j831J816q47o97K062
$$ y = [214, -1075, 608, -324, -521, 620, -842, 27, 164, -1289, 386, -613, -1144, 590, -1130, -328, 420, -1407, 49, 0, -1055, 127, -745, -516, 599, -1005, -323, 414, -1155, 533, -346, -1052, 916, -432, -284, 820, -649, 432, 330, -756, 619, -22, -161, 902, -263, 325, 944, -596, 967, 552, -438, 1257, -118, 159, 1321, -167, 998, 645, -322, 768, 83, 12, 1266, 90, 482, 905, -708, 1070, -68, -491, 1062, -586, -238, 889, -970, 434, 229, -948, 413, -394, -531, 654, -852, -354, 192, -1322, 282, -312, -1064, 457, -757, -713, 246, -1079, -26, 37, -1124, 366, -481, -1110, 551, -895, -195, 412, -931, 86, -81, -739, 799, -656, -468, 957, -783, 419, 692, -573, 673, -120, -199, 1235, -350, 391, 1153, -474, 957, 503, -448, 1224, 308, -66, 1042, -475, 858, 973, -858, 958, 111, -586, 1476]
914A476j628L29J047j712P63L63j795J767m20q23J608j463k87J799j383R50r56
931c65q98K241j351j83J436k223J293O75j655J278j415N49J425j913O47P02j800
948a557J834J86j404J359j264O68J031k046R20P46j665J943p17p25J566q75P5
965G5R67k175J294N43j380K176j701l06K025j959J346N1j702J620l36p89J102
982H51j196O8J727j779J097l27r53J854j336p43J716j763R06J258k049O93K57
999B81q03J824j962K35J571j723J150k68j952K344n23q74J036j185k3J398j589
1016a063J192n32j277J847m00l96J723k373J404Q55j797J216n50r70K480j965
1032f06l3J164j504K111k15j744J489j16n89J457j692o4J711j473N49O35j870
$$ y = [1476, -152, 177, 1224, -488, 275, 638, -1157, 610, 190, -633, 975, -488, -775, 1024, -359, 591, -365, -1263, 978, -373, -556, 880, -1343, -50, 625, -1030, 248, -1167, -618, 807, -1106, -459, 243, -1557, 277, 463, -941, 418, -846, -178, 853, -1193, -273, 473, -1192, 751, 34, -691, 875, 0, 75, 1042, -1133, 161, 704, -676, 1500, -201, -507, 1518, -441, 905, 956, -746, 874, 538, -251, 851, -345, -277, 1450, -329, 768, 441, -512, 1342, 6, -737, 979, -784, 122, 1380, -669, 24, 281, -522, 1302, -660, -425, 1146, -577, 573, 305, -1647, 697, 174, -700, 336, -849, -872, 526, -1063, 129, -403, -1680, 167, -233, -629, 1094, -1279, 125, 980, -817, 399, -151, -1121, 1359, -606, -639, 525, -979, 1132, 917, -827, 662, 546, -43, 1414, -278, -342, 1369, -104, 445, 1080, -790]
1049g90J813p07l82J665k099J95J639k083J208J94r66J143q00K01J299k970K078
1066F38J096k657J666q63m14K016j448Q1L29j426J893l75j295J213q80N2J743
1083A369k072J20P58q19R02k52p98O82j14k39J474j455J87J004j574J207Pj451
1101a064J639j486M69J335j311K96Q55p05M49m30q16J785j670k26J619j172J315
1118H82q61j98J277j489N52K96p71K47L82p36R79j08q61J349j293J513L5j566
1136c71J223L18j260Q63p85m2N60l09N60r25p14K026j184K45j48j88q2J175j250
1155b88J125j468Q44O14j570K07M53o92j34J033p84M52J57l04K74o10M63M10n47
1174c65q3N89q06J501p53r89J099r63N01P68j203J182m09n02L90K00O98j99r72
$$ y = [-790, 1023, 316, -66, 1599, -500, -305, 1334, -749, 459, 653, -313, 830, 30, 231, 1530, -1440, 638, 1734, -923, 743, -120, -534, 1482, 34, 115, 444, -982, 911, 536, -759, 454, -426, -374, 1369, -703, -583, 175, -644, 258, 6, -792, -110, -224, -463, 1011, -444, -257, 747, -827, 380, 387, -1064, 575, -911, -442, 893, -418, -122, 733, 28, 477, 47, -769, 1016, -654, -880, 739, -433, 882, 21, -177, 1100, -389, 163, 459, -312, -65, 317, -419, 560, 452, -409, 940, -353, 1160, 1195, -371, 852, 1170, -90, 773, -12, -54, 506, 197, 757, -168, -882, 1144, -40, 205, 57, -131, -213, 962, -288, 837, -631, 213, 827, -743, -536, -83, -775, -909, 124, -660, -208, -51, -355, -81, -691, -228, 182, -365, -448, 141, -665, 836, 83, -906, 193, -770, -269, 499, -704, 478, 69, -433, -43, 157, 855, 656, -316]
1193c16M91O31p16O66n42o50J274j146R67l84n99O17J80q54J108o00p4N43q30
1212b34R71n04j22R2M3l04K51l41M99l8m34R0L5k21L93l07R0lm02M53K52n20J23
1235a38k07Q5K45k34j2M35o22N84j87o92O87j20k67L51k87M02M0n82O94l96k39
1256d60M98l53M54k0n21L15J78l00M09k48l61Q10n07M1O12n74K88k57J03N30p08
1277g1J81J03l95L98J18n10O21j87l39Q0N6j53K65K7N4jj55R7o4j82M00m56K8
1300h5M82q10K86j52K0L13l44j13M85l46J31L39o19O95o15O4J83j32NM13n50K41
1322a09L5l05N35l17j33L77j64R6K2m51O61l01j01K10k49K47L14m74L48j77l36
1343b72J04P24p62P13p06R9M70m73L92K53p39O43k17j42R6J03n84P28m55N97O6
$$ y = [-316, 175, 806, 90, 756, 214, -436, 838, -308, 659, 275, -324, 293, 473, -381, 727, 127, 53, 596, -234, 737, 233, 111, 203, 246, -58, 193, -148, 351, 313, -121, -31, 4, -217, 176, -131, -41, -44, -446, 7, 259, -261, -138, -345, -260, -15, -249, -261, 174, -448, 136, -51, -743, -56, -176, -443, -92, -379, 23, 63, -519, 175, -221, -460, 38, -315, 139, 119, -402, -87, 91, -209, 200, -48, -409, 401, -106, -65, 547, -27, 261, 4, 107, 637, -71, 110, 213, -182, 216, 334, -176, 445, 258, -81, -1, 55, -98, 167, 194, 248, 247, 92, 189, 125, -57, 343, -113, -85, 397, -413, -127, -279, -259, 54, -290, -403, 82, -264, -133, 206, -413, 282, -333, -269, -86, -218, -213, 200, -350, -109, -74, -379, 156, -161, -294, 83, -81, 15, 37, -414, 247, -54, -155, 55, -194, 53, 367, -107, 241, 64, -272, -168, 556, -206, 507, -199, -100, 370, -103, 289, 542, -197, 446, 229, 87, 183, 286, -298, 430, -25, 572, 638]
1364F38j439N29O9O7L04L20j57k16l38P4M46l67K85k11k98M19l11M66j78m22K46
1385g4Oo6M1n79J97M31nj67N9J64P6l07r5K13r6j26M72l20J2J31j83l0L39k18
1409a25M25m52K44J59n35K94Q7K70k80N7l53Q24n27K74r4L20j40m62M8L26m54
1430i4J86O99n20k52K33O1L03n63NJ66L49j53m09M49j38rk39j46P38j10P09m06
1452H59n00j154R77m8O05n10n22K69k92K11j62L71k72j22L17N01p43K24j11m90
1472e92N64P8o92J33K17k0Q8J32k15L44M0K02k11j96M8o7K53N9k74Q1K31P6j06
1495A73k25l1J32k3N23j11p72P79l26J13L01o81L50M56m28k00M6J27N88j0p16
1516F5J0n26O21J25k43k70Q7K68J91j85n79J82N85k23J7l51k86K55l5oK32m05
$$ y = [638, -801, -272, -203, -136, 168, 488, 331, 115, -223, -149, 297, -70, 215, 4, -294, 125, -186, 280, 102, -320, -74, -68, -134, -93, -672, -475, -44, -49, -216, -157, 7, 83, -224, -319, -106, -202, -328, 144, -176, -164, -33, -216, -246, 93, -125, 300, -152, 92, 251, -284, 10, 97, 367, 87, 144, -209, 615, 88, 362, 268, 588, 448, -14, 34, 360, -94, 92, 791, 271, 19, 252, 313, 616, 53, 58, 224, 573, 420, 11, 460, 322, 313, 74, -72, 666, 556, 1265, 859, 359, -795, 182, 134, 739, 229, -293, -24, -316, -105, -267, 104, -168, -290, 27, 528, -215, 9, -102, -592, -28, 50, -642, -509, -292, -312, -224, -92, -307, 37, 77, 279, 68, -128, -80, -147, 106, 165, -109, -28, 203, 279, 173, -52, -83, 49, 26, 549, 438, -334, 445, 119, 232, 533, -148, 202, 658, 230, 30, 76, 203, 791, 781, 65, 75, -451, 170, 295, 52, -218, -131, 137, 328, 143, -436, -254, 331, 108, 125, -226, -512, -257, -292, -298, -66, -471]
1538d71J06R2L28j00J86M4J20l71j71p00R67L41p54o74J243j43l83K99m22O7N04
1559A08l52oJ69k99P60l12j16K0P5J54L8m4J47k91K19j28p9k4l6L3J12J24N9j62
1583A69j94K67L0p2J08l84j73N51o5n3p4m7J18K5n00O92n98J60K5p2j38K78k32
1606a79J95P9o61P21l81J83O7q6j63J45j46J58l6R1N9j04j73K80J37k22R0l71
1628c17J90K21k93m8J56K0J4j95J35L42m63L88j57J35l6j24K8J76j2k12L73k03
1650A18q5M0J13J23j31r2K36m69J12j2j24M25k05J6J67l7q7j52j72J31L80n5j8
1673B22m39O1K5j12K80P7q3j58P7l56L15j31RP8J68k11L9j80J88K32k60J54j58
1696a63m6L25j36j41N6K8j25K55k11O8J01O3k3r8n3J40P5K4j15l65M14O5n1r5
$$ y = [-471, -365, -273, 55, -45, 141, 185, 305, -66, -237, -937, 30, 371, -383, -1057, 186, 43, -340, -41, -463, -396, 108, -244, -250, -81, -380, 380, 68, -48, -28, 47, 201, 239, 195, 342, 51, 270, 142, 63, 39, 3, 36, 148, 272, 331, 169, -25, 242, 272, 200, 308, -76, -249, 302, 237, 184, 110, 63, 181, 206, -294, 398, -200, -40, -15, -87, -225, 53, -179, 16, 95, -566, 155, -226, -43, 24, -62, -225, -80, -226, -68, -104, -13, 46, -58, -231, 49, 186, -36, 54, -317, -127, 94, -199, -247, -91, -71, -57, -252, -117, 225, -238, 150, -7, 128, 92, -32, -4, 172, 160, -52, 321, 118, 33, 73, 186, 309, 178, 86, 322, -147, -35, -47, -171, 254, 49, 65, 232, 195, 108, -44, -216, -85, 295, 240, 222, -217, -156, -131, -243, 37, 114, 31, -127, -50, -406, -91, -222, -213, -135, 33, -178, -139, -319, -131, 101, -159, -5, -163, -209, 116, -20, -161, -105, -77, -202, 53, -158, -90, 11, 74, 51, -47, -100, 40, 115, 139, 24, -341, 73, 138, 87, -8]
1720hL9J02p0J38Q9k48K11J05m21K91j86J80m0K7q3N0J32j3j64Pj69Q6J5l7j04
1745g1J58J51o02L93j17J09J25k70L8L17l03j83Q9R6J26j75M2P8j20j53Q7J69
1767a6R1j42j44L20j76m10L72j46j50L22q8k7J23l19N59k95J80J22m14K20J88
1788A70j07J5L6l63J78P4Q2qq7q1L27j76j0n2O0k3j0J71n9o4M5J93j01p0j34K8
1814C4M64n40j89L10l21M56k0k18L48m09j43M69l33r9N6n7L23n76N24j9k72J06
1836a06L1o7L67k11k72J57J1J83L6m41M19l39k56Q23m73k03L95k18O9K5m69L57
1858a82K67k93L66k09K37j69k50O6L74r8N02m3q48J00n46J23P99L22n67L64p09
1879c94J35q0M27K6l72l3O80p55N32n4o6Q36j267j14M18J9K37k20l47k4J99j32
$$ y = [-8, 31, 133, 63, 201, 290, 42, 253, 358, -63, 228, 42, 222, 182, 209, 126, 176, 308, 295, 131, 138, -31, 55, 70, 33, -71, 87, 238, -364, 29, -88, 21, 146, -124, -86, 231, -72, -255, -166, -70, 56, -119, -77, 1, -119, -272, -185, -16, 75, -67, -211, 109, -67, -477, -105, -251, -401, -79, -167, -194, -71, -390, 169, -126, 54, 176, -238, -18, 170, 63, 78, 114, -249, -71, 3, 85, 77, -10, -91, 236, 60, 50, -2, 58, 35, 25, 196, 137, 73, 118, 311, 210, 140, 6, 34, 498, -42, -231, 79, -242, 214, 194, -24, 324, -85, -228, 241, -92, -191, -135, -192, 131, -445, 79, 60, -212, -106, -75, -142, 225, 14, -258, -101, -90, 93, 129, -312, 107, -232, -488, 335, -138, -341, 54, -164, -95, -70, -539, -182, 85, -208, 158, -51, 186, 17, -233, -167, 207, 109, 611, 568, -280, -180, -726, -603, 196, 518, -49, 315, -394, -259, -339, 88, 114, -258, -291, 389, -366, 166, 112, 46, 882, -385, -499, -81, -62, 175, -45, -392, -416, -217, -349]
1901c49K55m8O7k52k0M61k62R3K18m65J13l65L62K11O6k54M58l88p16R84o90O57
1923A36j45k92N40n91k70K40N35L47p39j34J6J92L15l53r3N39Ko47K22N12l65
1944c3o0L78l85O74l47j3j84n82O64P3k98L86k70m23O86n39N82o0k12N8J27k13
1966IK04j23j89P5kK5J08j06J51p8k99K96j15k32L31j20n6J47l29K99Nj0J16j42
1990c5l49N65m04n5J89m1K59k09k47K99p5M6K60l11O2N4nO8k89K16k19j22L37
2013fL84n94L10j12J48l94L23k29K61Jk15j7k0M36n09Q9N99m12L89J9l87L76q46
2036d06N02j32M62m76n3J56k47M06q01P60N34j521L88J02M20q69J005p67jQ01
2056B63k59K53p74L28K37m06J20l89N82n5r6L5N6K15n6l81K01L4k30J79k3R6K01
$$ y = [-349, -94, -142, -75, -327, -347, 114, -148, -55, 163, -302, -189, -554, -192, 19, 85, -169, 289, -99, -815, 169, -521, 136, -9, -301, 239, -352, -622, -382, 153, 500, -239, -373, -357, -165, 150, -203, -296, 243, 245, -402, -180, 332, -33, -93, 285, -100, 574, 227, 214, 30, -552, 112, 185, -113, 273, 3, -420, 266, -273, 309, 249, 37, 95, 222, 9, 213, 90, -99, -24, -26, -1, 107, 1, 152, 74, -225, 71, -44, -276, 55, -65, -121, 26, -303, -4, 1, -9, 107, -35, -384, 181, -223, -278, -89, -130, 129, -80, -327, -28, -103, -57, 203, -108, -46, 8, 3, 71, -218, -2, -221, -343, -6, 378, -216, 94, -18, 130, -264, 59, -170, 91, 92, -123, -140, -160, 276, -233, -144, 455, 43, 432, 451, 64, 440, -406, 96, -36, 426, -50, -103, 53, -194, 212, -589, 171, 705, -816, -428, -326, 94, -775, 230, -537, -538, 263, 4, 257, -517, -189, 48, -358, -238, -627, -45, -100, -196, -161, -105, 110, 54, -327, -126, -92, -322, -143, -166, -70, 131]
2079A31m19K45J29j91L79k62j0J79l47oJ78J40j64J60k04j2k30J59K22j79m5J84
2101C7j72K50j72P3n8m0N2J04O4k22L95k68N4K34m51O4L86k15k03q3M8K40j07
2124A0n8R5M7J13r2k5J39l16k2K89k64q2j85J41L8L4P0L0r1O6k18L41J7J01k84
2149a06j68K51N8l4j85L96l72J28M5Pk05L9K41j98J25j59J90k95M56l48k5K91
2171A32Ll91K79o9j14L27k42O6L82m85J32N9k22J48M4O0R1j77N36n24m79L62K90
2194B08p0k70L07j16M38o57N88o60L07j52k83K90rq7J12k9l67N71O27k99j000
2215e51J161n18K4l78Q70p68J41k12N25j75k82K18j07M00m36n24J99K58l4j00
2235b89L9N24J30m2K2l05J71q16P67N6m7l40N90n87J62K93l83N41r16L41J36m1
$$ y = [131, -288, -43, 86, -105, 274, 12, 2, 181, -166, -172, 6, 146, -18, 142, -62, -74, -304, -145, 77, -102, -147, 37, -135, 115, -57, 16, -42, -82, -30, 74, 138, -84, 311, 43, 97, 331, -120, -56, 330, 115, -88, -171, -123, 117, 10, -48, 47, 94, 207, 115, 90, 229, -87, -109, 180, -84, -166, -351, -210, -172, -138, -68, -38, -129, -63, -281, 60, 77, 178, -106, -274, -23, 35, 1, -184, 212, -160, -32, 13, 20, -185, -146, 95, -103, 22, -137, 53, -242, 214, -134, -159, 132, 135, -256, 23, -46, -160, 167, -75, -9, 373, -112, 20, 79, -143, 5, 49, 109, 200, 23, 559, 35, -444, -82, 208, 138, -132, 175, 59, 497, -160, 428, -232, 75, -77, -360, -70, -79, -166, -54, -83, -450, 121, 748, 449, -551, 610, 92, 116, -262, 608, -160, -19, -231, 294, 119, -163, 55, -52, 348, -88, -612, -413, -155, -189, -289, -250, 274, 404, 362, 384, 79, 250, -566, 201, 257, 210, -130, 460, -127, 35, 328, -55, 486, -430, -89, 47, 6]
2257FM41n55K15k84K07k75N67m83K44lo94Q35k76L80J0j42k85O35j069M55K21
2278A50n97J074q78j91L11L40M9n56K58k45L94l46P80o11J42Ok33R2r2J41R6r3
2300ir5j09K44L4l01K45q8J06J2M9k57Q2J52r8J14j95o7Q9k6J5K9M9j46K25q6
2325c2J08j80K35n6k3K12k40M95m75j1j43K53Pk5r4J45O3k05J04j13r9J31J66
2348B23k24K00l15J93j6r7r7O0j29k7L01k1%J3j46J37l81K46k34M98j82q6k43
2371c27R7L35j97P4l6J53m17K82K01l00J40n1O1j21R1Jr8J83J8k84J58N0j04o6
2395a57j78N64k82O0J91P3k05L1Q2k4k34R9q4L19J07m56J93J2K52j05k54j0l7
2418d3J73J79j65M7k95M84j96J97n09j91O79k89M7r9k06L21m16j36N81k9k87o9
$$ y = [6, 447, -108, 107, -177, 30, -245, 322, -161, 83, 80, -614, 221, -55, 325, 335, 193, -92, 543, -526, -71, 150, -447, 627, -251, -442, -131, 209, 258, -298, -40, -285, 109, -237, 543, -68, 74, 80, -153, -61, -153, -12, 84, -9, -104, -213, 31, 65, -236, 9, -79, 27, 39, 88, -169, -87, 65, -33, 81, -114, -181, -92, -118, -103, -74, -25, -171, 54, -32, 76, -104, 131, 75, 52, 264, 24, 519, 44, 33, -110, 143, 150, 125, 31, 176, 239, 34, 138, 25, -74, 57, 223, -1, 199, -116, 77, 61, -36, -133, -73, -202, -229, 72, 51, 51, 64, -82, 55, -326, -80, -314, 184, 2, -84, -327, -230, 105, -92, -18, -54, 99, -318, -36, 165, -135, 5, -46, 15, -106, -15, -14, -112, 71, 89, -195, -37, 13, -91, -157, -335, 229, -53, 7, 198, 271, 66, 97, 179, 155, -79, 20, -64, 255, 362, -94, 99, 111, 363, 258, 4, -6, -43, 130, 309, 144, 191, -104, 380, 184, 381, -128, -319, 360, 71, 118, 19, -187, 134, -282, -418, 163, 134, -153, -222]
2440b22J68m79K73M11k78P4L48q93N02J67j99k3J7M0k87O15n38P72j324R20l44
2461b80j25o04P74pk84J316M85r86j179R49l35K98k34M35k84J0J94n54O62q4j05
2482F2J22l04R1K65j95o3J53l21J90J56n9K33l60J30l0j66M8N5Rj75K31r0N7M8
2506H7l02K72r2J66r3J5j53P5j0K2J67j83K5J59k1m5r3J31k21j90K74L0p0L6m2
2531e6p7K4o3M3J31M3K03l17l9J73m7j14j15J00j06J50K14k14j0Q5j75kK17Nm6
2556Gj3P7j8P9j63J15J05n8l23J17kJ33j41L88l26K04m50N24l99N9R5P9j26J34
2580I7j94L1J09q8p1J6J74j17K48k67J19n7j53M2N2j9N8J29m8l42J43P1J71M1
2604A45l58L49kl70o0J21P6Q3J19k06J1J62k10o6L63n7j76K12Q8j43K88l51m11
$$ y = [-222, -54, -533, -260, 151, -127, -53, 295, -598, -96, 71, -128, -151, -134, -94, -381, 234, -304, 468, -856, 64, -280, -405, -1009, -235, -242, -526, 790, 1275, 289, -890, 59, -276, 22, -212, 223, -61, -51, 143, -411, 251, 167, 62, 184, -120, -29, 236, 41, -22, 131, -190, 0, 156, 97, 330, -30, 100, 70, -96, -48, 7, 16, -159, 72, -18, 39, 87, -215, 57, -35, 131, 38, 53, -100, -25, -35, -13, 154, -29, -4, 155, 134, 89, -4, 127, -94, -284, -10, 20, -50, -14, -56, -133, -109, -172, -129, 2, 45, 248, -69, -108, 65, 18, -96, -211, -111, -217, -67, 147, -67, -77, 8, -167, -169, 48, 53, 7, -6, 71, 53, 132, -31, 84, 189, 131, -192, -75, -77, 56, -85, 303, -23, 181, -269, 255, -144, -85, 10, 89, -37, 97, -97, -66, 43, -45, -116, -100, 74, -43, 205, -62, 57, 0, -153, -111, -59, -78, -20, 109, 61, -281, -138, -67, 104, 145, -213, 136, 134, -236, -296, -175, -99, -16, 103, -103, -92, 70, -140, -206, 157, 100, -76, 136, 224, 81, 369, 18, -393]
2627c93J79P09J83K35q9l08k65N0j51J7l05K62j9K4J02l08K55n95L62r8L75k55
2649c3O2M9J37j14Q7j21j04M6j18J17p2q4k2J31n2Q6k85N9K2J26K17l00q1K23
2673b4J76j72j10N6M0q9J05J86l96K67J24k36p1R6k1J32j2n9J04k33j9J26J19
2696H9k61K37p2N6q3J87l6j87J66j11N2p8r2K19kn6q8mJ06j31k01N88j45k11J88
2721A30j89M1m9K20j83J29J15k48j82L16p4K2J70l45J54L15n66K45Q7m02M42k1
2743A27j08k92M7j58K0K01N7l55L80L49n10K82J27k47n7J034j737R18M36j003
2763d89N47j28J07%K36k01N4j58o6K20j55Kk4Q4o1J93m07K64O7k40J49ll5j22
2787a66J27J29j3K5j32nP1q1j37J41J62j22J23l69K69J14j17k02O1j07M02l11
$$ y = [-393, -214, 495, 678, 913, 824, 516, 251, 301, 150, 167, -138, 124, 105, 129, 231, -77, 178, -417, -55, -153, 222, -33, 29, 78, 215, 101, 188, 67, -37, 9, -109, 8, -64, -148, -170, -39, -91, -5, -290, -231, -209, -83, 134, -166, -247, -24, 152, -20, -130, -74, -34, -123, -18, 168, -228, 39, 163, -73, -144, -48, -69, 63, 51, -8, 96, -137, -156, -30, 89, -172, 65, -7, 49, -34, 153, 117, -70, 96, -15, 37, -41, -133, 86, 84, 28, -60, -64, 42, -89, -290, 298, 153, -58, 130, -59, -18, -67, 153, -30, 99, 214, -34, -216, 100, 26, 48, 218, -127, 27, 342, -224, 21, 108, -294, 148, 127, 19, -273, -226, -384, -364, -163, -106, -461, -81, 268, -242, 40, 167, -80, -137, 897, -840, 78, 514, -489, 58, -70, 37, 37, 273, 72, 126, -32, -98, 122, -33, -31, -55, 29, -32, 161, -246, 18, 85, -155, -6, -9, -44, -166, -39, 90, 77, 102, -30, -35, 36, -45, -182, -41, 121, -1, 122, -247, 22, 136, 19, -183, -122, -229, 173, -138]
2809a38p3J56k81N27j75J05j58K22p2k63J08J50L1rl39j68K95m0M47K03o01L06
2831B33o8n44Q46j158L14l6MJ77Mn0J25K41j29p9QJ5J44j45nJ95J42m19J07L6
2855d2K45j26J21m0k11J08L3K6N5j26O0j55J61j2k39R6K46l56J15j28K42KJ6j78
2879h7K12r6P7j07j26L6j6O3k7M8J20j02J77k22l5J17Q3l05J70j42j17K52J2p4
2903h9L62l26J28O4j92L05l28K0J91k47K69j33L63k63l13LL36k55J6K15l10K42
2925E8Q4j48j9K54j73q8J84nk1k01K36j04rK78l84M7k6L46l94J4j80J27J87j23
2949f0R4L3Kj60K47j98J4J03k08J52r7L0N3R8j57k9J69j22OL4N4M5l4k10K14k02
2975a29Q5pJ25j13j31J36J57O3j57l84O80m68J59j08P5J32j48J81l8j35k5J24
$$ y = [-138, -211, -55, -336, 191, 16, 121, -37, 185, 113, -150, -42, 108, 139, 130, -209, -377, -82, -122, 325, 528, -73, 233, 165, -379, 467, -691, -377, -413, -409, -232, -228, -278, -153, 88, -41, -120, -112, -97, 47, -98, -103, 92, 234, -185, -78, -42, 203, 77, 198, 158, -53, 55, 88, 114, 169, 43, 103, -52, 109, 97, -142, -46, 200, -156, -41, -169, 73, 75, 91, -87, 125, 29, 106, -1, -127, -91, -107, -44, -71, -23, 97, -5, 172, -50, -85, 32, 115, -190, -20, -162, -279, -27, -15, -89, 273, -53, 75, 139, -53, 252, -76, -56, 135, -112, 157, 24, 387, 124, -189, -186, 150, -105, -89, 126, -184, 58, 142, -6, -25, 229, 56, -32, 152, 147, 126, -75, 161, 57, 48, 326, -58, -11, -37, 309, -85, -71, -251, -124, 63, -60, 34, 67, 69, -91, 156, -42, -28, 75, -133, 19, -78, -48, 5, 103, -54, -83, 86, -36, -30, 4, 58, 103, 69, -141, 73, -129, -44, -51, 74, -39, -170, -34, 123, 186, 29, -355, 325, -143, 16, -92, -17, 115, -33, 148, 110, -25, -50, 74]
2997G4k80J27k69N31k75J97k08J90N8n0M6j59n6J36J13M1m58K39l0l6J72q9j5
3020ak5J22k95K95j13r1r7O9J01N0k93L48n2j2J21k39M7J4R0j81Q8k80M34m1k30
3045a71J18J74k28j26L4k1K51qm0K5n0m2J9J26l52K37%J54O1j72J17k43J72nJ38
3070A68k60L3m1J1j8M7J53p1J5n4R4j64J00k5J3j95J62J34j09k24L39j64n5K70
3094A59k00m44M54J67k83K90k03j3Pj03L72k34j8R2L3q4m8J67o8ML2k16j05L27
3118H5l4p2P2M3j27J74k81j88L60k0j19j9P9R2o1q6K29l32K33m9n9P7m9M3n7M4
3144b2o2J68k17jJ65M1M5j33k0n5Q9k10J16J02q0K21j1J45j24j8m41L98j21K33
3168B08j72j0l0Nj47K09q7K07k91n9N37l07K79l16K3k12N36k34j49j57L61K50
$$ y = [74, -206, -79, -348, 183, -92, 105, -103, 87, 145, 95, 141, -18, -74, 62, 175, 216, -242, -3, -33, -69, 103, 14, -1, -26, 96, -199, 96, -17, -108, -205, -136, -35, 15, -278, 70, 18, 6, 127, -112, -65, -51, 39, -142, -54, -334, 100, 59, -171, -53, 121, -107, -233, -199, -220, 31, 23, -17, 8, -42, -84, -65, 61, -291, -54, -54, 100, 161, -11, 106, -137, 35, 30, 168, -92, -59, -100, -89, -107, -60, 93, 22, 37, -17, 77, -87, 13, -12, 1, -194, -32, 102, -7, -231, 108, -56, -111, 159, -41, -485, -31, 136, -147, 143, -60, -73, -66, -169, 203, -31, -49, 43, 76, -8, -56, 111, 43, 47, 79, -137, -242, 85, 51, -21, 51, 94, -33, 141, -140, -328, 32, 12, -107, -126, -47, 45, -16, -102, 127, -205, 28, -21, -80, -3, -52, -9, -66, -22, -84, 84, -133, -134, 31, 72, 117, -16, -36, -91, -2, -212, -96, 6, -74, 147, 136, 281, 157, 139, -302, 96, -25, 208, 36, 26, -4, 1, -146, 63, -24, 183, -108, -167, 370, 63, 342, 26, 49, -163, 373, 139, -10, -167, 194, 444]
3190D44k29r2N9k46O2N00l93j31o3O17p82L02j71Q65n72L2J35p82L21k07P00k34
3212A35j60l1k03L13J19M40q63R09k82l32l33O62p68O30K33m00k44J58q1k26N06
3233A82j12k98K30J20q8m11K42P19j316M56L23R6p22M28K05K10J7m57j54J7N73
3254B60L07j16j35j46l18O12l47L55j081P27L35l16o71P31l10N70m65k62K26M18
3274C74k82m49O04l30O54r63O03l01O64n17o06M42j73K28m68o2M76K59K16k28
3294A41n57N28K28q1K57k34k04k31p5P39n72l03N29L52n63O0M60l36l96L32l55
3315b81M36m50M55M51n37K35p22k26N24J60j10J09k5J77J72m51m17O81j26J63
3335B18m2j14K12j37l15K47j5k16K54q4L09k86j78M21m34J34J47l17K80j52n7
$$ y = [444, 215, 123, 182, -64, -2, 498, 105, -26, -89, 528, -254, 48, -123, 742, 170, 202, 337, -445, -124, -331, 369, 135, -25, -56, -259, 54, 173, 613, -250, 659, 377, 45, -288, 374, -394, 236, 469, 69, -175, -17, -98, -324, 182, 70, -228, 2, 122, 34, -377, -135, 584, -732, -276, 47, 143, -579, -151, 54, 264, 281, -176, -330, -313, 260, 567, 451, 316, 170, -148, 464, 117, 472, -609, 118, 453, 137, -534, 197, -113, 457, -8, -270, -44, 374, 92, -357, 247, -83, 571, -392, 211, -90, 574, 57, -549, -107, -280, -52, -520, -582, -106, 153, 369, 141, -416, 112, 340, 259, 516, 282, 78, -153, -228, 511, -61, -364, 165, 517, -46, 14, 474, 138, -258, 74, -281, 155, -295, 160, 611, 74, 309, -413, -639, -115, 45, -65, 44, 19, 196, 368, -83, -500, 181, 55, 218, 176, 62, 274, 137, -178, 69, 54, -162, 92, 8, 317, 31, -147, 274, -160, -26, 121, -196, 84, -68, -125]
3356a25K95n4p3N1r1K15j49k35j50L69q8p1J15K7j30%L25k85J7J58o0j60J61j18
3380e6K00ol07J55J35P2j06o2j03n9K87N4n9l38J82K52m13J51L94l61p5K44k16
3403c5L52l09j31J96P7L6j10j88L43m05o3K41r6J50j33L3L0m3J98k59L5j8L22
3426B23l01K92l04L21j0l59L14l38Q8J16P5m1J74k30P4k24k43N40k79J11p0M90
3448D19o3o11K37J12q2k05j4K96j08K38k01o2K81o43N57l28r22K025r85N4J33
3469A28k17j2K90L30n03K53n97J168n71L50n23O6j83L9j11j91N30L44p17K22r6
3490aJ50R1k14k92r4J83J93L24j92Pk05j0q3J38k83J88k14K92j71K6J65L7Q5j62
3514d2J3j92K20J88k39l1J50P6j05Kl2j18J06k8L41k59j03m3K56j45J58j75N2
$$ y = [-125, 170, 116, 43, 94, 3, 218, 69, -166, -316, 53, -35, -106, 9, 36, -94, -94, 231, -54, -37, 121, 61, -99, 62, -56, 144, 138, -169, -14, 121, 193, 87, 25, -78, -137, 150, 204, 145, -193, -11, 241, -172, -21, 373, 12, -63, 181, -35, 317, 8, -123, 73, 150, 186, 76, -112, 231, -174, -237, 4, -92, 58, -75, -42, -12, -55, 143, -116, -81, -99, 223, -78, 214, -90, 231, 221, -138, 176, -162, -74, 42, 117, 76, 250, 20, 94, -130, -373, 167, -112, -1, -71, 419, 356, -255, -18, 94, 12, -193, -207, 89, -19, 219, 18, -44, 237, -406, 151, -177, -1099, 926, -59, -5, 128, -89, -101, 189, 519, 16, 269, -328, 840, 269, 619, 96, 162, -21, 18, -93, -284, 246, 590, -127, 95, -1, 149, 240, 26, -266, -360, -177, 16, 340, 148, 155, -50, -60, -143, -5, -288, -100, -314, -22, -193, -167, -2, 35, 120, -42, -29, -221, -1, 187, -52, -83, 67, 143, 38, 40, 8, -110, -4, -32, 309, 50, -53, -96, 160, 15, 173, -2, 50]
3537E0k22RJ87J69j35k13m6L3J67P4j12N5o0l9P3O2K41l58j89L03K9l23L16j97
3561a26J04p5R3p0j32K47m8j4Q2l3j01K45m25k62N29N6J25j11k39N4K14j68J55
3584A00k82K67o6k44l8K12j06O7k17L19p7j16K34M1q7l6j22R6J82l38K76k08J14
3607b9k4J56l89J60M9J78J2j83L4J5J82k80J65rk2j63K22J01l31M61m04J68M5
3630A14r1L3j93j36K83J38P1l12oP33k3o90M6p69J311m23p6k15j4O19l75j2k33
3653b20L25k17j13K77p1K46k80m6L45k53k05J55J40l20N07l59j1J12j7j88J1N37
3675C55o76M26J65j95J68r03J053k76J65r61K95O19j89J48o73M44j71n17Q61k82
3695a44N29R9l99l75m5N6M54m93N82l56j87N81K03j20k63m28P98r52O85m63L19
$$ y = [50, -172, -163, 24, 193, 58, -155, -201, -168, -1, 73, -39, 16, -44, -83, -10, 52, 293, -65, -254, 49, 78, -245, 71, -126, -22, -97, -4, -74, -206, 41, -7, -21, 61, 28, -73, 172, -253, -515, 14, 70, 195, 84, -155, -101, 113, -55, 100, -182, 85, 19, -225, -263, -51, -157, -90, -307, 12, -65, -181, 53, 94, 7, -29, -151, -55, 127, -211, 65, -143, -29, -53, 103, -286, -126, -77, 101, 113, -70, -36, -21, 161, -119, 46, 37, 15, -148, 74, 175, -156, 305, -99, 69, 114, 23, 56, -137, -273, 10, 148, 219, -93, -99, 634, 611, -79, -33, -802, 509, 86, 10, -205, -219, 400, 25, 13, -220, 105, -112, -225, 52, -19, 227, -53, -99, 246, -7, -212, -57, 83, -237, 270, -89, -100, 12, -5, -193, -182, 355, -321, 105, 270, 75, 243, -660, 393, 117, 282, -679, -384, 235, 46, 194, -479, -35, -206, -723, 138, -144, 385, 484, 85, -290, -335, -279, 175, -318, 264, -92, -279, 302, 505, 385, 122, -306, 492, -460, 225, -238, 81]
3716H1l91N73k61N23j148O62M41j137l91J672m85l03j057J256N69p07l03M66m47
3735c87Q33j353J047j08j54L76r06L37M80m91L36M63j035M20O61j04L3k65j18
3754F5o84R80K51k95l15m28M93j52O84n07J3P3m61o2J70Q2J61l03J42K8L56n81
3776b90N49m72K39M9j79nl7M6K01j76lK16l64k86N03K09l40J41k63J43j84N65
3798B62l60K25l07O72k93l83l16Q70o59Q5k09J89P09q63J76N99l06J69o68P00
3818B92m31J244j068J10L4j203J860r24n29M88L86k35m12K32P0L1N66n27l97L78
3838c5K13J2q09j40J021m17M24k78k35j01P1K33j07K55k37p2rn3L10O7p5L55n81
3861a88K55J33m5n08O38m24p0L04j56K28k98l4J19K62j31n0l54Jr7L08n7l36M99
$$ y = [81, -310, 263, 2, 525, -623, 39, 480, -657, -1048, 624, 139, -164, -1221, 35, 604, -103, -406, 60, -387, 446, -907, 140, 32, -122, 254, -652, -315, 165, -326, 10, 473, -562, -142, 519, 415, 448, 183, 65, -619, 361, 612, 317, 2, -426, 67, -85, 599, 92, 105, 178, -283, -345, -175, -93, 68, -235, -93, -65, 291, -290, 259, -213, 26, 75, -104, -109, -146, -100, 101, -75, -78, 138, -226, -512, -9, 200, -140, 1, -262, -119, -303, 262, -98, 127, -180, 492, 199, -184, -500, 370, -289, -204, -413, -224, 485, -378, -202, 397, 91, 260, -408, 292, -139, 1105, 37, 147, 181, -1022, 838, -86, -615, -127, 259, 24, -388, -156, -86, -55, 511, -16, -413, -35, 178, 190, -619, -759, 262, -155, 269, -9, -244, -345, -274, -41, -148, 107, -130, -202, -211, -264, 46, 113, 38, 393, -188, 67, 200, 155, -353, 285, -139, -209, 95, -61, 167, -131, -165, -46, 216, 85, 35, -319, -318, -415, -107, -164, -500, -1]
3884ar5L0J02k44J30K99j85K91n87j24K18L24l8j09p5O6n2J50m26M42J15o0j25
3907D6l0k1o9J0L3k12K10o7L05j58K4M8j36P2j85N27m92J42r4q9J69q5J57j52
3931d7o9J45j99L87j07l91J93L46m23O96m41J30j36K18n08M11L5k04jK22l68n9
3953a70k71L35j79j78J14k99K14J233j212P76L31o76M45r00Q16K33p77O4J62j57
3973i6R13o59l7o16M69J85J1n79N30N02l59L08k13k90j63J19Qml21K49J86q0Q3
3996A46J42j45L93M5n54L5M51q57k90P01q51J85M86L26k90l79P40L05q32J014
4016G71L78j250O26m50r26M56M8N0k24J185j273P46o02L71p13Q87j86n7K09o52
4036f06K22M30O7l99L25k54K97K02j060J170m01j9k03j2J071p40p46R01k51oj70
$$ y = [-1, -96, -66, 36, -208, -78, 221, 36, 327, -260, -384, -166, 158, 120, 11, -64, 2, -50, 100, -326, 116, 231, 171, 46, 16, -5, -74, -64, -31, -243, -33, -100, 205, 47, 71, 119, -17, 55, -130, 397, -95, 47, -47, -136, 33, -52, 105, -47, -116, 29, -170, 217, 110, -281, -88, 258, -165, 531, 90, 220, 84, 302, -206, 205, 240, 36, 35, 257, -111, -170, -441, -106, -285, -463, -349, -648, -434, 799, -413, 363, 694, 18, 463, -437, 379, 612, -165, -101, 61, -96, 817, 158, 121, -495, -26, 159, 170, -409, 121, 623, 264, 572, 359, 69, -94, 25, 33, 29, -292, -43, 143, 63, 146, 288, 143, 536, 581, 27, 62, 513, -344, -634, 67, -784, -599, -113, 213, -77, -456, 284, 589, -243, 771, 1149, -101, 525, 75, -851, -395, -347, -297, -521, 664, -609, 137, -465, -94, -807, 80, -106, -163, 46, -606, -384, 46, 113, -286, 39, -215, 82, 284, -776, 394, -7, -26, -229, -241, 830, 90, -656, 245, -6, -12, -182]
4057a82J83Q65n46n85Q0J00k26M56mk59K0Nj04L43j30L11r27M84J44K27k51P0
4079G4p9L28L48o78Q00o85n88J522r92J07N01k68m75j036O54N46l5l13j29Q59
4099D61l33k59R63j051J44l09m0M04k66j20N00k86o7j16P38j155J251r43k6J62
4119c48K1K90P36l80l86J5k52O90p14l18N67K0m17L42k28j13J199m69n28J74O92
4140E93n31L9J92J13p7J20k08k87L31j39P7j87k35L27k72K9nl76P78m50K8K09
4162F9L22l57k17J41J88l2j27n2j07L69l61J32j0j2j26J39l8P8J24k99K34K86
4184C44n42L97q2J01k04k14m2K3K72mNl21q0N62k78J61J38k34j21m97Q09l59K95
4207A29L85p31o4k81Q39l12M1l22P7M73l98N31j44m08J16P3n34M06O6mj45J05
$$ y = [-182, 1, 866, 320, -265, -185, -85, -311, 145, 141, -118, -98, -93, -197, 146, 16, 327, -600, -116, 28, 255, 4, 74, -5, 323, 671, -7, 793, 108, -480, 1042, 50, 157, 658, 390, -85, -1121, -467, 79, 44, -269, -398, 461, 128, -131, 832, -219, -75, -384, -424, -20, -286, -406, 94, -192, -259, -375, 363, -792, 459, -484, -510, -348, -327, -37, 699, 319, -67, -52, -304, 386, -328, -646, -79, -59, -476, -134, -362, -475, 724, 255, -273, -99, 593, 62, 101, 293, 406, 329, 449, 241, -46, 285, 146, 223, 36, -199, 128, -144, -115, -120, -496, 282, -168, -140, 69, 391, 34, -183, -42, 146, 114, -13, -65, -172, 197, -164, -32, -42, -54, -180, -41, -79, -1, 123, -176, 58, 344, -198, 199, 117, 218, 14, -200, -242, -219, 53, 49, 54, -267, -347, 215, -63, 98, 236, 2, -119, -616, 193, -166, 129, 514, -217, -281, -562, 277, -35, 6, -316, -239, 234, -164, 367, 223, -185, -69, 4, -530, -124, -58, -62, -207, -102]
4229a02p3J89qJ35K20l58j88J70J59J50l8l29Q0j27L14j55M6r0j76M50k21Q7q1
4252E4R2j27p2m3k2J21k87L90l39L75J00k46J36j13j3r0J90j76J16J0l8rJ33j24
4276A8K87j92k28M5L5j20L65k36K9J81j77o7L5K4L4J49j9j35j03j68K16J40J9
4299A32k19J61p6lq0J69K7Q5k28%OL1LJ8m6N2j4r9K02j41k27L56J11j54J9m4l9
4326Bj81K59L4j13j14J01O9j19R9k49M05R9k03J84l34J76q0O2k74K93R3o0k32
4349h3J65k01j73M95j35o3j25n2K88j51J13p9j76K37j40L6j21M7J68l9J3J1N1
4372H6P9j83J82l22K45j23j45J48P5J2j13M1rm9P7l4j08K01j66Q6L9J08l02J28
4396d7o5J56k75K89j33O1K23l12m6K13P2j43jj32J94J76R6m82K16k29J22P8Kj38
$$ y = [-102, -175, 14, 6, 141, 361, 3, -185, -15, 144, 294, 256, -73, 7, -120, 194, 39, 85, -5, -181, 269, 48, 135, 54, 146, 19, -53, -96, -118, 3, -284, 106, -233, 142, 242, -4, 132, 19, 6, -84, 106, -70, 46, 56, 18, 9, 142, 18, 305, 113, -115, -70, -35, -155, 210, -26, 3, 184, 7, -60, -25, -1, 33, 182, 163, 28, -75, -243, -27, 113, 132, -87, 74, -2, -5, -85, 84, 111, 196, -32, -32, -26, 5, 8, 26, -20, 32, 18, -81, 121, -20, -247, 109, 220, 66, 85, 41, 2, -179, 80, 114, 1, -113, -12, 57, -62, 37, -212, 193, 292, 89, 273, -61, 115, 35, 97, -177, 116, 209, 149, -83, 82, -119, -292, 203, 68, 5, -120, -172, 116, -35, 78, -1, -177, 60, -80, -44, -165, -118, 50, 11, 24, 35, 86, 165, -18, 164, -158, 87, -36, -181, -33, 42, 54, -59, -18, -27, -76, 1, -33, -141, 60, -106, -20, 19, 127, -175, -47, -112, 44, -231, 58, -75, -14, 209, -103, -149, 64, 136, -7, -8, -140, 54, 230, 326, -156, 60, -169, -47, 31, 33, -105]
4420a05K13k35k0L3J8k7J79l3j70mN3J57M4q4J05k19n4J28o0K66r1j47j14N6J28
4445A7J84l04J35qm1R5l16J78K33j29Ql2K01m70K84q5j08Q3J76l11K78J09q8P1
4469A60n4j44J94r1N5l37K52l1N9J24l41K06j2J6N0j32O4m4p8J91l61J54l9K37
4493I8l27L15l1qp1j07Q2K1L21k13L1l79J32M13l35J06n9q5L08k67J36k41J85
4516B5K1l0Pn6J16J97l60J82J54k99J22L32n49J87j76R0j35K14k36j28M38j60
4538d4J06n1l9J3J32l66K31j61J66j70MK98k52K39l87K07L6j49l9K04N1j54J21
4561dj7l3L08k73P8m0k03K09R1j27Ok1R5j11j98L51k98K33m0j19j9P7O1J27k86
4586a53R1q3L07j22j72J94j0l2o6K9j08O0K78l65R2Q5j82K61j84L0k11M10k4m2
$$ y = [-105, 108, -127, -147, -114, -96, -123, 56, 23, -147, -151, -98, 59, 103, 19, 124, -95, -149, -21, -81, 185, 94, -53, -167, -111, 17, 201, -103, 32, 24, -17, 78, -238, -60, 173, 44, 52, 20, 221, -249, 35, -50, -158, -75, 101, -210, 68, 177, 89, 160, 106, -38, 156, 65, 120, -217, 35, 4, 63, 187, -154, 52, 40, 56, 106, -26, 38, -6, -84, 107, -254, -100, -139, 98, -229, 86, 55, 47, -24, -131, -49, -28, 293, 80, 111, -268, -136, 277, -58, 48, -11, -96, 212, -55, 81, -160, 25, 46, 16, 23, -33, 83, 280, -80, 102, 256, -43, 79, 411, -138, 49, -127, -37, -172, 42, -194, -322, 116, -44, 62, 11, -28, -15, 117, -249, -18, -179, -13, -183, -179, 119, -133, 106, -281, -74, -38, -187, -226, -22, 29, -125, -4, -21, -54, 254, -19, 59, 19, -184, 25, 116, -11, -5, -26, 69, -42, -240, 111, -187, 46, 6, -113, -132, -55, 6, 133, -153, -62, -145, 162, 40, -132, 62, 52, 20, -46, -17, -125, -65, 213, -152, -60, 25, -157, 104, -80, -50, -261, 149, 125, 83]
4610H3J25j26m8r4Q4Pj43Q9m6J06Kn1Q5k52K03k85L8L14m0k0r1J62l08J38Q7j1
4636Hj3j3j42J7J41k11L56m8k01lR0k24K3K18p8J9P5J75j55L7j0j08j65J08J20
4661A6J40j68l8K79l76J09Q2j7O8r2J88j73j31M6L50l18K6j27Q0k8J56q9N3j09
4685g3j0j67K85P1j04J6P2j29n7K4j7N3K16n7j30k28L07j49J27J57j44k8n0J18
4709A03j79J38r8R9K1Pk35K02j28m8J85j21nq4K90j55J88k43j3n3L53j23j9j15
4733c3j81K76P5k07K13k74m6R3O1o2K31l15L08r3J94j28l13L18r5n9Q9J48k84
4756h4P8J9N2j85J95J04j1l54O4J45N9p0L2Q2n7p0j22K00k5m0o3M3j68L45l6k69
4782a36J72J83J34l26J67k60N60q52L06M95o72J86o8O83J96q78J66j15k58R7K74
$$ y = [83, 208, 82, 34, -60, 24, 31, -112, -23, -69, 37, 39, -12, 73, -179, 24, -261, -223, 91, 51, 31, -60, 102, -206, -68, 19, 8, -5, -18, -160, -143, -2, -213, 143, 95, -106, -109, -19, -243, -220, -2, -80, -61, 14, 189, 34, 71, 61, -47, -212, -104, 16, 156, -12, -50, 229, -147, -38, 44, 27, 95, 3, 191, 18, -113, -67, 283, -35, -9, -136, -56, -84, 72, -17, 36, -73, -83, -250, 35, 106, 2, 18, 90, -39, -96, -72, -89, -36, 180, 123, -7, -235, 72, -77, 50, 207, 63, 35, -15, 103, -76, 62, -36, 63, 84, 91, -144, 58, -70, -118, 67, -54, -59, -143, 147, -8, 180, -63, -76, -129, 224, 101, 82, -33, -214, 62, 137, -70, 143, -131, -177, -84, -23, -85, 146, -169, 139, 46, 240, 112, -201, 117, 22, -37, 52, 200, -84, -6, 13, 65, -120, 75, 179, 168, -186, -122, 23, 82, 12, 44, 126, 69, -1, -123, 77, 52, 12, -51, -8, -176, 169, 133, -136, 36, 219, 353, 27, 194, -66, 494, -358, -52, 443, -229, -43, -111, 572, 768, -110, 56, -59, -317, -220, 54]
4803E4J72k84J35nk24k6K35j32L08k63J3K27l15K02j27m2j6J21r1R6k1K5l3p2
4827f3J20k24J36q7R6J26N9q3j68j59L90k28j3J17K53m33j9K5P3J43n2Q3j65j5
4851h8K60o6j50l6J16r3m9J39J38m2k65J29J27J51l18J72l94N59n95%N64n37P43
4874D65o88N70l27k05K13j12O6j76L00j06j08K09m6k8j40P6k60L91k18J80m5j75
4896a64k30M32J9l1o8L69k37jJ32j82P2j65K43k99K53m7K47j55o78N22L5RJ9M01
4920D96m19M45o64L70N34j085P23l62k34N40j45J96k77k16N39m04n19M67l29J70
4940a74J03O34r39M18l32L83N40o95l15j06M00M05k78J35p77Q18j96M22j81J4
4960B79K77k05n83L63L14l84Kl52L70R1j5K12n17%J24m82O76j321L12J345p36
$$ y = [54, 226, -58, 77, 72, -152, -178, 57, -75, 233, -30, -17, 210, -105, 97, -30, -72, -88, 33, -58, 38, 17, 42, 9, -63, 57, -167, -31, -118, -22, 104, 163, 80, -88, -247, 143, -85, -98, 19, 272, -161, -180, -155, -82, 61, 9, 92, -73, -88, 172, 106, -44, -80, 36, -57, -106, 33, 171, 129, -136, -7, 120, 271, -47, 125, -269, 290, -305, -305, 259, -278, 465, -223, 347, 20, -185, 28, -84, -18, -194, 106, 0, -108, 101, 55, 27, -113, -37, -297, 94, -124, 56, 11, -164, -394, 38, 57, 26, -42, 327, 90, 89, 221, 39, 111, -54, 189, -110, 143, 96, 343, 188, -490, 32, 67, 76, 95, 496, 77, 522, -142, 228, 762, -323, 400, 38, -196, 344, 199, 395, 118, -98, 441, 37, -482, -15, -344, -174, -71, 563, -376, 42, -290, 93, 633, -62, -377, -483, -83, 322, 44, 179, -598, 220, 24, 446, 265, 279, 556, 351, -232, 131, 445, 61, 63, -289, 81, 172, 157, 369, -148, -148, -24, -506, 170, -1151, -839, 506, -230]
4981b30O47j76o72O29p59L95N54k8k36j71K18j61K82k5k06k97K93N2j11L66p5
5002B89k0n25N9K66K98m88L44J40r5j15n34N99k39J71k20J29J63j60j68J96q6
5023Dk79K45L45L3m78K73%k52p4K73q6j12L20k64J47P8l33k8J93j61J67k02K02
5046A1jJ39o9n7OM1j3j96K98j42k02Q0J81j4j72P8R7k78L53J69j57n4q0p6N1K32
5072B25j32j49R1k30J24J34l51M08p8j82K15j46R0J49j06l5J28l6R4k73J29l04
5094b35J25Q6J65j75J13j52J29j38M37m53J37J46l37P5q4L01j91K14j04J5N2k38
5116a12j97L12k8o1l6OL15j17N4l66K48j63L42m8k24%l1J6K5m3lM38l2m02J72
5141F5J32L3l72M09k20k3j66N4R5j35J47j7K5Q3k48P1j86k2M40k03J44k38L25
$$ y = [-230, 417, 241, -431, 198, -561, -166, 388, 360, 124, -47, 171, 10, 292, 267, 61, -236, 57, 109, -2, 364, 289, 269, -256, -197, 69, 367, -121, 223, 363, 268, 153, -381, 218, -21, 150, -70, 59, 222, 62, -106, 90, 4, -275, -30, 315, 348, -130, 143, 143, -109, -183, 90, 4, -108, 212, -52, 95, 173, -160, -188, 5, -156, 11, -191, 11, 10, 149, 80, 23, 29, 70, 57, -139, 159, 17, -185, -105, 76, 62, -110, -32, 65, -213, 140, 309, 152, 98, 18, -58, -7, 225, 93, -56, 35, -195, -71, 63, -288, 120, 42, -140, 75, -71, 19, 168, 62, 27, 155, 119, 213, -60, 69, -235, -110, -24, 141, -34, 79, -73, 56, -82, 355, -98, 39, 185, -152, -77, -161, 140, -51, 163, 59, 74, 126, -112, -309, 3, -25, -86, -122, -116, 199, 82, 136, -230, 18, -145, 197, 149, -75, -75, -106, -90, -65, -108, -111, 327, 295, -107, 65, 197, 230, -142, 267, 47, 24, -142, -88, 7, -128, 19, 2, 27, 110, -138, -67, -253, -275, 165, -38, 106, -132, 193]
5164A93l63j0OQ5K97J56k67qk70K3K34k1j06L78j92m95N2L45O05l1n08L98o82
5187a81J56M1j34k09P46l74n39M21O0KK65J65m5j004Q4R30P00o76j104L58J44
5208a94L2J86j62PJ08k13O46l59J27O17j289L18j5K31j62pJ34P5l18P2l2j26L29
5231EP40o88J24j58O0R4k95N11k03M17n81J11l09j17M75L09p73N07R9m27L32n89
5253c56l30P83L30n17j60O17l25J06J55m15j8LOJ09J7O9j00J46pj45Q7o6k33M88
5277B44k47K21m41J73J98M8J00j94l36L98l68L91j59J48j14m5k28M19k52J75k07
5298g6J60N0J4k16qJ02j29K4J70K3j32K58k02L1k31N3J26P4j15K9o4J39J14k11
5322a7J6K25j09k99q7R2K25J50j08j9q2k1J54n6O6Ok53L7j26L74r0j25j27M14
$$ y = [193, -170, -180, -174, -89, 208, 364, 97, 89, -181, -158, 76, 55, -51, 327, 135, -360, -308, 37, 642, 611, 103, 501, -181, -25, 16, -118, -327, 419, 45, -494, -73, -13, -11, 254, 419, 374, -630, -546, 384, 1084, 408, -696, -338, -194, -162, 24, -138, -131, -23, -236, 410, 51, 178, 795, -494, -176, -191, 40, -122, -129, 5, 80, -238, -166, -198, -324, 5, 745, 57, 181, 23, 83, 177, -118, 393, 190, 607, 26, 137, -172, -289, 186, 495, -278, 229, 328, -99, 233, -356, -686, 97, 427, -90, -250, 367, 42, 148, 303, -112, -130, -127, -121, -12, 5, 74, -26, 120, 113, -32, 55, -11, -244, 244, -3, 218, -223, -50, 148, 196, 296, 102, -234, 164, -204, 187, 28, 176, 62, 17, -211, 208, -44, 131, -76, 84, 134, 148, -68, -76, 26, -103, -79, 91, 114, -18, 240, 38, 69, -162, -109, 17, 91, -24, 5, -59, 80, 194, -17, -1, 224, 115, -184, -271, -179, 46, 196, 88, 69, -13, -34, 120, 64, 130, 136, -117, -80, -206, 168, 78, -47, -174, 240]
5346B40k15J71nk26Q2m0j8J5J94k50J32JJ3o1j72Q2J16j00j09J57k1j11K08k56
5370a73J34K3j50J58j8l3J39q4q1K03j15k14L99j19o7O5j86j8K0J30J35m3l07
5393b02K84k3l91M35k09J64K9r0j57j52M87j96M4rp5M2P2K04m08l9L75k86P7N9
5417C5l2Q4k91KP1J18J97j03n1O9j83o1pK82q7J4j59m5K72j93J88mp8J77j39K97
5443C73l17p7Rj02j8MK60l01J83j95J35r7L11j50j82K32j16j78J75j51L98j52
5465D4mJ42l06J66j41l3KK83j39j24K19j93J5J07l4M0k09J59K6j01K1Q8j0J25
5489A43j04j63Q4K47k08j72K8L01K5j29J72j46m5r6J93j47j22K58j47k1N5j6L26
5512C16j99k34P3j61K39j57K28m3o2j36J73Kmr3P6k7n2J78l4j33O6j23J50J23
$$ y = [240, 25, 196, 191, -35, 47, 7, -11, 4, 198, -52, 80, 81, 94, 33, -139, -57, 59, -41, -150, 7, -14, -125, 83, -173, -39, -16, -166, -8, -26, -59, 80, -4, -85, 118, 3, -211, 188, 69, 2, 67, -119, -137, -117, 13, 148, 105, -202, 82, 59, -332, 103, -106, 58, 87, -3, -160, -312, 175, -21, 23, 14, -61, -19, 53, 257, -151, -190, 185, -101, -24, 35, 3, 87, -204, -202, -131, -13, 184, 81, 30, 99, -84, -145, -152, 130, 43, 57, -102, -147, 125, -68, 120, 116, 38, 215, 76, 373, 56, -21, -12, -114, -132, -128, 132, -169, 14, -181, -46, -143, 168, 18, -164, 68, -48, -226, -51, -202, 196, 44, 40, 182, -124, 42, -99, -132, -130, 153, 14, -110, 109, -84, -69, 38, 4, 44, -165, -6, 20, -81, -60, 28, 18, 143, 39, -124, -40, 207, -1, -173, -145, 156, 181, 52, 224, 78, 33, -63, 130, -17, -139, 119, -28, -49, 6, -10, 316, 117, -117, -44, -205, 34, -123, 105, 62, 0, -136, 37, 39, 35, -58, 18, -9, -61, 117, 83, -50, 16, -107, 43, 166]
5536A66j54J87l44q0J50Q9k2k0L6Qk03J85J7o1L11m91n9M65j00m5p9l6J62L03
5560C85l83j04j38L40j07P1j18K39l21N80n79J88n4j88q9K11l8M2J34j5j53j14
5582b11K38J40j40K4j36KK80K48M8q76M91k03l6N4r8L99p7k64L5O90n23J31q3
5605A33j15k71N66K90p98k8m5q33J306j95j8m03M39r67J296j089L21Q62K8l24
5625A55o49P71j048J124m23j88J02m0J74K20K49j569J411p17J44j48N63Q63j36
5644H58p38l46N0J91k49K75k73K8M86m78L26l50J49N20j237O67K49K55q09l84
5664h10r2P76L89j333L94R81J37k16J8m51l56L72K07kk4L34l96l99N01k73L36
5685I3j70m7L24k9K87l42j31j18Q6k12K04l00K74J65n7M9j18K36j52N1k14K07
$$ y = [166, 12, 199, -145, -225, -75, 14, -8, -28, 8, 16, -187, -2, 15, -46, 265, -226, -285, 180, 80, 35, -44, -80, 82, 385, 2, -102, -240, 100, -7, 64, -54, 185, -136, 444, -135, 53, -1, -189, -278, -67, -105, -63, 71, 56, -97, -211, 27, 167, 27, 51, -85, -83, 197, 445, 493, -383, 108, -95, -131, -77, -175, 224, 147, -117, -82, 608, 85, 216, 133, 18, -253, 313, 603, -195, -223, -268, -1101, 205, 10, -8, -411, 28, -939, 357, -732, -411, 451, 479, 155, -494, 277, -771, 353, -70, -258, -156, -196, -22, 198, 447, -1122, 289, -428, -284, -432, 131, 994, 858, 120, -226, -176, 15, -234, 41, -232, -204, 282, -196, 130, -220, -71, 449, -788, -121, 128, 383, -426, -810, -902, -126, 263, -1070, -676, 305, 442, 226, 244, -207, -563, -191, 16, 14, -10, 324, -72, -471, 30, -243, 93, -77, -124, 200, 171, 458, 116, -15, -133, -47, -259, -55, -355, -81, 84, 27, 76, -42, 194, 42, 93, -121, 86]
5707H6j38O1p6J33j69j1K40l28K21J53j17j41l1J81m9Jl5k3R4lp8Q5j17K3j0J69
5733A21j39j16M03j91n4J05m9k4K39k6k61J73j63j02K20k9j56j6N3o9rP6j49Q3
5757h0K19j19l2j97K09p4J13k17K19J58j19M9m2j69L12j74l59J70N83n65J86M
5779G5k21N00k89k03K77k29m94O57j32j23N99k66J17q4J02J9j31l6l84j12N44
5800A86l38l8K11k21l95J018o73M98N9J02m17j67J90K4L3k56N28k06j26L47p14
5821c55L75K38m05q7O45p51k37M78M61M86p01j70k89O71o6k45k85J3L70J90j23
5842B13O7Mj00l39J92j10j80M30j50J31k09l8j6M4J31l0p3J1K45k53Rk04J90L66
5866C31m65K31n3J11l3k41J10k29K88j30p5P8o4K79j67m6j28J09L69j93p1k6N3
$$ y = [86, -52, 9, -67, 66, -103, -114, 126, -202, 19, 172, 55, -86, -117, 64, 15, 16, -19, -42, 52, 49, -29, 56, -61, -38, -48, 121, -18, -134, 269, 78, 24, 129, 80, 56, 295, 269, 8, 181, 18, -84, 136, 107, -49, -65, -12, -81, -90, -14, -163, -80, 139, 20, -12, -209, 0, -74, 39, -178, 41, 199, 80, 129, 87, -82, 230, 56, -303, -133, 450, -115, 71, 75, -146, 354, 65, -138, 139, -90, -584, 73, -59, -182, 417, 151, 268, 184, 286, 305, 174, 138, -246, -358, 186, -152, -190, 21, -200, -595, 423, -250, 248, 307, 409, -8, -175, 15, 39, 72, -184, 344, 138, 12, 359, -355, 20, 258, -147, -234, 411, -340, -577, -99, 362, 848, 147, -23, -312, 359, 293, 48, -237, -224, 146, 336, 213, 280, 284, 184, -155, 37, -73, -253, 177, 27, 158, -51, -89, -105, -61, 70, 40, -33, -22, 223, -30, -21, -225, -35, 331, -134, 97, 44, 155, 122, -119, -9, -238, 50, -80, -155, -77, -141, 138, -29, -75, -203, -94, 275, 82, 11, -15, 38]
5889C8j50O3k40L99m0k80J57K33m48M01k2l69K05J84n04M60j98l6Q02m75p61M73
5911a08L2L37j71j76L1J35k96K22l5O1o3m5Mn2P0J20k4k40J22nj19N5J93J52j37
5936F3q4o8J27Q2o1n2L3o7K8L18k20k86K92j5j32j4J98N3n1k3j55J30j30O3l44
5961c15L08j12J43O9j13m9LR6J09j52Jo4J87r9j74K28L9j64j09K00j11K04j23
5984Bj6K25j49o1J30p0Q5l31Q4k6QK06O6j9k08jK15k52J58m91L29J68r0nO0J87
6010B04k82J87R7n4j71MJ42O9n4n5q1l8J18k21K57j41N1j67J09oK11p6j37o5k72
6035c71N76j56J9j58L93k36k38N6P6r0j17K30M1jK6j72K3L76l10J25j45o3L1j62
6059b47J48J29j60J06J37k53L2K00j57k61K58K03M7j23r3R0J81l91O4r0K47j00
$$ y = [38, -112, -49, -289, 110, 70, -210, -53, 180, -268, 133, 111, -258, -53, 131, -373, 87, -111, -147, 655, 180, -581, -108, -76, 261, 90, -86, -55, 80, -216, 6, -29, 32, -31, -76, -72, -124, -54, 66, 42, -198, -76, -81, -200, -145, 48, 200, 63, -21, -89, 38, 120, 59, 7, 40, -27, 1, 319, 99, -187, 105, 90, -42, -56, 142, 195, 144, 121, -34, 96, -34, 29, -315, -7, -119, 24, 93, -20, -69, -66, 30, 139, -13, -12, -76, 111, 12, -162, 66, 105, -59, -168, 32, -79, 125, 2, -14, 211, 62, 1, 131, 61, 146, -185, -101, -127, -119, 87, 153, 134, -74, -75, 140, -112, 46, -445, -116, 52, -38, -43, 17, 204, -78, 109, 206, 152, -19, -15, 127, 196, 142, 87, 6, -32, 86, -135, 122, -19, 32, -135, -26, -32, 179, 103, -34, -99, -371, 205, 49, 68, -90, 303, 67, -171, -115, -39, -129, -246, -16, 25, 24, 50, -122, -99, 277, -33, 92, -53, -116, -85, -247, -99, 30, -130, -24, 113, -140, -108, 92, -65, -326, -68, 135, 182, 59, -34, 56, 237, -154, -90, -180, 67, -33]
6081c3M7Q1j11J66l09J04j41L8L0L1J0L3Q7M4j29J5O0M2J56l52j36J21J24K36
6105B14k80j9K08k30J94j66j89K06N1r1J46Om0J41j06k61M46l64K33n6j86L38
6127A95on43L11O1k59M04m2j57Q6Q8j3r4p5J91k05l0k6K9k7J24j81l2K86j88L60
6152B57k46j65J42m2n9K87p1j45r5j25O21l73jP2q8o5J18j78K13j30J70l51J60
6175i4Q6j15J20j42L58l09J22pk6Q0O3l69K06nJ68o7j5j14J85m3l5j31Q8k18K4
6200a90K41M4k09L52j75j20P3N4j0q5O3j2q9K36k89P1J51k45LK26j39m4L9j02
6224a56m8J02J78n4J91J8m27J43L1l0J67j0m6J34J25l08M1L2p9j64L16j24L3j13
6248d8R5k33L16k2r2R8k39J5J43j24J01L9j34j61L32m3k4k04R3J94k4p7j25k6
$$ y = [-33, 14, 95, -16, 150, -159, -55, -196, -158, -128, -97, -87, -54, 33, 77, -52, -37, 23, 65, 221, -131, -267, -146, -22, 214, -66, -85, 123, -107, 87, -79, -268, -62, -11, -102, 44, 50, 10, 151, 45, -216, 230, -134, 99, 43, -143, 195, 189, -354, -43, 18, -241, 163, 121, -36, 50, 138, 125, 31, -44, 147, -58, -88, -114, -85, -112, 12, -169, -201, 85, -103, 257, 11, -154, -12, -54, -113, 174, 103, -42, -137, -262, 359, -14, -15, 57, -31, -96, 22, -156, 57, -73, 97, -254, -94, -8, -123, -3, -145, 213, -96, 26, 19, -7, 73, 136, -233, -27, -32, 136, 69, 54, -60, 125, 82, 47, -84, 4, -214, -190, 51, 95, -114, 238, 63, -57, 16, 70, 60, -25, 38, 26, -63, 173, -116, -45, 106, -139, -136, 90, -49, -93, -54, -156, -204, -102, 76, 22, 213, 231, -196, -53, -22, -52, 115, 105, 59, 193, 318, 10, 51, 83, 4, -160, 156, 32, 65, -48, 47, -186, 130, 108, 16, 114, -125, -110, 33, -91, 10, 49, -85, -246, 86, 43, 19, -185, -92, 102, 78, 1, -124, -150]
6272a50J88J66k12m1j54q2J17K87q3K8j03J38j8j90k8j24K86K56k61Q1j39n7K4
6295g1K54l84J10J31m4n5K96l92q1L34j55J14Nl2j18P8K69l45k27L16O9j20J03
6318E5R9k45M4p1K31n9j16J67J8j8J9r1R3k63K30j67K36k08K00j65R8j42LJ21
6342F9j70N9K06j94R5k03n7J84k57L00jJ27k38K14m0O3l91k28L81k72O25m71O98
6365D99r8Rk94j0N1r9o87N67L6j20r27J415l63M61m58k85K30J55K2O70r20Q03
6387F57m95m63L21k74K54n8J52j38j15J64J23k12R7J06k14J57k08K21L6j56J2
6408c3j75J09J73l09L76k4j3l14J86O4j38J69k06J29j64K68O2m3k3j12n2J00J9
6431D9J09j57L4q0J69j29o9j0K09Lj06k78J67L1j54J52j53Q7K03l8nl2J23k47
$$ y = [-150, 38, 204, -8, -49, -203, -285, -168, 119, 36, 64, -39, 99, 81, -109, -137, -261, 25, 281, 20, 101, -38, -95, -71, 183, -201, -91, 40, -4, -59, 237, -155, -236, 98, -57, 57, 62, 30, -88, -10, 259, -86, -313, 3, 72, -48, 55, 154, -91, -47, -118, 113, 54, -62, 105, 123, 105, 124, 33, 126, -137, 93, -74, 162, -46, 154, -11, 87, -55, -52, 69, -101, -42, 164, -30, 65, -138, -195, -11, -268, 32, 31, 158, -80, 134, 94, 157, -234, -462, -81, -353, 272, -199, 499, 401, 410, 116, 106, 157, 58, -629, -62, -26, -146, -1073, 342, -21, 440, -18, -303, -73, 82, 104, 774, -146, 657, 162, -301, 20, -254, 0, -58, 94, -44, -159, 5, 128, -84, 13, 119, -95, 62, -146, 75, 111, -45, -33, -208, -99, 74, -235, 141, 117, 104, -210, -24, 40, -98, 71, -135, -6, -170, 98, 160, 117, 94, -18, -70, 30, 49, 158, 1, 35, -45, 124, -5, -74, -84, 125, 128, 22, -256, -89, -58, -212, -60, -213, -126, 77, 39, 34, 2, 125, -122]
6455a22L20k12j29J90l2n2N2O0J78j74L1j8m1j09J17J18j66J59k05j3R8k2k9j60
6479a61M14o6k82M9J61K5J4j63k6J4j6J04P4l99K22R8J4J7o6J10j05Qj19N1j78
6504b06J04j03L73n3k84K55J2k58K88j6j40J89k02J99l1l00L5J81j99L52o2P7
6526B11k22P7O1J59j45k23K58l21K3K53j47O5j73J49j58J96j38r5R6J87k6j95
6548a08K13j58J2P7l7P3j40K98l48J56K51m34J41p6J32M5q9q1j99J80l5Q5j46
6571a88L41l49L08Jk72L21j3k21n2K53r6O9l6l02K47j64L84k04J8o6O5j07K50
6594A87k63L19r7k80J42l7J34j12Q5j24p4N3L00k56m87N18k1j99J62Q3l40L12
6616Erj44M76p80M49j57L9L80p18N23K03k37j28n5K29K1m8k92J73M3j7l3K03k10
$$ y = [-122, 198, -14, -143, 47, 15, -37, 15, 75, 253, 79, 110, 92, 51, -58, 59, 177, 11, 170, -35, -48, 50, 28, -1, -161, 253, 187, -95, -46, 115, 140, 154, -9, -35, -21, -37, 67, 141, -258, -36, 62, 76, 93, 27, 137, 32, 40, -79, -28, -206, -102, -205, 168, 115, -169, 86, 98, -160, 128, 112, -28, 161, -41, 158, 127, -173, -138, 43, -156, 196, 134, 211, -11, 66, 127, 286, 141, -82, 176, -145, -122, 131, -16, 49, -124, 25, -133, 63, -75, -170, -74, 113, 87, -108, 105, -53, -41, 36, -1, 72, -68, 230, -118, 38, 289, -145, -4, -80, 52, 97, 8, -73, -272, -92, -127, -42, -188, 153, -196, 112, 113, -159, 162, 149, -72, -124, 129, 33, 102, 66, -236, 11, -153, 231, 27, 45, -21, 44, -63, 187, -76, 243, 146, -134, 8, -29, 105, -7, 78, -46, -120, -67, 233, -23, -510, 8, -13, -212, -50, 33, -307, 5, -4, -148, 328, -452, -3, -160, -121, 259, -459, 64, 267, 30, -98, -153, 76, 97, 49, -243, -70, -27, -44, -77, 126, -84]
6640h4q7L77l33P7m6J24o7J04j59O6Q0L00j83j77l0J54O3l96L63l38K15j94J62
6663iM5m4N0m7j39J93Kk69L8M17k17K0j12n8K34j02J75o9j8J1P0k3L0j01k51J42
6689c2J87j66J10l42J78L5j20J17J51J07o4l23J56Kj23J96j80p2L23j08n7P8k30
6712a77M8p6J33J67l3k66K58j25L34n13K29j52K81j3k7n3K94k15ro6K1J39l65
6735a86M64k53L4n5P7JQ2k12j1j9j57M54j71m2oPj67M8J87l8r5k8J01j20R5j35
6761a45J70j25O9K21r1j26Lj40J66o8j4L23k59M4oL07l23o8K1K99j62j16Q1j54
6785i3K6k1O4O2Pn1J5k7J42k06K5K75r3o4lj96R0j01QK07m4J95l38J85J6QM8m0
6813I6j70L9j28R2M23l24J77m40L43r5L05k12j98K2J33J23k34Q3Q9j45Kj21J74
$$ y = [-84, -171, 206, -127, -50, -96, 28, -39, 65, -94, -28, 52, 352, 169, -8, -38, 116, 179, -217, 146, -192, 23, -171, -9, 36, -8, 42, -5, -144, 49, 51, -218, -180, 237, 20, 40, -72, -130, 104, 2, 177, 108, 90, 101, 171, 148, 178, 77, -174, -32, 155, -11, 99, -243, -65, -30, -150, -33, 118, 225, 161, -162, -6, -4, -127, 69, -111, -183, 140, 32, -25, 53, -177, -129, -205, -72, 95, 62, -204, 54, -71, 263, -250, -21, -173, 108, 95, 68, 15, 309, 94, 85, 19, 40, 179, -186, 278, 25, 59, 4, 81, 82, 164, -48, -59, -78, -235, 219, 48, 6, 0, 7, -160, -112, 75, 37, -58, -86, 15, -105, -10, -145, 25, -100, -31, 190, 99, -27, -24, -164, 2, -66, -80, 243, -16, 28, 22, 329, 6, -62, -41, 258, 96, -20, 61, -93, -67, -88, -24, 38, 45, -6, 9, -18, 124, -82, -57, 218, 125, 61, 58, -138, -48, -149, -141, 66, 22, 217, -121, 64, 80, 88, 136, 96, -74, -35, -163, -71, 352, 28, 205, -235, 108, 13, 318, 106, -92, -70, 63, 186, -48, 35, 124, -21, -19, -140, 34]
6836C4k5R6M7j71J38j86M2m3n6K46l86K18N2k06K77q4Q8J13k30Nq5n1L17J06l35
6861g9O6j23J99r0rJ84l77K02j32L17j49p0pJ18J32k26P3jL0j60J27l1K03l04
6885a07%J48J49j59J3k13O9R3l6J56k10J93L7j53O4jk10J83p8K1j56L10l0j37
6909e4Q6Q2k4l47K05j4J8P1k00M7L32j14M4O4Nj72J03k8l30J91J45j75OJ6j08
6934a51J12k52J66L80k53l98M49k68J78QJ05l69L9P4P33p32k24O68M78n21M1L54
6956F17m47J33q1l77L27k58n3j58O93k51j82n6K41j28M35o11j13L54n2J69l55
6977a53L6N1Rq9J16j01J40N2n3p2q5J96j84Q4M6j49M51n18K93l69K84l1K48j24
7001G8q0j67K30K19k20j07L7k12K39j94M26n7J93k24m37J71L40N5k84o75O71m44
$$ y = [34, 9, 105, 152, -19, 119, -67, -25, -68, -124, 122, -264, -46, 6, -200, 77, -7, 81, 194, -36, -31, -116, -167, 150, 256, -79, -13, -136, 63, -27, -36, 148, -229, -27, -159, 158, 9, -61, -68, 50, 182, -44, 29, 28, 58, -102, 25, -6, 197, -107, -107, 41, 190, 31, 44, -169, -100, -7, -43, 113, -97, 96, 133, -20, 44, 43, -167, 16, -62, -41, -197, 113, 83, -54, 32, 114, 90, -257, -52, -66, -48, 23, -177, -130, 202, 88, 132, 196, 201, 29, 132, 104, -226, -35, 110, -65, -59, -43, -151, -39, -291, -125, 255, 2, -396, 53, -215, -37, -29, 76, -293, -254, -180, 553, -179, -403, 265, 743, 222, 263, 617, 170, 303, 222, -155, 172, -86, -139, -297, 396, 145, -37, -93, 148, 20, 455, -156, -269, 85, 33, 202, -153, -117, -66, -57, -146, -30, -131, 9, 61, 8, -64, -149, 47, -137, -53, -7, -156, 295, -223, 70, -299, -15, -46, 202, 78, -2, -169, 61, 280, 60, -47, -10, -222, 17, -177, 249, 192, 385, 161, -276, -105, 235, 290, 6, -669, 2, -442]
7023d42Q99p9o62J52m29P02k17K69j53Q4l88L61l24J98r0L3K26l47J79J65l38
7044b01L6Q1L0p6K52r3Q9k13M8J80j10M4k3K15n11M21Q0k55O4J06j62Q0j23o7
7068a08M38l25j33K29l28j9J74n3o2R6M3R2J1M9j32j49L02k33n6M8M4P4n2j58
7092b08J65J4O9O8j79M8l7Q6P9j57mJ37j74J22L22k47k17R5O8m6o7l1K62j41j75
7117a48K11j14n5l3kJ67k84N6K53nJ01k29NJ18q5J34J01j91m3K49m10K77J47j15
7141A05j90Q3j3K20j75j71J67j19K50J18l21O4j35K1J17J69n8j09J62p5J00j96
7163A4p9j87K56M9j97K26L5j42K10k6k37Q9J04k22K95k50O5o0J26L27m44j9j33
7186b00J28J69ml6K00k00J1Lk15K78j55Kk27J51p4L1K42k21K76j26k78L53r8r2
$$ y = [-442, 457, 378, -284, -132, -561, 141, -76, 193, 40, 124, -264, 97, -227, -29, -119, -86, 140, -207, -28, 137, -201, -165, -84, -54, -130, 122, 29, 118, -95, -47, 133, 23, 67, 44, 259, -252, 169, 249, -6, 58, 164, 2, 82, -41, -108, 330, 5, -128, 101, -227, -246, -72, -125, -187, -91, -48, 44, 55, 104, -28, -177, 125, -108, -164, -116, -72, 2, -50, -208, -43, -29, 40, 108, -71, -23, -60, 26, 105, -52, -56, 81, -93, 29, 351, 104, -113, -18, 50, 4, -63, -94, 168, 27, -148, 63, -51, -106, -139, -141, 26, -258, -202, 51, 46, 147, -82, -77, 41, -44, 90, 191, 0, -43, 206, -204, 73, 220, 105, -85, -2, -15, 205, 30, -141, 26, -93, 157, 275, -46, 18, -117, -96, 21, 190, 132, 23, 185, 110, 210, 14, -65, -252, 4, 53, -144, 82, 117, -25, 185, 159, -78, 11, 115, -107, 188, -62, 3, -57, 69, 396, -48, -67, -200, -72, 97, 93, 57, 257, 57, 68, 71, -144, 134, -21, -19, -246, -95, -169, -138, 104, -117, 159, 33, -245, 108, 10, -82]
7210h2M8r7J58J82l78M2L66m07K17k24J80K25l89L65k14j28P7p2J89j7n0N4J8
7233F3K57j76j71K64k28j44L90j32O9l21j28K06n4J58o5N1r2J26m3j39O6L14l19
7256d8J26j08R1N2j60n7j38K87l67J93J51k58L04j82r8q8M45l63K98o14L56m12
7278e90O50k68J47K47l42K38k08K19J19j22k16K19p2j80J61j40k23M55K07j8l79
7299i6M6J7k77Q82p64k26Q1L45j10o3O92n04L32m71m98O52j92m89P27M8p96J485
7321H21q41j67J39L02n14L69K17k59p4P32m29q39O72N4k02p7N69j91l00r13J107
7342A76m15J87J89j49J11p2k27L33j27j5J17J73j61L37n10J26Kq3r5J01P3O0l30
7365a99K40r4r7L71R6m13L16j95j45O4J24o3k04K26k17K83m1K06l28O2o5J03K47
$$ y = [-82, -34, -131, 27, 209, -169, -127, 239, -168, 49, -175, 5, 230, -159, 206, -8, -136, -59, -131, 58, 41, -9, 45, 63, 320, 144, -27, 237, 9, -135, 255, 123, 192, -129, -257, -51, -105, 53, -12, 39, -53, 73, 30, -109, -43, 271, -48, 78, -30, 61, 113, -47, -104, -242, 45, -322, -129, 22, -236, 68, -114, -212, -300, 145, -218, 80, -534, -178, -590, 60, -208, -61, 186, -156, 82, -126, 93, 212, 90, -126, 93, 21, -159, 2, -138, -361, 94, 301, 283, -96, -50, -33, -310, 572, -192, -418, -337, 8, -102, -165, 527, 23, 355, -116, -614, 38, -154, -643, 84, 132, -664, 821, -20, -187, -48, 254, -260, 109, 326, 67, -7, 725, 296, -543, 129, 183, -19, -96, 473, 282, -18, -931, 176, -239, -52, 137, -12, 99, 27, -200, 133, 6, -9, 108, 281, 120, 457, -53, 73, 75, -8, -103, -2, 71, 131, -199, 41, -53, -150, 221, 317, -96, 220, 25, -120, -56, 68, 5, -199, 27, -190, 93, 52, 258, -70, -8, -73, 30, 277]
7388B77q7q0q8o1k27K97o1n1J36J61k31l4j35j31K40j36K86J83j77r1J82Q2p0
7411A84l64K79p8LN3Jj70l3N0k30J49K5L3j01M75l43o0J07j7K61l27K34p4L9j69
7436g3J15o3O7j10J89j6j05p0L4j04J10J79m1p9Pj46J69o5kQ9j26J24k76L46j54
7461ak29K87n8N3j51K53j85K50k76k1J26L6k26Q5J20j33L15l55l4N5J37k74J1
7484b15J76L4j82P8K74j41Or0MJ38q4P7j28k37L44m5j51L01k32J66k67L67j53
7507D0L6l06L01l19M46j35m8k26J59K7j87L5K88k9j2L0j11J70j65j83J62R9j27
7530e5J84j92J5Q9J26N5l37Q6P4j77L84k19l07K27L3j09K07j04J61k14N4r1r2
7553b02O2J38j30k0K20j28p8J04J01j74J12k6p5K97Pk72P3j57M5j35j81O56k91
$$ y = [277, 190, 110, 22, -39, -266, 31, -30, -81, 55, 216, -15, -49, -184, -315, -75, -211, 75, 258, 81, -10, 172, 254, 184, -180, 99, 21, 24, 77, 78, -92, -125, -75, -305, -156, -131, -98, -199, 276, -67, -127, -20, -37, 224, -103, 131, 57, 96, -73, 42, -21, 46, -64, 125, 109, 4, -66, -32, -136, -26, 153, 112, 33, 40, -106, 63, -2, -4, 85, -41, 83, -193, 153, -1, -230, 57, -1, 52, -99, 154, -31, 219, -57, -78, 48, 84, -142, -57, 63, -70, 245, -110, -144, -89, 48, -226, -215, -39, -5, -187, -109, 165, 24, 30, -60, -56, 82, -2, 75, -53, -290, 54, 9, -142, 159, -73, 93, -174, 193, 40, 76, -230, 71, -248, 198, 63, 15, -211, -52, -25, -212, -177, 111, 82, 70, 100, -11, 159, -6, -189, -27, 72, -55, 129, -63, -48, 41, 167, 222, -115, -29, 45, -132, 252, 33, -274, -47, -14, -123, 84, -20, 141, -73, -19, -110, -202, -140, -2, -132, -152, 68, -60, -138, -34, 67, -107, 5, -21, -96, 201, 208, -64, 9, -148, -103, -238, -419, 237, -54]
7576e4J49k19J79J52j20j79L02k17q2P1J07l19K68j6J09k05R4N3J3%j08k59L25
7599D4P2k04P9m0j88M09k88nL31l11K0j55j32K92j25j3L26m71K84K93K72k73n68
7622c51jJ39L56j97J04Ro10L46K27j017N38L82k29N76m34j28J78J34m12N98q42
7643f34P0R8k58P04p7j49J92N34o92J65K77o07P35p53j96Q63l12J83K34k75P0
7664A72k18K47l46L03q3k06K8J19J02L9l62J83J30n9j60J09n8P4j16Qr0J84K26
7687B26k31K13l72J47q7J62L8j31j88J42J29k5o6R2P0k38L1j0QP3Q7P6j47L8r5
7712e8r3K45Q1j73j62J07np2R8l7j30K25j26J70pj77J84l0l1j89J44k03L35q4
7736A2M5J55j19J60k39K86l49O7P7j15L3j65J71N2l35L14K8R7l01L1K38r3K67
$$ y = [-54, 95, -124, 55, 207, 87, -92, 210, -7, -89, -18, 89, -230, 38, 22, 131, -74, 20, 73, 86, 86, -22, -281, 44, 116, -88, -9, -49, -237, 172, -116, -121, 210, -101, -81, -236, -368, -76, -201, -214, 112, -359, -75, 218, 490, 217, -351, -352, -213, 143, -54, 50, 59, -551, -205, 22, -995, -457, -75, -304, 272, -162, -290, -112, 22, -390, 208, -634, -564, -466, -724, -20, -97, -246, -54, 480, -212, -47, 230, -377, 358, -395, -591, 272, -40, 143, 377, 102, 172, -46, 201, -145, 158, 75, -131, -103, 16, 118, 157, -205, -22, 108, 49, -111, -2, -60, 14, -102, -94, -184, 0, 226, -5, 208, -164, -17, -104, 58, 96, -35, -223, -81, 48, 23, -43, 49, 119, -119, -88, -98, -90, -17, 70, 146, -1, 37, -58, -151, 94, 175, 2, -160, -53, -58, -130, -32, -69, -199, 26, -100, 70, 63, -114, 70, 40, 9, -180, -36, -239, 96, 12, 57, 212, 93, 253, 14, 300, -49, 18, 95, -20, 13, -152, 19, 71, -264, 50, 78, 175, -126, -95, 143, 50, 317]
7759C17l19N6j99Nj05N41J0m66j42L43L9k33O29k49k79J54k39M02l98j50O09j
7781C25n12L14jl09M55K9J15L33l27M0l17k17m40K53k10Q45l86n16J111m60Q0
7802B05n60L90l96L00l47r3Q31m09L67Q2m14q57M03J74N15m38k05j84J200n76
7822a2rM76k54j94r8P18q40M76r33Q64n51K06M31l65O8J3O23o50N9K1p0J00m4
7845C5l7M1O8n8k61K45k49K52j88K37K2K40l59J3m0L52m16q9K58m6j08m0r7J05
7869a20J86j30K24l0j17q9K49j24l68L26j64J27Q6j40K28l67L35j06R2j72J41
7890F7k30M9J05p5k1L38k66j02L04q2k97oL78j43r9r5J54n6j6p4P0J33Q7j80m3
7915a00Q3O8J3j35J30j6j21K40k13j72K58pj37L53m94K63j96o9K31J9J3J03k31
$$ y = [317, -2, 54, -145, -140, -245, 296, 306, -160, -302, 41, 80, -153, 476, 227, -52, 102, -137, 265, -133, -283, 326, 325, -187, 127, 126, -183, 272, 301, 416, 749, 422, 462, 145, -72, -512, -259, -469, 376, -10, -526, 585, 125, 205, -355, 35, -361, -61, -408, -501, 330, -79, 288, 370, -44, -901, -498, -324, 191, -247, -452, -636, 564, -12, -21, 455, 201, 7, -91, 627, -213, 263, -670, 194, -357, -151, 280, -85, -17, -4, 619, -31, 28, 49, -21, 79, 35, -2, 39, 107, 49, -212, 33, -216, 36, -152, 85, 107, 347, -12, 1, -39, 313, -103, -192, 66, 20, -88, -128, -225, -120, 66, -64, 160, 130, 13, -76, 173, 49, -319, 7, -157, -30, 56, -84, 144, -223, 112, 6, 98, -74, 67, -163, -114, -9, -84, -105, 233, -33, -135, 169, 87, -210, -216, 162, 19, -80, -175, -21, -77, -93, -167, -97, 36, 123, -57, -100, -17, 51, 64, -71, 59, 43, -78, 162, -51, -223, 35, 28, -109, 244, -250, 13, -183, -252, -21, -2, 11, 114, -117]
7938a17K22j08r4M92n10K19j52k8j24N7J81pj48j06K26L0l8k12Q0j45K32J65j78
7961f3o9J50M0o1l2q7l3J78j2K20n75M51j12L4j90J49j70J30n3R4oq9J79j8j28
7986g3J65o6m0j18J10K90n17P27j10m18j55K60j00J54l5K1j25m28J12N47P41n61
8008C81o17J63J24j94n74Q03Q9k54J52r9j09N1j23J27J33n1j59L60n41M75j79
8029d2J61j46K2J95j9n7K3j99J7M6K3p1J19k41K36P9j54k42K44m25J145o87k26
8052a99O91l22N5p6l09J76j09l00M78lRj6O2k65J65k03L06j83N60m61J7l2q2j39
8076a80O6J81k26K04l1J51r9ojM7k44O2J12j61K97j48L0j74L32o1m17J39R4O9
8100C6j4l6j34l3Q8M2l1Lk46L86k8N9n5P0O6j17n6J06k51K16J30l83K80m90K0
$$ y = [-117, 105, -3, -97, 395, -115, 104, -48, -76, -200, -143, 38, 31, -117, -223, 3, 33, -5, -217, -137, -282, -50, 115, -63, -132, 18, 58, -3, -35, -122, -155, 23, 11, 231, -344, 107, -5, 29, -161, -12, -182, -52, -105, -11, -17, -106, 73, 55, -73, 92, 26, -14, -132, -22, 268, -249, 478, 368, -50, -205, 55, -45, 109, 74, 95, -30, -458, -346, 201, 942, 381, -236, -73, 51, -143, -717, 86, 175, -79, 73, -26, -135, -84, -207, -80, 53, 2, -157, 203, -338, 137, -42, 119, -27, -5, 190, 171, 114, 137, -62, -45, 1, 24, -47, 72, -169, 67, 146, -8, -250, -6, -431, 714, 27, -199, 492, 170, 225, 149, -160, 16, -93, -393, 85, 82, 91, 75, 137, -128, 37, -166, 140, -43, 517, 56, 73, 41, -41, -180, -114, 67, -159, 45, 14, 165, 66, 60, 59, 106, -138, -76, 36, -125, 172, 24, 54, -120, 212, 151, -266, -127, -33, 36, 22, -14, -148, -181, -93, -51, -82, -79, -325, 61, 33, 92, 37, 107, 173, 56, 0, 106, -145, 71, 201, -182, 98, -392, -372]
8125c72N77n70J52K79J015K32j517J31n3K52l81L53o5J21r1Ok34k3K21n1k16J95
8147c9Q4j63K22j2k13j62M11j43J21K6k62QL4K62l44J71k7o0n3L34k34k8j41L35
8171A27j71R3k83L31k16K29N2j85n2J61K79l53j6M9j1J72j38r0LJ16
$$ y = [-372, 205, -365, -213, 66, 1081, 1313, -204, -73, -126, 126, -255, 98, 33, 154, 63, 69, -165, -188, 33, -18, -234, -39, 45, -118, 104, 92, -121, -283, 128, -15, 106, 132, -130, -122, -88, 174, -170, 1, -26, -86, -139, 195, -39, -67, -208, 127, -44, 49, -234, 97, -119, 110, 162, -23, -75, 86, 365, 12, -4, 45, 34, 206, 68, -22, -19, 97]
8191I7
$$ Imaginary data points
##PAGE= N=2
##DATA TABLE= (X++(I..I)), XYDATA
0@%%%%%%%%%%%%%%%%qJ6j6J6j6J8k6L2l5M3m8N6o8P6q8J04j19J34j51J69j91K17
38A15k42K70l02L36l71M12m60N08n59O17o81P50q26R10j003J104j216J344j489
57g83J652j836K048k299K600k965L420m007M796n920P684j1040L2621o8784N6789
72A3976J5042p3969Q5506n7255n782M4467n3032M2970j919n3310O5312k6197j0573
85a4764M1632m5276J7349K5744m2236L5442j0664l8744N2356j6117k9097M0852
97A6477k9722J603K8928l4213J9154p657j9580M9715l9047m505M2689m9473L1300
110E669J7521n0501M2824j4382j4616M3458m5372R656K6312l7834K8239o051k5042
123b0119L1110j9317N363J6899l3750K6348Q293k8646K9141j0587j9496L1849
$$ y = [0, 0, 0, 0, 0, 0, 0, 0, 0, 0, 0, 0, 0, 0, 0, 0, 0, -8, 8, -8, 8, -8, 10, -16, 16, -19, 24, -24, 32, -36, 40, -48, 56, -63, 71, -80, 89, -102, 115, -127, 143, -159, 177, -194, 218, -242, 266, -293, 324, -357, 393, -433, 477, -526, 578, -638, 706, -783, 869, -967, 1081, -1218, 1382, -1583, 1837, -2170, 2626, -3294, 4390, -6650, 25971, -42813, 13976, 29018, -44951, 40555, -16700, -22482, 21985, -31047, 11923, 10004, -43306, 22006, -4191, -14764, 26868, -18408, -1059, 24685, -17551, 17891, 7227, -31517, 20839, 4722, -24375, 16477, -13245, -11642, 17286, -16927, 2227, -5430, -25010, 24705, -14342, -18847, 23842, -25631, 5669, 23190, -27311, 15513, 1131, -13485, 29973, -15399, -5743, 20569, -17265, 10974, 4923, -20119, 10991, -8326, -2963, 13936, -19814, 6534, 14827, -13819, 15322, 4735, -14761, 17088]
135A7088j5367o216J7850k3302J5548Q448k5446K2351j1026j1154K9238k4925
147f913J629J6736k6095K4088k764k4292L0359j8203k271K5445l0088J2935J0204
160A0770k1280K2727j2832j0936K2494k0309O751J0297k3525J8427N87j4028J8626
173G769j3805k539J7657j7161O677O888j7428J7132k109j2843J7570j3458L55
186e295J5799j9080R197N063j5122J7741p745q729J6320j5055N514R851j8949
199a0490J5415o05j0885J7977j2767j799J3827j5508Q214K842j4326J4683m344
212B234o419J3078j2008J947Q102j2360J0089j367r127J4291q228m188J1654j3254
226e556N158O249j2577J0441k320o650J2895j0470k84Q915j2820P438K094j0780
$$ y = [17088, 1721, -4495, 13355, -9947, 5601, 14049, -11397, 10954, -72, -11226, 18012, -6913, -5284, 11452, -14643, 9445, 6681, -17611, 12748, -5455, -7726, 17719, -12369, 566, 10770, -10510, 12217, -615, -11551, 10943, -9366, -2615, 7682, -15843, 2584, 3171, -10857, 7769, -6036, -8575, 9082, -8079, -1402, 5486, -11942, 5190, 3081, -9762, 7808, -5650, -5295, 10504, -8576, 621, 5684, -9438, 8303, 558, -8171, 8149, -6906, -1392, 8459, -10490, 4925, 4320, -6565, 11412, -1355, -3154, 10673, -4835, 3379, 6221, -8105, 6578, 2234, -4185, 8893, -3115, -1168, 6934, -5426, 4663, 3296, -5831, 8460, 232, -3956, 7698, -5556, -398, 5851, -6726, 3715, 1395, -5255, 7640, -2830, -3114, 5801, -7019, 419, 2513, -8267]
240h267J2405o667k681J1173j2418M276N658j0935R620j247o922J0801p378l67
254b949P392j0808O346J916r089J0486m213l745J0229q675J894N694j0392P937
268B023j92p418J1063o774j048Q692r965M752L455q928Q970k767n099R724p847
283a359J234O100j0078O496N27p100R310m895j852Q103q777L475L802r041P217
298C162j932n359R013o685L36O490q951M928J960p755Q141m213k939Q174p930
313c560K339M048q226O475j013n357Q037m853o22O421p680L848K143p616P489
328A873k997l842P948o114R91N337p262M880P69n845P264l839k008O840p036K980
344f1L566p428O383j074m415P159n493K88N909p310M058J932o593O319k183l182
$$ y = [-8267, 4138, -2529, -5210, 5963, -6455, -2179, 3479, -7456, 2164, 917, -6005, 4796, -2582, -2949, 4443, -6365, -19, 1897, -7192, 3294, -919, -4664, 5565, -3110, -1216, 4478, -5914, 2023, 1831, -5587, 5476, -1298, -2346, 6346, -3619, 1133, 4588, -4340, 4630, 1863, -3236, 6488, -1359, -125, 5975, -4103, 2393, 2920, -4180, 5130, 235, -1617, 6486, -2291, 1184, 4986, -4055, 3162, 1230, -4129, 4884, -1801, -1465, 5025, -3926, 1002, 2962, -4793, 3348, -865, -3804, 4370, -3560, -1221, 2827, -5399, 1076, 63, -5294, 2743, -2110, -2732, 3689, -3991, -143, 2000, -5616, 1873, -1124, -4966, 2982, -3132, -2141, 3196, -4066, 814, 1583, -4262, 3002, -837, -2845, 3995, -3041, -61, 3505, -3923, 2460, 1386, -3029, 4130, -1363, -1075, 4834, -2476, 1582, 3514, -3079, 3240, 1057, -2125]
360b125O539n712J578L627o358N247n94n302P083l408k255N192n217J666L230
375C191o273N151q84l913O007m957k80N563o500L498Q10n107N919k940k617N480
391B148n361J723L921o343M811n27m238N753l127j826M526m719K820J760m993
406c672M370q47k866N441m226j76M530m671K664N55m219M940j993j163M191n059
422b201J402M394n167L268J26m046N233k236j554L287l700K376K086n005L566
437A829o09k356M877l634o17K738l897L931l7m554L687o29j942L593l210m61K556
454A265j064J362j634j577L878l144k05K690l703N83L151l218J103q68r33L848
470A534k058r29J848l249K517Q35j914P85q33Q77J737l286J350J107l075M979
$$ y = [-2125, 4414, -1298, 280, 3907, -2451, 2796, 2202, -3100, 3983, 575, -1680, 3512, -1705, -39, 3191, -3082, 2069, 1185, -2728, 3279, -1678, -1958, 3605, -2895, 603, 1413, -3694, 2225, -715, -3332, 2148, -3213, -1490, 2431, -3912, 899, 372, -3866, 1887, -1240, -3066, 1460, -3259, -439, 1321, -3672, 698, -149, -3015, 2426, -1800, -1976, 2554, -2117, 547, 1102, -3117, 1823, -170, -1333, 2858, -2201, -799, 3595, -1572, 1696, 1822, -2224, 3009, 773, -781, 2506, -1194, 1182, 3268, -1737, 1829, 1220, -1136, 3741, 107, -510, 2228, -1669, 2262, 2225, -2329, 1358, 729, -1213, 2380, -830, -1291, 1265, 201, 1563, -71, -1648, 2230, -914, -1119, 1571, -2132, -1549, 1602, -1616, -513, -1381, -2314, 1534, -524, -1453, 395, -2854, -337, 498, -1416, -631, -1464, -587, 1150, -2136, -786, 321, -2754, 2225]
486B225q75m072K680Q73q84Q76j715J51J255j92J172j196j272K718p92J80p54
503C78j311K310J31q95R40k086q30M613j707k443K343j106M17K27k9j170o69K711
521A824N59k904K08J382j090J788m24k154Q59p43K171p60l048J814J286n12n42
538b86o19N93m94J221O08k763m36L078p94r88P71j092n59K062j46j812L98K41
556a017J400j97q66k38k40J435L30j089k37p53J585J556k477j49J146k10J070
573A049l00j419N93M70J510j229j378J372j48M93M63k081L92J421k80O28j430
590A26l83J364N0j69q47m86O79N41j49k41j156M05J559q11q14q3k77J282M23j891
610h78K95p2Q2J406j953J40N73m48J525r44j307J662j126P15N64k286J534K35
$$ y = [2225, 1350, -2722, -42, 831, -53, 823, -892, -741, 514, 322, 1494, 298, -974, 1744, 952, 1132, 378, -933, 1377, 1508, 613, 1553, -533, -1363, 3250, 1543, -900, 1443, 337, 754, 981, 952, -218, -887, 1824, 2383, -521, -313, 1069, -21, 1767, 1343, -811, 48, -695, 1476, 716, -2332, -518, 768, 256, -286, -905, -312, -806, 415, 1023, -1740, -2176, 902, 108, -880, -109, -1201, -1760, 302, 156, -1656, -1258, -1017, 383, 186, -680, -918, -1158, 277, 607, -482, -719, -1472, 113, 1669, -808, -957, 189, -21, 1049, 749, -670, -77, 393, 1903, 674, -704, 668, 520, 1013, 1476, -605, -213, 1208, 928, 1556, 126, -257, 1107, 1157, 988, 141, -345, 334, 875, 726, 485, -671, -266, 1293, 482, -332, -415, -692, 590, 1013, -878, -583, -655, -573, 833, -1120, -980, -407, -855, 670, -274, -1581, 81, -1045, -330, 234, -2052, -518, -283]
628b83k51J194k029K44J562j276R28k03j402J655j0n23N22q14K02J437j212L46
646H7J60p39J587k64j345J546j004R6J436k008Q89J83r66K214j465q68K124j838
664a75P93O50j731J378m83m54J699k194N72J367j990J266l56j232J517n30p50
681f53J363j303K22J135j518P17j02j114J588r08o05J555j671P33R67k001J641
698D6k4j500K071j539k09J790k011J270K79j725K102j005o13K313k495J004J006
715G60k046K068o49j039J726j218O8J500j839Q25Q55j677J670n18q46J870j197
732C13k92J562k067J086Q17k009J593n28q93K214k027K24J197j751J189Q7j445
749g30J900j290l83J520j887J167L27j651J680p44j025J938j576K29P16j323J376
$$ y = [-283, -534, 660, -1369, -1125, 437, -839, 89, -114, -1516, 139, 129, -394, 128, -686, -484, 953, -259, 87, 247, -492, 1095, 831, -514, 1032, 28, 124, 1560, -448, 441, 624, -342, 1872, 407, -461, 1663, -175, 618, 1268, -463, 915, 432, -22, 1677, -517, 55, 1422, -568, 698, 342, -890, 627, 97, -653, 710, -593, -371, 764, -754, -37, -139, -1253, 335, -573, -1178, 377, -1294, -561, 406, -1595, 46, 22, -1478, 593, -946, -1155, 635, -1376, -106, 173, -1552, 550, -455, -1068, 1245, -1250, -246, 760, -1286, 782, 133, -906, 820, -398, -330, 1170, -669, 156, 1011, -666, 1004, 486, -360, 1510, 313, 21, 1583, -484, 602, 1419, -590, 1003, 475, -418, 1796, -231, -7, 1190, -561, 628, 715, -730, 1170, -120, -503, 1017, -870, 297, 624, -1027, 653, -91, -1116, 822, -754, -525, 191, -1132, 244]
766B44q5j641J856r26k70J305j369M22Q27j767J224R8r91J619j304k58J493j739
784a262J290Q6j424J756p40m34J453j291K98J113j896J555l40o96J835j283j24
801a04J117j270R23K44j369J446r44m73J762j322Q3R14j429J107L0q95J192p30
819B82n46J451j622O60L64j293J202k87o57J140q69k45J092j286Q35r7j070J483
837E37o88o79J546j393M83K11j133J466o29o04J271j170J60J060j594R19L25j203
855a115J605r22k79J361j423O82N14j448J057p7q46J847j264j17J073j778J606
872D76K53j796J619l22n51J325j244J20J075j190J168o6j328J625j094k6J087
889A131j787R96L81j306J709j029l63J653j812J54J227k134J527J17j151J350
$$ y = [244, 159, -1482, 374, -552, -822, 483, -886, -464, 363, -1404, -180, -82, -1073, 546, -758, -1016, 477, -1262, 28, 114, -1310, 446, -294, -728, 725, -566, -268, 845, -1051, 504, 164, -532, 1303, 20, -104, 1013, -257, 666, 910, -459, 987, 43, -430, 1332, 10, 93, 1007, -422, 685, 715, -180, 1012, 282, -264, 1187, -435, 225, 589, -704, 498, 211, -446, 694, -175, -420, 672, -614, 221, 124, -946, 537, -151, -830, 716, -677, -194, 17, -1116, 350, -279, -883, 388, -782, -622, 438, -1156, -237, 88, -1115, 490, -432, -711, 650, -773, -91, 423, -1025, 32, -45, -891, 956, -308, -425, 648, -1130, 476, 729, -1067, 552, 230, -321, 1004, -240, -120, 955, -235, 933, 867, -461, 1164, 70, 44, 1131, -656, 340, 721, -585, 1124, 95, -268, 1385, -427, -273, 954, -1180, 347, 464, -687, 663]
905F63j118J75R06j591P38N43j445J737m82j535J833j250N31M89j669J536K45
922C06j965J892q72o07J735j476R52m1j378J929l34j352J935j577j5J864j861
939h65R39k02q64J689p13p18J691j795J120J062k286J253K01j084J724j429j97
956d74K168k566J936J11k335J618J20p68J102j519N64J351j442R61j62j994K244
973I15k95o99J071j540O79J294k416J694q99r00J932q87o46J376j617J575N2j815
991a126J615o16q56J912k077R2J479j444J566n64j344J753r68k80J879k104N39
1008e44J300j255Q45n5j606J905j103j97J550j924J158K38j493J816j052l73K300
1025A510j524L20Or67J448J0j857K174r71l18J974k373O15O34o92M81k63j369
$$ y = [663, -455, -280, 626, -965, -227, 316, -1129, 608, 126, -1409, 424, -826, -295, 194, -1475, 61, 306, -1659, 233, -639, -1246, 489, -987, -35, -76, -1454, 475, 141, -1211, 724, -853, -868, 996, -865, 74, -128, -992, 697, -16, -734, 957, -838, 282, 1344, -942, 311, 512, -572, 1152, -277, -474, 1694, -872, 1064, 1175, -1160, 458, 578, -190, 912, -607, -43, 1308, -134, 827, 665, -1329, 915, 620, -79, 992, -548, 131, 1425, -991, 703, -196, -1096, 836, -51, -697, 679, -938, 637, 689, -1126, 489, -127, -983, 929, -1148, -1056, 423, -1021, 545, -19, -1363, 390, -578, -858, 1021, -1083, -544, 756, -499, 346, 291, -1315, 590, -513, -710, 840, -1084, 74, 312, -1181, 635, -417, -790, 1510, -14, 306, 312, -655, 793, 803, -1054, 1120, 149, -169, 1805, -568, 47, 681, -11, 470, 207, -1162]
1043a162J837n47J11J034k024N68M86j097J522q86n25J873j235r8Q2p11J123J59
1061E10j112R60o39o40K283k012j83O71q94J555p44q76J270j161L20J417k527
1078a802K137o29n65J500j499O82J176j247L79L6j174J088L43j744K382j710L24
1095c23R48j511R27M07q17R93k27o28J642k185M08J194j107P31n99L59L15o73
1113a46M4J147q21M52l37j320J722M9j806J925l31m15J102j504O40J9j437J353
1131C36L4p65J212j567N87L75n92N62o78l91J589q45q08J322j476K35O49K7o7
1150b61m76o25O38K7j90P97p94J082j019n36J077n20P56j98m83O28j86l85J016
1169C48j3j452J098n27j10J182j039K97J096j88n68n31P87J78q78Q54j55m56L39
$$ y = [-1162, 675, 128, 239, 1273, -751, -183, 303, -794, 728, -158, -683, 1190, -45, -143, -61, -772, 351, 510, -602, 358, -281, -921, 1362, -650, -833, -162, -1056, 499, -245, -1121, 149, -1012, -692, 725, -1802, 335, -294, -859, 641, -858, -176, 1000, -247, 132, 168, -1006, 82, 425, -1319, 1063, -647, -323, 625, -886, 41, 448, -369, 624, 397, -231, 1411, -774, -366, 828, -279, 452, -147, 212, 527, -146, -102, 1045, 224, 676, 339, -981, 741, 790, -1016, 909, 578, 163, 1265, -239, 401, 420, -1017, 336, 370, -395, 817, -750, -163, 212, -380, 182, -496, -887, 702, -143, -951, 371, -1105, -870, -221, -194, -261, -737, -1362, -724, -697, -887, -90, -884, 198, -821, -1357, -280, -800, -44, -242, -725, -97, -283, -668, 348, 335, -1117, -19, -546, -656, 526, -513, -216, 880, 692, 124, -407, 380, 558, -320, 534, 379, -77, 262]
1188B62M2k74l8l68m53P16l54Q46k45p73R05l80j72J232j197N9O55n54m44Q07
1208B72n92P51j009L41N94p89J06J42n39Q44n12k32O79m02m5N30o76M94j49j14
1228c06K57j78m9L30n25K82L12o38O19l3m28P87n34J21K25o70L44L68n60M99j49
1249G4j69K73k98O8N33m64K84m2k67M61l42q5L57m37M47r0n51K52L7j38N94m12
1271H5P9K99q29Q30j64k64L52m89j21O27o83J75K59n79L14L4k82N71k13l15N49
1292B35n73J83r4k91M90m10J56K30j96Q1Q6m62N47qj85M63o68J73K69m88L24M
1314a34j86L72j09L2N9k88K32K92k22J67J52m26J59K67k76M87o11J53K00j00J65
1335C85j93j59L80l14j06L32l81QM65q24P53m97M46j01N84o97L7m14J58K21R0
$$ y = [262, 304, 30, -8, -376, -829, -113, -467, 379, 134, -639, 266, -114, -286, 946, -251, -192, 463, -91, -535, 272, -320, 431, -578, -237, 357, -432, -326, -184, -723, 121, -391, -623, 56, -346, -391, 139, -537, -43, -192, -306, -49, -227, -276, 54, -471, -189, 123, -515, 104, 71, -357, 430, -104, 17, 242, -428, -84, 284, -276, 223, 74, -95, 178, -120, -52, 481, 17, 301, 259, -8, 453, 111, 26, 383, -54, 393, 303, -248, 4, 41, -97, 497, 85, 164, 463, -366, 464, 300, 36, 388, -101, -222, 405, -278, -103, 156, -423, -109, -75, -357, 214, 1, -314, 235, -338, -155, -249, -540, -50, -460, -304, -74, -270, -189, -103, -565, -18, -26, -211, 252, -416, -243, 26, -462, -138, -134, -320, 52, -57, -25, 34, -254, -22, 270, 48, 215, 367, -59, 100, 367, 91, 578, -33, 120, 320, 220, 385, 192, 33, 413, 99, -7, 325, -56, -48, 417, -407, 346, -151, 295, 194, 778, 81, 118, -296, -138, 83, 173]
1356A73j77l44k03O33j25l42j42K60K93j48L2m28Q4K45r2k21L57nm36N43k59j19
1378d21K35L1J8M0j84K8K96l36N86k72n2J65j41j59N4K10r7mo2L40k46j17M39
1401C51j33l12J19J94j14K97o9r9l9Q1K47k50j76K9O4P0j39n27N43L01R7n1l16
1424A68K75O6m28j21j2l16J002n25n26P62m10L6J8n74K41M37l30P8J62m30K22
1445b05k50P78R8o32J10P5O69n82l07r10J058M71j396M35j1L41j23k72J134m82
1465ak30O50m94k02O09l17J4L57n74N33n66K37L64l10j4K01k13L4M11o32L96j80
1487G3K09q8l22J92O2K1M12n62j37L05J66o17L86l8n1M22k25l58o7N49j11k9k9
1510A63j50j27L3J23n89K27Q5j56P35o09l39L27o9M27l57k39K68L1j08J60j14
$$ y = [173, -4, -348, -551, 82, -43, -385, -527, -267, 26, -122, -90, -518, -434, -189, -281, -502, -145, -150, -586, -43, -302, -421, -186, -155, -137, -97, -281, -253, 43, -293, 293, 21, -31, 134, -7, -166, -112, 98, 1, -3, -65, 275, 29, -88, 351, 218, -94, 25, 219, 105, 402, 333, 234, 195, 276, 523, 273, 97, 126, 190, 260, 121, -406, 137, 438, 535, 484, 168, 443, 509, 81, -40, -52, -368, 634, 109, -417, 345, -65, -29, -11, -585, -344, 93, -237, -159, 3, -427, -205, -455, 323, 421, -211, -101, -26, 643, 61, -246, -1156, -98, 373, -1023, -588, -599, -258, -381, -653, 481, -1, -231, 419, -75, -277, 332, 15, 29, 386, -188, 345, -221, 16, 380, 70, 56, 257, 44, 78, 489, -143, 253, 73, 282, 194, -128, 64, 126, 147, 559, -3, -140, 165, 331, -286, 100, 62, 11, 433, 208, -150, -217, 332, 221, 192, 163, 13, -114, -81, 42, -547, -320, -235, -391, 344, -265, -604, -277, -346, 81, -276, -515, -247, -216, -324, -164, -278]
1531b78K4N49m88O23n13m27K68M02p77O98j67j60J40k90Q95n85N63o6j11o75J481
1552A106j631K62R02L3r83K20l7L20J66K2n24O01j74j66r2M6J49k08j1J80k78
1573i7L76j81j49L39m53J26j8J40k4j53n0J05k4j52J00l4K59k30j31L51l87N8
1595b29J31j17N8K07k41J3J79j60m2r7K16m2l7l8J83k90J82J15k16M19k72N5j20
1618a43O4K33l5o9j27L24j54N3j0P6J42k81J77l7k89L17OO7k1K2j57k29J88Q0
1642A97j49O5L7j58J94j02j21J10J21k76k1K88n4p8J07j36k1L6j18K07l94L56
1664I0j89P2m8j10j93L45j93K39r3O1R6k63m0L99n12J62j0j18L19j75k4K66l6
1687D5L7L8m62K63J42k63N03j14l02K28m2l28N66k36O3L2k19J39k2kJ35j17QJ48
$$ y = [-278, -254, 295, -193, 430, -83, -510, -242, 160, -617, 81, -86, -246, -106, -396, 499, -86, 477, 411, 300, -375, 1106, -525, -263, 639, 672, -311, -91, -128, 192, 358, 380, -144, 457, 283, 117, 25, 71, 220, 12, 1, 181, -97, 279, 98, -51, 288, -165, -39, -57, 83, 59, -94, -144, -39, -63, -215, -115, -149, 110, -120, -251, 100, -287, -229, -98, -215, -157, 50, -191, -178, 1, -159, -201, -298, -82, -124, -161, -199, -16, -306, -124, -9, -225, 194, -78, -23, -143, -79, 154, 119, 50, -77, 247, 93, 146, 136, 212, 354, 73, 250, 213, -76, 241, 247, 314, 293, 315, 158, -71, 117, 197, 48, 113, 150, -8, 186, 84, -37, 73, 194, -82, -103, 185, 131, 53, 160, 24, 3, 39, -79, 128, -266, 90, -99, -27, -75, -185, -378, -33, -226, 13, -80, -19, 77, -186, -226, 173, -339, -177, -187, -305, 14, -161, -185, 81, 45, 82, 120, -342, -79, 63, -200, 303, 189, -113, 115, 73, -255, 311, 75, 138, 170, -49, 90, 68, 66, 201, 84, 92, 240]
1711B40l9n8j60M2K92k7k03M2l21K52K09k03J8n8j47K24p4k95K51J91j69O7Rn4
1735B9J3L8J6j93rP5k15J46k0o0K07o6k66N18n22L8K99k15K55j59j73J38j24K09
1759d1M0j14M47l88l7J33k22J7R4m7N6k6j1M0J39J0M7J1J43k05J68l65K33R8r3
1784A27k22qm5N8M41l06pJ18k17k8K52k81M79k68k17L96n0r7j30J90l55L42j99
1807b7M6J55j97j64J54K4Jj03j48L87q5k09n4L1p3J90l69L77o5J4L54k98k1n1
1831a31q2M51k61k83M12l36O4L95k39K08k51k72N59n37K07K03K7k43L8j2j55L64
1853A26j11L05q32Q87k08K2J13m50J76L08k82J93K38o17R2M80l94K56N7k37l90
1874b68J86J28N15r25R00p16J85L47k49j83O49r18L18K79m02M48m71K63l25m1
$$ y = [240, 201, 143, -17, 25, 317, 290, 87, 129, -192, 60, 269, 66, 84, 26, -121, 103, 29, -266, -15, 176, 7, 74, 83, 29, 42, 80, 96, -97, -106, -31, -246, -100, -120, -180, 27, -39, -305, 213, -309, -271, 28, -187, 68, -91, -264, -126, -250, -41, -1, -115, 332, -56, -93, 40, -182, -165, -71, -118, -62, -88, -99, -59, 80, 90, 137, 148, 291, 86, 254, -111, 122, 220, 127, -95, -103, -148, -90, 351, 45, 38, 156, -61, -89, 163, -118, 361, 93, -124, 272, 222, 125, -5, 185, -170, 172, -27, 19, 174, -23, -187, -33, -9, -8, -111, -259, 128, 43, -166, -220, -189, -262, -72, -441, -64, -129, -115, 239, -59, -80, -131, -213, 238, -23, -306, 106, -230, -166, 229, -10, 198, -53, -325, 234, -303, -96, 107, 134, -109, -71, -83, -238, 126, 15, 320, -512, 375, 167, 189, 302, -148, 28, 336, 54, 247, 485, -132, -40, 440, 46, 302, 359, 122, -268, -82, 46, 561, -364, 536, -180, 5, 352, 103, -80, 569, -349, -31, 248, -154, 294, -177, 86, -239, -280]
1894b80O00q00k95J64N97n73R13o06L3L9K11L9O57j278J332p09L22o30J285m97
1914E24q1p37M94n60L18Q60j719M84K20J135j128p2M50N6n1K5J39k83l14K36o07
1935f11R44l69k58M01k80J79J65j88n04O64j06l80R77n12K53oo57N29j27k59O44
1956D99o73J57K1l33M14k29J05R1J2j03J52m78M04Qn04N50m13J77J24m04J73L35
1978H5j74k9J50k95J83l05K15L10m61L02j66J23L98l68KJ91j52l7j9j71L15J9
2000A16j55J94j42o8L61m13N21k09k94K32j10K4J46j28j08K68k81J86j95l7K73
2021A81j31J36j98K30m26M08l32K35L92m36K23k81j27K35j4J74n66M27J03k85
2041e2K31m48l14O96l71L47J98q97lJ54O42j38m78p27Q00J91o4m05P2L76M8j05
$$ y = [-280, 320, -480, -775, -611, -14, -587, 326, -280, -247, -208, 3, 42, 699, -579, 753, 44, 366, -264, 1021, 524, 443, -294, 200, -360, -42, 818, -901, -417, -197, 938, -190, -262, 188, 244, 193, 218, 357, 74, -240, -4, -611, 333, -36, -294, 107, -173, 6, 171, -17, -521, 143, 37, -343, 634, 122, 375, 369, -288, 241, 114, -145, 499, -174, -17, 4, -329, 85, -144, -39, 52, 64, -39, 113, -365, 39, 47, -457, 93, -320, -143, -19, -423, -250, 85, -89, -118, 32, -263, -80, -385, -170, 140, -321, -19, -185, -62, 336, -32, -30, 161, 9, -28, -47, -218, 97, 116, -39, 155, 13, -55, 306, -107, 414, 205, -89, 143, 33, 57, 203, 75, -33, 235, -46, 140, -55, -92, 181, 50, 186, -12, 218, -208, 200, -132, 103, 495, 59, 282, 1, -126, 109, 95, 269, -297, 130, 233, -52, 179, -269, -583, 113, -258, 89, 287, -610, -613, -459, 183, 45, -433, -1160, -360, -169, -233, -638, -566, -190, -142, -247]
2063b47O87o03k11L02K69m05M47k66j52R8L3p7R0J37J31j40j84J00k41J60K11
2084A39K2j88nJ26oo4p6J25k2r1L26k62Q7P6l79L98J12j05kj4k11J56j90o3J47
2109C6J7j14m8K21k10k8J14J77j38p0n4j32K08j25K8P7k13K62P1k54J65J24l52
2132b38J90L0P0k6j09L49k00k1m6P5k05J66l4L4m3r1L44k00Q8k57K76j67O2j16
2156f9L1J76j20N5k9K9R5j2o9K53m63Q4J12j88K01j0l16K53L2P1J32j34n4k06
2180a46k92M46m51Q63j11p50L90N4n9r4l1J72l7j31j42M52r3k18K37p3j57J94
2202B3l41P81p95p1Q28j067P29l61O7j58Q28j31L5m84J79L56o58M69p37Q18o29
2223c19k36Q17p6j99k32O59p2j40N52p29j24k98R29l08m54N80n72J7K96m99M58
$$ y = [-247, 440, -163, -374, -72, 197, -208, 239, -27, -179, -81, -48, -125, -35, 102, 233, 93, -91, 9, -232, -72, 139, 161, -27, -32, 94, 88, 24, -52, 73, 51, -40, 286, 24, 111, 187, -192, 206, 318, 213, 211, 197, -14, 142, -48, -111, 36, 53, -61, -109, 112, -98, -126, -12, 165, 27, -43, -97, -229, -21, -146, -118, -41, -254, 8, 79, -175, -10, 114, -238, -48, -18, 52, 26, -83, 266, 66, 45, -1, 74, -131, 35, 1, 35, -8, -99, 245, 45, 133, -124, 152, -15, 47, -69, -38, 138, 18, 73, 44, 73, 168, 156, 87, 340, -123, -39, 73, -115, 86, 76, -240, 13, 45, 116, 248, 114, 60, -146, -438, 8, -443, 420, 309, -441, -51, 3, -56, -150, -181, -9, -46, -177, -319, 133, 40, -178, 59, -14, -171, 23, -318, 463, -332, -403, 425, -642, 87, -274, -207, -365, 463, 332, 367, -117, 62, 418, -240, 229, -508, 310, -319, -555, 262, 186, -13, -245, 414, 342, 202, 754, 25, -99, -397, 532, 224, -230, 350, -222, -205, 91, -408, 50]
2244E0J50K57K9n01j66l36N12L55k18j4k30p05Q49L58k15m24J37j29N89M05k03
2265E50j014P28j8j135J436n59k65J41K40P6J71n00K74o68R13q79L22j92N07K58
2285C86m74N36n92J21L00k33K7N63o46J09k2k02K66K9j10M33m69j85L04K10k47
2306A04q7J84l96K78J28j42K21k21J55k72j5K10k71L16l29M70n37N4M11j96O1
2327A26q5j28k4j23K75k43J70J27j59J58m0k98M20l56r9J79L08k74R8J46l01M64
2349C41l56J65j83%j53L51j23N1R3l47L08j01k62J50k72K56K9o1J68Rj00L4R6
2372I3p3o3n2k3K20p1j39K8j12J52o6K45r9m9j8l1J78m3o6J78j17J14k44J47j11
2397b2L31qj97j31J25j78J46P6l84J95K01j90r9o4K76J58l54M0n5n4K46k74J46
$$ y = [50, 200, 457, 486, -15, -181, -517, -5, 350, 132, 118, -112, -817, 32, 390, 175, -249, -112, -241, 348, 753, 550, -464, 264, 246, -889, 547, -12, -277, -136, 104, 180, 351, -149, 125, -543, 370, -509, -187, -379, 128, 386, -88, 448, -144, -23, 277, 44, 71, 634, -12, 97, 75, -127, 139, 168, 58, 491, 22, -163, 141, 351, 104, 17, 201, -195, 83, 211, 69, 290, 69, 224, -48, -63, 147, -124, 192, -137, 333, -204, -150, 261, 65, 126, 41, -87, -111, -234, 41, -202, -32, 95, -64, 94, 54, -244, 176, -180, -279, -100, 208, -66, 32, 178, -123, 341, -15, 150, -33, -33, -186, 165, 42, 93, 186, -161, 147, 46, -216, -66, -338, -82, -53, -114, 54, 63, -37, -3, 93, 20, -43, -95, -118, 102, 31, -108, -80, -192, -40, -106, 139, 40, -9, -27, -58, 120, 77, 11, 189, 72, 186, -58, 89, -22, 309, 301, 104, -27, 98, -80, 66, 142, -242, -47, 154, -36, -135, -199, 77, 235, -119, -79, -134, -188, 58, -216, -70]
2420g0j45L32j59p2R3l6J4l3q4k19K79k53K33j00L47k51j73N73n26M49j1j15k00
2443a27N48p26R6k82N56m93R7L53K92n28K06L70n08j16L65p61J197l21j51l64
2463b97R3O41q49k44N36N57o57J78l58N57k47K45j11O7k11J17j0k04r5L94J62
2484B64Qm23j1j85J3K60j00N9Kk1R4J22n6J38j43j09m1q2p5L64m5o7q3J67j39
2509h9Q6J8j25K00j67r2M09l73K35k97K20R3n4k81K82Pj76J12j78N10m83L25j85
2532ck7pJ15j00L29k95J52Q4q8k49K26l84K48r2J06j09J40j16J56O7n6j76J90
2555A11q4J64j91J18p5j60K71lj19O1N6j72p9P2J49j80QR4q6O7kl20L49j06L2
2580b5L9m6j72L61K9m48K52j15lp8P4J84k7R3j43J79l25k8J15PJ50P3j48K28j66
$$ y = [-70, -215, 117, -42, -114, -21, -57, -43, -76, -160, -379, -100, -353, -120, -220, 127, -124, -297, 276, -250, 199, 188, 73, -127, 421, -305, -209, -491, 65, -428, -331, 22, 314, -214, -8, 362, -146, -262, 103, -658, 539, 218, 67, -297, -204, 437, -412, -656, -120, 437, -220, -42, -400, 157, -90, 155, 44, 111, -100, 17, 7, -197, -292, 102, 264, 272, -151, -162, -347, -334, -74, -174, -115, -113, -134, -40, 82, 26, 164, 21, -88, -129, -211, -286, 78, 33, -34, -117, 50, -89, -3, 15, -110, 90, -77, -169, 240, -133, 102, -195, 25, 118, 64, -217, 65, 72, -104, 8, -170, 340, -143, 182, -3, -30, -37, 78, -22, 307, 12, 164, 248, 160, -89, 137, -247, 1, -91, 15, -94, 46, -70, 86, 153, 97, -79, 111, 27, 191, 0, 118, 43, -117, 154, 151, 32, 93, 149, -23, -102, -30, 119, -61, -53, 41, -45, 22, 20, -300, 49, -57, -25, 14, -32, -204, 157, 186, -262, -10, -125, -128, -206, -132, 52, 25, 118, -25, 154, -171, -199, -84, -77, 73, 146, -2, 226, 60]
2605F0j2j88L52k15J75O7J39m34J11K25o35M33j18J9J16l26J83j57L10m18l07
2626f20P55L65j31m08j38L68o9k92K54j49J29p9J60r2O1n23K22J86J4Kk34n9K71
2649gR4j07o7J62j31N3r3p7K70j99J32k84R9J90p3L0J30p9k09J52k4o9M35n24
2673a96J12J45n4J72k53K97k34K5K5J49j45j28O6N3Q0J59k59k5j19N7J8j86J73
2696f8K17nM2j28M8j73P9J19j55j11L21L8l49K64k26P0q5K42j27J42l73J70NK14
2720A71N9j89%k71K17M0Q9n5N7j72M1k7J63k01k07P3K50N5k86J09N8n7l11K09
2744a85K57k8m62N63m98K79R3J40j55Q7k96l19Q9L16N23n88O13r56P53q9n6N37
2766F18r17O37n99M81n75N16j78r0L12m47L55j13k00L68l69K71j76J49j30M11
$$ y = [60, 48, -140, 212, -3, 172, 239, 378, -56, 55, 280, -355, 78, -40, -21, 95, -231, -48, -205, 105, -313, -620, 135, 500, 369, -39, -177, 191, 122, -170, 84, -65, 64, -15, 145, 53, 114, -409, -187, -1, 13, 15, -219, -278, -7, 87, -20, -87, 75, -56, -3, -96, -173, 97, -102, 30, -254, -155, 35, -38, -8, 122, 43, -166, -14, -38, -107, 328, -196, -84, 61, 7, 179, -74, 223, -11, 14, 39, 188, 43, -85, -19, 34, 114, 273, 14, -11, -130, -73, -55, -241, -68, 149, 144, 186, 58, 106, -67, 12, 131, -24, -135, 186, 224, -125, 139, -87, -17, -102, 140, 13, 155, -218, -48, -43, 171, 230, 41, 41, -230, -13, 27, 116, 61, 118, -54, -13, -40, 123, -78, -285, -212, 38, 93, -193, -84, -26, -83, -394, -185, 72, 44, -418, 145, -353, -74, 19, 159, 4, 91, -205, -524, -435, -119, 404, -184, 429, -527, 226, 137, 81, 618, -299, 338, -261, 220, -355, 161, -17, -107, 205, -242, 113, 0, -200, 168, -201, 70, -106, 43, -87, 324]
2786C24l36K52l82J36QK11l16j34J25J42j25r3P8J55ppJ92o7k33r3oL0M3K30j65
2811c8O0J11k98K63j48J68k18p7k03O10k46j72N53n46j68M28J6j45m1l9r4n02
2833g26P94q44N39l28P07k16J56j09K3K57j42j43K02N5j03j15j50K76m55J90K8
2854a04q4J09J39l07M02l10R9M3j30N6Oj13J72j60J40k4J12o1J84N5k16J38k71
2877a25K6O6pm4J64k18K36k23r2K2J85k79K56K55j72k9j9j25J1K33j15M3r7J61
2901A13k7r5L6M9J3j58J51M3l22K46N2j1k64K76P3j49k06N3P9R8Q8k67J91p0j27
2926a35P4R0J15j60J40j30k7J39p9M7k08j09J84M0J57k61j0K47l71J94L26j28
2948A35j5N8j57j05Q1qQ0k94M06j05k03J23O9k09QR7J15j69J31J5J6J37k70N9
$$ y = [324, -12, 240, -142, -6, 2, 213, -103, -237, -112, 30, -95, -188, -110, 45, 38, 31, 223, 156, -77, -170, -176, -146, -103, 127, -38, 22, 133, -165, 98, -50, 118, -100, -177, -380, 230, -16, -188, 365, -181, -349, 79, 95, -50, -91, -130, -224, -726, 68, -776, -237, -565, 142, -74, 82, -27, -4, 253, 111, -32, 170, 225, 122, 7, -143, 133, -322, -132, -104, -188, -79, 60, -247, 155, -155, -56, -13, -143, -87, -81, -194, -22, -182, -42, -66, 46, -15, 169, 224, 8, 146, -125, -99, -33, -40, -84, 80, -138, 98, -125, -217, -195, -10, -289, -33, 222, 50, 21, 2, -123, -112, 121, 6, 49, -48, 113, 86, -9, 27, 76, 89, -69, 82, 125, -197, 49, 101, 90, -174, 102, 175, 26, -180, -127, -48, 50, 138, -129, 62, -8, -135, -61, 29, 144, -16, 124, -6, -33, 106, 27, 74, -134, -243, -59, -19, 138, -123, -133, 114, -257, -63, 263, 135, 120, 178, 21, -84, -3, -11, 69, -225, 181, 76, -127, -4, 65, -144, -136, -39, 76, -93, 38, 53, 69, 206, -64, -5]
2972ej2j2j8K6J65k0nj35J10r2N5p9j23J73k36K32Mn1k19L00k1k9J51l69Q4J20
2998fK14k62m0K9k2K6J72l05L37m3j79m8J7N5m2R2O%n7oK6k09K35Q6Mj22J25l8
3026D5j31J01M8J06r9j64R8l4m9r0L75j89j53J22oj15J67p2q1L48k99qN5o3R1
3051CJ74j90Q6j07l4P3J87k63J83j22q9Q1J9j16J32k54J88L9K20j43K98m30O6
3074Al3K53k05K71J23o21J11n5K39k58J99L9M0k35K21m6l8J3k14K53r7j76l8L48
3098I5j8k61J13J51o0L4Op3M5J35k02m7r8OL01pk69N9J47P5l22K40j56R4J76k67
3124a03J20R9j23L3k48J74k23M19j17k4k4j3N3N8m3J02J4p4j56q3L11j21K53k98
3148a4j00L06j82J62k75K46o5J08k62J07Q0nJ50l5k49j30L81k42k40J00K68j88
$$ y = [-5, -17, -29, -47, -21, 144, 124, 119, -16, 94, 2, 57, -22, -145, 28, -208, 24, 28, -23, -242, 58, 37, 8, 159, -210, -126, -6, 208, -54, -94, -65, -87, -61, 111, -194, 143, 100, -79, -127, -110, -55, -97, -5, 1, 1, -56, -62, -36, -245, -10, 76, 80, -42, 83, 45, -86, 15, 63, 169, 70, -94, 4, -30, -79, -169, 206, 17, -136, -14, -20, -135, 32, -40, -121, 227, -72, -80, -25, -88, 3, 177, -13, 73, -34, -68, 5, 192, -71, 112, -10, -99, -18, 1, -115, 17, -237, -49, -10, 210, 67, 365, -65, 1, -32, 221, 16, 287, 410, -211, -100, -155, 84, -174, 25, 64, 104, -131, 90, 44, 6, 19, -195, 58, -39, -215, -253, 95, 77, -184, -71, 80, 20, 54, 60, -13, 32, 167, -35, -82, -180, -174, 127, 120, -149, -90, 57, 132, -190, 50, -106, -12, 164, -103, 17, 116, -7, 26, -222, -48, -271, 148, 31, 7, -17, -30, 23, 81, 38, 140, 154, 80, -76, -159, 152, 31, 284, -14, -114, 192, 10, 172, -103, 143, 78, 186, -76, 31, 111, 106, 256, 221, -28, -158, 223, -19, -259, -159, 109, -79]
3170g9mj21q4N72m51M97n51L93r0Q7l63J95k7N3R5M5R3k76j68Q1M4j69N48l20
3194@j5l9L62m1j29L49n05PJ21m99N97m77K51L11j35P8k5l42n8J20O4K51m48K70
3218F8j5r1M22j63j68K50K96l35k39O2J65k01q2R30j352O03r5k37K93k36k2m15
3240e62R71n61K93K98m44k82k16O61j00n49J059J13l29r00P37o88J098o74k56
3259c31L59k01l1O01j14k97O33n68k76J65O9j17m42L73O58o97j0J073j008k0K65
3280H4L20o85N40k09j63N77j58J62j269O35O46j231L0P6Q93p5K31j26p24M76j38
3301a08l15J153m32N4n90O40p72K81M62j36k12J08M0l02M85k16l83N84m85K30
3321H6J90j35J14l76k31J9Q41l24o87Q40p23L51n93M53K08o8L6k69J11J07K93
$$ y = [-79, -83, -204, -288, 284, -167, 330, -221, 172, 82, 169, -194, 1, -26, 27, 122, 167, 260, -16, -184, -103, -59, -228, 320, 0, -15, -54, 308, 267, 138, 487, -18, -11, 110, -389, 208, -269, -18, 293, 158, 236, 211, -131, -189, -69, -5, 246, -202, 68, 53, -38, 384, 221, 53, 303, 599, 264, 25, 87, 252, 51, -31, 899, -453, 150, 55, -182, 111, -125, -147, -562, 409, -152, 141, 439, -5, -287, -503, 158, 58, -491, 568, 681, 352, -548, 189, -499, 599, -75, -331, 28, -173, -204, 397, 283, -14, 619, 51, -225, -60, 9, -108, -550, -177, 481, -216, -226, 847, -161, -181, 84, 404, -281, 259, 50, -113, 464, 306, 468, -801, -166, 480, -751, -721, -645, 248, 173, 404, 278, -446, 30, -108, -423, 730, 298, 352, -238, 402, -370, -89, 373, 237, 25, 133, 173, -129, 356, 140, -243, 341, -144, 86, 276, 141, 255, -121, -352, -333, 508, 184, -503, 337, -386, -35, -628, -175, 33, -35, 1, -268, -157, -50, 243]
3342B43p33L63K37j30m29L09l96K09K35L5J79k95K79j7K02k69L71l33L6J17l46
3363a33Q5n9L10k79J96n1k9K7L34j43j19M1n24L81k17K57J18j09l61M7kK04K05
3386A79k82j62M34L1o2p3r1k17K14J3l6J5Q0j6qJ61j92K11m41J29R4J33R1j85
3410B0k50K36L0N8r0k5k30L44j14j38j25K44k8j25JK33n2j66L02K3o7j88J50N9
3434A02J10J9j31j22k49M49Pk60J68J35j76j94J79N1J85K0J03m82l01K68K79k
3456A58J28q0J15n09M21J14n10P97m16q87M48L71J6m61J98LNM0l4n32K15L03J88
3479I1P28l22j095P18Q96p70q7o27K33Q8M88o23j3M30j56k69J63j3j90L55k8R5
3501I2j41n4J63r0Ql2j07L44r6K01l46J5J77j48J9j81K05l6M2K04k10J03k81Q6
$$ y = [243, -490, -127, 110, -20, -449, -140, -536, -327, -92, -57, 122, -173, 106, 89, 291, 22, 393, 60, 96, 213, -133, -48, -107, 203, -76, 120, 69, 40, 67, 401, 258, 139, 180, -344, 37, -180, 77, 195, 86, -275, -228, -230, -26, 179, -103, -265, 169, 200, 138, 65, -26, -243, -29, -16, -52, -37, 43, 27, 19, 180, -12, 199, -242, -113, -19, 114, 205, 20, -230, 6, 36, 94, 4, -21, -251, 93, -21, -159, -284, -40, -68, -193, -192, 41, -11, -177, 125, 148, 81, -107, 43, 102, 212, 231, 100, -22, -271, 178, 185, -75, 93, 228, 52, -142, 37, 88, 273, 293, 396, -86, -387, -119, 160, 158, 286, 206, 321, -188, 233, 347, -163, 634, 218, -669, -221, 150, 166, -295, -97, -94, -89, -49, -83, -615, -400, -97, 91, 819, 497, -598, 120, 1016, 246, 159, -468, -235, -147, 341, -282, -295, 135, -21, -290, -127, -140, -330, 25, -3, 92, -49, -103, 60, -30, -22, -54, -161, 183, 87, 288, -58, -43, 134, -14, 5, -176, 29, -7, 35, 239, 29, 132, -149, -63]
3525f3P7p6J04Jn8K69l9j84J03k20j84M73j65Mm9j43K08o5j41J55J6j15J23j5
3549A6l5QJ07j22p8j8J38j10N2K19l02L9L04m46O8K59M1j25Q7P0j83R0j44Q9N9
3574H3n6k06L12q4k3k4p2Q2M6J5m2j41j66K11k0P5M9m9kK42m81J65P5q9J24J57
3600A81k59J91j04j50J73l9j51J68l76L12n1J77R5j35p1qo1K60j63l6O8j99K30
3623E2N6J75k98j36J43j1j65L90j72j19R3Q3J66k64n1j86J07P70M1p88m67J310
3645G29j152M27J70M03n78r05O07j55J78J76Oq5Q8J2r1K70r3J05p6L5k0o9K2J53
3669A57l71O58q62M50kl27P8M11Lm5K52m67n2j59N06m65M0Q45O0j601J178k06
3691H1J13K07m94k36L57m42J463j695J133n97n22Q37j58k71J89%K65j22o27L92
$$ y = [-63, 14, -62, 42, 43, -15, 254, 215, 31, 134, -86, -270, 203, 38, 42, -7, -150, 58, -7, -148, 7, 23, -92, 31, 16, -19, -11, 96, -26, -104, -122, 16, -94, -42, 177, -125, -86, 218, -228, -160, 99, 140, 15, 102, 172, -11, 79, -65, 24, 83, 27, -179, 133, 49, 26, 2, -70, 12, 58, 73, 31, -110, -276, -65, -85, -10, 39, -10, -12, 230, -251, -86, -11, -100, 24, 181, -78, 113, 9, -141, 32, -7, -158, 10, -366, -54, -105, 72, 167, 32, -39, -47, -108, 152, -11, -47, 21, -178, 52, 108, 283, -15, -151, -8, -19, -184, 206, 34, -85, 8, 91, 257, -7, -58, -244, -137, 633, 674, -114, -581, 729, -423, 4, 174, 577, -1, -906, -299, -454, -276, -100, -94, -179, -91, -79, -170, 100, 7, 112, 36, 71, 51, -18, 4, 157, -214, 444, -418, 32, 30, -297, -219, 192, 195, 150, 402, -65, -117, -276, 230, -235, -195, 650, 710, -891, 287, 81, 194, 401, -93, -329, 28, -414, 1049, -646, 487, -110, -632, 205, 47, -224, -35, -35, 230, 108, -519, -127]
3711a27M53K72K59o54q35K63N39K68k56j50J28kk37J66j202J159j37k80J42P30
3731D99m87j3J81l08l65K51m08O91n43P45j15j12N07o00J87k81J38J118q29PQ08
3752A071r05J62j027R23j69q10Q92m32J70L31r9o72P04j52O3k27k1J90J6P36n12
3773B32m52K68J04l78J30L42k14J3LK55m07P7l34R7P51m64l08J06J44K33k82K99
$$ y = [-127, 326, 598, 857, 203, -632, -369, 170, 438, 182, 32, 160, 158, -79, 87, -1115, 44, -93, -373, -231, 499, 12, -1, 180, -128, -493, -242, -650, 41, -502, 243, 128, 16, 523, -77, 110, -171, -33, 1085, 256, 263, 1071, 166, 328, -699, 224, 55, -755, 137, -295, -125, 206, 107, -565, 139, -13, 50, -177, -198, -8, 8, 744, 232, -220, 48, 152, -226, -96, 246, 32, 45, 48, 303, -104, -27, -361, -264, 487, 23, -285, -179, -35, 198, -84, 215]
$$ [...]
8191H4
##END NTUPLES=NMR FID
##END=
