##TITLE=1H_SR32_oiR
 CDCl3, 8 sc, 
 1.02.2021
##JCAMPDX= 6.0         $$ Bruker NMR JCAMP-DX V2.0
##DATA TYPE= NMR FID
##DATA CLASS= NTUPLES
##ORIGIN= UXNMR, Bruker Analytische Messtechnik GmbH
##OWNER= root
$$ XWIN-NMR		Version 3.5
$$ Mon Feb  1 11:07:25 2021 Russian Standard Time (UT+4h)  she@DPX200
##.OBSERVE FREQUENCY= 200.1315066352
##.OBSERVE NUCLEUS= ^1H
##.DELAY= (6, 6)
##.ACQUISITION MODE= SIMULTANEOUS
##.ACQUISITION SCHEME= undefined
##.AVERAGES= 8
##.DIGITISER RES= 18
##SPECTROMETER/DATA SYSTEM= spect
##.PULSE SEQUENCE= zg30
##.SOLVENT NAME= CDCl3
##.SHIFT REFERENCE= (INTERNAL, CDCl3, 0, 15.7039)
##AUDIT TRAIL= $$ (NUMBER, WHEN, WHO, WHERE, WHAT)
$$ ##TITLE= Audit trail, XWIN-NMR		Version 3.5
$$ ##JCAMPDX= 5.01
$$ ##ORIGIN= Bruker BioSpin GmbH
$$ ##OWNER= she
$$ F:/spectra/data/she/nmr/H-F/1/audita.txt
$$ ##AUDIT TRAIL=  $$ (NUMBER, WHEN, WHO, WHERE, WHAT)
(   1,<2021-02-01 11:06:23.17 +0400>,<she>,<DPX200>,
      <created by zg, POWCHK disabled, PULCHK disabled
       configuration hash MD5:
       00 E9 B6 7A A2 85 ED C7 34 08 36 98 17 FE 4E 26
       data hash MD5: 16K
       F1 50 F4 8D 6E 3E E7 67 F0 7F 4B 9F 93 C0 74 CF>)
$$ ##END=
$$ 
$$ hash MD5
$$ 2C 34 1E 5D BC 9B 2D 5D A9 21 F1 B6 B9 5C FF CF
##$RELAX= 
##$RELAX= 
##$RELAX= 
##$RELAX= 
##$RELAX= 
##$RELAX= 
$$ Bruker specific parameters
$$ --------------------------
##$DU= <F:/spectra>
##$EXPNO= 1
##$NAME= <H-F>
##$PROCNO= 1
##$TYPE= <nmr>
##$USER= <she>
##$AMP= (0..31)
100 100 100 100 100 100 100 100 100 100 100 100 100 100 100 100 100 100 
100 100 100 100 100 100 100 100 100 100 100 100 100 100 
##$AQSEQ= 0
##$AQ_mod= 1
##$AUNM= <au_zg>
##$AUTOPOS= <>
##$BF1= 200.13
##$BF2= 200.13
##$BF3= 200.13
##$BF4= 200.13
##$BF5= 200.13
##$BF6= 200.13
##$BF7= 200.13
##$BF8= 200.13
##$BYTORDA= 1
##$CFDGTYP= 0
##$CFRGTYP= 5
##$CHEMSTR= <none>
##$CNST= (0..31)
1 1 145 1 1 1 1 1 1 1 1 1 1 1 1 1 1 1 1 1 1 1 1 1 1 1 1 1 1 1 1 1 
##$CPDPRG= <>
##$CPDPRG1= <>
##$CPDPRG2= <>
##$CPDPRG3= <>
##$CPDPRG4= <mlev>
##$CPDPRG5= <mlev>
##$CPDPRG6= <mlev>
##$CPDPRG7= <mlev>
##$CPDPRG8= <mlev>
##$CPDPRGB= <>
##$CPDPRGT= <>
##$D= (0..31)
0 1.2 0 0 0 0 0 0 0 0.06 0 0.03 0 0 0 0 0.0002 0 0 0 0 0 0 0 0 0 0 0 0 
0 0 0 
##$DATE= 1612163182
##$DBL= (0..7)
120 120 120 120 120 120 120 120 
##$DBP= (0..7)
150 150 150 150 150 150 150 150 
##$DBP07= 0
##$DBPNAM0= <>
##$DBPNAM1= <>
##$DBPNAM2= <>
##$DBPNAM3= <>
##$DBPNAM4= <>
##$DBPNAM5= <>
##$DBPNAM6= <>
##$DBPNAM7= <>
##$DBPOAL= (0..7)
0.5 0.5 0.5 0.5 0.5 0.5 0.5 0.5 
##$DBPOFFS= (0..7)
0 0 0 0 0 0 0 0 
##$DE= 6
##$DECBNUC= <off>
##$DECIM= 32
##$DECNUC= <off>
##$DECSTAT= 4
##$DIGMOD= 1
##$DIGTYP= 9
##$DL= (0..7)
0 120 120 120 120 120 120 120 
##$DP= (0..7)
150 150 150 150 150 150 150 150 
##$DP07= 0
##$DPNAME0= <>
##$DPNAME1= <>
##$DPNAME2= <>
##$DPNAME3= <>
##$DPNAME4= <>
##$DPNAME5= <>
##$DPNAME6= <>
##$DPNAME7= <>
##$DPOAL= (0..7)
0.5 0.5 0.5 0.5 0.5 0.5 0.5 0.5 
##$DPOFFS= (0..7)
0 0 0 0 0 0 0 0 
##$DQDMODE= 0
##$DR= 18
##$DS= 0
##$DSLIST= <SSSSSSSSSSSSSSS>
$$ [...]
##$SUBNAM2= <"">
##$SUBNAM3= <"">
##$SUBNAM4= <"">
##$SUBNAM5= <"">
##$SUBNAM6= <"">
##$SUBNAM7= <"">
##$SUBNAM8= <"">
##$SUBNAM9= <"">
##$SW= 16.9725356469052
##$SWIBOX= (0..15)
0 0 2 0 0 0 0 0 0 0 0 0 0 0 0 0 
##$SW_h= 3396.73913043478
##$TD= 16384
##$TD0= 1
##$TE= 0
##$TE2= 300
##$TE3= 300
##$TEG= 300
##$TL= (0..7)
0 120 120 120 120 120 120 120 
##$TP= (0..7)
150 150 150 150 150 150 150 150 
##$TP07= 0
##$TPNAME0= <>
##$TPNAME1= <>
##$TPNAME2= <>
##$TPNAME3= <>
##$TPNAME4= <>
##$TPNAME5= <>
##$TPNAME6= <>
##$TPNAME7= <>
##$TPOAL= (0..7)
0.5 0.5 0.5 0.5 0.5 0.5 0.5 0.5 
##$TPOFFS= (0..7)
0 0 0 0 0 0 0 0 
##$TUNHIN= 0
##$TUNHOUT= 0
##$TUNXOUT= 0
##$USERA1= <user>
##$USERA2= <user>
##$USERA3= <user>
##$USERA4= <user>
##$USERA5= <user>
##$V9= 5
##$VALIST= <valist>
##$VCLIST= <CCCCCCCCCCCCCCC>
##$VD= 0
##$VDLIST= <DDDDDDDDDDDDDDD>
##$VPLIST= <PPPPPPPPPPPPPPP>
##$VTLIST= <TTTTTTTTTTTTTTT>
##$WBST= 1024
##$WBSW= 4
##$XGAIN= (0..3)
0 0 0 0 
##$XL= 0
##$YL= 0
##$YMAX_a= 324216
##$YMIN_a= -394577
##$ZGOPTNS= <>
##$ZL1= 120
##$ZL2= 120
##$ZL3= 120
##$ZL4= 120
##$ABSF1= 10
##$ABSF2= 0
##$ABSG= 5
##$ABSL= 3
##$ALPHA= 0
##$AQORDER= 0
##$ASSFAC= 0
##$ASSFACI= 0
##$ASSFACX= 0
##$ASSWID= 0
##$AUNMP= <proc_1d>
##$AZFE= 0.1
##$AZFW= 0.1
##$BCFW= 1
##$BC_mod= 2
##$BYTORDP= 1
##$COROFFS= 0
##$CY= 11.3945322036743
##$DATMOD= 1
##$DC= 2
##$DFILT= <>
##$DTYPP= 0
##$F1P= 15.9154993809931
##$F2P= -4.1035820241983
##$FCOR= 0.5
##$FTSIZE= 0
##$FT_mod= 4
##$GAMMA= 1
##$GB= 0.15
##$INTBC= 1
##$INTSCL= 1
##$ISEN= 128
##$LB= 0.24
##$LEV0= 0
##$LPBIN= 0
##$MAXI= 10000
##$MC2= 0
##$MEAN= 0
##$ME_mod= 0
##$MI= 1.114404
##$NCOEF= 0
##$NC_proc= 0
##$NLEV= 6
##$NOISF1= 3.799351
##$NOISF2= 2.8
##$NSP= 1
##$NTH_PI= 0
##$NZP= 0
##$OFFSET= 15.70392
##$PC= 1
##$PHC0= -10759.86
##$PHC1= 11.00095
##$PH_mod= 1
##$PKNL= yes
##$PPARMOD= 0
##$PSCAL= 0
##$PSIGN= 0
##$REVERSE= no
##$SF= 200.130013532006
##$SI= 16384
##$SIGF1= 3
##$SIGF2= 2
##$SINO= 400
##$SIOLD= 16384
##$SREGLST= <1H.CDCl3>
##$SSB= 0
##$STSI= 0
##$STSR= 0
##$SW_p= 3612.71676300578
##$SYMM= 0
##$S_DEV= 0
##$TDeff= 0
##$TDoff= 0
##$TI= <>
##$TILT= no
##$TM1= 0
##$TM2= 0
##$TOPLEV= 0
##$USERP1= <user>
##$USERP2= <user>
##$USERP3= <user>
##$USERP4= <user>
##$USERP5= <user>
##$WDW= 1
##$XDIM= 8192
##$YMAX_p= 0
##$YMIN_p= 0
$$ End of Bruker specific parameters
$$ ---------------------------------
##NTUPLES= NMR FID
##VAR_NAME=  TIME,          FID/REAL,        FID/IMAG
##SYMBOL=    X,             R,               I
##VAR_TYPE=  INDEPENDENT,   DEPENDENT,       DEPENDENT
##VAR_FORM=  AFFN,          ASDF,            ASDF
##VAR_DIM=   8192,          8192,            8192
##UNITS=     SECONDS,       ARBITRARY UNITS, ARBITRARY UNITS
##FACTOR=    0.0002944,     1,               1
##FIRST=     0,             0,               0
##LAST=      2.4114304,     0,               0
##MIN=       0,             -394577,         0
##MAX=       2.4114304,     324216,          0
$$ Real data points
##PAGE= N=1
##DATA TABLE= (X++(R..R)), XYDATA
$$ [...]
$$ plain form
2409 -4286 2655 -2291 33 5913 -4331 -617 1748 -2856 5446 -1033 -5106 3915 -1904 1316 3033
2424 3033 -6174 1705 2235 -2617 3707 -3762 -3096 5209 -2556 895 964 -6194 4177 1160 -3262 2831
2440 2831 -4623 -179 5302 -4255 505 -290 -3811 5756 -1371 -3954 2845 -3693 2540 3503 -6144
2455 -6144 1849 410 -1558 5249 -4323 -2271 4314 -2654 2837 355 -5741 4747 556 -1486 3635
2470 3635 -4822 908 4770 -3120 2548 -935 -3489 6103 -775 -1244 2408 -4059 3397 3396 -4293 2397
2486 2397 -1096 -881 5663 -3522 -1339 2498 -2621 4315 -374 -4699 3315 -896 328 2734 -5405
2501 -5405 969 2379 -2641 2802 -2332 -3023 4279 -1994 -277 1325 -4682 3027 1185 -3225 2137
2516 2137 -2709 -647 4038 -3269 -166 358 -3079 4029 -478 -3143 2239 -2453 1074 2555 -4183
$$ packed form
2409d286O941m946K324N880j0244L714K365m604Q302o479m073R021n819L220J717
2424C033r207P879N30m852O324p469O66Q305p765L451O9p158J0371l017m422O093
2440B831p454M444N481r557M760p95l521R567p127k583O799o538O233R63r647
2455f144P993j439j968O807r572K052O585o968N491k482o096J0488m191k042N121
2470C635q457N730L862p890N668l483k554R592o878m69L652o467P456jp689O690
2486B397l493K15O544r185K183L837n119O936m689m325Q014m211J224K406q139
2501e405O374J410n020N443n134o91P302o273J717J602o007P709j842m410N362
2516B137m846K062M685p307L103N24l437P108m507k665N382m692L527J481o738
$$ plain form
2531 -4183 1064 880 -1536 3290 -2309 -1835 3483 -1592 1298 916 -3483 2919 498 -1293 2474 -2710
2547 -2710 383 2931 -2286 1641 62 -2004 3375 -243 -1006 1958 -1975 1506 2246 -2513 1394
2562 1394 -13 -918 3036 -1528 -680 1703 -1317 1576 349 -2510 1913 -482 -550 1663 -2110 224
2578 224 1501 -1823 932 -800 -1705 2025 -1239 -355 651 -1900 905 363 -1684 697 -868 -829
2594 -829 1677 -1269 -164 631 -1601 1028 224 -1361 756 -850 -131 980 -1412 154 363 -758
2610 -758 1133 -119 -549 1622 -568 437 659 -844 1014 261 -470 937 -324 -15 1125 -419
2626 -419 443 405 -354 1010 355 -353 765 -320 316 693 -435 628 95 -170 461 -155 -137 422 -120
2645 -120 219 166 -443 25 209 -439 205 -487 -100 257 -581 115 -264 -596 62 -299 -513 116 -573 -51
$$ packed form
2531d183N247j84k416M826n599M74N318n075K890l82m399O402k421j791L767n184
2547b710L093K548n217L927j579k066N379l618p63K964l933L481P40m759L907
2562A394j407r05L954m564Q48K383l020K893j227k859M423k395o8K213l773K334
2578B24J277l324K755j732r05L730l264Q84J006k551K805n42k047K381j565L9
2594h29K506k946J105P95k232K629q04j585K117j606P19J111k392J566K09j121
2610g58J891j252m30K171k190J005K22j503J858p53p31J407j261L09J140j544
2626d19Q62l8p59J364o55p08J118j085O36L77j128J063n33k65O31o16J8N59n42
2645a20L39n3o09M68J84o48O44o92L87L57q38O96l79l32O58l61k14O29o89N22
$$ plain form
2665 -51 -14 -752 -96 -310 -289 -7 -72 -112 -23 -491 -34 -5 -402 126 -237 -172 184 -77 78 137 -152 76 151
2688 151 25 222 77 104 295 -208 307 366 166 538 203 -94 701 235 152 720 -33 520 376 29 648
2709 648 -107 90 706 86 356 352 -298 476 210 -12 403 -285 119 359 -473 68 -237 -477 198 -348 -240
2730 -240 241 -770 99 166 -733 205 -655 -597 328 -673 -257 162 -831 337 -143 -987 167 -447 -258
2749 -258 521 -1035 21 71 -648 933 -310 -740 606 -599 248 673 -1154 563 420 -837 1139
2766 1139 -645 -155 1128 -662 510 465 -842 1385 408 -526 1119 -728 626 1313 -805 776
2782 776 72 -717 1734 -321 -362 1278 -946 905 667 -1920 971 114 -401 1668 -1452 -462 1272
2799 1272 -1276 768 -241 -1841 1697 -402 -711 836 -2022 524 1095 -1974 648 -920 -1475 2102
$$ packed form
2665e1L7p38O56k14K1K82o5m0Q9m68M57K9l97N28l63O5L56k61J55N9k89K28P5
2688A51j26J97j45K7J91n03N15N9k00L72l35k97P95m66q3N68p53N53j44l47O19
2709F48p55J97O16o20K70mo50P74k66k22M15o88M04K40q32N41l05k40O75n46J08
2730b40M81j011Q69O7q99R38q60N8R25j001M16M19r93J168m80q44J154o14J89
2749b58P79j556J056N0p19J581j243m30J346j205Q47M25j827J717j43j257J976
2766A139j784M90J283j790J172m5j307K227r77r34J645j847J354O87k118J581
2782G76p04p89K451k055m1J640k224J851k38k587K891q57n15K069l120R90J734
2799A272k548K044j009j600L538k099l09J547k858K546N71l069K622j568n55L577
$$ plain form
2815 2102 -1266 -936 747 -1769 1456 356 -2213 1099 -1031 -212 2146 -2191 -363 1418 -1412
2830 -1412 1887 -422 -2554 2205 -516 260 1276 -2564 1251 1394 -1180 1664 -1475 -856 3102 -931
2846 -931 180 952 -2398 2692 956 -1778 1768 -1425 664 2999 -2109 441 886 -1469 3392 -464
2862 -464 -2063 1891 -1375 1262 1742 -3535 1167 729 -1411 2375 -2520 -1100 3006 -1544 894 91
2878 91 -3350 2839 222 -1539 1307 -2861 453 2921 -2955 523 -391 -2096 3449 -1436 -1889 1538
2894 1538 -2300 1812 1494 -3345 1096 -359 -889 3219 -2662 -918 2092 -1990 2367 -338 -3400
2909 -3400 2676 -165 -24 2103 -3495 787 2645 -1781 1848 -1203 -1646 4168 -1047 -749 1256 -2733
2925 -2733 2657 1550 -2843 1510 -1007 -196 3541 -2763 -99 1440 -1790 3332 335 -3199 2490
$$ packed form
2815B102l368L30J683k516L225j100k569L312k130Q19K358m337J828J781k830
2830a412L299k309k132M759k721P76J016l840L815J43k574K844l139O19L958m033
2846i31J111P72l350N090j736k734L546l193K089K335n108K550M45k355M861l856
2862d64j599L954l266K637M80n277M702m38k140L786m895J420M106m550K438q03
2878I1l441O189k617j761K846m168L314K468n876L478r14j705N545m885m53L427
2894A538l838M112l18m839M441j455n30M108n881J744L010m082M357k705l062
2909c400O076k841J41K127n598M282J858m426L629l051m43N814n215K98K005l989
2925b733N390j107m393M353k517Q11L737o304K664J539l230N122k997l534N689
$$ plain form
2940 2490 -877 623 1827 -3739 690 1074 -1566 2810 -2168 -2150 2636 -1726 38 511 -3736 2000
2956 2000 624 -1960 1649 -2489 -184 2618 -2379 -86 -156 -2458 2998 -853 -2380 1179 -1760
2971 -1760 359 1914 -3419 875 116 -1265 2591 -2929 -1234 2150 -679 1101 -168 -2738 1155
2986 1155 381 -848 1607 -2635 308 2782 -2341 1285 -791 -2077 2839 -459 -998 1802 -1655
3001 -1655 1108 1283 -1873 1542 125 -468 2545 -1484 -311 1228 -1441 1706 252 -1795 1915
3016 1915 1 -236 1633 -2258 181 1516 -1264 1503 -750 -1499 1594 -482 -444 843 -1958 1120
3032 1120 805 -1778 864 -1097 -783 1384 -1470 -300 409 -1315 949 -122 -1416 1253 -824 35
3048 35 766 -1377 222 201 -1406 1050 -771 -649 1051 -635 120 629 -1128 712 455 -787 1041
$$ packed form
2940B490l367J500J204n566M429L84k640M376m978J8M786m362J764M73m247N736
2956B000j376k584L609m138K305K802m997K293p0k302N456l851j527L559k939
2971a760K119J555n333M294p59j381L856n520J695L384k829J780j269k570L893
2986A155p74j229K455m242K943K474n123L626k076j286M916l298n39K800l457
3001a655K763J75l156L415j417n93L013m029J173J539k669L147j454k047L710
3016A915j914k37J869l891K439J335k780K767k253p49L093k076L8J287k801L078
3032A120l15k583K642j961L14K167k854J170P09j724K264j071j294K669k077Q59
3048C5P31k143J599k1j607K456j821J22J700j686P55N09j757J840k57j242J828
$$ plain form
3065 1041 -785 -47 1591 -628 685 422 -710 1439 60 -791 1462 -594 802 760 -583 991
3081 991 -31 -1229 782 -564 -325 996 -526 779 758 -597 658 8 397 552 -717 -73 216
3098 216 -671 -299 211 -767 -252 -768 -720 274 -711 435 415 -1130 648 152 -365 399 -741 -525 271
3117 271 -213 -299 -66 -333 458 -189 -432 -29 -314 268 74 -331 154 -423 -422 286 248 31 106 -503 -230 233
3139 233 -425 551 -35 -354 478 23 555 960 -131 151 249 34 491 137 -128 309 -34 320 391 -42
3159 -42 543 175 150 288 -44 -33 205 27 -165 -169 -476 86 -270 -270 85 -595 -205 86 -303 351 -18 -309
3181 -309 -24 -248 -248 28 -288 54 -127 -393 95 -358 -345 95 -352 12 96 -391 237 -168 -229 415 -252 0
3203 0 35 -376 202 251 -378 476 -62 -215 641 -211 128 65 -119 674 -38 -24 613 -177 230 720 -435 418
$$ packed form
3065A041j826P38J638k219J313k63j132K149j379q51K253k056J396m2j343J574
3081I91j022j198K011j346K39J321j522J305k1j355J255o50L89J55j269O44K89
3098B16q87L72N10r78N15n16M8R94r85J146k0j545J778m96n17P64j140K16P96
3117B71m84q6K33k67P91o47k43M03k85N82j94m05M85n77JP08l8k17P5o09K73M63
3139B33o58R76n86l19Q32m55N32M05j091K82R8k15M57l54k65M37l43L54P1m33
3159d2N85l68k5J38l32J1K38j78j92ml07N62l56%L55o80L90K91l89O54l69k91
3181c09K85k24%K76l16L42j81k66M88m53J3M40m47L64Q4m87O28m05o1O44o67K52
3203@L5m11N78M9o29Q54n38j53Q56q52L39o3j84P93p12J4O37p90M07M90j155Q53
$$ plain form
3225 418 307 -215 778 -103 27 577 -525 629 326 -362 710 -20 36 772 -608 90 336 -663 377
3244 377 -97 -675 648 -74 -131 399 -981 478 190 -744 627 -477 -503 744 -773 -202 125 -1116
3262 -1116 644 -19 -1242 421 -599 -303 700 -1303 203 422 -741 812 -576 -937 890 -547
3278 -547 361 691 -1242 833 616 -754 1110 -941 -504 1366 -1019 390 415 -1271 1471 273 -488
3295 -488 1113 -897 509 1469 -1371 685 262 -551 1796 -520 -729 1001 -691 1065 775 -1759
3311 -1759 1122 223 -377 1465 -1489 -254 1409 -982 841 -264 -1787 1695 -215 -493 862 -1912
3327 -1912 666 1393 -1522 803 -831 -1112 2047 -1128 -593 714 -1581 1551 347 -1847 928 -810
3343 -810 -103 1616 -2125 -293 774 -1379 1659 -650 -1656 1899 -567 254 1085 -2205 816 1119
$$ packed form
3225D18j11n22R93q81J30N50j102J154l03o88J072p30N6P36j380O98K46r99J040
3244C77m74n78J323p22n7N30j380J459k88r34J371j104k6J247j517N71L27j241
3262a116J760o63j223J663j020K96J003k003J506K19j163J553j388l61J827j437
3278e47R08L30j933K075k17j370J864k051M37J870k385J409K5j686K742j198p61
3295d88J601k010J406R60k840K056m23q13K347k316k09J730j692J756k90k534
3311a759K881q99o00J842k954J235J663k391J823j105j523L482j910k78J355k774
3327a912K578P27k915K325j634k81L159l175N35J307k295L132j204k194K775j738
3343h10P07J719l741J832J067k153L038k309j006L555k466Q21Q31l290L021L03
$$ plain form
3359 1119 -1234 1350 -1306 -835 2099 -866 134 654 -1538 2038 599 -1416 1184 -1004 495
3374 495 2192 -1668 175 657 -991 2420 -536 -1263 1655 -716 771 996 -2556 835 659 -685
3390 -685 1717 -1565 -696 1966 -786 631 171 -1947 2026 33 -963 978 -1984 291 1628 -1969
3406 -1969 558 -376 -1168 2208 -1027 -1149 853 -1427 1119 910 -2243 620 -264 -250 1835 -1800 -561
3423 -561 1304 -1364 1050 -242 -1895 1734 -306 -220 1113 -1849 603 1356 -1184 913 -686 -852
3439 -852 2245 -403 -228 821 -1459 1570 773 -1392 1172 -181 15 2147 -1035 -258 669 -805
3455 -805 1772 14 -1467 1467 -83 265 984 -1832 733 897 -817 1164 -864 -701 1481 -502
3471 -502 216 505 -1507 1081 522 -870 881 -777 -320 1154 -1261 140 77 -1163 1201 -322 -1116
$$ packed form
3359A119k353K584k656M71K934k965J000N20k192L576j439k015K600k188J499
3374D95J697l860J843M82j648L411k956p27K918k371J487K25l552L391j76j344
3390f85K402l282Q69K662k752J417m60k118L973j993r96J941k962K275J337l597
3406a969K527r34p92L376l235j22K002k280K546k09l153K863q84J4K085l635J239
3423e61J865k668K414j292j653L629k040Q6J333k962K452P53k540K097j599j66
3439h52L097k648J75J049k280L029p97k165K564j353J96K132l182P77R27j474
3455h05K577j758j481K934j550L48P19k816K565J64j714J981k028J63K182j983
3471e02P18K89k012K588n59j392J751j658M57J474k415J401o3j240K364j523p94
$$ plain form
3488 -1116 860 -489 306 764 -1538 185 144 -532 857 -813 -787 1059 -508 136 0 -1140 720
3505 720 -112 -723 485 -562 351 776 -771 647 -53 -679 1336 -283 -287 726 -537 571 747 -840
3523 -840 765 214 -240 980 -726 -363 657 -400 390 93 -696 502 -127 -292 769 -568 163
3540 163 457 -465 333 -100 -422 656 -79 -198 446 -592 55 176 -597 393 -220 -335 284 -302 -179
3559 -179 19 -417 168 98 -571 288 -160 -119 173 -397 76 424 -263 169 -242 -519 398 -253 -83 217 -247
3580 -247 208 86 -274 117 86 267 240 -292 128 120 -36 432 383 -163 169 149 86 237 -202 189 236 -126 296
3603 296 -124 -209 326 166 -90 303 -365 279 167 35 210 -42 -258 72 -113 -37 333 -411 106 38 -273
3624 -273 308 -235 -178 -27 -252 -55 -47 -130 4 -205 -86 101 -153 -14 -23 -248 -154 -208 -175 240 -270 31 218
$$ packed form
3488a116J976j349P95M58k302J723m1o76J389j670K6J846j567O44j36j140J860
3505G20q32o11J208j047R13M25j547J418p00o26K015j619mJ013j263J108J76j587
3523h40J605n51m54J220j706L63J020j057P90k97p89J198o29j65J061j337P31
3540A63K94r22P98m33l22J078p35j19O44j038O47J21p73R90o13j15O19n86J23
3559a79J98m36N85p0o69Q59m48M1K92n70M73L48o87M32m11k77R17o51J70L00m64
3580b47M55j22l60L91l1J81k7n32M20qj56M68m9n46L32k0o3J51m39L91M7l62M22
3603B96m20q5N35j60k56L93o68O44j12j32J75k52k16L30j85P6L70p44N17o8l11
3624b73N81n43N7J51k25J97Qq3J34k09J19J87k54J39rk25R4n4L3M15n10L01J87
$$ plain form
3647 218 -231 138 -201 -217 15 -393 -197 216 -204 -8 107 -144 139 234 -163 283 -151 100 335 -269 -16
3668 -16 177 43 168 64 20 176 -201 363 211 -218 265 358 1 347 -187 151 226 -213 309 213 -230 170
3690 170 -315 -39 308 -301 286 132 -662 112 -128 -149 393 -334 -145 42 -316 301 34 -501 126 -387
3710 -387 137 354 -465 154 13 -652 81 -283 -545 314 -400 25 190 -704 171 113 -361 554 -621 -129
3730 -129 611 -468 233 127 -402 788 184 -343 590 -596 198 496 -923 324 -69 -29 1078 -82
3748 -82 -230 891 -457 486 280 -659 604 255 -122 874 -754 -145 572 -197 554 -94 -949 717 -140
3767 -140 -321 715 -1070 353 386 -830 157 -353 -348 1071 -801 -452 442 -1142 694 -194 -1112 919
3785 919 -768 -294 769 -1371 184 580 -1121 1036 -372 -1163 1005 -550 -27 541 -1746 680
$$ packed form
3647B18m49L69l39j6K32m08J96M13m20J96J15k51K83R5l97M46m34K51K35o04K53
3668a6J93j34J25j04m4J56l77N64j52m29M83R3l57L46n34L38P5m39N22r6m43M00
3690A70m85K76L47o09N87j54p94P74k40k1N42p27J89J87l58O17k67n35O27n13
3710c87N24K17q19O19j41o65P33l64k62Q59p14M25J65q94Q75n8m74R15j175M92
3730a29P40j079P01j06n29J190o04n27R33j186P94K98j419J247l93M0J107j160
3748h2j48J121j348R43k06r39J263l49l77R96j628O09P17p69P51o48q55J666q57
3767a40j81J036j785J423L3j216R87n10NJ419j872L49Q94j584J836q88r18K031
3785I19j687M74J063k140J555L96j701K157j408p91K168j555N23N68k287K426
$$ plain form
3801 680 280 -1003 878 -722 -133 1221 -710 217 266 -1070 1403 326 -501 926 -626 722 1174
3818 1174 -1155 672 285 -513 1471 -420 -691 1166 -402 516 904 -1903 745 245 -315 1065 -1001
3835 -1001 41 1168 -579 586 -472 -1255 1838 456 -747 1026 -1166 -3 726 -1404 1052
3850 1052 -708 -704 1909 -1367 -717 719 -822 881 458 -1607 1067 -998 -230 1010 -2056 1
3866 1 470 -856 524 -542 -957 910 -399 -412 911 -1998 353 1097 -1204 616 -1447 -920 1914
3883 1914 -508 -237 695 -1404 1279 752 -1848 1160 -591 -97 815 -941 289 431 -490 1726 -619
3900 -619 -657 1666 -1102 854 -660 -1357 945 754 -597 809 -299 -356 1230 -404 777 -124 -1038
3917 -1038 1530 285 -1073 704 -765 362 737 -1464 758 30 -1024 1219 56 -757 1030 -759
$$ packed form
3801F80m00j283J881j600N89J354j931R27M9j336K473j077q27J427j552J348M52
3818A174k329J827l87p98J984j891k71J857j568R18L88k807K648n00n60J380k066
3835a001J042J127j747J165j058p83L093j382j203J773k192J163P29k130K456
3850A052j760MK613l276O50J436j541J703m23k065K674k065P68J240l066K057
3866AM69j326J380j066m15J867j309j3J323k909K351P44k301J820k063N27K834
3883A914k422K71R32k099K683n27k600L008j751M94R12j756J230J42r21K216k345
3900f19l8K323k768J956j514o97K302j91j351J406j108n7J586j634J181r01r14
3917a038K568j245j358J777j469J127L75k201K222p28j054K243j163q13J787j789
$$ plain form
3933 -759 -147 551 -1442 286 -288 -548 1316 -1413 -9 261 -965 489 -23 -1023 1065 -99 -367
3950 -367 493 -1161 323 710 -915 344 -75 -432 1123 -158 -210 424 -705 768 172 -810 699
3967 699 56 592 1097 -585 -214 681 -458 797 -56 -733 747 -41 241 696 -694 384 571 -520
3985 -520 251 -153 -485 1002 -461 161 260 -737 510 219 -570 525 -201 -162 567 -599 236 -179 -344
4004 -344 543 -326 -147 282 -272 -100 397 -480 57 -75 -493 222 -388 -219 425 -101 3 -104 -389 349
4024 349 137 -41 69 -399 284 346 -82 167 137 -188 362 -214 -65 366 18 400 20 -122 290 106 -15
4045 -15 326 399 -97 254 -186 47 303 -26 192 76 21 268 -68 49 128 -162 275 77 92 169 -134 -26
4067 -26 -123 -149 -125 31 -387 -110 -9 -296 92 -12 -52 -124 -145 -145 -65 -176 -33 -121 -371 -184 -340 -245 36 -325
$$ packed form
3933g59O12O98j993J728n74k60J864k729J404K70j226J454n12j000K088j164k68
3950c67Q60j654J484L87j625J259m19l57J555j281n2O34j129J473n96r82J509
3967F99o43N36N05j682L71Q95j139J255q53o77J480p88K82M55j390J078J87j091
3985e20P71m04l32J487j463O22R9r97J247k91p89J095p26L9P29j166Q35m15j65
4004c44Q87q69J79M29n54J72M97q77N37j32m18P15o10J69O44n26J04j07k85P38
4024C49k12j78J10m68O83O2m28K49l0l25N50n76J49M31l48L82l80j42M12j84j21
4045a5L41P3m96L51m40K33K56l29K18j16n5K47l36J17P9k90M37j98J5P7l03J08
4067b6r7k6K4J56m18K77J01k87L88j04m0p2k1%Q0j11J43q8k50J87j56R5K81l61
$$ plain form
4091 -325 47 -175 -130 -161 -404 -162 -42 -155 129 88 -63 39 46 -66 251 111 -9 150 55 80 32 49 160
4114 160 -33 -239 261 -251 27 125 -20 13 181 48 174 108 -27 393 -207 213 199 9 153 -49 -37 234
4136 234 29 -22 133 -9 -143 -245 -12 238 -79 -147 140 -149 -89 -123 -79 141 -29 35 42 -113 -116 92 -406
4159 -406 154 -2 -225 -64 -336 -11 -120 -365 142 -159 -390 -10 -471 -59 129 -409 180 130 -136 358
4179 358 -151 -71 219 -141 58 302 -448 149 59 -46 485 -40 293 446 60 364 66 -511 342 -79 -53
4200 -53 322 -167 175 425 -186 291 65 -171 403 -103 -87 239 -404 165 81 -318 121 4 -291 571 -388
4221 -388 -228 274 -552 341 37 -595 301 -305 -173 226 -774 -29 237 -375 574 -488 -418 467 -322 -27
4241 -27 208 -601 286 328 -574 160 -280 -190 588 -447 179 56 -797 668 -123 -455 597 -472 119 572
$$ packed form
4091c25L72k22M5l1k43K42J20j13K84m1j51J02Pj12L17j40j20J59r5K5m8J7J11
4114A60j93k06N00n12K78R8j45L3J68j33J26o6j35M20o00M20j4j90J44k02J2K71
4136B34k05n1J55j42j34j02K33K50l17o8K87k89O0l4M4K20j70O4Pj55lK08m98
4159d06N60j56k23J61k72L25j09k45N07l01k31L80m61M12J88n38N89n0k66M94
4179C58n09Q0K90l60J99K44p50N97r0j05N31n25L33J53l86L04k98n77Q53m21K6
4200e3L75m89L42K50o11M77k26k36N74n06J6L26o43N69q4l99M39j17k95Q62r59
4221c88J60N02q26Q93l04o32Q96o06J32L99j000P45K66o12R49j062P0Q85p89K95
4241b7K35q09Q87M2r02P34m40R0P78j035O26j23q53J465p91l32J052j069N91M53
$$ plain form
4261 572 -865 207 -56 -182 886 -353 -429 936 -219 179 285 -841 670 70 -264 603 -573
4278 -573 190 911 -424 297 -187 -779 825 -54 -189 536 -614 340 652 -739 540 -161 -305 837
4296 837 -700 -412 367 -727 765 -8 -877 501 -364 -283 719 -1167 -200 506 -625 618 -331 -681
4314 -681 953 -154 73 402 -1295 571 296 -738 584 -682 -348 1085 -583 -269 111 -831 1190
4331 1190 206 -909 525 -404 121 1040 -1040 228 263 -544 1026 -501 -633 833 -361 322 618
4348 618 -890 639 442 -501 766 -847 89 922 -476 453 -252 -770 1047 3 -462 436 -924
4365 -924 204 619 -997 168 40 -366 1200 -324 -656 481 -715 411 267 -1009 377 -175 -299
4382 -299 560 -883 -1 560 -830 464 -107 -699 1111 -263 -291 407 -975 313 371 -617 254 -318
$$ packed form
4261E72j437J072k63j26J068j239p6J365j155L98J06j126J511o00l34Q67j176
4278e73P63P21j335P21m84n92J604q79j35P25j150R54L12j391J279p01j44J142
4296H37j537K88P79j094J492p73q69J378q65Q1J002j886R67P06j131J243r49l50
4314f81J634j107K27L29j697J866k75j034J322j266L34J433j668L14L80r42K021
4331A190r84j115J434r29N25R19k080J268L5q07J570j527j32J466j194O83K96
4348F18j508J529j97r43J267j613R36Q33j398R29p05n18J817j044m65Q98j360
4365i24J128M15j616J165j28m06J566j524l32J137j196J126j44j276J386n52j24
4382b99Q59j443Q82N61j390J294n71n92J810j374k8O98j382J288N8r88Q71n72
$$ plain form
4400 -318 -334 957 -623 -359 370 -645 778 326 -789 704 -156 -19 735 -805 84 479 -506 736
4418 736 -86 -666 835 -324 263 343 -645 436 483 -317 644 -154 -93 822 -617 80 322 -409 353 64
4438 64 -299 418 -577 -24 624 -468 191 -33 -296 572 -418 -299 383 -277 -163 334 -623 184 0 -264
4458 -264 435 -445 -50 459 -286 168 -196 -690 312 -147 -431 -68 -446 118 273 -501 141 -62 -229 201
4478 201 -92 -159 431 -361 221 357 -153 216 -100 -118 550 -323 38 354 -324 290 174 -276 150 227 -143
4499 -143 325 -98 125 228 -220 66 190 108 269 -139 56 562 -137 64 -26 -344 110 -90 -114 70 -225
4520 -225 155 144 40 -91 27 -316 289 -89 -144 -118 -180 133 -41 -361 -136 16 -214 129 -310 169 -88
4541 -88 -135 -124 -188 -113 -55 -12 -94 27 -326 -92 -118 -83 78 -72 -169 63 94 -27 204 141 161 109 -97 428 -63
$$ packed form
4400c18j6J291j580K64P29j015J423m52j115J493q60J37P54j540Q89L95r85J242
4418G36q22n80J501j159N87Q0r88J081M7q00R61p98O1R15j439O97K42p31P62k89
4438F4l63P17r95N53O48j092O59k24k63Q68r90J19O82o60J14M97r57Q07j84k64
4458b64O99q80L95N09p45M54l64m94J002m59k84L63l78N64J55p74O42k03j67M30
4478B01k93o7N90p92N82J36n10L69l16j8O68q73L61L16o78O14j16m50M26P7l70
4499a43M68m23K23J03m48K86J24q2J61m08J95N06o99K01r0l18M54k00k4J84k95
4520b25L80j1j04j31J18l43O05l78n5K6o2L13j74l20K25J52k30L43m39M79k57
4541h8m7J1o4P5N8M3q2J21l53K34k6L5J61j50r7K32L1j21K31o3K0n2k06N25m91
$$ plain form
4566 -63 118 193 103 141 140 -145 -64 119 -24 340 201 -125 65 -143 -43 207 104 158 87 -37 192 -164 39
4589 39 97 -23 -76 54 38 79 -37 -28 -124 -104 131 -77 -155 69 -18 -168 106 -146 9 61 -332 13 99 -170
4613 -170 41 -42 -265 -111 -182 -301 195 -287 129 63 -191 174 -89 -61 220 -270 24 -178 226 261 57 59
4635 59 216 -240 85 305 3 293 -133 -15 276 26 -2 205 81 -61 347 57 430 -77 134 185 -177
4656 -177 -90 112 -168 145 68 -74 234 -85 -242 113 -181 235 123 -205 117 -162 7 71 -400 74 -188
4677 -188 -349 192 -120 -96 200 -224 86 160 -644 66 -144 -389 7 -338 -87 81 -99 68 176 -286 241
4698 241 -83 -291 393 -170 -175 244 -370 125 -4 -92 457 -252 -116 338 -365 258 23 -535 385 -146 38
4719 38 498 -327 48 671 -110 17 -71 -227 461 -81 -105 301 -346 390 202 -587 319 -126 -91 526 -189
$$ packed form
4566f3J81P5r0L8jk85Q1J83j43L64j39l26J90k08J00K50j03N4p1j24K29l56K03
4589C9N8j20n3J30j6M1j16Rr6K0K35k08p8K24q7j50K74k52J55N2l93L45Q6k69
4613a70K11q3k23J54p1j19M96m82M16o6k54L65k63K8K81m90K94k02M04L5k04K
4635E9J57m56L25K20l02K90m26J18K91k50k8K07j24j42M08k90L73n07K11N1l62
4656a77Q7K02k80L13p7j42L08l19j57L55k94M16j12l28L22k79J69O4m71M74k62
4677a88j61N41l12K4K96m24L10P4q04P10k10k45L96l45K51J68j80J67J08m62N27
4698B41l24k08O84n63nM19o14M95j29q8N49p09J36M54p03O23k35n58R20n31J84
4719C8M60q25L75O23p81J27q8j56O88n42k4M06o47P36j88p89R06m45L5O17p15
$$ plain form
4740 -189 88 222 -415 296 -1 -173 294 -511 -51 286 -912 -206 323 -231 414 -197 -414 379 -363 -259
4760 -259 263 -465 278 316 -449 154 -155 -44 299 -575 161 -24 -661 578 110 -566 417 -248 140 456
4780 456 -379 338 -213 -277 575 -129 18 702 -278 88 283 -575 422 72 -135 281 -226 -40 589 -305
4800 -305 337 90 -469 574 25 -294 439 -313 185 520 -318 379 -141 -272 552 -289 -271 521 -492 192
4820 192 305 -603 491 -307 -159 312 -689 -58 57 -256 401 -281 -743 393 -239 -217 462 -592 233
4839 233 417 -579 186 -367 -245 495 -253 -136 230 -521 227 238 -571 400 -39 -206 635 -246 179 333
4859 333 -205 483 13 -381 635 8 -68 366 -761 321 202 -516 450 -260 -337 894 -374 22 188
4878 188 -665 696 285 -315 351 -239 78 537 -337 164 175 -215 509 -36 -227 560 -531 49 407 -654
$$ packed form
4740a89K77J34o37P11k97j72M67q05M60L37j198P06N29n54O45o11k17P93p42J04
4760b59N22p28P43L8p65O03l09J11L43q74P36j85o37J239m68o76R83o65L88L16
4780D56q35P17n51o4Q52p04J47O84r80L66J95q58R97l50k07M16n07J86O29q94
4800c05O42k47n59J043n49l19P33p52M98L35q38O97n20j31Q24q41J8P92j013O84
4820A92J13r08J094p98J48M71j001O31J15l13O57o82m62J136o32K2O79j054Q25
4839B33J84r96P65n53J22P40p48J17L66p51P48J1q09R71m39j67Q41q81M25J54
4859C33n38O88m70l94J016o27p6M34j127J082j19p18R66p10p7J231j268L96J66
4878A88q53J361m11o00O66n90L17M59q74N01J1l90P24n45j91P87j091N80L58j061
$$ plain form
4898 -654 333 62 -292 184 -355 -258 282 -356 -17 23 -463 240 -57 -367 335 -524 -215 218 -644 315 -109
4919 -109 -284 152 -64 -213 366 -478 13 103 -556 199 -151 -50 321 -313 340 297 -6 208 20 -232 177
4940 177 -117 216 236 -554 218 294 -109 137 168 64 448 5 109 503 -93 81 100 -128 218 -164 72
4961 72 456 -253 -93 65 -120 233 -165 58 194 -79 0 158 -322 148 147 -267 118 -78 -71 67 -188 168
4983 168 -12 -153 -60 64 139 89 -84 42 371 -356 167 -54 -123 186 -290 -136 108 -185 130 159 -114 223
5005 223 -128 -39 127 -151 164 129 51 -37 16 -52 188 107 -264 -117 -89 41 138 -92 -13 20 -144 135 38 86
5029 86 460 8 -128 194 -86 41 260 9 -73 -58 41 17 -20 150 60 120 55 -23 -215 30 -58 -284 14 -24
5053 -24 55 -132 -246 -79 -193 -330 -206 -303 -129 -8 -147 -28 -197 -70 71 -167 193 -59 -191 53 12
$$ packed form
4898f54R87k71l54M76n39R7N40o38L39M0m86P03k97l10P02q59L09M33q62R59m24
4919a09j75M36k16j49N79q44M91R0o59P55l50J01L71o34O53m3l03K14j88k52M09
4940A77k94L33K0p90P72P6m03K46L1j04L84m43J04L94n96J74J9k28L46l82K36
4961G2L84p09J60J58j85L53l98K23J36k73P9J58m80M70jm14L85j96PJ38k55L56
4983A68j80j41R3J24P5n0j73J26L29p27N23k21o9L09m76J54K44k93L15K9k73L37
5005B23l51Q9J66k78L15l5p8q8N3o8K40q1l71J47K8J30R7k30P9L3j64K79r7M8
5029H6L74m52j36L22k80J27K19k51q2J5R9k4l7J70r0O0o5p8j92K45q8k26K98l8
5053b4P9j87j14J67j14j37J24r7J74J21j39J19j69J27J41k38L60k52j32K44m1
$$ plain form
5074 12 68 -144 -94 -144 187 8 153 69 79 -84 -24 -142 155 246 -190 257 59 -88 202 -188 201 86 101
5097 101 45 111 146 83 -142 4 -242 186 97 -138 160 72 -169 -146 -140 -18 51 -19 42 136 -171 113 -36 -334
5121 -334 -203 2 -105 71 -53 -293 3 -467 78 -57 -193 91 -424 -31 -21 -238 187 234 -112 106 182
5142 182 -124 -19 -67 16 -159 -97 27 366 -19 309 198 23 -20 -162 -40 253 -171 428 263 -154 112
5163 112 -46 80 180 -206 293 18 -290 288 -179 -258 101 7 112 454 -134 3 3 -29 429 -296 -30 95
5185 95 -133 181 -9 -316 363 -45 -41 103 -87 -39 246 -351 183 -61 -235 507 -518 56 109 -65 -4 71
5207 71 -283 298 -291 -325 250 -203 66 143 -391 269 -100 -492 187 -472 -161 277 -489 -103 350 -149 290
5228 290 0 -141 322 -75 32 56 -340 403 205 -96 492 -348 -148 316 -325 35 -59 -139 332 -84 -146
$$ packed form
5074A2N6k12N0n0L31j79J45q4J0j63O0j18K97R1m36M47j98j47K90l90L89j15J5
5097A01n6O6L5o3k25J46k46M28q9k35K98q8k41K3OJ22O9p0O1R4l07K84j49k98
5121c34J31K05j07J76j24k40K96m70N45j35j36K84n15L93J0k17M25M7l46K18P6
5142A82l06J05m8Q3j75O2J24L39l85L28j11j75m3j42J22K93m24N99j65m17K66
5163A12j58J26J00l86M99k75l08N78m67p9L59r4J05L42n88J37%l2M58p25K66J25
5185I5k28L14j90l07O79m08MJ44j90M8K85n97N34k44j74P42j025N74N3j74O1P5
5207G1l54N81n89l4N75m53K69P7n34O60l69l92O79o59L11M38p66L86M53m99M39
5228B90k90j41M63l97J07K4l96P43j98l01N88q40K00M64o41L60r4q0M71m16o2
$$ plain form
5249 -146 230 -339 6 426 -307 167 -27 24 308 -24 133 247 -301 255 110 -354 217 23 13 236 -304
5270 -304 130 292 -188 64 -4 -415 121 -139 -76 253 -472 242 -40 -444 90 -314 -231 398 -274 -178 60
5291 60 -400 142 213 -495 270 -280 -353 245 -395 -10 5 -145 252 -52 -287 347 -179 20 92 -332 287 478
5313 478 -308 269 -137 19 454 -272 179 231 -428 334 14 -302 159 -197 17 60 -331 36 -146 -311 490
5334 490 -269 -201 257 0 57 280 -512 181 -21 -143 231 -258 -141 -97 -405 -75 22 -91 229 38 -300
5355 -300 167 -78 -109 201 -283 -224 -175 -298 299 -293 -43 299 -405 76 -102 -333 233 -174 -295 140 -263
5376 -263 -100 154 -143 269 217 -394 315 -219 39 122 -191 196 110 -462 212 215 -389 109 -104 -181 47 -518
5398 -518 163 9 -59 78 -183 -679 424 -206 -530 162 213 236 -392 -84 -367 201 57 449 -40 -47 -190
$$ packed form
5249a46L76n69L45M20p33M74j94N1K84l32J57J14n48N56j45m64N71j94j0K23n40
5270c04M34J62m80K52o8m11N36k60O3L29p25P14k82m04N34m04Q3O29o72R6K38
5291F0m60N42P1p08P65n50p3N98o40L85J5j50L97l04k35O34n26J99P2m24O19J91
5313D78p86N77m06J56M35p26M51N2o59P62l20l16M61l56K14M3l91L67j82j65Q01
5334D90p59O8M58k57N7K23p92O93k02j22L74m89J17M4l08L30R7j13L20j91l38
5355c00M67k45l1L10m84N9M9j23N97n92K50L42p04M81j78k31N66m07j21M35m03
5376b63J63K54k97M12n2o11P09n34K58Q3l13L87q6n72O74Lo04M98k13p7K28n65
5398e18O81j54o8J37k61m96J103o30l24O92N1K3o28L08k83N68j44L92m89pj43
$$ plain form
5419 -190 -161 -276 -655 -367 501 144 -365 580 -831 -13 -316 122 138 -324 -344 289 -57 -8 -87 -158 189 58
5441 58 -172 8 -207 -202 6 -218 -11 -92 -128 31 -99 17 201 -98 -54 186 -238 275 -64 -157 171 -52
5463 -52 64 322 -151 -77 -117 -115 91 118 278 89 92 168 91 -113 -9 56 12 335 -53 -33 -99 66 -22 -155 -183
5488 -183 151 154 -59 94 -89 -240 32 -199 99 213 218 -41 -238 -74 121 104 -132 12 -109 17 -168 -102
5510 -102 30 -204 -69 -6 -265 231 121 -148 186 167 67 -5 4 -3 -90 18 103 63 10 -9 38 242 135 -178
5534 -178 -14 -140 -8 71 -15 136 300 -57 138 263 71 203 -168 244 267 -90 68 131 103 219 -44 17
5556 17 248 55 -181 42 18 159 -80 -170 125 9 -217 214 -150 239 111 -248 7 160 163 190 -37 -153
5578 -153 17 -129 -202 -30 -38 -125 85 88 42 -262 -63 189 -393 -63 175 53 227 -37 -201 47 -113 21
$$ packed form
5419a90K9j15l79K88Q68l57n09R45j411Q18l03M38J6m62k0O33l46M9p9p1L47j31
5441E8k30J80k15NK08k24K07q1l6J59j30J16J84k99M4K40m24N13l39r3L28k23
5463e2J16K58m73P4m0KK06K7J60j89LP6p7k04J04O5m4L23l88K0o6J65q8j33k8
5488a83L34Lk13J53j83j51K72k31K98J14Nk59j97J64J95j7k36J44j21J26j85O6
5510a02J32k34J35O3k59M96j10k69L34j9j00p2Rpq7J08Q5m0n3j9M7K04j07l13
5534a78J64j26J32P9q6J51J64l57J95J25j92J32l71M12K3l57J58O3k8J16k63O1
5556A7K31j93k36K23k4J41k39r0K95j16k26M31l64L89j28l59K55J53LK7k27j16
5578a53J70j46p3J72qq7K10Lm6l04J99K52n82L30K38j22J74k64j64K48j60J34
$$ plain form
5600 21 240 -335 171 -97 -126 302 -66 -34 94 76 129 189 -34 -95 -212 37 129 0 -66 173 -218 56 97
5623 97 -64 181 7 193 162 -125 18 -216 -256 26 -118 25 91 -69 420 127 25 89 100 -230 198 68
5645 68 -186 200 22 387 3 -147 8 5 -182 157 -215 -92 6 -175 245 13 -181 -108 -208 -114 69 -271
5667 -271 -39 319 -125 149 -160 96 167 -50 44 159 -280 83 9 -112 199 -105 -19 12 -239 -178 -85 -237
5689 -237 126 -29 92 249 -107 78 147 -171 140 -96 -323 -13 -297 220 282 -43 209 159 -45 304 -37
5710 -37 6 218 -191 -209 236 -139 130 51 -204 294 2 92 358 -150 208 3 70 60 -145 -272 259 -96
5732 -96 -258 -58 -213 209 -48 -324 150 -53 161 229 -357 -41 80 -310 52 -58 -206 305 -240 279 4
5753 4 -242 164 -152 -136 315 -194 -158 226 -163 -54 83 -258 174 154 -29 218 -164 180 198 -309 222 102
$$ packed form
5600B1K19n75N06k68k9M28l68L2J28j8N3O0k23o1j17K49R2j29o6K39l91K74M1
5623I7j61K45j74J86l1k87J43k34m0K82j44J43O6j60M89k93j02O4J1l30M28j30
5645F8k54L86j78L65l84j50J55lj87L39l72J23R8j81M20k32j94P3j00R4J83l40
5667b71K32L58m44K74l09K56P1k17R4J15m39L63p4j21L11l04Q6L1k51O1R3j52
5689b37L63j55J21J57l56J85O9l18L11k36k27L10k84N17O2l25K52n0k04L49l41
5710c7M3K12m09j8M45l75K69p9k55M98k92R0K66n08L58k05O7j0k05j27N31l55
5732i6j62K00j55M22k57k76M74k03K14O8n86L16J21l90L62j10j48N11n45N19k75
5753Dk46M06l16J6M51n09L6L84l89J09J37l41M32k0j83K47l82L44J8n07N31j20
$$ plain form
5775 102 -202 300 -192 -108 322 -172 186 144 -414 250 -95 -89 326 -95 152 172 -32 133 166 -211 307 28
5797 28 -274 367 -339 50 186 -144 45 -197 -143 275 -384 -335 312 -257 62 1 -395 48 -180 -146 367 -111
5819 -111 -20 -10 -68 61 119 -109 221 -186 -98 39 -210 187 46 -27 200 -67 -172 303 54 174 149 -237
5841 -237 148 -7 39 125 -303 -120 92 -180 122 -53 -308 199 2 -49 317 52 -51 109 -299 88 182
5862 182 -150 283 -1 -321 -79 -100 269 -69 -66 134 35 -60 112 -242 8 218 -206 -170 121 -254 -97 -118
5884 -118 -72 209 34 -3 206 -111 -60 173 65 229 7 54 92 -183 -159 64 -217 -15 -260 106 298 -107
5906 -107 49 27 -278 -66 -6 -161 216 -252 87 312 -26 -18 139 30 72 76 87 -5 -267 -22 -48 -154 31
5929 31 264 144 41 12 -170 50 -134 -30 130 -5 120 -10 -115 -20 -152 71 52 -207 -199 -23 11 -146
$$ packed form
5775A02l04N02m92Q4M30m94L58m2n58O64l45OM15m21K47K0k04J65L3l77N18k79
5797B8l02O41p06L89J36l30J89k42N4M18o59M9O47n69L19o1l96M43k28L4N13m78
5819a11R1J0n8J29N8k28L30m07Q8J37k49L97j41p3K27k67j05M75k49J20k5l86
5841b37L85j55M6Q6m28J83K12k72L02j75k55N07j97n1L66k65j03J60m08L87R4
5862A82l32M33k84l20K42k1L69l38LK00r9r5J72l54K50K10m24L6K91l75J57k1
5884a18M6K81j75l7K09l17N1K33j08J64k22M7L8k75K4K23k81K02k45L66J92m05
5906a07J56k2l05K12O0j55L77m68L39K25l38QJ57j09M2MJ1r2k62K45k6j06J85
5929C1K33j20j03k9j82K20j84J04J60j35J25j30j05R5j32K23j9k59QJ76L4j57
$$ plain form
5951 -146 -17 25 143 152 -145 -25 -267 171 182 7 53 132 -76 117 -89 -80 25 -69 56 327 -187 -182 -113 -145
5975 -145 28 -173 -172 -186 -66 -21 -59 153 217 33 218 -76 -25 -95 89 -281 -59 -146 17 114 -89 63 -153
5998 -153 115 64 -125 -202 -79 -33 189 71 181 -23 -8 -40 -127 -8 3 73 -210 90 116 49 -80 -7 -94 126
6022 126 -46 -21 162 -127 102 95 -212 -17 -162 -5 -173 0 131 -51 59 -26 -190 -153 -54 -51 -29 -89 -8 28
6046 28 -56 -97 58 71 -141 251 -134 185 -120 -274 38 93 40 -143 -13 -138 188 -135 150 153 -309 -50 -179
6069 -179 -133 -146 -147 -16 87 -6 22 87 -96 61 71 -10 -151 -115 288 -75 -127 160 50 253 299 -107 -64 117
6093 117 77 2 191 -231 190 -321 -91 105 30 238 -179 -95 220 -108 -105 44 -198 -29 71 -253 50 -8
6115 -8 -76 12 160 188 148 -204 99 61 -4 42 -65 -208 -27 -64 64 59 -249 -8 -132 -229 67 40 -164 59 -127
$$ packed form
5951a46J29M2J18Rk97J20k42M38J1j75M6P9k08J93k06RJ05r4J25K71n14NO9l2
5975a45J73k01Jj4J20M5l8K12O4j84J85k94N1p0J84l70K22q7J63R7k03J52k16
5998a53K68n1j89p7J23M6K22j18J10k04J5l2q7J19J1P0k83L00K6o7j29P3q7K20
6022A26j72K5J83k89K29pl07J95j45J57j68J73J31j82J10q5j64L7R9LK2o0Q1L6
6046B8q4m1J55J3k12L92l85L19l05j54L12N5n3j83J30j25L26l23K85Lm62K59j29
6069a79M6j3jJ31J03r3K8O5j83J57J0q1j41L6M03l63n2K87j10K03M6m06M3J81
6093A17m0p5J89m22M21n11K30J96p5K08m17Q4L15l28LJ49k42J69J00l24L03n8
6115ho8Q8J48K8m0l52L03l8o5M6j07j43J81l7J28nl08K41j24r7K96k7k04K23j86
$$ plain form
6140 -127 -6 21 -156 221 -128 -3 173 106 98 -97 -283 74 158 188 274 -295 73 395 -97 90 111 6 168
6163 168 -151 -128 90 -117 113 149 -415 218 -189 -44 136 -301 130 131 -69 96 -135 -29 140 -63 -154 102
6185 102 -194 -92 -257 -225 112 -164 -73 75 -236 -29 -15 -309 108 214 -208 102 -72 -50 -3 -166 209 85
6207 85 -140 358 105 -138 85 -351 -185 118 -376 183 182 -115 240 -123 -100 200 -104 -3 24 -452 351 91
6229 91 -44 246 -120 5 182 -132 -19 -169 -135 264 -49 -65 230 -288 -188 214 -118 95 -301 -202 487
6250 487 25 40 -78 -347 291 224 -8 -10 1 98 196 -312 -201 15 22 117 -147 -149 140 -107 -27 76 -377 133
6274 133 43 -160 111 -168 -277 357 16 241 198 -131 -98 134 -130 -193 -98 78 149 -57 270 113 122 190 -187
6297 -187 -202 85 -237 9 241 -119 282 271 -16 73 -19 -175 54 -227 172 77 -327 215 -89 -58 197 -132
$$ packed form
6140a27J21K7j77L77l49J25J76o7qj95j86L57Q4L0Q6n69L68L22m92J87K1j05J62
6163A68l19K3K18k07K30L6n64O33m07J45J80m37M31Jk00J65k31J06J69k03r1K56
6185A02k96J02j65L2L37k76R1J48l11K07J4k94M17J06m22L10j74K2M7j63L75j24
6207H5k25M98k53k43K23m36J66L03m94N59jk97L55l63K3L00l04J01K7m76Q03k60
6229I1j35K90l66J25J77l14J13j50L4L99l13j6K95n18J00M02l32K13l96R9O89
6250D87m62J5j18k69O38o7k32kJ1R7R8n08J11K16PR5k64kK89k47Q0J03m53N10
6274A33r0k03K71k79j09O34l41K25m3l29L3K32k64o3R5J76P1k06L27j57RO8l77
6297a87j5K87l22K46K32l60M01j1k87Q9r2j56K29k81L99r5m04N42l04L1K55l29
$$ plain form
6319 -132 -38 382 -109 104 -1 -147 191 -136 92 260 -340 -76 138 -349 341 175 -142 106 -320 -147
6339 -147 -85 -113 198 40 -108 126 -174 -110 86 -142 -58 63 -181 318 141 -276 352 -165 110 18 -14 50
6361 50 -98 91 -17 0 -294 181 -207 -218 90 70 104 -149 -87 171 23 99 -15 28 120 -73 -22 -93 -96 -185 144
6386 144 -57 45 -8 -410 -11 11 33 158 -25 -232 -135 -6 -17 -38 -268 131 -149 107 -265 -164 -97 -47 -250
6409 -250 -75 117 -157 -54 -38 -143 -22 88 54 62 -228 -36 75 46 12 -136 35 -105 -173 251 -131 -42 232
6432 232 49 8 132 -17 -38 17 9 -136 14 106 100 58 -9 269 12 57 268 -42 181 20 209 79 91 129
6456 129 -144 -110 105 335 93 70 -13 -50 192 -137 297 -65 -167 95 14 47 -29 -201 -164 144 45 11 -48 29
6480 29 29 282 262 63 28 -73 -128 12 -74 -37 103 -80 46 -189 -25 -160 -74 -115 -37 -46 -19 -93 221 -17 -21 100
$$ packed form
6319a32R4M20m91K13j05j46L38l27K28J68o00K64K14m87O90j66l17K48m26J73
6339a47O2k8L11j58j48K34l00O4J96k28Q4J21k44M99j77m17O28n17K75r2l2O4
6361E0j48J89j08J7k94M75l88j1L08k0L4k53O2K58j48P6j14M3R2j93N1p1lq9L29
6386A44k01J02n3m02L99K2K2J25j83k07R7J29j1k1k30L99k80K56l72J01O7N0k03
6409b50J75J92k74J03J6j05J21J10l4Qk90J92J11k9l4j48J71j40o8M24l82Q9K74
6432B32j83m1J24j49k1N5qj45J50R2om2o7K78k57M5K11l10K23j61J89j30J2L8
6456A29k73L4K15K30k42k3q3l7K42l29M34l62j02K62q1L3p6j72L7L08r9l4n9P7
6480B9%K53k0j99l5j01n5J40q6L7J40j83J26k35J64j35Q6m1P8rK7p4L14k38mJ21
$$ plain form
6506 100 42 -65 -116 -107 -170 -7 160 85 -307 99 98 -24 -58 -113 78 146 115 215 -19 -51 -163 222 51 125 4
6531 4 25 11 -89 27 187 25 14 -314 17 84 95 -28 54 -84 164 -27 -188 58 52 233 -8 -44 -2 5 -150
6556 -150 162 -2 -279 4 287 -90 -123 -301 -64 177 28 -39 17 243 -1 -67 98 -174 -131 4 155 82
6578 82 120 275 81 204 -125 -214 38 -30 149 11 40 -100 121 -115 -108 -478 -134 79 113 40 3 -129 104
6601 104 -243 -53 112 -79 96 126 -183 57 2 -100 202 -84 210 39 -70 -43 -109 84 241 -287 64
6622 64 20 -74 10 91 -45 78 -128 -203 41 -253 -105 9 -213 50 -39 -262 135 -74 140 151 -48 64 -9
6645 -9 -94 138 -300 -49 19 -44 -112 105 -108 195 146 22 328 -187 -195 -210 81 76 209 -152 107 -61 -84 -4 -13
6670 -13 181 88 -43 275 -3 -21 138 -115 189 211 -138 35 -133 -236 226 -260 -126 203 -121 131 -19
$$ packed form
6506A00n8j07n1Ro3J63J67p5l92M06jj22l4n5J91O8l1J00k34l2j12L85j71P4j21
6531DK1j4j00J16J60j62j1l28L31O7J1j23Q2j38K48j91j61K46oJ81k41l6M2Pj55
6556a50L12j64k77K83K83l77l3j78K37K41j49o7N6K26k44o6J65k72M3J35J51p3
6578H2L8J55j94J23l29q9K52o8J79j38K9j40K21k36Pl70L44K13L4p3l7j32K33
6601A04l47J90J65j91J75L0l09K40n5j02L02k86K94j71j09K7o6J93J57n28L51
6622F4m4r4Q4Q1j36J23k06p5K44k94J48J14k22K63q9k23L97k09K14J1j99J12p3
6645iq5K32m38K51O8o3o8K17k13L03m9j24L06n15qj5K91nJ33l61K59j68k3Q0r
6670a3J94r3j31L18k78j8J59k53L04K2l49J73j68j03M62m86J34L29l24K52j50
$$ plain form
6691 -19 -145 181 -352 -26 95 -353 265 164 66 116 173 -75 126 -136 -119 -94 -343 -17 89 85 192 54 -130
6714 -130 175 -19 -138 99 -137 88 -129 15 38 -316 140 163 -351 85 -135 -177 13 -207 53 358 -265
6735 -265 -105 135 -361 -2 29 -188 157 103 -72 160 -186 -108 201 44 62 -39 -145 188 -56 -33 2 -164
6757 -164 58 236 -110 131 120 127 -4 -37 -34 212 43 110 -125 -8 -102 -135 -28 -49 -119 261 -69 -176 189 -176
6781 -176 -218 143 -118 149 -69 -159 -197 -108 223 289 -190 -32 -66 -84 116 18 -77 -101 -71 -252 143 -172 58 268
6805 268 -173 238 231 -327 -58 -247 -65 69 19 -5 22 87 182 234 -79 -52 -122 -30 117 113 -17 -18 23 95 -92 -40
6831 -40 71 -41 27 -40 -127 -129 154 -49 211 -115 -68 65 -121 13 -35 -164 -90 134 -22 -10 -67 139 116 -4
6855 -4 110 61 100 127 -103 -82 85 13 -54 99 -126 120 155 -39 28 195 -147 40 24 120 -25 -111 97 -7
$$ packed form
6691a9j26L26n33L26J21m48O18j01r8N0N7k48K01k62J7K5k49L26J06mJ07j38j84
6714a30L05j94j19K37k36K25k17J44K3l54M56K3n14M36k20m2J90k20K60L05o23
6735b65J60K40m96L59L1k17L45n4j75K32l46P8L09j57J8j01j06L33k44K3L5j66
6757a64K22J78l46K41j1Pj31l3LK46j69O7k35J17r4l3J07k1p0L80l30j07L65l65
6781a76m2L61k61K67k18r0l8Q9L31O6m79J58l4j8K00r8r5k4L0j81L95l15K30K10
6805B68m41M11pn58K69j89J82J34n0k4K7O5R5N2l13K7p0R2J47mj30jM1P2j87N2
6831d0J11j12O8o7q7kK83k03K60l26M7J33j86J34m8j29P4K24j56J2n7K06k3j20
6855dJ14m9L9K7k30K1J67p2o7J53k25K46L5j94O7J67l42J87j6R6j45q6K08j04
$$ plain form
6879 -7 82 -228 -119 18 146 6 -10 -7 -51 5 -124 96 82 -18 193 -78 -72 -60 -57 -3 41 42 -30 -75 -205 107 31
6906 31 -113 92 -220 199 42 -240 49 -190 -240 67 130 -50 57 16 0 191 -94 65 87 194 12 -61
6928 -61 231 12 -93 68 -54 -46 -38 7 -156 -71 -30 -33 246 -56 -123 -133 10 -156 -270 79 -32 -10 -46 2 -282
6953 -282 -169 35 -23 197 -187 -75 -148 -18 -164 7 267 3 25 -151 191 20 72 60 -7 -89 177 -155
6975 -155 195 66 -191 18 100 -2 -105 -218 123 114 230 41 40 345 29 -38 152 -199 9 186 -182 -55
6997 -55 106 59 -61 91 102 14 28 -33 86 35 157 119 68 161 27 -86 17 54 -62 100 -276 -49 -92 -2
7021 -2 26 -49 -72 -171 -131 69 133 -82 241 -78 -45 73 115 -30 -171 12 -35 -138 -122 -324 56 183 43 7
7045 7 -34 216 -122 78 -48 -174 129 -281 -64 -245 -51 -122 -163 -67 -91 -104 45 94 -59 -79 -116 11 -95 -3
$$ packed form
6879gQ9l10J09J37J28j40j6Lm4N6j29K20j4j00K11k71OJ2LN4M4Jp2m5j30L12p6
6906C1j44K05l12M19j57k82K89k39n0L07O3j80J07m1j6J91k85J59K2J07j82p3
6928f1K92k19j05J61j22QQM5j63Q5M1lK79l02o7j0J43j66j14L49j11K2l6M8k84
6953b82J13K04n8K20l84J12p3J30j46J71K60k64K2j76L42j71N2j2o7q2K66l32
6975a55L50j29k57K09Q2j02j03j13L41rJ16j89jL05l16o7J90l51K08J77l68J27
6997e5J61m7j20J52J1q8J4o1J19n1J22l8n1R3j34j13J03L7j16J62l76K27m3R0
7021bK8p5k3r9M0K00O4k15L23l19L3J18M2j45j41J83m7j03J6k02L80J27j40l6
7045Gm1K50l38K00j26j26L03m10K17j81J94p1m1R6k4j3J49M9j53k0l7J27j06R2
$$ plain form
7069 -3 13 106 51 -86 135 209 105 99 -94 232 3 -132 194 -178 -221 114 -140 -90 -32 -134 146 -90 7 -119
7093 -119 -76 -95 -14 -48 163 117 -216 95 113 3 -158 -20 -179 0 3 -85 191 -26 -103 -56 123 -14 -244 68
7117 68 126 -45 103 197 92 569 -92 48 95 -135 -13 96 19 -5 -309 -29 81 -79 300 20 -20 181
7139 181 124 79 166 19 84 169 -156 229 -181 32 205 40 227 -253 -129 -50 -158 -76 -74 -162 -106 150 -128 -105
7163 -105 -72 -107 137 -130 -236 298 -113 174 80 -65 50 -230 -113 74 -20 -308 170 -124 -4 -128 -157 234
7185 234 -62 -15 123 11 -274 -68 -180 133 80 -359 199 -42 193 66 37 0 36 -84 228 -139 71 243
7207 243 5 53 85 -324 -47 181 -152 122 -107 -66 -85 -152 -72 -43 -182 196 5 -128 194 -81 25 -27 -81
7230 -81 85 -62 1 106 -130 113 -177 -173 93 147 -143 8 65 -116 43 -354 -3 32 -189 -90 -135 109 -171
$$ packed form
7069cJ6R3n5j37K21P4j04oj93L26k29j35L26l72m3L35k54N0N8j02K80k36R7j26
7093a19M3j9Q1l4K11m6l33L11J8j10j61J38j59J79Lq8K76k17p7M7J79j37k30L12
7117F8N8j71J48R4j05M77o61J40M7k30J22J09p7k4l04K80J10j60L79k80m0K01
7139A81n7m5Q7j47O5Q5l25L85m10K13J73j65J87m80J24P9j08Q2Kq8N6K56k78K3
7163a05L3l5K44k67j06N34m11K87r4j45J15k80J17J87r4k88M78k94J20j24k9L91
7185B34k96M7J38j12k85K06j12L13n3m39N58k41K35j27k9l7L6j20L12l67K10J72
7207B43k38M8L2m09K77K28l33K74k29M1j9o7Q0K9j39L78j91j33L22k75J06n2n4
7230h1J66j47O3J05k36K43k90MK66N4k90J51N7j81J59l97L51L5k21R9m5K44k80
$$ plain form
7253 -171 104 -89 -36 -101 115 19 -186 -12 -56 -153 109 -67 41 4 150 -103 180 61 37 -177 -122 188 -18
7276 -18 -148 88 -63 99 154 35 134 118 75 143 -254 81 271 -155 -95 107 102 116 -54 57 7 33 -109 115
7300 115 -110 126 38 -108 116 -60 34 52 18 101 -167 -203 10 -99 53 127 39 -197 -50 -48 -223 -42 -238
7323 -238 200 -196 -41 78 38 -74 38 -44 -81 -20 -68 -189 -9 159 220 -66 160 189 22 186 64 -75
7345 -75 55 -70 -121 22 -127 196 26 39 123 206 62 -8 -81 18 -7 -141 206 -47 -76 -8 -184 225 -50 79
7369 79 -36 -338 -125 293 82 22 -94 60 200 74 9 258 -43 -12 208 -40 259 -171 18 -30 39 -229
7391 -229 171 21 -85 -279 62 -70 -148 -78 9 -1 -136 20 26 171 8 194 198 78 -205 -103 7 193 -3
7414 -3 -219 124 46 -10 133 142 -70 -358 -150 55 -79 -7 196 -25 93 -150 206 -74 -14 160 114 -52 -146
$$ packed form
7253a71K75j93N3o5K16r6k05J74m4r7K62j76J08l7J46k53K83j19k4k14N5L10k06
7276a8j30K36j51J62N5j19R9j6m3O8l97L35J90m26O0K02nJ4j70J11n0K6j42K24
7300A15k25K36q8j46K24j76R4J8l4Q3k68l6K13j09J52P4q8k36J47Kj75J81j96
7323b38M38l96J55J19m0j12J12q2l7O1m8j21J80J68O1k86K26K9j67J64j22j39
7345g5J30j25n1J43j49L23j70J3Q4Q3j44p0p3R9k5j34L47k53k9O8j76M09k75J29
7369G9j15l02K13M18k11o0j16J54J40j26o5K49l01L1K20k48K99m30J89m8O9k68
7391b29M00j50j06j94L41j32p8P0Q7j0j35J56OJ45j63J86Mj20k83J02J10J86j96
7414ck16L43p8n6J43Rk12k88K08K05j34P2K03k21J18k43L56k80O0J74m6j66r4
$$ plain form
7437 -146 -4 4 -65 -9 -30 -186 163 -117 16 239 -150 184 -14 153 87 83 52 113 138 77 63 -134 4 -188
7461 -188 -134 -60 -168 157 -270 74 148 224 -29 130 -72 -50 -35 29 -125 -191 -175 -131 98 29 100 -67 -7 75 55
7486 55 20 -13 196 143 -180 -103 -48 8 -32 -80 79 221 42 139 194 -213 19 179 -103 -46 -52 -12 -158 -89 23
7511 23 319 -63 -48 -191 -15 363 -187 102 -164 -162 73 5 -44 213 -1 -213 215 -138 104 -38 -60 -206
7533 -206 -18 -95 -113 77 -77 85 90 162 -185 -97 -208 86 -107 140 -64 99 91 38 47 146 152 114 -67 383 219
7558 219 -226 -94 212 -18 85 -40 114 61 -2 37 -93 300 -34 181 -33 11 -184 222 -24 -233 198
7579 198 150 -103 -202 9 68 308 230 41 59 -137 334 -180 -143 95 -191 -73 89 -162 -68 -55 94 217 -92
7602 -92 6 59 -453 94 -150 5 -260 59 -28 -60 -146 102 157 -127 206 47 131 -139 -344 -82 168 86 29
$$ packed form
7437a46J42Qo9N6k1j56L49k80J33K23l89L34j98J67o6ml1O1K5o1j4j97J38j92
7461a88N4P4j08L25m27L44P4P6k53J59k02K2J5O4j54o6J6M4K29o9P1j67O0Q2k0
7486E5l5l3K09n3l23P7N5N6m0m8J59J42j79R7N5m07K32J60k82N7oM0j46O9J12
7511B3K96l82J5j43J76L78n50K89k66KK35o8m9K57k14k12M28l53K42j42k2j46
7533b06J88p7j8J90j54J62NP2l47Q8j11K94j93K47k04J63qn3RR9Ol8j81M50j64
7558B19m45J32L06k30J03j25J54n3o3L9j30L93l34K15k14M4j95M06k46k09M31
7579A98m8k53r9K11N9K40p8j89J8j96M71n14L7K38k86J18J62k51R4J3J49J23l09
7602i2R8N3n12N47k44J55k65L19q7l2q6K48N5k84L33j59Q4k70k05K62K50q2n7
$$ plain form
7625 29 93 -17 6 64 -49 296 -112 56 36 -55 -49 -80 -217 139 -15 93 52 -104 -96 175 47 127 113 158 116
7650 116 -81 143 -26 -241 438 241 -231 30 -180 291 216 -113 117 50 -108 199 16 -33 6 -343 18
7671 18 104 20 30 33 -18 81 -111 -74 252 -160 -73 -178 -58 60 -129 -43 -42 -83 -68 177 -173 -42 56 39 -36 177
7697 177 -54 -74 -191 146 59 -271 230 -10 -75 32 265 -31 39 -170 42 -30 -7 214 -124 -147 62 -111
7719 -111 -142 186 228 196 56 -127 103 116 -8 -45 287 90 10 -166 146 108 5 95 57 219 241 61 178
7742 178 126 -138 151 -45 -110 -48 153 -70 93 -73 16 -10 -52 -55 -25 -81 -67 -58 106 368 106 -16 65 61 111 -160
7768 -160 -264 134 -287 248 -81 -42 13 -132 66 -40 -202 180 -114 -83 -126 132 -99 59 -151 149 31
7789 31 3 256 -60 -113 -2 26 315 115 -158 141 -66 85 11 -128 324 -7 -129 16 141 150 8 74 65
$$ packed form
7625B9O4j10K3N8j13L45m08J68k0r1Ol1j37L56j54J08m1j56QK71j28Q0j4M5m2
7650A16j97K24j69k15O79j97m72K61k10M71p5l29K30o7j58L07j83m9L9l49L61
7671A8Q6q4J0Ln1R9j92L7L26m12Q7j05J20J18j89Q6Jm1J5K45l50J31R8j7p5K13
7697A77k31k0j17L37q7l30N01k40o5J07K33k96P0k09K12p2K3K21l38k3K09j73
7719a11l1L28M2l2j40j83K30J3j24l7L32j97q0j76L12l8j03R0l8J62K2j80J17
7742A78n2k64K89j96o5O2K01k23J63j66Q9k6m2lL0n6J4RJ64K62k62j22Q1mN0k71
7768a60j04L98m21N35l29L9N5j45J98j06j62L82k94L1m3K58k31J58k10L00j18
7789C1k8K53l16n3J11K8K89k00k73K99k07J51p4j39M52l31j22J45J25Rj42O6r
$$ plain form
7812 65 116 7 -64 159 -59 169 64 -244 72 -14 61 -146 -126 37 -11 215 -11 -179 15 -115 -167 107 45
7835 45 224 87 -246 173 12 101 -239 -96 -84 153 51 -109 70 12 151 33 7 113 70 -140 206 7
7857 7 -61 -71 92 2 -264 -146 -29 -74 -227 3 -84 59 5 -172 45 -58 -52 132 -368 -256 -15 1 65 30
7881 30 92 -83 100 -68 -73 -49 99 35 2 32 -276 -110 164 -45 -139 23 -162 -199 -64 -53 -38 -182 116 -70
7905 -70 115 -58 -61 227 -188 22 -296 86 4 -81 -116 26 -131 172 -156 -305 80 -162 90 -16 65 73 159
7928 159 110 189 0 86 96 -124 -15 -105 59 -11 -14 -40 129 15 -301 175 76 -120 -120 98 100 37 112 63 170 159
7954 159 -3 -178 -179 153 -72 111 -78 0 25 146 -269 74 -131 157 49 26 -62 -264 100 -17 13 179
7976 179 108 110 77 -23 22 30 -36 -62 -296 -29 -211 61 -91 169 -90 -7 42 -93 -12 -141 -5 192 -112 84
$$ packed form
7812F5N1j09p1K23k18K28j05l08L16q6P5k07K0J63m8K26k26j68J94j30n2K74o2
7835D5J79j37l33M19j61Q9l40J43J2K37j02j60J79n8J39j18k6J06m3k10L46j99
7857Go8j0J63r0k66J18J17m5j53K30q7J43n4j77K17j03OJ84n00J12K41J6O4l5
7881C0O2j75J83j68nK4J48o4l3L0l08J66K74k09r4J62j85l7J35J1J5j44K98j86
7905g0J85j73lK88m15K10l18L82q2q5l5J42j57L03l28j49L85k42K52j06Q1QQ6
7928A59m9P9j89Q6J0k20J09r0J64p0lk6J69j14l16M76r9j96%K18Ko3P5m9J07j1
7954A59j62j75jL32k25J83j89P8K5J21m15L43k05K88j08k3q8k02L64j17L0J66
7976A79p1Kl3j00M5Qo6k6k34K67j82K72j52K60k59Q3M9j35Q1j29J36J97l04J96
$$ plain form
8000 84 -228 -7 145 37 50 146 182 -179 76 -275 -61 -140 -412 -201 -243 20 19 263 -128 206 40 105 316
8023 316 -133 114 -91 86 146 -89 -21 -34 11 -23 322 -26 99 147 160 -71 188 147 117 134 -106 297 78
8046 78 173 -22 132 12 11 50 -47 76 -108 -136 53 76 19 39 173 33 154 -49 191 104 129 -151 1 8 -89
8071 -89 -164 -116 130 28 -166 -45 77 -3 44 -5 -36 5 10 29 35 5 45 -53 45 12 -150 -10 -156 63 -74 -247
8097 -247 35 188 -190 12 42 -133 169 58 -146 -71 -121 122 225 34 -90 167 161 164 90 -118 117 209 84
8120 84 -104 -60 45 -47 -90 81 -51 165 139 -33 187 16 49 -30 55 131 8 60 133 9 -121 -181 -148 -147 106
8145 106 31 66 -112 228 -154 -145 -36 -66 55 -9 -93 -83 73 77 -64 170 -326 197 43 113 114 36 142 -38 -206
8170 -206 -149 -41 -184 152 163 -109 92 -167 -134 49 135 -112 -172 -123 123 -130 -83 -39 -35 -137 186
$$ packed form
8000H4l12K21J52j08J3R6L6l61K55l51K14p9k72K11m2K63jK44l91L34j66O5K11
8023C16m49K47k05J77O0k35O8j3M5l4L45l48J25M8J3k31K59m1l0J7k40M03k19
8046G8R5j95J54j20jL9r7J23j84k8J89K3n7K0J34j40J21k03K40q7K5k80J52Pr7
8071h9p5M8K46j02j94J21J22q0M7m9l1M1NJ9Ol0M0r8R8l3j62J40j46K19j37j73
8097b47K82J53l78K02L0j75L02j11k04P5n0K43J03j91j24K57oLp4k08K35R2j25
8120H4j88M4J05r2m3J71j32K16k6j72K20j71L3p9Q5P6j23N2P3j24j30o0L3JK53
8145A06p5L5j78L40l82RJ09l0J21o4q4J0J56Mj41K34m96N23j54P0Jp8J06j80j68
8170b06N7J08j43L36J1k72K01k59L3J83Q6k47o0M9K46k53M7M4Mj02L23
8191A86
$$ Imaginary data points
##PAGE= N=2
##DATA TABLE= (X++(I..I)), XYDATA
$$ plain form
0 0 0 0 0 0 0 0 0 0 0 8 -8 8 -8 16 -16 24 -31 36 -43 55 -64 75 -88 107 -128 147 -172 200 -228 265 -304 347
32 347 -395 449 -506 570 -642 721 -806 901 -1003 1115 -1237 1372 -1519 1678 -1854 2044
48 2044 -2252 2481 -2732 3008 -3317 3659 -4038 4463 -4946 5498 -6132 6876 -7758 8824
62 8824 -10143 11829 -14062 17178 -21867 29822 -46959 166958 -233025 -139988 215077 -131992
74 -131992 162360 16535 -199852 2440 71782 129968 -70791 -260435 135099 979
84 979 -87032 147319 -92425 -5954 110805 -57290 233492 -104846 -379476 260024 93372
95 93372 -254888 68762 -52688 -39040 173795 -5890 -76891 -96320 64171 165733 -161629
106 -161629 24386 114622 -210282 128539 139268 -234773 -34265 -35451 33986 177925 -191774
$$ packed form
0@%%%%%%%%%Qj6J6j6K4l2M0n5O7p9R8j19J39j63J95k35K75l19L72m28M93n69O51
32C47p42Q44r55J076j212J363j527J707j904K118k352K609k891L197l532L898
48B044m296M733n213N740o325O976p697Q501r409J0444j1630J3008j4634J6582
62H824j8967K1972k5891L1240l9045N1689p6781K13917l99983R3037L55065l47069
74a31992K94352j45825k16387K02292O9342N8186k00759j89644L95534j34120
84I79q8011K34351k39744Q6471J16759j68095K90782l38338k74630O39500j66652
95I3372l48260L23650j21450J3648K12835j79685p1001j9429J60491J01562l27362
106a61629J86015R0236l24904L38821J0729l74041K00508j186O9437J43939l69699
$$ plain form
117 -191774 -48409 216207 -34145 40732 10988 -132697 49010 16986 18081 -7762 -120527
128 -120527 105875 15082 -80042 157567 -117756 -143550 235143 30216 -71797 29889
138 29889 -41213 110416 27434 -129748 18899 -49365 -5009 93456 -67166 11409 34076
149 34076 -26378 112475 -20812 -81392 46773 -49099 66355 72641 -167502 18371 88751
160 88751 -54759 6474 -65514 -22914 82233 -34124 34457 32689 -65537 57571 4810
171 4810 -40895 23141 -100133 -13555 87913 -46635 -7859 -13034 -18737 91775 -37873 -58505
183 -58505 45502 -19381 31106 24920 -57113 32831 -10025 -46369 45832 -37133 -43770 28005
195 28005 3234 56598 2244 -48703 58289 15103 -20486 4074 -43880 20131 30344 -37739
$$ packed form
117a91774J43365K64616k50352P4877k9744j43685J81707l2024J095k5843j12765
128a20527K26402r0793r5124K37609k75323k5794L78693k04927j02013J01686
138B9889p1102J51629q2982j57182J48647o8264M4356R8465j60622P8575K2667
149C4076o0454J38853j33287o0580J28165r5872J15454O286k40143J85873P0380
160H8751j43510O1233p1988M2600J05147j16357O8581j768r8226J23108n2761
171D810m5705O4036j23274Q6578J01468j34548L8776n175n703J10512j29648k0632
183e8505J04007o4883N0487o186q2033Q9944m2856l6344R2201q2965o637P1775
195B8005k4771N3364n4354n0947J06992m3186l5589K4560m7954O4011J0213o8083
$$ plain form
207 -37739 24848 1305 -26219 36764 -16405 -355 33101 -35314 27912 54083 -15745 -8910
219 -8910 -10969 11605 10716 -52006 -3296 23141 -14263 26184 6109 -11274 32121 -13147 -10941
232 -10941 22238 -18998 -4598 4259 -4840 17957 -21621 -29361 15854 -3010 -16290 -6114 4256
245 4256 27344 -556 -10808 20638 -10471 -19089 -2390 -20070 -1630 -2346 -17415 11099 11805
258 11805 -7152 -6578 -1641 10758 1956 -15853 9484 15622 -5128 -3744 -6604 -511 -4505 -19432
272 -19432 -360 11083 3559 4806 10060 15729 9596 -7205 -3131 8348 -2679 -7442 -152 7965
286 7965 7583 -5465 -2154 7954 2908 -3849 762 12597 12499 2723 1737 7539 3087 -10550 -11599
301 -11599 -1904 1371 -5430 -3484 10838 9494 -557 -2211 3048 2958 -6381 -6500 158 3793 -2835
$$ packed form
207c7739O2587k3543k7524O2983n3169J6050L3456o8415O3226K6171o9828O835
219h910k059K2574q89o2722M8710K6437l7404M0447k0075j7383M3395m5268K206
232a0941L3179m1236J4400Q857r099K2797l9578p740M5215j8864j3280J0176J0370
245D256K3088k7900j0252L1446l1109q618J6699j7680J8440p16j5069K8514P06
258A1805j8957N74M937J2399q802j7809K5337O138k0750J384k860O093l994j4927
272a9432J9072J1443p524J247N254N669o133j6801M074J1479j1027m763P290Q117
286G965l82j3048L311J0108n046o757M611J1835r8r776r86N802m452j3637j049
301a1599R695L275o801J946J4322j344j0051j654N259r0r339j19O658L635o628
$$ plain form
316 -2835 -8754 -2761 17 -7566 -13872 -789 5440 -2265 392 5249 6742 -913 -7868 -5498 -4064
331 -4064 -6463 -9882 -6155 3632 5116 -7592 -1522 9773 -3711 -3762 1265 2493 6149 -2387 726
346 726 7708 -4009 -6817 -1633 -2863 1979 -1387 -688 13694 7114 5611 4154 -4504 12419 624
361 624 -15148 11408 4035 -8005 9158 2706 -125 263 -5259 10964 3412 -5951 10935 -479
375 -479 6627 12572 -18938 -722 5565 -11949 5486 -9008 -5632 17455 -8522 2611 12530
388 12530 -19594 2471 7886 -9556 6594 -16298 -3876 20134 -17308 -3180 -2755 -19605 19916
401 19916 -2420 -18366 15072 -8536 4003 17719 -22775 1302 -2930 -15120 25421 -15774
413 -15774 -19421 19864 -10422 16240 8309 -37882 17998 15310 -11458 16109 -17684 -1825 25476
$$ packed form
316b835n919N993K778p583o306J3083O229p705K657M857J493p655o955K370J434
331d064k399l419L727R787J484j2708O070J1295j3484n1N027J228L656q536L113
346G26O982j1717k808N184j230M842l366O99J4382o580j503j457q658J6923j1795
361F24j5772K6556p373j2040J7163o452k831L88n522J6223p552r363J6886j1414
375d79P106N945l1510J8216O287j7514J7435j4494L376K3087k5977J1133R919
388A2530l2124K2065N415j7442J6150k2892J2422K4010l7442J4128M25j6850L9521
401A9916k2336j5946L3438k3608J2539J3716m0494K4077m232j2190M0541m1195
413a5774l647L9285l0286K6662p931m6191N5880k688k6768K7567l3793J5859K7301
$$ plain form
426 25476 -13139 11661 -9238 -28201 38582 -894 -12723 21901 -27479 18231 36091 -29249
438 -29249 6686 -6645 -11198 47686 -19917 -25835 26693 -13633 17800 13797 -32305 9669 -7011
451 -7011 17765 33916 -55792 5419 37059 -30869 28509 -6861 -56012 38283 12624 -12540
463 -12540 5157 -39059 25331 27260 -32032 16756 -23095 -19535 48764 -14322 -12199 -8399 -29810
476 -29810 56450 -4256 -55006 35660 -26382 -5813 68315 -48719 -31723 32680 -144 23219
488 23219 -25911 -27800 28040 -19735 31216 18328 -76765 27758 38546 -19692 23149 -43787
500 -43787 -8309 63148 -28800 10812 5688 -60003 58922 30795 -50412 6660 -11388 18360
512 18360 31230 -27326 14604 -23617 -13217 86177 -36419 -53158 47489 -19128 22706 28384
$$ packed form
426B5476l8615K4800k0899j8963O6783l9476j1829L4624m9380M5710J7860o5340
438b9249L5935j3331m553N8884o7603n918N2528m0326L1433m003m6102M1974j6680
451g011K4776J6151q9708O1211L1640o7928N9378l5370m9151R4295k5659k5164
463a2540J7697m4216O4390J929n9292M8788l9851L560O8299o3086K123L800k1411
476b9810Q6260o0706n0750R0666o2042K0569P4128j17034J6996O4403l2824K3363
488B3219m9130j889N5840m7775N0951j2888r5093J04523J0788n8238M2841o6936
500d3787L5478P1457r1948L9612n124o5691J18925k8127q1207N7072j8048K9748
512A8360J2870n8556M1930l8221J0400R9394j22596j6739J00647o6617M1834N678
$$ plain form
524 28384 -61613 11738 12901 3040 41321 -59897 -21055 59406 -14457 11294 -9154 -46045
536 -46045 40575 4399 -844 6799 -73031 39579 55987 -61535 14921 -5563 -35335 61362
548 61362 -8285 -33694 3988 -25118 47889 10013 -58549 23464 -14028 -684 53307 -51393
560 -51393 -19337 25217 -9510 46067 -26460 -53410 52480 -5440 -1844 27463 -61455 9073
572 9073 46092 -15896 12031 -33358 -10124 57770 -20932 71 5089 -44106 51877 23049
584 23049 -42949 14958 -19172 10406 46669 -42455 -1209 11947 -20040 52009 -10355 -41282
596 -41282 28411 -9909 19441 18773 -52197 15239 15705 -9386 32773 -39322 -20603 45272 -14610
609 -14610 7822 -3137 -40067 38503 8595 -20829 13292 -34873 8521 36031 -31009 1859
$$ packed form
524B8384q9997P3351J163r861L8281j01218L8842Q0461p3863K5751k0448l6891
536d6045Q6620l6176n243P643p9830J12610J6408j17522P6456k0484k9772R6697
548F1362o9647k5409L7682k9106P3007l7876o8562Q2013l7492J3344N3991j04700
560e1393L2056M4554l4727N5577p2527k6950J05890n7920L596K9307q8918P0528
572I073L7019o1988K7927m5389K3234O7894p8702K1003N018m9195R5983k8828
584B3049o5998N7907l4130K9578L6263q9124M1246J3156l1987P2049o2364l0927
596d1282O9693l8320K9350o68p0970O7436M66k5091M2159p2095J8719O5875n9882
609a4610K2432j0959l6930P8570k9908k9424L4121m8165M3394K7510o7040L2868
$$ plain form
621 1859 -6262 -17479 41637 -13015 -25434 15162 -19549 19098 15216 -38002 10779 -1071 -4197
634 -4197 29641 -31038 -11761 22544 -14764 18562 -985 -32259 23810 3925 -3194 13050
646 13050 -31266 9514 23618 -18335 12192 -9266 -12753 31087 -6708 -5481 7292 -17359
658 -17359 21648 10201 -21034 14342 -6575 -1869 25751 -17106 -4381 9534 -7689 17777
670 17777 -4093 -14825 15883 -5689 3345 12781 -20619 4167 10033 -8485 10811 -9314 -8274
683 -8274 15659 -7966 1345 2357 -16550 11679 3920 -11207 5635 -8294 -625 9496 -11380
696 -11380 553 -148 -9751 11138 -4035 -9428 7191 -7446 1655 4813 -10800 2616 -130
709 -130 -3489 6472 -6676 -3548 6638 -5288 2062 1889 -7601 5850 983 -2101 4967 -4552 1338
$$ packed form
621A859q121j1217N9116n4652j2419M0596l4711L8647l882n3218M8781j1850l126
634d197L3838o0679J9277L4305l7308L3326j9547l1274N6069j9885p119J6244
646A3050m4316M0780J4104m1953L0527k1458l487M3840l7795J227J2773k4651
658a7359L9007j1447l1235L5376k0917M706K7620m2857J2725J3915j7223K5466
670A7777k1870j0732L0708k1572R034R436l3400K4786N866j8518J9296k0125J040
683h274K3933k3625R311J012j8907K8229p759j5127J6842j3929P669J0121k0876
696a1380J1933p01r603K0889j5173n393J6619j4637R101L158j5613J3416k746
709a30l359R961j3148L128J0186j1926P350j73r490J3451m867l084P068r519N890
$$ plain form
724 1338 4934 -3369 3245 241 -2342 6204 -25 -1450 4096 -1273 2783 3128 -2222 4265 268
739 268 -169 4978 -1126 458 3041 -1274 1608 1140 -936 1815 249 336 1212 -1572 945 1166 -1931
756 -1931 609 -390 -1638 507 -1150 -232 -732 -1617 -383 -1037 -1397 -708 -1075 -1947 -51 -1403 -1793 -449
774 -449 -1692 -1179 -1728 -1087 -755 -1552 -1037 -952 -814 -696 -673 -948 -421 -162 -1116 301 -190 179 9 -326
794 -326 849 -268 93 1089 520 615 988 867 992 1231 643 1581 619 991 2631 -533 1335 2380 -366
813 -366 1851 1516 222 1754 -92 1568 1591 -1317 1848 1530 -1422 2754 -646 -1707 3165 -1531
829 -1531 523 1102 -3158 2385 34 -2171 1893 -3080 -1017 2429 -3443 281 -614 -4723 4382 -2071
845 -2071 -4379 3089 -4914 482 2740 -6513 1152 -789 -3624 4811 -4483 -3988 3696 -4104 2452
$$ packed form
724A338L596q303O614l004k583Q546o229j425N546n369M056L45n350O487l997
739B68m37N147o104J584K583m315K882m68k076K751j566Q7Q76k784K517K21l097
756a931K540r99j248K145j657R18n00q85J234o54l60O89l67q72J896j352l90J344
774d49j243N13n49O41L32p97N15Q5J38J18K3k75N27K59r54J417m91L69j70l35
794c26J175j117L61R96n69R5L73j21J25K39n88R38r62L72J640l164J868J045k746
813c66K217l35j294J532j846J660K3k908L165l18k952M176l400j061M872m696
829a531K054N79m260N543k351k205M064m973K063L446n872L724q95m109R105o453
845b071k308P468q003N396K258r253P665j941k835Q435r294M95P684p800O556
$$ plain form
860 2452 508 -7521 5378 -1316 -1760 6902 -9187 25 8485 -6137 3526 57 -6261 8713
874 8713 -378 -1329 4057 -8199 7404 7109 -8951 5849 -1518 -2347 12851 -6287 -1438 4754
888 4754 -6883 12870 1541 -13129 10580 -319 -1956 10999 -9995 -1395 6477 -3135 10237
901 10237 -8697 -8804 16126 -6709 375 7355 -17169 6310 9399 -8249 4872 -11187 -1983
914 -1983 17995 -12954 -1502 3503 -15558 15087 3531 -15328 3336 -7595 7569 9738 -21231
927 -21231 5084 2656 -11039 20086 -8897 -18252 14590 -3279 5016 2013 -20293 11958 2961
940 2961 -5936 15299 -19347 -6269 23582 -7477 1371 -2741 -13306 21652 -111 -7587 9455
953 9455 -20024 11269 23660 -21722 875 2250 -3941 22166 -10138 -9144 8987 -10189 20326
$$ packed form
860B452j944q029J2899o694m44Q662j6089R212Q460j4622R663l469o318J4974
874H713r091r51N386j2256J5603k95j6060J4800p367q29J5198j9138M849O192
888D754j1637J9753j1329j4670K3709j0899j637J2955k0994Q600P872r612J3372
901A0237j8934j07K4930k2835P084O980k4524K3479L089j7648J3121j6059R204
914a983J9978l0949J1452N005j9061L0645j1556j8859J8664j0931J5164K169l0969
927b1231K6315k428j3695L1125k8983r355L2842j7869Q295l003k2306L2251q997
940B961q897K1235l4646J3078K9851l1059Q848m112j0565L4958k1763p476J7042
953I455k9479L1293J2391m5382K2597J375o191K6107l2304R94J8131j9176L0515
$$ plain form
966 20326 5963 -29099 13634 5463 -3257 16633 -20383 -3049 15699 -7522 16013 -10158
978 -10158 -22695 26485 -105 -6924 8642 -22898 8362 17777 -13430 5480 -15688 -5618
990 -5618 31249 -14945 -10125 6489 -16546 20076 7236 -24207 5496 -6635 6664 19390
1002 19390 -28435 -2619 12043 -10659 19269 -8454 -22947 18094 -2329 5178 5668 -28545
1014 -28545 12866 12534 -10660 13964 -17849 -9675 27805 -7597 -500 -844 -18870 25822 5893
1027 5893 -16351 9824 -15693 8598 24954 -21987 -1010 3179 -5432 25881 -10121 -16824 15121
1040 15121 -6891 13085 8849 -27758 10648 7851 -3993 15980 -20247 -6152 20440 -8052
1052 -8052 7962 -3189 -21232 20684 3546 -8473 8019 -20720 6396 19328 -16027 2954
$$ packed form
966B0326j4363l5062M2733q171q720J9890l7016J7334J8748k3221K3535k6171
978a0158j2537M9180k6590o819J5566l1540L1260R415l1207J8910k1168J0070
990e618L6867m6194M820J6614k3035L6622j2840l1443K9703j2131J3299J2726
1002A9390m7825K5816J4662k2702K9928k7723j4493M1041k0423P507M90l4213
1014b8545M1411l32k3194K4624l1813Q174L7480l5402P097l44j8026M4692j9929
1027E893k2244K6175k5517K4291J6356m6941K0977M189q611L1313l6002o703L1945
1040A5121k2012J9976m236l6607L8406k797j1844J9973l6227J4095K6592k8492
1052h052J6014j1151j8043M1916j7138j2019J6492k8739K7116J2932l5355J8981
$$ plain form
1064 2954 -6792 -9178 24388 -8649 -12056 6065 -12318 15320 7154 -23904 7187 -1572 -987
1077 -987 16563 -19613 -5442 11484 -7974 12047 -5772 -18548 16283 -1542 -1205 8040 -19285
1090 -19285 5783 12441 -9218 8071 -9448 -7078 20167 -6634 -2747 4957 -14072 13904 6919
1103 6919 -13110 5896 -5283 2543 15493 -12890 -792 5936 -6861 14454 -3136 -11859 11069
1116 11069 -2886 3976 6790 -14568 6122 6185 -5701 9204 -8539 -5685 13033 -5099 1478
1129 1478 1794 -10877 9618 1968 -6445 5795 -9398 963 10307 -9576 1236 -255 -6760
1142 -6760 9839 -3308 -6988 4446 -5783 3743 4038 -10969 2918 755 -3503 6801 -7071
1155 -7071 -3406 5998 -4598 2967 -893 -7255 5978 -618 -2940 4560 -5921 389 5759 -4669
$$ packed form
1064B954r746k386L3566l3037l407J8121j8383K7638q166l1058L1091q759N85
1077i87J7550l6176J4171J6926j9458K0021j7819j2776L4831j7825L37R245k7325
1090a9285K5068O658k1659J7289j7519K370K7245k6801L887P704j9029K7976o985
1103F919k0029J9006j1179P826J2950k8383J2098O728j2797K1315j7590q723K2928
1116A1069j3955O862K814k1358K0690O3j1886J4905j7743K854J8718j8132O577
1129A478L16j2671K0495p650q413J2240j5193J0361R344j9883J0812j491o505
1142f760J6599j3147l680J1434j0229R526K95j5007J3887k163m258J0304j3872
1155g071L665R404j0596P565l860o362J3233o596k322P500j0481O310N370j0428
$$ plain form
1169 -4669 2872 -783 -3261 6746 -2193 -948 3451 -3987 3971 3288 -4155 3075 -188 -338 5407
1184 5407 -2832 290 3206 -2025 3883 475 -2882 3771 -338 30 2676 -2729 1525 1927 -1582
1199 -1582 2400 -928 -1440 2989 -1494 -584 1474 -2325 746 238 -2096 1239 -1425 -898 1305 -2103
1215 -2103 -413 94 -1891 571 -908 -1910 392 -1629 -786 244 -1944 39 -620 -1678 335 -990
1231 -990 -861 -19 -1028 -502 -268 -972 114 -79 -669 664 -195 -48 759 -174 613 -9 175 865 454
1250 454 604 762 255 417 927 277 1015 832 441 826 577 481 866 296 1342 718 307 1075 341 388
1270 388 604 -94 251 490 -317 643 233 -366 817 -530 -25 413 -740 -9 -387 -603 509 -1168
1288 -1168 -496 277 -1519 -190 515 -2001 -317 -12 -1404 181 -1603 -561 211 -1911 963 -432
$$ packed form
1169d669P541l655k478J0007q939J245M399p438P958o83p443P230l263j50N745
1184E407q239L122K916n231N908l408l357O653m109L68K646n405M254M02l509
1199a582L982l328n12M429m483R10K058l799L071n08k334L335k664N27K203l408
1215b103J690N07j985K462j479j002K302k021Q43J030k188J983o59j058K013j325
1231i90J29Q42j009N26K34p04J086j93n90J333q59J47Q07r33P87o22J84O90m11
1250D54J50J58n07J62N10o50P38j83l91L85k49r6L85n70J046o24m11P68p34M7
1270C88K16o98L45K39q07R60m10n99J183j347N05M38j153P31l78k16J112j677
1288a168O72P73j796J329P05k516J684L05j392J585j784J042P72k122K874j395
$$ plain form
1304 -432 -2632 910 -781 -1398 1136 -1862 -106 731 -2032 1656 -750 -2276 3542 -990 -1017 1742
1320 1742 -1776 977 1153 -1009 2042 -1713 61 4393 -3038 175 3133 -2670 3298 1450 -2228
1335 -2228 3232 -973 1580 3577 -4773 2211 2973 -2823 3778 -865 -2667 3840 -1531 1768 997
1350 997 -5925 5534 1124 -4854 5219 -3655 -2450 6433 -3415 -402 -524 -3787 6074 -2271 -4241
1365 -4241 4478 -6078 1323 5756 -8217 669 -75 -2805 6798 -6538 -3829 6004 -6194 3528
1379 3528 2748 -10508 4129 2368 -2484 3791 -7628 834 6133 -6439 5300 -2486 -8487 11759
1393 11759 -1016 -4606 4656 -7169 5024 6208 -8083 5006 -3034 -2700 13172 -6295 -3973
1406 -3973 5896 -4941 8452 1289 -9608 7568 -2873 2418 10191 -13386 896 9377 -5738
$$ packed form
1304d32k200L542j691o17K534k998J756Q37k763L688k406j526N818m532k7K759
1320A742l518K753J76k162L051l755J774M332p431L213K958n803N968j848l678
1335b228N460m205K553J997q350O984P62n796O601m643j802O507n371L299p71
1350I97o922J1459m410n978J0073q874J205Q883r848L013j22l263R861q345j970
1365d241Q719j0556P401M433j3973Q886p44k730R603j3336K709R833j2198R722
1379C528p80j3256J4637j761m852O275j1419Q462N299j2572J1739p786o001K0246
1393A1759j2775l590R262j1825J2193J184j4291J3089q040L34J5872j9467K322
1406c973R869j0837J3393p163j0897J7176j0441N291P773k3577J4282Q481j5115
$$ plain form
1419 -5738 7584 -3469 -8737 11464 -2136 698 3280 -13251 8463 6814 -8851 5943 -6901
1432 -6901 -3056 13410 -7768 -1260 1393 -9742 13293 103 -12304 7385 -6369 1683 10902
1445 10902 -13870 -229 2647 -4455 12057 -8686 -10048 10955 -5560 4489 3509 -17073 7761
1458 7761 5059 -5384 7982 -12807 -1770 14448 -8198 2761 -1100 -11224 14722 567
1470 567 -7764 5910 -9641 6120 11335 -12774 3702 -602 -4665 16651 -7228 -7309 8228 -6527
1484 -6527 10096 4178 -15277 7530 1549 -522 11209 -13884 -2023 12140 -5480 7532 -4159
1497 -4159 -12005 15267 -791 -2767 4541 -13235 7174 9532 -10256 4390 -5979 -4502 15492
1510 15492 -7738 -4201 4292 -10104 10830 2575 -13132 6002 -4876 1176 11675 -13637 -1740
$$ packed form
1419e738J3322j1053n268K0201j3600K834K582j6531K1714j649j5665J4794j2844
1432f901L845J6466k1178O508K653j1135K3035j3190j2407J9689j3754Q052R219
1445A0902k4772J3641K876p102J6512k0743j362K1003j6515J0049r80k0582K4834
1458G761k702j0443J3366k0789J1037J6218k2646J0959l861j0124K5946j4155
1470E67q331J3674j5551J5761N215k4109J6476m304m063K1316k3879q1J5537j4755
1484f527J6623n918j9455K2807n981k071J1731k5093J1861J4163j7620J3012j1691
1497d159p846K7272j6058j976P308j7776K0409K358j9788J4646j0369J477J9994
1510A5492k3230L537Q493j4396K0934q255j5707J9134j0878O052J0499k5312J1897
$$ plain form
1523 -1740 5414 -6189 10537 -5359 -11556 10405 -2792 1815 3996 -15337 6174 6207 -6168
1536 -6168 6260 -8569 -3530 12738 -6740 -246 807 -9514 11118 1852 -8485 5395 -6762
1549 -6762 3176 11058 -9662 1037 1806 -5024 11264 -3922 -7643 7304 -4448 5938 5199 -11451
1563 -11451 4895 2719 -2653 8222 -8673 -2330 10128 -4377 4305 -1130 -8998 9726 1482
1576 1482 -3588 3888 -7603 2993 7637 -7457 1894 -1480 -4055 9462 -4225 -4460 3771 -5722
1590 -5722 4539 3119 -8863 2996 -1139 -1604 6458 -6909 -2033 4243 -4379 4434 -1356 -7640
1604 -7640 5772 -1085 -1126 3281 -7326 1910 3853 -4431 2881 -2647 -2987 6557 -2584 -1157 2332
1619 2332 -4355 4525 1987 -4341 3841 -2119 185 5265 -3947 406 2526 -2391 4252 -16 -3046
$$ packed form
1523a740P154j1603J6726j5896o197K1961j3197M607K181j9333K1511L3j2375
1536f168J2428j4829N039J6268j9478O494J053j0321K0632r266j0337J3880j2157
1549f762R938P882k0720J0699P69o830J6288j5186l721J4947j1752J0386p39j6650
1563a1451J6346k176n372J0875j6895O343J2458j4505Q682n435p868J8724q244
1576A482n070P476j1491J0596M644j5094R351l374k575J3517j3687k35Q231r493
1590e722J0261j420j1982J1859m135m65Q062j3367M876O276q622Q813n790o284
1604g640J3412o857m1M407j0607R236J943q284P312n528l40R544r141J427L489
1619B332o687Q880k538o328Q182n960K304N080r212M353K120m917O643m268l030
$$ plain form
1634 -3046 3751 -1112 916 2916 -4011 1878 2184 -1883 3366 -1742 -1198 3773 -1505 756 1099 -3046
1650 -3046 3071 833 -1990 1925 -1746 -125 2505 -2753 317 217 -2214 2088 -1193 -1683 1318
1665 1318 -1920 12 870 -2517 600 -317 -1457 1172 -1568 -1018 840 -1661 363 -165 -1919 1004
1681 1004 -535 -787 587 -1113 -183 962 -995 406 106 -800 1057 -420 -190 987 -439 563
1697 563 517 -577 986 514 296 949 -34 353 864 -215 802 624 -108 1055 404 512 934 199 797
1716 797 628 -111 620 291 88 564 -168 97 490 -339 239 339 -238 155 -290 -257 18 -464 -181 -87 -439
1737 -439 -169 -526 -650 84 -661 -791 213 -576 -748 -255 -881 -176 -898 -274 -190 -1206 -162 -239 -867 48
1757 48 -299 -652 192 -664 -221 122 -985 517 444 -917 775 -36 -173 466 -179 403 79 -265 1623
$$ packed form
1634c046O797m863K028K000o927N889L06m067N249n108N44M971n278K261L43m145
1650c046O117k238k823L915l671J621K630n258L070j00k431M302l281m90L001
1665A318l238J932Q58l387L117r17j140K629k740N50J858k501K024n28j754K923
1681A004j539k52J374j700R30J145j957J401l00r06J857j477K30J177j426J002
1697E63m6j094J563m72k18O53r83L87N11j079J017j78p32J163o51J08M22p35N98
1716G97j69p39P31l29k03M76p32K65L93q29N78J00n77L93m45L3K75m82K83R4l52
1737d39K70l57j24P34p45j30J004p89j72M93o26P05p22O24Q4j016J044p7o28R15
1757D8l47l53Q44q56M43L43j107J502p3j361J692q11j37O39o45N82l24l44J888
$$ plain form
1776 1623 32 -361 1769 -279 254 1741 -793 663 985 -313 1839 -108 -236 2160 -596 572
1792 572 1302 -1326 1150 683 -403 1016 -1421 390 2009 -2083 870 582 -2532 2442 91 -1653
1808 -1653 1038 -1469 688 1181 -2740 1111 -477 -1598 2808 -2062 -1764 1771 -2103 1363 -268
1823 -268 -3852 2637 -1035 -1593 2732 -3806 -875 2717 -2495 1084 -1071 -2462 3412 -1372 -599 2081
1839 2081 -4359 2707 2750 -4230 2543 -1185 -767 4972 -2980 -514 2223 -3199 4637 999 -4815 4157
1855 4157 -519 338 4235 -4792 1437 2638 -2444 5414 -2469 -3722 6238 -1865 598 2709 -6125
1870 -6125 3855 2956 -3584 3939 -4336 -807 7284 -5061 206 1007 -4914 6520 -275 -5004 3285
1885 3285 -4423 1980 5074 -8232 1542 920 -3921 6920 -4467 -4550 5450 -4027 3064 1492 -8840
$$ packed form
1776A623j591l93K130k048N33J487k534J456L22j298K152j947j28K396k756J168
1792E72P30k628K476m67j086J419k437J811J619m092K953k88l114M974k351j744
1808a653K691k507K157M93l921L851j588j121M406m870K98L535l874L466j631
1823b68l584O489l672n58M325o538K931L592n212L579k155j391N874m784P73K680
1839B081o440P066M3o980O773l728M18N739p952K466K737n422P836l638n814Q972
1855D157m676Q57L897r027O229J201n082P858p883j253R960q103K463K111q834
1870f125R980q99o540P523q275L529Q091j2345N267Q01n921J1434o795m729Q289
1885C285p708O403L094j3306R774o22m841J0841j1387q3J0000r477P091j572j0332
$$ plain form
1900 -8840 4904 603 -3221 5404 -7415 -1474 7254 -4615 2375 -1663 -6620 8669 -684 -3732
1914 -3732 3935 -7287 4076 6251 -7633 2795 -1435 -2177 9925 -5033 -3350 4981 -4746 6789
1928 6789 2256 -8735 5968 -657 10 7626 -8998 621 6283 -3946 6505 -2613 -7063 9287
1942 9287 -1525 -170 4079 -9619 5139 5772 -6032 4299 -5192 -2361 10939 -5423 -1444
1955 -1444 1758 -6821 8851 920 -8856 4564 -3844 1284 7492 -9975 243 2889 -4500 7925
1969 7925 -4595 -7307 7418 -3466 1915 3045 -10470 4509 2868 -4273 5533 -7390 -2474
1982 -2474 9051 -4752 1707 -456 -8112 9058 550 -5059 4086 -6775 3138 7530 -8031 1754
1996 1754 218 -2940 9572 -4082 -4778 5891 -4028 5239 2715 -8804 5256 708 -1203 6683
$$ packed form
1900h840J3744m301l824Q625j2819N941Q728j1869O990m038m957J5289r353l048
1914c732P667j1222J1363K175j3884J0428m230p42J2102j4958J683Q331r727J1535
1928F789m533j0991J4703o625O67P616j6624R619N662j0229J0451r118m450J6350
1942I287j0812J355M249j3698J4758O33j1804J0331r491K831J3300j6362L979
1955a444L202q579J5672p931r776J3420q408N128O208j7467J0218K646p389J2425
1969G925j2520k712J4725j0884N381J130j3515J4979j641p141R806j2923M916
1982b474J1525j3803O459k163p656J7170q508n609R145j0861R913M392j5561R785
1996A754j536l158J2512j3654o96J0669r919R267k524j1519J4060m548j911P886
$$ plain form
2010 6683 -6851 -657 6807 -4151 4228 -703 -6840 7491 -209 -1543 3762 -7429 3116 5705
2024 5705 -5525 3035 -2924 -2875 8734 -3734 -2232 2224 -5225 5800 1511 -7201 3423 -2086
2038 -2086 -94 5621 -7331 -698 2995 -3688 4581 -2322 -5509 5015 -2522 355 2449 -6987
2052 -6987 2426 2538 -3562 3401 -3877 -2471 5819 -3390 399 692 -4891 4948 821 -3891 2756
2067 2756 -2791 903 4774 -4436 554 1161 -2417 5196 -1764 -2793 4013 -1877 2148 2473 -4566
2082 -4566 2583 1165 -1344 3691 -2701 -633 4044 -2258 1827 544 -3172 3440 -255 -1083 2271
2097 2271 -3057 1021 2842 -2673 1270 -524 -1679 3781 -1590 -1370 1523 -2255 1325 769 -3227
2112 -3227 1341 -268 -964 2015 -2524 -873 1364 -1717 698 -552 -2380 1672 -895 -829 972 -2246
$$ packed form
2010F683j3534O194P464j0958Q379m931o137J4331p700j334N305j1191J0545K589
2024E705j1230Q560n959M9J1609j2468J502M456p449J1025m289q712J0624n509
2038b086J992N715j2952O633L693o683Q269o903l187J0524p537K877K094r436
2052f987R413J12o100O963p278J406Q290r209L789K93n583R839m127m712O647
2067B756n547L694L871r210M990O07l578P613o960j029O806n890M025L25p039
2082d566P149j418k509N035o392K068M677o302M085j283l716O612l695q28L354
2097B271n328M078J821n515L943j794j155N460n371K20K893l778L580n56l996
2112c227M568j609o96K979m539J651K237l081K415j250j828M052k567O6J801l218
$$ plain form
2128 -2246 404 911 -1795 950 -728 -1338 1769 -950 -117 998 -1397 1003 501 -1067 1127 -459
2144 -459 -46 1687 -945 277 980 -380 1086 12 -446 1085 -87 264 999 -395 916 908 -252
2161 -252 897 -70 -28 1182 -295 344 556 -431 754 232 -156 638 -211 -43 403 -131 -66 382 -674
2180 -674 285 -234 -229 86 -761 -257 1 -656 -38 -88 -343 -148 -458 -716 -257 -756 -314 -195 -859 -140 -228
2201 -228 -699 41 -543 -322 -34 -492 -48 -255 -369 -142 58 -261 613 -154 -142 61 -254 539 111 199 392
2222 392 -15 226 623 -56 256 519 -180 425 285 336 701 -18 547 433 -217 722 428 -107 825 -15
2242 -15 420 556 -238 254 45 -149 579 -136 -297 441 -578 183 643 -965 330 -218 -439 732 -1147
2261 -1147 -663 517 -1083 127 -249 -1216 235 -336 -637 524 -1529 17 332 -1414 716 -673
$$ packed form
2128b246K650N07k706K745j678o10L107k719Q33J115k395K400n02j568K194j586
2144d59M13J733k632J222P03j360J466j074m58J531j172L51P35j394J311qj160
2161b52J149r67M2J210j477O39K12r87J185n22l88P94q49J68M46n34O5M48j056
2180f74R59n19NL15q47N04K58o57O18n0k55J95l10k58M59m99M42J19o64P19q8
2201b28m71P40n84K21K88m58M44k07j14K27K00l19Q74p67J2K03l15P93m28Q8J93
2222C92m07K41L97o79L12K63o99O05j40N1L65p19N65j14o50R39k94n35R32q40
2242a5M35J36p94M92k09j94P28p15j61P38j019P61M60j608J295n48k21J171j879
2261a147M84J180j600J210l76r67J451n71l01J161k053J546L15j746K130j389
$$ plain form
2277 -673 -1171 1151 -950 -331 284 -1526 887 199 -1380 1065 -844 -396 1989 -1296 -226 764 -1273
2294 -1273 1883 253 -1384 1593 -633 390 1776 -2074 918 1304 -1095 2519 -677 -971 2383
2309 2383 -758 1122 1119 -2285 2216 762 -1291 2179 -1488 -114 2618 -1726 700 560 -2055 3334
2325 3334 -288 -1831 1881 -2174 963 2081 -3382 720 -113 -1269 3046 -2377 -1881 2060 -2249
2340 -2249 1414 634 -3964 2065 -68 -1331 2441 -3917 -377 2912 -2833 1487 -1169 -3280 4084
2355 4084 -811 -1335 1712 -3902 2352 2578 -3665 1743 -1398 -907 4904 -2699 -1126 1862 -2761 3801
2371 3801 783 -4375 3046 -794 444 4021 -4643 511 2947 -1919 3972 -1793 -3492 5098 -1264
2386 -1264 373 2095 -4971 3147 2667 -3001 2879 -2989 -1195 5797 -3009 196 878 -3974 5082
$$ packed form
2277f73m98K322k101O19O15j810K413o88j579K445j909M48K385l285J070R90k037
2294a273L156j630j637K977k226J023J386l850K992L86k399L614l196k94L354
2309B383l141J880ll404M501j454k053L470l667J374K732m344K426j40k615N389
2325C334l622j543L712m055L137J118n463M102q33j156M315n423M96L941m309
2340b249L663p80m598O029k133j263L772o358L540L289n745M320k656k111P364
2355D084m895n24L047n614O254K26o243N408l141M91N811p603J573K988m623O562
2371C801l018n158P421l840J238L577q664N154K436m866N891n765j699Q590o362
2386a264J637J722p066Q118m80n668N880n868J794O992q806L205O82m852R056
$$ plain form
2401 5082 424 -4115 2785 -2899 1251 4420 -5541 445 1312 -2399 4859 -2934 -3959 4154 -2211
2416 -2211 1916 1189 -6752 3226 1449 -2455 3508 -5061 -1241 5191 -3428 1162 -759 -4711 5734
2431 5734 -428 -3056 2821 -4557 1928 4405 -5119 1543 -534 -2351 6202 -2997 -2734 3157 -3206
2446 -3206 4158 2345 -5814 3129 51 -251 4776 -5290 -523 4565 -2305 3478 -1143 -4470 5661
2461 5661 -352 -915 2594 -4895 2839 3768 -3655 2519 -2024 -1861 6426 -3020 -1086 1817 -3968 4406
2477 4406 1157 -4902 2707 -2053 152 4796 -5318 -447 1666 -2961 4505 -1734 -4536 3893 -1494
2492 -1494 612 1739 -5909 2096 1989 -2860 2922 -3486 -1631 4917 -2990 43 361 -4007 4146
2507 4146 210 -3075 2457 -3121 633 3641 -4214 1105 293 -2167 4321 -1756 -2402 2814 -2121
$$ packed form
2401E082m658m539O900n684M150L169r961N986Q67l711P258p793j025Q113o365
2416b211M127p27p941R978j777l904N963q569L820O432q619M590j921l952J0445
2431E734o162k628N877p378O485K477r524O662k077j817Q553r199K63N891o363
2446c206P364j813q159Q943l078l02N027j0066M767N088o870N783m621l327J0131
2461E661o013n63L509p489P734R29p423O174m543J63Q287r446J934K903n785Q374
2477D406l249o059P609m760K205M644j0114M871K113m627P466o239k802Q429n387
2492a494K106J127p648Q005j07m849N782o408J855O548p907L033L18m368Q153
2507D146l936l285N532n578L754L008p855N319q12k460O488o077o46N216m935
$$ plain form
2522 -2121 2302 1840 -4446 2444 352 -744 3680 -3114 -416 3289 -1831 2079 75 -3170 3787
2537 3787 202 -962 2212 -3032 1213 2855 -2817 1583 -493 -1535 3469 -1555 -933 1935 -2509
2552 -2509 1926 1227 -3013 1811 -597 -711 2541 -2742 -423 1456 -2154 1734 -399 -2584 2161
2567 2161 -794 -114 1191 -2888 611 787 -1827 1080 -1135 -934 2223 -1691 -268 689 -2155 1263
2583 1263 157 -1675 1227 -1125 17 1563 -1609 267 462 -1304 1609 -325 -883 1426 -716
2598 -716 593 858 -1241 914 604 -740 1130 -701 -44 1502 -491 475 543 -917 1095 11 -397
2615 -397 1242 -461 303 767 -849 573 273 -573 830 -357 -92 455 -719 48 345 -504 276 -317
2633 -317 -550 722 -828 -318 217 -696 87 -248 -749 98 -416 -351 138 -793 19 154 -587 80 -46 -497
$$ packed form
2522b121M423m62o286O890k092j096M424o794K698L705n120L910k004l245O957
2537C787l585j164L174n244M245J642n672M400k076j042N004n024O22K868m444
2552b509M435o99m240M824k408j14L252n283K319J879l610L888k133k185M745
2567B161k955O80J305m079L499J76k614K907k215K01L157l914J423R57k844L418
2583A263j106j832K902k352J142J546l172J876J95j766K913j934n58K309k142
2598g16J309K65k099K155l10j344J870j831O57J546j993R66O8j460K012j084m08
2615c97J639j703P64M64j616J422l00q46J403j187K65N47j174P67K97q49P80n93
2633c17k33J272j550N10N35r13P83l35n01Q47n14O5M89r31Q12J35p41O67j26m51
$$ plain form
2653 -497 189 -690 -375 -120 -424 -201 141 -150 129 -232 -411 370 -189 8 232 -173 359 89 -90 126
2673 126 -6 280 438 249 359 378 67 341 258 67 559 276 453 388 58 174 190 4 140 102 -157 198
2695 198 -126 256 239 -308 275 26 -147 263 -315 -132 81 -268 101 -129 -405 56 -531 -333 138 -546
2715 -546 -305 17 -263 117 -411 -392 309 -545 -190 236 -637 342 30 -583 182 -285 -427 403 -633 -22
2735 -22 107 -591 318 179 -497 615 -528 100 411 -787 434 199 -380 990 -465 -235 1011 -359
2753 -359 537 366 -661 884 281 -205 1027 -735 340 1146 -649 847 150 -559 1485 -128 -438
2770 -438 872 -827 573 837 -1086 707 -99 -743 1484 -915 -252 984 -1433 802 260 -1512
2786 -1512 1065 -351 -528 837 -1839 -4 862 -1567 700 -832 -1483 1867 -1045 -531 369 -2059
$$ packed form
2653d97O86q79L15K55l04K23L42k91K79l61j79P81n59J97K24m05N32k70j79K16
2673A26j32K86J58j89J10J9l11K74q3j91M92k83J77o5l30J16J6j86J36l8k59L55
2695A98l24L82j7n47N83k49j73M10n78J83K13l49L69k30k76M61n87J98M71o84
2715e46K41L22k80L80n28J9P01q54L55M26q73R79l12o13P65m67j42Q30j036O11
2735b2J29o98R09j39o76J112j143O28L11j198J221k35n79J370j455K30J246j370
2753c59Q96j71j027J545o03m86J232j762J075Q06j795J496o97p09K044j613l10
2770d38J310j699J400K64j923J793q06o44K227k399O63J236k417K235n42j772
2786a512K577j416j77J365k676J835Q66k429K267j532o51L350k912N14R00k428
$$ plain form
2802 -2059 689 757 -1769 634 -996 -495 2033 -1690 -179 697 -1450 1889 -181 -1837 1594 -888
2818 -888 307 1955 -2439 625 997 -975 2156 -1072 -1372 2539 -861 648 1064 -2519 1748 1081
2834 1081 -873 1654 -1695 12 2702 -1499 514 83 -1993 2963 -215 -1598 1778 -1778 1269
2849 1269 2307 -2782 752 244 -867 2795 -1721 -1528 1714 -1684 1523 516 -3413 1710 23
2864 23 -1074 2044 -3111 -461 2446 -1850 938 -744 -2740 3044 -394 -1332 1336 -2802 1310 1863
2880 1863 -2746 823 -934 -924 3647 -2276 -1225 1470 -1985 2348 347 -3405 2107 -298 214 2669
2896 2669 -3268 248 2054 -1391 2515 -887 -2529 3278 -576 306 1424 -3350 1943 2117 -1812
2911 -1812 1761 -1911 -555 3851 -1636 -325 959 -2057 3247 488 -2802 1911 -1601 925 2630
$$ packed form
2802b059K748O8k526K403j630N01K528l723J511Q76k147L339k070j656L431k482
2818h88J195J648m394L064L72j972L131l228l00L911l400J509M16l583M267o67
2834A081j954K527l349J707K690m201K013m31k076M956l178j383L376l556L047
2849A269J038n089L534n08j111L662m516J93L242l398L207j007l929N123j687
2864B3j097L118n155K650K907m296K788j682j996N784l438r38K668m138M112N53
2880A863m609L569j757J0M571n923J051K695l455M333k001l752N512k405N12K455
2896B669n937L516J806l445L906l402j642N807l854Q82J118m774N293J74l929
2911a812L573l672J356M406n487J311J284l016N304k759l290M713l512K526J705
$$ plain form
2926 2630 -3268 392 1166 -1609 2970 -1541 -2754 2903 -1597 685 1434 -3878 1638 1027 -1675 2391
2942 2391 -2867 -1095 2705 -1926 941 249 -3149 3032 518 -1951 1237 -2551 174 2899 -2921
2957 -2921 782 374 -1470 3039 -1691 -1443 2022 -1175 1860 268 -3033 1963 1216 -696 2505 -2485
2973 -2485 57 2126 -1683 1739 -641 -2356 2721 -348 43 1143 -2587 1029 2130 -1544 1173
2988 1173 -334 -1471 3226 -1367 -898 1348 -1183 2364 609 -2876 1086 -553 -74 2088 -1657
3003 -1657 -292 1062 -1260 1535 -743 -1532 1943 -874 -75 1208 -2259 599 703 -1588 1141 -1533
3019 -1533 -1483 1785 -1892 21 271 -1614 1514 158 -1494 1229 -1466 -43 1792 -2000 57 226
3035 226 -1191 1546 -634 -1070 1354 -733 503 1017 -1853 865 274 -798 1337 -746 -230 1493
$$ packed form
2926B630n898L660P74k775M579m511j213N657m500K282P49n312N516o11k702M066
2942B391n258J772L800m631K867o92l398O181k514k469L188l788K725K725n820
2957b921L703m08j844M509m730K48L465l197L035j592l301M996p47j912L201m990
2973b485K542K069l809L422k380j715N077l069L91J100l730L616J101l674K717
2988A173j507j137M697m593M69K246k531L547j755l485L962j639M79K162l745
3003a657J365J354k322K795k278p89L475k817P99J283l467K858J04k291K729k674
3019a533N0L268l677J913K50j885L128j356j652K723k695J423J835l792K057J69
3035B26j417K737k180m36K424k087J236N14k870K718n91j072K135k083N16J723
$$ plain form
3051 1493 -751 653 436 -1034 1179 181 -237 871 -772 808 1082 -660 473 77 -500 1160
3067 1160 -595 -346 658 -926 1225 819 -1260 1141 73 252 770 -181 240 429 -422 793 -373
3084 -373 -1463 749 -335 -167 128 -1207 283 634 -839 386 -324 -36 -303 -727 209 187 -464 -49
3102 -49 449 -712 615 -395 -237 504 -753 -600 573 -98 982 -101 -175 525 273 -507 -117 -89 147
3121 147 -34 -457 675 527 49 717 24 270 175 -157 277 395 -361 552 110 290 483 55 254 122
3141 122 -43 314 -162 231 255 208 176 181 -151 231 -44 -455 34 -158 -89 -235 -308 -209 -4 -261 114 99 -457
3164 -457 98 -428 -216 -17 -274 -90 -96 -311 -138 -319 -437 326 -411 -101 -52 -290 58 -85 -191 -10 -206
3185 -206 -158 47 -159 11 110 -342 173 -132 -64 347 -35 200 252 -147 337 50 -139 589 67 258 476
$$ packed form
3051A493k244J404k17j470K213r98m18J108j643J580K74j742J133l96n77J660
3067A160j755K49J004j584K151m06k079K401j068J79N18r51M21J89q51J215j166
3084c73j090K212j084J68K95j335J490L51j473J225p10K88k67m24R36k2o51M15
3102d9M98j161J327j010J58P41j257J53J173o71J080j083p4P00k52p80L90K8K36
3121A47j81m23J132j48m78O68o93K46r5l32M34J18p56R13m42J80J93m28J99j32
3141A22j65L57m76L93K4m7l2Nl32L82k75m11M89j92O9j46p3R9K05k57L75j5n56
3164d57N55n26K12J99k57J84ok15J73j81j18P63p37L10M9k38L48j43j06J81j96
3185b06M8K05k06J70R9m52N15l05O8M11l82K35N2l99M84k87j89P28n22J91K18
$$ plain form
3206 476 -34 396 209 -112 578 -102 -100 765 -216 379 366 -453 383 168 -237 441 -447 -2 597 -313 505
3227 505 -79 -790 636 -366 -188 514 -707 152 116 -725 155 -314 -514 722 -404 -251 243 -1034
3245 -1034 262 88 -933 300 -553 -414 954 -1033 113 108 -780 962 -183 -838 589 -383 30
3262 30 662 -1234 647 195 -708 988 -580 -504 1080 -519 741 334 -1109 1061 202 -494 1052
3279 1052 -1044 264 1307 -929 409 95 -658 1657 -334 -571 963 -1053 706 846 -1321 617
3295 617 25 -388 1827 -1256 -632 1086 -1126 834 66 -1777 923 -184 -438 1084 -1581 3
3311 3 1011 -1178 736 -536 -1400 1671 -547 -388 625 -1959 1015 752 -1667 628 -968 -424 2022
3328 2022 -1445 -416 452 -1291 1594 -41 -1642 959 -613 229 1671 -2331 381 1043 -1056 1552
$$ packed form
3206D76n10M30j87l21O90o80KQ65r81N95j3q19Q36k15m05O78q88M45N99r10Q18
3227E05n84p11J426j002J78P02j221Q59l6q41Q80m69k00J236j126J53M94j277
3245a034J296j74j021J233q53J39J368j987J146nq88J742j145o55J427r72M13
3262C0O32j896J881m52r03J696j568P6J584j599J260m07j443K170q59o96J546
3279A052k096J308J043k236J338l14p53K315j991k37J534k016J759J40k167J938
3295F17n92m13K215l083O24J718k212J960p68j843K700j107k54J522k665J584
3311CJ008k189J914j272q64L071k218J59J013k584K974k63k419K295j596N44K446
3328B022l467J029Q68j743K885j635j601K601j572Q42J442m002K712O62k099K608
$$ plain form
3344 1552 -888 -1227 2001 -458 338 499 -1777 1553 945 -1056 1177 -1320 -181 2345 -1042 346
3360 346 132 -1256 2356 54 -1356 1233 -1141 957 1385 -2082 456 151 -605 1923 -1392 -1211
3376 -1211 1577 -1036 1123 123 -2259 1360 180 -598 1213 -2001 -171 1715 -1650 556 -650
3391 -650 -1672 1936 -546 -1178 687 -1759 866 1168 -2057 604 -639 -820 2141 -1432 -651 854
3407 854 -1311 1467 361 -2095 1214 -401 -140 1397 -2024 245 1528 -965 1413 -704 -1354 2183
3423 2183 -198 -289 1088 -1681 1245 1092 -1347 976 -838 -356 2024 -1014 157 655 -1321 1828
3439 1828 147 -1387 890 -744 204 1691 -1814 302 429 -538 1764 -711 -1355 1429 -564 255
3455 255 537 -2129 975 836 -752 899 -1570 -580 1579 -1272 16 35 -1369 1430 -198 -1128 710
$$ packed form
3344A552k440l39L228k459P96J61k276L330o08k001K233k497J139K526l387J388
3360C46k14j388L612k302j410K589k374K098M28l467K538l05p56K528l315J81
3376a211K788k613K159j000k382L619j180p78J811l214J830J886l365K206j206
3391f50j022L608k482o32J865k446K625L02l225K661j243j81K961l573P81J505
3407H54k165K778j106k456L309j615K61J537l421K269J283k493K378k117o50L537
3423B183k381r1J377k769K926j53k439K323j814M82K380l038J171M98j976L149
3439A828j681j534K277j634R48J487l505K116J27r67K302k475o44K784j993Q19
3455B55K82k666L104j39j588J651k469R90K159k851J288J9j404K799j628r30J838
$$ plain form
3472 710 -1114 275 956 -1568 230 -218 -809 1445 -633 -769 998 -683 757 569 -1522 791
3488 791 204 -506 1186 -1138 -267 1243 -585 494 58 -1000 1371 240 -310 863 -729 608
3504 608 904 -657 494 99 -396 1254 -411 -351 559 -719 810 403 -765 564 -182 -116 849 -688
3522 -688 -53 604 -518 488 -79 -546 709 -248 -148 246 -790 169 200 -755 345 -357 -455 498 -708
3541 -708 -276 86 -577 486 -185 -624 427 -377 -264 459 -757 -107 147 -510 347 -38 -212 625 -94
3560 -94 182 321 -332 152 423 -502 286 -240 -144 561 -224 128 330 7 306 -45 -446 318 -181 508 318
3581 318 -133 12 216 -118 407 -200 -19 350 -315 162 304 -441 376 23 -6 302 -130 -174 -176 -323 17
3602 17 -76 -284 35 143 -179 62 -448 -53 407 -235 134 -143 -224 -54 -202 -69 -128 -683 31 -144 -150 39
$$ packed form
3472G10j824J389O81k524J798m48n91K254k078j36J767j681J440j88k091K313
3488G91n87p10J692k324Q71J510j828J079m36j058K371j131n50J173j592J337
3504F08K96j561J151l95m95J650j665O0R10j278J529m07j168J329p46O6R65j537
3522f88O35O57j122J006n67m67J255r57J00L94j036R59L1r55J100p02r8R53j206
3541g08M32L62o63J063o71m39J051q04J13P23j216O50K54o57Q57l85j74Q37p19
3560i4K76J39o53M84K71r25P88n26R6P05p85L52K02l23K99l51m01P64m99O89j90
3581C18m51J45K04l34N25o07J81L69o65M77J42p45Q17l53k9L08m32m4kj47L40
3602A7r3k08L19J08l22K41n10L95M60o42L69k77q1J70j48J33n9n55P14j75oJ89
$$ plain form
3624 39 -129 -356 -139 -416 119 47 -152 194 225 -169 183 31 -107 -66 -68 30 269 -107 336 287 -368 368 -71
3647 -71 -22 123 -15 10 159 -232 283 40 34 313 44 129 381 -284 254 166 -70 382 -235 36 0 -186 355
3670 355 193 -129 351 -106 -30 217 -375 -148 -3 -188 -36 12 -292 140 -420 -1 23 -473 188 90 -634
3691 -634 135 -271 -29 178 -513 126 19 -390 265 -83 -517 64 -249 171 92 -556 340 238 -188 392
3711 392 -275 -126 442 -422 22 115 -581 490 256 -182 413 -105 121 708 -108 437 81 -408 598 -130
3731 -130 -202 261 -395 472 554 -744 634 97 -316 611 -619 271 710 -404 455 210 -826 617 -74
3750 -74 -260 603 -1089 96 612 -758 572 -510 -638 787 -588 -204 309 -918 724 -48 -1122
3767 -1122 372 -854 -333 799 -955 90 292 -697 894 -257 -744 843 -447 146 374 -1475
$$ packed form
3624C9j68k27K17k77N35p2j99L46L1l94L52j52j38M1kR8K39l76M43m9o55P36m39
3647g1M9J45j38K5J49l91N15k43oK79k69Q5K52o65N38q8k36M52o17K71l6j86N41
3670C55j62l22M80m57P6K47n92K27J45j85J52M8l04M32n60M19K4m96O61r8p24
3691f34P69m06K42K07o91O39j07m09O55l48m34N81l13M20p9o48Q96j02m26N80
3711C92o67J49N68q64M44R3o96J071k34m38N95n18K26N87q16N45l56m89J006p28
3731a30p2M63o56Q67Q2j298J378n37m13R27j230Q90M39j114Q59k45j036J443o91
3750g4j86Q63j692J185N16j370J330j082j28J425j375L84N13j227J642p72j074
3767a122J494j226N21J132j754J045K02r89J591j151m87J587j290N93K28j849
$$ plain form
3783 -1475 167 417 -681 812 -548 -652 1436 -211 466 121 -1173 754 -54 -172 824 -1104 23
3800 23 1147 -963 263 231 -833 1714 -386 -483 997 -514 952 619 -1120 827 183 -410 1394
3817 1394 -811 -592 986 -685 586 439 -1434 1027 -338 -338 867 -1591 -106 572 -757 347
3833 347 -402 -1026 1516 -602 -619 541 -1336 567 1058 -1587 428 -1072 -455 1828 -1337 11 677
3850 677 -686 1092 -66 -1002 1183 -469 367 876 -1344 473 970 -1161 825 -492 -794 1388
3866 1388 -1015 222 615 -1281 892 394 -376 1183 -779 47 2171 -879 714 266 -636 1174
3882 1174 -174 140 899 -426 1065 909 -1748 274 279 -534 1200 -638 -927 813 -663 214 77
3899 77 -1316 1140 87 -786 952 -1372 -401 1720 -1235 94 -257 -449 1347 -333 -281 609 -989
$$ packed form
3783a475J642K50j098J493j360j04K088j647O77l45j294J927q08j18R96j928J127
3800B3J124k110J226l2j064K547k100r7J480j511J466l33j739J947o44n93J804
3817A394k205K19J578j671J271j47j873K461j365%J205k458J485O78j329J104
3833C47p49o24K542k118j7J160j877J903M91k645K015j500O17K283l165J348O66
3850F77j363J778j158r36K185j652Q36N09k220J817M97k131J986j317l02K182
3866A388k403J237L93j896K173m98p70J559j962Q26K124l050J593m48r02J810
3882A174j348L14P59j325J491j56k657K022Nq13J734j838k89J740j476Q77j37
3899G7j393K456j053q73J738k324R71K121k955J329l51j92J796j680N2Q90j598
$$ plain form
3916 -989 640 985 -1101 -201 -248 -449 1006 -755 -480 451 -195 812 -177 -686 623 581 31 1106
3934 1106 -1239 89 446 -715 779 9 -928 737 -216 -61 761 -1025 583 686 -850 891 -193
3951 -193 -239 1247 -828 -236 452 -682 1020 45 -862 722 -219 370 647 -733 342 313 -292 565
3969 565 -505 -322 715 -218 220 393 -993 567 154 -314 504 -441 -112 655 -589 116 -283 -551
3987 -551 652 -138 -535 205 -554 65 447 -792 127 -70 -417 589 -319 -401 410 -281 318 47 -467
4006 -467 258 -35 -288 568 -320 76 453 -279 177 73 -415 361 -22 -110 285 -377 314 439 -447 265
4026 265 70 -314 420 -240 -117 439 -70 252 383 -158 471 194 -182 180 -116 24 282 -224 -16 -25 -583
4047 -583 111 -148 -90 201 -365 -18 83 -203 157 -41 -315 414 -377 -305 2 -298 30 -228 -246 28 -224
$$ packed form
3916i89J629L45k086R00m7k01J455j761K75R31o46J007r89n09J309m2n50J075
3934A106k345J328L57j161J494p70r37J665r53J55Q22j786J608J03j536J741j084
3951a93m6J486k075N92O88j134J702r75r07J584r41N89K77j380J075k9o05Q57
3969E65j070J83J037r33M38J73j386J560m13m68Q18r45L29P67j244P05l99k68
3987e51J203p90l97P40p59O19L82j239R19j97l47J006r08q2Q11o91N99k71n14
4006d67P25k93k53Q56q88L96L77p32M56j04m88P76l83q8L95o62O91J25q86P12
4026B65j95l84P34o60J23N56n09L22J31n41O29k77l76L62k96J40K58n06K08rn58
4047e83O94k59N8K91n66L47J01k86L60j98k74P29p91P2L07l00L28k58j8K74k52
$$ plain form
4068 -224 131 -54 -162 -59 134 -96 56 23 -179 -23 -250 -77 -10 -42 -61 45 -165 17 -137 -214 125 143
4090 143 64 77 -94 285 17 249 159 108 222 249 -140 25 381 94 155 228 -40 141 150 -61 339 -11 231
4113 231 98 -72 266 53 -210 116 -247 67 91 147 16 20 -74 268 15 -402 98 -64 6 -186 -139 82
4135 82 -50 242 48 -175 -335 -41 -150 61 -241 -352 -161 66 -73 61 -296 196 -56 -376 162 -284
4155 -284 111 -21 -86 133 171 -109 89 -228 -349 85 -67 115 375 -252 111 35 44 142 158 45 333 -96
4177 -96 346 120 -233 161 31 180 577 -287 -92 274 -245 360 -154 -218 227 -307 -266 456 -423 159 147
4198 147 -448 105 -99 -361 426 -172 -82 -11 -812 154 -25 -209 365 -324 -353 462 -567 -39 0 -441 446
4219 446 -311 -364 342 -138 -69 431 -631 105 216 -246 429 -379 -460 488 -388 16 134 -383 777 27
$$ packed form
4068b24L55j85j08J03J93k30J52l3k02J56k27J73O7l2j9J06k10J82j54p7L39J8
4090A43p9J3j71L79k68K32r0n1J14K7l89J65L56k87O1P3k68J81Rk11M00l50K42
4113B31j33j70L38k13k63L26l63L14K4N6j31Mr4L42k53m17N00j62P0j92M7K21
4135H2j32K92j94k23j60K94j09K11l02j11J91K27j39J34l57M92k52l20N38m46
4155b84L95j32o5K19L8k80J98l17j21M34j52J82K60o27L63p6RR8J6j13K88m29
4177i6M42k26l53L94j30J49L97q64J95L66n19O05n14o4M45n34M1P22q79N82j2
4198A47n95N53k04k62P87n98R0P1q01R66j79j84N74o89k9Q15j029N28L9m41Q87
4219D46p57n3P06m80O9N00j062P36J11m62O75q08q1R48q76M04J18n17J160p50
$$ plain form
4239 27 -311 460 -341 31 687 -352 440 -288 -176 639 -224 -421 514 -212 288 677 -686 522 225
4258 225 -312 816 -156 -135 772 -457 612 180 -626 773 -17 -48 463 -750 272 506 -591 348
4276 348 -252 -655 759 -253 -311 191 -934 585 353 -932 410 -340 -466 816 -866 -30 197 -656
4294 -656 919 -103 -894 629 -371 -28 552 -1063 246 330 -752 444 -554 -574 1102 -407 56
4311 56 377 -901 847 181 -630 467 -593 89 1102 -626 205 128 -735 938 -38 -632 746 -502
4329 -502 154 628 -1136 420 111 -578 1001 -577 -190 894 -500 463 101 -979 871 174 -313
4346 -313 566 -891 46 864 -495 505 -252 -701 1219 -206 -440 491 -840 440 527 -1145 311
4363 311 -149 -433 650 -1048 -303 576 -415 552 22 -996 765 -278 -19 782 -1198 158 794 -493
$$ packed form
4239B7l38P71q01L72O56j039P92p28J12Q15q63j97R35p26N00L89j363J208k97
4258B25n37J128r72K1R07j229J069m32q06J399p90l1N11j213J022K34j097R39
4276C48o00m03J414j012n8N02j125J519k32j285J342p50j26J282j682Q36K27q53
4294f56J575j022p91J523j000L43N80j615J309Q4j082J196r98k0J676j509M63
4311E6L21j278J748o66q11J097j060O82J013j728Q31p7q63J673r76n94J378j248
4329e02O56M74j764J556l09o89J579j578L87J084j394R63l62j080J850o97m87
4346c13Q79j457R37Q18j359J000p57m49J920j425k34R31j331J280Q7j672J456
4363C11m60k84J083j698P45Q79r91R67n30j018J761j043K59Q01j980J356O36j287
$$ plain form
4381 -493 451 -167 -511 1132 -351 -41 477 -691 575 299 -629 702 -486 4 1062 -617 45
4398 45 158 -705 610 -155 -603 733 -235 213 585 -867 384 198 -206 634 -518 -395 830 -479
4416 -479 282 328 -755 922 283 -411 495 -684 33 374 -585 339 -213 -535 596 -502 -448 432 -464
4435 -464 -1 55 -531 178 -483 -186 659 -371 -337 289 -482 454 49 -612 649 -269 -322 402 -481 71
4455 71 264 -626 283 -202 -334 588 -263 -140 135 -327 120 182 -549 446 47 59 618 -225 -12 227 5
4476 5 378 109 -398 96 -214 66 467 -367 -93 208 -353 395 205 -226 396 -249 48 162 -278 41 313
4497 313 -161 165 -225 165 28 -278 76 58 -383 263 -37 -259 227 -254 152 -122 -400 9 203 -410
4517 -410 223 -4 -355 73 -153 -64 107 -125 272 -241 29 64 -212 6 115 -134 58 30 -174 386 -139
$$ packed form
4381d93R44o18l44J643j483L10N18j168J266k76r28J331j188M90J058j679O62
4398D5J13q63J315p65m48J336r68M48L72j452J251j86m04Q40j152J23J225j309
4416d79P61M6j083J677o39o94R06j179P17L41r59R24n52l22J131j098N4Q80q96
4435d64M63N6n86P09o61K97Q45j030L4O26p71R36m05o61J261r18n3P24q83N52
4455G1J93q90R09m85j32R22q51J23K75m62M47O2p31R95l99J2N59q43K13K39k22
4476EL73k69n07M94l10K80M01q34K74L01n61P48j90m31O22o45K97J14m40L19K72
4497C13m74L26l90L90j37l06L54j8m41O46l00k22M86m81M06k74k78M09J94o13
4517d10O33k27l51M28k26Q9J71k32L97n13K70L5k76K18J09k49J92k8k04N60n25
$$ plain form
4538 -139 -74 151 93 41 172 95 261 101 -239 339 48 86 194 -33 -158 170 -102 239 28 49 268 -90
4560 -90 -43 202 -97 71 -29 310 211 -234 -104 -180 -133 242 186 128 104 -168 145 -26 -5 -198 -214 -297 25 53
4584 53 -199 -409 -331 -236 -77 -128 -154 -147 -342 -61 -115 -236 100 -159 -319 -326 -64 -49 -322 -219 -35 -115 -54 55
4608 55 -143 25 93 -257 374 -9 -151 -23 -9 -135 195 -53 159 53 108 160 93 99 276 -42 26 85 -185
4631 -185 189 -188 -12 158 1 -27 160 -81 172 149 11 150 -82 -17 131 -105 -59 -73 -431 90 -7 -81
4653 -81 149 -163 43 193 -498 8 89 -204 195 -266 -307 164 -78 -93 24 -308 176 -67 -261 113 -150
4674 -150 -181 41 -121 4 -2 -349 354 -66 -103 116 -55 23 103 -214 386 4 -283 365 -35 -38 326 -72 195
4697 195 140 -281 291 450 -123 634 35 -100 502 -131 277 90 -326 537 -135 111 271 -280 171 248 -228
$$ packed form
4538a39O5K25n8n2J31p7J66j60l40N78k91L8J08k27j25L28k72L41k11K1K19l58
4560i0M7K45k99J68j00L39r9m45J30p6M7L75n6n8k4k72L13j71K1j93j6q3L22K8
4584E3k52k10P8R5J59n1k6Pj95K81n4j21L36k59j60pK62J5k73J03J84q0O1J09
4608E5j98J68O8l50O31l83j42J28J4j26L30k48K12j06N5N2o7OJ77l18O8N9k70
4631a85L74l77J76J70j57k8J87k41K53k3j38J39k32O5J48k36M6j4l58N21r7p4
4653h1K30l12K06J50o91N06Q1k93L99m61m1M71k42j5J17l32M84k43j94L74k63
4674a50l1K22j62J25ol47P03m20l7K19j71P8Q0l17O00l82k87O48m00lL64l98K67
4697A95n5m21N72J59n73P57n99j35O02o33M08j87m16Q63o72K46J60n51M51P7m76
$$ plain form
4718 -228 121 -150 -279 389 -352 -75 -66 -751 401 49 -482 494 -271 -182 343 -263 133 -53 -529 303 -309
4739 -309 -444 189 -263 31 122 -642 177 191 -395 235 -274 -178 434 -367 273 255 -481 607 45 -246 200
4760 200 -481 -347 603 -629 121 95 -603 696 6 -175 252 -218 260 361 -465 499 -70 -193 743 -542
4780 -542 -163 452 -190 416 38 -405 451 -202 -177 539 -686 285 453 -490 24 -53 -496 495 -118 -220
4800 -220 239 -676 287 355 -682 101 -250 -386 754 -661 -30 451 -440 308 -46 -526 106 -354 84
4819 84 310 -744 259 520 -353 255 -202 -320 476 -279 -96 175 -498 320 69 -369 377 -199 -121 606
$$ packed form
4718b28L49k71j29O68p41K77Ro85J152l52n31R76p65Q9N25o06L96j86m76Q32o12
4739c09j35O33m52K94R1p64Q19J4n86O30n09R6O12q01O40j8p36J088n62k91M46
4760B00o81J34R50j232P50k6o98J299o90j81M27m70M78J01q26R64n69j23R36j285
4780e42L79O15o42O06l78m43Q56o53K5P16j225R71J68r43N14p7m43R91o13j02
4800b20M59r15R63O8j037P83l51j36J140j415O31M81q91P48l54m80O32m60M38
4819H4K26j054J003K61q73O08m57j18P96p55J83K71o73Q18k51m38P46n76P8P27
$$ [...]
8191a61
##END NTUPLES=NMR FID
##END=
