##TITLE=1H_SR32_5
 CDCl3,8 sc, 
 1.03.2021
##JCAMPDX= 6.0         $$ Bruker NMR JCAMP-DX V2.0
##DATA TYPE= NMR FID
##DATA CLASS= NTUPLES
##ORIGIN= UXNMR, Bruker Analytische Messtechnik GmbH
##OWNER= root
$$ XWIN-NMR		Version 3.5
$$ Mon Mar  1 12:52:41 2021 Russian Standard Time (UT+4h)  she@DPX200
##.OBSERVE FREQUENCY= 200.1315066352
##.OBSERVE NUCLEUS= ^1H
##.DELAY= (6, 6)
##.ACQUISITION MODE= SIMULTANEOUS
##.ACQUISITION SCHEME= undefined
##.AVERAGES= 8
##.DIGITISER RES= 18
##SPECTROMETER/DATA SYSTEM= spect
##.PULSE SEQUENCE= zg30
##.SOLVENT NAME= CDCl3
##.SHIFT REFERENCE= (INTERNAL, CDCl3, 0, 15.7039)
##AUDIT TRAIL= $$ (NUMBER, WHEN, WHO, WHERE, WHAT)
$$ ##TITLE= Audit trail, XWIN-NMR		Version 3.5
$$ ##JCAMPDX= 5.01
$$ ##ORIGIN= Bruker BioSpin GmbH
$$ ##OWNER= she
$$ F:/spectra/data/she/nmr/H-F/1/audita.txt
$$ ##AUDIT TRAIL=  $$ (NUMBER, WHEN, WHO, WHERE, WHAT)
(   1,<2021-03-01 12:51:44.84 +0400>,<she>,<DPX200>,
      <created by zg, POWCHK disabled, PULCHK disabled
       configuration hash MD5:
       00 E9 B6 7A A2 85 ED C7 34 08 36 98 17 FE 4E 26
       data hash MD5: 16K
       9B 59 F1 F3 10 16 DC 48 1C A7 B4 6F D0 97 CD 8E>)
$$ ##END=
$$ 
$$ hash MD5
$$ 0F 47 F9 5B 20 FD 9B 93 0E 2C E4 60 3C 03 7E 50
##$RELAX= 
##$RELAX= 
##$RELAX= 
##$RELAX= 
##$RELAX= 
##$RELAX= 
$$ Bruker specific parameters
$$ --------------------------
##$DU= <F:/spectra>
##$EXPNO= 1
##$NAME= <H-F>
##$PROCNO= 1
##$TYPE= <nmr>
##$USER= <she>
##$AMP= (0..31)
100 100 100 100 100 100 100 100 100 100 100 100 100 100 100 100 100 100 
100 100 100 100 100 100 100 100 100 100 100 100 100 100 
##$AQSEQ= 0
##$AQ_mod= 1
##$AUNM= <au_zg>
##$AUTOPOS= <>
##$BF1= 200.13
##$BF2= 200.13
##$BF3= 200.13
##$BF4= 200.13
##$BF5= 200.13
##$BF6= 200.13
##$BF7= 200.13
##$BF8= 200.13
##$BYTORDA= 1
##$CFDGTYP= 0
##$CFRGTYP= 5
##$CHEMSTR= <none>
##$CNST= (0..31)
1 1 145 1 1 1 1 1 1 1 1 1 1 1 1 1 1 1 1 1 1 1 1 1 1 1 1 1 1 1 1 1 
##$CPDPRG= <>
##$CPDPRG1= <>
##$CPDPRG2= <>
##$CPDPRG3= <>
##$CPDPRG4= <mlev>
##$CPDPRG5= <mlev>
##$CPDPRG6= <mlev>
##$CPDPRG7= <mlev>
##$CPDPRG8= <mlev>
##$CPDPRGB= <>
##$CPDPRGT= <>
##$D= (0..31)
0 1.2 0 0 0 0 0 0 0 0.06 0 0.03 0 0 0 0 0.0002 0 0 0 0 0 0 0 0 0 0 0 0 
0 0 0 
##$DATE= 1614588704
##$DBL= (0..7)
120 120 120 120 120 120 120 120 
##$DBP= (0..7)
150 150 150 150 150 150 150 150 
##$DBP07= 0
##$DBPNAM0= <>
##$DBPNAM1= <>
##$DBPNAM2= <>
##$DBPNAM3= <>
##$DBPNAM4= <>
##$DBPNAM5= <>
##$DBPNAM6= <>
##$DBPNAM7= <>
##$DBPOAL= (0..7)
0.5 0.5 0.5 0.5 0.5 0.5 0.5 0.5 
##$DBPOFFS= (0..7)
0 0 0 0 0 0 0 0 
##$DE= 6
##$DECBNUC= <off>
##$DECIM= 32
##$DECNUC= <off>
##$DECSTAT= 4
##$DIGMOD= 1
##$DIGTYP= 9
##$DL= (0..7)
0 120 120 120 120 120 120 120 
##$DP= (0..7)
150 150 150 150 150 150 150 150 
##$DP07= 0
##$DPNAME0= <>
##$DPNAME1= <>
##$DPNAME2= <>
##$DPNAME3= <>
##$DPNAME4= <>
##$DPNAME5= <>
##$DPNAME6= <>
##$DPNAME7= <>
##$DPOAL= (0..7)
0.5 0.5 0.5 0.5 0.5 0.5 0.5 0.5 
##$DPOFFS= (0..7)
0 0 0 0 0 0 0 0 
##$DQDMODE= 0
##$DR= 18
##$DS= 0
##$DSLIST= <SSSSSSSSSSSSSSS>
$$ [...]
##$SUBNAM2= <"">
##$SUBNAM3= <"">
##$SUBNAM4= <"">
##$SUBNAM5= <"">
##$SUBNAM6= <"">
##$SUBNAM7= <"">
##$SUBNAM8= <"">
##$SUBNAM9= <"">
##$SW= 16.9725356469052
##$SWIBOX= (0..15)
0 0 2 0 0 0 0 0 0 0 0 0 0 0 0 0 
##$SW_h= 3396.73913043478
##$TD= 16384
##$TD0= 1
##$TE= 0
##$TE2= 300
##$TE3= 300
##$TEG= 300
##$TL= (0..7)
0 120 120 120 120 120 120 120 
##$TP= (0..7)
150 150 150 150 150 150 150 150 
##$TP07= 0
##$TPNAME0= <>
##$TPNAME1= <>
##$TPNAME2= <>
##$TPNAME3= <>
##$TPNAME4= <>
##$TPNAME5= <>
##$TPNAME6= <>
##$TPNAME7= <>
##$TPOAL= (0..7)
0.5 0.5 0.5 0.5 0.5 0.5 0.5 0.5 
##$TPOFFS= (0..7)
0 0 0 0 0 0 0 0 
##$TUNHIN= 0
##$TUNHOUT= 0
##$TUNXOUT= 0
##$USERA1= <user>
##$USERA2= <user>
##$USERA3= <user>
##$USERA4= <user>
##$USERA5= <user>
##$V9= 5
##$VALIST= <valist>
##$VCLIST= <CCCCCCCCCCCCCCC>
##$VD= 0
##$VDLIST= <DDDDDDDDDDDDDDD>
##$VPLIST= <PPPPPPPPPPPPPPP>
##$VTLIST= <TTTTTTTTTTTTTTT>
##$WBST= 1024
##$WBSW= 4
##$XGAIN= (0..3)
0 0 0 0 
##$XL= 0
##$YL= 0
##$YMAX_a= 259537
##$YMIN_a= -286928
##$ZGOPTNS= <>
##$ZL1= 120
##$ZL2= 120
##$ZL3= 120
##$ZL4= 120
##$ABSF1= 10
##$ABSF2= 0
##$ABSG= 5
##$ABSL= 3
##$ALPHA= 0
##$AQORDER= 0
##$ASSFAC= 0
##$ASSFACI= 0
##$ASSFACX= 0
##$ASSWID= 0
##$AUNMP= <proc_1d>
##$AZFE= 0.1
##$AZFW= 0.1
##$BCFW= 1
##$BC_mod= 2
##$BYTORDP= 1
##$COROFFS= 0
##$CY= 11.3945322036743
##$DATMOD= 1
##$DC= 2
##$DFILT= <>
##$DTYPP= 0
##$F1P= 15.9154993809931
##$F2P= -4.1035820241983
##$FCOR= 0.5
##$FTSIZE= 0
##$FT_mod= 4
##$GAMMA= 1
##$GB= 0.15
##$INTBC= 1
##$INTSCL= 1
##$ISEN= 128
##$LB= 0.24
##$LEV0= 0
##$LPBIN= 0
##$MAXI= 10000
##$MC2= 0
##$MEAN= 0
##$ME_mod= 0
##$MI= 1.114404
##$NCOEF= 0
##$NC_proc= 0
##$NLEV= 6
##$NOISF1= 3.799351
##$NOISF2= 2.8
##$NSP= 1
##$NTH_PI= 0
##$NZP= 0
##$OFFSET= 15.70392
##$PC= 1
##$PHC0= -10761.86
##$PHC1= 12.20094
##$PH_mod= 1
##$PKNL= yes
##$PPARMOD= 0
##$PSCAL= 0
##$PSIGN= 0
##$REVERSE= no
##$SF= 200.130013532006
##$SI= 16384
##$SIGF1= 3
##$SIGF2= 2
##$SINO= 400
##$SIOLD= 16384
##$SREGLST= <1H.CDCl3>
##$SSB= 0
##$STSI= 0
##$STSR= 0
##$SW_p= 3612.71676300578
##$SYMM= 0
##$S_DEV= 0
##$TDeff= 0
##$TDoff= 0
##$TI= <>
##$TILT= no
##$TM1= 0
##$TM2= 0
##$TOPLEV= 0
##$USERP1= <user>
##$USERP2= <user>
##$USERP3= <user>
##$USERP4= <user>
##$USERP5= <user>
##$WDW= 1
##$XDIM= 8192
##$YMAX_p= 0
##$YMIN_p= 0
$$ End of Bruker specific parameters
$$ ---------------------------------
##NTUPLES= NMR FID
##VAR_NAME=  TIME,          FID/REAL,        FID/IMAG
##SYMBOL=    X,             R,               I
##VAR_TYPE=  INDEPENDENT,   DEPENDENT,       DEPENDENT
##VAR_FORM=  AFFN,          ASDF,            ASDF
##VAR_DIM=   8192,          8192,            8192
##UNITS=     SECONDS,       ARBITRARY UNITS, ARBITRARY UNITS
##FACTOR=    0.0002944,     1,               1
##FIRST=     0,             0,               0
##LAST=      2.4114304,     0,               0
##MIN=       0,             -286928,         0
##MAX=       2.4114304,     259537,          0
$$ Real data points
##PAGE= N=1
##DATA TABLE= (X++(R..R)), XYDATA
$$ [...]
$$ plain form
2120 -502 527 51 -836 560 -473 -251 266 -799 31 216 -348 243 -139 -360 559 -174 -283 245 -423
2139 -423 257 92 -400 60 -190 -275 667 -103 80 208 3 285 170 20 273 -19 136 412 -315 139
2159 139 343 31 389 17 75 220 -70 12 226 -317 347 -14 -285 144 -10 -56 100 -165 178 65 -156
2180 -156 114 55 -152 117 62 171 3 -214 339 154 -14 38 -74 6 321 -140 52 -25 -187 -4 -118 -152
2202 -152 -62 -49 -118 -252 -84 193 3 -249 97 -209 55 -24 -261 -257 90 -19 186 -367 82 1 35 7 21
2225 21 -45 -121 131 125 203 -19 44 11 119 -91 281 25 30 335 119 163 -27 22 277 144 287 43 -156 77
2249 77 -88 -277 -43 81 21 63 -233 46 -125 -186 506 -256 -53 313 -163 72 53 -154 254 -74 -53 267
2271 267 -425 26 121 -402 111 -165 -353 182 -331 268 176 -595 269 122 -149 605 151 -757 807 192
$$ packed form
2120e02J029m76q87J396j033K22N17j065Q30J85n64N91l82k21R19p33j09N28o68
2139d23O80j65m92M60k50q5R42p70J83J28k05K82j15j50K53k92J55K76p27M54
2159A39K04l12L58l72N8J45k90Q2K14n43O64l61k71M29j54m6J56k65L43j13k21
2180a56K70n9k07K69n5J09j68k17N53j85j68N2j12Q0L15m61J92p7j62J83j14l4
2202a52R0J3o9j34J68K77j90k52L46l06K64p9k37ML47j09K05n53M49q1L4k8J4
2225B1o6p6K52oP8k22O3l3J08k10L72k56NL05k16M4j90M9K55j33J43k44j99K33
2249G7j65j89K34J24o0M2k96K79j71o1O92p62K03L66m76K35j9k07M08l28K1L20
2271B67o92M51R5n23N13k76j88N35n13N99r2p71Q64j47k71P54m54r08J564o15
$$ plain form
2291 192 681 757 -458 -85 747 -315 40 -195 120 804 9 212 51 -233 598 335 -676 851 6
2310 6 178 536 -316 88 274 47 465 -457 -260 653 -342 -7 80 -913 590 292 -288 520 -509 -13
2330 -13 773 -523 158 48 -392 794 -208 -544 475 -479 293 607 -1039 154 -73 -515 915 -831
2348 -831 -418 526 -367 535 -41 -1105 575 -179 -243 547 -864 -43 711 -911 257 -270 -806 1100
2366 1100 -339 -370 377 -946 626 778 -1031 471 -458 -297 1232 -652 -178 584 -728 780 162
2383 162 -1026 639 -68 390 854 -1258 39 484 -536 942 -444 -832 1136 -101 89 345 -1132
2400 -1132 907 508 -711 792 -727 -281 1517 -950 -176 202 -919 921 -30 -1153 611 -596
2416 -596 205 862 -1631 -57 447 -448 1038 -741 -998 753 -460 452 215 -1353 841 385 -579
$$ packed form
2291A92M89P6j215L73Q32j062L55k35L15O84p95K03j61k84Q31k63j011J527q45
2310FJ72L58q52M04J86k27M18r22J97R13r95L35Q7r93J503k98n80Q08j029M96
2330a3P86j296O81j10m40J186j002l36J019r54P72L14j646J193k27m42J430j746
2348h31M13R44q93R02n76j064J680p54o4P90j411Q21P54j622J168n27n36J906
2366A100j439l1P47j323J572J52j809J502r29J61J529j884M74P62j312J508o18
2383A62j188J665p07M58M64k112J297M45j020J478j386l88J968j237J90K56j477
2400a132K039l99j219J503j519M46J798k467P74L78j121J840r51j123J764j207
2416e96Q01O57k493J574N04q95J486j779k57J751j213R12k37j568K194m56r64
$$ plain form
2433 -579 726 -1049 -281 920 -611 488 -182 -1309 1227 169 -755 698 -929 126 1286 -1164
2449 -1164 255 -47 -576 1540 -460 -674 853 -498 1006 627 -1386 754 176 -110 951 -1087
2465 -1087 -436 826 -427 603 -105 -1047 1000 -56 -361 634 -1146 278 1009 -882 350 -361 -391
2482 -391 1422 -185 -386 347 -654 558 320 -1084 517 -142 -443 875 -944 -398 487 -648 703
2499 703 -187 -911 684 -227 -58 531 -895 476 472 -481 555 -618 -364 1036 -597 -159 104 -780
2517 -780 659 442 -746 302 -457 -40 927 -457 98 436 -532 923 -118 -653 536 -363 524 499
2535 499 -859 129 322 -211 640 -599 -206 604 -256 55 137 -947 468 29 -297 452 -352 138 439
2554 439 -468 244 320 -613 437 161 -355 522 -254 161 333 -326 262 -173 -219 329 -514 -69 181 -176
$$ packed form
2433e79J305j775P68J201j531J099o70j127K536j058r24J453j627J055J160k450
2449a164J419l02n29K116k000k14J527j351J504l79k013K140n78k86J061k038
2465a087O51J262j253J030p08r42K047j056l05R95j780J424P31j891J232p11l0
2482c91J813j607k01P33j001J212k38j404J601o59l01J318j819N46Q85j135J351
2499G03q90p24J595r11J69N89j426J371mr53J036j173K54J400j633M38K63q84
2517g80J439k17j188J048p59M17R67j384N55L38r68J455j041n35J189q99Q87k5
2535D99j358R88J93n33Q51j239L93Q10q60L11Q2j084J415m39l26P49q04M90L01
2554D39r07P12P6r33J050k76n16Q77p76M15J72o59N88m35m6N48q43M45K50l57
$$ plain form
2574 -176 112 -165 -535 80 -30 -223 233 -576 52 308 -361 195 61 -295 295 -283 -168 25 -335 250
2594 250 160 -417 -16 -13 78 355 -108 -28 252 -12 229 -86 -154 190 69 -29 242 -182 -1 135 -178 261
2616 261 21 -142 386 -224 39 308 -220 -28 161 13 205 57 136 67 -124 -292 204 -243 35 61 -174
2637 -174 140 -105 -56 1 -14 -37 -50 -94 205 -297 -224 34 -164 39 -67 -50 18 -101 -7 -24 -208 56 169 -99
2661 -99 101 -153 31 -71 -80 107 148 225 16 -106 -162 -54 -54 174 84 49 -205 138 122 46 99 57 -20 21 71 -20
2687 -20 305 86 111 178 33 -169 69 -98 48 -8 161 94 -61 159 213 -1 235 -44 54 -94 -150 -38 -96
2710 -96 -24 37 -273 -42 -129 -87 156 -219 -12 -14 -301 -15 -28 -276 -258 -204 27 1 -40 132 124 -252 52 -111 -78
2735 -78 -161 135 -56 58 -301 237 144 120 110 6 -44 -3 -123 237 222 37 106 93 270 252 76 102 163 -256
$$ packed form
2574a76K88k77l70O15j10j93M56q09O28K56o69N56j34l56N90n78J15J93l60N85
2594B50r0n77M01LR1K77m63Q0K80k64K41l15o8L44j21r8K71m24J81J36l13M39
2616B61k40j63N28o10K63K69n28J92J89j48J92j48P9o9j91j68M96m47K78K6k35
2637a74L14k45M9N7j5k3j3m4K99n02P3K58j98K03j06J7O8j19R4j7j84K64J13k68
2661i9K00k54J84j02rJ87M1P7k09j22n6J08%K28r0l5k54L43j6p6N3m2p7M1N0r1
2687b0L25k19K5O7j45k02K38j67J46n6J69o7j55K20N4k14K36k79R8j48n6J12n8
2710i6P2O1l10K31q7M2K43l75K07kk87K86j3k48J8N4K31k6m1J72ql76L04j63L3
2735g8q3K96j91J14l59N38r3k4j0j04n0M1j20L60j5j85O9j3J77j8j76K6O1m19
$$ plain form
2759 -256 338 -70 -272 308 46 176 291 -243 206 114 -198 191 -96 -251 253 -68 -181 226 -53 130
2779 130 132 -350 159 -319 -63 180 -196 96 221 -173 225 64 -394 94 -91 59 252 -524 130 64 -209
2800 -209 183 -463 -216 385 -270 156 288 -304 385 -43 -223 179 -378 89 655 -290 284 148 -456 516
2820 516 -61 -241 84 -494 223 366 -644 96 89 -134 628 36 -178 401 -183 257 2 -731 462 44
2840 44 -91 461 -631 101 655 -64 323 -152 -582 746 -55 -286 102 -510 411 493 -666 -131 -413 -425
2860 -425 790 -732 -398 539 -485 529 179 -647 385 -313 -110 523 -790 -4 83 -356 550 -267
2878 -267 -520 594 -113 49 428 -702 349 320 -494 243 -347 -357 793 -391 -34 286 -459 592 144
2897 144 -607 404 -416 193 886 -698 52 2 -357 810 -328 -423 400 -202 151 334 -776 409 249
$$ packed form
2759b56N94m08k02N80k62J30J15n34M49r2l12L89k87j55N04l21j13M07k79J83
2779A30Km82N09m78K56K43l76K92J25l94L98j61m58M88j85J50J93p76O54o6k73
2800b09L92o46K47O01o55M26J32n92O89m28j80M02n57M67N66r45N74j36o04R72
2820E16n77j80L25n78P17J43j010P40pk23P62n92k14N79n84M40k55p33J193m18
2840D4j35N52j092P32N54p19L87m75m30J328q01k31L88o12R21Q2j159N35k82j2
2860d25J215j522L34R37j024J014l50q26J032o98K03O33j313P86Q7m39R06q17
2878b67k53J114p07J62L79j130J051k9q14P37n90j0J150j184L57L20p45J051m48
2897A44p51J011q20O09O93j584P50n0l59J167j138r5Q23o02L53J83j110J185j60
$$ plain form
2916 249 -351 682 -438 -359 925 -163 238 -36 -709 652 -1 -308 91 -594 124 654 -575 252
2934 252 -61 -292 767 -296 -319 161 -308 325 314 -669 131 -215 -259 617 -754 -407 338 -528 396 -141
2954 -141 -619 592 -65 -132 312 -590 106 595 -414 267 -112 -322 970 -219 -163 424 -580 350 181
2973 181 -448 308 -178 12 550 -440 -33 97 -393 573 53 -501 430 -66 164 620 -624 64 331 -169
2993 -169 403 -315 -239 700 -104 55 160 -719 447 39 -338 198 -196 -29 335 -293 161 -56 -411 624
3013 624 -85 -345 351 -252 25 74 -273 -38 22 -231 265 -470 -126 323 -194 71 170 -321 207 -16 -277
3034 -277 220 -355 69 384 -227 122 261 -382 304 88 -39 118 -218 140 347 -157 -58 -80 208 12 -83
3055 -83 -119 221 -304 429 147 -264 75 -69 -61 -81 -498 -61 289 -89 110 75 -226 229 -214 -250 81 -168
$$ packed form
2916B49o00J033j120P9J284j088M01k74o73J361o53l07L99o85P18N30j229Q27
2934B52l13k31J059j063k3M80m69O33j1r83Q00l46m4Q76j371L47P45q66R24n37
2954a41m78J211o57o7M44r02O96M89j009O81l79k10J292j189N6N87j004R30j69
2973A81o29P56m86J90N38r90M07J30m90R66n20n54R31m96K30M56j244O88K67n00
2993a69N72p18P6R39q04J59J05q79J166m08l77N36l94J67L64o28M54k17l55J035
3013F24p09k60O96o03K77M9l47K35O0k53M96p35L44M49n17K65R9m91N28k23k61
3034b77M97n75M24L15o11L49J39o43O86k16j27J57l36L58K07n04R9k2K88j96r5
3055h3l6L40n25P33k82m11L39j44Qk0m17M37L50l78J99l5l01M55m43l6L31k49
$$ plain form
3077 -168 119 54 -162 135 96 -219 191 -271 -106 -110 -188 36 131 -255 22 -213 -75 -36 -18 200 -191 -104 99
3100 99 -263 -197 156 203 61 259 -440 0 -134 -126 183 -268 106 201 -230 126 -25 -413 7 -108 -43 294
3122 294 305 48 150 42 -11 64 -326 3 -35 24 -14 79 -83 39 113 -159 80 -207 -54 239 -56 146 -35
3145 -35 -83 187 117 -3 162 189 3 157 47 251 -124 1 -72 -213 195 275 -49 222 -185 117 8 14 8
3168 8 -156 -60 -26 -80 -164 60 -105 -64 -147 -6 -149 -349 -139 -1 39 -57 -329 -28 210 5 -86 15 -26 109
3192 109 -53 -295 -79 15 -24 -24 -15 -138 200 20 -8 22 -195 322 99 64 180 391 66 10 -308 9 243
3215 243 -206 178 205 -144 -155 -72 55 229 -269 166 -7 -269 133 142 -45 182 -167 -69 71 -180 137 144 -430
3238 -430 97 93 -36 -82 -146 85 58 -83 -14 -34 -10 164 -257 64 216 -147 208 -44 -97 214 -239 20 243
$$ packed form
3077a68K87o5k16K97l9l15M10m62J65mp8K24R5l86K77k35J38L9J8K18l91Q7K03
3100I9l62O6L53M7j42J98o99M40j34QL09m51L74R5m31L56j51l88M20j15O5L37
3122B94J1k57J02j08n3P5l90L29l8N9l8R3j62J22P4k72K39k87J53K93k95K02j81
3145c5m8K70p0j20J65K7j86J54j10K04l75J25p3j41M08Q0l24K71m07L02j09Oo
3168Hj64R6L4n4q4K24j65M1q3J41j43k00K10J38M0r6k72L01K38k05r1J01m1J35
3192A09j62k42K16R4l9%Rj23L38j80k8L0k17N17k23l5J16K11l25n6l18L17K34
3215B43m49L84K7l49j1Q3J27J74m98M35j73k62M02Rj87K27l49R8J40k51L17Pn74
3238d30N27mj29m6o4K31k7j41O9k0K4J74m21L21J52l63L55k52n3L11m53K59K23
$$ plain form
3261 243 -399 147 154 -141 49 -211 -129 400 -81 -84 198 -53 65 241 -212 -7 -40 219 403 -169 170 153
3283 153 -396 443 -313 -510 212 -176 -41 383 -545 141 -80 6 311 -557 -211 439 36 465 388 -449 1017
3304 1017 -208 -408 151 -166 -30 298 -582 45 -846 -289 747 424 -56 290 70 175 433 -268 223
3323 223 194 223 121 201 -202 36 104 80 218 -750 137 -46 -96 713 -301 254 514 -256 360 385 54 902
3345 902 -300 198 461 -399 344 528 -707 390 448 227 -335 -134 175 685 -571 65 -126 278 210
3364 210 -271 -362 286 65 200 305 -413 -170 -417 -749 1453 -3 542 838 -806 160 568 296 748
3383 748 -278 -5 609 327 570 -22 -852 308 -402 -406 1361 -67 254 279 -495 -271 206 125 528 -258
3403 -258 -15 411 167 608 65 -608 372 185 247 370 -722 29 321 -74 300 402 -138 761 256 -335
$$ packed form
3261B43o42N46Pk95J90k60Q2N29m81lK82k51J18J76m53K05l3K59J84n72L39j7
3283A53n49Q39p56j97P22l88J35M24r28O86k21Q6L05q68L46O50m03M29p7q37J466
3304A017j225k00N59l17J36L28q80O27q91N57J036l23m80L46k20J05K58p01M91
3323B23k9K9j02Q0m03K38O8k4J38r68Q87j83n0Q09j014N55K60p70O16K5l31Q48
3345I02j202M98K63q60P43J84j235J097N8k21n62K01L09N10j256O36j91M04o8
3364B10m81r1O48k21J35J05p18K43k47l32K202j456N45K96j644R66M08k72M52
3383G48j026K73O14k82K43n92q30J160p10mJ767j428L21K5p74K24M77q1M03p86
3403b58K43M26k44M41n43o73R80j87O2J23j092P51K92l95L74J02n40Q99n05n91
$$ plain form
3423 -335 121 -115 240 151 -214 -139 37 55 294 -43 -443 326 198 -18 128 -498 236 326 -178 229 -456
3444 -456 -379 596 -13 359 330 -538 439 8 104 549 -202 -51 461 -368 178 -130 -552 320 -367 -183 -193
3465 -193 -85 -22 153 -411 -155 50 59 80 -276 121 40 -190 124 -125 -250 226 -104 -33 212 -134 203 332
3487 332 -407 166 89 156 758 -78 -16 71 -49 176 118 -270 184 -165 -21 274 -29 45 476 -131 3 -62
3509 -62 -251 -17 -36 41 294 -171 262 101 -454 -14 -234 -310 186 -118 -191 217 -357 180 10 10 17 145 -44
3532 -44 122 -267 30 68 -278 -12 32 -16 189 -426 154 156 -370 -10 170 -83 92 6 -143 -38 22 -96 26
3555 26 -353 -100 146 -235 28 -120 -126 57 32 -88 -145 123 71 38 -84 122 268 280 222 -365 -42 62 -58
3578 -58 141 -108 -154 -73 89 38 169 -169 7 54 -149 39 -143 -156 -151 97 -94 22 107 89 -378 -67 236
$$ packed form
3423c35M56k36L55q9l65P5J76J8K39l37m00P69j28k16J46o26P34R0n04M07o85
3444d56P7R75o09L72k9q68R77m31R6M45p51J51N12q29N46l08m22Q72o87J84j0
3465a93J08O3J75n64K56K05RK1l56L97q1k30L14k49j25M76l30P1K45l46L37J29
3487C32p39N73p7O7O02q36O2Q7j20K25n8l88M54l49J44K95l03P4M31o07J34o5
3509f2j89K34j9P7K53m65M33j61n55M40k20p6M96l04p3M08n74N37j70%PJ28j89
3532d4J66l89K97L8l46K66M4m8K05o15N80Kn26L60J80k53J75q6j49J05O0j18J22
3555B6l79K53K46l81K63j48oJ83k5j20n7K68n2l3j22K06J46J2n8n87L23J04j20
3578e8J99k49m6Q1J62n1J31l38J76M7k03J88j82j3NK48j91J16Q5j8m67L11L03
$$ plain form
3601 236 177 -127 -95 293 299 122 96 296 159 -313 277 -61 59 -204 -256 266 78 86 -260 -76 -140 293 -177
3624 -177 490 14 57 105 -92 -209 93 147 27 3 150 17 146 -5 135 52 13 263 -22 -21 155 230 -166
3647 -166 76 -41 69 -60 68 114 105 15 -76 175 -81 -243 -196 12 32 29 -197 -59 -52 -115 -28 111 -44 -73 21
3672 21 174 33 -12 0 21 -38 7 133 -79 144 42 -90 42 -71 146 90 -44 110 3 75 -98 26 -349
3695 -349 -89 -264 -124 177 -183 -222 385 -108 137 46 -213 253 -153 89 22 -65 164 -5 -18 -97 42 -104
3717 -104 304 -91 147 331 -128 175 155 206 381 -202 167 -245 127 260 361 -655 649 324 -163 40
3737 40 -464 -593 -251 -102 112 918 -173 -333 -405 -162 423 392 -188 -95 -356 472 -694 622 -110 -902
3757 -902 849 552 350 -220 -404 -312 120 -186 -193 105 -191 503 80 -308 442 -647 -287 227 0 -967
$$ packed form
3601B36n9l04L2L88Oj77k6K00j37m72N90l38J20k63n2N22j88Ql46J84o4M33m70
3624a77O67m76M3M8j97j17L02N4j20k4J47j33J29j51J40q3l9K50k85JJ76P5l96
3647a66K42j17J10j29J28M6rr0r1K51k56j62M7K08K0lk26J38Po3Q7J39j55k9R4
3672B1J53j41m5J2K1n9M5J26k12K23j02j32J32j13K17n6j34J54j07P2j73J24l75
3695c49K60j75J40L01l60l9O07m93K45r1k59M66m06K42o7q7K29j69j3p9J39j46
3717a04M08l95K38J84m59L03k0N1J75n83L69m12L72J33J01j016J304l25m87K03
3737D0n04j29L42J49K14Q06j091j60p2K43N85l1n80R3k61Q28j166J316p32p92
3757i02J751k97k02n70j84R2M32l06pK98k96O94m23l88P50j089L60N14k27r67
$$ plain form
3777 -967 -792 -56 577 -219 -1301 541 769 -666 -281 -678 1489 1148 -326 605 -14 -299 -406 -466 320
3796 320 -172 -770 -305 896 -696 -477 -538 248 -30 -59 667 328 -516 305 -243 -27 398 -558 -512 -293
3816 -293 117 -338 551 75 -31 -182 -206 269 -747 793 292 -742 190 315 732 -91 153 -53 629
3835 629 -579 67 1350 -178 97 343 -218 107 66 -228 -121 -1097 -91 815 207 788 -744 613
3853 613 342 -119 1371 -470 -243 391 -154 97 -515 -139 165 1653 -21 918 139 -572 835 559
3871 559 100 -777 112 -327 -569 -122 1080 152 290 785 -1036 63 -18 -743 165 -126 -46 -174 -417 -521
3891 -521 273 -590 99 94 -107 1184 439 -355 203 -490 227 379 -63 -240 -72 -127 267 -294 -263 216 -439
3912 -439 407 120 256 47 1016 -237 148 -206 -313 430 -193 -316 39 -495 304 -271 -576 191 -728 -36
$$ packed form
3777i67J75P36O33p96j082J842K28j435L85l97K167l41j474R31o19k85j07o0P86
3796C20m92n98M65J201j592K19o1P86k78k9P26l39q44Q21n48K16M25r56M6K19
3816b93M10m55Q89m76j06j51k4M75j016J540n01j034R32J25M17q23K44k06O82
3835F29j208O46J283j528K75K46n61L25m1k94J07r76J006R06o08N81j532J357
3853F13k71m61J490j841K27O34n45K51o12L76L04J488j674R39p79p11J407k76
3871E59m59q77Q89m39k42M47J202r28J38M95j821J099q1p25R08k91Q0j28k43j04
3891e21P94q63O89nk01J291p45p94N58o93P17J52m42j77J68n5L94n61L1M79o55
3912d39Q46k87J36k09R69j253L85l54j07P43o23j23L55n34P99n75l05P67r19O92
$$ plain form
3932 -36 438 28 -82 -417 -651 564 -802 -247 293 -570 89 -7 -227 -59 -374 -808 312 -145 -400 213
3952 213 473 588 128 -250 -790 -7 -38 21 -443 249 350 -780 -131 -573 -66 462 63 -373 -234 -356
3972 -356 690 418 -23 -16 373 115 385 -44 1 628 95 -180 241 -230 -1060 -472 -859 -213 195 176 -246
3993 -246 -321 -225 125 129 611 -53 -401 -255 -173 74 -266 171 -153 369 172 135 -35 88 -15 -130 -170 292
4015 292 669 -469 -295 -59 -39 -488 -15 459 -287 -753 257 -89 -124 36 -1 -34 -22 258 -59 -69 98
4036 98 -197 -91 -21 -60 69 -57 -84 -50 55 -110 27 82 31 221 -43 0 66 -3 93 -22 -68 -125 -83 42 -51
4061 -51 -43 42 -106 -40 226 12 1 -25 -39 49 -91 -48 153 -114 -300 -87 -328 -59 73 -272 97 46 -200 421
4085 421 -95 322 -37 35 -451 -301 265 -272 -669 -271 270 462 -83 -223 -86 402 560 172 -86 1031
$$ packed form
3932c6M74m10j10l35k34J215j366N55N40q63O59r6k20J68l15m34J120m57k55O13
3952B13K60J15m60l78n40P83l1N9m64O92J01j130O49m42N07N28l99m36J39j22
3972c56J046k72m41PL89k58K70m29M5O27n33k75M21m71q30N88l87O46M08j9m22
3993b46p5R6L50MM82o64l48J46Q2K47l40M37l24N22j97l7j70J23j03j15m0M62
4015B92L77j138J74K36K0m49M73M74p46m66J010l46l5J60l7l3J2K80l17j0J67
4036I8k95J06P0l9J29j26k7L4J05j65J37N5n1J90k64M3O6o9R6j15m6n7M2J25r3
4061e1QQ5j48O6K66k14j1k6j4Q8j40M3K01k67j86K13k41K69J32l45L69n1k46O21
4085D21n16M17l59P2m86J50N66n37l97L98N41J92n45j40J37M88J58l88k58J117
$$ plain form
4105 1031 -505 579 8 215 60 -447 499 215 87 -170 396 124 103 -360 176 -14 90 29 -435 517
4125 517 -349 337 266 -384 -342 387 -226 -247 -124 258 -195 -428 -383 -181 -372 123 -610 332 136 306 -44
4146 -44 -102 -2 -73 -86 -143 66 191 -65 377 238 105 353 -747 121 -161 -301 -261 40 27 309 -272 -15
4168 -15 147 376 89 219 -62 250 17 -556 -185 457 8 -112 368 265 -59 -232 -150 72 480 255 -325
4189 -325 -129 172 -248 -305 345 0 -20 -209 -278 197 226 477 170 -41 89 515 -779 682 -307 -469 -455
4210 -455 -763 -389 187 -126 304 -407 79 64 153 -239 -619 -735 -24 413 -740 722 120 -590 78 -639
4230 -639 -1241 413 403 47 301 123 -495 27 194 382 -403 -345 44 -1140 -714 340 596 471 693 -33
4250 -33 213 49 -1027 367 -397 -149 -255 340 1244 10 -38 492 26 -216 -243 520 42 -546 605 -164
$$ packed form
4105A031j536J084n71K07j55n07R46k84j28k57N66k72k1m63N36j90J04o1m64R52
4125E17q66O86p1o50M2P29o13k1J23L82m53k33M5K02j91M95p33R42j96J70l50
4146d4n8J00p1j3n7K09J25k56M42j39j33K48j100Q68k82j40M0L01j3K82n81K57
4168a5J62K29k87J30k81L12k33n73L71O42m49j20M80j03l24j73Q2K22M08k25n80
4189c25J96L01m20n7O50l45k0j89o9M75K9K51l07k11J30M26j294J461r89j62J4
4210d55l08L74N76l13M30p11M86j5Q9l92l80j16P11M37j153J462o02p10O68p17
4230f39o02J654j0l56K54j78o18N22J67J88p85N8L89j184M26J054K56j25K22p26
4250c3K46j64j076J394p64K48j06N95R04j234m8N30m66k42k7P63m78n88J151p69
$$ plain form
4270 -164 861 340 -477 300 -649 -469 -1012 475 805 -5 464 -563 -273 -44 300 -676 27 -373 233
4289 233 -165 -547 552 678 -291 -96 -583 -387 56 168 565 -143 34 554 -273 471 401 -690 642
4308 642 -316 193 -93 -258 -11 -161 115 -37 19 -504 487 -172 -79 134 -289 -195 -117 -267 -479 -442 -180 329
4330 329 -116 -621 -187 -998 -220 -284 -238 -474 408 228 -202 -362 -775 -235 -138 -10 -508 -347 -198 77 -312
4351 -312 372 175 662 -749 44 357 925 -307 409 -183 857 -356 -520 143 -124 -335 -220 105 -248
4370 -248 -3 325 -13 -33 -19 10 -201 -334 -248 421 -223 -220 -33 229 392 -261 410 -125 346 105 -85 -55
4392 -55 -13 -100 646 485 -143 187 -65 342 135 -184 -168 344 8 194 -86 -353 437 391 -21 -34 -175 107
4414 107 -235 787 -96 -251 413 247 99 430 151 -86 24 1014 -201 34 -87 364 43 -162 326
$$ packed form
4270a64J025n21q17P77r49J80n43J487L30q10M69j027K90K29L44r76P03m00O06
4289B33l98l82J099J26r69J95m87J96M43J12L97p08J77N20q27P44p0j091J332
4308F42r58N09k86j65K47j50K76j52N6n23R91o59R3K13m23R4P8j50k12L7K62N09
4330C29m45n05M34q11P78o4M6k36Q82j80m30j60m13N40R7J28m98J61J49K75l89
4351c12O84j97M87j411P93L13N68j232P16n92J040j213j64O63k67k11J15L25l53
4370b48K45L28l38k0J4K9k11j33Q6O69o44LJ87K62J63o53O71n35M71k41j90L0
4392e5M2q7P46j61o28L30k52M07k07l19J6N12l36J86k80k67P90m6m12j3j41K82
4414A07l42J022q83j55O64j66j48L31k79k37J10R90j215K35j21M51l21k05M88
$$ plain form
4433 326 -109 161 -303 76 188 96 -461 425 256 -24 -67 99 335 161 133 61 -156 512 582 211 -108 445
4455 445 116 -5 14 -385 169 -361 96 165 427 -301 -295 -845 -439 -218 -446 266 -261 142 -117 -292 655
4476 655 -154 -242 175 -172 157 446 10 -499 -208 -737 -162 175 272 316 -1188 -127 533 493 204 591 784
4497 784 -249 -282 -348 450 -264 304 -346 -434 -97 53 -312 -538 -181 345 357 246 250 24 251 507 83 175
4519 175 482 68 307 434 -539 216 -98 -229 206 475 -39 -113 -2 57 277 -47 -96 432 65 270 396
4540 396 -183 65 -314 -306 -13 878 -34 -331 242 295 584 150 127 378 -498 -272 -163 661 252 75 -19 -159
4562 -159 -247 342 -60 -242 12 -37 -127 -100 551 301 -155 -288 37 -493 -85 -212 314 82 -76 -29 -184 -307
4584 -307 147 187 -166 -195 -128 573 -244 -118 -167 -219 -14 -369 -112 403 111 133 114 141 -279 131 -134 279 116
$$ packed form
4433C26m35K70m64L79J12r2n57Q86j69k80m3J66K36j74k8p2k17O68P0l71l19N53
4455D45l29j21J9l99N54n30M57O9K62p28On50M06K21k28P12n27M03k59j75R47
4476F55q09q8M17l47L29K89m36n09K91n29N75L37R7M4j504J061O60m0k89L87J93
4497G84j033l3o6P98p14N68o50q8L37J50l65k26L57N26J2j11Mk26K27K56m24R2
4519A75L07m14K39J27r73P55l14j31M35K69n14p4J11N9K20l24m9N28l67K05J26
4540C96n79K48l79QK93Q91r12k97N73N3K89m34k3K51q76K26J09Q24m09j77r4j40
4562a59q8N89m02j82K54m9r0K7O51k50m56j33L25n30M08j27N26k32j58M7j55j23
4584c07M54M0l53k9O7P01q17J26m9n2K05l55K57N15k92K2j9K7m20M10k65M13j63
$$ plain form
4607 116 -193 45 163 -286 -319 -51 -224 -385 176 93 397 -721 -130 85 -508 -153 88 225 155 -281 -156
4628 -156 -19 202 -94 -218 -403 -281 -13 35 -638 250 -375 251 332 92 120 -156 134 -90 -552 101 9
4649 9 -374 -36 66 -547 -66 -263 132 386 -270 298 -100 -235 -119 -144 298 255 299 344 -227 -302 -34 442
4671 442 105 66 -105 -196 -171 -168 -73 311 -119 -174 -627 138 -136 190 63 360 -51 -171 12 270 203 -42 -9
4694 -9 -130 -317 42 -263 -68 34 -126 -103 170 86 -22 -51 95 -160 -80 -404 82 -152 128 -59 97 -59
4716 -59 -221 220 -60 151 -127 179 132 153 130 -107 -35 63 154 112 -142 -266 224 160 27 124 -94 -164 -65 -225
4740 -225 140 -180 -2 166 -254 82 43 206 32 -84 -214 90 16 133 15 -116 -94 41 -44 -25 -64 -113
4762 -113 191 15 49 103 -40 -47 -23 -226 125 -227 289 -145 207 164 -15 -266 -136 17 -12 -242 -170 -169 -150 -25
$$ packed form
4607A16l09K38J18m49l3K68j73j61N61q3L04j118N91K15n93L55K41J37p0m36J25
4628a56J37K21k96j24j85J22K68M8o73Q88o25O26Q1k40K8k76K90k24m62O53r2
4649Il83L38J02o13M81j97L95K54o56N68l98j35J16k5M42m3M4M5n71p5K68M76
4671D42l37l9j71r1K5LR5L84m30n5m53P65k74L26j27K97m11j20J83K58o7k45L3
4694ij21j87L59l05J95J02j60K3K73q4j08k9J46k55Q0l24M86k34K80j87J56j56
4716e9j62M41k80K11k78L06m7K1k3k37P2R8R1m2k54j24M90o4j33R7k18p0R9j60
4740b25L65l20J78J68m20L36l9J63j74j16j30L04p4J17j18j31K2J35q5J9l9m9
4762a13L04j76L4N4j43pK4k03L51l52N16m34L52m3j79k51J30J53k9k30P2JJ9J25
$$ plain form
4786 -25 96 -19 -568 66 90 16 597 661 -886 -70 -493 -269 -460 873 235 -241 -531 -145 -26 -598 -54
4807 -54 -169 -490 462 -355 111 -105 20 -376 70 418 143 101 122 106 -55 127 -59 -125 48 -130 199 77
4829 77 -50 144 -593 27 -32 -114 -372 281 87 29 -110 -283 324 -421 222 -292 196 642 -85 366 -553
4850 -553 244 -15 263 368 137 -43 820 120 -222 -264 849 268 262 496 357 -975 708 -478 -524 250
4870 250 199 602 -203 -56 442 289 403 116 5 -527 775 461 -393 10 113 -293 26 458 -94 -222
4890 -222 -277 -141 370 -247 -291 974 -200 -152 -706 204 -239 -253 -319 154 -275 -302 -242 16 80 185 330 -26
4912 -26 455 -59 68 -247 -25 869 -478 464 -291 -13 -199 149 -540 478 171 565 100 -150 -181 301
4932 301 268 -297 129 -64 348 122 301 -129 610 85 127 -796 -67 -145 242 93 86 373 -537 95 186 286
$$ packed form
4786b5J21j15n49O34K4p4N81O4j547Q16m23K24j91J333o38m76k90L86J19n72N44
4807e4j15l21R52q17M66k16J25l96M46L48k75m2K1j6j61J82j86o6J73j78L29j22
4829G7j27J94p37O20n9q2k58O53j94n8j39j73O07p45O43n14M88M46p27M51r19
4850e53P97k59K78J05k31j80Q63p00l42m2J113n81oK34j39j332J683j186m6P74
4870B50n1M03q05J47M98j53J14k87j11n32J302l14q54M03J03m06L19M32n52j28
4890b22n5J36N11o17m4J265j174M8n54R10m43j4o6M73m29k7O0K58O4J05J45l56
4912b6M81n14J27l15K22Q94j347R42p55K78j86L48o89J018l07L94m65k50l1M82
4932C01l3n65M26j93M12k26J79m30P39n25M2r23P29p8L87j49pK87r10O32R1J00
$$ plain form
4954 286 27 666 -335 -808 -337 876 399 -724 -116 -395 244 597 642 -105 -241 112 49 -108 87 443
4974 443 571 5 38 -587 210 -117 -164 37 796 -304 331 -485 -453 774 -510 -200 205 534 97 875
4994 875 -152 -245 -344 74 -267 661 -99 476 -487 -464 -272 -610 464 -833 -94 -36 425 -338 289 -448
5014 -448 150 -244 -155 225 -302 130 -23 393 -80 -186 -248 59 87 360 -87 264 -513 -569 0 183 202 43
5036 43 348 25 -261 791 8 -612 66 152 -36 -360 -96 127 341 300 201 18 240 482 250 -14 661
5057 661 -748 -363 -245 -130 -193 -197 307 102 -389 -177 21 -71 161 -143 351 -345 1 -26 29 -138 139 215
5079 215 458 -63 283 385 45 196 -303 -22 -386 218 271 15 -120 277 -32 76 53 -256 243 -47 -138
5100 -138 -134 65 -29 146 -22 97 130 -90 31 -120 -120 -71 -73 -119 -270 -169 -268 -351 -116 325 -350 645 -68 -252
$$ packed form
4954B86k59O39j001m73M71J213m77j123O08k79O39L53M5p47j36L53o3j57J95L56
4974D43J28n66L3o25P97l27m7K01P59j100O35q16L2J227j284L10M05L29m37P78
4994H75j027r3r9M18l41R28p60N75r63K3J92l38J074j297P39N8M61p63O27p37
5014d48N98l94Q9L80n27M32j53M16m73j06o2L07K8K73m47L51p77n6N69J83J9j59
5036D3L05l23k86J052p83o20O78Q6j88l24K64K23K14m1r9j83K22K42k32k64O75
5057F61j409L85J18J15o3mN04k05m91K12J98r2K32l04M94o96L46k7N5j67K77P6
5079B15K43n21L46J02l40J51m99K81l64O04N3k56j35L97l09J08k3l09M99k90r1
5100a38MJ99r4J75j68J19L3k20J21j51%M9km6j51J01r9q3K35M41o75R95p13j84
$$ plain form
5124 -252 6 -362 -101 113 -445 -396 -19 -205 191 -147 123 -62 -3 -249 85 -124 88 -186 -87 14 -132
5145 -132 57 -152 127 64 100 -57 -322 -92 5 47 -121 -58 -88 286 100 92 -23 27 -71 169 153 47 55 9 -370
5170 -370 -80 -121 -424 -186 -126 40 59 35 396 -314 75 291 289 121 102 -118 285 -52 -366 112 -107 -238
5192 -238 -17 -347 312 -414 206 -316 -150 3 -470 -623 -179 140 -24 -198 21 -604 -824 201 -460 405
5212 405 -478 -671 118 265 296 310 -160 45 378 -704 -102 226 -241 165 -337 622 -715 -231 665 -491
5232 -491 0 -318 -124 -430 648 -43 41 -115 362 203 211 -93 -29 345 193 666 354 -127 167 -596 -208
5253 -208 442 -116 -97 -376 -158 -198 60 610 80 -183 -192 193 110 -389 213 723 -149 -235 -79 -236 54 -240
5275 -240 -385 -142 -11 -211 139 -118 -142 209 22 -325 -119 110 92 90 -255 -240 78 -504 -136 -68 -392 -174
$$ packed form
5124b52K58l68K61K14n58M9L77j86L96l38K70j85N9k46L34k09K12k74R9J01j46
5145a32J89k09K79o3L6j57k65K30R7M2j68O3l0L74j86qj15N0r8K40j6j06Qm6l79
5170c70K90m1l03K38O0J66J9k4L61p10L89K16kj68j9k20M03l37l14M78k19j31
5192b38K21l30O59p26O20n22J66J53m73j53M44L19j64j74K19o25k20J025o61Q65
5212D05q83j93P89J47L1J4m70K05L33j082O02L28m67M06n02R59j337M84Q96j156
5232d91M91l18J94l06J078o91Q4j56M77j59Ql04O4L74j52M73l12m81K94p63L88
5253b08O50n58J9k79K18m0K58N50n30k63rL85q3m99O02N10q72q6J56j57K90k94
5275b40j45K43J31k00L50k57k4L51j87l47K06K29j8kl45J5L18n82L68O8l24K18
$$ plain form
5297 -174 -104 -296 -479 276 -286 -567 51 -408 -723 333 -18 393 -328 -186 -153 267 70 -5 53 -60 250
5318 250 -100 114 311 14 264 -47 -172 257 -288 -3 369 127 -264 271 -239 114 173 -34 201 -347
5338 -347 -497 -224 -634 81 -368 85 34 227 579 -283 344 -440 -898 133 147 -79 264 -141 460 3
5358 3 -465 -31 -482 -751 -689 528 -595 -223 273 -95 -69 102 -243 276 18 -32 -85 111 -41 -36 -90 78
5380 78 50 -43 -4 36 -86 135 -226 -375 -262 -460 145 7 -490 -197 351 -440 76 181 28 254 169 32
5402 32 -8 232 -8 -68 25 499 -260 -77 128 -79 -60 -27 -71 346 4 -344 -428 -262 -191 -435 166 305 89
5425 89 218 444 -417 -258 -302 -396 -32 -147 -116 -64 -1020 -277 766 -330 -110 -348 -379 257 423 264 1125
5446 1125 409 -245 -630 -133 -147 -355 305 -201 -132 -284 -121 -683 254 536 534 99 -259 -111 242 -139 172
$$ packed form
5297a74P0j92j83P55n62k81O18m59l15J056l51M11p21J42L3M20j97p5N8j13L10
5318B50l50K14J97k97K50l11j25M29n45K85L72k42l91N35n10L53N9k07K35n48
5338c47j50K73m10P15m49M53n1J93L52q62O27p84m58J031J4k26L43m05O01m57
5358Cm68M34m51k69O2J217j123L72M96l68K6J71l45N19k58n0n3J96j52Nn4J68
5380G8k8r3L9M0j22K21l61j49J13j98O05j38m97K93N48p91N16J05j53K26q5j37
5402C2m0K40k40o0R3M74p59J83K05k07J9L3m4M17l42l48q4J66P1k44O01J39k16
5425H9J29K26q61J59m4r4L64j15L1N2r56P43J043j096K20k38l1O36J66j59Q61
5446A125p16o54l85M97j4k08O60n06O9j52J63n62R37K82km35l58J48L53l81L11
$$ plain form
5467 172 -46 319 74 -32 -15 -27 -75 -114 65 -4 248 10 -89 -30 -83 -207 -159 -15 91 -59 122 152 166 -79
5491 -79 8 146 63 48 44 -102 -171 -9 -4 5 -137 -141 -57 -49 121 90 3 -155 33 -14 -154 96 -7 -19 -123 -148 76
5518 76 163 4 107 6 108 142 11 179 -230 5 87 -38 -40 -251 -185 158 -134 -134 -57 -63 -9 181 -53 173
5542 173 -66 -39 -4 34 50 196 88 -5 76 -72 127 145 -183 80 166 -9 37 -75 77 -191 32 -19 41 88
5566 88 94 -17 103 155 -87 -272 -266 -159 -31 43 -82 -267 8 17 19 108 52 -359 184 108 47 67 -92 -283 -142
5591 -142 226 87 -50 153 76 -38 118 252 225 316 57 -45 221 -218 75 -42 23 166 17 -242 52
5612 52 26 -37 23 -79 98 -89 -152 13 170 121 -27 -136 30 -92 -43 -203 -75 -8 -187 -39 -43 177 174 -23
5636 -23 162 -39 70 39 3 -7 19 320 99 129 -61 74 -167 -140 -73 58 209 -154 71 -202 -87 9 5 27
$$ packed form
5467A72k18L65k45j06J7j2m8l9J79o9K52k38r9N9n3j24M8J44J06j50J81L0J4k45
5491g9Q7J38q3j5mj46o9J62NRj42mQ4QJ70l1q7j58J88m7j40K50j03j2j04k5K24
5518G6Q7j59J03j01J02L4j31J68m09K35Q2j25kk11O6L43k92%P7oN4J90k34K26
5542A73k39K7L5L8J6J46j08r3Q1j48J99J8l28K63Q6j75M6j12J52k68K23n1O0M7
5566H8Oj11J20N2k42j85OJ07J28P4j25j85K75RKQ9n6m11N43p6o1K0j59j91J41
5591a42L68j39j37K03p7j14J56J34k7R1k59j02K66m39K93j17O5J43j49k59K94
5612E2k6o3O0j02J77j87o3J65J57m9j48j09J66j22M9j60J28O7j79J48mK20lj97
5636b3J85k01J09l1l6j0K6L01k21L0j90J35k41K7O7J31J51l63K25k73J15R6mK2
$$ plain form
5660 27 91 222 209 -37 -176 293 26 -58 79 -219 -69 -45 5 -133 394 -69 295 -53 -266 163 -201 134
5682 134 -150 -85 129 129 -267 115 247 -120 39 96 -128 -105 295 266 164 -55 128 -166 124 135 -54 -2 -91
5705 -91 -97 166 707 -150 569 -349 10 397 51 94 151 -107 -45 -186 -84 187 -46 126 -5 -3 132 66 76
5728 76 111 -20 -49 0 -33 -125 250 -134 253 130 -223 -2 116 64 -1 172 -93 -102 -230 19 -219 -146 202 -157
5752 -157 -139 -26 -192 -91 283 -4 -45 -74 73 107 174 -10 168 -8 319 -170 -124 249 44 -478 95 229
5774 229 223 -317 -205 613 -445 280 -113 -97 -522 487 -509 85 149 376 428 -302 -69 -15 44 152 103 -19
5796 -19 -77 -4 7 164 60 147 252 -333 -12 -37 -321 27 -83 -138 16 -29 98 288 88 96 204 39 35 -176
5820 -176 -79 -74 -10 94 147 -3 -117 -61 -11 -133 -147 30 -72 -95 -291 -58 171 91 24 102 -86 -81 -125 12 -32
$$ packed form
5660B7O4J31j3k46j39M69k67q4J37k98J50K4N0j38N27m63L64l48k13M29l64L35
5682A34k84O5K14%l96L82J32l67J59N7k24K3M00k9j02k19J83k94K90J1j89N2q9
5705i1oK63N41q57P19r18L59L87l46M3N7k58O2j41J02K71k33J72j31KJ35o6J0
5728G6L5j31k9M9l3r2L75l84L87j23l53K21J18n2o5J73k65rj28K49k38P3L48l59
5752a57J8J13j66J01L74k87m1k9J47L4O7j84J78j76L27m89M6L73k05n22N73J34
5774B29on40J12Q18j058P25l93J6m25J009r96N94O4K27N2p30K33N4N9J08m9j22
5796a9n8P3J1J57j04Q7J05n85L21k5k84L48j10n5J54m5J27J90k00QJ08j65mk11
5820a76R7NO4J04N3j50j14N6N0j22j4J77j02k3j96K33K29q0o7P8j88Nm4J37m4
$$ plain form
5845 -32 115 38 -27 152 61 34 67 -228 -28 -82 239 87 30 -306 183 143 88 26 -71 257 69 33 -30 -352 -48
5870 -48 126 -67 -155 -32 -81 -34 -71 117 -80 70 160 114 -250 -37 -22 199 -18 -151 107 169 15 -145 -156
5893 -156 111 12 -1 66 19 -11 -199 163 -115 113 39 -6 -25 133 -53 -100 -216 76 -34 36 -145 130 -47
5916 -47 100 -135 -23 193 -227 89 -92 -110 54 198 -161 73 -35 360 -12 53 -17 230 -43 -114 25 111
5938 111 156 5 -16 78 -118 245 296 155 -253 -436 186 -547 236 56 53 -6 171 -260 -81 147 80 -315 57
5961 57 109 -30 -157 147 266 -170 331 -84 250 112 212 -123 -153 -145 -3 -40 -181 218 -134 -143 199 35 74
5984 74 132 105 210 67 258 73 175 66 93 143 131 41 94 83 5 101 -141 -37 177 -88 32 117 117 5 -392
6009 -392 -23 114 -17 -13 95 69 -30 -167 -108 -242 -98 159 46 -12 -72 -47 -176 68 11 -10 -17 -89 -32 31 8
$$ packed form
5845c2J47p7o5J79r1k7L3k95K00n4L21j52n7l36M89m0n5o2r7L28j88l6o3l22L04
5870d8J74j93q8J23m9M7l7J88j97J50R0m6l64K13J5K21k17j33K58O2j54j60j1
5893a56K67r9j3O7m7l0j88L62k78K28p4m5j9J58j86m7j16K92j10P0j81K75j77
5916d7J47k35J12K16m20L16j81j8J64J44l59K34j08L95l72O5p0K47k73p1J39Q6
5938A11M5j51k1R4j96L63N1j41m08j83O22p33P83j80ln9J77m31J79K28o7l95L72
5961E7N2j39j27L04J19m36N01m15L34j38J00l35l0QJ42l7j41L99l52rL42j64L9
5984G4N8k7J05j43J91j85J02j09K7N0j2r0N3j1p8R6k42J04K14k65J20Q5%j12l97
6009c92L69J37j31MJ08k6r9j37N9j34J44K57j13n8o0K5j29K44n7k1pp2N7O3k3
$$ plain form
6034 8 -36 91 -2 -142 132 -40 -156 73 -185 -61 38 -1 -122 49 -246 69 33 244 -55 -146 167 277 -116
6057 -116 281 -102 -53 125 49 -67 -7 -113 -14 28 27 48 -15 172 -75 62 35 88 174 -127 -228 -137 -136 179 -321
6082 -321 61 -185 108 187 -95 -304 -36 270 -484 -20 225 176 -152 -134 -39 327 287 -263 272 7 514 -44
6104 -44 -195 -13 310 -285 78 333 -8 134 207 -27 137 -112 -3 302 -176 -26 137 111 170 132 -34 39
6126 39 -77 -2 -210 55 80 -109 -47 20 232 7 -18 -18 -16 252 -173 284 -7 -30 -101 -5 -189 109 80 25 -102
6151 -102 169 29 -83 -126 189 105 174 169 26 113 -22 -148 -57 -30 -84 65 104 64 -240 -174 -36 87 -293 79
6175 79 -26 -40 -116 107 31 -179 216 92 -32 -115 -17 -53 8 14 -155 3 -39 -222 26 -28 9 116 -20 -66 250
6200 250 -79 -203 157 274 277 15 70 203 -77 107 -95 -133 116 -74 75 161 -201 -176 -4 127 201 93
$$ packed form
6034Hm4J27r3j40K74j72j16K29k58J24R9l9j21J71k95L15l6K11k99r1L13J10l93
6057a16L97l83M9J78p6j16O0j06R9M2jK1o3J87k47J37k7N3Q6l01j01R1JL15n00
6082c21L82k46K93P9k82k09K68L06p54M64K45m9l28J8R5L66m0n50N35k65N07n58
6104d4j51J82L23n95L63K55l41J42P3k34J64k49J09L05m78J50J63k6N9l8j66P3
6126C9j16P5k08K65K5j89O2O7K12k25k5%KK68m25M57k91k3p1R6j84K98k9n5j27
6151a02K71j40j12m3L15q4O9nj43Q7j35j26R1K7n4J49L9m0l04O6J38J23l80L72
6175G9j05j4p6K23p6k10L95j24j24q3R8l6O1Oj69J58m2j83K48n4L7J07j36m6L16
6200B50l29j24L60J17Lk62N5J33k80J84k02l8K49j90J49Q6l62K5J72J31P4j08
$$ plain form
6222 93 49 63 69 -69 185 -71 -54 143 23 130 -206 -45 219 33 21 -125 163 -10 24 -21 77 99 49 100
6246 100 -58 228 46 -32 213 5 -204 114 102 30 -66 21 31 189 11 247 43 -80 -110 -13 19 129 -8
6269 -8 139 6 116 177 -94 -78 -122 -143 60 244 58 56 139 65 -282 151 63 102 -76 163 -257 125 64 18 167
6294 167 32 69 44 206 9 175 332 -57 152 -283 78 21 -89 19 -231 -172 -61 -66 77 37 21 31 61
6317 61 -123 177 6 28 -96 -73 75 -26 -117 -7 -113 30 102 46 158 232 -155 52 144 53 -114 -138 29
6340 29 -21 -15 -62 211 50 -11 -154 -285 -187 -78 -63 -92 -202 143 213 13 147 -34 183 -2 -27 -73 54 -28
6364 -28 -115 110 -77 284 24 -132 198 38 189 -29 -15 -138 61 -36 151 -315 88 233 92 -30 89
6385 89 177 107 -205 70 107 -51 -7 -183 -87 -179 114 78 -112 167 -15 54 18 74 193 -64 133 51 106 166 84
$$ packed form
6222I3m4J4Oj38K54k56J7J97j20J07l36J61K64j86j2j46K88j73L4m5R8K2n0N1
6246A00j58K86j82p8K45k08k09L18j2p2r6Q7J0J58j78K36k04j23l0R7L2J10j37
6269hJ47j33J10O1k71J6m4k1K03J84j86kQ3p4l47M33q8L9j78K39m20L82o1m6J49
6294A67j35L7k5J62j97J66J57l89K09m35L61n7j10J08k50N9J11nJ43m0j6J0L0
6317F1j84L00j71K2j24K3J48j01r1J10j06J43P2n6J12P4l87K07R2r1j67k4J67
6340B9n0Om7K73j61o1j43j31R8J09J5k9j10L45P0k00J34j81K17j85k5m6J27q2
6364b8q7K25j87L61k60j56L30j60J51k18J4j23J99r7J87m66M03J45j41j22J19
6385H9Q8p0l12K75L7j58M4j76R6r2K93l6j90K79j82O9l6N6J19k57J97q2N5O0q2
$$ plain form
6410 84 -178 277 -95 153 -119 -48 7 98 32 46 -59 -28 55 91 -27 130 85 -371 210 -144 -37 -32 45 149
6434 149 30 332 -171 18 -115 135 -9 135 -42 50 -156 -272 78 100 -75 -129 59 -116 -102 28 -44 -66
6456 -66 -92 -198 -156 47 -333 -161 142 159 151 -54 -179 -157 -80 -143 -14 110 33 58 -15 24 152 -55 110 11 -40
6481 -40 -79 -130 76 -109 52 132 -21 -23 81 -120 171 108 -127 -46 110 22 -121 244 -36 -49 -218 45 148
6504 148 -152 147 -110 7 251 297 -119 51 306 70 204 14 -2 223 38 -126 -30 -45 104 -11 -85 67
6526 67 -64 131 -45 -58 135 84 41 -67 -64 150 110 -75 216 172 -34 156 133 -18 24 -207 59 -104 -225
6549 -225 72 226 -81 -210 -56 148 -9 -279 132 -127 350 67 38 -230 53 146 136 164 -39 58 -13 -80
6571 -80 -290 38 169 28 -81 114 -12 64 143 97 -62 196 -153 157 -113 -25 -54 -22 -154 -270 211 -104
$$ packed form
6410H4k62M55l72K48k72P1N5R1o6J4j05L1Q3L6j18J57m5m56N81l54J07NP7J04
6434A49j19L02n03J89j33K50j44J44j77R2k06j16L50K2j75n4J88j75J4J30p2k2
6456f6k6j06M2K03l80J72L03J7qk05j25K2P7o3J29J24p7K5p3L9J28k07J65r9n1
6481d0l9n1K06j85J61Q0j53kJ04k01K91o3k35Q1J56q8j43L65k80j3j69K63J03
6504A48l00K99k57J17K44M6m16J70K55k36J34j90j6K25j85j64R6j5J49j15p4J52
6526F7j31J95j76j3J93n1m3j08LK14m0j85K91m4k06J90k3j51M2k31K66j63j21
6549b25K97J54l07j29J54K04j57k70M11k59M77k83k9k68K83R3j0K8k03R7p1o7
6571h0k10L28J31j41j09J95j26P6P9m6j59K58l49L10k70Q8k9L2j32j16M81l15
$$ plain form
6593 -104 75 34 5 104 -111 236 -86 42 27 11 155 -182 -100 -134 -8 26 191 25 95 -3 44 -10 132 -229
6617 -229 22 -205 -166 30 -28 80 116 -25 -91 39 -97 23 8 -126 142 -158 38 20 146 68 75 64 199
6640 199 122 -27 75 168 134 27 -123 35 244 147 125 73 -49 61 2 193 -142 -95 55 -162 -142 12 55
6663 55 -17 127 133 58 99 -34 -85 16 64 152 -55 25 187 -70 204 73 -188 54 -274 -163 243 -236 87
6686 87 93 -92 183 113 -184 153 -103 -180 -92 337 256 449 -18 697 230 -7 59 -47 148 -169 197 76 -334
6709 -334 -575 -552 428 1185 357 -197 72 26 -582 -235 -109 -65 -258 -343 -114 -116 -424 404 -53 -360 -552 121
6731 121 223 94 266 504 135 217 44 58 255 373 -235 -142 113 -62 94 47 -240 -8 -52 34 -57 -67 56
6754 56 49 261 79 116 197 -137 -258 -5 78 -44 59 -23 192 197 -66 90 128 27 -49 -8 -104 356 -161 36
$$ packed form
6593a04J79m1k9R9k15L47l22J28j5j6J44l37Q2l4J26L4J65j66P0r8M7n4J42l61
6617b29K51k27L9J96n8J08L6j41o6J30j36J20j5j34K68l00J96j8J26p8Pj1J35
6640A99p7j49J02R3l4j07j50J58K09r7k2n2j22J10n9J91l35M7J50k17K0J54M3
6663E5p2J44Op5M1j33n1J01M8Q8k07Q0J62k57K74j31k61K42l28J11M06m79L23
6686H7Oj85K75p0k97L37k56p7Q8M29q1J93m67P15m67k37O6j06J95l17L66j21m10
6709c34k41K3R80P57q28n54K69m6o08L47J26M4j93q5K29kl08Q28m57l07j92O73
6731A21J02j29J72K38l69Q2j73J4J97J18o08R3K55j75J56m7k87K32m4Q6r1j0J23
6754E6pK12j82L7Q1l34j21K53Q3j22J03q2K15Nk63J56L8j01p6M1r6M60n17J97
$$ plain form
6778 36 119 31 176 37 -20 -54 -46 107 -52 18 -47 52 109 104 277 -63 154 169 -324 -90 92 -192 93 163 85
6803 85 9 -115 12 110 -158 178 29 129 -86 30 -195 119 -43 71 140 55 26 171 29 145 -149 -253
6825 -253 28 92 81 -165 -15 280 -145 -133 96 -37 -154 76 -121 -12 106 63 214 -153 -147 -48 132 49 -6
6848 -6 27 -20 -90 -42 28 -142 270 30 -7 -37 10 74 -269 -60 -143 -39 171 -148 -132 151 48 52 -77 -48 -114 32
6874 32 -46 -31 -13 -154 26 -273 176 -145 140 40 277 177 -38 -138 -132 64 -97 48 210 87 23 -50 -109
6897 -109 -9 98 287 -57 -223 -68 442 -292 16 -190 -31 115 8 46 15 -67 -153 31 -185 -47 88
6918 88 -270 -120 -24 136 -102 -57 -2 -73 21 254 109 -49 -49 70 114 209 227 -520 203 203 -251 38 -9 42 31
6943 31 94 13 -103 215 -43 128 -68 -1 -7 -118 -75 92 64 174 13 124 149 -106 -21 -273 -78 175 35
$$ packed form
6778C6Q3q8J45j39n7l4QJ53j59P0o5R9N7nJ73l40K17J5m93K34J82k84K85P0p8
6803H5p6j24J27R8k68L36j49J00k15J16k25L14j62J14O9q5k9J45j42J16k94j04
6825b53K81O4j1k46J50K95m25J2K29j33j17K30j97J09J18m3J51l67OR9J80q3n5
6848fL3m7p0M8P0j70M12k40l7l0M7O4l43K09q3J04K10l19J6K83j03Mj29K9o6J46
6874C2p8J5J8j41J80k99M49l21K85j00K37j00k15j00OJ96j61J45J62j23o4p3n9
6897a09J00J07J89l44j66J55N10p34L08k06J59J46j07L8l1q2q6J84k16J38J35
6918H8l58J50R6J60k38M5N5p1R4K33j45j58%J19M4R5J8p47P23%m54K89m7N1j1
6943C1O3q1j16L18k58J71j96O7oj11M3J67k8J10j61J11K5k55Q5k52J95K53j40
$$ plain form
6966 35 30 145 -33 1 -82 149 28 6 -71 -60 -37 102 -9 -62 40 114 46 136 130 112 -135 -109 -103 -159 123 122 116 -102
6994 -102 -62 -18 -112 -128 -32 108 -144 87 12 -64 130 -203 -149 115 28 161 154 122 15 2 -137 -159 -35 175 203
7019 203 160 -67 -109 -240 -130 -41 143 135 11 -39 -245 -158 130 27 -131 -31 23 124 249 -16 95 -75 225
7042 225 37 27 107 -74 -7 131 -61 102 -23 -76 -85 51 111 51 120 58 153 150 -269 -9 -60 74 3 -107 -108 -167
7068 -167 -52 -234 324 309 -159 -92 -184 9 -64 48 20 -263 -42 109 -27 -57 -9 14 -70 70 17 -179 56
7091 56 301 -31 -167 -210 -83 -126 -298 48 -79 -118 -81 -28 -129 178 189 -121 -146 -206 6 93 23 99 93 46 120
7116 120 -18 -58 116 318 36 175 -213 43 -37 -172 -49 162 -23 247 64 168 133 -93 55 -178 -117
7137 -117 228 120 192 128 -33 -238 -60 -42 132 3 -76 -25 68 28 -73 93 -81 103 -67 86 24 25 -21 115
$$ packed form
6966C5nJ15j78L4q3K31j21k2p7J1K3J39j11n3J02P4o8R0oj8k47K6On6K82jok18
6994a02M0M4r4j6R6J40k52K31p5p6J94l33N4K64q7J33pl2j07j3j39k2J24K10K8
7019B03m3k27m2j31J10Q9J84qj24n0k06Q7K88j03j58J00N4J01J25k65J11j70L00
7042B25j88j0Q0j81O7J38j92J63j25n3rJ36O0o0O9o2R5lm19K60n1J34p1j10jn9
7068a67J15j82N58j5m68O7r2J93p3J12k8k83K21J51j36l0M8K3q4J40n3j96K35
7091E6K45l32j36m3J27m3j72L46j27l9L7N3j01L07J1l10k5o0K12Q7p0P6om7P4
7116A20j38m0J74K02k82J39l88K56q0j35J23K11j85K70j83J04l5k26J48k33O1
7137a17L45j08P2o4j61k05J78J8J74j29p9N1R3m0j01J66j74J84j70J53o2Jm6J36
$$ plain form
7161 115 51 54 -105 32 147 123 -99 -119 288 162 43 -223 146 123 -100 -44 -1 64 44 -64 80 -24 -33 -183
7185 -183 75 -111 -419 14 -106 53 314 102 -36 34 -38 -152 26 -55 7 43 -202 -48 3 141 111 -75
7207 -75 134 269 -102 17 258 218 -144 -11 -26 23 -152 -197 -305 -18 -63 -39 175 -178 -308 -156 75 -80
7229 -80 184 -161 -34 268 113 189 -46 -168 -34 141 70 -78 -170 131 -68 97 119 90 -22 103 91 61 -42
7252 -42 62 -17 130 -104 13 -109 -61 60 18 -201 -39 38 158 302 -70 -76 -87 42 105 40 73 7 -248 102
7276 102 257 54 23 35 188 -95 -183 -244 -185 -237 115 172 -285 -104 15 99 44 -344 8 -397 226 -12 14
7299 14 208 -409 458 -204 562 -316 216 -378 -119 -222 -303 131 113 -305 522 232 -272 355 230 -274 -415
7320 -415 -632 465 -324 374 -55 -108 -442 356 -653 -111 112 -38 41 -216 -221 -43 51 106 111 49 40 -52 -60 102
$$ packed form
7161A15o4Lj59J37J15k4k22k0M07j26j19k66L69k3k23N6M3O5k0j08J44j04rj50
7185a83K58j86l08M33j20J59K61k12j38P0p2j14J78q1O2L6k45J54N1J38l0j86
7207g5K09J35l71J19K41m0l62J33j5M9j75m5j08K87m5K4K14l53j30J52K31j55
7229h0K64l45J27L02j55P6k35j22J34J75p1j48r2L01j99J65K2k9j12J25j2l0j03
7252d2J04p9J47k34J17j22M8J21m2k19J62P7J20J44l72oj1J29O3o5L3o6k55L50
7276A02J55k03l1J2J53k83q8o1N9n2L52N7m57J81J19Q4n5l88L52m05O23k38K6
7299A4J94o17Q67o62P66q78N32n94K59j03q1M34j8m18Q27k90n04O27j25n04j41
7320d15k17J097p89O98m29n3l34P98j009N42K23j50P9k57nJ78R4N5No2rr2qJ62
$$ plain form
7344 102 -156 -193 -149 -11 181 -164 -47 -137 170 12 -72 -51 -207 22 40 -276 39 247 78 -294 -65 80
7366 80 193 -49 -6 -134 -316 169 82 -170 160 -4 -139 -124 -196 88 15 -28 -28 -156 30 -11 -45 -42 183 76
7390 76 51 85 -182 48 -59 -148 -88 10 43 4 -112 -89 80 -160 -317 -28 76 79 25 81 -174 33 -278 188
7414 188 124 -52 -302 -211 -36 56 3 191 31 -31 -303 6 -112 -102 -337 406 -218 207 -44 235 199 -7
7436 -7 320 -271 -379 237 94 -96 297 -529 -9 -490 -409 -122 -34 146 179 -471 203 57 -181 116 -207 164
7458 164 360 544 38 533 227 268 568 210 79 368 168 -30 553 -789 -488 248 569 -386 298 244
7478 244 -180 -20 164 -549 42 -69 40 214 -44 -160 51 -41 -14 -77 21 -148 -127 -88 270 2 3 -158 16
7501 16 -14 132 -73 -26 -89 176 52 1 306 270 236 -109 -33 -7 193 51 -303 17 -34 268 -20 -15 166 124
$$ packed form
7344A02k58l7M4J38J92l45J17r0L07j58q4K1j56K29J8l16L15K08j69l72K29J45
7366H0J13k42M3j28j82M85q7k52L30j64j35J5p2K84p3m3%j28J86m1l4LK25j07
7390G6k5L4k67K30j07q9O0R8L3l9j16K3J69k40j57K89J04Ln4N6k55K07l11M66
7414A88o4j76k50R1J75R2n3J88j60o2k72L09j18J0k35P43o24M25k51K79l6k06
7436gL27n91j08O16j43j90L93q26N20m81Q1K87Q8J80L3o50O74j46k38K97l23L71
7458A64J96J84n06M95l06M1L00l58j31K89k00j98N83j342L01P36L21r55O84n4
7478B44m24J60J84p13N91j11J09J74k58j16K11r2K7o3R8j69K1L9L58k68Jj61J74
7501A6l0J46k05M7o3K65j24n1L05l6l4l45P6K6K00j42l54L20n1L02k88NJ81m2
$$ plain form
7525 124 92 -51 222 -19 -127 5 -8 268 284 66 -106 -145 248 61 51 -240 -50 244 72 -129 -24 38
7547 38 130 -76 45 18 -180 145 -32 -38 84 74 78 77 10 29 -11 -70 235 236 48 -225 78 -122 67 56 187 -35
7573 -35 19 -103 49 -151 -44 -112 -32 -69 96 -161 -238 42 -62 -175 -154 116 -32 31 -125 93 -2 93 167 81
7597 81 115 78 -133 -73 46 -88 -107 -16 -99 32 68 -34 -202 137 -56 -23 -192 -302 -64 18 -153 67 -24 0
7621 0 82 69 -41 -69 -25 89 178 -10 37 49 -115 14 19 61 96 166 -43 17 92 -28 -53 105 160 -138 -172 -16
7647 -16 21 -136 239 240 138 -188 125 27 -146 22 97 -135 58 241 150 -84 -70 148 -158 -40 -154 -33 -16
7670 -16 -34 136 44 57 -67 -154 -69 134 -4 -66 147 218 26 139 172 260 -59 -93 -112 18 155 -197 27 -25
7694 -25 -39 -266 -108 -36 155 -123 -72 32 -156 -78 268 174 137 250 137 -137 37 57 -4 66 98 -56 101 142
$$ packed form
7525A24l2j43K73k41j08J32j3K76J6k18j72l9L93j87j0k91J90K94j72k01J05O2
7547C8R2k06J21k7j98L25j77oJ22j0Mjo7J9m0n9L05Jj88k73L03k00J89j1J31k22
7573c5N4j22J52k00J07o8Q0l7J65k57p7K80j04j13K1K70j48O3j56K18r5R5P4q6
7597H1L4l7k11O0J19j34j9R1q3J31L6j02j68L39j93L3j69j10K38Q2j71K20r1K4
7621@Q2j3j10k8M4J14Q9j88M7J2j64J29NM2L5P0k09O0P5j20k5J58N5k98l4J56
7647a6L7j57L75Jj02l26L13r8j73J68P5k32J93J83r1k34J4K18l06J18j14J21J7
7670a6j8J70r2J3j24q7Q5K03j38o2K13P1j92J13L3Q8l19l4j9J30J37l52K24n2
7694b5j4k27J58P2J91k78N1J04j88P8L46r4l7J13j13k74J74K0o1P0L2j54J57M1
$$ plain form
7718 142 -61 53 -93 251 -162 136 113 73 -215 -40 13 228 218 -102 1 -61 -280 -108 -185 147 5 52
7740 52 156 -54 4 -120 125 -111 157 -10 72 -33 12 -186 -295 64 218 94 110 -202 -8 15 203 -1
7762 -1 -95 23 148 369 -300 -140 12 -129 -56 140 -2 112 -20 67 20 -5 -126 51 -15 -182 -101 -179 8
7785 8 131 -69 51 19 -155 122 -224 -19 -77 -95 131 -180 63 -55 -140 47 -254 -128 144 -142 65 -377
7807 -377 -241 213 -320 254 0 175 149 69 93 -28 163 77 -193 -66 -57 14 -9 -111 214 -4 -5 -190 -29
7830 -29 -8 54 20 156 -69 -202 158 221 222 -131 -194 -24 163 -17 1 -240 35 -86 37 -71 -112 282 33
7853 33 -205 -132 596 292 325 302 -183 -2 -26 -435 -227 135 -118 36 307 331 124 -262 -271 -39 -459 48 440
7876 440 115 169 376 -315 576 -619 -95 850 -128 800 -60 660 -353 -386 80 349 56 414 -397 -115
$$ packed form
7718A42k03J14j46L44m13K98k3m0k88J75N3K15j0l20J03o2k19J72p7L32j42M7
7740E2J04k10N8j24K45k36K68j67Q2j05M5j98j09L59J54j24J6l12J94K3J88k04
7762ar4J18J25K21o69J60J52j41P3J96j42J14j32Q7m7k5j21J77o6j67Q1p8J87
7785HJ23k00J20l2j74K77l46K05n8j8K26l11K43j18q5J87l01J26K72k86K07m42
7807c77J36M54n33N74k54J75k6q0K4j21J91q6k70J27RP1k3j02L25k18jj85J61
7830b9K1O2l4J36k25j33L60O3Jl53o3J70J87j80J8k41K75j21J23j08m1L94k49
7853C3k38P3P28l04L3k3m85J81k4m09K08L62k53J54K71K4k07l86rK32m20N07L92
7876D40l25N4K07o91Q91j195N24R45r78R28q60P20j013l3M66K69k93L58q11K82
$$ plain form
7896 -115 344 319 -496 480 -36 51 -100 81 -30 272 80 -437 -33 -87 153 -163 -132 -93 -126 -117 -364 176 69
7919 69 231 18 13 -243 157 33 104 50 36 -34 -80 148 97 -135 38 -124 -59 48 -2 103 -57 -46 -129 -54 7
7944 7 -334 -195 135 -187 -118 139 -64 17 11 -17 18 97 -244 -362 -99 241 -100 -134 5 232 -106 -247 -516
7967 -516 -206 -187 355 442 -230 -34 343 140 -187 -176 222 95 -78 -29 -101 46 -243 24 95 -107 28 144
7989 144 104 314 8 -52 107 67 208 211 -82 -83 -110 -432 -51 -271 336 -26 -230 498 -261 -355 -7 -313 -206
8012 -206 -321 -23 -178 20 -24 -44 -57 105 130 -256 51 -66 -115 100 11 -53 40 31 -13 147 -95 25 118 137
8036 137 276 -57 179 197 -121 -53 -183 188 -37 0 -60 83 38 1 94 95 223 -79 124 83 -30 63 102 219
8060 219 -129 -24 62 -70 -28 -126 -99 101 -44 -9 -168 -58 91 73 -90 153 -6 108 -39 7 57 37 -243
$$ packed form
7896a15M59k5q15R76n16Q7j51J81j11L02j92n17M04n4K40l16L1L9l3Rk47N40j07
7919F9J62k13nk56M00j24P1n4j4p0m6K28n1k32J73j62O5J07n0J05j60J1q3P5O1
7944Gl41J39L30l22O9K57k03Q1ok8L5P9l41j18K63L40l41l4J39K27l38j41k69
7967e16L10J9N42Q7o72J96L77k03l27J1L98j27j73M9p2J47k89K67P1k02J35J16
7989A44m0K10l06o0J59m0J41Lk93jk7l22L81k20O07l62k04P28p59r4L48l06J07
8012b06j15K98j55J98m4k0j3J62K5l86L07j17m9K15q9o4R3rm4J60k42J20R3J9
8036A37J39l33K36J8l18O8j30L71k25L7o0J43m5l7R3JJ28l02K03m1j13R3L9J17
8060B19l48J05Q6j32M2r8K7K00j45L5j59J10J49j8j63K43j59J14j47M6N0k0k80
$$ plain form
8083 -243 233 25 -92 94 -195 284 316 -177 133 9 -159 -84 154 7 34 92 171 -118 -106 139 -47 307
8105 307 -87 194 166 -94 42 -28 7 12 -63 127 174 -136 128 42 90 161 205 49 64 -9 -106 226 172 162 -21
8130 -21 -98 -89 36 -21 -25 79 0 39 -245 27 -55 -67 20 -195 -139 59 55 -22 -80 -29 -6 -83 136 -57 285 -92 -54
8157 -54 -137 -19 -51 125 23 46 -60 141 288 225 105 145 71 217 -72 -95 23 -44 206 -26 15 66 66 42 20
8182 20 -226 173 -89 113 75 43 -107 47 -112
$$ packed form
8083b43M76k08j17J86k89M79L2m93L10j24j68P5K38j47K7N8P9k89J2K45j86L54
8105C07l94K81k8k60J36p0L5Np5J90M7l10K64q6M8P1M4j56J5p3r7L32n4j0j83
8130b1p7RJ25n7mJ04p9L9k84K72q2j2Q7k15N6J98mp7n8N1K3p7K19j93L42l77L8
8157e4q3J18l2J76j02K3j06K01J47o3j20M0p4J46k89k3J18o7K50k32M1N1%k4k2
8182B0k46L99k62K02l8l2j50J54j59
8191a12
$$ Imaginary data points
##PAGE= N=2
##DATA TABLE= (X++(I..I)), XYDATA
$$ plain form
0 0 0 0 0 0 0 0 0 0 0 0 -8 8 -8 8 -16 16 -24 24 -32 40 -48 56 -64 80 -93 108 -128 144 -168 192 -222 253
32 253 -290 326 -369 417 -469 527 -588 657 -734 814 -904 1000 -1109 1225 -1356 1493 -1647
49 -1647 1813 -1997 2201 -2423 2674 -2950 3262 -3614 4016 -4481 5024 -5668 6446 -7412 8641
64 8641 -10269 12543 -15964 21757 -34218 122887 -181083 -105928 169996 -89531 97048
75 97048 -99 -117039 14589 12113 81110 1197 -173306 40004 -11650 986 125542
86 125542 -131230 -24621 153865 -30903 95941 -67931 -215871 175007 18276 -183758
96 -183758 107126 -32449 -95575 136811 71158 -63389 -127602 50680 176117 -129786 -45890
107 -45890 109074 -115400 52919 92513 -142233 -12087 -33195 -5805 149604 -102991 -66163
$$ packed form
0@%%%%%%%%%%qJ6j6J6k4L2m0M8n6P2q8J04j20J44j73K01k36K72l12L60m14M75
32B53n43O16o95P86q86R96j115J245j391J548j718J904k109K334k581K849l140
49a647L460l810M198m624N097n624O212o876P630q497R505j0692J2114j3858J6053
64H641j8910K2812k8507L7721n5975J57105l03970P5155K75924k59527J86579
75I7048r7147j16940J31628k476O8997p9913j74503K13310n1654J2636J24556
86A25542k56772J06609J78486j84768J26844j63872j47940L90878j56731k02034
96a83758K90884j39575o3126K32386o5653j34547o4213J78282J25437l05903Q3896
107d5890J54964k24474J68319L9594k34746J30146k1108K7390J55409k52595L6828
$$ plain form
118 -66163 144896 -8945 24562 19885 -99387 6999 5824 25335 9565 -113730 56570
129 56570 59870 -53609 86144 -59516 -99026 155797 12820 -67802 48241 -29190 26852
140 26852 34154 -52099 5312 -66068 -15995 109952 -36307 -35075 38350 10508 70027 -25502
152 -25502 -61713 52289 -47948 -4908 79967 -83430 -26286 54046 -12550 27528 -41170
163 -41170 -43766 64992 -5464 8331 25130 -48427 31710 15456 -37249 16047 -61608 -27172
175 -27172 68029 -23500 -8187 13645 -15512 53237 -6070 -36628 26454 -33406 1676 43656
187 43656 -38929 -7587 5611 -14926 33453 -27820 -35040 36879 -941 15862 20829 -20545
199 -20545 23119 -1176 -14451 21130 -40926 -22028 33784 -7512 7286 2486 -12491 40014
$$ packed form
118f6163K11059j53841L3507m677j19272J06386j175J9511j5770j23295J70300
129E6570L300j13479J39753j45660l9510K54823j42977q0622J16043p7431N6042
140B6852P302q6253N7411p1380N0073J25947j46259J232P3425k7842N9519r5529
152b5502l6211J14002j00237M3040Q4875j63397N7144Q0332o6596M0078o8698
163d1170k596J08758p0456J3795J6799p3557Q0137j6254n2705N3296p7655L4436
175b7172R5201r1529J5313K1832k9157O8749n9307l0558O3082n9860L5082M1980
187D3656q2585L1342J3198k0537M8379o1273p220P1919l7820J6803M967m1374
199b0545M3664k4295j3275L5581o2056J8898N5812m1296J4798m800j4977N2505
$$ plain form
211 40014 -3690 -19881 28571 -16489 -6202 28779 -3706 -4272 -12551 -1582 18954 -27425 -11230
224 -11230 21326 -10753 14945 20973 -9372 13575 -2125 -10071 11947 -22373 -15536 10309 -5762
237 -5762 4367 -827 -6995 12230 -3900 -6307 7881 -5996 1939 6451 -1919 7861 -13050 -14491
251 -14491 9713 -14813 -16579 7097 1397 2569 6375 7119 8524 -6397 -3945 5723 -10102 -9229
265 -9229 2077 -695 2189 -3230 -1296 6198 -5401 -2824 6768 2992 3128 5692 7357 5461 -4503
280 -4503 -4964 1257 -7044 -8073 2107 4268 4383 3778 8003 8417 -708 -1058 2947 -77 -3361 69
296 69 4129 964 -3266 -1025 1686 -3953 -3742 2442 3566 3439 3119 5894 4015 -3234 -4598 -3440
312 -3440 -5146 -7887 -4532 2205 821 -1439 2548 4926 -2637 -3609 1689 -1369 -2819 -796 1165
$$ packed form
211D0014m3704j6191M8452m5060J0287L4981l2485n66q279J0969K0536m6379J6195
224a1230L2556l2079K5698O028l0345K2947j5700p946K2018l4320O837K5845j6071
237e762J0129n194o168J9225j6130k407J4188j3877P935M512q370R780k0911j441
251a4491K4204k4526j766K3676n700J172L806P44J405j4921K452R668j5825Q73
265i229J1306k772K884n419J934P494j1599K577R592l776J36K564J665j896r964
280d503m61O221q301j029J0180K161J15o05M225M14r125l50M005l024l284L430
296F9M060l165m230K241K711n639K11O184J124j27l20K775j879p249j364J158
312c440j706k741L355O737j384k260L987K378p563r72N298l058j450K023J961
$$ plain form
327 1165 -818 -4430 -2803 -2854 -5123 -3850 -1691 708 5441 1990 1947 7442 -1762 -4517 943 -4270
343 -4270 -4442 -2675 257 4066 -1699 49 6476 -490 -1205 3057 666 3834 228 2620 8407 -7454
359 -7454 -2502 7736 -8443 -3193 3687 -2750 6107 5933 2299 5919 -2207 2899 3878 -8505 1997
374 1997 -1634 -5372 11634 -4094 -6220 7920 -5779 3365 3301 -10034 8044 2015 -3360 11875
388 11875 -9381 -8251 7668 -8234 379 -4872 -11503 14418 -1588 -3272 11240 -14162 1274
401 1274 12001 -12602 1767 -5184 -8328 17938 -7408 -9211 6636 -13309 10101 6731 -18060
414 -18060 11254 -1579 -1676 23074 -15893 -9813 12350 -8411 8314 -4041 -16889 16010 -1843
427 -1843 4845 14831 -26937 8110 20154 -14982 12817 -8044 -14354 28838 -4932 -5635 5650
$$ packed form
327A165j983l612J627n1k269J273K159K399M733l451m3N495r204k755N460n213
343d270j72J767K932L809n765J748O427o966p15M262k391L168l606K392N787j5861
359g454M952J0238j6179N250O880o437Q857j74l634L620q126N106R79j2383J0502
374A997l631l738J7006j5728k126J4140j3699R144o4j3335J8078o029n375J5235
388A1875k1256J130J5919j5902Q613n251o631K5921j6006j684J4512k5402J5436
401A274J0727k4603J4369o951l144K6266k5346j803J5847j9945K3410l370k4791
414a8060K9314j2833r7K4750l8967O080K2163k0761J6725j2355j2848L2899j7853
427a843O688R986m1768L5047J2044l5136K7799k0861o310M3192l3770p03J1285
$$ plain form
440 5650 -23854 18148 16604 -22566 8489 -3871 1120 25420 -14900 -1941 -2305 -14155 36044
453 36044 -11306 -34341 28965 -7564 -3761 27923 -28757 -8735 17155 -1520 15469 -22176
465 -22176 -15260 29956 -10674 3018 4002 -35152 17023 12511 -10617 10948 -31981 5772 44079
478 44079 -31479 -1734 11325 -34169 28581 17284 -32296 -2548 -3727 20921 10739 -32626
490 -32626 13197 -5154 -10911 47608 -23335 -32158 31602 -5309 13724 3989 -42530 23300 9386
503 9386 -12040 29413 -30909 -16363 43224 -1206 -3622 -13615 -12043 34284 -9228 -2013 15432
516 15432 -46718 24299 45557 -44289 -188 6188 -12650 36226 -9390 -19255 8330 -14316
528 -14316 32458 8871 -47315 12108 6769 691 22029 -33406 -3988 18345 -12316 33415
$$ packed form
440E650k9504M2002j544l9170L1055j2360M991K4300m0320J2959l64j1850N0199
453C6044m7350k3035O3306l6529L803L1684n6680K0022K5890j8675J6989l7645
465b2176O916M5216m0630J3692R84l9154N2175m512k3128K1565m2929L7753L8307
478D4079p5558K9745J3059m5494O2750j1297m9580K9748j179K4648j0182m3365
490c2626M5823j8351n757N8519p0943q823O3760l6911J9033r735m6519O5830j3914
503I386k1426M1453o0322J4546N9587m4430k416r993J572M6327m3512P215J7445
516A5432o2150P1017K1258q9846M4101O376j8838M8876m5616r865K7585k2646
528a4316M6774k3587n6186N9423n339o078K1338n5435K9418K2333l0661M5731
$$ plain form
540 33415 -19314 -46165 46537 3997 -18445 17280 -31438 1574 27612 -10908 3884 -27107
552 -27107 -6907 46247 -19737 -10811 10661 -28250 29589 15605 -33460 7702 -14132 7502
564 7502 36731 -37367 -8951 20128 -14556 26449 -1752 -34229 17029 2820 12406 9044 -39151
577 -39151 14739 18045 -14447 22614 -21708 -20893 38896 -3469 -2345 2525 -26850 27050 13832
590 13832 -21002 11875 -19501 1330 34713 -20740 -5028 2218 -12165 31237 -5671 -23350
602 -23350 15222 -11092 12156 19084 -33050 3161 9458 -7232 21110 -19514 -16667 22040 -7356
615 -7356 8280 1254 -27981 17249 8211 -9675 9867 -21696 -1337 24085 -13715 936 -3463
628 -3463 -14770 22898 -2015 -13003 7517 -15002 11238 15733 -21649 3627 496 -6541 19374
$$ packed form
540C3415n2729k6851R2702m2540k2442L5725m8718L3012K6038l8520J4792l0991
552b7107K0200N3154o5984Q926K1472l8911N7839j3984m9065M1162k1834K1634
564G502K9229p4098K8416K9079l4684M1005k8201l2477N1258j4209R586l362m8195
577c9151N3890L306l2492L7061m4322Q15N9789m2365J124M870k9375N3900j3218
590A3832l4834L2877l1376K0831L3383n5453J5712P246j4383M3402l6908j7679
602b3350L8572k6314K3248O928n2134L6211O297j6690K8342m0624K847L8707k9396
615g356J5636p026k9235M5230r038j7886J9542l1563K0359K5422l7800J4651m399
628c463j1307L7668k4913j0988K0520k2519K6240M495l7382K5276l131p037K5915
$$ plain form
641 19374 -10785 -10777 10483 -6526 12778 2580 -19745 12479 1986 -2682 12425 -15413 -1142
654 -1142 13321 -5924 8179 -4961 -11574 17348 -1517 -4767 8054 -11569 6373 11336 -8551
667 -8551 3648 -4303 -1884 13827 -7721 -2902 5322 -8395 9270 3895 -11254 5462 -1212
680 -1212 -288 8065 -9886 -17 4896 -5795 6981 -2864 -8712 7381 -1882 -991 2536 -7995
694 -7995 3264 2801 -4887 4407 -4884 -4276 7554 -4637 -1714 1447 -5038 4043 85 -4302 2477
709 2477 -3008 -26 4579 -4606 545 2278 -3089 3951 -1257 -2914 3085 -774 1176 1749 -3955
724 -3955 2258 787 -1686 3009 -873 -830 3573 -1118 386 1439 -1387 2842 620 -714 2036 -834
740 -834 1177 2601 -954 946 781 -369 1425 340 68 764 -1123 598 1062 -886 -185 287 -504
$$ packed form
641A9374l0159QK1260j7009J9304j0198k2325L2224j0493m668J5107k7838J4271
654a142J4463j9245J4103j3140o613K8922j8865l250J2821j9623J7942M963j9887
667h551J2199p951K419J5711k1548M819Q224j3717J7665n375j5149J6716o674
680a212R24Q353j7951R869M913j0691J2776r845n848J6093r263Q91L527j0531
694g995J1259m63p688R294r291O08J1830j2191K923L161o485R081l958m387O779
709B477n485K982M605r185N151J733n367P040n208j657N999l859J950N73n704
724c955O213j471k473M695l882M3M403m691J504J053k826M229k222j334K750k870
740h34K011J424l555J900j65j150J794j085k72O96j887J721M64j948P01M72p91
$$ plain form
757 -504 566 -1061 -634 -103 -1120 -372 -1412 -485 498 -310 -1232 214 -716 -1174 159 -795 -528 -620 -706
776 -706 -358 -966 -452 -362 -583 -314 -324 -323 -228 -45 -634 160 -150 -213 574 -258 290 -1 173 501 -101 45
798 45 456 276 341 370 369 892 269 283 1171 -188 600 1489 -535 662 795 -213 769 468 530 746 -337
819 -337 1190 839 -1052 1058 280 -614 1733 -825 -705 1050 -1554 870 179 -2290 1070 -564 -629
836 -629 1342 -2260 -285 820 -2271 1283 -725 -3222 2670 -1223 -1375 1291 -3348 945 1127 -2894
852 -2894 1480 -1937 -1667 3738 -2509 -776 915 -3350 3633 128 -4106 3651 -2696 -357 5518
867 5518 -4989 -498 3122 -2296 3915 -822 -2902 4261 -2217 2507 3529 -7208 3540 3958 -3159
882 -3159 4453 -3410 -1523 6827 -3419 2574 1374 -7560 7957 3029 -6274 3941 -3204 271
$$ packed form
757e04J070j627M27N31j017P48j040R27R83q08r22J446r30m58J333r54K67r2q6
776g06L48o08N14R0k21K69j0JR5J83n89P94l10o3P87q32N48k91J74L28o02J46
798D5M11j80O5K9jN23o23J4Q88j359P88Q89k024J197J33j008R82l01O2K16j083
819c37J527l51j891K110p78q94K347k558J20J755k604K424o91k469L360j634o5
836f29J971l602J975J105l091L554k008k497N892l893j52K666m639M293J82m021
852b894M374l417K70N405o247J733J691m265O983l505m234P757o347K339N875
867E518j0507M491L620n418O211m737k080P163o478M724J022j0737J0748M18p117
882c159P612p863J887Q350j0246N993j200q934J5517m928r303J0215p145L475
$$ plain form
896 271 6542 -5106 1715 -1481 -4022 11398 -4316 -7548 7534 -4707 2158 5606 -9428 1609
910 1609 877 -1581 8185 -9685 -4501 10102 -6045 2542 1537 -10929 6446 1620 -1963 3682
924 3682 -12233 3550 10372 -10757 3449 -449 -9861 12119 -83 -6867 2245 -6848 9046
937 9046 4838 -13102 6123 -2140 -3833 14472 -8016 -7274 7064 -2898 8821 -1533 -12573
950 -12573 11095 -1361 -1030 11166 -14855 -1353 13011 -4089 4345 -5662 -6370 14415 -3824
963 -3824 -350 5005 -15332 9780 11616 -12145 3257 -4224 -1065 14506 -9184 -1799 2855 -9603
977 -9603 15558 1595 -16775 7762 -1538 2092 9371 -14650 522 5118 -4916 12809 -9424
990 -9424 -13064 15360 -2503 254 3353 -15693 7249 6512 -5860 6131 -13051 -2627 17537
$$ packed form
896B71O271j1648O821l196k541J5420j5714l232J5082j2241O865L448j5034J1037
910A609p32k458R766j7870N184J4603j6147Q587j005j2466J7375m826l583N645
924C682j5915J5783O822k1129J4206l898r412K1980j2202o784R112r093J5894
937I046m208j7940J9225q263j693J8305k2488P42J4338r962J1719j0354j1040
950a2573K3668j2456L31J2196k6021J3502J4364j7100Q434j0007p08K0785j8239
963c824L474N355k0337K5112J836k3761J5402p481L159J5571k3690P385M654j2458
977i603K5161j3963j8370K4537r300L630P279k4021J5172M596j0034J7725k2233
990i424l640K8424j7863K757L099j9046K2942p37j2372J1991j9182J0424K0164
$$ plain form
1003 17537 -8774 -1650 1167 -11006 13836 2642 -10307 4390 -8809 6161 12690 -15557
1015 -15557 783 2696 -5199 14910 -6085 -10735 9053 -3931 8252 4085 -17751 8109 4719
1028 4719 -3439 10954 -12762 -4040 14099 -4747 4483 -2335 -11994 14840 1762 -5869 5777
1041 5777 -12207 5242 12808 -10518 2379 -2665 -5142 16055 -5618 -7547 5472 -7461 9160
1054 9160 5393 -14533 4858 -262 -782 11409 -12139 -4319 8704 -5135 7596 -2640 -12785
1067 -12785 10216 -452 -1476 5182 -13655 3246 9299 -7681 4131 -5253 -6276 13010 -4010
1080 -4010 -3425 2635 -9542 9329 4840 -10206 4112 -3711 -193 10525 -8748 -1894 3683 -4809
1094 -4809 9629 -1171 -9521 7706 -1829 1079 6243 -10276 2101 5454 -3157 5924 -4884
$$ packed form
1003A7537k6311P124K817j2173K4842j1194j2949J4697j3199J4970O529k8247
1015a5557J6340J913p895K0109k0995m650J9788j2984J2183m167k1836K5860l390
1028D719q158J4393k3716Q722J8139j8846R230o818r659K6834j3078p631J1646
1041E777j7984J7449P566k3326J2897n044k477K1197k1673j929J3019j2933J6621
1054I160l767j9926J9391n120n20J2191k3548P820J3023j3839J2731j0236j0145
1067a2785K3001j0668j024O658j8837J6901O053j6980J1812r384j023J9286j7020
1080d010N85O060j2177J8871m489j5046J4318p823L518J0718j9273O854N577q492
1094d809J4438j0800q350J7227r535K908N164j6519J2377L353q611R081j0808
$$ plain form
1107 -4884 -4516 9371 -2654 618 2471 -8299 6417 3769 -5958 3726 -5130 84 8698 -5987
1121 -5987 -80 1650 -5280 7193 -424 -5644 3848 -3182 2206 4404 -7284 1800 1162 -3134 5715
1136 5715 -4207 -3839 5121 -3085 1540 824 -6325 3621 845 -2452 2981 -4761 -907 4677 -3685
1151 -3685 948 -413 -3579 4397 -467 -2519 2011 -3474 1626 2976 -4172 1413 -40 -1872 3690
1166 3690 -1635 -1502 2447 -1951 2225 940 -3269 2764 -83 -572 2718 -2083 296 2464 -1501
1181 -1501 1624 24 -1500 2585 -255 -206 1622 -1760 1494 1359 -1497 1080 -282 -373 1955 -1096
1197 -1096 -220 717 -1562 1202 357 -1361 1047 -396 -546 858 -1123 -208 317 -1209 854 -428
1213 -428 -1134 937 -439 -1078 272 -690 -227 159 -1195 355 -442 -747 682 -559 -412 312 -513 174
$$ packed form
1107d884L68J3887j2025L272J853j0770J4716k648r727R684q856N214Q614j4685
1121e987N907J730o930J2473p617n220R492p030N388K198j1688R084o38m296Q849
1136E715r922L68Q960q206M625p16p149R946k776l297N433p742L854N584q362
1151c685M633j361l166P976m864k052M530n485N100J350p148N585j453j832N562
1166C690n325J33L949m398M176j285m209O033k847m89L290m801K379K168l965
1181a501L125j600j524M085k840M9J828l382L254j35k856K577j362r1K328l051
1197a096Q76R37k279K764q45j718K408j443j50J404j981R15N25j526K063j282
1213d28p06K071j376o39J350r62M63L86j354J550p97l05J429j241J47P24q25O87
$$ plain form
1231 174 -502 -288 -111 -211 -114 305 -272 151 146 -527 329 -34 -237 648 -333 162 -63 -198 683 135 216
1252 216 65 321 104 475 72 355 243 177 1287 480 -579 401 -340 434 150 84 111 86 29 113 523
1273 523 225 -129 -296 478 101 -345 -224 -806 -7 383 -87 -252 -372 -426 354 233 -1524 519 -259 -927
1293 -927 -322 -116 4 200 -937 967 -477 -823 727 -1080 -21 378 -1725 -400 -55 -718 1416
1310 1416 -652 -606 890 -1212 751 1982 -1640 584 554 -263 1389 -1043 220 1127 -1298 1608
1326 1608 1368 -1668 1375 696 -724 1372 -561 301 693 -839 1783 -558 -1707 2850 -398 -964
1342 -964 1446 -1305 555 820 -1711 1668 -1339 -726 3768 -1995 -1170 1646 -2201 1067 533 -2502
1358 -2502 905 -1598 592 2396 -4157 144 2124 -2674 2797 -718 -3299 2403 -739 -61 1338
$$ packed form
1231A74o76K14J77j00R7M19n77M23no73Q56l63k03Q85r81M95k25j35Q81n48Q1
1252B16j51K56k17L71m03K83j12o6J110q07j059R80p41P74k84o6K7k5n7Q4M10
1273E23k98l54j67P74l77m46J21n82P99L90m70j65j20n4P80j21j757K043p78o68
1293i27O05K06J20J96j137J904j444l46J550j807J059L99k103J325L45o63K134
1310A416k068M6J496k102J963J231l622K224l0q17J652k432J263R07k425K906
1326A608k40l036L043o79j420K096j933Q62L92j532K622k341j149M557l248n66
1342i64K410k751J860K65k531L379l007O13M494n763Q25K816l847L268n34l035
1358b502L407k503K190J804o553M301J980m798N471l515k581N702l142O78J399
$$ plain form
1373 1338 -4808 2439 1746 -3245 2136 -1584 -2302 3802 -1587 -460 164 -3217 4655 -249 -3833 3486
1389 3486 -2291 -465 5199 -3587 -772 1375 -1506 4204 -2223 -3066 4143 -2444 1684 2807 -6233
1404 -6233 2890 1545 -1398 4294 -4038 -1028 5452 -3391 1923 1102 -5827 5085 2117 -3389 2390
1419 2390 -3566 1500 4705 -4466 1432 -600 -3534 7430 -2063 -4414 3603 -3042 2530 2841 -6892
1434 -6892 2121 443 -1711 5855 -5519 -2907 5219 -2930 2474 -343 -6320 4559 -64 -1129
1448 -1129 3310 -6971 1201 5711 -4842 2052 -1614 -4470 7484 -1626 -2520 2170 -5155 4298
1462 4298 3687 -6222 2414 -1537 -1029 6782 -5104 -1978 3473 -3299 5767 -408 -7069 4899 -630
1477 -630 160 4600 -7131 761 4493 -2929 4450 -2738 -4252 7226 -1294 -193 1884 -6292 4732
$$ packed form
1373A338o146P247o93m991N381l720p18O104n389J127O24l381P872m904l584P319
1389C486n777J826N664q786K815K147k881N710o427q43P209o587M128J123r040
1404f233R123j345k943N692q332L010O480q843N314q21o929J0912k968n506N779
1419B390n956N066L205r171N898k032k934J0964r493k351Q017o645N572L11r733
1434f892R013j678k154P566j1374K612Q126q149N404k817n977J0879m623j065
1448a129M439j0281Q172M510j0553O894l666k856J1954r110q94M690p325R453
1462D298o11r909Q636l951N08P811j1886L126N451o772R066o175o661J1968n529
1477f30P90M440j1731P892L732p422P379p188j514J1478q520J101K077q176J1024
$$ plain form
1492 4732 3978 -4513 3005 -3815 -773 7446 -4331 -1518 1248 -4071 6529 140 -5968 3245 -2527
1507 -2527 1579 4733 -7261 516 1978 -2322 4964 -3764 -4425 5240 -2258 1974 1443 -7389 3476
1522 3476 1990 -2379 2754 -5134 -1020 5696 -3388 1181 -358 -4901 5965 -4 -3560 2790 -3581
1537 -3581 1884 4561 -5341 1082 75 -1899 6218 -2496 -3134 3894 -2342 2820 1590 -5519 2857
1552 2857 790 -860 4290 -4444 -745 4333 -2592 2716 -305 -4237 5081 -185 -1545 2240 -4218
1567 -4218 1708 3541 -3765 1803 -1156 -2124 4731 -1852 -1650 1749 -2959 3428 1044 -4468 1572
1582 1572 -972 -548 3721 -3786 -724 2255 -2341 2871 -985 -3348 3180 -700 115 1803 -3240
1597 -3240 942 1907 -2506 1651 -1040 -2198 3095 -1713 -392 1334 -3014 1975 1064 -3058 1684
$$ packed form
1492D732p54q491P518o820L042Q219j1777K813K766n319J0600o389o108R213n772
1507b527M106L154j1994P777J462m300P286q728o61R665p498M232n31q832J0865
1522C476j486m369N133p888M114O716r084M569j539m543J0866n969l556O350o371
1537c581N465K677r902O423j007j974Q117q714o38P028o236N162j230p109Q376
1552B857k067j650N150q734L699N078o925N308l021l932R318n266j360L785o458
1567d218N926J833p306N568k959r68O855o583K02L399m708O387k384n512O040
1582A572k544M24M269p507L062K979m596N212l856k363O528l880Q15J688n043
1597c240M182R65m413M157k691j158N293m808J321J726m348M989r11m122M742
$$ plain form
1612 1684 -1272 -510 2842 -2293 58 805 -1289 2486 -55 -2193 2206 -776 592 1427 -2715 973
1628 973 1373 -1059 1386 -529 -876 1952 -629 296 222 -1693 1592 17 -1220 1260 -1131 257
1644 257 1457 -1423 283 148 -1165 1392 -84 -1015 652 -1082 205 602 -1254 437 113 -828
1660 -828 1062 -696 -524 416 -724 131 -72 -1195 416 -267 -577 528 -722 -80 611 -579 228
1677 228 -254 -741 732 -303 -176 365 -474 -116 394 -118 565 231 -43 478 -356 18 357 -463 325
1696 325 347 -410 361 85 86 357 270 216 515 -487 -10 254 -6 108 164 293 329 99 283 247 -142 321
1718 321 -93 -50 101 -168 -55 -54 -179 -294 69 -462 -27 194 -183 153 -518 -136 -98 -471 -212 9 -278
1739 -278 -106 -269 -317 105 -55 -155 -324 -348 276 -356 -30 -32 -73 -108 72 314 -788 39 -918 -88 -13 -1
$$ packed form
1612A684k956P62L352n135K351P47k094L775k541k138M399k982J368Q35m142L688
1628I73M00k432K445j915l47K828k581R25p4j915L285j575j237K480k391J388
1644B57J200k880J706j35j313K557j476r31J667j734J287L97j856J691l24r41
1660h28J890j758J72R40j140Q55k03j123J611o83l10J105j250O42O91j190Q07
1677B28m82m87J473j035J27N41q39L58N10n12O83l34k74N21q34L74L39q20P88
1696C25K2p57P71k76JK71q7n4K99j002M77K64k60J14N6J29L6k30J84l6l89M63
1718C21m14M3J51k69J13Jj25j15L63n31M35K21l77L36o71L82L8l73K59K21k87
1739b78J72j63m8M22j60j00j69k4O24o32L26km1l5J80K42j102Q27r57Q30P5J2
$$ plain form
1761 -1 -119 -394 -125 74 23 338 17 464 664 270 517 400 -784 282 419 -391 972 478 -825 368
1781 368 223 -415 1356 -161 350 -906 148 567 -298 303 453 -587 502 34 -286 601 -322 -227
1799 -227 867 -692 -45 123 -653 313 -332 -317 330 -827 520 466 -1428 380 215 -834 768 -615
1817 -615 -727 753 -606 305 -13 -1438 1012 -71 -976 790 -815 -300 755 -708 415 -382 -813
1834 -813 1430 -501 -781 1079 -1124 418 1384 -1215 674 57 -331 1669 -1213 -27 1117 -1050
1850 -1050 1182 613 -1645 1067 -213 111 1270 -1647 321 1318 -1280 1386 -308 -1570 2215 -230
1866 -230 -444 923 -1573 1135 1135 -1583 977 -1037 -909 2125 -1520 -299 851 -1701 1827 -18
1882 -18 -2313 1300 -846 186 1912 -2647 -136 1219 -1235 1570 -780 -1869 1739 -888 451
$$ packed form
1761aj18k75K69J99n1L15l21M47K00l94K47j17j184J066J37q10J363m94j303J193
1781C68j45o38J771j517N11j256J054M19q65O01J50j040J089m68l20Q87r23R5
1799b27J094j559O47J68p76R66o45J5O47j157J347n4j894J808j65j049J602j383
1817f15j12J480j359R11l18j425K450j083r05J766j605N15J055j463J123p97m31
1834h13K243j931k80J860k203J542R66k599J889o17l88K000k882J186J144k167
1850a050K232n69k258K712j280L24J159k917J968R97k598K666j694j262L785k445
1866b30k14J367k496K708%k718K560k014J28L034l645J221J150k552L528j845
1882a8k295L613k146J032J726m559K511J355k454K805k350j089L608k627J339
$$ plain form
1897 451 601 -2837 1383 1243 -1122 1154 -1826 -1118 3319 -1417 323 334 -2267 2964 83 -1630
1913 -1630 1653 -2222 560 2598 -2810 720 345 -1048 3033 -1981 -1651 1544 -981 1395 1070 -3013
1929 -3013 1374 614 -771 2417 -2442 -501 2636 -974 919 -435 -2650 2856 261 -1585 1368
1944 1368 -2758 951 2424 -3122 175 -600 -1492 3582 -1236 -1442 1311 -1896 1472 1108 -3061 913
1960 913 -49 -406 2392 -2560 -873 1898 -1286 1796 -314 -3051 2213 -83 -343 1580 -2951 712
1976 712 2102 -1677 1246 -1243 -1649 3445 -804 -596 770 -2172 2238 1399 -2020 1260 -981 70
1992 70 2939 -1942 -312 1011 -1208 2456 -184 -2121 1961 -719 559 1431 -2973 697 1346 -863
2008 -863 1798 -1407 -1346 2291 -659 214 441 -2353 1662 736 -1534 1160 -1810 -16 2357 -1768
$$ packed form
1897D51J50l438M220j40k365K276k980P08M437m736J740J1k601N231k881j713
1913a630L283l875K782K038n408L530l75j393M081n014L30L195k525K376l25m083
1929c013M387p60j385L188m859J941L137l610J893j354k215N506k595j846K953
1944A368m126L709J473n546L297p75q92N074m818k06K753l207L368l64m169L974
1960I13r62l57K798m952J687K771l184L082k110k737N264k296k60J923m531L663
1976G12J390l779K923k489m06N094m249K08J366k942M410q39l419L280k241J051
1992G0K869m881J630J323k219L664k640j937M082k680J278Q72m404L670O49k209
2008h63K661l205O1L637k950Q73K27k794M015r26k270K694k970J794K373m125
$$ plain form
2024 -1768 80 44 -1557 2058 -499 -1598 872 -1438 799 1287 -2503 397 116 -846 1586 -1549
2040 -1549 -1132 1092 -736 1017 272 -1877 1205 429 -643 1200 -1578 -154 1677 -1119 446 -106
2056 -106 -1312 1897 -205 -603 933 -1269 943 1110 -1186 573 37 -348 1456 -771 -569 897
2072 897 -843 1146 629 -1473 984 184 227 1234 -1217 -8 762 -601 853 -142 -859 1319 -70
2089 -70 -262 708 -1169 592 679 -930 879 -315 -483 1161 -685 -252 304 -787 828 480 -790
2106 -790 379 -568 -84 792 -987 167 287 -458 634 -363 -692 528 -462 -44 431 -678 159 229
2124 229 -477 334 -330 -296 471 -336 324 134 -306 529 122 -602 343 -140 -190 333 -358 313 226 -324 499
2145 499 -115 -107 382 -342 -10 111 -250 150 139 76 451 -62 -2 212 -119 187 116 -202 -140 -88 -322 -62 -93
$$ packed form
2024a768J848l6j601L615k557j099K470k310K237M88l790K900k81r62K432l135
2040a549M17K224j828J753p45k149L082p76j072J843k778J424J831k796J565n52
2056a06j206L209k102l98J536k202K212J67k296J759n36l85J804k227K02J466
2072H97j740J989n17k102K457q00M3J007k451J209P70j363J454r95p17K178j389
2089g0j92R70j877J761Q7j609J809j194j68J644j846M33N56j091J615l48j270
2106g90J169r47M84Q76j779J154J20p45J092r97l29J220r90M18M75j109Q37P0
2124B29p06Q11o64L4P67q07O60j90m40Q35m07p24R45m83n0N23o91O71q7n50Q23
2145D99o14QM89p24L32J21l61M00j1o3L75n13O0K14l31L06p1l18O2N2k34K60l1
$$ plain form
2168 -93 48 94 -327 -25 256 -52 100 -204 -132 135 -256 -79 -131 -109 102 -124 -61 252 -186 36 -189 -375
2190 -375 -49 -71 -28 -78 -12 -9 111 -79 86 -2 -1 -196 -97 151 27 -164 293 101 -432 183 198 187 85 -131
2214 -131 -93 72 -126 146 62 -132 158 -22 177 317 -37 20 172 108 148 246 -21 38 51 -173 111 -94 34
2237 34 28 -274 93 -25 5 179 2 -124 6 22 155 127 -325 244 100 75 323 -284 -148 112 -453 -78
2259 -78 37 -244 151 -84 -79 272 -258 -24 9 -360 -52 -131 -181 353 -376 8 -82 -409 311 -67 -674 169
2281 169 170 61 904 -486 150 78 -436 167 182 125 890 -797 37 687 -787 675 -331 -469 1123 61
2301 61 -192 321 -469 862 232 -631 757 161 -31 179 -515 -142 660 -308 112 -36 -463 717 -112
2320 -112 -200 373 -607 127 379 -686 325 -147 -197 967 -564 -244 616 -345 534 -81 -1096 267 -44
$$ packed form
2168i3J41M6m21L02K81l08J52l04P2K67l91J77n2K2K11k26O3L13m38K22k25j86
2190c75L26k2M3n0O6LJ20j90J65q8Jj95R9K48j24j91M57j92n33O15J5j1j02k16
2214a31L8J65j98K72q4j94K90j80J99J40l54N7J52o4M0R8k67N9J3k24K84k05J28
2237C4ol02L67j18L0J74j77j26J30J6J33k8m52N69j44k5K48o07J36K60n65L75
2259g8J15k81L95k35NL51n30K34L3l69L08p9n0N34p29L84r0l27P20l78o07Q43
2281A69Jj09Q43j390O36p2n14O03J5n7P65j687Q34O50j474J462j006j38J592j062
2301F1k53N13p90J331o30q63J388n96j92K10o94L73Q02r68M20j48m27J180q29
2320a12q8N73r80P34K52j065J011m72n0J164j531L20Q60r61Q79o15j015J363l11
$$ plain form
2339 -44 -115 778 -872 -55 774 -567 504 -100 -970 802 -187 -119 521 -1195 224 638 -638 492
2357 492 -213 -436 1126 -427 -130 23 -823 1003 202 -784 516 -567 38 1122 -776 148 551 -438
2375 -438 1143 42 -849 903 -511 262 564 -1407 426 372 -506 882 -632 -631 1123 -669 333
2392 333 205 -1177 890 303 -834 573 -850 154 1147 -958 70 -242 -756 1003 -322 -962 760
2409 760 -841 512 568 -1396 389 313 -391 929 -902 -478 921 -658 647 115 -1304 965 182
2426 182 -595 544 -1259 258 1456 -753 315 -468 -690 1472 -274 -304 441 -886 901 825 -1222
2443 -1222 478 -248 -296 1789 -909 -409 835 -395 846 -190 -842 955 -47 -184 1000 -1129
2459 -1129 21 1011 -654 702 -354 -891 1211 -513 -198 211 -1231 647 624 -811 652 -573
$$ packed form
2339d4p1Q93j650Q17Q29j341J071o04q70J772r89O8O40j716J419M14j276J130
2357D92p05k23J562j553K97J53q46J826q01r86J300j083O05J084j898R24M03r89
2375d38J581j101q91J752j414P73L02j971J833n4q78J388j514JJ754j792J002
2392C33j28j382K067n87j137J407j423J004R93k105J028l12n14J759j325o40J722
2409G60j601J353N6j964J785p6p04J320j831M24J399j579J305n32j419K269p83
2426A82p77J139j803J517J198k209J068p83k22K162j746l0P45j327J787p6k047
2443a222J700p26m8K085k698N00J244j230J241j036o52J797j002j37J184k129
2459a129J150R90j665J356j056n37K102j724L15M09j442J878k3j435J463j225
$$ plain form
2475 -573 -40 1119 -778 -312 262 -852 949 43 -1058 675 -475 306 773 -1192 -86 121 -398
2492 -398 672 -632 -829 605 -585 160 207 -1152 660 452 -401 721 -483 -7 1086 -365 40
2509 40 10 -681 849 46 -607 588 -585 471 751 -785 95 75 -238 734 -270 -488 592 -437
2527 -437 216 250 -939 527 382 78 469 -708 -142 493 -381 246 132 -631 805 -161 -319 532 -703
2546 -703 110 479 -456 62 -266 -381 740 -386 -354 472 -522 256 317 -429 147 -362 -233 472 -417 -71
2566 -71 320 -291 187 -167 -364 284 -69 -11 249 -460 419 258 -337 137 -277 -121 499 -166 -83 345 -290
2587 -290 67 280 -343 227 21 15 527 -135 246 -2 -228 456 -15 -264 338 -94 -31 245 -313 -10 175
2608 175 -227 222 -64 -145 223 -393 36 152 -318 126 164 -204 69 -298 109 228 -397 97 -12 -305 136
$$ packed form
2475e73N33J159j897M66N74j114J801r06j101J733j150P81M67j965J106K07n19
2492c98J070j304j97J434j190P45M7j359J812k08q53J122j204M76J093j451M05
2509D0l0o91J530q03o53J195j173J056K80j536Q80k0l13R72j004k18J080j029
2527d37O53L4j189J466j45l04L91j177N66O35q74O27j14p63J436r66j58Q51j235
2546g03Q13L69r35N18l28j15J121j126L2Q26r94P78O1p46N76n09J29P05q89L46
2566g1L91o11M78l54j97O48l53N8K60p09Q79j61n95M74m14J56O20o65Q3M28o35
2587b90L57K13o23N70k06oN12o62L81k48k26O84m71k49O02m32O3K76n58L03J85
2608A75m02M49k86q1L68o16M29J16m70M44L8l68K73l67M07J19o25M94j09k93M41
$$ plain form
2629 136 -45 -57 35 46 -11 68 -219 103 -98 -65 182 14 -93 341 2 93 -41 -52 125 12 -193 -3 -55
2652 -55 67 226 40 268 268 14 70 -63 -1 121 -116 -6 223 -25 65 162 5 331 119 52 195 -72 78
2675 78 -42 97 22 5 24 -27 -158 -10 119 -245 89 60 -238 -176 139 -39 -146 -124 169 105 -240 89 -12
2698 -12 -120 174 -102 111 42 -268 92 0 -75 53 25 -57 33 -47 126 105 -153 65 -86 95 17 -146 4
2721 4 -97 -45 -45 344 -159 -93 10 83 -77 -201 43 93 -234 457 84 -333 -22 52 3 10 -164 -15 144 -307
2745 -307 220 269 76 209 2 -95 169 -13 160 -288 -265 256 -114 16 305 -380 -43 17 114 81 -78 135
2767 135 78 18 -130 102 -413 293 -144 -479 292 -132 122 314 -393 128 42 -197 303 -429 -240 349 20
2788 20 197 105 -404 51 45 -363 471 -187 -148 335 -279 46 16 -531 530 56 -88 179 -352 82 400 -238
$$ packed form
2629A36j81j2R2J1n7P9k87L22k01L3K47j68j07M34l39R1j34j1J77j13k05J90n2
2652e5J22J59j86K28%k54N6j33O2J22k37J10K29k48R0R7j57L26k12o7J43k67J50
2675G8j20J39p5j7J9n1j31J48J29l64L34k9k98O2L15j78j07K2K93o4l45L29j01
2698a2j08K94k76K13o9l10L60r2p5J28k8q2R0q0J73k1k58K18j51J81p8j63J50
2721Dj01N2%L89n03O6J03P3j60j24K44N0l27O91l73m17L11P4m9Pj74J49J59m51
2745c07N27M9j93J33k07r7K64j82J73m48K3N21l70J30K89o85L37O0R7l3j59K13
2767A35n7o0j48K32n15P06m37l35P71m24K54J92p07N21q6k39N00p32J89N89l29
2788B0J77r2n09M55om08Q34o58L9M83o14L25l0n47J061m74j44K67n31M34L18o38
$$ plain form
2810 -238 178 -119 -419 394 -12 -128 249 -507 488 469 -402 408 -184 26 575 -487 -87 347 -206 249
2830 249 51 -479 560 20 -271 282 -744 15 330 -305 270 -451 -410 652 -582 111 287 -378 375
2849 375 128 -679 201 -379 -189 648 -495 -101 303 -431 507 113 -668 649 -300 126 261 -693 355
2868 355 414 -184 456 -445 -470 712 -362 216 122 -734 827 158 -401 307 -744 -41 833 -650 17
2887 17 -60 -493 715 -1 -380 331 -527 257 570 -628 120 -70 -213 539 -581 -331 500 -568 261
2906 261 -28 -833 755 248 -304 378 -552 20 770 -375 -91 -185 -590 880 -262 -375 148 -522 543
2925 543 440 -693 171 -262 -320 697 -573 -298 608 -389 360 157 -829 503 -53 -1 414 -522 -32
2944 -32 421 -221 446 -351 -714 602 -142 -277 186 -623 440 487 -593 186 -488 52 728 -468 -125
$$ packed form
2810b38M16k97l00Q13m06j16L77p56R95j9q71Q10n92K10N49j062M00M34n53M55
2830B49j98n30J039n40k91N53j026P59L15o35N75p21M1J062j234O93J76o65P53
2849C75k47q07Q80n80J90Q37j143L94M04p34R38l94p81J317r49M26J35r54J048
2868C55N9n98O40r01k5J182j074N78r4q56J561o69n59P08j051P03Q74j483O67
2887A7p7m33J208p16l79P11q58P84L13j198P48j90j43P52j120K50Q31j068Q29
2906B61k89q05J588n07n52O82r30N72P50j145K84r4m05J470j142j13N23o70J065
2925E43j03j133Q64m33n8J017j270K75R06r97P49k03r86J332n56N2M15r36M90
2944c2M53o42O67p97l63J316p44j35M63q09J063M7j080P79o74N40O76j196L43
$$ plain form
2963 -125 227 -772 507 205 -404 133 -57 -42 480 -687 171 433 -248 634 -135 -453 537 -262 18 200
2983 200 -647 454 265 -126 341 -650 -191 508 -29 56 59 -618 220 10 -369 59 -435 69 256 -315 -22
3004 -22 -8 -210 388 -373 -240 400 -254 120 215 -508 34 146 -2 277 -261 -19 476 -174 145 -17 -560
3025 -560 315 -4 -268 209 -390 128 430 -211 200 -95 -20 343 -22 -119 89 -222 358 130 -432 352 36
3046 36 -142 482 -423 178 107 -232 289 -111 -253 186 -65 -96 76 -166 -79 178 -46 169 74 -339 394 11
3068 11 167 -10 -478 179 160 -116 171 175 102 190 -61 -29 103 -227 79 -96 -80 12 -162 -72 208 -131 75
3091 75 -78 -165 190 2 -129 29 -31 -25 98 -138 204 160 78 0 46 -8 320 -43 110 -93 -58 121 23 30 170
3116 170 -185 -220 -154 -50 54 -195 -240 40 138 -138 127 77 116 -24 87 90 -36 163 -16 44 93 169 14 86
$$ packed form
2963a25L52r99J279l02o09N37j90J5N22j167Q58K62o81Q82p69l18R90p99K80J82
2983B00q47J101j89l91M67r91M59O99n37Q5Lo77Q38k10l79M28m94N04J87n71K93
3004b2J4k02N98p61J33O40o54L74R5p23N42J12j48K79n38K42M95o50L19j62n43
3025e60Q75l19k64M77n99N18L02o41M11k95P5L63l65r7K08l11N80k28n62P84l16
3046C6j78O24r05O01p1l39N21m00j42M39k51l1J72k42Q7K57k24K15r5m13P33l83
3068A1J56j77m68O57j9k76K87Mp3Q8k51L2J32l30L06j75J6R2j74R0K80l39K06
3091G5j53q7L55j88j31J58o0OJ23k36L42m4q2p8M6n4L28l63J53k03L5J79r8PJ40
3116A70l55l5O6J04J04k49m5K80R8k76K65n0L9j40J11Lj26J99j79O0M9P6j55P2
$$ plain form
3140 86 96 -185 83 -128 -75 -53 -175 382 -21 -56 39 -16 -146 43 19 -67 46 -39 -137 -64 83 53 157 -128
3164 -128 -71 141 133 -58 -168 37 198 -14 93 21 65 -23 -39 -81 4 -212 83 400 -197 -144 -129 -7 55 -200
3188 -200 103 199 -21 102 -143 -46 50 -369 25 111 128 30 163 -136 72 68 202 -98 -36 -149 -107 -272 34
3211 34 107 -84 65 81 133 -213 -16 39 -85 -41 171 -11 -56 -172 -51 196 45 -109 183 179 110 128 112 -161
3235 -161 77 -338 33 35 -273 128 -69 160 125 -192 228 307 -298 155 52 44 232 -165 185 298 -354 114
3257 114 29 -360 97 -29 -124 221 -145 173 -4 -360 248 27 -330 253 74 155 272 -405 -149 -154 -107 384
3279 384 -68 -202 253 -155 -60 -229 -162 113 42 -359 77 -437 -350 -131 27 58 -106 -619 148 -169 -437 378
3301 378 -357 843 428 -713 -278 204 -40 929 -75 -238 120 -628 485 -49 -332 75 131 -141 214
$$ packed form
3140H6J0k81K68k11N3K2j22N57m03l5R5n5j30J89k4q6J13q5r8P3J47l0J04k85
3164a28N7K12qj91j10K05J61k12J07p2M4q8j6m2Q5k16K95L17n97N3J5J22O2k55
3188b00L03R6k20J23k45R7R6m19L94Q6J7r8J33k99K08mJ34l00O2j13M2j65L06
3211C4P3j91J49J6N2l46J97N5j24M4K12j82m5j16J21K47j51j54K92mo9J8j6k73
3235a61K38m15L71Kl08M01j97K29l5l17M20P9o05M53j03qJ88l97L50J13o52M68
3257A14q5l89M57j26r5L45l66L18j77l56O08k21l57N83j79Q1J17o77K56nM7M91
3279C84m52j34M55m08R5j69O7K75p1m01M36n14Q7K19J58L1j64n13P67l17k68Q15
3301C78p35J200m15j141M35M82k44R69j004j63L58p48J113n34k83M07N6k72L55
$$ plain form
3320 214 -160 95 492 -259 99 -130 -537 324 -426 -270 95 -129 270 -10 -450 315 151 -383 134 -139
3340 -139 -5 141 -321 471 88 -42 528 -457 432 109 -60 -363 -398 -614 -497 -62 -522 553 433 -170
3360 -170 -654 -914 497 603 -308 -675 -356 -737 541 -1187 -175 70 -657 872 1043 -49 -224 -223 115
3379 115 600 103 -346 304 -534 553 102 64 189 -211 468 172 -790 530 508 -387 333 -978 -148 227
3399 227 -770 151 -256 -546 607 103 230 -133 -430 -223 1122 -927 -493 299 -12 579 -162 -573 174
3418 174 -262 -195 310 -781 8 -622 -213 572 -593 -435 408 -252 -160 -102 -316 17 61 -286 219 -847
3438 -847 218 28 64 316 -195 -31 302 -131 -269 247 -156 585 -78 -116 174 -141 -357 424 -115 -316
3458 -316 54 -247 109 -24 -152 401 320 -359 211 -406 71 361 -198 -35 -149 -327 602 -482 -180 201
$$ packed form
3320B14l74K55L97p51L58k29m07Q61p50J56L65k24L99k80m40P65j64n34N17k73
3340a39J34J46m62P92l83j30N70r85Q89l23j69l03l5k16J17M35m60J075j20o03
3360a70m84k60J411J06r11l67L19l81J278j728J012K45p27J529J71j092j75JL38
3379A15M85m97m49O50q38J087m51l8J25m00O79k96r62J320k2q95P20j311Q30L75
3399B27r97R21m07k90J153n04J27l63k97K07J345k049M34P92l11N91p41m11P47
3418A74m36O7N05j091P89o30M09P85j165J58Q43o60R2N8k14L33M4l47N05j066
3438h47J065j90L6K52n11J64L33m33j38N16m03P41o63l8K90l15k16P81n39k01
3458c16L70l01L56j33j28N53q1o79N70o17M77K90n59J63j14j78R29j084L02L81
$$ plain form
3478 201 -201 221 239 -226 431 -81 -129 361 -444 139 20 -251 241 126 -96 257 -241 122 301 -383 58
3499 58 137 41 85 -71 -39 55 5 -4 211 -221 391 67 -311 118 23 -138 255 -107 146 -126 -128 -103 78 -11 447
3524 447 -65 -110 82 -139 39 -11 -1 188 -68 -168 294 32 150 -38 -177 311 -90 -182 95 -149 36
3545 36 313 27 -47 194 -179 150 49 -65 101 -97 -8 221 -83 53 -53 -60 162 71 150 65 71 263 161
3568 161 73 288 145 -16 60 -105 -25 252 9 -130 -93 214 258 -169 -22 16 -61 -14 36 -54 -105 -220 -310 -109
3592 -109 -104 -78 -10 63 -93 63 -96 134 -181 -435 46 -70 314 275 -167 -155 111 -91 130 214 159 143 -68
3615 -68 11 212 217 572 144 67 400 107 507 -95 383 -96 29 -128 31 -80 -164 119 -299 -64 -105 -77 -85
3638 -85 174 41 67 -198 -137 64 28 -118 -59 -39 32 -45 -146 58 124 -271 -199 -118 -51 -17 -24 127 -57 3 -62 74
$$ packed form
3478B01m02M22J8m65O57n12m8M90q05N83j19k71M92j15k22L53m98L63J79o84M41
3499E8P9r6M4j56L2R4n0rK15m32O12l24l78M29r5j61L93l62K53k72kK5J81q9M58
3524D47n12m5J92k21J78n0J0J89k56j00M62k62J18j88j39M88m01r2K77k44J85
3545C6K77k86p4K41l73L29j01j14J66j98Q9K29l04J36j06pK22r1P9q5OJ92j02
3568A61q8K15j43j61P6j65Q0K77k43j39L7L07M4m27J47L8p7M7N0r0n1j15r0K01
3592a09NK6O8P3j56J56j59K30l15k54M81j16L84l9m42J2K66k02K21Q4n5j6k11
3615f8P9K01NL55m28p7L33k93M00o02M78m79J25j57J59j11q4K83m18K35m1K8q
3638h5K59j33K6k65O1K01l6j46N9K0P1p7j01K04O6l95P2Q1O7L4pJ51j84O0o5J36
$$ plain form
3664 74 -139 -43 -44 -47 21 -67 -51 55 61 118 -131 -9 88 -171 -225 -7 -159 234 -46 -104 107 158 75 -167 -153 -96
3690 -96 0 -153 -7 -250 87 145 41 73 -123 180 74 -60 47 118 -20 -19 -147 30 197 -91 119 77 -31
3713 -31 -15 163 37 421 -67 68 47 28 14 -147 -221 342 -106 193 58 -363 -392 -48 378 438 65 -114 415
3736 415 -111 525 263 -256 -215 -490 -276 665 -562 -101 -103 -626 194 1065 -911 -349 252 -521 1023 -724
3756 -724 -110 641 -342 352 133 198 113 -315 -246 583 626 100 537 -4 -537 -472 67 488 -76 57 -100 -515
3778 -515 367 78 -280 -107 2 685 -764 -160 356 -752 -348 479 421 -477 692 477 -824 605 -1002
3797 -1002 337 657 -121 -506 -771 629 721 -147 -418 19 -394 -109 -400 -602 -611 -365 -754 533 59 -712
3817 -712 337 437 733 556 -717 69 141 -106 130 -26 -350 140 157 561 212 -437 322 -465 191 782
$$ packed form
3664G4k13R6jlO8q8J6J06ON7k49J22R7k59n4K18j52L93k80n8K11N1q3k42J4N7
3690i6R6j53J46k43L37N8j04L2j96L03j06j34J07P1j38Jj28J77J67k88K10m2j08
3713c1J6J78j26L84m88J35k1j9j4j61p4N63m48K99j35m21k9L44M26O0l73j79N29
3736D15n26O36k62n19M1k75K14R41j227M61kn23Q20Q71j976N62O01p73J544j747
3756g24O14P51r83O94k19O5q5m28O9Q29M3n26M37n41n33O5N39M21n64J33j57m15
3778e15Q82k89l58J73J09O83j449O04N16j108M04Q27n8q98J169k15j301J429j607
3797a002J339L20p78l85k65J400R2q68k71M37m13K85k91k02rK46l89J287m74p71
3817g12J049J00K96j77j273P86P2k47K36j56l24M90J7M04l49o49P59p87O56N91
$$ plain form
3837 782 887 -409 -542 108 353 544 583 -647 -305 500 107 126 -503 -111 224 -32 -89 -1179 -506 -293
3857 -293 571 -406 551 29 1040 179 1213 -283 162 -60 -219 -1062 205 393 -277 168 80 -133 -252
3876 -252 -69 -141 -455 -246 -617 -415 -27 -324 -322 -337 -252 -21 -160 71 506 -466 -661 97 -37 267 315 -346
3898 -346 888 143 125 -438 -139 3 -142 -277 -331 161 33 559 68 -761 227 416 167 492 -217 526
3918 526 140 104 670 258 -98 -527 -40 742 -1333 -223 -2 678 172 145 431 1087 261 -196 1120 -47
3938 -47 51 -1 644 -1260 -19 188 501 270 -218 1005 -345 -80 814 -496 -62 404 -1135 -64 -224
3957 -224 347 -316 261 885 -53 -511 -900 -296 235 240 -302 -348 111 -129 -11 -992 88 268 7 -327 -161
3978 -161 40 -300 -266 -522 50 -206 -102 -249 -44 -1014 -566 101 -279 -138 -366 -490 -183 129 116 -454 -9
$$ packed form
3837G82J05j296j33O50K45J91L9j230L42Q05l93J9o29L92L35k56n7j090O73K13
3857b93Q64r77R57n22J011q61J034j496M45k22j59q43J267J88o70M45q8k13j19
3876b52J83p2l14K09l71K02L88k97Kj5Q5K31j39K31M35r72j95P58j34L04M8o61
3898c46J234p45j8n63K99J42j45j35n4M92j28N26m91q29R88J89k49L25p09P43
3918E26l86l6N66m12l56m29M87P82k075J110K21O80n06k7K86O56q26m57J316j167
3938d7R8n2O45j904J241K07L13k31m88J223j350K65Q94j310M34M66j539J071j60
3957b24N71o63N77O24r38m58l89O04N31Nn42m6M59k40J18r81J080J80k61l34J66
3978a61K01l40L4k56N72k56J04j47K05r70M48O67l80J41k28j24L07L12j3n70M45
$$ plain form
3999 -9 -78 -169 552 317 -305 97 174 705 -498 -449 -77 -20 -172 -234 -31 -398 251 112 -220 122 -72 111
4021 111 220 -113 -167 180 -668 -278 -106 -39 -186 -180 164 14 -216 149 61 -57 120 -138 148 -15 -105 -109 152
4044 152 -151 29 -196 -194 95 4 -40 6 -43 -75 51 -231 109 14 -130 -138 -209 -154 66 -168 201 -51 47 14 158
4069 158 -62 -19 119 -37 35 -25 20 80 82 228 31 107 174 -15 14 187 -269 456 -96 -191 308 -83 -226 150
4093 150 156 536 28 -238 -1054 -207 -498 -249 -204 207 104 -316 263 -462 -700 202 145 115 208 -491 243 419
4115 419 403 141 150 -133 316 -248 -62 310 -132 178 570 -676 -135 18 -572 51 204 30 -253 -10 -169
4136 -169 -327 -217 108 -436 -288 -55 71 -200 -266 79 16 -158 -272 -176 -446 603 544 -296 136 469 -297
4157 -297 230 -363 -122 -149 -582 -132 -276 -150 -271 -149 -236 -252 354 -196 -173 244 54 18 -16 -360 -251 -323
$$ packed form
3999io9r1P21k35o22M02P7N31j203M9L72N7j52o2K03l67O49j39l32L42j94J83
4021A11J09l33n4L47q48L90J72O7j47OL44j50k30L65q8j18J77k58K86j63r0mK61
4044A52l03J80k25KK89r1m4M6m9l2J26k82L40r5j44qp1N5K20k34L69k52R8l3J44
4069A58k20M3J38j56P2o0M5O0KJ46j97P6O7j89K9J73m56P25n52r5M99l91j43L76
4093A50OL80n08k66q16Q47k91K49M5M11j03m20N79p25k38R02n7l0R3o99P34J76
4115D19j6k62Rk83M49n64J86L72m42L10L92j246N41J53n90O23J53j74k83K43j59
4136a69j58J10L25n44J48K33J26k71o6L45o3j74j14R6k70J049n9q40M32L33p66
4157b97N27n93K41k7m33M50j44J26j21J22q7j6O06n50K3M17j90l6l4l44J09p2
$$ plain form
4179 -323 -75 -61 -279 328 -628 -71 -286 -285 -167 149 -102 260 -432 83 173 182 7 -336 257 315 -461 -66
4201 -66 -54 429 -307 -417 -98 -314 155 144 -71 490 -242 -459 -577 696 -188 7 -579 357 29 -12 -353
4222 -353 263 132 -222 -267 104 -519 -411 -641 -219 4 -202 228 -262 -82 -526 389 -247 58 -280 -747
4242 -747 188 -799 40 -488 319 -286 612 462 370 -118 -450 -447 -182 305 335 -243 -1120 -667 -581 73 -633 -675
4264 -675 524 1039 62 -240 -575 -802 -167 -869 -39 -236 -234 -345 216 -150 379 605 -178 -742 -673 -1093 425
4285 425 -539 18 527 -284 -312 -64 276 122 70 156 -726 263 333 69 -603 199 -40 486 -64 -196 131
4306 131 211 49 -91 -203 -76 107 -56 -570 -612 217 216 428 -58 -447 62 -29 315 138 87 104 -534 -130
4328 -130 328 -191 -64 349 -341 -11 -43 -265 304 599 149 -184 -43 -453 118 -705 -122 74 -408 -1022
$$ packed form
4179c23K48J4k18O07r56N57k15JJ18L16k51L62o92N15R0Rj75l43N93N8p76L95
4201f6J2M83p36j10L19k16M69j1k15N61p32k17j18J273q84J95n86R36l28m1l41
4222c53O16j31l54m5L71o23J08k30M22K23k06M30m90J80m44R15o36L05l38m67
4242g47R35r87Q39n28Q07o05Q98j50r2m88l32LK65M87L0n78q77M53Q6O54p06m2
4264f75J199N15r77l02l35k27O35p02Q30j97Kj11N61l66N29K26p83n64O9m20J518
4285D25r64N57N09q11k8K48L40j54n2Q6q82R89P0k64o72Q02k39N26n50j32L27
4306A31Q0j62j40j12J27J83j63n14m2Q29jK12m86l89N09r1L44j77n1J7o38M04
4328a30M58n19J27M13o90L30l2k22N69K95m50l33J41m10N71q23N83J96m82o14
$$ plain form
4348 -1022 604 32 439 716 359 219 -200 -541 -462 326 -43 467 -513 146 368 -9 83 -209 -285 47
4368 47 -129 79 -453 -366 189 -419 185 -357 -333 685 184 -95 -21 302 -291 254 29 103 -216 47 442
4389 442 -234 -74 85 -289 -192 396 -175 -226 69 -448 169 -53 -88 -123 -17 130 68 -203 98 -563 1130
4410 1130 515 -134 537 305 669 -410 -654 402 165 -154 587 368 310 -534 520 -685 631 394
4428 394 75 -274 216 -450 420 58 -80 0 216 -239 -217 13 -66 346 70 258 -312 -158 -300 -25 215
4449 215 -116 306 214 -16 146 3 -508 -22 -257 -393 74 -104 158 -159 123 92 -132 -436 241 406 -109
4470 -109 9 -148 299 95 -279 -249 169 -175 -496 -563 -182 -33 -839 -327 -449 -960 -503 680 426 -271
4490 -271 -263 -658 -514 947 -59 705 -11 455 182 -467 -131 129 -591 -21 -229 671 -242 -947 225 81
$$ packed form
4348a022J626n72M07K77l57j40m19l41P9P88l69N10r80O59K22l77R2k92p6L32
4368D7j76K08n32Q7N55o08O04n42K4J018n01k79P4L23n93N45k25P4l19K63L95
4389D42o76J60J59l74R7N88n71n1K95n17O17k22l5l5J06J47o2k71L01o61J693
4410A130o15o49O71k32L64j079k44J056k37l19P41k19n8q44J054j205J316k37
4428C94l19l49M90o66Q70l62j38Q0K16m55K2K30p9M12k76J88n70J54j42K75K40
4449B15l31M22r2k30J62j43n11M86k35j36M67j78K62l17K82l1k24l04O77J65n15
4470a09J18j57M47k04l74L0M18l44l21o7L81J49q06N12j22n11M57J183k54o97
4490b71Ql95J44J461j006P64p16M66k73o49L36K60p20N70k08R00r13p05J172j44
$$ plain form
4510 81 486 -244 -125 -255 516 758 17 1 34 111 182 137 615 -365 -151 -154 -55 174 42 167 -151 -236 -290 236
4534 236 359 -224 14 -104 549 34 -373 -107 393 -161 -90 -127 73 483 -197 -207 -327 -166 -158 -49 38 89
4556 89 180 -47 489 230 433 6 -199 61 399 212 -68 -96 -14 -297 -70 -63 -61 -5 -94 -61 -346 -122 -375 -38
4580 -38 -3 -34 266 115 115 -188 165 44 -271 384 8 -106 -516 -291 -408 274 113 -598 357 -332 91 216
4602 216 -122 -470 252 343 -78 7 -82 267 -340 613 311 267 279 -421 72 63 -212 -156 -58 85 352 -374 -461
4625 -461 255 -237 -434 589 17 -132 -18 -147 21 -186 289 94 627 -70 -331 -205 -408 -57 -28 245
4645 245 127 -398 141 470 -329 -83 -62 -379 -98 184 -357 194 42 -27 252 -166 -355 -240 -143 -33 109
4666 109 -363 -169 -109 128 -193 -263 -96 -14 516 298 279 564 -26 -19 252 -184 -125 423 -207 18 -264 -367
$$ packed form
4510H1M05p30J19j30P71K42p41j6L3P7P1m5M78r80K14lR9K29j32J25l18q5n4N26
4534B36J23n83K38j18O53n15m07K66N00n54P1l7K00M10o80j0j20J61QJ09Q7N1
4556H9R1k27N36k59K03m27k05K60L38j87k80k8Q2k83K27PKN6q9L3k85K24k53L37
4580c8L5l1L00j51%l03L53j21l15O55l76j14m10K25j17O82j61p11R55o89M23J25
4602B16l38l48P22R1m21Q5q9L49o07R53l02m4J2p00M93rk75N6R8J43K67p26q7
4625d61P16m92j97J023n72j49J14j29J68k07M75j95N33o97k61J26k03L51K9K73
4645B45j18n25N39L29p99K46K1l17K81K82n41N51j52o9K79m18j89J15R7J10J42
4666A09m72J94O0K37l21p0J67Q2N30k18j9K85n90PK71m36N9N48o30K25k82j03
$$ plain form
4688 -367 151 -93 -380 -115 44 -24 124 -172 -411 -41 123 97 -137 -107 30 -100 96 40 91 255 200 -113
4710 -113 72 -89 -5 50 -162 28 76 48 21 -70 47 100 -109 38 -213 -149 238 -123 68 158 -160 62 -153
4733 -153 28 -103 4 -198 -93 43 -186 -37 77 -64 -91 -194 -170 43 250 181 -152 45 -78 26 19 101
4755 101 91 -52 124 -28 -84 -138 -18 -87 -1 -90 18 -212 -172 -7 -172 -23 -54 182 -180 -294 127 167 145
4778 145 257 55 386 35 -253 -296 68 81 -312 -442 -126 -37 -191 270 290 -81 -59 -437 -262 469 40 -36
4800 -36 470 -142 -24 -61 239 -88 -242 -128 54 441 312 -107 -12 -288 73 628 126 -147 -196 215 -27
4821 -27 8 -151 227 110 -201 264 226 192 76 189 -113 275 -180 194 179 -278 -43 79 -351 -250 108 111
4843 111 -106 -94 -65 -185 -133 275 295 21 -119 -359 426 -561 330 184 460 -163 -850 -378 -34 0 549 589
$$ packed form
4688c67N18k44k87K65J59o8J48k96k39L70J64k6k34L0J37j30J96n6N1J64n5l13
4710a13J85j61Q4N5k12J90M8k8k7r1J17N3k09J47k51O4L87l61J91R0l18K22k15
4733a53J81j31J07k02J05J36k29J49J14j41k7j03K4K13K07o9l33J97j23J04pQ2
4755A01j0j43J76j52n6n4J20o9Q6q9J08k30M0J65j65J49l1K36l62j14M21M0k2
4778A45J12k02L31l51k88m3L64J3l93j30L16Q9j54M61K0l71K2l78J75P31m29p6
4800c6N06o12J18l7L00l27j54J14J82L87j29m19R5k76L61N55n02k73m9M11k42
4821b7L5j59L78j17l11M65l8l4j16J13l02L88m55L74j5m57K35J22m30J01L58L
4843A11k17J2K9j20N2M08K0k74j40k40P85r87Q91j46K76o23o87M72L44L4N49M0
$$ plain form
4865 589 -192 551 -344 204 -228 313 163 -866 -204 -364 -105 -433 257 -190 -28 -148 -91 -760 -165 -598
4885 -598 62 -431 422 -431 -414 -589 449 643 -278 -392 -788 -157 -164 -419 -40 -545 -301 279 751 857 -206
4906 -206 -115 -43 -696 135 -315 -69 222 -298 173 465 -54 -231 -586 -292 -238 -147 326 -143 123 138 -409 328
4928 328 -218 -74 -1372 -380 -643 705 -250 -476 390 27 -501 -406 475 -351 -179 315 69 556 98 -358
4948 -358 -187 197 -679 146 59 -214 -71 716 -626 413 -755 -687 284 -312 -573 89 -442 -725 196 -240
4968 -240 106 295 -419 211 363 111 -471 -414 392 344 1066 -361 79 96 -381 -50 26 -177 292 -465 502
4989 502 14 305 109 -459 -293 60 23 1 60 -505 390 -652 246 -523 -332 -602 -356 657 338 81
5009 81 -572 -292 126 -139 74 -134 312 165 89 380 -206 271 237 200 77 -140 170 -57 -18 224 -60 91
$$ packed form
4865E89p81P43q95N48m32N41j50j029O62j60K59l28O90m47J62j20N7o69N95m33
4885e98O60m93Q53q53J7j75J038J94r21j14l96O31pk55L79n05K44N80M72J06j063
4906b06R1P2o53Q31m50K46K91n20M71K92n19j77l55K94N4R1M73m69K66J5n47P37
4928C28n46J44j298R92k63J348r55k26Q66l63n28R5Q81q26J72M94k46M87m58m56
4948c58J71L84q76Q25q7k73J43P87j342J039j168O8R71n96k61O62n31k83R21m36
4968b40L46J89p14O30J52k52n82N7Q06m8P22j427M40J7m77L31P6k03M69p57R67
4989E02m88K91j96n68J66L53l7k2N9n65Q95j042Q98p69J91k70K46J013l19k57
5009H1o53K80M18k65K13k08M46j47p6K91n86M77l4l7j23k17L10k27L9K42k84J51
$$ plain form
5031 91 144 -371 229 152 -9 -166 204 -98 140 74 497 210 429 -43 451 124 -263 358 -411 201 -48
5052 -48 92 -83 279 -18 278 -83 -180 142 324 -189 -143 225 -59 -317 136 -644 -256 -135 237 -16 -188
5073 -188 -122 -99 124 -273 -34 -39 7 8 -77 -157 306 -75 160 222 -401 64 71 -181 251 0 73 71 -101 183 125
5098 125 -57 57 -192 20 183 -264 -26 -77 176 -144 -206 125 90 -118 -160 9 228 48 27 83 116 -784
5120 -784 153 -144 -318 88 499 326 166 -31 -249 84 157 -89 43 -102 -60 156 131 76 178 -22 25 72
5142 72 -236 -14 24 72 -240 53 19 155 108 150 -55 -99 122 -54 236 211 -66 47 -50 -153 87 -99 -74
5165 -74 -12 70 113 -196 -44 -28 -152 -88 31 -298 -20 35 -101 48 -134 -6 -181 -470 -262 -196 223 -397 354
5188 354 594 579 -276 -90 -343 -90 328 -7 215 -816 -127 132 715 -264 282 -101 -28 422 75 -373
$$ packed form
5031I1N3n15O00p7j61j57L70l02K38o6M23k87K19m72M94l27l87O21p69O12k49
5052d8J40j75L62k97K96l61r7L22J82n13M6L68k84k58M53p80L88J21L72k53j72
5073a88O6K3K23l97K39nM6Jq5q0M63l81K35O2o23M65Pk52M32k51P3kj72K84n8
5098A25j82J14k49K12J63m47K38n1K53l20o2L31l5k08m2J69K19j80k1N6L3r00
5120g84R37k97j74M06M11j73j60j97k18L33P3k46J32j45M2K16k5n5J02k00M7M7
5142G2l08K22L8M8l12K93l4J36m7M2k05m4K21j76K90k5k77J13r7j03K40j86K5
5165g4O2Q2M3l09J52J6j24O4J19l29K78N5j36J49j82J28j75k89K08O6M19o20P51
5188C54K40j5q55J86k53K53M18l35K22j031O89K59N83r79N46l83P3M50l47m48
$$ plain form
5208 -373 124 136 -163 -37 -380 -415 -53 359 212 -71 -62 247 -528 313 -59 -151 -239 -179 423 -171 -296 -196
5230 -196 -13 -673 229 116 -252 -212 -25 229 195 -348 195 -127 -280 4 252 85 -231 -100 -69 -85 -490
5251 -490 51 194 333 -175 -392 0 -64 298 -57 -330 -254 847 15 -52 245 -23 281 323 316 27 -16 781
5273 781 277 -117 -744 136 173 -48 393 -295 516 368 -110 57 74 337 -160 -144 278 -4 -113 60 -483
5294 -483 11 -110 -1103 260 26 -341 -661 247 352 -325 -510 294 -173 -94 -186 76 -26 -25 -217 345 -51
5315 -51 72 -106 -26 -110 -42 -123 251 96 6 -14 -143 -683 -81 638 89 1022 96 -269 -11 -186 81 -221
5337 -221 148 209 221 -548 309 184 227 597 -451 39 -1037 -312 302 967 -744 207 533 -83 190 -124
$$ packed form
5208c73M97J2k99J26l43l5L62M12j47k83RL09p75Q41l72r2q8O0O02n94j25J00
5230a96J83o60R02j13l68M0J87K54l4n43N43l22j53K84K48j67l16J31L1j6m05
5251d90N41J43J39n08k17L92o4L62l55k73P6J101q32o7K97k68L04M2pk89m3P97
5273G81n04l94o27Q80L7k21M41o88Q11j48m78J67J7K63m97J6M22k82j09J73n43
5294d83M94j21r93J363k34l67l20R08J05o77j85Q04m67P9r2K62j02Jj92N62l96
5315e1J23j78Q0q4O8q1L74j55r0k0j29n40O02P19n49R33r26l65K58j75K67l02
5337b21L69O1J2p69Q57j25M3L70j048M90j076P25O14O65j711R51L26o16K73l14
$$ [...]
8191b26
##END NTUPLES=NMR FID
##END=
