##TITLE=1H_SR31-kr2
 d6,8 sc, 
 11.02.2021
##JCAMPDX= 6.0         $$ Bruker NMR JCAMP-DX V2.0
##DATA TYPE= NMR FID
##DATA CLASS= NTUPLES
##ORIGIN= UXNMR, Bruker Analytische Messtechnik GmbH
##OWNER= root
$$ XWIN-NMR		Version 3.5
$$ Thu Feb 11 09:59:07 2021 Russian Standard Time (UT+4h)  she@DPX200
##.OBSERVE FREQUENCY= 200.1315066352
##.OBSERVE NUCLEUS= ^1H
##.DELAY= (6, 6)
##.ACQUISITION MODE= SIMULTANEOUS
##.ACQUISITION SCHEME= undefined
##.AVERAGES= 8
##.DIGITISER RES= 18
##SPECTROMETER/DATA SYSTEM= spect
##.PULSE SEQUENCE= zg30
##.SOLVENT NAME= CD3CN
##.SHIFT REFERENCE= (INTERNAL, CD3CN, 0, 15.7039)
##AUDIT TRAIL= $$ (NUMBER, WHEN, WHO, WHERE, WHAT)
$$ ##TITLE= Audit trail, XWIN-NMR		Version 3.5
$$ ##JCAMPDX= 5.01
$$ ##ORIGIN= Bruker BioSpin GmbH
$$ ##OWNER= she
$$ F:/spectra/data/she/nmr/H-F/1/audita.txt
$$ ##AUDIT TRAIL=  $$ (NUMBER, WHEN, WHO, WHERE, WHAT)
(   1,<2021-02-11 09:58:02.40 +0400>,<she>,<DPX200>,
      <created by zg, POWCHK disabled, PULCHK disabled
       configuration hash MD5:
       00 E9 B6 7A A2 85 ED C7 34 08 36 98 17 FE 4E 26
       data hash MD5: 16K
       F3 A2 D4 AC C7 39 F6 CA F9 DD D8 CA 27 53 F0 C8>)
$$ ##END=
$$ 
$$ hash MD5
$$ 2F BB B3 81 F2 81 45 9B BD 8E C8 2E 8D 70 EF 33
##$RELAX= 
##$RELAX= 
##$RELAX= 
##$RELAX= 
##$RELAX= 
##$RELAX= 
$$ Bruker specific parameters
$$ --------------------------
##$DU= <F:/spectra>
##$EXPNO= 1
##$NAME= <H-F>
##$PROCNO= 1
##$TYPE= <nmr>
##$USER= <she>
##$AMP= (0..31)
100 100 100 100 100 100 100 100 100 100 100 100 100 100 100 100 100 100 
100 100 100 100 100 100 100 100 100 100 100 100 100 100 
##$AQSEQ= 0
##$AQ_mod= 1
##$AUNM= <au_zg>
##$AUTOPOS= <>
##$BF1= 200.13
##$BF2= 200.13
##$BF3= 200.13
##$BF4= 200.13
##$BF5= 200.13
##$BF6= 200.13
##$BF7= 200.13
##$BF8= 200.13
##$BYTORDA= 1
##$CFDGTYP= 0
##$CFRGTYP= 5
##$CHEMSTR= <none>
##$CNST= (0..31)
1 1 145 1 1 1 1 1 1 1 1 1 1 1 1 1 1 1 1 1 1 1 1 1 1 1 1 1 1 1 1 1 
##$CPDPRG= <>
##$CPDPRG1= <>
##$CPDPRG2= <>
##$CPDPRG3= <>
##$CPDPRG4= <mlev>
##$CPDPRG5= <mlev>
##$CPDPRG6= <mlev>
##$CPDPRG7= <mlev>
##$CPDPRG8= <mlev>
##$CPDPRGB= <>
##$CPDPRGT= <>
##$D= (0..31)
0 1.2 0 0 0 0 0 0 0 0.06 0 0.03 0 0 0 0 0.0002 0 0 0 0 0 0 0 0 0 0 0 0 
0 0 0 
##$DATE= 1613023081
##$DBL= (0..7)
120 120 120 120 120 120 120 120 
##$DBP= (0..7)
150 150 150 150 150 150 150 150 
##$DBP07= 0
##$DBPNAM0= <>
##$DBPNAM1= <>
##$DBPNAM2= <>
##$DBPNAM3= <>
##$DBPNAM4= <>
##$DBPNAM5= <>
##$DBPNAM6= <>
##$DBPNAM7= <>
##$DBPOAL= (0..7)
0.5 0.5 0.5 0.5 0.5 0.5 0.5 0.5 
##$DBPOFFS= (0..7)
0 0 0 0 0 0 0 0 
##$DE= 6
##$DECBNUC= <off>
##$DECIM= 32
##$DECNUC= <off>
##$DECSTAT= 4
##$DIGMOD= 1
##$DIGTYP= 9
##$DL= (0..7)
0 120 120 120 120 120 120 120 
##$DP= (0..7)
150 150 150 150 150 150 150 150 
##$DP07= 0
##$DPNAME0= <>
##$DPNAME1= <>
##$DPNAME2= <>
##$DPNAME3= <>
##$DPNAME4= <>
##$DPNAME5= <>
##$DPNAME6= <>
##$DPNAME7= <>
##$DPOAL= (0..7)
0.5 0.5 0.5 0.5 0.5 0.5 0.5 0.5 
##$DPOFFS= (0..7)
0 0 0 0 0 0 0 0 
##$DQDMODE= 0
##$DR= 18
##$DS= 0
##$DSLIST= <SSSSSSSSSSSSSSS>
$$ [...]
##$SUBNAM2= <"">
##$SUBNAM3= <"">
##$SUBNAM4= <"">
##$SUBNAM5= <"">
##$SUBNAM6= <"">
##$SUBNAM7= <"">
##$SUBNAM8= <"">
##$SUBNAM9= <"">
##$SW= 16.9725356469052
##$SWIBOX= (0..15)
0 0 2 0 0 0 0 0 0 0 0 0 0 0 0 0 
##$SW_h= 3396.73913043478
##$TD= 16384
##$TD0= 1
##$TE= 0
##$TE2= 300
##$TE3= 300
##$TEG= 300
##$TL= (0..7)
0 120 120 120 120 120 120 120 
##$TP= (0..7)
150 150 150 150 150 150 150 150 
##$TP07= 0
##$TPNAME0= <>
##$TPNAME1= <>
##$TPNAME2= <>
##$TPNAME3= <>
##$TPNAME4= <>
##$TPNAME5= <>
##$TPNAME6= <>
##$TPNAME7= <>
##$TPOAL= (0..7)
0.5 0.5 0.5 0.5 0.5 0.5 0.5 0.5 
##$TPOFFS= (0..7)
0 0 0 0 0 0 0 0 
##$TUNHIN= 0
##$TUNHOUT= 0
##$TUNXOUT= 0
##$USERA1= <user>
##$USERA2= <user>
##$USERA3= <user>
##$USERA4= <user>
##$USERA5= <user>
##$V9= 5
##$VALIST= <valist>
##$VCLIST= <CCCCCCCCCCCCCCC>
##$VD= 0
##$VDLIST= <DDDDDDDDDDDDDDD>
##$VPLIST= <PPPPPPPPPPPPPPP>
##$VTLIST= <TTTTTTTTTTTTTTT>
##$WBST= 1024
##$WBSW= 4
##$XGAIN= (0..3)
0 0 0 0 
##$XL= 0
##$YL= 0
##$YMAX_a= 52468
##$YMIN_a= -38648
##$ZGOPTNS= <>
##$ZL1= 120
##$ZL2= 120
##$ZL3= 120
##$ZL4= 120
##$ABSF1= 10
##$ABSF2= 0
##$ABSG= 5
##$ABSL= 3
##$ALPHA= 0
##$AQORDER= 0
##$ASSFAC= 0
##$ASSFACI= 0
##$ASSFACX= 0
##$ASSWID= 0
##$AUNMP= <proc_1d>
##$AZFE= 0.1
##$AZFW= 0.1
##$BCFW= 1
##$BC_mod= 2
##$BYTORDP= 1
##$COROFFS= 0
##$CY= 11.3945322036743
##$DATMOD= 1
##$DC= 2
##$DFILT= <>
##$DTYPP= 0
##$F1P= 15.9154993809931
##$F2P= -4.1035820241983
##$FCOR= 0.5
##$FTSIZE= 0
##$FT_mod= 4
##$GAMMA= 1
##$GB= 0.15
##$INTBC= 1
##$INTSCL= 1
##$ISEN= 128
##$LB= 0.24
##$LEV0= 0
##$LPBIN= 0
##$MAXI= 10000
##$MC2= 0
##$MEAN= 0
##$ME_mod= 0
##$MI= 1.114404
##$NCOEF= 0
##$NC_proc= 0
##$NLEV= 6
##$NOISF1= 3.799351
##$NOISF2= 2.8
##$NSP= 1
##$NTH_PI= 0
##$NZP= 0
##$OFFSET= 15.70392
##$PC= 1
##$PHC0= -10758.86
##$PHC1= 13.20095
##$PH_mod= 1
##$PKNL= yes
##$PPARMOD= 0
##$PSCAL= 0
##$PSIGN= 0
##$REVERSE= no
##$SF= 200.130013532006
##$SI= 16384
##$SIGF1= 3
##$SIGF2= 2
##$SINO= 400
##$SIOLD= 16384
##$SREGLST= <1H.CDCl3>
##$SSB= 0
##$STSI= 0
##$STSR= 0
##$SW_p= 3612.71676300578
##$SYMM= 0
##$S_DEV= 0
##$TDeff= 0
##$TDoff= 0
##$TI= <>
##$TILT= no
##$TM1= 0
##$TM2= 0
##$TOPLEV= 0
##$USERP1= <user>
##$USERP2= <user>
##$USERP3= <user>
##$USERP4= <user>
##$USERP5= <user>
##$WDW= 1
##$XDIM= 8192
##$YMAX_p= 0
##$YMIN_p= 0
$$ End of Bruker specific parameters
$$ ---------------------------------
##NTUPLES= NMR FID
##VAR_NAME=  TIME,          FID/REAL,        FID/IMAG
##SYMBOL=    X,             R,               I
##VAR_TYPE=  INDEPENDENT,   DEPENDENT,       DEPENDENT
##VAR_FORM=  AFFN,          ASDF,            ASDF
##VAR_DIM=   8192,          8192,            8192
##UNITS=     SECONDS,       ARBITRARY UNITS, ARBITRARY UNITS
##FACTOR=    0.0002944,     1,               1
##FIRST=     0,             0,               0
##LAST=      2.4114304,     0,               0
##MIN=       0,             -38648,          0
##MAX=       2.4114304,     52468,           0
$$ Real data points
##PAGE= N=1
##DATA TABLE= (X++(R..R)), XYDATA
$$ [...]
$$ plain form
2007 77 -81 -176 203 109 -30 -225 140 -271 -117 -56 -42 394 -126 -81 42 86 -111 -201 -110 285 -19 -95 -10 -149
2031 -149 167 178 100 -172 -55 -38 200 -27 -39 -290 -12 4 -269 -240 90 295 -90 64 262 -66 -88 117
2053 117 150 153 218 114 -279 69 39 -19 -137 -11 83 -224 70 118 91 -104 133 25 -212 56 221 -66 96
2076 96 -15 321 -89 128 162 -325 -39 158 37 97 263 97 -34 9 375 33 -13 -135 102 -65 -107 62
2098 62 175 237 56 -41 126 169 298 -432 177 178 -237 97 41 190 -175 -80 -27 -41 52 157 158 35 279 120
2122 120 -163 196 -30 25 -44 -49 381 -58 -284 112 67 95 -169 149 -97 99 52 -169 -58 -112 -226 -132 210
2145 210 -124 -210 260 146 -135 6 -73 -81 267 -58 28 61 -93 230 64 111 154 -24 45 181 -26 -220 -100
2168 -100 229 -94 13 -168 10 29 -145 26 192 -87 34 -214 79 0 -197 108 255 384 -156 -873 120
$$ packed form
2007G7j58r5L79r4j39j95L65m11J54O1J4M36n20M5J23M4j97r0R1L95l04p6Q5j39
2031a49L16J1p8k72J17J7K38k27j2k51K78J6k73K9L30K05l85J54J98l28k2K05
2053A17L3LO5j04l93L48l0n8j18J26R4l07K94M8k7j95K37j08k37K68J65k87J62
2076I6j11L36m10K17L4m87K86J97j21O0J66j66j31M3L66l42m6j22K37j67m2J69
2098F2J13O2j81r7J67M3J29p30O09Jm15L34n6J49l65R5N3j4R3J05Jj23K44j59
2122A20k83L59k26N5o9nM30m39k26L96m5K8k64L18k46J96m7k21J11n4j14R4L42
2145B10l34q6M70j14k81J41p9qL48l25Q6L3j54L23j66M7M3j78O9J36k07j94J20
2168a00L29l23J07j81J78J9j74J71J66k79J21k48K93p9j97L05J47J29n40p17R93
$$ plain form
2189 120 325 -229 -386 505 126 -106 -82 491 270 535 -138 -389 378 -5 -402 -81 565 45 -74 459
2209 459 -167 593 666 -552 -4 -319 183 -115 153 407 414 379 -7 -106 -1 -155 -86 -63 -68 -47 -188 53 -47
2232 -47 202 -36 -125 180 -25 -189 18 -36 -117 -12 131 -45 -124 139 211 -210 -90 66 145 -289 66 -107
2254 -107 14 120 -120 -44 43 -16 126 115 43 164 -24 95 -209 -350 221 214 104 -459 11 -293 -978 745
2276 745 239 -50 -588 -238 450 -146 -155 -384 -40 -261 217 -143 -155 -65 -123 117 -57 -59 60 113 -27 -16 68
2299 68 -58 162 -70 -147 38 199 -226 -90 401 -22 -12 -187 -232 -85 -34 -107 15 -45 4 73 -225 81 -60
2322 -60 -30 72 -168 -227 237 35 -125 61 -14 -2 260 221 -2 -224 179 -113 237 -139 -122 28 -661 116
2344 116 -355 -343 20 151 -506 264 -115 978 377 474 -92 -54 338 -343 266 179 126 -122 24 -20 -5 58
$$ packed form
2189A20K05n54j57Q91l79k32K4N73k21K65o73k51P67l83l97L21O46n20j19N33
2209D59o26P60P3j218N48l15N02k98K68K54Pl5l86r9J05j54O9K3nK1j41K41j00
2232d7K49k38q9L05k05j64K07n4q1J05J43j76p9K63P2m21J20J56P9m34L55j73
2254a07J21J06k40P6Q7n9J42j1p2J21j88J19l04j41N71pj10n63M70l04o85J723
2276G45n06k89n38L50O88n96rk29L44k21M78l60j2R0n8K40j74kJ19N3j40J1Q4
2299F8j26K20k32p7J85J61m25J36M91m23J0j75m5J47N1p3J22o0M9O9k98L06j41
2322f0L0J02k40n9M64k02j60J86p5J2K62l9k23k22M03k92L50l76J7J50o89P77
2344A16m71J2L63J31o57P70l79J093o01R7n66L8L92o81O09q7n3k48J46m4J5O3
$$ plain form
2366 58 -53 267 -377 -27 -186 -468 31 -861 84 353 -284 -79 -28 -29 287 -98 -131 -48 -244 112 121 -25 -13
2389 -13 199 185 14 -47 108 103 -298 64 -126 -137 -53 -47 -190 -127 198 -57 132 -10 -90 170 -14 -99 -4 -7 -98
2414 -98 -152 112 -32 -38 -275 25 81 -145 -47 -146 -73 11 -235 -157 240 -70 -38 365 -40 -117 -59 -344 205 -253
2438 -253 -147 76 275 -390 -627 128 -147 -276 101 128 -135 -2 -97 57 -87 54 -133 167 200 -27 92
2459 92 193 -36 -35 -32 -29 140 -81 -108 -153 -47 4 -109 -20 10 -178 -14 125 160 -37 -232 -185 330 -165 -21 99
2484 99 -113 -91 34 74 21 -94 126 -18 -156 179 -107 -377 -106 54 83 78 27 84 32 -116 -38 -260 -65 3
2508 3 29 -154 45 -114 -12 -11 -221 106 -62 44 -166 -164 205 -223 -30 121 -99 -34 -126 106 64 56 -52 38
2532 38 54 31 -110 196 12 -37 125 -59 -89 -124 -31 228 2 -89 144 166 -76 138 159 28 -109 111 -50
$$ packed form
2366E8j11L20o44L50j59k82M99q92R45K69o37K05N1jL16l85l3Q3j96L56Rj46J2
2389a3K12j4j71o1J55nm01L62j90j1Q4Oj43O3L25k55J89j42q0K60j84q5R5lr1
2414i8n4K64j44ok37L00N6k26R8r9P3Q4k46P8L97l10L2M03m05p7N8k85N49m58
2438b53J06K23J99o65k37P55k75j29L77K7k63J33r5J54j44J41j87L00L3k27J19
2459I2J01k29JLLJ69k21k7m5J06N1j13Q9L0j88J64J39L5j97j95M7N15m95J44J20
2484I9k12K2J25M0n3j15K20j44j38L35k86k70K71J60K9nn1N7n2j48P8k22J95O8
2508CK6j83J99j59J02Jk10L27j68J06k10KL69m28J93J51k20O5r2K32m2qj08R0
2532C8J6k3j41L06j84m9J62j84l0l5R3K59k26r1K33K2k42K14K1j31j37K20j61
$$ plain form
2555 -50 21 -103 212 212 220 -168 123 -116 -38 -23 -28 76 -162 -53 142 -167 -44 -54 3 224 -34 -85 -148 -264 42
2580 42 -46 -83 22 44 62 -8 67 62 -59 -216 156 27 38 28 28 -69 -94 -137 25 -127 -29 4 11 125 -18 4 146
2607 146 -20 44 -202 -170 23 150 174 37 61 0 -339 -90 -36 -57 95 -59 4 -7 -63 -183 -195 246 -113 100
2631 100 45 43 -121 -109 35 -35 141 -183 -186 -40 -22 39 139 -35 120 166 -42 -95 61 -12 -13 -77 149 -212 -125
2656 -125 -66 -9 161 -265 -88 -43 197 -8 75 143 4 227 -15 -10 -194 -61 -116 -115 -92 -35 104 -154 -41 178
2680 178 182 -21 -40 -147 -50 -78 155 158 -107 203 13 21 31 84 99 -163 -132 67 22 81 239 304 -110 -96 42 73
2706 73 -50 40 -234 -5 48 -131 -8 -13 144 74 -230 60 -63 32 -31 82 19 -36 -53 -215 -13 159 170 126
2730 126 -68 9 -12 -153 99 -346 44 -139 123 -85 -331 -41 -31 33 77 -127 37 -230 91 -188 -227 -18
$$ packed form
2555e0P1j24L15%Ql88K91k39P8J5nJ04k38J09J95l09J23j0N7K21k58n1o3j16L06
2580D2q8l7J05K2J8p0P5nj21j57L72j29J1j0%r7k5m3J62j52R8L3PJ14j43K2J42
2607A46j66O4k46L2J93J27K4j37K4o1l39K49N4k1J52j54O3j1n6j20j2M41l59K13
2631A00n5kj64J2J44p0J76l24lJ46J8O1J00j74J55M6k08n3J56p3jo4K26l61Q7
2656a25N9N7J70m26J77M5K40k05Q3O8j39K23k42Nj84J33n5JK3N7J39k58J13K19
2680A78Mk03j9j07R7k8K33Lk65L10j90QJ0N3J5k62L1J99m5N9J58O5m14J4J38L1
2706G3j23R0k74K29N3j79J23nJ57p0l04K90j23R5o3J13o3n5j7j62K02J72J1m4
2730A26j94P7k1j41K52m45L90j83K62k08k46K90J0O4M4k04J64k67L21k79l9K09
$$ plain form
2752 -18 93 69 -83 183 -212 107 -89 -131 119 151 -105 94 60 -102 74 -98 -156 -141 -105 87 -45 66 -449
2775 -449 -63 466 -102 453 6 80 -31 -128 21 -45 -267 126 -106 14 -197 -141 -32 109 -116 -275 -150
2796 -150 72 121 -53 -19 -244 19 -207 -64 179 112 39 -208 -151 102 -65 226 217 91 -90 -69 46 -25 -181
2819 -181 -18 121 -1 -33 73 -33 -68 96 -108 288 -138 236 -2 -118 4 129 -246 299 145 61 138
2840 138 -69 33 -334 297 -14 131 -160 115 86 374 53 -4 -376 29 42 -19 -499 279 -232 266 -217
2861 -217 -349 -36 105 -247 59 421 -503 131 -917 -142 119 656 -8 -138 -248 234 261 -16 -77 164
2881 164 -104 -139 80 93 257 11 5 0 -158 -304 -86 -63 31 -26 114 178 75 -170 -145 36 250 88 7 134
2905 134 -87 -28 -91 -184 -32 -147 65 -260 120 247 53 92 16 49 46 -82 243 83 -95 -7 -140 42 -147
$$ packed form
2752a8J11k4j52K66l95L19j96m2K50L2k56J99l4j62J76j72n8J5L6J92j32J11n15
2775d49L86N29n68N55m47P4j11r7J49o6k22L93k32J20k11N6J09J41k25j59J25
2796a50K22M9j74L4k25K63k26J43K43o7p3k47N7K53j67K91rj26j81K1J15p1j56
2819a81J63J39j22l2J06j06l5J64k04L96m26L74k38j16J22J25l75N45j54q4P7
2840A38k07J02l67O31l11J45k91K75k9K88l21n7l72M05J3o1m80P78n11M98m83
2861b17j32L13J41l52L06L62r24O34j048P75K61N37o64j30j10M82K7k77o1K41
2881A64k68l5K19J3J64k46onj58j46K18K3R4n7J40O4j03k45K5J81K14j62q1J27
2905A34k21N9o3r3J52j15K12l25L80J27j94L9p6L3lj28L25j60j78Q8j33J82j89
$$ plain form
2928 -147 188 -174 -178 -110 46 -54 -99 191 179 180 297 420 -223 22 39 -81 44 -22 -82 -108 -63 96 -196 -41
2952 -41 93 234 173 -38 -65 -31 -27 -5 -62 -32 -29 -86 -75 64 112 77 -52 114 -50 -289 -115 50 98 -208 -43
2977 -43 -39 21 6 -112 -310 -190 21 237 -190 71 62 20 6 62 -412 -261 193 -40 322 -207 309 -119 -38 -81
3001 -81 29 -132 50 71 23 30 60 -71 122 20 -115 -129 -137 -61 -48 180 -16 34 -52 36 29 0 -31 23 -57 -233 83
3028 83 -317 244 140 -48 -144 -132 -146 -164 44 -153 -126 333 195 -52 225 -67 -337 -472 -275 -427 26 -139
3050 -139 261 314 608 -76 -122 366 -122 -311 -31 710 -163 -31 111 -297 156 172 -191 -105 -381 74 -155
3071 -155 59 225 243 -142 -88 89 264 77 39 102 -72 -179 22 31 185 92 18 58 -8 -52 104 2 -51 -111
3095 -111 -39 26 -64 58 -154 -57 134 -157 -83 88 16 -106 125 184 68 -61 -68 -72 -93 164 39 95 276 311 14
$$ packed form
2928a47L35l62mO8J56j00m5K90j2JJ17J23o43K45J7j20J25o6o0k6M5J59k92J55
2952d1J34J41o1k11k7L4MK2n7L0Ln7J1J39M8l5j29J66j64k39J74J65M8l06J65
2977d3MO0j5j18j98J20K11K16m27K61rm2j4N6m74J51M54k33L62n29N16m28Q1m3
3001h1J10j61J82K1m8PL0j31J93j02j35j4qP6J3K28j96N0q6Q8pk9l1N4q0j76L16
3028H3m00N61j04j88r6J2j4j8K08j97K7M59j38k47K77k92k70j35J97j52M53j65
3050a39M00N3K94o84m6M88m88j89K80P41q73J32J42m08M53J6l63Q6k76M55k29
3071a55K14J66J8l85N4J77J75j87l8O3j74j07K01RJ54r3p4M0o6m4J56j02n3o0
3095a11P2O5r0J22k12R7J91k91P4J71p2j22K31N9j16j29pmk1K57j25N6J81L5k97
$$ plain form
3120 14 8 129 -139 -34 38 1 -40 -173 -35 -49 172 3 89 129 282 -146 -92 95 183 -190 -65 86 93 178 -77
3145 -77 303 -197 234 67 -196 129 -108 162 153 7 -146 -136 -101 67 33 -9 38 -32 -98 -137 203 148 -26 -177
3169 -177 41 109 16 -108 143 -30 112 286 199 80 -99 -94 -93 122 -106 49 53 -78 25 60 -195 82 -66
3192 -66 -55 -187 -68 -57 -20 17 250 -53 36 8 -190 -49 116 -121 193 267 214 288 -141 195 -24 19 -21 -45
3216 -45 -221 55 24 -168 -111 58 -8 -160 227 18 -25 186 10 -95 108 -285 -137 80 42 -15 -173 277
3238 277 292 -295 -254 -265 -177 -29 -147 -78 -391 836 234 -214 -136 -399 -399 -187 4 207 -178 976 261 72
3260 72 -250 -95 -116 32 -184 -372 -211 69 -177 -191 -102 -23 -131 -229 51 -74 -95 -35 -87 113 103 165 -35 -150
3284 -150 115 29 -160 -64 -103 109 -42 31 -73 24 384 101 -16 78 -209 85 229 187 -8 -43 143 32 -162
$$ packed form
3120A4oJ21k68J05P2l7m1j33J38j4K21j69Q6M0J53m28N4J87Q8l73J25J51PQ5k55
3145g7L80n00M31j67k63L25k37K70rj46j53J0L5J68l4m2M7p0o6l9L40n5j74j51
3169a77K18O8r3j24K51j73J42J74q7j19j79NJK15k28J55Mj31J03L5k55K77j48
3192f6J1j32J19J1L7L7K33l03Q9k8j98J41J65k37L14P4n3P4m29L36k19M3m0k4
3216d5j76K76l1j92N7J69o6j52L87k09m3K11j76j05K03l93J48K17l8n7j58M50
3238B77J5n87M1j1Q8J48j18O9l13J227o02m48P8k63%K12J91K03l85J154p15j89
3260G2l22J55k1J48k16j88J61K80k46j4Q9P9j08r8K80j25k1O0n2K00j0O2k00j15
3284a50K65q6j89R6l9K12j51P3j04R7L60k83j17R4k87K94J44m2j95l5J86j11j94
$$ plain form
3307 -162 126 -24 33 -246 -20 96 -105 -24 -150 10 -60 104 32 78 -123 -132 -227 116 -15 -25 23 -68 52 233
3331 233 -43 -120 313 138 -174 159 -36 -197 -95 -44 160 -84 86 97 62 286 209 105 -145 26 89 241
3353 241 86 20 218 3 208 229 -50 -113 1 -60 306 -157 -31 -103 125 80 -190 92 255 -105 -184 158
3375 158 161 -100 137 -135 -141 25 334 109 -177 22 20 9 -3 12 -201 83 -53 -72 158 -212 292 -122 -102 -24
3399 -24 -13 49 -239 -231 -162 20 137 -149 -311 -275 -76 98 -135 376 1272 -167 -490 107 -66 -89 -70 -144 10
3422 10 62 208 43 -165 -59 -56 31 67 -117 73 -94 14 231 -58 -94 160 48 -11 -178 113 45 117 -54
3445 -54 -154 -9 -30 123 -472 -709 -324 324 -212 -167 72 -3 -83 -88 108 141 -112 -254 116 11 -101 92 192
3468 192 -87 -168 -120 -48 39 45 -149 -112 5 207 -409 27 -118 237 29 81 171 -28 30 -74 -13 -219 -177 -204
$$ packed form
3307a62K88j50N7k79K26J16k01Q1j26J60p0J64p2M6k01rr5L43j31j0M8r1J20J81
3331B33k76p7M33j75l12L33j95j61J02N1K04k44J70J1l5K24p7j04k50J71O3J52
3353B41j55o6J98k15K05K1k79o3J14o1L66m63J26p2K28m5k70K82J63l60p9L42
3375A58Lk61K37k72oJ66L09k25k86J99kj1j2J5k13K84j36j9K30l70N04m14K0P8
3399b4J1O2k88QO9J82J17k86j62L6J99J74k33N11Q96j439l23N97j73k3J9p4J54
3422A0N2J46j65k08J06LQ7L6j84J90j67J08K17k89l6K54j12n9j67K91o8P2j71
3445e4j00J45k1J53n95k37L85O48n36M5K39p5q0nJ96L3k53j42L70j05j12J93J00
3468A92k79q1M8P2Q7Oj94L7J17K02o16M36j45L55k08N2R0j99N8j04O1k06M2k7
$$ plain form
3492 -204 89 -2 -40 79 42 225 17 -66 -104 -201 -2 131 63 77 138 -112 -38 221 -209 71 95 -217 -19 -256
3516 -256 -112 -72 162 -748 390 -23 -268 383 28 -164 270 -295 3 -264 10 165 -86 260 117 410
3536 410 203 -4 -10 3 -229 -178 81 74 -24 -75 41 129 -121 -12 -56 45 209 186 -33 127 -51 66 -66 -85
3560 -85 -69 102 -27 -144 16 -136 82 -1 319 100 31 -60 127 -104 -5 -360 -219 120 -270 28 6 -272
3582 -272 -144 161 -34 -27 -247 -76 -69 -98 69 123 316 -134 -174 70 -56 311 -183 -90 123 236 -346 -328 102
3605 102 61 -144 333 62 -218 -132 -320 26 -422 -283 183 127 -182 -245 -39 -32 35 -135 -418 94 -88 379
3627 379 275 -112 -72 -61 342 28 -861 215 53 357 -172 158 630 -52 351 397 -335 -86 413 136 39
3648 39 281 166 -133 -1 4 38 -63 199 273 -38 -102 -46 151 226 134 -42 -105 -258 -55 445 541 95 246 412
$$ packed form
3492b04K93r1l8J19l7J83k08q3l8r7J99J33o8J4O1k50P4K59m30K80K4l12J98k37
3516b56J44M0K34r10J138m13k45O51l55j92M34n65K98k67K74J55k51L46j43K93
3536D10k07k07oJ3k32N1K59pr8n1J16Q8k50J09m4J01J64k3k19J60j78J17j32j9
3560h5J6J71j29j17J60j52K18q3L20k19o9r1J87k31R9l55J41L39l90K98k2k78
3582b72J28L05j95Pk20J71Pk9J67N4J93m50m0K44j26L67m94R3K13J13n82J8M30
3605A02m1k05M77k71k80Q6j88L46m48J39M66n6l09o3K06PO7j70k83N12j82M67
3627C79j04l87M0J1M03l14q89J076j62L04n29L30M72o82M03M6p32K49M99k77r7
3648C9K42j15k99J32NL4j01K62P4l11o4N6J97P5r2j76o3j53K03N00R6m46J51J66
$$ plain form
3672 412 -8 -508 159 183 -905 309 -114 -7 -178 -65 -421 20 207 -293 -21 307 -97 -59 -27 -379
3692 -379 484 -219 -422 -930 -196 -394 575 659 183 182 229 -453 -248 -589 37 -217 527 -662 -296 -481 111
3713 111 -236 220 -130 -12 -377 -119 448 -294 -1026 -294 16 38 -199 363 586 -94 -395 -407 -442 362 -350
3734 -350 38 60 289 -655 -334 71 -12 -541 165 39 -512 -27 -169 -79 125 24 198 -396 285 -213 170
3755 170 -102 89 154 -113 -222 246 514 -296 -506 58 -584 105 228 50 88 228 -114 -319 -164 -38 -86
3776 -86 -56 84 -10 24 63 -22 -54 12 -187 91 245 59 100 68 -64 252 107 -152 120 -75 25 297 -49
3799 -49 34 214 79 54 5 84 355 -89 157 -126 53 151 125 -117 188 -30 -35 181 -9 197 -39 181 -82
3822 -82 -103 -61 243 -69 -74 -140 124 94 38 -7 57 187 -1 -143 150 66 -29 5 -62 -116 -135 94 -99 -273 -205 16
$$ packed form
3672D12m20n00O67K4j088J214m23J07j71J13l56M41J87n00K72L28m04L8L2l52
3692c79Q63p03k03n08P34j98R69Q4m76jM7o82K05l41O26k54P44j189L66j85N92
3713A11l47M56l50J18l65K58N67p42p32P32L10K2k37N62K23o80l01j2l5Q04p12
3734c50L88K2K29r44L21M05q3n29P06j26n51M85j42R0K04j01J74n94O81m98L83
3755A70k72J91O5k67j09M68K68q10k10N64o42O89J23j78L8J40l42k05J55J26m8
3776h6L0J40r4L4L9q5l2O6j99K78J54j86M1l2j32L16j45k59K72j95J00K72l46
3799d9Q3J80j35k5m9P9K71m44K46k83J79R8k6k42L05k18nK16j90K06k36K20k63
3822h2k1M2L04l12no6K64l0n6m5O4J30j88j42K93q4r5L4o7n4j9K29j93j74O8K21
$$ plain form
3848 16 200 -70 -67 -132 142 -153 168 -64 -148 -176 -249 32 -69 66 -10 103 -52 78 -91 160 87 -8 -184
3871 -184 187 -222 -26 39 -160 -18 -87 -79 -132 -221 -5 -155 84 -87 3 -169 -121 -170 148 -325 37 99 -270
3894 -270 88 320 39 -107 -122 -64 -85 -201 -68 7 -7 -104 194 -133 -107 -129 93 164 -206 -232 -6 -154 -225 -84
3918 -84 -61 -103 36 2 69 51 78 -30 138 -109 91 -28 119 140 -15 -154 108 99 -107 -205 127 -51 143 -23
3942 -23 50 -52 -10 9 -100 65 -79 43 -29 -2 -6 47 -72 -131 6 -31 -85 201 -92 22 -99 -14 35 -254 -300
3967 -300 162 153 147 86 35 -134 -22 294 -66 175 51 -27 90 88 105 -102 -16 -315 119 78 84 39 -94 -224 -184
3992 -184 -137 77 4 7 -14 -78 37 -188 9 109 359 97 -214 -74 113 212 -116 -226 -69 -109 -129 -48 63
4015 63 4 -167 88 -315 -188 -197 57 122 -169 -71 -130 195 -47 295 93 -70 -279 -22 109 -227 64 50 60
$$ packed form
3848A6J84k70Lo5K74k95L21k32q4k8p3K81j01J35p6J13j55J30j69K51p3r5j76
3871a84L71m09J96O5j99J42o9Qn3q9K16j50K39j71R0j72M8m9L18m73L62O2l69
3894b70L58K32k81j46j5N8k1j16J33P5j4r7K98l27K6k2K22P1l70k6K26j48p1J41
3918h4K3m2J39l4O7j8K7j08J68k47K00j19J47K1j55j39K62rk06r8L32j78J94j66
3942b3P3j02M2J9j09J65j44J22p2K7mN3j19n9J37l7n4K86k93J14j21Q5M9k89m6
3967c00M62roo1n1j69J12L16l60K41j24p8J17kJ7k07Q6k99M34m1Om5j33j30M0
3992a84M7K14p3Lk1o4J15k25J97J00K50k62l11J40J87R9l28j10J57m0k0Q1J11
4015F3n9j71K55m03J27rK54O5k91R8n9L25k42L42k02j63k09K57J31l36K91j4J0
$$ plain form
4038 60 -184 -41 259 79 147 -6 -215 102 223 87 12 -33 58 -48 -138 182 -39 -172 -161 145 57 -140 34
4061 34 -72 82 -20 112 174 163 -35 -128 106 -31 -157 -68 -36 -139 98 118 -204 -12 45 -158 124 -29 22
4084 22 -31 114 130 -146 109 -97 171 106 181 136 66 172 -11 -95 102 184 13 79 -28 115 132 -146 -104 -83
4108 -83 165 24 31 -21 -29 -175 -195 -205 29 -31 -47 40 -20 13 -25 9 211 83 -96 -99 57 -213 29 -319 100 282
4134 282 -325 -183 -39 -9 27 -8 -120 -1 -56 -404 -244 144 309 -67 -164 -698 -140 -379 189 336 -570 -232
4156 -232 717 266 -363 288 49 481 350 -348 201 -256 -503 -9 -326 -519 -132 -3 -162 -543 393 -33
4176 -33 192 19 113 341 -50 -41 -337 30 134 -136 -20 -20 145 -13 191 337 389 91 -57 132 -41 61
4198 61 -46 32 -207 -144 15 64 -43 46 -25 -47 -138 -221 27 -125 -29 81 -151 157 -127 98 -15 -129 124
$$ packed form
4038F0k44J43L00j80O8j53k09L17J21j36p5m5R1j06r0L20k21j33J1L06q8j97J74
4061C4j06J54j02J32O2j1j98r3K34j37j26Q9L2j03K37K0l22J92N7k03K82j53N1
4084B2n3J45J6k76K55k06K68o5P5m5p0J06j83q4J97Q2j71O6j07J43J7k78M2K1
4108h3K48j41Pn2qj46k0j0K34o0j6Q7o0L3l8L4K02j28j79lJ56k70K42l48M19J82
4134B82o07J42J44L0L6l5j12J19n5l48J60L88J65l76r7n34N58k39N68J47r06L38
4156b32R49m51o29O51k39M32j31o98N49m57k47M94l17j93L87J29j59l81R36m26
4176c3K25j73R4K28l91Rk96L67J04k70J16%J65j58K04J46N2k98j48J89j73J02
4198F1j07P8k39O3J59M9j07Q9p1k2r1q3K48j52R6J10k32L08k84K25j13j14K53
$$ plain form
4221 124 -127 -32 141 308 -220 6 282 -95 -35 -30 108 -62 231 107 35 -49 29 -6 -93 30 94 -2 -76 -113
4245 -113 -23 -181 88 -42 265 -35 -51 -35 -154 -52 29 -32 -67 187 252 165 -140 -91 168 378 19 -174 140
4268 140 -88 39 150 464 -22 69 -218 -286 258 -168 -143 -243 -516 -88 260 -472 328 157 -30 -560 -227
4289 -227 -495 508 146 -285 1072 131 -437 -267 200 87 -11 405 184 95 124 90 89 112 162 -42 32 -31 -159
4312 -159 53 -107 92 166 67 -261 -245 -151 -229 -189 102 177 -291 418 568 -206 201 -326 267 -231 -107 39
4334 39 -170 -131 90 30 -242 103 -25 -8 9 -111 -103 -124 -228 94 -16 26 117 37 40 35 -54 -117 402 227 4 114
4360 114 6 80 -124 -180 243 -181 -50 -250 16 -121 40 -149 -3 -50 -20 -21 14 60 352 195 -345 43 -84
4383 -84 139 107 109 -97 -352 207 19 -180 52 -13 92 27 222 -42 -333 -354 472 -33 -33 -229 165 385 277
$$ packed form
4221A24k51R5J73J67n28K26K76l77O0NJ38j70K93j24p2q4P8l5q7J23O4r6p4l7
4245a13R0j58K69j30L07l00j6J6j19J02Q1o1l5K54O5q7l05M9K59K10l59j93L14
4268A40k28J27J11L14m86R1k87o8N44m26K5j00k73M28L48p32Q00j71j87n30L33
4289b27k68J003l62m31J357r41n68J70M67j13r8M16k21q9K9l4jK3N0k04P4o3j28
4312a59K12j60J99P4r9l28J6R4p8M0K91P5m68P09J50p74M07n27N93m98J24J46
4334C9k09L9K21o0k72L45j28J7J7j20Qk1j04L22j10M2R1q0Lnq9o3N19j75k23J10
4360A14j08P4k04n6M23m24J31k00K66j37J61j89J46m7L0jL5M6K92j57n40L88j27
4383h4K23l2Kk06k55N59j88j99K32o5J05o5J95k64k91k1Q26n05%j96L94K20j08
$$ plain form
4406 277 57 -369 50 -128 -465 -241 321 64 -379 -228 91 125 -392 115 515 -317 -588 22 -110 -410
4426 -410 139 201 -278 -267 425 -41 -44 -269 -16 62 185 -206 52 200 -186 114 30 129 -24 -98 -24 95 157
4449 157 -135 21 -75 -2 -30 -106 -36 -150 -123 -32 85 -102 208 235 27 51 39 -66 16 59 -69 343 -22 7
4473 7 -79 -8 -168 -114 9 -18 20 31 -99 166 115 -5 23 -160 280 -21 -73 280 171 -328 101 290 -61 -49
4497 -49 -126 -90 -147 -18 25 76 -110 46 109 219 -71 -119 195 29 55 -22 53 15 -165 -105 68 -125 53 13 -156
4522 -156 18 -39 -75 -123 -36 108 28 178 42 -106 15 -93 -16 -97 -165 -7 -66 54 -56 40 -4 -55 -23 -70 92
4547 92 -25 124 -36 -55 0 2 -98 68 -86 -115 77 36 49 -61 -100 134 -118 -173 -234 98 -147 40 -98 -118
4571 -118 -19 -7 119 50 116 -71 19 9 10 -2 1 -158 -6 143 131 -89 76 -39 21 -128 -17 32 43 -23 57 138
$$ packed form
4406B77k20m26M19j78l37K24N62k57m43J51L19L4n17N07M00q32k71O10j32l00
4426d10N49O2m79J1O92m66lk25K53P8J23l91K58J48l86L00q4R9j53p4P4J19O2
4449A57k92J56r6P3k8p6P0j14K7R1J17j87L10K7k08K4j2j05Q2M3j28M12l65K9
4473Gq6P1j60N4J23k7L8J1j30K65n1j20K8j83M40l01n2L53j09m99M29J89l51J2
4497d9p7L6n7J29M3N1j86J56O3J10k90m8L14j66K6p7P5l8j80O0J73j93J78m0j69
4522a56J74n7l6m8Q7J44q0J50j36j48J21j08P7q1o8J58n9J20j10R6m4n1L2m7J62
4547I2j17J49j60j9N5Kj00J66j54k9J92m1J3j10l9K34k52n5o1L32k45J87j38k0
4571a18R9J2J26o9O6j87R0j0Jj2Lj59J52J49j2k20J65j15O0j49J11M9J1o6Q0Q1
$$ plain form
4597 138 50 -77 -149 -62 -110 -22 180 26 -169 392 256 30 248 -224 124 39 -98 102 113 32 50 32 -174
4620 -174 53 -307 -44 -100 -156 73 65 133 -59 -75 -36 -144 -283 -41 -89 57 27 107 -282 -5 72 88 -92 -113
4644 -113 26 -270 -209 23 -105 4 225 -154 -85 62 76 -40 -6 183 340 -118 -72 -164 134 87 -54 -46 10
4667 10 -207 -110 -121 13 -131 50 79 102 -71 -65 -91 88 -72 79 118 -135 -90 85 -138 24 111 30 140 2
4691 2 -71 12 165 107 48 211 -32 5 149 101 207 -99 224 94 -4 -165 243 86 -113 -69 220 81 55 -76
4715 -76 -84 75 6 97 -24 -1 110 -87 80 -80 120 2 -102 -82 95 -16 -132 -70 12 133 -78 95 143
4738 143 64 -183 120 147 118 85 -53 -20 -209 75 129 65 33 -18 -170 -146 -186 161 24 -166 12 15 -88 -202
4762 -202 -19 10 7 -7 -117 -83 -12 -157 108 -14 -46 -144 77 -142 -101 -11 -113 129 203 144 -89 76 60 305
$$ packed form
4597A38q8j27p2Q7m8Q8K02j54j95N61j36k26K18m72L48q5j37K00J1q1J8j8k06
4620a74K27l60K63n6n6K29qO8j92j6L9j08j39K42m8J46l0Q0l89K77P7J6j80k1
4644a13J39k96O1K32j28J09K21l79O9J47J4j16L4J89J57m58M6r2K98m7j41QN6
4667A0k17R7j1J34j44J81K9K3j73Ok6J79j60J51L9k53M5J75k23J62Q7q1J10j38
4691Bp3Q3J53n8n9J63k43L7J44m8J06l06L23j30r8j61M08j57j99M4K89j39k6j31
4715g6qJ59o9R1j21K3J11j97J67j60K00j18j04K0J77j11j16O2Q2J21k11J73M8
4738A43p9k47L03K7k9l3j38L3j89K84N4o4l2n1j52K4m0L47j37j90J78Lj03j14
4762b02J83K9lj4j10L4P1j45K65j22l2r8K21k19M1R0j02K42P4n9k33J65j6K45
$$ plain form
4786 305 -175 -9 -114 -144 8 -90 217 -194 125 -60 -27 31 15 262 10 214 -38 151 157 113 65 118 -107
4809 -107 144 47 -182 51 -308 -136 124 207 -71 123 -41 -119 13 217 27 144 -348 15 -30 215 80
4830 80 176 441 284 -209 -132 28 260 -164 89 250 -306 58 293 -202 203 -361 -215 283 -231 -306 -106
4851 -106 -462 554 -23 -157 -580 -563 223 -412 -55 -200 402 -81 -33 67 -58 -51 12 13 71 46 203 -4 98
4874 98 -2 75 -75 -86 18 101 132 198 109 -138 -104 -42 15 -41 -36 -28 20 -74 -97 -34 227 103 -69 145 139 38 -142
4901 -142 -27 -209 -33 157 91 -114 -12 212 -50 41 12 171 -26 -92 115 52 -267 -80 -91 38 -38 24 274
4924 274 174 -212 -4 31 13 63 -54 119 100 -198 275 -4 -130 -37 -128 90 -126 -41 93 -180 128 24
4946 24 103 85 -4 148 -220 -41 71 52 218 53 14 -37 -3 -131 -26 266 -62 69 -193 -78 32 -91 -14
$$ packed form
4786C05m80J66j05l0J52r8L07m11L19j85L3N8j6K47k52K04k52J89Om4m8N3k25
4809a07K51r7k29K33l59J72K60Q3k78J94j64p8J32K04j90J17m92L63m5K45j35
4830H0R6K65j57m93P7J60K32m24K53J61n56L64K35m95M05n64J46M98n14p5K00
4851a06l56J016n77j34m23J7P86o35L57j45O02m83M8J00j25PO3JN8k5J57k07J02
4874I8j00P7j50j1J04Q3L1O6q9k47L4O2N7n6NQM8r4k3O3K61j24j72K14oj01j80
4901a42J15j82J76J90o6k05J02K24k62R1k9J59j97o6K07o3l19J87j1J29p6O2K50
4924B74j00l86K08L5j8N0j17J73j9k98M73k79j26R3r1K18k16Q5J34k73L08j04
4946B4P9j8q9J52l68J79J12j9J66j65l9n1L4j28J05K92l28J31k62J15J10j23P7
$$ plain form
4969 -14 41 89 308 -312 180 -108 18 111 128 -323 57 38 86 15 51 117 51 -72 24 -13 -5 142 -22 -103 11
4994 11 -122 -196 -3 -21 93 -7 -2 -111 3 -143 58 -46 89 -58 83 -389 53 33 217 -131 -97 56
5016 56 84 211 -129 -288 -117 -99 -85 -51 66 102 24 -114 9 67 130 177 138 -75 40 -31 -36 27 -91 55 139
5041 139 -120 88 234 -35 -116 130 -156 215 209 12 112 122 70 -35 -158 -34 37 219 151 180 -72 5 -86
5064 -86 -147 -81 53 225 59 -103 -8 -97 67 -184 118 189 -59 172 -44 160 111 -142 -80 -39 114 -54 121
5087 121 62 45 59 192 17 58 -175 191 -116 -173 -48 104 -161 -44 28 -28 -21 -30 72 292 -187 168 74 12
5111 12 -65 116 -98 178 75 -142 -163 -89 -66 -261 10 -46 -88 76 -289 123 -252 39 126 -107 27 -126 -85
5134 -85 -86 188 -55 81 -329 56 188 148 47 -81 192 21 -170 -38 109 -295 -171 -269 112 -71 73 95
$$ packed form
4969a4N5M8K19o20M92k88J26R3J7m51L80j9M8p1L6O6o6j23R6l7QJ47j64q1J14
4994A1j33p4J93j8J14j00Nj09J14j46K01j04J35j47J41m72M42k0J84l48L4J53
5016E6K8J27l40j59J71J8J4L4J17L6p8j38J23N8O3M7l9k13J15p1nO3j18J46Q4
5041A39k59K08J46k69q1K46k86L71oj97J00J0n2j05j23J24P1J82o8K9k52P7r1
5064h6o1O6J34J72j66j62R5q9J64k51L02P1k48K31k16K04m9k53O2M1J53j68J75
5087A21n9j7J4J33j75M1k33L66l07n7J25J52k65J17P2n6PrJ02K20m79L55r4o2
5111A2p7J81k14K76j03k17k1P4K3j95K71n6m2J64l65M12l75K91Q7k33J34j53M1
5134h5jK74k43J36m10L85J32m0j01j28K73j71j91J32J47m04J24r8L81j83J44K2
$$ plain form
5156 95 -312 154 -55 -124 -134 160 -279 255 -216 -123 -186 165 295 171 506 -245 135 347 -38 -51 328 -287
5178 -287 -272 335 66 31 436 -84 -330 70 22 74 185 39 -43 18 -55 283 186 -389 268 -307 622 -506
5200 -506 -85 -326 208 129 -336 433 -137 -19 -133 310 191 81 -214 -606 -1232 121 -133 -187 209 127 -616
5221 -616 -545 -168 499 -596 461 697 -494 36 151 -189 431 -204 -366 447 -205 -237 -587 381 0 -282
5241 -282 -98 -547 50 98 406 -269 -227 -362 158 -322 -281 17 -39 302 378 2 209 -445 -78 -243 -276 -287
5263 -287 -140 -308 -400 293 156 219 -24 214 -90 273 -222 -17 -513 -365 -191 3 -65 -162 177 -201 -215 -39
5285 -39 -78 172 -297 131 -6 -18 -287 -392 220 -357 57 308 -48 74 -179 -166 -146 -138 182 203 239 -140 -157
5308 -157 76 -61 -232 -4 282 -109 -56 -163 -69 84 -34 -144 -84 153 -225 93 -253 98 152 -310 -229 -45
$$ packed form
5156I5m07M66k09o9j0K94m39N34m71R3o3L51J30j24L35p51L80K12l85j3L79o15
5178b87J5O07k69l5M05n20k46M00m8N2J11j46q2O1p3L38r7n75O57n75R29j128
5200e06M21k41N34p9m65P69n70J18j14M43j19j10k95l92o26J353k54n4L96q2p43
5221f16P1L77O67j095J057K36j191N30J15l40O20o35j62Q13o52l2l50R68l81k82
5241b82J84m49N97M8L08o75M2j35N20m80M1K98n6L41P6l76K07o54L67j65l3j1
5263b87J47j68r2O93j37O3k43K38l04L63m95K05m96J48J74J94o8r7L39l78j4J76
5285c9l9K50m69M28j37j2k69j05O12n77M14K51l56J22k53J3K0QL20K1L6l79j7
5308a57K33j37j71K28K86l91N3j07R4J53j18j10O0K37l78L18l46L51N4m62Q1J84
$$ plain form
5330 -45 -112 266 140 166 -224 -48 -55 141 -217 -93 -77 103 -393 -94 212 -114 -91 13 15 -34 10 -119 160 133
5354 133 56 -68 -134 9 -36 166 119 -108 -402 -22 80 50 1 4 -154 279 259 175 143 197 154 224 109 -166 9
5379 9 68 -223 -175 121 -148 233 7 -39 73 81 -32 19 123 127 42 -143 47 67 -26 -187 -13 -39 233 94 11
5404 11 -32 22 -120 -62 44 79 -8 7 105 -56 -148 27 -177 -34 -83 147 182 181 119 -159 -76 19 -99 37 120 219
5430 219 -18 19 51 21 77 -14 -214 -108 -162 99 176 152 -1 -13 -70 -5 203 -137 -7 -22 -326 -34 233 95
5454 95 49 -53 -29 -143 -170 234 53 210 200 -257 83 -162 -35 -215 98 -58 -4 1 -334 346 187 37 -62
5477 -62 -100 173 153 -85 -142 -38 198 -158 -80 -93 -61 -40 -14 -40 -169 35 -117 -84 140 44 -26 -63 20 -7 -79 30
5503 30 -104 59 -144 69 -135 -264 -57 84 -70 -139 109 -116 39 133 277 -49 49 -162 91 102 -97 -36
$$ packed form
5330d5o7L78j26K6l90J76pJ96l58J24J6J80m96K99L06l26K3J04Km9M4j29K79k7
5354A33p7j24o6J43m5K02m7k27k94L80J02l0m9Lj58M33k0q4l2N4m3P0j15k75J75
5379IN9k91M8K96k69L81k26m6J12Qj13N1J04Mq5j85J90K0r3j61J74k6K72j39q3
5404A1m3N4j42N8J06L5q7J5R8j61r2J75k04J43m9K30L5jo2k78Q3R5j18J36Q3R9
5430B19k37L7L2l0N6r1k00J06n4K61P7k4j53j2n7O5K08l40J30j5l04K92K67j38
5454I5m6j02K4j14k7M04j81J57j0m57L40k45J27j80L13j56N4Nl35O80j59j50r9
5477f2l8K73k0k38n7J04K36l56P8j3L2K1K6k6j29K04j52L3K24r6p0l7Q3k7p2J09
5503C0j34J63k03K13k04j29K07J41j54o9K48k25J55R4J44l26R8k11K53J1j99O1
$$ plain form
5525 -36 36 -202 149 -38 -3 7 11 142 -107 -31 -9 32 -13 29 -26 57 -86 143 80 135 151 -127 183 -122 85
5550 85 -105 -97 -207 -264 -111 164 219 -70 138 130 -30 -40 -54 -33 -19 -35 15 7 -94 18 108 88 256 -114 -148 -3
5576 -3 -249 -89 -165 -165 32 22 15 44 -128 66 27 -63 -52 -25 -12 -7 97 -75 7 -182 142 -67 -3 3 -51 -233 99
5603 99 -165 -184 -58 369 212 80 670 27 106 146 -32 -176 8 -13 173 119 -422 23 -114 -266 -168 -113 -538
5626 -538 11 189 683 -93 -297 236 139 291 -419 -280 224 -387 5 -24 315 -152 -345 -129 -484 -20 -228
5647 -228 314 -588 296 -278 487 -420 334 568 -896 254 206 -303 519 266 -356 -319 8 176 112 -23
5667 -23 -216 -67 -34 -24 -21 15 32 4 -180 -61 112 117 -89 55 306 68 80 55 -43 -64 -45 3 115 -29 -31 -144
5693 -144 115 11 -6 -111 -175 58 104 102 41 144 -79 -77 -51 175 11 138 38 23 60 1 118 -205 49 -123
$$ packed form
5525c6P2k38L51j87L5J0MJ31k49P6K2M1m5M2n5Q3j43K29o3N5J6k78L10l05K07
5550H5j90Qj10n7J53K75N5k89K08qj60j0j4K1J4j6N0qj01J12R0k0J68l70l4J45
5576ck46J60p6%J97j0pK9j72J94l9r0J1K7J3NJ04j72Q2j89L24k09O4On4j82L32
5603I9k64j9J26M27j57j32N90o43P9M0j78j44J84k1J86n4n41M45j37j52R8N5m25
5626e38N49J78M94p76k04N33r7J52p10J39N04o11L92k9L39m67j93K16l55M64k08
5647b28N42r02Q84n74P65r07P54K34j464J150m8n09Q22k53o22L7L27J68o4j35
5667b3j93J49L3J0LL6J7k8j84J19J73Nk06J44K51k38J2k5r8k1J9M8J12j44kj13
5693a44K59j04j7j05o4K33M6ko1J03k23KK6K26j64J27j00j5L7n9J17l23K54j72
$$ plain form
5717 -123 214 115 40 -309 -114 191 -68 184 -271 43 -92 -112 -21 76 -7 -65 -42 -179 64 -205 -280 -247 -179 77
5741 77 -227 -303 -106 87 -36 -41 -30 75 -57 348 113 -124 234 -5 -20 -48 -85 -97 -158 170 -70 134 47 -126
5765 -126 -61 135 -84 -87 32 -169 275 -366 -70 -300 11 -133 -76 -532 289 -777 -416 277 102 -322 -240
5786 -240 -16 -626 -322 -495 484 -274 -108 -168 -166 405 13 -41 -252 -17 86 44 -769 526 -167 83 -55
5807 -55 517 60 -655 -262 -248 32 -576 8 0 23 -138 -288 212 219 13 286 98 143 -66 273 -67 382 11
5830 11 -487 -206 4 -166 6 527 -118 219 -417 -522 -254 -169 -344 38 244 179 -313 -576 -508 0 60 21
5852 21 421 -297 -30 75 -468 372 219 -961 -13 468 518 99 270 -287 -386 466 583 -175 493 460 677
5873 677 158 329 -185 -306 133 7 -1235 -388 723 -69 635 360 -481 -204 -68 -131 -373 -659 338 109
$$ packed form
5717a23L37r9p5l49J95L05k59K52m55L14j35k0R1R7q3n8K3j37K43k69p5L3O8K56
5741G7l04p6J97J93j23nJ1J05j32M05k35k37L58k39j5k8l7j2o1L28k40K04q7j73
5765a26O5J96k19lJ19k01M44o41K96k30L11j44N7m56Q21j066L61O93j75m24Q2
5786b40K24o10L04j73R79p58J66o0KN71l92n4k11K35J03m2q13J295o93K50j38
5807e5N72m57p15L93J4K80o08N84qK3j61j50N00Pk06K73j88M5k09L39l40M49l71
5830A1m98K81K10j70J72N21o45L37o36j05K68Q5j75L82K06o5m92k63O8N08O0l9
5852B1M00p18K67J05n43Q40j53j180R48M81N0m19J71n57r9Q52J17p58O68l3K17
5873F77n19J71n14j21M39j26j242Q47J111p92P04k75q41K77J36o3k42k86R97k29
$$ plain form
5893 109 45 45 -78 117 89 -76 106 -21 230 -89 -107 -26 -19 112 207 13 50 -15 18 -31 32 -25 7 -155 136
5918 136 163 -177 -282 -15 -80 -55 6 14 152 -267 -273 -75 -148 149 -62 44 153 198 72 -14 -21 20 -72 154 73
5943 73 45 142 -103 79 45 -157 -92 -107 28 -75 -181 -231 -66 102 -56 -120 15 148 -74 48 -18 44 38 -33
5967 -33 -513 294 105 -55 187 -38 20 20 133 -10 -86 -121 283 438 175 195 -53 -263 -251 -122 -126 -6 -350
5990 -350 407 228 -329 162 298 213 -35 -495 61 -49 -120 -301 209 677 -455 280 -232 -13 -11 -474 -515
6011 -515 286 -388 4 -232 -181 564 -122 393 -302 -31 -235 -127 -234 -230 -95 634 -836 -751 -419 327 -339
6032 -339 -402 289 -453 -30 -287 396 222 671 160 220 117 -206 116 -58 -555 139 460 118 112 -97 -210
6053 -210 -277 2 98 -45 315 -394 204 -1016 304 -83 -273 121 -325 10 271 68 -70 247 152 -520
$$ packed form
5893A09o4%j23J95k8j65J82j27K51l19j8Q1PJ31R5j94L7o5L3m9O3n7L2j62K91
5918A36K7l40j05K67o5K5O1QJ38m19oJ98p3K97k11J06J09M5j26q6pM1r2K26q1
5943G3k8R7k45J82l4k02O5j5J35j03j06n0J65J68j58o4J35J33k22J22o6O2op1
5967c3m80Q07j89j60K42k25N8%J13j43p6l5M04J55k63K0k48k10J2J29mJ20l44
5990c50P57j79n57M91J36q5k48m60N56j10p1j81N10M68j132P35n12K19Km63m1
6011e15Q01o74L92k36N1P45o86N15o95K71k04J08j07MJ35P29j470Q5L32P46o66
6032c39o3O91p42M23k57O83j74M49n11O0j03l23L22j74m97O94L21l42ok09j13
6053b10o7K79R6j43L60p09N98j220J320l87j90L94m46L35K61k03j38L17r5o72
$$ plain form
6073 -520 -8 106 -11 87 114 100 83 112 37 114 313 -218 68 -102 -185 455 -72 -106 -248 -135 -299 -63 67
6096 67 -75 -141 -400 108 -10 -30 -61 103 -187 -75 37 94 -392 -291 67 61 283 -138 -127 -210 -157 -410 -18
6119 -18 214 40 -91 -84 29 28 -119 -66 53 81 -50 -203 25 176 70 14 6 -176 84 -81 -7 -141 -60 27
6143 27 -41 74 -100 33 -51 -66 141 -40 -65 -3 -128 -33 191 43 -128 52 -62 12 -88 183 91 63 119 124
6167 124 134 140 55 -121 -96 -32 -155 72 88 39 -124 300 135 22 302 76 142 70 30 72 177 138 -18 -3 -234
6192 -234 -118 8 -76 20 211 104 115 16 -106 115 -9 69 -138 -45 40 36 201 100 75 -227 76 153 -60 -109
6216 -109 -86 -68 -82 235 29 254 42 138 98 -272 -12 -63 -17 201 -89 19 -14 -22 -127 -69 -73 3 -35 -160 108
6241 108 26 -23 -178 14 -87 -20 140 -128 229 -205 82 97 -125 -133 -134 -32 202 2 -4 143 -111 9 291
$$ packed form
6073e20N12J14j17R8K7j4j7K9p5P7J99n31K86j70q3O40n27l4j42J13j64K36J30
6096F7j42o6k59N08j18k0l1J64k90J12J12N7m86J01L58oK22m21J1q3N3k53L92
6119a8K32j74j31PJ13jj47N3J19K8j31j53K28J51j06n6qj82K60j65P4j34Q1Q7
6143B7o8J15j74J33q4j5K07j81k5O2j25R5K24j48j71J80j14P4j00K71r2k8N6N
6167A24J0Oq5j76K5O4j23K27J6m9j63M24j65j13K80k26O6p2m0M2J05l9j56J5k31
6192b34J16J26q4R6J91j07J1r9j22K21j24P8k07R3Q5mJ65j01k5l02L03P7k13m9
6216a09K3J8j4L17k06K25k12R6m0l70K60n1M6K18k90J08l3qj05N8mP6l8j25K68
6241A08q2m9j55J92j01O7J60k68L57m34K87J5k22qjJ02K34k00oJ47k54J20K82
$$ plain form
6264 291 -32 -14 -101 75 -244 -69 97 -277 -126 -141 -113 -288 -63 -10 -124 -293 -325 -27 63 123 70 -182 113
6287 113 -222 25 27 -89 93 180 -139 213 -156 -1 284 11 -87 -114 -96 128 -189 -43 -335 -117 -26 -190
6309 -190 119 140 -32 -144 -15 203 -151 -304 14 45 -170 95 -48 -236 -94 3 101 5 -146 14 67 -38
6331 -38 81 -123 93 26 14 322 -212 49 -33 -121 201 110 103 114 19 205 -89 -201 91 -29 -92 38 68 -517
6355 -517 373 97 -572 621 488 451 -383 131 -9 288 -95 -310 -3 51 311 232 95 139 274 274 -169 25
6377 25 -33 -337 -187 3 -127 -53 -132 -324 -210 -47 396 -189 156 -215 191 107 -35 -34 -28 -215 38 67 -84
6400 -84 153 -175 -62 142 -142 10 96 43 -110 -168 -234 -29 -28 10 -19 149 128 -175 113 133 -162 111 35 -99
6424 -99 3 74 -150 -26 -168 -187 1 23 -76 191 56 94 205 -150 75 17 61 73 -144 -95 -52 -179 182 -54
$$ packed form
6264B91l23J8q7J76l19J75J66l74J51j5K8j75K25N3j14j69l2K98R0O0n3k52K95
6287A13l35K47Kj16J82Q7l19L52l69J55K85k73r8k7J8K24l17J46k92K18R1j64
6309a90L09K1j72j12J29K18l54j53L18L1k15K65j43j88J42R7R8r6j51J60N3j05
6331c8J19k04K16o7j2L08n34K61q2q8L22r1pJ1r5J86k94j12K92j20o3J30L0n85
6355e17Q90k76o69J193j33l7q34N14j40K97l83k15L07N4K60p9j37M4J35%m43J94
6377B5n8l04J50J90j30P4p9j92J14J63M43n85L45l71M06q4j42JOj87K53K9j51
6400h4K37l28J13K04k84J52Q6n3j53n8o6K05JL8k9J68k1l03K88K0k95K73p6j34
6424i9J02P1k24J24j42j9J88K2r9K67j35L8J11l55K25n8M4J2k17M9M3j27L61k36
$$ plain form
6448 -54 -85 170 139 -99 15 -117 -344 -204 32 -94 128 31 187 157 68 1 20 -7 24 -82 -115 -235 41 105
6472 105 -80 -31 51 12 -142 -31 -87 -101 -65 -84 -57 52 125 123 15 -8 -69 -356 121 -70 -268 72 -181 -124 165
6497 165 -112 -83 -29 199 -96 118 146 -86 -94 28 -231 138 178 222 -20 5 124 40 -88 -158 133 -82 -96 -8
6521 -8 112 80 10 14 144 -21 -102 116 -130 -284 80 -191 320 502 157 -459 -44 609 629 -5 -334 342 38
6544 38 -22 352 553 64 -535 303 239 310 347 -144 193 -422 -48 -513 253 499 639 25 -1214 131 -75
6565 -75 769 33 304 -48 -585 -14 1 -233 -282 46 -371 -23 232 80 -7 114 150 -170 103 -219 -27 -24
6587 -24 327 -45 -150 17 -120 74 70 -13 276 -204 119 214 -83 -225 125 42 84 -23 -73 46 -122 113 -164
6610 -164 -207 71 -79 118 -144 164 179 -55 -90 -242 149 90 289 -6 -51 80 -28 -127 -1 -58 -1 123 -168
$$ packed form
6448e4l1K55l1k38J14j32k27J40K36j26K22r7J56l0q9o7J9k7L1j06l3j20K76O4
6472A05j85M9Q2l9j54J11n6j4L6j9K7J09P3kj08k3o1k87M77j91j98L40k53N7K89
6497A65k77K9N4K28k95K14K8k32qJ22k59L69M0M4k42K5J19q4j28p0K91k15j4Q8
6521hJ20l2p0MJ30j65q1K18k46j54L64k71N11J82l45o16M15O53K0o34l29O76l04
6544C8o0L74K01m89n99Q38o4P1L7m91L37o15L74m65P66K46J40o14j239J345k06
6565g5Q44p36K71l52n37N71J5k34m9L28m17L48K55j52q7J21L6l20K73l22J92L
6587b4L51l72j05J67j37J94mq3K89m80L23R5k97j42L50q3M2j07n0J19j68K35k77
6610a64m3K78j50J97k62L08J5k34l5j52L91n9J99k95m5J31j08r9J26n7N7J24k91
$$ plain form
6633 -168 179 144 20 16 62 -57 -10 255 -184 -66 -78 -36 146 -757 -193 320 546 141 219 341 -101 71 12
6656 12 -271 145 -14 -78 39 23 1 -113 247 19 29 20 175 -110 -20 13 -225 -38 208 -68 -27 293 7
6679 7 139 -179 -87 288 89 -224 56 4 -2 142 -34 72 100 150 -8 -69 168 131 -128 -123 -126 -13 464 -139 167
6704 167 -63 -70 244 15 -122 -30 98 -40 -11 188 131 151 -105 -107 8 -3 -173 114 73 -69 156 113 -104 -87
6728 -87 -86 -140 -20 91 -60 184 100 53 -67 339 93 192 6 101 -47 -9 208 -119 -8 -126 18 -182 -153
6751 -153 -54 30 -120 153 -269 -296 -53 -236 -79 -69 -46 -136 75 -203 61 110 71 261 73 7 -157 38 224
6774 224 -43 -28 -32 -31 93 -12 -88 -77 -30 -225 -233 -19 -39 96 74 -69 11 42 17 67 69 -49 -85 53 -150 -148 -23
6801 -23 87 -108 5 -169 -72 250 -46 -28 -15 40 -120 -87 131 55 81 -48 -69 -57 146 169 -173 -32 32 -144
$$ packed form
6633a68L47l5j24mM6j19M7K65m39J18j2M2J82r03N64N13K26m05P8J22m42J72n9
6656A2k83M16j59o4J17j6k2j14L60k28J0rJ55k85R0L3k38J87K46k76M1L20k86
6679GJ32l18R2L75j99l13K80n2oJ44j76J06K8N0j58o1K37l7k59NlJ13M77o03L06
6704A67k30pL14k29j37R2J28j38K9J99n7K0k56kJ15j1j70K87m1j42K25m3k17J7
6728h7Jn4J20J11j51K44q4m7j20M06k46R9j86R5j48L8K17l27J11j18J44k00K9
6751a53R9Q4j50K73m22k7K43j83J57J0K3r0K11k78K64M9l9J90j88o6j64J95J86
6774B24k67J5mJJ24j05p6J1M7j95qK14k0J35k2j43Q0L1k5N0Kj18l6J38k03KJ25
6801b3J10j95J13j74R7L22k96J8J3N5j60L3K18p6K6j29k1J2K03K3l42J41O4j76
$$ plain form
6825 -144 -82 218 47 88 -94 -101 -16 -143 -39 -141 35 -30 -49 -322 -89 80 -266 -127 -147 106 -173 57 147
6848 147 66 104 -66 69 142 -37 57 -88 97 -3 91 -146 -94 131 7 1 176 46 100 -273 45 183 -165
6871 -165 30 -117 -271 10 -154 -76 -30 84 194 -119 -147 288 -227 26 56 40 -56 34 -58 -82 175 40 -219
6894 -219 -71 -100 40 -13 -183 6 57 165 56 347 -26 -139 -288 -24 -46 -392 118 -177 -187 165 -102 -255
6916 -255 203 500 34 3 -126 22 175 237 55 -474 295 433 23 114 -70 -100 -44 511 447 412 162 -338
6938 -338 277 -22 -245 -130 -154 -430 -68 326 -257 35 -182 112 -316 -111 146 1 11 -94 2 155 -107
6959 -107 166 92 -146 169 164 81 -27 18 78 -162 7 -8 -77 133 181 231 0 114 -199 -33 -150 -131 103 10
6983 10 101 -228 -24 -11 -235 -217 83 -47 -70 -166 88 164 -10 -54 37 -226 -66 -192 -1 38 95 58 -44 276
$$ packed form
6825a44O2L00j71M1j82pQ5j27J04j02J76o5j9k73K33J69l46J39k0K53k79K30R0
6848A47q1L8j70J35P3j79R4j45J85j00R4k37N2K25j24oJ75j30N4l73L18J38l48
6871a65J95j47j54K81j64P8M6J14J10l13k8M35n15K53L0j6r6R0r2k4K57j35k59
6894b19J48k9J40n3j70J89N1J08j09K91l73j13j49K64k2l46N10k95j0L52k67j53
6916b55M58K97m66l1j29J48J53O2j82n29P69J38m10R1j84l0N6N55o4l5k50n00
6938c38O15k99k23J15k4k76L62L94n83K92k17K94m28K05K57j45J0j05R6J53k62
6959a07K73p4k38L15nq3j08M5O0k40J69j5o9K10M8N0k31J14l13J66j17J9K34r3
6983A0R1l29K04J3k24J8L00j30k3r6K54P6j74m4R1k63J60j26J91L9N7l7j02L20
$$ plain form
7007 276 -39 18 -32 -26 -241 -45 -47 -80 101 210 239 -70 -4 43 106 130 48 -107 -145 181 -87 162 15 -251 71
7032 71 255 -132 -74 -59 60 8 -12 155 -79 84 -40 -11 -89 -12 -77 -42 63 119 -20 155 -140 138 -170 -50
7056 -50 78 25 -58 -223 -2 123 114 -79 40 -62 114 -234 98 -25 -34 -48 7 96 -131 -241 317 95 -82
7079 -82 127 -5 -145 -74 -73 203 -81 38 -133 113 125 -15 -81 -132 -76 -46 -21 170 143 -228 -181 14 197 23
7103 23 28 93 57 61 129 -3 -119 -318 121 -12 54 -7 62 -77 32 -73 70 12 -11 -361 13 -93 -181 209 -105
7128 -105 278 207 193 -207 15 206 305 276 -161 96 69 29 -130 217 -172 -22 -144 -47 39 75 5 -76 245 -65
7152 -65 -2 73 -9 -194 32 65 -39 -29 240 95 -82 -256 128 162 -26 -32 95 103 -67 121 -82 75 -309 -310
7176 -310 58 72 -161 -266 148 38 108 -147 -60 91 -40 5 74 69 6 181 66 -16 -148 -22 -65 305 -138
$$ packed form
7007B76l15N7n0Ok15J96kl3J81J09K9l09O6M7O3K4q2j55l8L26k68K49j47k66L22
7032G1J84l87N8J5J19n2k0J67k34J63j24K9p8P7o5L5J05N6j39J75k95K78l08J20
7056e0J28n3q3j65K21J25rj93J19j02J76l48L32j23rj4N5Q9k27j10N58k22j77
7079h2K09j32j40P1JK76k84J19j71K46J2j40o6n1N6L0K5J91k7l71M7J95J83j74
7103B3NO5l6MO8j32j16j99M39j33O6o1O9j39J09j05J43n8k3l50L74j06q8L90l14
7128a05L83p1j4m00K22J91R9k9m37K57k7m0j59L47l89J50j22R7Q6L6p0q1L21l10
7152f5O3P5q2j85K26L3j04J0K69j45j77j74L84L4j88oJ27Qj70J88k03J57l84j
7176c10L68J4k33j05M14j10P0k55Q7J51j31M5O9no3J75j15q2j32J26m3L70m43
$$ plain form
7199 -138 -167 -1 -9 69 132 -107 156 -51 -7 124 282 542 79 -53 11 -522 -28 308 -2 -113 128 88 -528
7222 -528 -267 -214 440 370 412 -514 584 -1007 121 -143 229 -487 346 -28 44 -17 468 -154 272 139 183
7243 183 77 152 -224 147 580 227 180 -26 5 -192 3 26 -74 -147 81 187 -379 -266 -64 11 -177 2
7265 2 156 0 -74 -48 182 -129 -110 16 -37 -45 -93 -200 -96 -192 180 192 -40 -60 -83 94 -83 182 -150 -1
7289 -1 131 -93 84 -114 3 167 99 38 -93 -203 -33 65 -164 83 -126 263 -15 -51 144 -119 -19 130
7311 130 -93 278 -29 43 166 174 20 -125 -43 -130 -71 104 -296 -210 48 -122 263 -141 -67 81 -23 130 -112
7334 -112 -124 7 -24 193 -19 114 33 56 -114 -8 112 2 -177 -168 48 242 29 7 268 54 -43 111 50
7357 50 91 -135 169 98 -280 -48 -51 -40 -143 -68 -281 17 23 -58 12 94 -108 44 90 -25 -78 -136 -242 72 -8
$$ packed form
7199a38k9J66qP8O3k39K63k07M4J31J58K60m63j32O4n33M94L36l10j11K41m0o16
7222e28K61N3O54p0M2r26J098j591J128k64L72p16Q33l74P2o1M85o22M26j33M4
7243A83j06P5l76L71M33l53m7k06L1j97J95K3j00p3K28J06n66J13K02P5j88J79
7265BJ54j56p4K6K30l11J9J26n3qm8j07J04r6L72J2k32k0k3J77j77K65l32J49
7289aJ32k24J77j98J17J64o8o1j31j10J70R8k29K47k09L89k78l6J95k63J00J49
7311A30k23L71l07P2J23Qj54j45Q2q7N9J75m00Q6K58j70L85m04P4J48j04J53k42
7334a12j2J31l1K17k12J33q1K3j70J06J20j10j79RK16J94k13k2K61k14r7J54o1
7357E0M1k26L04p1l78K32lJ1j03P5k13K98Oq1P0Q2k02J52M6j15n3n8j06L14q0
$$ plain form
7382 -8 -10 -205 -15 -109 59 -74 36 -93 -204 172 -48 75 -95 -39 -316 -4 -143 -80 -2 -85 -117 -198 -80 312
7406 312 -21 11 9 35 85 -213 -73 -96 -13 -102 -70 -10 153 -30 -298 110 90 66 -9 96 240 -11 -39 -155 82
7431 82 31 27 149 -48 81 -163 71 -131 12 -151 89 127 -58 21 152 68 167 135 -7 -224 45 48 121 -92
7455 -92 -70 139 -212 103 84 19 -110 -9 -150 201 70 35 -85 -61 -32 20 -189 -9 -28 -16 193 30 172
7478 172 -135 138 -275 -112 -131 -100 -17 98 -86 -191 -54 103 164 -121 43 99 -212 -23 16 85 -165 -36
7500 -36 70 -113 -165 -102 55 -274 -125 36 -6 -110 224 96 -162 133 -5 -136 7 -147 -45 139 -323
7521 -323 547 -277 -246 137 78 701 68 -8 95 155 -256 42 -44 58 66 -350 -99 -41 233 140 150 131 15 -97
7545 -97 -2 -256 -155 44 -96 15 -193 250 -59 42 -81 352 -76 -192 499 244 -256 -87 -89 -130 133 -66
$$ packed form
7382hkj95J90r4J68j33J10j29j11L76k20J23j70N6k77L12j39O3P8q3l2q1J18L92
7406C12l33L2kK6N0k98J40k3Q3q9L2O0J63j83k68M08k0k4p5J05J44k51k8j16K37
7431H2n1mJ22j97J29k44K34k02J43j63K40L8j85P9J31q4R9l2j42k17K69LP3k13
7455i2K2K09l51L15j9o5j29J01j41L51j31l5j20K4K9N2k09J80j9J2K09j63J42
7478A72l07K73m13J63j9L1Q3J15j84j05J37J57O1k85J64N6l11J89L9O9k50J29
7500c6J06j83n2O3J57l29J49J61m2j04L34j28k58K95j38j31J43j54J02J84m62
7521c23Q70q24L1L83n9O23o33p6J03O0m11K98q6J02Qm16K51N8K74r3J0j9j16j12
7545i7R5k54J01J99j40J11k08M43l09J01j23M33m28j16O91k55n00J69km1K63j99
$$ plain form
7567 -66 -132 34 150 227 -85 -514 -108 -193 200 156 44 -177 -253 174 49 95 -130 -117 31 162 -56 -46 221
7590 221 53 185 -610 270 -83 -262 174 112 156 -8 102 81 -63 -157 -39 -136 -213 90 522 215 147 -112
7612 -112 11 11 -264 95 228 -218 -478 -236 40 423 -309 242 114 76 540 379 -10 -297 -59 22 26 -32
7634 -32 -165 252 532 -214 -250 78 -543 -311 -41 -248 -420 220 -11 345 -204 -238 -602 286 -425 272 16
7655 16 194 -569 -314 543 -1082 -132 37 88 -175 525 -178 258 68 -254 77 251 -162 -46 -141 -34 194
7676 194 -172 85 96 142 -68 180 -113 210 67 -135 -47 94 189 -48 43 134 -75 217 109 156 102 -60 -63
7699 -63 38 144 3 -27 -69 81 -180 -1 310 27 26 -215 93 -13 69 -80 -124 123 -44 253 126 256
7721 256 5 -110 -76 -91 224 123 126 -61 21 6 165 205 -123 -200 -89 -116 59 -103 61 -108 163 -132 -30
$$ packed form
7567f6o6J66J16P7l12m29M06q5L93m4j12k21p6M27j25M6k25J3J48J31k18J0K67
7590B21j68J32p95Q80l53j79M36o2M4j64J10k1j44r4J18r7p7L03M32l07o8k59
7612a12J23%k75L59J33m46k60K42K76L83p32N51j28l8M64j61l89k87K38Q1Mn8
7634c2j33M17K80p46l6L28o21K32K70k07j72O40k31L56n49l4l64Q88p11O97k56
7655A6J78p63K55Q57j625R50J69N1k63P00p03M36j90l22L31J74m13J16r5J07K28
7676A94l66K57J1M6k10K48k93L23j43k02Q8J41R5k37R1R1k09K92j08M7n4j62l
7699f3J01J06j41l0m2J50k61J79L11k83jk41L08j06Q2j49m4K47j67K97j27J30
7721B56k51j15L4j5L15j01Lj87Q2j5J59M0l28p7J11k7J75j62J64j69K71k95J02
$$ plain form
7744 -30 -92 191 -231 -64 -93 80 -52 -284 -108 344 -20 0 61 -27 49 260 41 -88 -153 31 110 -164 -130
7767 -130 -201 -17 -141 89 -198 125 6 -143 38 -160 -84 -56 10 25 104 -210 89 51 -277 2 -193 -127 -58
7790 -58 15 -55 -62 122 14 146 -115 148 54 -62 108 152 -17 24 87 -137 -23 -19 68 -7 79 -9 0 53 -48 73
7816 73 -273 28 13 -145 -31 -232 30 -124 -55 43 76 104 99 -34 214 31 -183 84 221 86 112 151 24
7839 24 0 -74 1 39 -30 -210 -98 12 107 -161 -165 51 -127 42 -60 -18 139 -79 125 -130 126 -112 53
7862 53 80 -56 -237 80 103 136 158 100 -212 0 199 42 269 254 -29 232 -115 -52 163 171 126 130 -154 55
7886 55 -28 65 -200 15 106 179 122 -142 26 40 -126 54 123 31 -122 103 -16 83 -16 -185 109 -61 -5 -41
7910 -41 19 36 39 -39 51 -92 112 -197 187 -40 -5 -120 -156 64 49 104 -117 73 69 -87 108 -60 -263 188
$$ packed form
7744c0o2K83m22J67k9J73j32k32J76M52l64K0O1q8P6K11k19j29o5J84P9k74L4
7767a30p1J84j24K30k87L23j19j49J81j98P6K8O6J5P9l14K99l8l28K79j95O6O9
7790e8P3p0pJ84j08J32k61K63r4j16J70M4j69M1O3k24J14MQ7p5Q6q8RN3j01J21
7816G3l46L01j5j58J14k01K62j54O9R8L3K8nj33K48j83k14K67J37j35K6L9j27
7839B4k4p4P5L8o9j80J12J10R5k68mK16j78J69j02M2J57k18K04k55K56k38J65
7862E3K7j36j81L17K3L3K2n8l12K12J99j57K27j5k83K61l47O3K15Qm5Mk84K09
7886E5q3R3k65K15R1P3n7k64J68J4j66J80O9r2j53K25j19R9r9j69K94j70N6l6
7910d1O0J7Lp8R0j43K04l09L84k27L5j15l6K20j5N5k21J90mj56J95j68k03M51
$$ plain form
7934 188 77 -78 -109 -20 -91 126 120 -35 31 59 97 83 -4 -80 136 -233 -323 10 -53 -6 172 38 28 42 -266
7959 -266 -68 88 -158 -11 -62 50 44 -271 -98 -83 234 -51 -55 -19 -42 -93 -106 -60 33 -51 -7 -21 -59 -5 136 79
7985 79 -112 -140 -54 -148 273 -15 108 6 176 -108 -146 227 53 -158 -39 -28 -68 9 -143 116 -163 108 58
8008 58 50 -63 93 -197 -57 -30 229 159 120 181 -41 -27 93 -367 6 -94 70 -12 52 73 119 95 -44 -58 -3
8033 -3 227 274 79 -518 -212 -398 7 75 142 20 105 46 -187 -8 106 -202 -177 -16 302 -38 -18 114 -3
8056 -3 42 -130 -172 3 -93 63 118 -37 138 -65 -114 -62 50 19 149 -148 -107 -3 -38 111 -74 50 132 5
8080 5 316 -142 -109 -42 -12 15 -57 -179 -115 -5 25 118 59 7 -150 1 156 -97 -139 35 -53 -39 226 -9 -92
8105 -92 -131 -198 150 -254 -56 -138 -37 97 -14 59 23 28 -112 -60 -9 -101 -40 106 -70 -100 -90 16 48 -78 279
$$ packed form
7934A88j11j55l1Q9p1K17oj55O6K8L8j4q7p6K16l69r0L33o3M7J78j34j0J4l08
7959b66J98J56k46J47n1J12ol15J73J5L17k85mL6k3n1j3M6R3q4M4j4l8N4J41n7
7985G9j91k8Q6r4M21k88J23j02J70k84l8L73j74k11J19J1m0P7j52K59k79K71n0
8008E8qj13J56k90J40K7K59p0l9O1k22J4J20m60L73j00J64q2O4K1M6k4j39j4N5
8033cK30M7j95n97L06j86M05O8O7j22Q5n9k33J79J14l08K5J61L18l40K0J32j17
8056cM5j72m2J75r6J56N5j55J75k03m9N2J12l1J30k97M1J04l5J49j85J24Q2j27
8080EL11m58L3O7L0K7p2j22O4J10L0R3n9n2j57J51J55k53m2J74q8J4K65k35q3
8105i2l9o7L48m04J98q2J01J34j11P3l6Nj40N2N1r2O1J46j76l0J0J06L2j26L57
$$ plain form
8130 279 191 219 -58 -415 42 -3 6 29 100 67 -149 -76 32 -179 248 285 35 159 186 -168 -89 -146 -307 336
8154 336 424 67 754 -146 -412 353 391 258 -215 133 -118 61 328 161 -220 -156 -29 167 -188 -22 111
8175 111 -191 -87 406 202 -53 87 -64 62 -62 18 -51 89 227 40 5 -72
$$ packed form
8130B79q8K8k77l57M57m5RK3P1l3k16P3J08k11M27L7k50J24K7l54P9n7j61O43
8154C36Q8l57O87r00k66P65L8j33m73L48k51J79K67j67l81O4J27J96l55J66J33
8175A11l02J04M93k04k55J40j51J26j24Q0o9J40J38j87l5p7
8191g2
$$ Imaginary data points
##PAGE= N=2
##DATA TABLE= (X++(I..I)), XYDATA
$$ plain form
0 0 0 0 0 0 0 0 0 0 0 0 0 0 0 0 0 0 0 8 -8 8 -8 8 -8 16 -16 16 -24 24 -31 32 -40 43 -48 56 -64 72 -80 89 -100
39 -100 112 -124 140 -155 171 -188 211 -230 253 -283 308 -341 375 -415 456 -503 559 -618 687 -767
59 -767 860 -971 1106 -1273 1490 -1774 2180 -2797 3874 -6320 27492 -14757 -8769 40227 7937
74 7937 12727 -126 10376 10682 2605 31643 -134 -20006 36741 1704 -15801 17161 -10153
87 -10153 -15899 3723 8022 -3100 -38648 6881 29586 -35099 -18274 4986 -20423 -2615 -12569
100 -12569 -27350 -14261 -8087 3711 -25709 -28693 17584 -17751 -28844 10898 -19985 -28671 -1915
113 -1915 -594 -10686 -30943 -659 16698 -22639 -4760 1494 -20588 12280 3827 -25511 -5414
126 -5414 9249 8684 -14292 -9269 25210 -5855 -10320 23485 -5896 -11584 13112 5636 522 -5356
$$ packed form
0@%%%%%%%%%%%%%%%%%Qj6J6j6J6j6K4l2L2m0M8n5O3p2Q3r1J04j20J36j52J69j89
39a00K12k36K64k95L26l59L99m41M83n36N91o49P16p90Q71r59J062j177J305j454
59g67J627j831K077k379K763l264L954m977O671j0194L3812m2249N988M8996l2290
74G937M790j2853J0502L06q077K9038l1777j9872N6747l5037j7505L2962k7314
87a0153n746J9622M299j1122l5548M5529K2705o4685J6825K3260k5409J7808r954
100a2569j4781J3089O174J1798k9420k984M6277l5335j1093L9742l0883q686K6756
113a915J321j0092k0257L0284J7357l9337J7879O254k2082L2868q453k9338K0097
126e414J4663n65k2976N023L4479l1065m465L3805k9381n688K4696p476n114n878
$$ plain form
140 -5356 5368 12928 -2802 12538 4655 -14049 23317 15767 -18771 1424 16653 9267 -5588
153 -5588 -264 19949 -568 -581 21279 -3943 -2533 17040 816 722 6843 3819 2679 3130 17073
168 17073 1339 -13386 21546 15405 -15510 2549 12403 3417 -1477 782 8227 -886 3002 11248
182 11248 -8794 743 13465 -8422 -3991 9058 -2254 -8332 -104 10343 -5552 -15206 10525
195 10525 4912 -14602 -1427 437 -5998 -1696 -4463 -7057 -5350 1747 -1108 -15272 -676 6964
209 6964 -15319 -8745 6510 -6257 -12485 -2338 3635 -7372 -10980 3279 -1741 -8582 1201 -4911
223 -4911 -7373 4262 -1408 -10649 -2093 6726 -2443 -11913 3644 7946 -10211 -3675 7927 -1874
237 -1874 -4837 2162 2204 -1237 316 2663 -2067 1659 7361 -3978 -3567 11009 3722 -7510 2729
$$ packed form
140e356J0724P560j5730J5340p883j8704L7366p550l4538K0195J5229p386j4855
153e588N324K0213k0517j3K1860k5222J410J9573j6224r4O121l024j140M51J3943
168A7073j5734j4725L4932o141l0915J8059R854q986m894K259P445r113L888Q246
182A1248k0042R537J2722k1887M431J3049j1312o078Q228J0447j5895r654K5731
195A0525n613j9514J3175J864o435M302k767k594J707P097k855j4164J4596P640
209F964k2283O574J5255j2767o228J0147N973j1007l608J4259n020o841R783o112
223d911k462J1635n670r241Q556Q819r169r470J5557M302j8157O536J1602r801
237a874k963O999M2l441J553K347m730L726N702j1339M11J4576p287j1232J0239
$$ plain form
252 2729 10519 117 -5189 6930 7273 -2622 1973 6613 690 3106 5023 -562 2439 7874 1813
267 1813 -3814 6337 9886 -3724 -2126 10502 3968 -5370 2834 7237 -105 -1187 3523 2159
281 2159 278 3383 18 -2037 5029 2810 -6106 52 7208 -1795 -7151 3330 5266 -5745 -3680
296 -3680 4460 6 -4748 -547 -106 -2655 -406 -1188 -4935 58 2089 -6365 -5491 3642 879 -8090
312 -8090 -2705 4109 -3633 -7220 -346 1545 -4100 -2842 -407 -2368 -817 -412 -5160 -2155 3083
327 3083 -2688 -6357 1614 3898 -5286 -4982 4160 1012 -6011 -812 2538 -1085 -1776 50 10 451
343 451 1745 -1363 -1976 3978 2234 -5210 -27 6141 -847 -3997 3214 5263 -1327 -1519 4828 2913
359 2913 -854 1920 1307 877 3651 88 -1308 4078 4940 -1056 -1763 6085 4423 -4104 850 6096
$$ packed form
252B729P790j0402n306J2119L43r895M595M640n923K416J917n585L001N435o061
267A813n627J0151L549j3610J598J2628o534r338Q204M403p342j082M710j364
281B159j881L105l365k055P066k219q916O158P156r003n356J0481J936j1011K065
296c680Q140m454m754M201M41k549K249p82l747M993K031q454Q74R133k763q969
312h090N385O814p742l587O874J891n645J258K435j961J551M05m748L005N238
327C083n771l669P971K284r184L04R142l148p023N199L350l623o91J826m0M41
343D51J294l108o13N954j744p444N183O168o988l150P211K049o590j92O347j915
359B913l767K774o13m30K774l563j396N386Q62n996p07P848j662q527M954N246
$$ plain form
375 6096 -215 -1403 2103 2932 913 214 2022 1371 1223 1827 -2508 -138 5105 -2231 -4618 2978
391 2978 3659 -1917 -3675 2992 3530 -4332 -1534 1606 -2147 -679 -1179 -2619 390 -427 -1861 -1223
407 -1223 903 1233 -5364 -2584 4713 -3789 -6452 1157 1398 -1397 -3928 -755 2431 -1887 -761 -1274
423 -1274 -3399 2270 -1383 -5460 1526 684 -2036 -695 1098 2469 -4139 -1979 5471 -2357 -4567
438 -4567 1077 366 1751 -1196 -2578 2859 2273 1452 -1199 -3158 5576 1053 -5141 2643 1821 -618
454 -618 1192 1122 3455 -990 -868 5954 -371 -1841 1722 -953 3872 1744 -3889 2074 4147 3433
470 3433 -743 -3836 5758 2917 -4742 1742 339 -363 2492 -955 1819 273 -1192 4028 -461
485 -461 -1017 821 -3759 3493 2301 -6035 -614 2669 2713 -720 -6091 3230 3015 -4450 -354 -2706
$$ packed form
375F096o311j188L506Q29k019o99J808o51j48O04m335K370N243p336k387P596
391B978O81n576j758O667N38p862K798L140l753J468n00j440L009q17j434O38
407a223K126L30o597K780P297q502k663P609K41k795k531L173L186m318J126n13
423a274k125N669l653m077O986q42k720J341J793J371o608K160P450p828k210
438d567N644p11J385k947j382N437n86q21k651j959Q734m523o194P784q22k439
454f18J810p0K333m445J22O822o325j470L563k675M825k128n633N963K073p14
470C433m176l093R594k841p659O484j403p02K855l447K774j546j465N220m489
485d61n56J838m580P252j192q336N421L283M4l433n371R321k15p465M096k352
$$ plain form
501 -2706 -1709 2556 -3261 -1038 334 -2294 1991 -1711 -1307 150 -5893 1567 2794 -6793 -2309 707
517 707 1830 588 -6257 406 3559 -2282 -302 -3727 -1812 4430 -3103 -2191 1299 -1104 2225 -663
533 -663 -466 1993 -4110 1830 4196 -4078 -1026 612 2393 3987 -4025 -629 4327 1189 1878 -3098
549 -3098 -1457 6444 -781 -1663 1937 -135 3215 720 21 3318 -2305 1487 4368 -2001 251 -205
565 -205 1099 5225 -1828 -1833 3031 1907 2762 -2837 -2750 5877 422 -2142 452 -882 2925 112 -1618
582 -1618 2384 -1925 -414 2661 -2381 -148 -1664 -1546 3744 -1501 -3516 318 389 2575 -2784 -4768
598 -4768 3109 250 -2641 -1347 -2554 1677 -226 -3081 685 -1516 -1096 825 -2509 141 -1448
613 -1448 -3234 2481 -522 -2932 -965 -698 2714 -991 -4835 1936 1352 -1028 -1108 -2373 1739 1493
$$ packed form
501b706R97M265n817K223J372k628M285l702M04J457o043P460J227r587M484L016
517G07J123j242o845O663L153n841J980l425J915O242p533R12L490k403L329k888
533f63J97K459o103N940K366q274L052J638J781J594q012L396M956l138O89m976
549c098J641P901p225q82L600k072L350k495o99L297n623L792K881o369K252m56
565b05J304M126p053nM864j124Q55n599Q7Q627n455k564K594j334L807k813j730
582a618M002m309J511L075n042K233j516J18N290n245k015L834P1K186n359j984
598d768P877k859k891J294j207M231j903k855L766k201M20J921l334K650j589
613a448j786N715l003k410J967K67L412l705l844O771n84k380q0j265M112k46
$$ plain form
629 1493 -2435 391 -133 294 1097 -1402 1236 685 -2287 1749 1167 -459 -193 -402 3341 1225 -2892
646 -2892 1242 2170 1162 719 -1760 1859 2620 -962 378 603 1437 1832 -1251 1590 2207 -972 1053
663 1053 1665 1058 242 -989 2057 2366 -1554 61 1151 1475 838 -1798 577 2346 -353 -838 -209
680 -209 1116 1196 -2012 -92 1680 -1002 -958 -113 388 80 -1877 -121 1180 -1227 -1130 -882 347 652
698 652 -2404 -1791 1102 5 -1437 -1731 264 1082 -1925 -1705 545 -487 -1238 -1368 -63 220 -1696
715 -1696 -1764 62 -6 -938 -1735 -292 1132 -1171 -2065 442 583 -790 -1766 -44 1402 -1004 -1288 183
733 183 547 -296 -921 -292 1136 118 -866 41 1370 813 -801 -13 1907 692 -1025 334 1671
750 1671 858 -615 94 1662 1059 114 643 1432 1583 24 -162 1321 1499 64 -170 1443 1705 -93
$$ packed form
629A493l928K826n24M27Q03k499K638n51k972M036n82j626K66k09L743k116m117
646b892M134R28j008m43k479L619P61l582J340K25Q34L95l083K841O17l179K025
663A053O12o07q16j231L046L09l920J615J090L24o37k636K375J769k699m85O29
680b09J325Q0l208J920J772k682M4Q45N01l08j957J756J301k407R7K48J229L05
698F52l056O13K893j097j442k94J995Q18l007K20K250j032p51j30J305K83j916
715a696o8J826o8r32p97J443J424k303q94K507J41j373r76J722J446k406k84J471
733A83L64q43o25O29J428j018r84R07J329n57j614P88J920j215j717J359J337
750A671q13j473P09J568o03r45N29P89J51j559j86J483J78j435k34J613K62j798
$$ plain form
768 -93 -465 1712 1580 -476 -178 1070 1154 -25 -521 784 1097 -61 -754 466 1314 115 -977 89
786 89 1146 -205 -1434 -134 1087 -320 -1560 57 962 -301 -1090 -273 414 -425 -1437 -1168 235
803 235 -338 -1275 -1184 439 394 -1635 -1420 327 -443 -1751 -1333 208 -236 -1750 -896 222 -14 -883 -1345
822 -1345 215 216 -981 -1384 -350 477 -954 -1686 394 930 -769 -886 450 909 -677 -814 375 1107
840 1107 -534 -418 288 1051 857 -463 199 1517 528 -725 43 1366 926 -945 436 1763 483
857 483 113 573 1399 916 -497 298 1314 558 -53 -163 1088 1631 -269 -321 1523 1071 -247 -654 558
876 558 1089 -636 -299 1448 278 -243 -62 451 1095 -584 -923 578 40 -159 -1709 -701 1489 -743
894 -743 -954 603 146 -824 -2171 -594 600 -795 -1168 31 -688 -289 -483 -607 829 -571 -1267 -197
$$ packed form
768i3l72K177j32k056K98J248Q4j179m96J305L13j158o93J220Q48j199j092J066
786H9J057j351j229J300J221j407j240J617R05j263p89Q17O87q39j012K69J403
803B35n73r37R1J623m5k029K15J747p70j308M18J541m44j514Q54J118k36q69m62
822a345J560Jj197m03J034Q27j431p32K080N36j699j17J336M59j586j37J189P32
840A107j641J16P06P63j94j320O62J318r89j253P68J323m40j871J381J327j280
857D83l70M60Q26m83j413P95J016p56o11j10J251N43j900n2J844m52j318m07J212
876E58N31j725L37J747j170n21J81N13O44j679l39J501n38j99j550J008K190k232
894g43k11J557m57r70j347J577J194j395l73J199p19L99j94j24J436j400o96J070
$$ plain form
912 -197 6 -125 -1910 -1433 1399 164 -1678 -231 95 480 -673 -1463 491 3 -782 103 -840 570
930 570 63 -907 775 123 -1078 -70 297 930 -761 -1340 1599 669 -841 28 87 1535 941 -1208
948 -1208 423 751 636 469 -924 939 1203 -897 1160 830 -366 462 431 1408 -63 -1524 1273
965 1273 1293 -352 248 -412 1552 1652 -1173 -165 691 757 762 -1499 262 1085 -751 745 290 -498 550
984 550 -207 715 346 -1731 551 682 -296 -46 -1918 480 1845 -1364 -1218 19 517 786 -1950 -581
1002 -581 1081 -872 0 -238 -839 149 -753 2 373 -1508 -227 218 -129 455 -1881 -585 1802 -797
1020 -797 -1323 -495 535 1188 -1413 -1003 875 -529 156 -156 -858 882 -360 -434 849 -873 -75 290
1038 290 225 945 -1368 -594 1699 124 -500 -663 449 1842 -410 -981 638 308 829 -114 -797 1148
$$ packed form
912a97K03j31j785M77K832j235j842J447L26L85j153p90J954m88p85Q85r43J410
930E70n07r70J682o52j201J008L67O33j691n79K939r30j510Q69N9J448n94k149
948a208J631L28j15j67j393J863K64k100K057l30j196Q28l1R77j471j461K797
965A273K0j645O00o60J964J00k825J008Q56O6Nk261J761Q23j836J496m55p88J048
984E50p57R22l69k077K282J31r78K50j872K398J365l209J46J237M98K69k736J369
1002e81J662j953Q72k38o01R88r02P55L71j881J281M45l47N84k336J296K387k599
1020g97n26Q28J030O53k601M10J878j404O85l12p02J740j242p4J283j722P98L65
1038B90o5P20k313P74K293j575o24j63J112J393k252n71J619l30N21r43o83J945
$$ plain form
1056 1148 347 -350 885 -261 93 56 435 1434 -860 -1044 1354 792 -63 -694 -434 1763 270 -864
1074 -864 -52 311 1003 -94 -1260 725 564 -495 321 -528 325 -316 -285 1061 -392 -878 441 221
1092 221 162 -724 -1066 917 532 -980 -303 -182 890 -14 -1558 118 456 -458 -161 -206 424 126 -992
1111 -992 312 95 -952 -71 37 231 -191 -1113 401 574 -392 -480 -493 757 634 -1386 -223 644 48
1130 48 -135 -469 417 504 -925 211 651 -36 -19 -254 387 682 -669 -14 641 174 -20 -409 643 829
1150 829 -336 -205 643 656 -82 -231 487 866 -186 16 511 223 472 -404 297 944 -89 -202 220
1169 220 645 284 -536 61 1045 -200 -635 -172 299 186 -384 -278 465 12 -224 -72 223 449 -600
1188 -600 -247 454 43 -471 -264 353 247 -630 -82 362 17 -360 -286 -198 270 -395 -678 150 334 -140 -686
$$ packed form
1056A148q01o97J235j146L54l7L79R99k294j84K398n62q55o31K60K197j493j134
1074h64Q12L63O92j097j166J985j61j059Q16q49Q53o41L1J346j453m86J319k20
1092B21n9q86l42J983l85j512O77J21J072r04j544J676L38r14K97m5O30k98j118
1111i92J304k17j047Q81J08J94m22r22J514J73r66q8j3J250j23k020J163Q67n96
1130D8j83l34Q86Q7j429J136M40o87J7k35O41K95j351O55O55m67j94l89J052J86
1150H29j165J31Q48J3p38j49P18L79j052K02M95k88K49q76P01O47j033j13M22
1169B20M25l61q20N97R84j245m35M63M71j13n70J06P43m53k36J52K95K26j049
1188f00L53P01m11n14K07O17j06q77N48M44l45l77P4Q8M68o65k83Q28J84m74n46
$$ plain form
1209 -686 -53 686 -554 -871 44 240 -302 -622 11 419 -128 -484 -52 125 -59 -864 -392 390 -87 -671
1229 -671 -96 604 49 -595 -28 604 -109 -417 -69 583 -132 -290 -253 527 235 -57 -113 504 440 -397 -182
1250 -182 588 343 -282 -164 709 661 -232 -324 746 179 42 90 649 621 105 107 654 426 -92 -246 181 639
1272 639 192 -66 64 631 -196 -146 247 569 114 -83 254 610 380 -508 64 240 -150 -191 -218 390 16
1293 16 -824 -290 238 177 -690 -116 364 -73 -621 -436 622 38 -625 -313 109 -136 -268 -736 62 269
1313 269 -426 -813 -53 -16 -451 -835 297 396 -673 -504 87 79 -221 -378 -111 244 -112 -262 -13 159 -116
1334 -116 -536 -205 446 81 -270 88 698 395 -533 -247 808 130 -210 200 425 398 -309 -12 364 242
1354 242 -34 103 167 660 -294 225 833 464 -292 457 795 397 -358 -54 417 195 62 -123 210 673
$$ packed form
1209f86O33P39j240l17R15J96n42l20O33M08n47l56M32J77j84q05M72P82m77n84
1229f71N75P00n55o44N67O32p13l08L48O52p15j58L7P80k92k92n6O17o4q37K15
1250a82P70k45o25J18Q73m8q93r2J070n67j37M8N59k8n16KN47k28n18j54M27M58
1272F39m47k58J30N67q27N0L93L22m55j97L37L56k30q88N72J76l90m1k7O08l74
1293A6q40N34N28o1q67N74M80m37n48J85J058n84o63L12M22k45j32m68P98K07
1313B69o95l87P60L7m35l84J132R9j069J69N91ql00j57K67L55l56j50K49J72k75
1334a16m20L31O51l65l51L58O10l03r28K86J055o78l40M10K25k7p07K97L76j22
1354B42k76J37O4M93r54N19O08l69p56P49L38l98p55L04M71k22j33j85L33M63
$$ plain form
1374 673 100 -294 275 400 120 -162 244 686 -15 -322 202 67 -522 -135 458 539 -350 -793 -37 -597
1394 -597 245 -197 -245 385 174 -743 -198 -178 -221 -128 -499 172 -215 -366 305 -227 -238 -237 -327 308 -108 -726 -241
1417 -241 -158 372 -340 -752 247 176 -394 -481 -164 321 156 -161 125 -18 -519 202 -91 45 100 -609 -44
1438 -44 586 -248 -407 32 537 302 -849 347 709 -99 -36 -378 411 483 -94 137 281 241 335 -146 372
1459 372 352 -373 -1 808 -84 -69 49 523 380 -563 -82 445 51 192 -398 127 689 -46 59 88 14
1480 14 440 -112 231 539 -481 -100 489 -307 -167 -371 106 615 -607 -284 549 461 207 -497 -563 518
1500 518 -202 -330 -538 -66 173 -145 -237 -132 22 -35 -645 -387 -67 -463 54 205 -512 -506 -183 318 223 -667
1522 -667 -756 324 101 -362 -205 -248 260 -225 -353 54 -366 -276 197 -342 86 -77 -94 57 133 -374 28
$$ packed form
1374F73n73l94N69J25k80k82M06M42p01l07N24j35n89L87N93Q1q89m43P56n60
1394e97Q42m42m8O30k11r17N45K0m3R3l71O71l87j51O71n32j1Jr0O35m16o18M85
1417b41Q3N30p12m12R99p1n70q7L17M85j65l17K86j43n01P21k93J36N5p09N65
1438d4O30q34j59M39N05k35j151J196L62q08O3l42P89P2n77K31J44m0R4m81N18
1459C72k0p25L72Q09q92J5J18M74j43r43M81N27l94J41n90N25N62p35J05K9p4
1480A4M26n52L43L08j020L81N89p96J40k04M77N09j222L23Q33q8k54p04o6J081
1500E18p20j28k08M72K39l18r2J05J54n7o10K58L20l96N17J51p17OL23N01r5q90
1522f67q9J080k23m63J57m3N08m85j28M07m20R0M73n39M28j63j7J51P6n07M02
$$ plain form
1543 28 106 566 -285 -404 284 64 541 -75 -382 571 518 -273 293 -297 -285 433 -164 433 -83 -446 343
1564 343 436 -312 -131 266 275 467 -501 -156 243 506 120 -454 335 291 -71 104 -11 329 -7 -271 246
1585 246 17 -285 217 124 -28 119 -92 241 -122 -171 -152 215 523 -143 -715 51 416 -115 -220 -195 265
1606 265 47 -295 127 -42 -256 305 36 -119 46 -371 43 164 -50 -462 -273 166 -119 -626 137 250
1626 250 -108 -213 -213 -2 103 -142 -98 27 15 97 -276 163 201 -354 -141 146 -27 -218 -116 317 186 -289
1648 -289 -30 361 -75 69 -13 -93 332 119 -234 42 193 203 -518 191 522 -257 -47 473 97 -8 81
1669 81 233 -14 -160 -85 -118 30 499 -148 -338 167 27 -169 -259 422 226 -104 85 621 -135 -51 -26 -35 100
1692 100 -9 -15 58 185 154 -138 -204 339 -328 -399 202 395 -638 -91 207 207 -275 63 88 -43 -68 15 -291
$$ packed form
1543B8P8M60q51j19O88k20M77o16l07R53n3p91N66n90J2P18n97N97n16l63P89
1564C43R3p48J81L97RJ92r68L45L99K63l86n74P89m4l62J75j15L40l36k64N17
1585B46k29l02N02r3j52J47k11L33l63m9J9L67L08o66n72P66L65n31j05K5M60
1606B65k18l42M22j69k14N61k69j55J65m17M14J21k14m12J89M39k85n07P63J13
1626B50l58j05%K11J05k45M4J25j2Q2l73M39L8n55K13K87j73j91J02M33j31m75
1648b89K59L91m36J44q2q0M25k13l53K76J51J0p21P09L31p79K10N20l76j05Q9
1669H1J52k47j46P5l3J48M69o47j90N05j40j96r0O81j96l30J89N36p56Q4K5rJ35
1692A00j09oP3J27l1k92o6N43o67p1O01J93j033N47K98%m82L38K5j31k5Q3l06
$$ plain form
1715 -291 87 168 -378 -234 99 174 -571 -215 99 -10 -378 105 140 -246 -269 45 85 199 90 -129 -4 209
1737 209 -133 -324 80 375 -461 -293 736 140 -73 -63 484 -38 -197 107 214 111 -42 -225 -312 145
1757 145 14 -244 -19 317 45 -270 181 280 -258 -58 -10 297 -350 99 177 82 47 229 11 19 225 -197
1779 -197 -206 304 358 -46 -50 299 81 -410 381 303 -142 -268 125 104 100 -179 -156 194 211 16 -282 44 188 -46
1803 -46 -314 433 136 -462 -122 136 30 -100 208 -97 -47 -308 115 -30 179 9 -353 -109 348 39 -346
1824 -346 236 82 -209 -262 167 112 -327 79 97 139 -14 13 -167 52 92 -165 -185 299 344 -229 -105 268 -6
1847 -6 49 35 158 -121 -34 115 -301 -18 102 -128 191 176 292 -216 -26 357 -131 -410 272 130 -231 -84
1869 -84 29 -23 -8 -136 -30 -124 182 -41 -138 80 180 -147 -150 203 -129 -161 33 470 -176 -290 148 204 -406
$$ packed form
1715b91L78Q1n46J44L33P5p45L56L14j09l68M83L5l86k3L14M0J14j09k19J25K13
1737B09l42j91M04K95q36J68J029n96k13J0N47n22j59L04J07j03j53j83q7M57
1757A45j31k58K25L36k72l15M51R9n38K00M8L07o47M49P8r5l5J82k18QK06m22
1779a97rN10N4m04mL49k18m91P91p8m45j26L93k1mk79K3L50J7j95k98L26J44k34
1803d6k68P47k97n98L40K58j06j30L08l05N0k61M23j45K09j70l62K44M57l09l85
1824c46N82j54k91n3M29n5m39M06J8M2j53K7j80K19M0k57k0M84M5n73J24L73k74
1847fN5j4J23k79Q7J49m16K83J20k30L19j5J16n08J90L83m88k79O82j42l61J47
1869h4J13n2J5j28J06r4L06k23r7K18J00l27lL53l32l2J94M37o46j14M38N6o10
$$ plain form
1892 -406 -91 283 -14 99 -289 -368 -125 -116 91 -403 145 209 23 109 126 -101 -212 -119 154 -205 -188 338 -22
1915 -22 -15 -78 -238 -22 140 -162 -216 -146 106 88 -320 314 264 135 52 156 52 45 -22 90 -28 -100 213 148 -57
1940 -57 -108 -160 -354 396 138 -123 60 213 73 -201 117 51 -45 -61 -287 -72 16 -91 109 -118 421 -76
1962 -76 -220 -12 125 -184 130 265 -250 -213 -76 108 22 37 -82 -90 10 144 -139 -73 324 144 -97 284
1984 284 102 92 -177 -168 224 -330 -87 -2 12 39 -168 -254 192 363 137 170 163 329 -297 -211 269 29 -272 -150
2008 -150 -44 -107 -126 247 361 -65 -24 -115 -111 56 113 -14 -96 361 81 -199 135 52 -45 -138 -52 26 -79 -12 39
2033 39 184 22 23 29 62 -20 93 -119 129 -314 -242 200 97 -61 33 126 99 -237 -165 -1 -202 -126 57 -27 66
2058 66 -9 36 172 167 185 -45 65 62 105 -187 -91 128 65 -152 102 318 88 -241 -92 -103 -12 16 -170 68 261
$$ packed form
1892d06L15L74k97J13l88p9K43RK07m94N48O4j86Q6J7k27j11R3K73l59J7N26l60
1915b2Po3j60K16J62l02n4P0K52j8m08O34n0j29q3J04j04po7J12j18p2L13o5k05
1940e7n1n2j94P50k58k61J83J53j40k74L18o6r6j6k26K15Q8j07K00k27N39m97
1962g6j44K08J37l09L14J35n15L7J37J84q6J5j19qJ00J34k83O6L97j80k41L81
1984B84j82j0k69RL92n54K43Q5J4K7k07q6M46J71k26L3pJ66o26Q6M80k40l01J22
2008a50J06o3j9L73J14m26M1r1MJ67N7j27q2M57k80k80L34q3r7r3Q6P8j05O7N1
2033C9J45j62JOL3q2J13k12K48m43P2M42j03j58R4R3k7l36P2J64k01P6J83q4R3
2058F6p5M5J36nJ8k30J10lM3k92R6K19o3k17K54K16k30l29J49j1R1K8j86K38J93
$$ plain form
2083 261 -227 44 379 186 15 171 94 -269 22 32 -47 -35 -152 51 110 374 -14 132 -6 263 -24 -135
2105 -135 -157 64 -4 -5 -33 82 4 60 186 -121 -87 49 -129 92 103 -212 -60 349 -123 106 -77 166 66
2128 66 -102 -343 95 -25 -23 -131 72 49 -82 -192 -211 -56 -172 175 -291 189 -351 -98 115 -77 -92 -55
2150 -55 144 84 84 -92 -17 45 -48 74 28 175 87 -151 -23 -59 -76 1 -63 181 154 -56 27 11 -58 127 152 9
2176 9 148 111 9 415 -182 161 -245 199 -171 19 190 206 -130 71 -149 543 13 -159 479 -161 -52
2197 -52 -94 510 70 -9 513 -646 61 -256 371 87 574 -429 -323 802 353 78 -181 651 130 -145
2217 -145 57 79 12 289 95 135 -308 273 383 -101 -95 187 4 -168 -117 93 -105 -146 -255 -87 -240 -14
2239 -14 -75 -195 24 196 178 -93 311 -45 81 53 -148 -34 137 170 -196 -79 -48 95 76 112 -69 95 97
$$ packed form
2083B61m88K71L35j93j71J56p7l63K91J0p9J2j17K03N9K64l88J46j38K69k87j11
2105a35k2K21o8jk8J15p8N6J26l07L4J36j78K21J1l15J52M09m72K29j83K43j00
2128F6j68k41M38j20Kj08K03k3j31j10j9J55j16L47m66M80n40K53K13j92j5L7
2150e5J99o0%j76P5O2r3J22m6J47q8k38J28l6j7P7o4K44k7k10Q3j6o9J85K5j43
2176IJ39l7j02M06n97L43m06M44l70J90J71J6l36K01k20O92n30j72O38o40J09
2197e2m2O04m40p9N22j159P07l17O27k84M87j003J06J125m49k75k59Q32n21k75
2217a45K02K2o7K77j94M0m43N81J10m84OK82j83j72N1K10j98m1j09J68j53K26
2239a4o1j20K19J72j8k71M04l56J26k8k01J14J71L3l66J17L1J43j9L6j81J64K
$$ plain form
2262 97 46 -293 164 46 -200 -383 493 -204 352 -384 47 499 186 -575 220 198 -335 -71 -241 150 105
2283 105 431 132 -136 41 -127 -156 14 -34 -67 -136 -14 210 -42 80 -20 -31 -37 -191 61 79 11 -130 -262
2306 -262 200 -65 -26 15 9 216 -182 -44 -10 -143 -167 -24 -181 -115 -178 -159 298 141 -38 -9 1 48 -204 -7
2330 -7 -382 87 46 282 3 -238 -193 -460 329 -202 -481 119 101 -312 6 168 21 143 -381 196 172 -297
2352 -297 -260 199 740 -6 101 107 213 -60 270 10 -30 7 -162 21 68 135 -5 -378 611 44 -101 -379
2374 -379 -222 -584 262 -233 -222 -275 -221 362 -156 31 330 541 121 -104 -404 38 -140 -65 31 -152 238 99
2396 99 -253 54 -73 17 -220 -9 4 -184 319 -40 -209 -111 -203 -131 -101 94 -62 -160 -103 -68 127 -223 -46
2419 -46 -20 82 117 -50 166 -68 -25 13 92 150 57 138 141 25 108 46 142 -357 -597 316 -280 271 -222 391 612
$$ packed form
2262I7n1l39M57j18k46j83Q76o97N56p36M31M52l13p61P95k2n33K64j70L91m5
2283A05L26k99k68J77j68k9J70m8l3o9J22K24k52J22j00j1oj54K52J8o8j41j32
2306b62M62k65L9M1oK07l98J38L4j33k4J43j57O6o3J9M57j57j79K9J0M7k52J97
2330gl75M69m1K36k79k41M5k67P89n31k79O00j8m13L18J62j47J22n24N77k4m69
2352b97L7M59N41p46J07OJ06k73L30k60m0L7j69J83M7O7j40l73R89n67j45k78
2374c79J57l62Q46m95J1n3N4N83n18J87K99K11m20k25l00M42j78P5R6j83L90j39
2396I9l52L07j27R0k37K11J3j88N03l59j69R8r2P2L0J95j56r8N7L5J95l50J77
2419d6K6J02L5j67K16k34M3L8P9N8r3Q1Lj16Q3o2R6m99k40R13n96N51m93O13K21
$$ plain form
2444 612 -90 403 163 108 -151 69 -92 -166 42 99 -205 -262 355 -82 -20 -281 -150 -140 -187 157 -132 -232
2466 -232 -151 -45 37 170 94 132 -19 -344 -74 -115 -71 168 92 67 73 -126 247 -18 -71 50 -73 -154 59 -169
2490 -169 -22 102 -148 22 18 -36 61 6 -216 -16 -257 143 58 -59 72 179 -107 -232 -190 -238 217 -8 34
2513 34 8 78 -317 35 184 -70 -152 240 -112 130 -55 -161 153 -46 16 -150 -143 138 137 106 -49 98 -11
2536 -11 23 128 -8 77 -93 9 102 31 -170 109 69 -32 74 145 196 -262 -15 34 -77 160 -19 -259 32
2559 32 58 14 -60 108 -89 22 193 -167 51 -31 136 -107 -21 -65 -56 268 -159 -19 12 -23 5 -182 202 82
2583 82 -56 -67 46 70 -57 -238 -23 -311 46 147 -48 32 81 -276 -237 40 -68 -182 125 -57 90 -160
2605 -160 -94 35 -104 -104 70 -90 161 56 -136 -32 66 144 170 -100 33 64 -38 46 -110 -56 66 -34 86
$$ packed form
2444F12p02M93k40n5k59K20j61p4K08N7l04n7O17m37O2k61J31J0m7L44k89j00
2466b32Q1J06Q2J33p6L8j51l25K70m1M4K39p6k5Oj99L73k65n3J21j23q1K13k28
2490a69J47J24k50J70mn4R7n5k22K00k41M00q5j17J31J07k86j25M2m8M55k25M2
2513C4k6P0l95L52J49k54q2L92l52K42j85j06L14j99O2j66PK81jl1j55J47j09
2536a1L4J05j36Q5j70J02R3p1k01K79m0j01J06P1N1m58K47M9j11K37j79k40K91
2559C2K6m4p4J68j97J11J71l60K18q2J67k43Q6m4RL24m27J40L1l5K8j87L84j20
2583H2j38j1J13K4j27j81K15k88L57J01j95Q0M9l57L9K77j08j14L07j82J47k50
2605a60O6J29j39%J74j60K51j05j92J04R8P8K6k70J33L1j02Q4j56N4J22j00J20
$$ plain form
2628 86 312 -126 267 -119 -179 -62 144 -107 5 30 163 63 101 -146 57 104 -4 -76 -25 78 -28 119
2650 119 -11 137 67 -290 272 -53 -85 62 148 -130 -134 -17 224 241 137 14 118 -72 135 135 -60 94 -261
2673 -261 122 64 -175 237 -177 113 28 338 -39 147 225 -154 -105 -92 -167 -6 -54 -70 -260 136 55 72 -32
2696 -32 129 -133 -7 -144 -392 27 -104 131 259 200 -274 103 -92 242 -97 73 8 -240 -68 -110 -133 115
2718 115 224 27 -92 42 -161 -34 53 -50 -194 17 107 121 76 252 3 63 -4 83 -58 218 92 -90
2740 -90 114 -57 -43 -109 59 136 -88 82 -118 56 129 -204 110 -277 56 -42 -69 79 6 53 75 -52 258
2763 258 161 26 42 -39 12 0 -73 -132 64 -82 13 403 -126 -24 -170 301 48 -28 167 176 -17 -110 98 -427
2787 -427 -340 108 -123 -84 262 63 -192 -221 78 -268 -1 329 -180 119 196 57 -92 -84 69 150 61 183 -8
$$ packed form
2628H6K26m38L93l86o0J17K06k51J12K5J33j00L8k47K03M7j08p2N1J03j06J47
2650A19j30J48p0l57N62l25l2J47Q6k78mJ17K41J7j04j23J04j90K07%j95J54l55
2673b61L83n8k39M12m14K90q5L10l77J86P8l79M9J3p5J61m8j6j90L96q1J7j04
2696c2J61k62J26j37k48M19j31K35J28n9m74L77j95L34l39J70o5k48J72m2k3K48
2718A15J09j97j19J34k03J27Q7j03j44K11R0J4m5J76k49O0o7Q7j41K76j26j82
2740i0K04j71J4o6J68P7k24J70k00J74P3l33L14l87L33r8k7J48p3M7K2j27L10
2763B58r7j35J6q1N1j2p3n9J96j46R5L90n29J02j46M71k53p6J95Rj93r3K08n25
2787d27Q7M48k31L9L46j99k55k9K99l46K67L30n09K99P7j39j49QJ53Q1q9J22j91
$$ plain form
2810 -8 84 -196 -85 -56 237 -175 -45 57 -206 140 -133 153 4 190 -63 -236 -66 223 108 -23 60 -32
2832 -32 -115 226 16 -8 161 31 -201 8 -18 93 24 -38 -99 -121 302 117 -89 -125 -111 69 -209 183 128 183
2856 183 -145 644 168 45 962 -526 294 -83 -460 -121 -288 227 144 383 -186 -104 243 -113 456 -38
2876 -38 14 107 -52 93 93 -17 -8 -85 123 149 -120 -100 -174 72 22 150 -4 64 35 -36 28 -202 -348 49 -13 94
2902 94 -18 44 -39 -25 -76 107 -204 -64 -3 -131 -356 34 -60 -38 -66 113 -44 224 352 114 -72 -105 -7 -61
2926 -61 -77 -178 -7 -120 39 -217 83 -6 15 -97 -19 -161 58 -37 89 155 -112 189 38 -122 46 -128
2948 -128 -160 33 206 -272 6 -4 -89 291 4 -115 268 40 39 41 11 -24 -214 -71 -85 -73 60 -63 -27 -349
2972 -349 -122 57 -2 -15 -211 -53 41 -272 29 0 204 167 -87 25 74 151 153 -19 -108 -70 27 -198 -29 69
$$ packed form
2810hR2k80J11K9K93m12J30J02k63L46k73K86j49J86k53j73J70K89j15j31Q3r2
2832c2q3L41k10k4J69j30k32K09k6J11o9o2o1k2M23j85k06l6J4J80k78L92n5N5
2856A83l28P89m76j23R17j488Q20l77l77L39j67N15q3K39n69Q2L47l56N69m94
2876c8N2R3j59J45%j10Rp7K08K6k69K0p4K46n0J28j54O8k9p1O4k30j46L97o2J07
2902I4j12O2q3J4n1J83l11J40O1j28k25L90r4K2k8J79j57K68J28k38j86l3R8n4
2926f1j6j01J71j13J59k56L00q9K1j12P8j42K19r5J26O6k67L01j51j60J68j74
2948a28l2J93J73m78K78j0q5L80k87j19L83k28jKl0l5j90J43j4J2J33j23L6l22
2972c49K27J79n9j3j96J58R4l13L01k9K04l7k54J12M9P7Kj72q9L8R7k25J69R8
$$ plain form
2996 69 -246 160 97 -226 -20 53 130 145 -67 128 -1 38 136 100 -100 -27 -236 81 -142 -71 32 72 -72 -10
3020 -10 158 -34 170 101 -55 27 42 180 134 -201 186 -67 -271 91 -229 39 -116 809 -199 -170 -270 -16
3042 -16 134 86 150 237 -298 162 -44 -264 412 362 60 -216 506 252 217 194 -528 196 -5 342 289 -110 -456
3065 -456 15 85 -148 -116 43 19 73 116 21 -181 23 185 20 98 -101 9 83 84 70 104 11 -18 97 -28 -34
3090 -34 183 -88 -15 275 45 184 -32 -209 -80 39 -183 79 -94 199 -120 35 -68 157 -119 66 83
3111 83 4 -5 85 84 -183 23 119 7 8 79 -140 -64 52 120 -140 51 -62 -67 54 134 136 -18 -122 26 182 72
3137 72 -131 53 47 -153 -24 -6 -39 152 195 -82 206 123 -50 -259 -123 41 112 6 168 39 133 -170 -111
3160 -111 102 -53 -18 -108 114 29 -107 -241 122 -143 -108 -175 222 2 31 -134 -150 -111 38 107 77 -12 54 -21
$$ packed form
2996F9l15M06o3l23K06P3P7J5k12J95j29L9R8l6k00P3k09L17k23P1J03M0j44O2
3020a0J68j92K04o9j56Q2J5J38m6l35L87k53k04L62l20K68j55R25j008K9j00K54
3042a6J50m8O4Q7n35M60k06k20O76n0l02k76P22k54l5k3p22P24k01L47n3l99l46
3065d56M71P0k33L2J59k4N4M3r5k02K04J62j65P8j99J10P4Jj4L4r3k9J15j25o
3090c4K17k71P3K90k30J39k16j77J29J19k22K62j73K93l19J55j03K25k76J85J7
3111H3p9rR0jk67K06R6j12JP1k19P6J16O8k60J91j13nJ21Q0Kj54j04J48J56j10
3137G2k03J84ok00J29J8l3J91M3k77K88q3j73k09J36J64P1j06J62j29R4l03N9
3160a11K13j55L5r0K22q5j36j34L63k65L5o7L97k20K9j65j6L9J49O9l0q9O6p5
$$ plain form
3184 -21 20 70 58 -43 72 -192 358 -237 -103 158 -68 227 -222 185 91 108 -19 87 -183 9 -116 96
3206 96 -33 -60 139 51 -43 -100 12 61 -40 -127 95 221 129 -115 -79 56 45 4 -82 -23 -100 -182 211 -197 -347
3231 -347 -22 -37 -13 -86 48 111 60 -159 285 -596 72 340 -155 657 100 -13 47 216 -71 -543 60 -728
3253 -728 -286 -248 253 450 -14 -276 -241 124 -163 292 -462 -70 -405 -371 -97 -179 53 -164 -22 -23 -171 17
3275 17 -50 -153 89 179 86 -99 -127 -43 142 -108 -57 -85 75 -217 -101 -181 202 -65 -186 -111 -260 -137 -285
3298 -285 -84 21 -78 -50 -145 136 -48 -207 60 92 101 18 105 92 -77 -74 -100 136 -112 -42 -66 -89 -208 -132 -101 12
3324 12 -219 61 169 -28 208 -210 158 -74 300 -76 82 40 40 72 209 15 -106 -175 -241 -23 211 5
3346 5 -25 46 -1 40 144 190 20 265 5 294 69 56 -214 -31 124 303 119 309 -87 -45 -143 -70 62 30
$$ packed form
3184b1M1N0j2j01J15k64N50n95J34K61k26K95m49M07r4J7j27J06k70J92j25K12
3206I6j29k7J99q8r4n7J12M9j01q7K22J26r2k44L6J35j1m1q6N9p7q2L93m08j50
3231c47L25j5K4p3J34O3n1k19M44q81O68K68m95Q12n57j13O0J69k87m72O03p88
3253g28M42L8N01J97m64k62L5L65k87M55p54L92l35L4K74q2K32k17J42jj48J88
3275A7o7j03K42R0r3j85k8Q4J85k50N1k8J60k92J16q0L83k67j21P5j49J23j48
3298b85K01J05r9K8r5K81j84j59K67L2Rq3Q7j3j69Lk6K36k48P0k4k3j19P6L1J13
3324A2k31K80J08j97K36m18L68k32L74l76J58m2%L2J37j94j21o9o6K18K34k06
3346El0P1m7M1J04M6j70K45k60K89k25j3k70J83J55J79j84J90l96M2r8P3J32l2
$$ plain form
3370 30 -73 135 -51 103 202 -300 47 90 -66 -217 113 173 260 99 -39 -167 311 31 -126 -83 -195 -90
3392 -90 77 67 43 79 -174 -42 -54 -68 -40 266 -188 27 -25 -75 -185 235 -40 -163 336 439 265 -985 -629
3415 -629 -497 -6 -138 302 -168 62 84 -116 -13 -20 -67 35 54 147 155 -66 -111 -11 121 212 -75 -42 -5 16
3439 16 -97 22 -124 -160 -109 -54 -57 -83 82 -105 403 -681 -315 379 188 374 4 -17 -155 114 26 -12 -43
3462 -43 -76 6 218 -14 -7 -34 -127 24 -135 18 -100 105 103 -17 -3 26 35 -83 -33 -67 33 74 -108 179 -70
3487 -70 -150 -42 -94 -147 212 -109 121 -53 131 -51 -41 4 12 -7 -91 -37 85 150 34 -47 18 -123 63 101 -116
3512 -116 52 -221 370 62 -311 -337 340 -98 85 185 14 22 349 -209 703 210 411 260 -432 -186 -89
3533 -89 185 81 -6 -218 -170 370 224 -43 -57 189 -142 83 -78 -15 -12 -162 -159 -35 192 -176 133 97 -79
$$ packed form
3370C0j03K08j86J54R9n02L47M3j56j51L30O0Q7j61j38j28M78k80j57M3j12J05
3392i0J67j0k4L6k53J32j2j4K8L06m54K15n2n0j10M20k75j23M99J03j74j250L56
3415f29J32M91j32M40m70K30K2k00J03pm7J02J9R3Qk21m5J00J32R1k87L3L7K1
3439A6j13J19j46l6N1N5lk6J65j87N08j084L66O94j91J86l70k1j38K69q8l8l1
3462d3l3Q2K12k32Pk7r3J51j59J53j18K05kj20J4K9Rj18N0l4J00M1j82K87k49
3487g0q0J08n2n3L59l21K30j74J84j82J0M5Qj9q4N4J22O5j16q1O5j41J86L8k17
3512a16J68k73N91l08l73k6O77m38J83J00j71QL27n58R12m93K01j51o92K46R7
3533h9K74j04q7k12M8N40j46k67j4K46l31K25j61O3Lj50LJ24K27l68L09l6j76
$$ plain form
3556 -79 -177 43 -126 -7 -6 -74 207 46 193 305 30 -109 52 29 0 -168 -61 -119 -85 9 95 20 54 28 -203
3581 -203 -196 73 205 -244 -271 -390 286 174 -376 -81 -102 -410 -194 -92 115 9 -123 -85 -21 -186 -20 -365
3603 -365 -139 -266 -4 708 -844 407 34 -100 6 -164 -183 364 149 310 -453 -79 433 -173 -228 -662
3623 -662 -373 125 -49 164 -276 171 167 -81 -478 -89 -831 11 9 54 -252 -17 182 40 -182 -75 242 52
3645 52 251 461 -323 -235 -78 161 -209 114 -147 105 -64 -150 154 -291 115 -3 395 -247 -698 70 500
3666 500 -142 -57 -529 265 666 208 365 177 359 273 -163 292 -486 -129 -208 551 14 307 310 -302 749
3687 749 -321 -135 -170 252 -423 840 22 -101 453 -428 -183 -584 -19 12 354 234 -519 -159 148 453
3707 453 -138 -48 -867 220 -432 -582 -64 -263 369 -252 -223 695 -309 397 305 -4 -767 713 -850 -643
$$ packed form
3556g9r8K20j69J19Jo8K81j61J47J12k75j39J61k3k9j68J07n8L4R4Q6p5L4k6k31
3581b03PK69J32m49k7j19O76j12n50K95k1l08K16J02K07j06j32L8O4j65J66l45
3603c65K26j27K62P12j552J251l73j34J06j70j9N47k15J61p63L74N12o06n5m34
3623f62K89M98j74K13m40M47mk48l97L89p42Q42kM5l06K35J99j42k22J07L17j90
3645E2J99K10p84Q8J57K39l70L23k61K52j69q6L04m45M06j18L98o42m51P68M30
3666E00o42Q5m72P94M01m58J57j88J82q6m36M55p78L57p9P59n37K93Lo12J051
3687G49j070J86l5M22o75J263q18j23N54q81K45m01N65L1L42j20p53L60L07L05
3707D53n91R0q19J087o52j50N18j99O32o21K9R18j004P06r2l09p63J480j563K07
$$ plain form
3727 -643 282 115 68 -400 667 785 493 63 -110 -872 77 -931 349 -261 -170 -98 365 -625 12 -775
3747 -775 -39 137 -186 56 99 169 480 426 -333 -23 129 447 -231 350 -133 186 394 197 236 -265 137
3768 137 -243 -44 -89 138 -609 -174 -59 -134 -23 -23 -211 15 -133 -45 -83 -35 -92 -2 -121 -194 147 60 29 -101
3792 -101 -88 119 -7 1 168 -161 54 105 29 -43 68 -57 14 -40 -82 105 129 -141 53 194 55 33 64 -4
3816 -4 -218 104 -96 -138 -166 59 106 32 -20 91 -211 93 -4 108 68 -89 -76 -93 17 35 164 154 -204 -118 180
3841 180 -27 282 -76 -103 132 -202 -34 197 -38 89 -148 50 106 100 96 -83 34 66 -49 -96 274 1 -239
3864 -239 34 -89 -79 -36 -98 66 -151 -206 6 223 1 -103 278 4 -41 -113 38 138 -192 -117 -98 -162 38
3887 38 56 -44 59 -57 -234 145 -107 27 130 46 -21 -12 -165 -139 18 51 -123 -43 171 -99 -20 -79 -330 -7
$$ packed form
3727f43R25j67m7m68J067J18k92m30j73p62R49j008J280o10R1P2M63r90O37p87
3747g75P36J76l23K42M3P0L11n4p59L10J52L18o78N81m83L19K08j97L9n01M02
3768A37l80J99m5K27p47M35J15p5J11%j88K26j48Q8l8M8n7R0j19p3L41q7l1j30
3792a01J3K07j26QJ67l29K15N1p6p2J11j25P1n4m2J87K4k70J94J41j39k2L1o8
3816dk14L22k00m2k8K25M7p4n2J11l02L04r7J12m0j57J3j7J10J8J29j0l58Q6K98
3841A80k07L09l58k7K35l34J68K31k35J27k37J98N6omj79J17L2j15m7L70k73k40
3864b39K73j23J0M3o2J64k17n5K12K17k22j04L81k74m5p2J51J00l30P5J9o4K00
3887C8J8j00J03j16j77L79k52J34J03q4o7Rj53K6J57L3j74Q0K14k70P9n9k51L23
$$ plain form
3911 -7 28 84 143 -87 115 19 91 148 -62 -16 -86 123 -89 -129 -98 -149 145 129 120 3 53 -83 -233 -287 -115 -128
3937 -128 71 348 -162 299 122 -168 -153 -255 -120 -199 15 416 72 -15 67 -96 -225 73 -54 -20 -55 41
3959 41 139 50 50 -21 1 222 -4 -123 10 -46 -161 1 118 -154 124 136 -193 13 -93 -84 47 -8 -156 -152 -115
3984 -115 -140 -73 -49 -19 -157 -94 -83 -38 -295 -154 -117 -94 -79 70 -142 8 -60 -24 -39 -56 -75 -51 193 166 -117 3
4010 3 -68 -213 -88 -252 -9 -140 36 -77 114 -86 -103 -66 124 150 -260 25 -64 -167 105 87 160 -27 -314
4033 -314 122 145 -81 -54 5 89 -130 -185 -51 75 180 67 185 139 -128 28 -228 -144 9 222 -97 -9 123
4056 123 -35 9 140 130 -41 70 -203 -68 74 151 17 40 58 -96 -67 57 -139 109 207 -92 35 143
4078 143 -149 177 66 25 -153 -99 -22 49 59 -10 52 91 -22 -119 -89 -61 209 -62 275 90 -111 -14 152 127
$$ packed form
3911gL5N6N9k30K02r6P2N7k10M6p0K09k12m0L1n1K94j6rj17N0j36j50n4J72j3
3937a28J99K77n10M61j77k90J5j02J35p9K14M01l44q7Q2j63j29K98j27L4l5R6
3959D1R8q9%p1K2K21k26j19J33n6j15J62J17k72K78J2l29K06j06RJ31n5j48ML7
3984a15k5O7K4L0j38O3J1M5k57J41L7K3J5J49k12J50o8L6j5j7j9K4K44k7k83J20
4010Cp1j45J25j64K43j31J76j13J91k00j7L7J90K6m10K85q9j03K72j8P3j87k87
4033c14M36K3k26K7N9Q4k19n5J34J26J05j13J18m6k67J56k56Q4J53K13l19Q8J32
4056A23j58M4J31j0j71J11k73J35J42P7j34K3J8j54K9J24j96K48R8k99J27J08
4078A43k92L26j11m1j78N4P7P1J0o9O2L9j13r7L0K8K70k71L37j85k01R7J66k5
$$ plain form
4102 127 274 -28 252 -147 -46 179 -81 76 -34 -78 176 -278 98 -15 -41 98 140 -250 32 -48 162
4123 162 127 -55 104 83 76 -49 -190 17 146 35 -171 414 204 8 253 -54 456 381 183 -2 258 1
4145 1 79 74 211 298 80 154 -313 214 189 -308 -191 -69 230 242 286 309 -405 -593 158 283 132 140 289 -175
4169 -175 -21 -45 -291 -24 79 -396 -26 63 -100 -212 -136 -151 -146 81 -12 -38 -212 277 -142 12 -64 329 52
4192 52 60 -83 61 -259 184 34 129 -35 224 -106 -84 65 87 -1 119 142 -74 -81 -205 -186 44 -25 -327 56
4216 56 -69 6 -12 75 37 115 -147 77 -193 146 -81 -149 -45 8 51 -38 -63 29 306 53 -4 -121 83 -12 -56
4241 -56 76 47 96 -58 -66 12 31 240 106 -120 -198 -68 -36 52 -42 144 71 247 -71 176 168 51 -184 90 -26
4266 -26 19 -7 -35 -85 -50 325 465 162 -427 -362 -210 712 -221 -222 -409 -259 -118 208 96 235 -318 372 490
$$ packed form
4102A27J47l02K80l99J01K25k60J57j10m4K54m54L76j13k6J39M2l90K82q0K10
4123A62l5j82J59k1pj25j41K07J29j11k06N85k10j96K45l07N10p5j98j85K60k57
4145AP8nJ37Q7k18P4m67N27k5m97J17J22K99J2M4K3p14j88P51J25j51QJ49m64
4169a75J54k4k46K67J03m75L70Q9j63j12P6j5NK27r3k6j74M89m19J54p6L93k77
4192E2Qj43J44l20M43j50R5j64K59l30K2J49K2q8J20K3k16pj24J9K30o9l02L83
4216E6j25P5j8Q7l8P8k62K24k70L39k27o8J04N3M3q9k5R2K77k53n7j17K04r5m4
4241e6J32k9M9j54qP8J9K09j34k26p8J30L2Q8r4J86p3J76l18K47qj17k35K74j16
4266b6M5k6k8n0L5L75J40l03n89O5J52R22r33jj87J50J41L26j12J39n53O90J18
$$ plain form
4289 490 -304 378 360 565 -763 -36 -29 -148 92 429 191 156 -173 -55 -170 247 195 -172 196 74 74 138
4311 138 -204 417 26 69 49 336 107 -151 63 -247 467 -669 -472 223 -41 -244 270 168 199 75 28
4332 28 -375 -74 -17 -21 -148 -138 183 203 105 91 -10 51 109 -45 194 76 -79 -28 77 172 4 -16 351 86
4356 86 -287 -157 -62 32 -8 -32 -373 -556 -49 -261 341 -157 -160 -36 -174 -39 -366 -136 170 -50 106 -44
4378 -44 -136 282 -183 -101 89 -140 42 150 79 -287 65 115 68 58 343 -37 -142 -266 -279 17 -262 84 -50
4401 -50 -424 76 -290 -155 465 48 -9 -57 149 -374 26 242 -140 352 262 -67 -343 -483 -431 -290 -593 -262
4423 -262 1065 206 -101 289 99 -246 21 -82 -836 -510 296 304 -165 -383 -432 -74 247 -274 -182 213 -255
4444 -255 82 92 -19 128 -33 -79 -103 45 -4 196 190 112 333 -203 -37 -30 25 -95 -70 119 -85 -129 155 90
$$ packed form
4289D90p94O82j8K05j328P27Pj19K40L37k38l5l29J18j15M17n2l67L68j22%O4
4311A38l42O21l91M3k0K87k29k58K14l10P14j136J97O95k64k03N14j02L1j24m7
4332B8m03L01N7mj27J0L21K0r8j4j01O1N8j54K39j18j55N1J05R5j68k0L67k65
4356H6l73J30R5R4m0k4l41j83N07k12O02m98lJ24j38J35l27K30L06k20J56j50
4378d4r2M18m65Q2J90k29J82J08p1l66L52N0m7j0K85l80j05j24j3K96k79L46j34
4401e0l74N00l66J35O20m17n7m8K06n23M00K16l82M92r0l29k76j40N2J41l03L31
4423b62J327q59l07L90j90l45K67j03p54L26Q06Qm69k18m9L58L21n21R2L95m68
4444b55L37J0j11J47j61m6k4J48m9K00op8K21n36J66PN5j20K5J89k04m4K84o5
$$ plain form
4468 90 -211 -16 28 -98 207 -131 49 -124 -146 235 0 -94 23 -48 -217 48 -108 123 -234 -111 192 -240
4490 -240 45 194 328 -40 -96 53 80 40 14 139 75 -25 -131 41 6 -62 30 31 -138 113 -123 128 -61
4513 -61 56 -201 114 -234 -75 40 89 -85 -244 -140 -77 -37 77 36 145 -94 4 -157 -105 -44 133 137 -139
4536 -139 -45 126 95 -70 132 -149 126 -38 -26 -83 270 59 97 -128 -217 84 217 117 -51 39 -64 39
4558 39 51 -50 197 96 226 -38 -117 45 -185 10 -60 -20 20 28 -154 -68 -52 -115 58 -119 -80 91 86 145 35
4583 35 51 133 -68 101 -209 -58 -82 -192 36 -12 297 162 -89 284 -37 2 -371 -17 -85 -164 -87 -83 -82 -123 22
4608 22 25 51 63 112 -160 -28 60 -159 -22 78 -82 8 88 74 -290 401 222 220 107 -90 32 -124 193 132
4632 132 75 -60 70 102 -213 -105 -43 94 -169 -372 -51 -15 239 -10 -214 -147 3 110 -32 133 39 -180
$$ packed form
4468I0l01J95M4j26L05l38J80j73k2L81k35r4J17p1j69K65j56K31l57J23L03m32
4490b40K85J49J34l68n6J49K7m0k6J25o4j00j06J72l5o8R2Jj69K51k36K51j89
4513f1J17k57L15l48J59J15M9j74j59J04O3M0J14m1J09k39R8j61N2O1J77Mk76
4536a39R4J71l1j65K02k81K75j64J2n7L53k11L8k25q9L01J33j00j68R0j03J03
4558C9J2j01K47j01J30k64p9J62k30J95p0M0M0Qj82Q6J6o3J73j77L9J71nN9j10
4583C5J6Q2k01J69l10J51k4j10K28m8L09j35k51L73l21L9l73L54o8p9P7MJm1J45
4608B2LK6J2M9k72J32Q8k19J37J00j60R0Q0j4l64O91j79kj13j97J22j56L17o1
4632A32n7j35J30L2l15J08O2J37k63k03L21L6K54k49k04O7J50J07j42J65r4k19
$$ plain form
4654 -180 126 -28 58 29 101 -60 -281 -119 7 73 300 97 -43 -141 62 -20 17 136 -76 184 109 176 105
4677 105 34 210 42 -9 20 -60 -128 -31 -144 -216 -21 -106 -118 -16 -137 173 98 116 -97 -167 -89 287 -82 -117 -111
4702 -111 85 132 56 -37 87 -60 -103 305 -34 -158 -115 93 -124 -70 121 -187 -92 -44 -348 -23 119 -51 117
4725 117 -203 -3 -85 -61 58 106 156 -48 14 -73 77 17 30 -77 -16 237 62 -40 -8 -94 114 146 50 -204
4749 -204 -117 35 -197 108 -47 96 -14 169 -76 -174 -71 -164 296 -6 -82 71 -79 81 286 255 -153 -219
4771 -219 17 -111 -172 -23 -77 -34 -67 143 -15 168 -13 83 -30 100 242 -163 142 193 -13 -362 -64 -71 -33
4794 -33 -22 96 -216 -63 100 91 161 101 -40 -80 191 -109 -66 -144 213 68 34 -71 158 119 175 8 161 -19
4818 -19 -215 32 132 -329 -49 -322 166 264 165 146 149 -190 -186 -92 -115 -527 21 -49 -218 10 -290 388 148 -127
$$ packed form
4654a80L06j54Q6k9P2j61k21J62J26O6K27k03j40r8K03q2L7J19k12K60p5O7p1
4677A05p1J76j68n1K9q0o8R7j13p2J95q5j2J02j21L10p5J8k13p0P8L76l69l5O
4702a11J96M7p6r3J24j47m3M08l39j24M3K08k17N4J91l08R5M8l04L25J42j70J68
4725A17l20K00q2K4J19M8N0k04O2q7J50o0J3j07O1K53j75j02L2q6K08L2r6k54
4749b04Q7J52k32L05j55J43j10J83k45r8J03r3M60l02p6J53j50J60K05l1m08o6
4771b19K36j28o1J49n4M3l3K10j58J83j81R6j13J30J42m05L05N1k06l49K98pL8
4794c3J1J18l12J53J63rP0o0j41m0K71l00M3p8L57j45l4j05K29l9N6j67J53j80
4818a9j96K47J00m61K80k73M88R8r9j9Ll39MR4k3m12N48p0j69K28l00O78k40k75
$$ plain form
4842 -127 -71 -962 211 -624 -354 -275 -104 249 -237 59 -150 -902 847 -67 -389 483 -93 -73 -52 -8 378
4863 378 -82 219 -87 96 163 46 51 -74 -354 75 28 224 -105 45 57 -60 308 133 63 -15 22 222 72
4886 72 -20 -27 36 38 202 -178 -52 -30 -155 -315 -60 33 77 104 208 8 -59 -34 51 -11 -14 -82 31 135 -68 -350
4912 -350 -103 56 -32 -89 -476 -26 -208 -92 23 -6 103 -253 67 -4 -81 65 126 -44 33 152 251 35 -149
4935 -149 -179 217 48 2 97 109 -4 29 -43 4 -74 128 -54 99 -43 -263 -67 10 107 -33 -38 110 25 20 -60
4960 -60 129 -138 -31 146 -39 -12 142 -67 65 -82 180 -109 115 85 182 131 279 236 24 -93 -40 69
4982 69 -20 161 -27 -166 -39 187 8 -110 -60 -94 -35 -114 131 -117 -324 127 -164 75 26 64 -18 -288 43
5005 43 33 -216 -2 -138 -105 -202 74 -186 138 182 122 48 51 -140 130 132 -99 129 -71 333 26 199 53 -100
$$ packed form
4842a27N6q91J173q35K70P9J71L53m86K96k09p52J749r14l22Q72n76K0K1M4L86
4863C78m60L01l06J83O7j17Nj25k80M29m7J96l29J50J2j17L68j75p0p8L7K00j50
4886G2r2pO3KJ64l80J26K2j25j60K55R3M4K7J04k00o7K5Q5o2lo8J13J04k03k82
4912c50K47J59q8n7l87M50j82J16J15k9J09l56L20p1p7J46O1j70P7J19R9k16j84
4935a49l0L96j69m6R5J2j13L3p2M7p8K02j82J53j42k20J96P7R7j40nJ48q5nq0
4960f0J89k67J07J77j85K7J54k09J32j47K62k89K24l0R7n1J48m3k12j17N3J09
4982F9q9J81j88j39J27K26j79j18N0l4N9p9K45k48k07M51k91K39m9L8q2k70L31
5005D3j0k49K14j36L3r7K76k60L24M4o0p4Lj91K70Kk31K28k00M04l07J73j46j53
$$ plain form
5029 -100 -313 52 144 187 48 9 -55 88 43 37 -92 -31 116 -73 -50 -74 -57 -75 104 -385 114 -94 129 -67
5053 -67 6 -72 19 -11 -69 -108 61 -59 -110 230 54 25 -215 -18 -128 29 -25 255 -21 197 134 324 -107 38
5077 38 59 -305 35 -105 30 -194 -216 122 86 2 -292 270 109 149 -18 -64 -73 -59 226 38 172 -197 -148 201
5101 201 -16 107 258 -158 155 49 43 38 39 -70 -20 82 -269 12 -132 -233 -94 146 60 -150 69 37 3
5124 3 15 -123 108 84 -201 -126 246 -107 153 -70 -152 46 84 -35 23 57 -1 241 -235 -67 95 103 17 26 -103
5149 -103 -46 49 224 -288 -79 -38 331 -103 5 -164 93 -177 -223 85 143 -18 -391 397 -114 -329 215 -220
5171 -220 -247 40 42 99 179 -226 87 29 -3 7 38 135 499 -278 149 -4 -53 148 -270 -256 147 -28 -82 77
5195 77 -431 241 -274 -89 -203 -7 101 300 -522 583 -412 -172 -655 401 36 -143 -221 -293 -29 137
$$ packed form
5029a00k13L65R2M3j39l9o4J43m5oj29O1J47j89K3k4J7j8J79m89M99k08K23j96
5053f7P3p8R1l0n8l9J69j20n1L40j76k9k40J97j10J57n4K80k76K18o3J90m31J45
5077C8K1l64L40j40J35k24k2L38l6q4k94N62j61M0j67m6rJ4K85j88J34l69M9L49
5101B01k17J23J51m16L13j06onJj09N0J02l51K81j44j01J39K40q6k10K19l2l4
5124CJ2j38K31k4k85P5L72l53K60k23q2J98L8j19N8L4n8K42m76J68J62Qq6Rj29
5149a03N7R5J75n12K09M1L69m34J08j69K57k70m6L08N8j61l73P88n11k15N44m35
5171b20k7K87KN7Q0m05L13n8l2J0L1R7L64p77M27j53m9K01m18J4M03j75n4J59
5195G7n08O72n15J85j14J96J08J99q22J105r95K40m83J056l65j79p8p2K64J66
$$ plain form
5215 137 -321 -348 350 178 183 262 -111 -405 -102 394 385 309 -501 97 -790 -412 302 162 73 -133 -439 -445 169
5238 169 -629 -292 340 306 382 331 -173 -265 -77 -101 -129 55 -284 133 126 159 -489 -290 -57 109 206 -258 -326 5
5262 5 26 87 497 -36 117 225 -100 -66 79 91 -215 -98 101 145 291 -679 93 8 45 108 -243 11 28 111
5286 111 -185 3 -121 82 53 51 187 -74 -39 -24 4 166 63 -8 -108 -39 109 173 -108 -43 -14 -174 278 122
5310 122 -33 -222 -113 150 59 231 38 -15 39 -153 -189 2 -52 -16 208 60 -60 -11 40 -101 -198 137 -31
5333 -31 -26 361 31 110 -95 -31 -43 99 -100 -70 -21 -17 66 60 59 -100 -107 -6 -168 -66 79 -166 153 -4 23 -1
5359 -1 -64 58 -163 -68 71 -35 66 87 -177 54 -158 8 14 41 308 -23 -13 7 216 -30 -105 130 68 -127
5383 -127 -247 -15 204 81 50 34 149 -359 242 -9 8 178 179 -205 38 -40 -180 -52 174 256 -277 -3
$$ packed form
5215A37m58k7O98j72NP9l73k94L03M96rp6q10N98q87L78P14j40q9k06l06oO14
5238A69p98L37O32l4P6n1n04r2J88k4k8J84l39M17pL3o48J99K33J66R7m64o8L31
5262EK1O1M10n33J53J08l25L4J45J2l06J17J99M4J46r70P72q5L7O3l51K54J7Q3
5286A11k96J88j24K03k9kJ36k61L5J5K8J62j03p1j00O9J48O4k81O5K9j60M52j56
5310A22j55j89J09K63r1J72j93n3N4j92l6J91n4L6K24j48j20M9N1j41r7L35j68
5333c1NL87l30P9k05O4j2J42j99L0M9MQ3ojj59pJ01j62J02J45k45L19j57K7k4
5359ao3J22k21R5J39j06J01K1k64K31k12J66OK7K67l31J0K0K09k46p5K35o2j95
5383a27j20K32K19j23l1j6J15n08O01k51J7J70Jl84K43p8j40J28K26Q2n33K74
$$ plain form
5405 -3 -185 16 -171 -20 63 55 139 -180 74 203 241 299 317 -64 112 -66 -111 -77 19 58 26 68 -104 170 -253
5430 -253 -141 50 19 211 81 -59 114 20 132 32 -130 165 40 -50 -40 -105 96 120 -292 -45 -88 -39 -67
5453 -67 63 -153 116 -82 -53 133 -59 -33 13 -151 -199 61 152 -225 -76 -21 -170 -124 -185 23 -126 -18 127
5476 127 -104 -256 -93 -32 177 -7 -265 -22 126 -144 8 -118 131 151 41 -122 -58 -100 -291 -18 276
5497 276 -172 -184 181 -176 -58 22 -47 -161 137 -67 63 -34 -118 -51 -52 89 -189 -23 -15 218 -4 93 -148 -18
5521 -18 -192 91 115 -123 112 -83 141 -39 180 183 -87 -38 100 -52 3 106 -134 -67 -9 -82 -226 -45 -74
5544 -74 1 -82 221 116 -18 -111 -144 -445 -33 99 -82 -248 -148 140 -95 -114 78 48 134 -62 -4 177 75
5567 75 574 -134 85 -73 52 40 130 351 8 -59 123 -89 99 100 183 138 12 81 -274 25 -248 100 64
$$ packed form
5405cj82K01j87J51Q3qQ4l19K54J29L8N8J8l81J76j78m5L4R6L9l2M2j72K74m23
5430b53J12J91l1J92j30j40J73r4J12j00j62K95j25r0J0o5K01K4m12K47m3M9k8
5453f7J30k16K69j98K9J86j92K6M6j64m8K60R1l77J49N5j49M6o1K08j49J08J45
5476A27k31j52J63O1K09j84k58K43J48k70J52j26K49K0j10j63O4m2j91K73K94
5497B76m48j2L65l57J18Q0o9j14K98k04J30r7q4O7jJ41k78J66QK33k22R7k41J30
5521a8j74K83K4k38K35j95K24j80K19Lk70M9J38j52N5J03k40O7N8p3j44J81k9
5544g4P5q3L03j05j34r3l3l01M12J32j81j66J00K88k35j9J92l0Q6j96N8J81j02
5567G5M99p08K19j58J25j2R0K21l43o7J82k12J88JQ3m5j26O9l55K99k73L48l6
$$ plain form
5590 64 -152 60 -145 66 -101 -11 -78 99 152 203 53 157 162 -148 -296 17 -137 341 -67 -137 -51 -236 156
5613 156 -417 87 57 44 181 187 -359 -155 -145 380 22 -219 15 -33 -5 211 400 293 333 250 220 22 -30 -211
5637 -211 39 -15 -356 8 -299 -212 96 151 101 484 -506 628 135 128 462 -425 -506 -196 434 -82 -53 -91 -115
5660 -115 183 119 184 -95 -326 6 -171 -104 -203 185 -130 10 -198 -99 -66 -37 144 -31 67 61 -169 -5 178
5683 178 -4 -109 273 -185 34 -135 -11 24 -133 -340 -38 66 256 -77 -282 72 52 317 -59 -135 -115
5704 -115 150 5 -280 138 0 -52 159 99 -228 130 5 -158 -244 75 -88 157 114 -40 62 32 -97 66
5726 66 158 -257 -14 -16 127 37 -43 -121 305 98 112 -27 -144 -69 -95 113 -70 78 1 -57 -19 234 -64 -222
5750 -222 -299 -37 -43 167 46 -82 37 183 127 -241 -89 -72 -92 -296 -16 22 226 -182 -5 -56 -152 43 150
$$ packed form
5590F4k16K12k05K11j67R0o7J77N3N1j50J04Nl10j48L13j54M78m08p0Q6j85L92
5613A56n73N04l0j3J37On46K04J0N25l58k41K34m8K8K16J89j07M0q3l0j98n2j81
5637b11K50n4l41L64l07Q7L08N5n0L83r90J134m93pL34q87q1L10O30n16K9l8k4
5660a15K98o4O5k79k31L32j77O7r9L88l15J40k08R9L3K9J81j75R8ok30J64J83
5683A78j82j05L82m58K19j69J24L5j57k07L02J04J90l33k05L54k0K65l76p6K0
5704a15K65j45k85M18j38n2K11o0l27L58j25j63q6L19j63K45m3j54J02l0j29J63
5726F6R2m15K43kJ43r0q0p8M26k07J4j39j17P5k6K08j83J48p7n8L8K53k98j58
5750b22p7K62oK10j21j28J19J46n6l68J52J7k0k04K80L8K04m08J77n1r6J95J07
$$ plain form
5773 150 -80 -239 -377 760 -17 93 -31 -433 132 13 -114 -295 313 262 -118 -814 -5 324 74 -183
5793 -183 58 7 237 -108 -159 207 106 429 -38 3 242 108 337 165 227 -94 436 77 -538 127 105 119
5815 119 -84 93 330 -228 -152 279 -116 216 322 190 -23 86 -93 -143 -16 94 260 181 200 439 -247
5836 -247 -219 562 356 -119 -424 -258 -222 -229 167 225 -160 127 -196 503 -453 -514 128 215 -135 587 17 142
5858 142 34 185 80 341 -497 574 492 -216 110 -883 244 310 -80 794 610 55 -177 -826 49 434
5878 434 -322 -23 614 -235 65 -326 302 -43 711 14 6 185 631 -123 -204 13 -345 52 -29 254 292 172
5900 172 146 -48 614 185 144 390 270 -245 -85 102 -126 -126 153 -85 10 -177 -265 150 24 160 9 118
5922 118 63 -94 77 -11 215 -96 -243 60 -76 104 266 -115 -52 -27 -17 43 -24 149 189 148 -159 181 -5
$$ packed form
5773A50k30j59j38J137p77J10j24m02N65j19j27j81O08n1l80o96Q09L29k50k57
5793a83K41n1K30l45n1L66j01L23m67M1K39j34K29j72O2l21N30l59o15O65k2J4
5815A19k03J77K37n58P6M31l95L32J06j32k13J09j79n0J27J10J66p9J9K39o86
5836b47K8P81k06m75l05J66L6pL96N8l85K87l23O99r56o1O42Q7l50P22n70J25
5858A42j08J51j05K61q38J071q2p08L26r93J127O6l90Q74j84n55k32o49Q75L85
5878D34p56K99O37q49L00l91O28l45P54o97qJ79M46p54q1K17l58L97q1K83L8j20
5900A72k6j94O62m29m1K46j20n15J60J87k28%K79k38R5j87q8M15j26J36j51J09
5922A18n5j57J71q8K26l11j47L03j36J80J62l81O3K5J0O0o7J73M0m1l07L40j86
$$ plain form
5945 -5 -40 -46 -100 172 -49 -152 -81 182 -42 50 -70 178 -220 -288 123 261 -45 -86 -34 88 17 -138 28 308
5969 308 -77 378 -86 -204 80 -188 274 276 37 12 -84 -38 -30 185 -89 -288 772 -172 -263 -57 302 63
5991 63 392 -52 196 -648 -177 244 41 -390 174 -355 45 -106 249 150 -103 619 -362 77 -111 -384 449
6012 449 435 -295 679 -579 -551 -301 743 395 23 -193 -113 -266 -1022 95 -583 0 -252 -252 226 195 -27
6033 -27 37 182 -2 64 143 -338 -288 -124 213 -143 359 -136 -132 -186 -156 230 -236 151 -359 -69 -185 563 -251
6056 -251 493 -312 -6 201 -469 -76 -27 95 -203 228 -40 -346 -11 -266 176 -509 38 -203 127 -130
6076 -130 -71 98 112 -14 -35 236 109 149 -245 -170 -234 -71 -33 144 105 71 -284 -30 -67 149 18 12 161 17
6100 17 98 -98 -157 123 33 57 -38 150 61 37 -84 78 131 -140 0 -57 309 263 104 -75 -201 -36 -209 248
$$ packed form
5945el5on4K72k21j03P1K63k24R2j20K48l98o8M11J38l06m1N2J22p1j55J66K80
5969C08l85M55m64j18K84k68M62Kk39k5r6M6QK15k74j99J060r44r1K06L59k39
5991F3L29m44K48q44M71M21k03m31N64n29M00j51L55r9k53P22r81M39j88k73Q33
6012D49j4p30R74j258K8K50J044l48l72k16Q0j53p56J117o78N83k52%M78l1k22
6033b7O4J45j84O6P9m81N0J64L37l56N02m95Mn4L0L86m66L87n10K90j16P48q14
6056b51P44q05L06K07o70L93M9J22k98M31k68l06L35k55M42o85N47k41L30k57
6076a30N9J69J4j26k1K71j27M0l94P5o4J63L8J77l9l4l55K54l7K16j31oJ49j44
6100A7Q1j96n9K80r0K4r5J88q9k4j21J62N3k71J40n7L66m6j59j79j26J65j73M57
$$ plain form
6124 248 50 -44 -325 -75 336 -77 106 12 207 121 178 40 -293 -33 259 160 50 86 -112 90 6 74 70
6147 70 -169 68 43 -181 109 61 -41 126 -110 -88 91 -11 48 32 -5 -72 -219 95 45 -130 128 -222 -71
6170 -71 -189 85 -165 -289 -13 8 -37 52 227 -4 -118 -18 -32 124 32 -187 74 -117 159 20 -175 147
6192 147 -164 205 -152 34 129 -115 79 10 106 -8 205 -78 -202 -63 -56 -74 -22 81 -136 -263 -116 -72 -4
6215 -4 166 363 85 -70 19 51 325 -17 30 77 -21 -57 214 -77 216 53 -188 -40 -87 -36 106 -231 -181 -76
$$ packed form
6124B48j98r4k81K50M11m13J83r4J95q6N7j38l33K60K92r9j10L6j98K02q4O8m
6147G0k39K37k5k24K90m8j02J67k36K2J79j02N9j6l7o7j47L14n0j75K58l50J51
6170g1j18K74k50j24K76K1m5Q9J75k31j14J00j4J56r2k19K61j91K76j39j95L22
6192A47l11L69l57J86R5k44J94o9R6j14K13k83j24J39Pj8N2J03k17j27J47M4O8
6215dJ70J97k78j55Q9L2K74l42M7M7r8l6K71k91K93j63k41J48m7N1J42l37N0J05
$$ [...]
8191G3
##END NTUPLES=NMR FID
##END=
