##TITLE=1H_SR31_Kr
 CDCl3,8 sc, 
 3.02.2021
##JCAMPDX= 6.0         $$ Bruker NMR JCAMP-DX V2.0
##DATA TYPE= NMR FID
##DATA CLASS= NTUPLES
##ORIGIN= UXNMR, Bruker Analytische Messtechnik GmbH
##OWNER= root
$$ XWIN-NMR		Version 3.5
$$ Wed Feb  3 10:05:20 2021 Russian Standard Time (UT+4h)  she@DPX200
##.OBSERVE FREQUENCY= 200.1315066352
##.OBSERVE NUCLEUS= ^1H
##.DELAY= (6, 6)
##.ACQUISITION MODE= SIMULTANEOUS
##.ACQUISITION SCHEME= undefined
##.AVERAGES= 8
##.DIGITISER RES= 18
##SPECTROMETER/DATA SYSTEM= spect
##.PULSE SEQUENCE= zg30
##.SOLVENT NAME= CDCl3
##.SHIFT REFERENCE= (INTERNAL, CDCl3, 0, 15.7039)
##AUDIT TRAIL= $$ (NUMBER, WHEN, WHO, WHERE, WHAT)
$$ ##TITLE= Audit trail, XWIN-NMR		Version 3.5
$$ ##JCAMPDX= 5.01
$$ ##ORIGIN= Bruker BioSpin GmbH
$$ ##OWNER= she
$$ F:/spectra/data/she/nmr/H-F/1/audita.txt
$$ ##AUDIT TRAIL=  $$ (NUMBER, WHEN, WHO, WHERE, WHAT)
(   1,<2021-02-03 10:04:27.04 +0400>,<she>,<DPX200>,
      <created by zg, POWCHK disabled, PULCHK disabled
       configuration hash MD5:
       00 E9 B6 7A A2 85 ED C7 34 08 36 98 17 FE 4E 26
       data hash MD5: 16K
       7F 97 0E 3F 32 A0 3D ED D5 E4 EA 48 32 17 91 67>)
$$ ##END=
$$ 
$$ hash MD5
$$ FF C9 A3 42 FD 41 D6 ED DB 62 A0 74 D9 0E A2 33
##$RELAX= 
##$RELAX= 
##$RELAX= 
##$RELAX= 
##$RELAX= 
##$RELAX= 
$$ Bruker specific parameters
$$ --------------------------
##$DU= <F:/spectra>
##$EXPNO= 1
##$NAME= <H-F>
##$PROCNO= 1
##$TYPE= <nmr>
##$USER= <she>
##$AMP= (0..31)
100 100 100 100 100 100 100 100 100 100 100 100 100 100 100 100 100 100 
100 100 100 100 100 100 100 100 100 100 100 100 100 100 
##$AQSEQ= 0
##$AQ_mod= 1
##$AUNM= <au_zg>
##$AUTOPOS= <>
##$BF1= 200.13
##$BF2= 200.13
##$BF3= 200.13
##$BF4= 200.13
##$BF5= 200.13
##$BF6= 200.13
##$BF7= 200.13
##$BF8= 200.13
##$BYTORDA= 1
##$CFDGTYP= 0
##$CFRGTYP= 5
##$CHEMSTR= <none>
##$CNST= (0..31)
1 1 145 1 1 1 1 1 1 1 1 1 1 1 1 1 1 1 1 1 1 1 1 1 1 1 1 1 1 1 1 1 
##$CPDPRG= <>
##$CPDPRG1= <>
##$CPDPRG2= <>
##$CPDPRG3= <>
##$CPDPRG4= <mlev>
##$CPDPRG5= <mlev>
##$CPDPRG6= <mlev>
##$CPDPRG7= <mlev>
##$CPDPRG8= <mlev>
##$CPDPRGB= <>
##$CPDPRGT= <>
##$D= (0..31)
0 1.2 0 0 0 0 0 0 0 0.06 0 0.03 0 0 0 0 0.0002 0 0 0 0 0 0 0 0 0 0 0 0 
0 0 0 
##$DATE= 1612332266
##$DBL= (0..7)
120 120 120 120 120 120 120 120 
##$DBP= (0..7)
150 150 150 150 150 150 150 150 
##$DBP07= 0
##$DBPNAM0= <>
##$DBPNAM1= <>
##$DBPNAM2= <>
##$DBPNAM3= <>
##$DBPNAM4= <>
##$DBPNAM5= <>
##$DBPNAM6= <>
##$DBPNAM7= <>
##$DBPOAL= (0..7)
0.5 0.5 0.5 0.5 0.5 0.5 0.5 0.5 
##$DBPOFFS= (0..7)
0 0 0 0 0 0 0 0 
##$DE= 6
##$DECBNUC= <off>
##$DECIM= 32
##$DECNUC= <off>
##$DECSTAT= 4
##$DIGMOD= 1
##$DIGTYP= 9
##$DL= (0..7)
0 120 120 120 120 120 120 120 
##$DP= (0..7)
150 150 150 150 150 150 150 150 
##$DP07= 0
##$DPNAME0= <>
##$DPNAME1= <>
##$DPNAME2= <>
##$DPNAME3= <>
##$DPNAME4= <>
##$DPNAME5= <>
##$DPNAME6= <>
##$DPNAME7= <>
##$DPOAL= (0..7)
0.5 0.5 0.5 0.5 0.5 0.5 0.5 0.5 
##$DPOFFS= (0..7)
0 0 0 0 0 0 0 0 
##$DQDMODE= 0
##$DR= 18
##$DS= 0
##$DSLIST= <SSSSSSSSSSSSSSS>
$$ [...]
##$SUBNAM2= <"">
##$SUBNAM3= <"">
##$SUBNAM4= <"">
##$SUBNAM5= <"">
##$SUBNAM6= <"">
##$SUBNAM7= <"">
##$SUBNAM8= <"">
##$SUBNAM9= <"">
##$SW= 16.9725356469052
##$SWIBOX= (0..15)
0 0 2 0 0 0 0 0 0 0 0 0 0 0 0 0 
##$SW_h= 3396.73913043478
##$TD= 16384
##$TD0= 1
##$TE= 0
##$TE2= 300
##$TE3= 300
##$TEG= 300
##$TL= (0..7)
0 120 120 120 120 120 120 120 
##$TP= (0..7)
150 150 150 150 150 150 150 150 
##$TP07= 0
##$TPNAME0= <>
##$TPNAME1= <>
##$TPNAME2= <>
##$TPNAME3= <>
##$TPNAME4= <>
##$TPNAME5= <>
##$TPNAME6= <>
##$TPNAME7= <>
##$TPOAL= (0..7)
0.5 0.5 0.5 0.5 0.5 0.5 0.5 0.5 
##$TPOFFS= (0..7)
0 0 0 0 0 0 0 0 
##$TUNHIN= 0
##$TUNHOUT= 0
##$TUNXOUT= 0
##$USERA1= <user>
##$USERA2= <user>
##$USERA3= <user>
##$USERA4= <user>
##$USERA5= <user>
##$V9= 5
##$VALIST= <valist>
##$VCLIST= <CCCCCCCCCCCCCCC>
##$VD= 0
##$VDLIST= <DDDDDDDDDDDDDDD>
##$VPLIST= <PPPPPPPPPPPPPPP>
##$VTLIST= <TTTTTTTTTTTTTTT>
##$WBST= 1024
##$WBSW= 4
##$XGAIN= (0..3)
0 0 0 0 
##$XL= 0
##$YL= 0
##$YMAX_a= 50740
##$YMIN_a= -25014
##$ZGOPTNS= <>
##$ZL1= 120
##$ZL2= 120
##$ZL3= 120
##$ZL4= 120
##$ABSF1= 10
##$ABSF2= 0
##$ABSG= 5
##$ABSL= 3
##$ALPHA= 0
##$AQORDER= 0
##$ASSFAC= 0
##$ASSFACI= 0
##$ASSFACX= 0
##$ASSWID= 0
##$AUNMP= <proc_1d>
##$AZFE= 0.1
##$AZFW= 0.1
##$BCFW= 1
##$BC_mod= 2
##$BYTORDP= 1
##$COROFFS= 0
##$CY= 11.3945322036743
##$DATMOD= 1
##$DC= 2
##$DFILT= <>
##$DTYPP= 0
##$F1P= 15.9154993809931
##$F2P= -4.1035820241983
##$FCOR= 0.5
##$FTSIZE= 0
##$FT_mod= 4
##$GAMMA= 1
##$GB= 0.15
##$INTBC= 1
##$INTSCL= 1
##$ISEN= 128
##$LB= 0.24
##$LEV0= 0
##$LPBIN= 0
##$MAXI= 10000
##$MC2= 0
##$MEAN= 0
##$ME_mod= 0
##$MI= 1.114404
##$NCOEF= 0
##$NC_proc= 0
##$NLEV= 6
##$NOISF1= 3.799351
##$NOISF2= 2.8
##$NSP= 1
##$NTH_PI= 0
##$NZP= 0
##$OFFSET= 15.70392
##$PC= 1
##$PHC0= -10755.99
##$PHC1= 10.40095
##$PH_mod= 1
##$PKNL= yes
##$PPARMOD= 0
##$PSCAL= 0
##$PSIGN= 0
##$REVERSE= no
##$SF= 200.130013532006
##$SI= 16384
##$SIGF1= 3
##$SIGF2= 2
##$SINO= 400
##$SIOLD= 16384
##$SREGLST= <1H.CDCl3>
##$SSB= 0
##$STSI= 0
##$STSR= 0
##$SW_p= 3612.71676300578
##$SYMM= 0
##$S_DEV= 0
##$TDeff= 0
##$TDoff= 0
##$TI= <>
##$TILT= no
##$TM1= 0
##$TM2= 0
##$TOPLEV= 0
##$USERP1= <user>
##$USERP2= <user>
##$USERP3= <user>
##$USERP4= <user>
##$USERP5= <user>
##$WDW= 1
##$XDIM= 8192
##$YMAX_p= 0
##$YMIN_p= 0
$$ End of Bruker specific parameters
$$ ---------------------------------
##NTUPLES= NMR FID
##VAR_NAME=  TIME,          FID/REAL,        FID/IMAG
##SYMBOL=    X,             R,               I
##VAR_TYPE=  INDEPENDENT,   DEPENDENT,       DEPENDENT
##VAR_FORM=  AFFN,          ASDF,            ASDF
##VAR_DIM=   8192,          8192,            8192
##UNITS=     SECONDS,       ARBITRARY UNITS, ARBITRARY UNITS
##FACTOR=    0.0002944,     1,               1
##FIRST=     0,             0,               0
##LAST=      2.4114304,     0,               0
##MIN=       0,             -25014,          0
##MAX=       2.4114304,     50740,           0
$$ Real data points
##PAGE= N=1
##DATA TABLE= (X++(R..R)), XYDATA
0@%%%%%%%%%%%%%%%%%%pJ5j6J6j6J6k1K9l2L2l9M7n4O2p0P8q7J00j11J23j37J53
40H1j72J92k13K36k61K88l18L50l86M25m67N16n70O28o93P68q53R50j063J195
60F33j354J549j793K114k550L175m149N901r965L5454J8949n4172J8954k8908
74a6162K0939M0525m5918k514N592j8704M7993j7231k7402K6874k3169J2772J8342
87B1937m1088K7156Q687k2861K2934k8253l354M2136k3490L206l61k8017M0123
100A8755L103k5387J4687k6651J2599L0261l3612O754J699j5244L6221j7700k3599
113a8114K2579j5548J5650J1229l7989J4134M554p374K3868k6684o610K5260j7285
126a2330J1886N69k5139K7921j627j4488J4742k0168J0551K3174k2300N974l061
$$ y = [0, 0, 0, 0, 0, 0, 0, 0, 0, 0, 0, 0, 0, 0, 0, 0, 0, 0, 0, -7, 8, -8, 8, -8, 8, -13, 16, -16, 16, -23, 24, -30, 32, -38, 40, -47, 53, -58, 65, -72, 81, -91, 101, -112, 124, -137, 151, -167, 183, -203, 222, -245, 271, -299, 329, -364, 404, -449, 501, -562, 633, -721, 828, -965, 1149, -1401, 1774, -2375, 3526, -6439, 29015, 47964, -6208, 12746, -16162, 4777, 45302, -616, -3130, 2462, -16242, 31751, 14520, -12882, 13992, -9177, 3595, 21937, -19151, 8005, 16692, -6169, 16765, -11488, -14842, 27294, 3804, 7010, 6649, -21368, 18755, 21858, -3529, 11158, -15493, -2894, 27367, -6245, 509, 2208, -13036, 23185, 5485, -18114, 4465, -11083, 4567, 15796, -22193, -8059, -3505, -10879, 12989, -13695, -20305, 4955, -12330, -444, 125, -25014, 2907, 1280, -13208, 1534, -18634, -8083, 15091, -7209, -1235, -4296]
139d296j0785K9628r801j2036J2555j6707J4539J0548k3562J2744o81o835J8581
152A3892j8082m279J6644j1585R680k834j9998J8323j136m524J1410j9220L983
165g726J3420j3795R133l221j0626J7645q205n648R558j0991J0736N610j5685
178i795Q019k571k016J5020j1558l095P231r217J0144Q22j0960J0415l683l028
192d272P899j0640M305O675q731N277m319n872J2028m283j320M027r531N585L888
207G16o583O608l499l152P349o415J146M864m662N610j317n848O091j566R30N265
223E537p062J305K479l607N501q60l053M354l936n0L214l679L380O17m557K109
239A692j760k28M332l038k64K20l621K986Q04j609J985k641q53J582j692J917
$$ y = [-4296, -15081, 14547, 4746, -7290, 5265, -11442, 3097, 13645, -9917, 2827, 2146, -4689, 13892, -4190, -8469, 8175, -3410, 6270, 3436, -16562, 1761, 625, -3899, 7511, -11709, -7726, 5694, -8101, 1032, -2189, -12815, 4830, -3375, -9023, 535, -10456, 280, 5890, -9795, -1776, -4347, -6363, 8657, -2901, -5996, 1235, -7982, 2162, 2984, -7976, 2439, -1244, -4272, 3627, -7013, -2708, 3967, -4764, 513, -3806, -9678, 2350, -1933, -3253, 774, -8757, -3172, 716, -5867, 741, -2758, -5910, 1439, -4976, -3830, 1034, -3628, 1982, 665, -5183, 908, -658, 272, 5537, -1525, -220, 2259, -1348, 4153, 3293, 240, 4594, 658, 608, 3822, 143, 3523, 4140, -417, 1692, -68, -296, 4036, 998, 734, 954, -2667, 319, 1123, -486, 1499, -1142, -1995, -413, -2105, -188]
255a88J062k167J208j674q01K581l30N70k22k393P24J045m83K266o31j418M27
272d24r57P90J419O5M9q62j206Q26M30J039P09j460n73M1j58J464N41l61l54q21
292A97l13J112P52O26o39r28k22j84R28J032L0o69q26n44N32R51M68j50p09j055
312C89j91N94O00N78l54p91r62L60N46N46J32m11j610j35K42N04R98l65p52l72
332d54n04K60R07k6m3j409n07N59l5R78O60j651N2q57m73J680L54n37jj646N52
353b141O00r9J697q51j238R73j096J465J376j485J168l28j615J935J05L32J916
370B714k111k45N49j102K833m05j308J384k564J005K306k270J846l0l507K539
386A634r97j294L496k451M5O45l214K607P31j816K989l759j052L527l300K289
$$ y = [-188, 874, -1293, -85, -1759, -2560, 21, -309, 261, 39, -2354, -1630, -585, -1068, 1198, 567, -851, -424, -1381, -591, 828, 893, 942, 80, -1126, -300, 130, 1169, 1878, 418, -155, -114, -272, 1192, 1733, 1372, 1018, 197, -116, 996, 1748, 2374, 1735, 807, 585, 401, 1329, 2361, 2391, 1722, 896, 352, 884, 1835, 2303, 2153, 1444, 389, 198, 792, 1392, 1970, 1616, 825, -137, 223, 769, 1315, 1447, 1036, -574, -709, -467, 37, 1035, 670, -82, -454, -958, -698, 209, 183, 140, -1269, -1776, -1217, -1252, -274, 386, -1265, -1213, -2070, -2543, -863, -509, -1046, -1047, -2693, -2141, -1541, -1640, 57, -794, -2032, -1059, -2155, -690, 686, -799, 369, 41, -1574, 361, 466, 798, 2714, 603, 358, 907, -195, 2638, 2233, 925, 2309, -255, 750, 3056, 786, 2632, 2602, -905, 1634, 637, -657, 2839, 388, 433, 1078, -2136, 471, 1202, -614, 2375, -1384, -2436, 1091, -2209, 80]
402H0J207l975L350j069k362M082k195R49K672n380K227P62k203N515l517k509
418b366L920l802K774K480n362L887p21l417M677l935M93M626n511J781J03m415
434d788P087j294l272L863n707K840M467n962L238J85m244O857m177j954O137
449C276l816L267N39p813O672L61k568O201p679j13O723o263M752K30o924P211
465D056k315k945M972o563L880M304q622L550j611l039J0130o646l263M390n164
480d886O090J616j0012O493k039j091O633p912Q20P098n838M749l124o801J0386
495B182j529k838M364q490L853P667p925M380l353k608J0376o911k812M955n546
510d235O676J182j1193P603j363m8P433j0614p07O692n128P211k196q899R520
$$ y = [80, 1287, -2688, 662, -407, -2769, 1313, -882, 67, 2739, -2641, -414, 348, -1855, 3660, 143, -2366, 1554, -2248, 526, 3006, -2356, 1531, 810, -2607, 2070, -1865, -1372, 3254, -2257, -476, -373, -4788, 2299, 1005, -2267, 1596, -4111, -1271, 3196, -2766, 472, 657, -3587, 3270, -907, -2861, 3276, -540, 2727, 3266, -4547, 2125, 2486, -82, 6119, -1560, -1673, 5050, -1213, 3539, 3769, -3155, 4056, 1741, -1204, 3768, -2795, 1085, 5389, -3233, 317, -1294, -4333, 5797, -849, -4112, 278, -4886, 1204, 2820, -7192, -699, -2738, -3829, 2804, -5108, -4288, 2810, -3028, 1721, -1403, -8204, 2182, 653, -2185, 2179, -6311, -2458, 5209, -2716, 1664, -1689, -4297, 6079, -832, -3644, 1311, -4235, 2441, 3623, -7570, 33, -1330, -1378, 6055, -4559, -5266, 1426, -3702, 3509, 1313, -7586, 1934]
525A934l036%L736r232N589N932p439M176m574k435J1948n958k385K913p135Q783
541B817K969r161N111m245J201Q387r770M03M400m993P712m521p990R209j971
556d42J784K605j1761N285M916m309M831o765k870R617m999K73K033p632R577
571B143R47p950M442l817J669Q705q592j364L516k948Q364k339p288N962k768
586a318K961L323r566M627L147l121M425n590l040Q954l336L35l11p145P523K342
602D210m535K905n427O76P167n651R44M09l557P548k695n531M673k555L376K914
618D871q221J906K230j101N558n297l264N574k649K474K72o098N359M89k984K964
634B083m504J077N464m347j68m73k854O522j209l382J977l247K549K990m579J345
$$ y = [1934, -1102, -1102, 2634, -6598, -1009, 4923, -2516, 1660, -2914, -5349, 6599, 641, -1744, 1169, -5966, 2817, 5786, -3375, 1736, -2509, -1308, 7079, -2691, -2288, 2112, -2881, 4831, 310, -7680, 1529, -442, 1342, 3947, -7814, -2529, 2387, -1922, 2909, -3856, -6726, 2891, -2108, -1835, 198, -7434, 2143, 3090, -4860, -418, -4235, -2566, 6139, -2453, -3817, -301, -3249, 5115, 2776, -4512, 1450, -1318, 1643, 4966, -4600, 27, 3174, 53, 4478, -1112, -4152, 4802, 1466, 1801, 1490, -5655, 1868, 4210, -325, 2580, -2847, -2171, 4996, -655, 289, 698, -2859, 4689, 1994, -3537, 1136, -1419, 1957, 4871, -3350, -1444, 786, -315, 5243, -54, -3318, 2256, -393, 2081, 2353, -3745, 1614, 2103, -881, 2083, -2421, -1344, 4120, -227, -395, -868, -3722, 2800, 1591, -1791, 186, -3061, -512, 2478, -2101, -756]
650g56O43j751M136l380j324L925k116J969r5m655L292J484p44K345m370K42L337
667B182j934J755m34k438L244j091j477K078j817J436J898l750N04M37o26L301
683C268k014j343J020j313J685P04k341J430p38o02J479j656L74J805j969L56
699A45l45j134K121j72n40K50j947J024J229j381J221n36j192J173r22J10J320
716D24r59L93l14j266R16K14K15N88j216j48K52m61J341r9r51P02p72o4R71j17
736c51mL24o70L2J01O35L98n4n21nn03P84L26J05J2m10n73N69J72pQ21q42j85
759A54n41P37R4K33K02p32k09m7M6L4O02j04o00j94j70L25P07q1n81j55l23N7
781e46N55k8on80j37l3J08P48j39j38m43j23k98L17M58K42k78n47O5J00N39L57
$$ y = [-756, -113, -1864, 2272, -1108, -2432, 1493, -623, 1346, 1251, -3404, -112, 1372, 628, 2973, -1397, -1155, 2182, 248, 2003, 1569, -869, 2375, 1284, -193, 1885, 68, 1504, 3402, -348, 156, 593, -33, 3268, 1254, -89, 931, -382, 1303, 2007, -334, 1096, 358, -244, 1235, -421, -47, 1758, -211, 145, -200, -1334, 787, 615, 75, 325, -1622, -598, 631, -750, 471, -65, -1257, -84, -1006, -896, 424, -535, -142, -456, -1722, -806, -592, -377, 211, -1005, -1153, -901, -1362, -21, -120, -1071, -369, -1141, -1205, -234, -351, -355, -31, -701, -669, -568, 67, 465, 411, -110, -115, -618, 166, 492, 597, 609, 199, -374, 195, 367, 360, 1181, 339, 154, -387, 350, 444, 677, 879, 147, -62, -109, -63, -29, 573, 469, -131, -325, -495, -170, 537, 456, -125, -280, -603, -546, 9, -19, -25, -605, -742, -775, -667, 81, -58, -196, -639, -762, -1060, -743, -285, -43, -321, -868, -803, -703, -164, 193]
803A93N9l56l41l24N26M15M57l91N6n78L34K80M4N55j90j8o40J50N27J19J68j50
825H95n90K27P3j0P51k45n22j59n80N59N47l85N37j095k14N36oR2N11j286K32
846a32J08l82Q47j06n91N72r37o6O22K11K15k50r18K08j99L27R72j196j0K44p91
867a252Q54J74j005J419o14q51N50q58J066O11j119N46j104K35J785p58m8J84
885a85j396J377K45q90J083k17n13J089j410O40J043q79J379j135j173J945q12
902A91N52P19k385J158N33j014J488q75q33J855j421k98O67j084J936j42k190
919a143J370j224N99K051k631K19Q26j489K253j038j544K513j295J04O73k561
935b317K158Q78j629J143j712k91K982j603J82K56k285K729R2k030K092j558Q7
$$ y = [193, 252, -104, -445, -769, -243, 172, 629, 238, 294, -284, 50, 330, 374, 929, 739, 721, 81, 231, 758, 877, 1045, 895, 305, 532, 605, 595, 1346, 1101, 579, 420, -160, 399, 946, 561, 1098, 3, -211, 325, 319, 411, 922, -364, -132, -24, -406, 441, 335, -256, 316, -621, -687, -65, 146, 361, 111, -807, -599, -798, -471, 501, -695, -705, -461, -1252, -398, -224, -1229, 190, -424, -1275, -725, -1583, -517, 94, -1025, -479, -1583, -1348, 437, -321, -369, -185, -1581, -204, 41, -849, 234, 17, -496, 593, -817, -177, 866, -13, 1366, 231, -942, 1003, 191, 743, 1462, -923, 235, 768, -246, 1242, 367, -466, 1389, -32, -330, 337, -747, 1189, 1047, -1143, 227, -997, -398, 1653, -978, -759, 67, -1422, 831, -207, -1751, 762, -533, -429, 244, -2317, -159, 719, -910, 233, -1479, -1770, 1212, -391, -209, 47, -2238, 491, 583, -1447, 645, -913, -826]
952h26K295l228O95J475j382K402j329k078K646j092R84J496m015J666J432j545
968d04J696j643k26K765k333N63L84j905L514m32k411J573j746J064K646l440
984c35P64J35j034L196j788j437K641j876N87Q57l379K323J086j511J718k742
1000g95n21L612k355O70j16k828L084N73k225J554j715P92K069l325Q69Q78j036
1017h15K762j978k273K381r99J721P69l611J726N17q89K316k258n06K480j803
1033d60K61J40k282L365K90k079J411k465J682K666l168N96J71j255K878j038
1049G13j982K488k092J771R99l207J348J002p38J842k902o21L172j355J243j077
1065F04k674K897J72j405R33j742O79K033k508R53k29j128K815j038k537K162
$$ y = [-826, 1469, -1759, -1064, 411, -971, 1431, 102, -1976, 670, -422, 562, 2058, -1957, -291, 1141, -404, 1292, -351, -577, 2188, -145, 418, 802, -1103, 2411, 1979, -432, 1141, -605, 459, 3105, -335, 429, 564, -470, 2726, 938, -499, 2142, 266, 853, 1710, -1669, 654, 1740, 229, 1947, -795, -1316, 2296, -59, 611, 495, -2333, 751, 1324, -901, 653, -1062, -270, 1799, -1526, -657, 221, -815, 1947, -31, -2304, 77, -922, 799, 1568, -2043, -317, 200, -689, 1627, -631, -1137, 1343, -460, -199, -59, -2341, 1024, 1314, -765, 646, -1819, -137, 2529, -639, -43, 128, -1127, 1751, 713, -1269, 1219, -873, 898, 1897, -1310, 38, 1040, 302, 2144, -758, -1379, 1793, 438, 1681, 604, -2070, 827, 999, -406, 527, -1215, -536, 1497, -1011, -58, -287, -1415, 1400, 362, -2175, -13]
1081a3q16J471Q31l148P79K26J40K023k290q50K727j277M13o32j586K132J135
1098A265j882J343k227O59K391j805N71r91j077K483l19j659J517p65O66N94j649
1115h85O51L45k29J654k244J89J001l36J599j036j963J201K92O84j41j059N36
1132B59Q77o55O98j105k81J423p21p19J39l23J090P33j529K95o44K61J405j355
1150a52p64J547r65j8Q33j618J396J96o90L32j060J51J174o31K44m47j168J051
1168e89Q1k86J131j161K67K88p89J089k29n14J025q66m8J67O1M66K28j41K75m31
1188B4k65P83l59m69P35n50L46K86J60k27m8j40J14l14R56p45J13Q9j049Q02j
1209B41O50k4n55l80J25J37K88r1n88P07K4n56O2L40L88q59K64j413Q86m01J380
$$ y = [-13, -829, 642, 1473, -1675, -896, -670, -530, 1493, -797, -1647, 1080, -197, 216, -416, -2002, 130, 1265, -617, 726, -1501, -842, 1549, -256, 315, -676, -1753, 730, 411, -1248, 269, -496, 170, 764, -885, -234, 111, -118, 1536, -708, -519, 482, 146, 1745, 709, -1254, -53, 239, 923, 782, -277, 259, 1136, 481, 1179, 74, -207, 1216, 495, -224, -85, -408, 682, 1415, -114, 181, -463, -202, 1203, -152, -916, 631, -334, -352, 481, -1137, 259, 455, -235, 97, -963, -812, 362, -269, -25, -472, -1640, -589, -508, -794, 337, -824, -557, -269, -1058, 31, -198, -712, 313, -553, -601, -434, -373, 93, 321, 180, 455, 24, -241, 542, 183, -286, 449, -101, 245, 531, 691, 464, 416, 276, 390, 76, 1032, 287, 400, 489, -560, 242, 241, 891, 867, 312, -68, 57, 194, 482, 391, -197, 510, 534, -22, 40, 380, 768, -91, 173, -1240, -354, -755, 625]
1230F25J18n48l11o11M45K16n64R63P0o18o90L98M48o24N82j086L34O0O30k17
1250c80M84n6n22N5j51J0Q64q52J61K59k71L23m1K69J08R6n56k59J33j0M62J47
1272B73J53m84J01L21o9N66k36l51o62Q88j13M62l74m40j90J51K15l1L18k23l86
1293a11Pk01N34j47J45k29j86k01L28m7L63n46l49M42rJ43K10k50L34m83l53N70
1315c6l82K0O42n23l27P63p37P93k50K9l62J60M44l65k42J37J0M70L96o07n90
1336e57O99N42l45m95n74Q87L64j90L78p93k23R89j121N85K52J82J51n56m27N71
1356C19K19m39Q44p55j54K76K24L51k63r29J283j286M61R76j630O72J31j41K69
1375D28p48J96J200q99p43J75o89J420J49j018P91q12O1Q27o84L04O58j489J006
$$ y = [625, 743, 195, -116, -727, -282, -66, -630, 333, 403, -215, -905, -507, -59, -683, -101, -1187, -853, -793, -163, -380, 104, 48, -474, -419, -570, -560, 304, -548, -387, -128, -399, -76, -117, 152, 260, 356, -200, -459, -326, -336, 126, 273, 426, -58, 43, 364, 295, 861, 625, 274, -388, 500, 387, 849, 475, 35, -155, -4, 211, 180, 498, 275, -111, -104, -305, 229, 82, 227, -2, -188, -389, -61, -108, 255, -291, -640, -198, -207, -64, 146, -104, 230, -253, -606, -36, -418, -398, 244, -279, -606, 157, -580, 213, -37, -8, -370, -210, 234, -131, -373, -236, -226, 244, 640, 33, -557, 142, 684, 339, -156, -730, 157, 521, 331, 709, -84, -307, 682, -439, 146, 398, 580, 731, 175, -252, 319, 538, 99, 943, 188, 34, 310, 534, 885, 622, -307, 976, -310, 151, 1127, -503, 169, 300, 159, 428, -320, -124, 1076, 177, -566, -391, -1080, 340, 489, -529, 262, -550, -489, 338, -346, -42, 616, -873, 133]
1394A33q8j053J662p62P88J09j434J25J184p76P59j169j27J818j117R12n03j117
1412f56J718j20j204R28r57L25J350k057Q98m60N22J318m79k249K135j521J314
1429H05Q82k673J692K3j452J900j476o22K175o80K26o19j942K611M19j316P35
1446F88j827k49K882k146P79l70j043J967q18j014O42l39J284pj992J161P49q17
1464d70J282j511r34J456j302K060J48l672L843j268l50J194k680J306J518j510
1480h90J063j52j174K343j915L9R29j519J188J860k237O55L00j209L277k990p71
1497a203J531k68O25K26k168J694j61j50J067k375J605J471k021J670o63k538
1513a658L397j722n92O30j131J185J441k472O38O28l94K054k105p13J274p14J365
$$ y = [133, 45, -1008, 654, -108, 680, 789, -645, -520, 664, -112, 647, -522, -649, 1169, 52, 964, 461, -656, 1062, 942, -262, 666, -291, 34, 1384, -673, 225, -235, 287, 1605, 1126, -1123, 1012, -509, 805, 1687, -986, 706, 729, -723, 1177, -299, -921, 1254, 574, 800, 181, -1761, 850, 1269, -47, 688, -1139, -1388, 1494, -652, 127, -243, -1286, 681, -137, -1151, -509, -848, 436, 429, -1563, -402, 347, -470, 812, -699, -1633, -177, -1479, 581, 729, -2943, 900, -368, -718, 476, -2204, -898, 620, -890, 173, 21, -1153, 1190, -725, -686, 243, -1276, -88, 1772, -465, 190, 490, -719, 2558, -432, -1203, 328, 60, 685, 911, -1257, 437, 276, 126, 1193, -1182, 423, 1894, -127, 1543, 880, -1658, 1739, 17, -575, 55, -1076, 109, 1550, -922, -284, 344, -50, 2004, -101, -814, 460, -254, 1111]
1530A111j671j490K401l35q53K461k230Q7J348j338J329k45k129K642j055q05
1546g72J021j597J025J180j375O77p7j321J993q26o68J167j424J338K64k278K024
1563C51j67m19J136j960R23Q54j311J434m58j086K047j722j88J397j672J622J27
1580I08j657J239o47J2J831j704l22J078j381J527K11j683J090l96l24R71j713
1597i60O99R15j190O28k60q65J468p43j02N41j393J074K55r52O64k86m90J230
1615B33p71J86L08o55Q72l09r64J251k28J56N49j298L99M76p82J014k89n32P07
1634C23k16j00O58q09N00K40j193J075o06n5R32p86q1K49o40Q86Pn16O76n81O
1655c1N97o68L31K32m98L77j10k33Q32o44K93N0n50J74M91n15L11o5l76L02qj72
$$ y = [1111, -560, -2050, 351, 16, -837, 1624, -606, -519, 829, -509, 820, 575, -1554, 1088, 33, -772, 249, -1348, -323, 857, -518, 159, 82, -1239, 754, -72, -740, 427, -997, 341, 605, -1673, 351, 184, -235, 901, -1059, -136, 718, -593, 841, 383, -703, 1344, -378, -566, 831, -841, 781, 908, -749, 490, -157, -145, 1686, -18, -340, 738, -643, 884, 1095, -588, 502, 106, -218, 753, -960, -261, 654, -536, 92, -168, -1033, 435, -308, -410, 131, -1262, -188, 67, -885, -221, -507, -997, 233, -538, -352, -44, -699, 173, -136, -1100, 151, -77, 79, 628, -670, -271, 205, -577, 437, 148, -384, 323, 107, 7, 665, -144, 356, 596, -597, 478, -128, -183, 749, -37, -118, 131, -509, 377, 384, -132, 544, -37, -31, 566, -102, 229, 461, -37, 340, 230, -3, 829, 185, 478, 528, -22, 152, 643, 128, 439, 374, -2, 300, 292, 120]
1677A20L07m74L61n06J2L83k90L8K66o12p7K30j28P10m79j71J79l00j69L60Q6
1698a54J74j62k59J57K8OM29O2j73j14l6J70K88j04p5Kk91L08J34M8O6o7k7k36
1722A74K63Q3k13j1n4n7P4j7L9Q1k48j6q5m1N3j26L58%j40k42K59o9P8J08m29
1747a78J4K26K94k31N7k66K29m9r6J6J33P4k52O8j07M6p6M1j13L4K0j96K15P1
1771b6J50o2l28k5j63K40K68l87nN1j29M3L39q0P0j54q1K32J08o5K96l32K27R8
1795B85l82N67j3j41m3j79q9M28j09L36k40m59K30L15k80J34k19J12K16n63M45
1816C51j22j13L27m28l65N93o32K42N05r37L78K09m23O13m56j75O50p58L42J48
1836e1p20J061j1m66L54p80L02O65q08O19j99p10J015j23m98L87p41N10N34r29
$$ y = [120, 427, -47, 314, -192, -180, 203, -87, -49, 217, -395, -472, -242, -370, 340, -139, -310, -131, -431, -600, -240, -154, 20, -142, -401, -244, -216, -210, 219, 281, 108, -6, -42, 128, 416, 312, 237, 239, -52, 256, 390, 438, 504, 437, 410, 174, 437, 520, 307, 296, 242, 185, 259, 242, 281, 362, 114, 98, 13, -28, 25, -101, 257, 257, 117, -125, 134, 65, 143, 251, -178, -164, 62, 356, 125, 182, -84, 145, 96, 0, 16, 149, 223, -29, 39, -68, -22, -98, -57, -170, -136, -116, -312, -97, -26, 124, 62, -266, -291, -454, -214, 54, -333, -338, -287, -416, -373, -34, -114, -44, -198, -279, -47, 61, -4, 292, -40, 187, 285, -97, 470, 457, 316, 273, 94, 5, 433, 324, 660, 420, -39, 191, 506, 226, 360, 141, 253, 469, -94, 351, 229, 116, 443, 15, -350, 243, -389, -147, 358, -579, -201, 8, -415, 198, -258, -433, 217, -541, -199, -51, -771, 290, 279, -187, 167, -613, -311, 354, -454, 165, -34, -744, 271, 148, -350, 37, -704, -194, 340, -589]
1856e89L59M6m38J383j285k79Q14l03N18N6j383J135n0k55R22j020p4J054q86
1875b75O55l20p66J645o55n58P34r42R29O91j609O52m48m24J993j631kQ43r50
1894d38R40J59j611J233l82O5R52j866K73J209q74J152j176j082K013p49k21R28
1912E25j783R45J059j524Q55q25l85K407j786m46Q38r51J962r6j967J346o69K56
1930b39J719k299J55R82q54J638j114j129K058m49k78N21k086J549J362j809J224
1947I51j371n35K845j470l00M86j636K225p3j895J672j374M41J939k613M82Q92
1964F66j025J846j150j582J878p44N62P03k475J410P74j221J651j855m63K616
1980A591j867O9O50j752K087K57j851J121j226O89J996k394M32J28q14K253j202
$$ y = [-589, -230, -184, -622, 761, -524, -803, 11, -292, 226, 282, -1101, 34, -16, -271, 651, -369, -443, 611, -275, 380, 60, -706, 939, 284, -274, 460, -482, 447, 1138, -471, 181, -267, -691, 1302, -329, -331, 512, -438, 502, 661, -950, 283, -99, -34, 918, -948, -675, 534, -340, 812, -364, -1446, 567, -182, -403, 525, -1258, -313, 746, -778, 77, -748, -1133, 1274, -512, -958, -120, -1071, 891, 795, -1172, 174, -495, -239, 1480, -819, -664, 318, -536, 1102, -12, -1141, 917, 468, 190, 711, -1375, 174, 1536, -273, 951, -420, -955, 1890, 420, 120, 606, -1030, 1195, 1122, -773, 899, -475, -34, 1905, -708, -226, 666, -359, 1487, 337, -1245, 633, -111, 451, 1154, -1321, 89, 863, -358, 1293, -562, -1025, 1591, -276, -207, 443, -1309, 778, 1035, -816, 305, -921, -232, 1764, -630, -198, -70, -884, 1369, 167]
1997A67j450J722r82P05O41k500J547P44j251J556j740l70J872r33L19M04j917
2014a466K309l73r67J061j217O22J472j990O26J65o92J919r75j186J284r52J037
2031F77N54j801O51M48q01J497j433m19J708j336L42M06j402J506p8p21O26j202
2049g78M53J136j364N59j79q63J646o47n51Q24q82N36R01j758R74Pm37J430j641
2068f34K32J127j003P87j5r92R04k68m15Q88j190K26R62j027M07j63n81J313o72
2087a14n12J007r52N05O10j011O76l06l98J138q76L13L88p51O52J07n37O95l86
2106B48j84O26q86M79J11l05M94l04k89N09k86J11M03j010N63K30o99K81j16j84
2126b08O78q99K73J50p81N77Q8l03L26m11K21L02o11K06L38n65K79K30m04N35
$$ y = [167, -1283, 439, -543, 162, 803, -1697, -150, 594, -657, 899, -841, -1211, 661, -272, 47, 451, -1466, 843, 470, -497, 564, -653, -31, 1441, -549, 77, 242, -450, 1469, 494, -692, 592, -360, 677, 1231, -570, 81, 529, -272, 1225, -208, -627, 1081, -255, 87, 493, -909, 597, 519, -202, 424, -778, -325, 811, -553, 6, -173, -1036, 610, -37, -588, 236, -646, -110, 791, -967, 7, 14, -423, 1007, -634, -402, 725, -278, 509, 494, -498, 406, 138, -277, 611, -579, -353, 609, -418, -11, -174, -755, 558, -114, -626, 381, -571, -66, 544, -467, 209, -97, -495, 643, -233, 80, 468, -283, 369, 476, -61, 634, 248, 64, 690, -196, 283, 394, 89, 583, 279, -10, 499, 213, 324, 727, -283, 280, 510, -189, 92, -24, -208, 470, -429, -156, -6, -787, -210, -122, -425, -99, -510, -289, 13, -598, -392, -54, -619, -340, -110, -514, 21]
2146B1l6l52K63n07O57M4p1Q3k62J72J28j31J02P8l54K49p5m22P60l80k07J77
2168f3j82J94K58j42o3J98l47P5J80q6r3n4J92L7l05K96J55n1j32k19M34j41K5
2191A66O8J16l8j96K52m08M43j69r5j05k03K90J2j97J20n6J76k13q9k7O5l1L2
2214h7k23O0j79K10j0P4k45J5J20J17j62K19j10M7O0k8J55m20K33OJ17n0j16L73
2238A76K61j65j16l0j46J60O8l0J86k88r5J99k41R8j01K07J0j30J56k39J08J13
2260A61j70j18J95r3J55K83n90j9L80l03J69J86m79M82l89oL86m38K43J29j94
2281c0j8l86M46J50l05o9J25k87K45n7K2J72l02J8L54o03K36K38k56J07Ll69M62
2304a04j61J68J72n39J67L48m29P93n84J9M09l47J83m7m89Q33q7n76N98n96K21
$$ y = [21, -15, -367, -104, -611, 46, 90, 19, 102, -160, 12, 140, 9, 111, 189, -165, 84, 9, -413, 347, -33, -240, -63, -245, -51, 207, 65, 2, 200, -147, -72, 108, 22, -71, -125, 67, 104, -201, 95, 250, 199, 67, -152, 282, 141, 166, 234, 350, 312, 116, 368, -40, 403, 234, 139, 34, -169, 121, 133, -64, 56, 0, 176, -37, -126, -153, -88, -119, -87, -310, -250, -429, -219, -229, -155, -400, -385, -265, -148, -310, -91, -201, -154, -94, -122, 33, -387, -154, -148, -31, -81, -197, 176, 437, 272, 156, 126, -20, 140, 208, 178, 364, 76, -19, 180, -61, 37, -64, 143, 153, 23, 179, -60, 48, 161, -9, -127, 68, -25, 130, 413, -177, -196, 184, -119, 50, 236, -243, 239, -150, -156, 230, -208, 35, 164, -30, -48, -434, 12, 162, -143, -212, -87, -374, -129, -186, -164, 8, -294, -276, 78, -525, -289, -51, -307, -200, -197, -566, -104, -265, -97, 75, -464, -297, 51, -378, 415, -169, -150, 259, -88, 95, 48, -441, 392, 305, -271, 327, -269, -48]
2325d8O89n96J11M1l89Q00l28l35N37o64M18L45p96M90J35m62O29r17J40Q77q00
2346a23J97j2o65J037J92p32O21j116M51R40j166M66j14j08P65m85o88P64n79
2365c55P23J10j227Q46k78M8N86p54k6Q31p24L40j00j010J386J0o00M86j020O51
2385g7J048j153N26m00o97J772r70p22R37q89J164rj240R23M4k32Q32j242M4P99
2405D58r15J025n42j263J805o24L16M46j544L81J293j091M86n51n19J806j079
2422a12m12M13o32R87M43j543R97k55j34R96j326p7Q95r43J394m41j547J487m09
2441b19j0J004j918N72J335j149P82j062o91J708l38l64K58r59J042O30j096O53
2459A78n93J43J389j629K27N50p81J351j69j408J153k72K23N66j702M70Q56q11
$$ y = [-48, 641, 45, 156, 197, -192, 608, 280, -55, 482, -182, 236, 581, -215, 275, 410, -52, 577, -340, -200, 677, -123, 74, 62, -603, 434, 626, -106, 515, -601, -150, 790, -376, 90, -24, -132, 633, 148, -540, 224, -355, 368, 478, -749, 97, -181, -133, 453, -301, -327, 504, -220, 120, 20, -990, 396, 406, -194, 292, -728, -77, 971, -182, 344, -56, -753, 1019, 49, -673, 264, -625, 539, 530, -710, 213, 257, 25, 857, -385, -341, 458, -457, 568, 26, -1237, 568, -56, 260, 706, -838, -457, 836, -255, 231, -320, -839, 967, -112, -524, -111, -743, 244, 687, -856, 141, -114, -248, 748, -578, -655, 240, -703, 691, 250, -1297, 190, -219, -229, 775, -1143, -571, 764, -385, 397, -665, -1356, 352, 14, -350, -92, -1051, -9, 621, -475, 178, -415, -272, 1117, -512, -285, 265, -516, 835, 666, -742, 411, 139, 362, 928, -774, -304, 552, -259]
2477b59J139q25m32J182o97P4J05j074J226M99j455Q94q84K08J217j102L8K62
2495A16q49J202k3j273J129n07J03P85j606M07J039j106J152j012m62J423m14
2512A04Q6K53j471J002N43q96N00o07j43J250r96L38J54o94Q12L8p08N78n34L25
2532f6N90j008M13J71o97R99l82p03J006m58M47J21r31P21j99l90J083j257M82
2551e8J519j797Q06p65K14M59k55R5K53o42N1J182j532O09J32m08R50j049k91
2570e27Q91k53j04j95l04L77q1Q2L76j68l00M39l37j67p0r99J126L64l71N05q59
2591e75J49J296j036k96J42r4N25R0n66K62j91L35M0p14Q30l50N3J79n89L50N94
2612D34l95k92O95m90j03K92m57M67k50R9n9K32j14Q1j73K20j83k08M42j23N2
$$ y = [-259, 880, 55, -377, 805, 108, 182, 287, -787, 439, 938, -517, 377, -507, -299, 918, -184, -146, 116, -733, 469, 446, -827, 302, -205, -102, 683, -923, -516, 523, -583, 569, -443, -905, 518, 104, 190, 443, -1028, -26, 517, -379, 121, -486, -629, 621, -375, -37, 117, -577, 235, 273, -435, 143, -391, -66, 524, -484, -71, 100, -597, 402, 20, -683, 323, -135, 312, 433, -498, 223, 24, -366, 717, -540, -58, 1461, -336, 470, -295, -81, 378, 123, 218, 471, -171, -120, 1062, -470, 139, 271, -137, 813, -236, -527, 364, 111, 7, -188, -492, -115, -196, -114, 262, 94, -206, 233, -104, -271, -341, -1340, -214, 150, -221, 284, -575, -426, 870, -166, -462, -320, -414, 111, 201, -365, -103, -294, 41, 81, -633, 197, -153, -100, 79, -510, -160, 434, 39, -253, 442, -48, -151, 141, -316, 151, -99, 0, -59, 173, 59, 140, -33, 187, 4, -204, 238, 115, 167]
2633A67L9j18L86m37J2K95k09j81L23j97L07k44j74J52Q0k70O0l89M49Mk67K28
2655A6j01p1J83k5k17K18j62k19K10n2L34j79p9k05J81m5p2J49J17l34Q4n9K24
2678a04k2lP1J03r5j14J33J11m3M8j27O9k86O34l66k6j9J02N6m8n2Nq2J39k62
2703a78O0K10k13J71j15M3J40j6K08k18L2K13l60K9j17J75j9kM2j72j8O4J70j20
2727Ij34J69k57K42J00q9r6J34j13J87l67J53O7o4P6L01n41K12J3l20K09J38m12
2750c83O07m70J89j38j4J68j14N1J35K0k5R3m88M55j15k0Q1j95K5K88j73Q9L09
2773C75l46K59k8q3j16j19J19J83k49K9O8QJ88l30J44PJ7N2J00l29L29l31PL03
2797B57k64L1K43l72L36r6l88L52k11j75L00m26N48R1m17K32m01o7L23J08j40
$$ y = [167, 206, 88, 474, 37, 49, 344, 135, -46, 277, 80, 387, 143, -31, 121, 201, -69, -9, -398, 51, 55, -212, 16, -85, -156, 27, 2, -215, 3, -159, -378, -168, -220, 114, -65, -144, -349, -168, -213, -285, -136, -19, -353, -269, -328, -104, -126, -129, -58, 45, -50, -164, -31, 80, 37, 85, -42, 27, -259, 375, 9, -17, -36, 66, 122, 74, 22, 27, -55, 84, -178, -118, 92, -121, 50, -65, -22, 118, 102, 310, 92, 124, 337, -23, 6, -111, 64, 45, 43, 85, -87, -105, -41, 129, 9, -125, 44, -213, 29, 129, 40, -56, 78, -35, 152, -215, -62, 5, -59, 17, 318, -223, -11, 2, -318, -109, 29, -383, 224, -246, -57, -195, -209, -41, -155, -104, 31, 51, 26, 119, -369, 86, -29, -49, 32, -163, -138, 150, -23, 66, 375, 29, 288, 260, 177, 61, -58, 61, 244, -5, 24, 92, 100, 288, -42, 102, 109, 126, 178, 278, -51, 278, -53, -46, 257, -7, 24, 267, -105, 231, 135, -253, 99, -112, -287, 13, -413, 135, 226, -191, 41, -360, -427, -104, 4, -136]
2818a36M42o68M25M6l07K56l27P1P10p54O3J18l35O36l43l65O01j40r3N25p38
2839c13L32N5K1J90l71k68N66l16K43J34p87Q25J3m59N13m84r3N08l90j04M77
2860B92m41O14k86o60O85l84K42M08n80M7K97n67O82n46m60J001n30K42j1p72
2880g27O63K05m17N95r64L70O51m26J3L6p79J097j04p40L97m14L93Q17j178L79
2900a33J97l1M35n28l51M48l9K95n1j053J078N6l64N63j010L16Q01n89J79k11
2920Hm34J025m04j38J96m60M25O63j276M28O0l27P94m08l35N17o08O98q4o82M58
2941A16O7J3J98n65j48R10m19K24l76p39J145j24l79R5o50N48Q04p90M4k60k7
2962c13P50l39m94P22p18N93J39j035Q70k42L27K60j227K48R27o61R7N70q05P00
$$ y = [-136, 306, -362, 63, 109, -198, 58, -269, -198, 512, -242, -179, -61, -396, 240, -103, -468, 133, -7, -100, 425, -313, 19, 74, 95, 285, -86, -354, 212, -104, 139, 273, -514, 311, 324, -135, 378, -106, -199, 309, -81, -185, 292, -149, 465, 179, -481, 204, -180, 62, 470, -110, -63, 234, -333, 349, -197, -657, 344, -186, 56, 45, -727, -64, 141, -276, 319, -645, -275, 376, -50, -37, -1, -780, 317, 213, -527, -130, -544, -151, 666, -512, -133, 64, 33, 468, -60, -411, 37, -2, 293, 242, -811, 267, 323, -41, 522, -488, -172, 629, 40, 219, 8, -426, 599, 195, 57, 253, -207, 218, 881, -395, 33, 93, -234, 560, 152, -183, 334, -274, 424, 340, -342, 116, 183, 196, 394, -171, -319, 591, 172, 396, 20, -719, 426, 302, -77, 18, -632, -84, 720, -70, -26, -286, -313, 437, 98, -396, 326, -392, 201, 340, -695, 175, -67, 260, 520, -707, -459, 468, -193, -96, 474, -331, 369]
2982C69M08j166J054j747Q3J597j251P77k72QN53k89l66K37l24O22J96p98O33
3001C24l01m6N30m89n3J65l58N72l42o53R27k72k9J59j08l05N83l23J95k99q1
3022b04J15k23K59l0l03L82j00n59O77l34L83J10j33p57K35Q87m69J99r5m08M17
3043D9j11L53l82j24L1J30P7k01m48P67j78o15N33j105J556k15k85K15m34N65
3063A78j73r7j84O90n61M65L19m77m67M08L2q0j06J1L34l1M2j0j10k10K43k71
3085e5J44O6j90k5L9M2J74m54M37l93J33J38l03L18kj16MJ25k95J89J80j20j44
3108a08j03L1M34p08N20j87J07R5m67O21m12M4j84J66K84k17j09mM23k21J01j9
3130H7p7OJ29k59M9k8J44k14p1J44L37j89J19j01J11Qm0n3J08j15k0K41o0j73
$$ y = [369, 777, -389, 665, -1082, -999, 598, -653, 124, -148, -140, 413, 124, -242, -5, -329, 293, 489, -309, 324, 23, -23, 507, 18, -35, 130, -228, 344, 2, -651, 276, 4, -25, 134, 26, -279, 304, -19, 176, -123, -204, -89, -312, -53, -83, -386, -4, -104, -663, 14, -320, 63, 173, 40, -717, -482, 405, -64, 135, 40, -368, 49, -62, 291, -91, -215, -184, -54, 23, -178, -626, 141, -37, -652, -119, -1224, 332, 117, -168, 47, -387, 178, 5, -92, -276, 414, -147, 318, 637, 160, -307, 101, 133, 53, -53, -42, 292, 261, 303, 293, 183, -27, 216, -55, 89, 155, -35, -60, -21, 21, 195, -259, 178, -215, -82, 56, -247, 71, 69, -47, -43, 82, -213, -24, 156, 36, -108, -211, -180, 254, -454, 66, -121, -14, 81, -386, 235, -177, -133, -317, -151, 133, -84, -193, -197, 226, 5, 106, 87, 10, 16, 145, -114, -65, -93, 51, -163, -234, -90, 247, 58, 177, 76, 187, 195, 155, 102, 210, 95, 75, 316, 256, 83]
3154H3MJ33P2l22J26J10j94M7K5o4j08L13q0N3q2J6N6l27L26q2l34K16j06n7J97
3179B1kq5L0J31j7l54P6K61l23J20K4kJ01j27K52j32j85J84K34l11L13k26j7Q
3203b6o0Ml44K45J25P6j3j88K34K0l06J23K29l43J08L62k94k42M74q5J58p1j67
3226A9O4L0j39K47k86k5J62rP5k61J66J72j72j0J96l62K45L2j58j0K94l77j69
3249b76J22K36j96l2J22m0J0J01k60l7J70J32l6J54m31J06J30j78N00l18j57J14
3271f4q6j30M01l67K18J4k3K01j77j3J74k62L41j01n23L95j3j83J32j10K70M7
3293A41j83L2Ql55M52l8m4J17m12M52j5m69L93j28J24M38n13P8P8J05J33k98l70
3316b74J80K57k66L65o26L41M67o68L04q0o28Q72k94j12J12j51L13J28m48K59
$$ y = [83, 87, 220, 292, -30, 96, 206, 12, 59, 84, 20, -88, 225, 145, 198, 116, 132, 188, -139, 187, 105, -229, -13, -119, -176, 21, 19, -66, -36, 95, 78, -276, -200, 61, -262, -142, -118, -120, -19, -146, 106, -26, -211, -27, 207, -104, 209, -17, -34, -26, -86, -82, -426, -181, -56, 20, 7, -181, 53, 73, -233, -110, 119, -224, -116, 246, -48, -290, 184, 99, 257, 186, 19, 83, 113, -26, 221, -65, -90, 72, 63, 138, -123, 43, 215, 43, 33, 229, -133, 112, 144, -14, -24, 270, -107, -276, -154, 82, -114, -146, -24, -64, -54, 47, -213, -250, -80, 52, 16, 170, -261, -155, -25, -203, 297, -21, -178, -64, -150, -280, 121, -246, -28, -14, -37, 164, -13, -26, 148, -114, 227, 126, -397, -2, -15, -198, -66, -176, 94, 141, -42, -10, -2, -357, 95, 57, 13, 130, -282, 170, 155, -314, 79, -49, 75, 513, 0, 78, 156, 261, 394, 96, -274, -94, 163, -103, 262, -364, -23, 444, -224, 80, 0, -628, 244, -50, -162, -50, -201, 112, 240, -208, 51]
3336E1k94j10P87o35k33N44l97L5O12r00N22J1k18K17m42K13M71m08K56l35k08
3357d61O93j83k10J95n44O55M20m86k3J7j00L62o39K57K95k08K56j28l66L60N4
3378B16k66P17q00J01K93j03R0l35l44P50j98j31N0l79M32J67l73K01l97K04P89
3399F84r17L73R8m66M42l02j82K14j80N8N64o34J05L48m52L14k24l59O81j30k49
3420b14M29o20K94J07j54K11J15l22O38p03k29M79l48O19j26m07L10k67J25K45
3440A82o70K80L97j65P2j47k02M47k28J05K45p41J60M47k30K11k11J37P79p35
3460A33k34J87k72M63k8l83M27j56p1K31m12K75r5j62N35o51K02k8q2K33q1n15
3482d84L16K16k36M06l97r0N14k79m4M8m71P84l44j44L50j81Q8J33k56OJ08l44
$$ y = [51, -243, -353, 434, -201, -434, 110, -287, -252, 360, -540, -18, -7, -225, -8, -450, -237, 234, -174, 82, -253, -461, 232, 49, -161, 34, -510, 145, 565, 79, 56, 73, -27, 335, -304, -47, 248, 40, 296, 168, -198, 162, 216, -50, 667, -133, -32, 261, 158, 248, -87, -431, 319, 121, -10, 40, -339, 93, 260, -113, 88, -309, -105, 684, -233, 140, 238, -228, 214, -88, -270, -56, -236, -178, 386, -248, -143, 205, -247, 67, -157, -516, 165, 35, -214, 215, -405, -111, -4, -158, 53, 168, -154, 484, -219, -448, 31, -317, 302, 176, -231, 79, -188, -63, 182, -488, -208, 189, 24, 96, -51, -253, 194, -34, 71, 316, -425, -265, 182, -48, 163, -48, 89, 868, 133, -101, 86, -186, 277, 249, -134, 293, 137, 66, 297, -115, 160, 65, -97, 438, -213, -11, -39, -121, 112, 31, -484, -168, 48, -188, 218, -179, -269, 245, -34, -78, -30, -501, 283, -61, -205, 145, -36, 52, 185, -71, -65, 43, -301]
3504c01N79j61m00L93m3R9J19o60M07J42m28N23m12M1J33o1J52pJ14j09l7k18
3526a35K27n9J82O0k10q2J61j47M21k68j76R6m2O9N2k85K96q9P3J16l80j46K61
3549eJ24K5j28l9p2K20k55J39L7j48J3L3k08L49j66J65k64j2K05j29K3M7j30N9
3573a17K41j31j6kj84L94k12n2L54n13J72L33l14M54l98J23Qj43J52r7J34j99
3595a3R3R3j%k31J69j38p2O2J76r1K78k36j17J36r3J7K55k95R8J4o3Pk56M21k38
3621b5l2LJ36J77j59l52P3n0K22P4j25M8nr2J01n4P4k53L05j34Q2l01M1R3L2J63
3647D2j36RJ83j00J04k34MNJ36k21L3L21J3k49Q3P0j26J88p7j83k6Q1K87k24Q2
3672F5j73L19j77J3o0J4J20r6J6J48k07l0l4p9K49J30j18j57K30k82K57O1j49
$$ y = [-301, 278, 117, -283, 110, 67, 166, 285, -375, 32, 174, -254, 269, -143, -102, 31, -30, 122, 115, 229, 120, 83, -135, 92, 33, 215, 275, 65, -17, 144, -3, 418, 150, -26, 70, 28, 97, 149, -136, 160, 71, 144, 260, -120, -266, -5, 119, 144, 16, -23, -95, 125, -130, 9, 46, -102, -89, -56, -264, 85, -81, 84, -180, -192, 13, -116, -93, -46, -176, -117, 124, -7, -23, -25, -209, 185, -27, -79, 275, -238, -66, 267, -47, 407, 9, 132, 140, -3, 149, 52, 186, -13, 80, 173, 172, 172, -59, 110, -28, -100, -38, 138, 47, 325, 89, -28, 108, 15, 32, 287, -8, 90, 104, 41, 48, -208, 213, -25, -57, -54, 82, 259, 100, -252, -179, -229, -7, 67, -58, -10, -15, -107, -6, -60, 14, -239, 66, -68, 14, -287, -246, -153, -121, 42, -94, -85, 98, -2, 102, -132, -128, -123, 13, -208, -175, 146, 159, -90, -7, 63, -63, 125, 48, -135, -161, -80, 207, -17, 65, -108, 211, 34, 47, -13, 1, 121, 25, 41, 189, -18, -48, -82, -161, 88, 218, 100, -57, 173, -109, 148, 209, 60]
3695F0J17k22n6J82l46J21n3J70o5J18j01P5lj89K42K20k32n3M3k3k00JJ09j54
3719b39N82l93k90N52l4m69L30l5jO9k82K04n4kP6m2J43J2m05M34j19n2K80k37
3743B8j07M44n14J32K16l28K63q4j03J87k72K17J2j18M1K97m31M55n68k05O65
3764B27m82K38J60k96N72l57l20K38qk15M05k89J03K25n12M48k25j06L29j36o7
3785f8K67k95J19o7l12K82l31J95K71l79K04J%pJ89k74L62k49l1K60l38J74M7
3808B0P5K2r9j68K56J7k15J19p1O0J75m31L86l09N0M08m64N22l21j74N36l23k22
3831a51M42l98J76K47k44j90M14j0j90j65k06K80j21q0L87l35K63L73j54l66o9
3852i7q2K13j99N94l02o09J118p88K29qk86K53L72o64K28K92R2m71M77q60J06
$$ y = [60, 177, -45, -101, 81, -265, -144, -197, -27, -92, 26, -75, 0, -3, -192, 50, 270, 38, -15, 28, 5, -195, -194, -85, -239, 343, -50, -340, 212, 178, -291, 39, 4, 3, 72, -210, -6, -60, -62, 14, -28, 115, 127, -278, 156, 37, -15, 265, 28, -79, 365, -149, -17, 199, -129, 134, 50, -53, 134, -138, 79, 91, -27, 14, 311, -120, 335, -233, -438, 227, -255, -17, 143, -153, 419, 62, -258, -20, -28, -243, 162, -127, -24, 201, -311, 137, -88, -194, 135, -1, -68, 199, -96, 23, -44, -356, -74, -405, -210, 61, -318, -114, -113, -113, -120, 69, -205, 157, -92, -123, 137, -201, -27, 20, 95, 117, 18, -150, 106, 123, -92, 27, -44, 16, 191, -240, 146, -163, -113, 295, -169, 353, 32, -142, 394, 71, -151, 291, -107, 69, 316, 72, -118, 296, 286, 96, -69, -275, 5, -116, -196, 191, -144, 119, 492, 338, -28, -97, -179, 34, -165, 429, 127, -482, 636, -152, 77, 69, -217, 36, 408, -256, -28, 264, 356, -115, 362, -498, -392]
3873c92O80n60Q06r26l64J194q60J189j012k30Q01l89q2R33q83L23k41R3R6o28
3893d52M14J65K20o85L1m7J126j281M01K66m45O18J07o52O50l70k85J4M49q19
3913e75Q24o01L94j66j037J018M92k96k42J0k65Q2J04k54K84O4J51k58K15J04
3933D8l29L25K30k37K45m87J06N87m20k88M72k26N8J31o57N43j93L8N2l7j04K17
3955G4p8P9j14p4M83j07l69O7J32qL80n61K89j59p8J77j44J28Q7n30L11L25o43
3978c33O05m39K12K28m58O6J67J36ql31J34q7K85r5J25L32o14K73o71N59j87m70
4000e71J059m46l90K35j71M71j23l87L60j34J81l0k89J37L46o10L36J92m35K00
4020f9Q1j51R6K2j65K06j16Q1Q2k00N19j23j39l3j56J35p0j11L3K74k08o12J033
$$ y = [-392, 288, -272, 534, -392, -756, 438, -422, 767, -245, -475, 326, -63, -145, 788, -95, 228, -13, 80, 176, -452, -38, 127, 347, -338, -307, -354, 772, -509, -108, 158, -287, 331, 438, -214, 436, 66, -219, -205, 244, -575, 249, -352, 42, -124, -1161, -143, 349, 53, -189, -179, -444, -362, -258, -512, -228, -164, -13, -271, -56, 48, -281, 44, 274, 37, 282, -205, -99, 488, 68, -220, 252, 26, 84, 215, -442, 101, -92, -54, -2, -39, -143, 74, -4, 75, -39, -113, 370, 263, -106, -39, 93, 85, 465, -96, 193, 34, -44, 133, -11, 117, 204, -326, -15, 310, -333, 272, -167, 45, 273, -185, -119, 48, 184, 176, -155, -21, -108, 177, 82, 207, 539, -75, 198, -473, 86, -101, -571, 488, 42, -348, -113, -284, 187, 64, -323, 37, -97, 84, 54, -235, -98, 248, -362, -26, 166, -269, -69, 12, -139, -43, -21, -186, 20, -96, -15, 67, -133, 386, 263, 124, 91, -65, 70, 0, -111, -78, 196, -12, -624, 409]
4043D09j51l20k9J05K50j84J56m56L06P1o4K7q1j2K43j49j94K14J70j88J24m29
4065a82L79l08j36K55J86k09K79l23j76J36j16J15K91k20L5J92k12J57o0q0o1
4086e8P9J55l60K04k48K11l4J53j36k8J0qJ39k7l19K92n2j13J18O6O4r3l5k50
4110b70L06P7J30m06J37J23J07j92K00l4j76J59r2j14J24Rk9k20M67k59n4n2J07
4133D8L7j51Q1K00k84k4L9J80P0j46n4j62O0J30l1K44m11M0j9p4L65qk02K24k75
4158a23J37j45j01J90q7J40K87k28k43J56k14J98K37l42K52l8j2j92J22k91L75
4179G8Kj81J49r6Q1n0k8j60M6J00J48k08N5m2j69K65M9L1l47O63m24j12J62Jk84
4204b71K16L9R4J39j72K4J90j80L9p8L6J06l13J25j60L74j3j01k00KnJ4j9L39
$$ y = [409, 258, -62, -91, 14, 264, 80, 236, -220, 86, 157, 93, 120, 39, 27, 270, 121, -73, 141, 311, 123, 247, -182, 197, -111, -247, 8, 194, -15, 264, -59, -235, -99, -215, -100, 191, -29, 6, 198, -14, 143, 83, 3, -58, 21, 176, -184, 20, -228, -17, -51, 102, -34, -62, -52, -60, 79, 52, -267, 25, -27, -140, -22, 44, 108, 15, -20, -270, 36, 113, 243, -163, -26, 97, 204, 12, 212, 178, 2, 161, 69, -45, 79, 88, 59, -161, 306, 47, -7, -59, 48, 85, -66, 15, 215, -69, -93, -54, 126, 196, 50, -4, -166, -106, 24, -7, 237, -174, -134, -153, -227, 138, 130, -72, 152, -123, 14, -131, -232, -42, -129, 11, 298, 70, -173, -17, -231, -33, 204, -138, 114, 76, 64, -128, -6, -297, 78, 80, -101, 48, -48, 33, -17, -45, -205, -159, -59, 89, -119, -64, -106, -275, -10, 39, 70, -277, 386, -38, -150, 12, 13, -271, -55, -16, 78, 217, 45, 69, 259, 79, 118, 40, 76, 182, -131, -6, -166, 208, 195, 94, -106, -104, -109, -95, -114, 225]
4228B25l00rm0K18j51N9J8J02r4J33m99K78L04n74K63J26l20K50P3j02J95l89
4250b34K05J22j63P3R9k22K92q8j78M63n29P0l5j41P24l41M4M1n54M88l10oJn2
4274b31k55L29K70j83K22k39N03r0n65M38q4J09R2l92m42O69J2N21m68m3O8l11
4296g0j10P0N50n69L54m46N01p35J43O33J46q16k85J91O86n55P3N36j063O85j61
4317b42J0j2L95n89L11J77k32K74j35k10P8k6K6P2j68P19p18K70k98J43l13R51
4339D83j000N59l12L1M84q55Q51K11l61l01P02j014J371j043o6M83l94K49M14
4358D92o71J96L15o24M98m33K9M28l65o8N44o43L24K07m98K36o0J17K81m68n3
4379b16L90k98M33l10l65O73n10K82J56m37M0K57m11O13o09K6L94k01kJ06l28
$$ y = [225, -75, -84, -124, 94, -57, 2, 20, 122, 28, 161, -338, -60, 244, -330, -67, 59, -261, -11, 62, -40, 155, -234, -29, 93, -70, 3, 102, -120, 172, 84, -94, 369, -160, -90, -125, -266, 458, 117, 161, 202, -352, 136, -174, -180, -179, -231, -486, -157, 113, -70, 152, -87, 416, 326, -239, 199, 115, 224, 316, -76, -518, 151, 163, 684, 216, 173, 241, -70, -180, -110, 440, -129, 225, -221, 280, -455, -312, 321, 467, -349, -634, -443, 243, -312, -239, 297, -766, -81, -242, -232, -244, 151, -438, -127, 50, -182, 92, -43, -253, -175, -201, -175, -103, -271, 448, -270, 0, -298, -155, -468, 483, -517, 42, -270, -239, 245, -610, 241, 452, 91, -210, 492, -522, 849, -194, -260, 223, -171, 78, 492, -179, 17, 332, -292, 206, -227, -198, 230, -135, -203, 341, -302, 22, 229, -269, -33, -93, 24, 305, -163, -216, 174, -124, 309, -1, -366, 307, -203, 79, 235, -202, -162, 95, -316, 297, -312, -286, 108, -93, -95, 11, -317]
4400c17L20J50j62M17m82m86R55o33k4K03j83Q33k51m27J63j59K06l94J04K06
4420C9Om95N41O5J02L16l18j49l31O12m21O19q16L32n15J76R12j515J235k93o6
4441C6k24N75j136J253m38l88J27n1K18Q5l65M60o01M54p1J06j70j02L68k25K15
4462A26k19J52n48P17n9l04r5N17n66P78n64K96k47J12l47R2p3N42N84j408N28
4483A4o09M22J90j80k68K70N12p92M90N16k74k67K12l91L16m1m25O69p17J91l42
4504e04R70p93R15j50j81r9L48p38k8P48q85L76N16r76R13K82K29q87Q38j098
4524b04p45M56J067J81o73k90N49q1j054M36J61J40M50N59j734O72M02l64L40
4543B68R1Q6o93k07rq29M31J209L94m20p80O14M68q29M66m08k71O75o46L98K11
$$ y = [-317, 3, 153, -9, 408, -74, -560, 395, -238, -262, -59, -242, 591, 340, -87, 76, -83, 123, -271, -167, 39, 45, -450, 91, 156, 258, 574, 256, 107, -224, 388, -33, 586, -230, 102, -413, -237, 675, -840, 395, 102, 36, -188, 387, -749, 504, 66, -322, -195, -246, -28, 57, -308, 152, -449, 5, -66, 40, -130, -232, 136, -89, 126, -93, 59, -489, 228, 169, -135, -230, 287, -279, 499, -65, 231, -16, 96, -251, -159, -232, 310, 894, -514, 14, -595, -173, 17, -163, -431, -161, 351, -441, 49, 565, 291, 24, 236, -155, 161, 120, -305, 364, -353, -162, -504, 466, -327, 588, 438, 257, 158, 506, -232, -260, 488, -397, -21, 495, -481, 432, 714, 943, 56, 894, -204, -949, -493, 574, 755, 82, -208, 341, 260, -794, -358, -197, -57, 393, 952, -782, -110, 292, -72, 268, 359, 445, -248, -455, -464, -1293, -862, 347, 741, 321, -459, 155, 623, -206, 260, -148, -419, 256, -390, 8, 219]
4564B19p5M8N39r38L35l8p28J179l1q89M43j73k05N23J14n52M18n00j97M70Q1
4585D3k6N07j06k03l80O0M72j82O9O4m92M26K67l97n58K77r1J68j74K89J73m32
4607b26K25P8o79P7Q68n08L76o00M1L63R2j12q9nR7k62j26M39j67J98k12L74o34
4630c92O98l82k84j82P39n66N90j33m7K88n16N88k72j57l40O16m54L95m33P5N7
4651a12L23rk04k68R28r08L98p70N69nK81j58n5p31L14R21m94J89n18M57j54m42
4673d48M7M51K27m81K73l7J64o58N84k30m9K04j94K52l31P02o01P5M70r53L78
4694a55k58K69N88j091M7Q4N50m92R60j160R78m95O83j332J108m34q7M53p56P22
4714A82n00J042m85r7m50J54P4j59L65Q61j634k92N61Q0R41j472R20k23o09J004
$$ y = [219, 144, 192, 731, -207, 128, 90, -638, 541, 510, -379, 64, -109, -314, 209, 323, -229, 189, -311, -508, -38, 43, 17, 524, 418, 215, -165, -105, 367, 185, 254, 318, -174, 252, 519, 122, -436, -159, -250, -82, -256, 33, 206, -226, -1, 77, -602, -525, 343, -165, 211, -389, -348, 15, 107, -5, -94, -99, -2, -264, -390, 49, -118, 80, -132, 242, -392, 306, -76, -360, -542, 197, -369, 221, 88, 41, 329, -187, 401, 129, -28, -368, 248, -206, 189, -244, -169, -112, 211, 202, -2, -270, 658, -250, 148, -622, -53, -58, 223, 65, 10, -721, -407, 514, 20, 209, -309, 148, -6, -448, -401, 50, 277, -204, 69, 32, 196, -462, 122, -108, -157, 47, -147, 105, -226, 476, -125, -50, 420, -533, -155, -413, -144, 444, -647, -600, -516, 34, -458, 502, -658, 320, -175, 508, -824, 284, -150, -237, 216, -540, 182, -318, 724, 239, 142, -308, -154, -80, -239, 126, 987, -647, -939, -378, -298, 643, -829, 91, -132, -741, 263]
4734B63n60P5%N13j65l76M78q47P81m32K35J039j756K94J282j702J154r55J079
4753D00l85j85j40QL27j40j32j02L94L4p52P54Q18j339l13Q91q05K04J053l73
4773B17J3m43L24K73l91L72o43J83J11K54J31q4m43P5n9J52J04K7o81J064m52
4794A04m67J31M0M36k23k6m16P94l30M38L06q64k8L47j56m5M8m22J05J09j61J75
4816a05J9J75J13l37j7P2K55n05j85O00J02l80P20r15N63p6j33rK02p49R43M5
4838C98p34N74K44k37m27o83Q84J93N2P8n01l54K69J28Q71l49m49P81J09r92K04
4859E9j279J240l32J05K70m18L61l85j26L40K57l65L16N38j62o89J081j048L89
4878A52j48l67l07Q71k53j44r0O5m21Q3Q19J36ll58n23L67L19m29K79N4j34P0
$$ y = [263, -297, -222, -222, 291, 126, -250, 228, -619, 162, -270, -35, 1004, -752, -458, 824, -878, 276, -679, 400, 15, -170, -310, -302, 25, -115, -247, -349, 45, 79, -673, 81, 899, -440, -753, 138, -667, -463, 590, 217, 230, -213, 111, 384, -7, 365, -278, -95, 16, 270, 401, 317, -126, -51, -110, 42, 146, 173, -508, 556, 104, -363, -232, -192, 244, 21, -5, -421, 373, 43, 481, 787, -77, -105, 242, 86, 41, 89, -333, -228, -119, -280, -105, -86, 89, 202, -135, -152, -80, 175, -330, -515, 85, 187, -193, 527, -388, 175, 99, -34, -43, 159, -590, 353, 398, -336, 238, 482, 245, -182, -865, 19, 212, 264, 342, -159, -513, -244, -116, 755, 406, -43, 738, 847, -145, 59, -1220, 20, -312, -207, 63, -355, 6, -379, -505, -165, 92, -273, 43, 581, 419, -270, 811, -237, 152, 4, -363, -670, 201, -52, -196, -286, -221, -642, -559, 260, 396, 393, 35, -488, -121, 198, -231, 48, 102, -32, 38]
4900C8K1L5J46J85k03r07M25j03P20J21o61K15P17j005L77Mj87N58p28j6j50L80
4922a8N73r22N37n10M1J92M65l48j38l95j44k24k6N91Q31r91P41o37M49M62m06
4943A23L16q00J12R48q35L42n5k93p8N74M2n40L5J62p4o4L39p30L52J10K0Q4j13
4966b3M0R3k37K58Q5l25L55k94j55N07m62J69M0k82K64J44k77M26j26m96Q09n16
4988cm1O04n92k70N17r3o8j11l46L33j84K74n58O33K22j94p3j86L85q65J33j7
5010e00M55P99j335O1Q49m86p81Q67K79K69l21q62L59K36K51j43k40K62K64j61
5030A22j58k55K30J79k2JM3k74J94n1k06J18pJ9R1Q3j63q6K07J48l60J58j5j0
5054a4J76o3l38K62k95r0L15q8Q4J22l07K71k59J82J94l90J78l7R1j73L84l68
$$ y = [38, 59, 94, 240, 425, 222, -685, -260, -363, 357, 478, -183, 32, 749, -256, 121, 125, -62, 496, -232, -248, -398, -18, 555, -367, 170, -340, -299, -107, 358, 10, -128, -523, -667, -891, -917, -326, 505, -486, 255, -382, 67, 529, 123, 439, -361, -249, 699, -136, 206, 151, -142, -220, 354, 396, -144, -109, 53, -21, -85, 254, -476, -124, -14, 6, 90, -23, 17, 110, -127, 131, 216, -109, 246, -48, -203, 304, -158, 11, 51, -231, 33, 177, -100, 326, 200, -296, 513, -3, -44, 560, -32, -302, 215, 122, 54, -57, -403, -70, -254, 20, -538, 95, 317, 123, 50, -136, 249, -616, -483, -500, -45, 754, -581, -520, 329, -157, -938, -71, 208, 477, 156, -706, -347, -111, 140, -3, -243, 19, 283, 122, -36, -291, -61, 118, 96, 97, 140, -134, 60, 9, -197, -79, -86, -67, 24, 107, -56, -142, 65, 213, -147, 11, -4, -14, 162, 99, -239, 23, -272, -362, -47, -135, -51, 71, -236, 35, -224, -42, 152, -238, -60, -97, -6, -179, 205, -163]
5076a63J02o5j24L66j8j37j02Q3R6k44K50J08j56N0m6j9j32M08j33k50K82l21
5098a65K91j48q7K13k00L89j52p0o5m1j06J65J47K64l39j28K46k59K2J30k47J29
5120a1Q7J1K4k30j38L44j26j16J57q4K07j05r1l4J2q9L07m0j42p6L12r9j97L01
5144A84p1k62n4J22j06P6K66j29J7j32J71k04j71J41J98j9J60j31K3o8j96K66
5166H1N2k06k37L87j26J29q1j84K6J10J6l8m7J27J63j90R8j87J8L06l39K04K9
5189A11j55J53J2l27L23l50J81J37J3j19pj6J73j83J4n2K85k67K34l90k7J05m5
5212a97K32j1L6k8j67Q5L6k21K66m4LO1j15J64k22j22K08l8j70n5K21L23m03K0
5236a38J32j6j85K62R3j69J86j45j36LM4K14m6j31J71m5j4M5k87J77J17j55K16
$$ y = [-163, -61, -126, -250, 116, 98, -39, -141, -58, 38, -206, 44, 152, -4, 46, 0, -19, -151, 257, 124, -126, 156, -165, 126, -22, -109, 104, -96, 293, 141, 71, 6, -35, -141, 24, 171, 435, 96, -32, 214, -45, -23, 107, -140, -11, 76, 87, 111, -119, -257, 87, -39, -155, 2, -82, 125, 20, -71, -105, -93, -182, 125, 85, -57, -133, 179, 80, -117, 184, 113, -149, -203, -81, -187, -111, 155, 26, 43, -89, 82, -122, -293, -152, 46, 27, 187, 56, 79, 11, -185, 81, 133, -73, -310, 77, -49, 80, -1, -185, -159, -49, -33, -71, -118, 9, 172, -18, 80, -107, -89, 217, -122, 82, 111, -44, 109, 121, -206, 117, -233, -52, 85, 98, -21, -28, -44, 129, -54, -40, -92, 193, -74, 160, -230, -257, -152, -197, 35, 24, 60, 32, -135, -50, -14, -235, 31, -13, -10, 51, -64, 100, -122, -244, -36, -74, -244, -299, -78, 245, -158, -138, -6, -22, -207, 55, 148, -21, 165, 20, -116, -113, -69, 145, 99, -32, 139, 94, 80, 125, -162, 15, 132, -23, 193]
5259A93m08K1J46m2J82j15l17L91J72k81OK14l24J60K05k69M68m27j86J34rO9
5281a7j07q1L34k05J87k73m9J58%K0R9l4J39j57j07j42M23l84L66K5j88m1n5M5
5305d4m8m3K25J15k73kj52K41l2r5K10j88j27J72P5LK54k02j73J82r2j9J4j04
5329a03M0m3l8L10k20r6K12j27L95j83k34O3k28M15J44k20p7k04j73L90rk7K4
5352A1J37M2n7m6m70N40j18j59R9J00j18K0M1q5O4n7Lj24J97m30M08n7J79j80
5376f0J52m05L06J29j84J36j64O3J55j1m4l75L23m7J07k76J99j47J51l0k2K4l5
5399e5rj04K7m2M00l14NM8J6J25p8O9j63O7kN6q4j34J58j49L04k05R5r3P1O8l54
5426b77K50k96K41L53k38L76n19r5J58J6K03k53L9L43l76K44j98j48J55K93l80
$$ y = [193, -215, -194, -48, -90, 92, -23, -340, 51, 223, -58, -52, 162, -162, -2, 203, -66, 402, -25, -211, -77, -86, -17, -124, -205, 129, -76, 111, -162, -211, -53, -53, -33, 66, 32, 171, 14, -93, -235, 188, -196, 170, 195, 7, -34, -89, -44, -92, -135, 90, 205, -68, -70, -222, 19, -13, -108, 102, -86, -213, -41, 34, 37, 291, 89, -84, 98, 6, -13, 1, -103, -63, -106, -144, 166, -54, -150, 62, -65, 330, 147, -87, -24, -252, 163, 307, 87, 10, -194, -367, 23, 14, -13, 11, 148, 190, 133, 87, -383, 157, 39, -120, -21, 79, -39, -19, 22, -63, 1, -56, -53, -177, 20, -410, -2, -59, 120, -60, 92, -313, -7, 122, -62, 74, -90, -27, 128, 117, 73, -302, 21, -26, 81, -195, 4, -143, 8, -22, -44, -20, -55, -64, -168, -141, -183, 217, -97, -92, -44, -28, 97, 19, 88, -75, -8, -10, 46, -38, -172, -14, -163, 141, -64, 31, -62, 9, 77, -277, -27, -323, -82, 271, 33, 409, -110, -205, -47, -31, 172, -81, -42, 301, -75, 169, -29, -177, -22, 271, -109]
5447a09J14K40j42l49J55J06o0k83J10L60J07l26L40n05L6M6L78k71J98lM25p9
5469D88o17N70n30l06J47M46m79N39K76M1p16J91j46j66qK69j60k15N45k54k31
5490c16N32J93o35K81j75J17J37j98j11Q2L09N6n3j79o0M47k25R5l81j35L68j23
5512B6Mk51J21P5m54J58K59J28n3j82J61l65L89n2K08J87k30k38K2q5L07J49p4
5535B10m15l37N65J27k27j08n9K72R7q4j88M74k80K59K90n55n25K45K4R9P61m66
5557A79k86M46j18K56l02j31J1M70n35K17J33K06r45J101P40j605P1j37j68R94
5577E97j31j018K36J73M33l67L56l61R4N61m61o96M26K18l49O05n37r8l59N85
5597i3j86m23M61M86n42K06N81qM16q1r36K04J46l48n88N13N67n62L70J21l03
$$ y = [-109, 5, 245, 103, -246, -91, 15, -45, -328, -218, 142, 249, -77, 263, -242, -206, -160, 218, -53, 145, 142, 567, 488, -129, 441, -89, -395, -248, 198, -281, 258, 534, 575, -141, 50, -96, -262, -270, -1, -161, -376, 169, -85, -316, 216, 409, -226, 55, -120, -3, 134, -64, -175, -93, 216, 272, 219, 40, -20, 427, 202, 297, -84, -219, 149, 26, 30, -221, -100, -25, -479, -321, -62, 66, 13, -169, -8, -373, 16, -36, 172, 359, 129, -109, -87, -172, 135, 284, 210, -205, -542, 23, 150, -77, -185, -244, 28, 125, 41, -147, 327, 47, 306, 596, 41, -484, -239, -215, -116, 645, 179, -107, 339, 221, 477, 175, 44, 55, 525, -10, 207, 340, 546, -399, 702, 1442, -163, -92, -229, -397, 597, 466, -552, -316, -143, 290, -77, 279, -82, 12, 573, 112, -584, -158, 60, -289, 316, -221, -319, -678, -93, -279, -702, -241, 245, -297, -91, 490, 482, 898, 817, -119, 85, 231, -117, -705, -192, 375, -187, 183, 304, 1]
5618Aj69n9K55O19o53L22l38k24j19O33l24j44j3L25K37k40K43j58M81n85L79
5639D69j008O16Ln48J84m95Q09j09J49L5j76m05J56M17r0K8J83l79O93o6p15K15
5661c4j84J66L02O55o14m04K91j16k18j83kJ96J84j24JK40J43K90j96q85M22K12
5683A42p19M44M46N9p14P9L92m90K86l34K35K49J2J94J22k39k15Q5K93p6o17K51
5705a15K72j50j55p3N29j10m7j94j90J75L26m30j01M08K1n31R9M25l64J85J94
5726A74k71L84k01j56K99p90K27J35L65J98M7o18L72j21K43n37Q0L06k1k01J85
5747I9l72j3N16l15J86j07M9K64m8l19K67j64m4L2m9J05Kj13R7k10OK89k02J39
5771I5Om12K47J73j28K80k02j41L26m33K44L9k18K27k19J16k68L18j37J25k25
$$ y = [1, -168, -227, 28, 647, -6, 316, -22, -246, -365, 268, -56, -200, -213, 112, 349, 109, 352, 194, 675, 90, 469, -539, 77, 80, -468, -284, -779, 30, -79, 70, 105, -71, -476, -320, 97, 7, 35, 218, -161, 532, 466, -249, -34, -218, -52, 250, 905, 291, -113, 178, 62, -156, -339, -341, -145, 39, -85, -84, 156, 299, 589, 393, -492, -70, 142, -577, -133, 313, 372, -342, -263, 129, -361, -75, -409, -174, 75, 87, 281, 403, 164, -51, 34, 327, 251, -366, -115, 157, 7, -148, -221, 308, 198, 151, -43, -233, -58, 268, -162, -263, 145, 166, -365, -266, 159, -205, -20, 174, -97, 287, 86, -70, 229, -561, -334, -199, 166, 364, 411, -207, 165, 44, 287, -250, -170, 136, 115, -86, 99, -273, -286, 230, -85, 101, -6, 43, 307, 259, -60, 207, 43, -1, 31, -18, 87, 89, -24, 73, -137, -131, 158, -44, 95, 101, -311, -64, 109, -19, 261, 59, -82, 244, -189, 55, 94, -124, 103, -116, 0, -268, 50, -87, 38, -187]
5792a87J47J19k81L86n8k86L73l74K49m5j8ok0J79j31k87K52J48l41J55k16K44
5814Bol0lJ58k83L7K77k12J59k05q1L69l04J62K79n39K35J66k43j31j14L06J37
5837A36r9J4n8o3J00Jj4j76J97r4NJ51rk67r2J59L30j81K9K6k70M19k79j26L50
5862A89n1n6q0P4Q8p9J07m1j58j61J60k11L69L2k40J56m2j09R4j30k4J69l96M53
5886A13l6q9p0j27J99j79K60k11J1J70qpln0j25N7k46Q9K19R7j50p3L4K05M8l4
5912I4J37J7m56L62j28k42K64j04k9J49k52Q5l8J17K56j91k36N90m24L56l34N1
5934D4o8M9J13k80M1J12r6m5J59j9J48k20R4j03P3pm3K22K11m26M1m7l3J07%J7
5960D4j9l57L04M6k7J30r8J60k91k03J44K17k7L2j13k37J14J44J12k16K9K48j45
$$ y = [-187, -40, 79, -202, 184, 126, -160, 213, -161, 88, 43, 25, 19, -1, 178, 47, -240, 12, 160, -181, -26, -242, 2, -4, -34, -37, 121, -162, -125, 152, -60, 99, -106, -187, 182, -122, 40, 319, -220, 15, 181, -62, -193, -307, -1, 136, 37, 51, -7, -70, 30, 31, 17, -159, 38, -56, -51, 100, 91, -176, -268, -109, 221, 40, 69, 95, -175, 244, -35, -161, 189, 138, 82, 2, 76, 164, 85, 192, 151, -7, -168, -8, -219, 150, 182, -58, 98, 56, -53, 41, -89, -113, 56, -340, 113, 77, -12, -82, -209, -10, -189, 71, -140, -129, 41, 33, 26, 23, -27, -152, -95, -341, -252, -33, 64, -86, -159, -125, 80, 128, 94, 231, 248, -208, 154, 26, -216, 48, -56, -85, 64, -188, -103, -141, -24, 232, 41, -195, 395, -29, 327, -7, 44, -24, 25, 138, -142, -101, 11, -85, -130, 29, 10, 158, -62, 32, -71, 2, -5, -48, 174, 385, -41, 0, -47, -80, 27, 27, 44, 25, -332, -28, 18, -9, 121, 23, 183, -108, -311, -167, 50, 23, 55, -58, -295, -181, -37, 75, -141, -112, 136, -9]
5983iQ6O5q7R2L9l13K00k32K61j95K3L80r0m49L85k83K9J5K37j45R6J00j45j20
6007f0J23p8J79k64N0j0J31OJ26j28k31K09JP7m6J01j86j20o1K00j09K6J20k34
6031a78K87l56K58k11J13j04K45k1r3p4L10k03m4J47k30K45j67J95J16m06P5k4
6053a20K8J82k36K77j60J93l01J42J00k7M7l54J10J18nk2R3N5J44l57K37j20J54
6076A78k45J38j50J73k57J56K09k06J07j26k7K28j78j17M6k9l4m6J41J16j62k44
6098c29M69Q8k40J72j08J27k17q0O7o7Q0J17j83J56j3n4J24l56L86O4k00J07J04
6121B14l39L65n86L93j3j12k0K02Pk16m1M08k81L8o3J11Kp9o5o9K39o8Q7k60R6
6146e0k9J6n4K90k65K60j05o9n2k0J65J23l25k4N2M20m01J26N5L0J06l97M05n3
$$ y = [-9, 77, 142, 55, 147, 186, -127, 73, -159, 102, -93, -70, 310, 220, -229, 156, -127, -98, -83, 154, 9, 105, 205, 60, -60, 63, -15, 164, -100, -50, -60, 71, 77, 203, 75, -156, 53, 54, 131, 85, 186, 0, -120, -181, 19, -90, -64, 56, -178, 109, -247, 11, -200, -87, -191, 54, 33, -60, -134, 176, -27, -71, 76, -154, 91, -76, 119, 235, -171, -96, -120, -92, 90, -146, 131, -29, 164, -137, 5, 105, 78, 125, -229, -119, -1, -6, -28, 65, 120, 264, -93, 144, 24, 178, -67, 71, -79, 94, -163, -7, 202, -4, 103, -23, -50, 178, 0, -117, -71, -100, -134, -180, -39, 77, -85, -329, 140, 228, -12, 160, 52, 179, -38, -118, -51, -118, -38, 79, -104, 52, 39, -15, 109, -247, 139, 203, 3, 110, 214, -125, 240, -346, 47, 34, -78, -98, 104, 111, -105, -146, 262, -19, 19, -44, 67, 69, -10, -75, -144, 95, 27, 114, -146, -50, -79, -63, -117, 173, -92, 168, 63, -6, -58, -78, 87, 210, -115, -139, -87, 333, -68, 58, 113, 143, 249, -148, 257, 204]
6170B04k10K08k9j60j53R7K21l5j44N0q5J6L6l5L2j65Q7K38m6j65j03K64j66J95
6194A52k68J90q2k4J51k88K3K13q3Q7J14k72J46k49K03l5L8j9P8j19Q1O9k0J3
6218I9J61k80P8Q9j48J35Kj06J62j46k02K91j89R1k07K15m2J33n9k1J20j20j11
6241e5k0K21l59N3L5j21K78j7j34L25k43N4r1K08k74J48l2r9J27J30l0Lk67Q9
6265g1r5K05j27j56M29k14J43p2j24J44Q3j07j09J57j30K88j40m1p1M0P9m2oj32
6289f9K70o8n3N6m5P7j18J23l0m2j10m1K67p7l01K87m4k21M29k18p0R4j33L70
6313C33j35r9O5n9j09k7L7p8K07k26L19J1m13P8K30m68M79q3p2j8j1P1q5J33M6
6338A26O7j03p3j85N6M65m10J25k51K6L34j23n6N5Q0m1j33oJ06p2j63K42p6j01
$$ y = [204, -6, 202, 173, 13, -140, -43, 178, 143, -1, 49, -36, -20, 16, -19, 13, -152, -65, 173, 127, -38, -141, 123, -43, 152, -116, 74, -8, -32, 119, -169, -146, 67, -16, 71, 185, -87, 59, -190, 13, -22, 16, -3, 75, -44, 37, 106, 86, 99, 260, -20, 58, 147, -1, 134, 136, 30, 192, 46, -156, 135, -54, 37, -170, 45, 3, 136, 77, 56, 176, 56, -55, -75, 146, -213, -160, -125, -246, 32, 15, -119, 206, -37, 17, -74, 134, -140, 8, -24, -123, 4, 134, 104, 107, -160, -71, -166, 39, -88, -244, 185, -29, 114, 42, -82, 62, 145, 38, -71, 86, -44, 244, 104, 63, -8, 32, 111, 69, 63, -69, 201, 133, 80, 136, 91, 168, 50, 173, 143, 101, -9, -50, 217, 140, -161, 126, 82, -139, 290, 72, 2, 96, -37, 333, 198, 99, 164, 105, -4, -31, 6, -72, 135, -91, 228, 239, -174, -96, 134, -334, 145, 62, -10, -28, -39, 32, -53, 80, 126, 193, 90, 17, -168, -112, 353, -57, 68, -183, -157, 177, 54, -2, 53, 133, 92, -41, -47, 59, -13, -176, 66, -10, -111]
6362a11p0j9J19O9O2J06k6k11K26j37N0j2K3J74k50Q1J09j39l1p1l8l8P7J81j54
6387c0J22j22J98m0K4j27j35K46m5j3j02N4q4P8n9j04J68j03J3j68J4J75j19L42
6411A83j13O6j32j03o0K14M2rjj59j27M02j6k21J46k47L26j70j29L4j1M9K17j39
6435D2j21L22o06M57k85J10K44l46q8K86j22M5J56k34J47m2O5q1k11M62k91MJ03
6458A6R5Qk16j84M06m1k26J10l6K09k44j3J70k82M5J48L35l69J21J51k06r3J00
6481Dk0J03j84J76o8o1o6J07k36K28L5J24m20K16K12j90K98k72k63M23l3l51L04
6504F6j27L60n29R9K01l49P92j286O15L04J61n81m4j07M12K17Q2k86n3J19l16
6525b50K01J13k6k60K18J24Q2j45k02j05M21M7p3j61m7K21k04qJ83q9q5J57o5
$$ y = [-111, -181, -200, -81, -12, 50, 156, 130, -81, 145, 8, 58, 46, 69, 243, -7, 74, 183, 44, 13, -58, -96, -134, -57, 124, -30, 92, -30, 168, 128, 152, 25, -110, 136, 91, 78, -24, 30, -54, 24, -35, -139, 29, -74, -61, -229, -215, -40, -159, 183, 70, 136, 4, -99, -159, 55, 97, 88, 87, -72, -199, 203, 187, -34, 112, -135, 191, 21, -108, -74, -85, -36, 181, 42, -79, 243, -363, 94, -191, -81, 163, -183, -271, 15, -107, -62, 94, -140, 7, -35, 30, -51, -262, 200, -91, -87, 16, 111, 119, -97, -281, 125, 84, -142, -32, -68, 141, -103, -116, 54, -228, -183, -35, 300, -69, 52, 203, -3, -96, 4, -16, 87, -97, 79, 11, -50, -116, -9, -245, -17, 18, 142, -278, -62, 150, -40, 258, -14, -277, 146, 113, -238, 66, -61, 299, -230, -131, 70, -279, 513, -773, -158, 146, 307, -274, -318, -425, -13, 204, 286, 0, -53, 66, -250, -49, 64, 38, -222, -4, 120, 202, 57, -145, -250, 171, 218, 145, -16, -63, 158, -46, -54, 129, 40, -45, 112, 47]
6548D7k4l64M26J57k3j03j38J33j02N9p3Q8o9J9J04l49J08L4J38K6k75J45J01
6571F5j57j91R7J73O3k72L48l71J83J73k82L12L7n6j34l9nr8J57MJ4jj64K05p2
6596a1J28j86n3K17j40k0K10j56j13J15o7J43J9K4m64J24K78M2k72oR2p7J94M4
6620F5J7N9k91M36k13J3N2k5J15l05K67l21L72j12m84N98j78j77K64m90J57L5
6642a46J85O6o3K00m05K77m0k85OK43k82K10L2l53P71m96J97j40N7j0K34O5n19
6665a96M32j56P4j47j49j30K37L88m75J19k9j84L83k63kJ88J72r8N7l53p0J72
6687c0m0l39K47j86L89N7j83K38k27J55k04K21k24J34JK46l08j52L60o8R0K78
6709D55m24L14j96j50J94k91l1K07q7L29l59l87L30n3P4j18K43l95M60j70J01
$$ y = [47, 23, -341, 85, 242, 219, 116, -22, 111, 9, 68, -5, 83, 14, 33, 137, -212, -104, -70, 68, 94, -181, -36, 65, -92, -283, -186, -13, 50, -222, 126, -245, -62, 111, -171, 141, 178, 122, -12, -51, -56, -154, 3, 7, 21, 20, -144, 61, -11, 117, -69, -122, 95, -45, -65, 145, -11, -124, -9, -76, 67, 86, 110, -354, -230, 48, 90, -182, -188, -96, -173, 21, 65, 82, 141, -150, 286, 73, 86, 138, 113, 228, -77, 190, -131, 241, 129, -355, 243, 65, -112, 152, -338, -181, -146, 39, 105, 42, 242, -163, 114, 74, -211, -205, 38, -244, -34, -2, -355, 416, -80, 117, -23, 34, 24, 258, 323, -196, 236, 80, 154, 7, -142, -272, -35, 353, -122, -3, -32, -216, 167, -96, -98, 90, 262, 164, 221, -132, -202, -30, -70, -409, -162, -348, 41, 98, -85, 153, -74, 81, -123, 98, -126, 8, 9, 255, -53, -205, 155, 87, 177, 455, 31, 345, 149, -1, 193, -98, -129, 78, -9, 320, -39, -426, -96, -149, -75, -193, 50, -345, 115, -55, 46]
6730D6j19O7l55M70K21R8k43m01J73k11N78l75l67K50k20J26k0J75k57N24l25
6751a65K45k55l01K37M28o1j95L3J52j52K76j69k67J37N8j62J53M62l82r9L0L1
6773C4L87m90k37L0L91J98r1J82l35m77L03k67M41j82J0J94m50oP29j99J79l14
6795C0l8q9J30K13l40j64J93j8M68l42p1P1k24k65J75L62n91O38k30k4k44N28
6817A68K63l78l73N51K46k27p42M27J47L44n89K54j26N47No12J38r6pJ15K06M08
6839F69j048M12l9L00l04j64l98L55M87l58J29j5J0k52O1M55j15k81J15l09M29
6860A39r6L61p28J90L24j01O6L6m06j8J81l06O26n38L9m59N74O04o40O12l89J75
6882B46j60n34M44P14l57p18O26o13L67J52q02M88k35J47M67q38R60l13k57j1
$$ y = [46, -73, -6, -361, 109, 330, 428, 185, -216, -43, -254, 324, -51, -418, -168, -388, -262, -282, -107, -364, 160, -165, 80, -175, -476, -239, 189, 128, -67, -34, 118, -34, 242, 73, -194, -57, 1, -161, -8, 454, 72, -27, 3, 34, 421, -69, -306, -276, 115, 313, 222, 404, 69, -408, -105, -372, 69, -113, -103, 91, -359, -365, 364, 165, 344, 30, -8, -97, 33, 246, -94, -258, -65, -83, 385, 43, -28, 43, -181, -446, -271, 91, -500, 138, -92, -116, -360, 168, 431, 53, -320, 231, 477, 250, -492, -65, 82, 426, -163, 91, -35, 512, 517, -95, 43, -53, -60, 55, 261, 669, -379, 33, -6, 294, -10, -174, -572, -217, 270, -88, 41, 26, 36, -216, -155, 300, 185, -96, 19, -290, 139, 43, 404, -324, -134, 190, 89, 155, 191, -215, -233, -52, -358, 268, -270, -231, -690, -116, 488, -152, 460, 71, 246, 86, -448, -4, 710, 353, -365, 261, -352, 15, 167, -635, -147, -382, -235, 232, -606, 354, 41, -216, -227]
6902b27R24j011K52P89N5j220N58j14n22Q98l23l59m73Q04Q1L85j241P57k33K82
6922F2m5j4J61m3m39M36L28l64k08q03J369l07Q3o69O79L29n93rK02L41o7k88
6944A41n76L07l93N71M48O4j70n72n80P4N42K54j057J154Q2j60n53P60k17p8K83
6965C24k70q4J17m4q9M23j59j29K50m30J29P0k11p9K0R0M9J85k53j29M74j39j11
6988DM1p9j65P7O53k77k88j42P0k3L01k22K47l57K36k06n9K50MJ12k90qJ70j25
7012g6L59l48J31n6l2P8M6j69N8q4Q7m9J02j69R3j37J64j70O5K01Jo9k19K32j85
7037a46M24k53j4j70J44j43J86K01o7m45O3J07J43KJ45l03K53k00L5J93j45J8
7059B8n5J83j11K3J55l67j1L03j10M3k5k19L52l68N0J15j8j2P8L0o7K30ll52M8
$$ y = [-227, 697, -314, -62, 727, 782, -438, 120, 6, -516, 382, 59, -300, -773, 31, 112, 497, -744, 13, -220, 62, 17, 3, 164, 121, -318, 118, 446, 82, -126, -929, 440, 133, 216, -453, 226, 555, -38, -47, 155, 496, 429, 141, -435, -128, -521, 50, 498, 562, 392, -180, -760, -686, -144, 110, -947, 207, 289, 129, -424, 336, 119, 41, 324, 54, -30, 87, 43, -46, 377, 218, 89, 339, -91, 38, 108, -103, -182, -162, -72, -23, 162, -91, -220, 254, 115, 4, 45, -34, -199, -122, 531, 254, -34, -176, -106, -129, 172, -50, 197, -160, 76, -130, -189, 61, 65, 177, -113, -121, 49, -76, 283, -65, 66, 10, -22, 56, 102, -67, -9, -93, -6, -55, 47, -122, -29, -166, -2, -172, -107, 94, 95, 26, -193, 39, -146, 278, 25, 11, -159, -15, -158, 28, 229, 162, -283, -220, -113, 30, 32, 177, -126, 127, -73, -38, 155, 10, 28, -27, 156, 45, 68, 223, -144, -155, 148, 38, 81, 56, -163, 189, -179, -129, -14, -32, -44, 34, 64, -3, 227, 224, -128, -80]
7084h0K26j89p3k52K47J95N5j37R1k26j61L42K57k65k29J39P5J07k97K33j43J88
7106A03L8j37Q9k54M96r4q9J6j05j51L18j68j79L34o3j03J00j89l4J79j62L3O5
7129D3r1K06j22j24K45j17j61J22P1O5p8QK00l47M4N01l74l3M7m3n5j29rJ83o1
7154ij0J65k76K09k7k32o5K14J61j19k80O1L26j95j33J19j36J01Q2p5p3J01Q2
7177iR3r0J34j21J10K66n68K14J66j70l2j13j98K85r5o7K18q2J77j19pL23k66
7200D9j03K42l02K23n1j69J61J81o7n8k09K02n7p4r1K44j12J30O7j02P8p0p5N9
7224I6J41j52j27oJ45mj28k00M4L68m5r0k9l4j01r7R6J34j27J34k0j57J09k08
7248b58K30mL93k12j37j64m6j19K31J2o2K24k17j5M65m07J6k44M69j25k30M72
$$ y = [-80, 146, -43, -116, -368, -121, 74, 129, -8, 83, -143, -304, 38, 295, 30, -199, -60, 15, 122, -175, 58, -85, 103, 141, 4, 93, -161, 335, 241, 152, 168, 63, -88, 230, 62, -117, 217, 154, 51, 151, -38, -72, 107, -55, -22, 43, -48, 158, 36, -88, 157, 40, -121, 1, 72, 137, 59, 67, 267, -80, -36, 465, 91, 58, 105, 62, 7, -122, -131, 52, -9, -19, 146, -130, 79, 52, -180, -245, -31, 130, 11, -269, -208, 118, -77, -210, -91, -227, -126, -44, -119, -192, -91, -9, 84, -6, 128, 7, 117, 383, -185, 29, 195, 25, -7, -120, -318, -33, -128, -195, 23, -59, 118, -1, -8, 315, 49, -54, 188, -114, 109, 58, -111, 50, 231, 164, 106, -103, 99, 42, -32, -123, 121, 9, 139, 206, 104, 182, 112, 37, 96, 237, 85, -42, -48, 97, 93, -35, -235, -191, 177, 132, 42, 13, -21, -122, -219, -123, 11, -116, 18, -2, -159, -50, -258, -28, -32, 361, 149, 12, -152, -198, -317, -86, -74, -136, 88, -129, -144, 321, -86, -70, -314, 155, 30, -200, 272]
7270B72m7k90l12M58k47r3M67l04N5m9J79n16L62j36L35k92R7L58l6l15l2k9J43
7293B8K31m08j18M11J42o25M55l40K63j94R6o4K63J1k20J02P7j43QL7L6P7r7P5
7317A03K72m63L37j49j04k9n2J15q0N30m70K06k05M0j64o3J25N04j93l21M9K13
7339B01r7j11M3J2q5r9j67L52q7L0Q3m34L52J21k48O9K00k45L79m37K09k03kL5
7363a29K66J18l74J28L08n89L3K25j6pl83M03J43k4l46J46Q9K5k00M63l13L29
7385B95j46j60R0j08J7J16O2q5J1o0r0K9J85k54J05o0J06n8J17m19L21K3M2Nj62
7410g8R9l18J23Q9J94l7m8r5K36j49j86J14R4p7r0K78k14Q3j37j4OL24kk72K86
7435B09k08k5j8K71j92J68J3j62j87R0O2j31J76r4J94j35K67k24k89K30J4J17
$$ y = [272, 225, -65, -377, 81, -166, -259, 208, -96, -41, -90, 89, -427, -65, -201, 134, -158, -61, 297, 261, -54, -86, -115, 28, 259, -149, -267, 144, 286, -339, 116, -224, 39, -155, -59, -123, 140, 151, -69, 33, 110, -33, -25, 12, 48, 125, 28, 103, 375, -88, 249, 100, -4, -33, -85, 30, -50, 480, 10, 216, 11, 51, -113, -176, -51, 453, 260, -61, -12, 201, 104, -7, 36, 48, -37, -136, -303, 49, -38, -8, 75, -359, -7, 114, -134, -65, 135, -110, 269, -168, 41, -162, -164, -129, 137, 255, -119, 9, 317, -272, -239, -14, -30, -37, -420, -17, 126, 102, -244, -98, -9, 16, -184, 279, -34, 295, 149, -11, 79, -29, -12, 104, 166, 81, 92, 32, -58, -29, 156, -98, 7, -53, 53, -5, 112, -307, 14, 37, 79, 84, -78, 21, -297, -174, -85, 109, 72, 24, -71, 165, 16, -170, -56, 38, -39, -129, 149, -65, 18, -119, -133, -127, 197, 195, -77, 209, 1, -24, -42, 229, 37, 205, 218, 56, -131, -41, 21, -110, 66, -28, 166, 31, 298, 74, -215, 15, 29, 146]
7457A46p6J2k05K07Pj59Q9j54J97j02nJ30j21J43l99K2N59p43M54J83l9j20J69
7480A95j95N4N4K29m87L65m64K70P3m8Q4p1q9l3J34j34K8N3J03j61P5j53N0J84
7504A16l4O5m9j50P1o0k07L06O7n6o7j0k9K05l32M31l64L17k03J27k70J00J81
7527A55r1J66j11j78J1K1l1j62J29J02k75J13J19L3j9K5R7j19Q2M4j38J1j10R0
7551c6K36k93j08K4J02J78j83O0m5j72M35l47K18o8k14M59k75k44K80K53j63l47
7573b50K02L4k27J5K8k05N92j83J59n00MJ6L65k19m1K57j89Jk19J47o4K34l7k6
7597a06J55j80J83M6Olk03L19j64k31K63j14m4L5J21r0J11j19Q0j24O2K20p9k47
7621a03R4M2j0P9k64K66m6n8ql9J04n4j64K42j02m7o6K39L3l2k69P2J19j43K23
$$ y = [146, 70, 82, -123, 84, 91, -68, 21, -133, 64, -38, -43, 87, -34, 109, -290, -268, 291, -452, 2, 185, 146, 26, 195, 0, 54, 108, 337, -150, 215, -249, 21, 94, 46, 130, 59, -30, -63, 71, -63, -35, 18, 121, -40, 35, -118, -68, 116, 82, 147, 98, -52, 19, -41, -248, 58, 125, 69, 2, -8, -37, 168, -164, 267, -97, 220, 17, 144, -126, -26, 155, 64, 230, 119, -59, -48, -27, -58, -220, -91, 11, -264, -151, -32, 1, -18, 7, 104, -15, 67, 111, -27, -16, -126, -36, 200, -93, -201, -177, -75, 103, -80, -20, -65, -237, 198, -149, 69, 1, -213, 246, -29, -273, 7, 260, 97, -250, -48, -14, -241, -226, -198, -403, 189, 6, 165, -335, -331, -315, 50, -169, -210, 47, -142, -141, -360, -213, -277, -43, -80, -106, 49, -131, 52, 98, 104, 101, -102, 217, 53, -178, 85, -29, -73, -38, 83, -7, 104, -15, 65, -59, 3, 223, 144, -103, -9, 33, 23, 102, -162, 104, 58, 0, -8, -47, 57, 3, -161, 81, -21, -68, -134, 105, 138, 106, -163, -91, 28, -115, 108]
7646A08k35K45k10K42l18K08k09K66j49J58m4j88K71p2k32K52Qk20K20J11Ok18
7668@j86K83R9m78J32J71j06K12r0J02K4J6M5m02J42M2k03N8J65Q9j53K8mJ71
7692A57j61j4nj66JK5O9K25l13L37k60J8M21K30p21J52k90Q4K71m90K45P9n53
7715f59Q55K1j65K4l69L06l1M7j34j066O53M14J25m48N13j35l7J84k27J47K90
7736C08m91K85O25j398M20R3M11m91K77j43K53O4o43K63O94j65j54m77O88m13
7756FJ89l38Q5L49o51L79p7j23L13P31p52j29J56l24K00m19L96L42m47j2K55n17
7778c88N11j43p8K8L85k18m32M45J28l1k25L1P5M2j12j46n4J98rk46M83j38L09
7801D15j4q6q15R2P65m33M35N5j49l07L41l34J00k7J94k97J88k13K05l34k07N57
$$ y = [108, -127, 118, -92, 150, -168, 40, -169, 97, -52, 106, 62, -126, 145, 73, -159, 93, 101, -119, 101, 212, 218, 0, -186, 97, 196, -282, -150, 21, -85, 127, 37, 139, 163, 179, 224, -178, -36, 6, -197, -139, 26, 115, -38, -10, -14, 157, -4, -18, -23, -189, -188, -163, -94, 131, -182, 155, -105, -87, 334, 564, -157, -5, -295, -211, 60, -430, -185, -106, -659, 196, 217, 52, 76, -293, 13, -18, 29, -105, -1171, -518, -104, 21, -427, 86, -49, -86, 98, -129, 18, 308, -183, 102, 727, -671, -251, -158, 253, -238, 39, -104, 149, 213, -430, -167, 527, 362, 208, -269, 419, 6, 195, -143, -58, 291, -360, 19, -58, -181, 132, 863, 111, -18, 138, -186, 14, -405, -9, 333, -114, -126, 129, -388, 123, -20, -98, -70, 315, 97, -335, 110, 238, 207, -18, 13, 88, 130, 18, -128, -182, 16, 7, -239, 244, 106, 415, 401, 315, -500, -408, 357, -76, 359, 414, 265, -42, 299, -35, 65, 38, 232, -65, 123, -90, 115, -219, -426, 131]
7823A31m74K86N2K4r0j0R0O6k69M51R2n54L71k23J2QJ37j24Q2j55O1l3j16j17
7847c02M8L02p6k4o3K03k16J35k23P3J77m8k02K38j7j49K65m8%J56r1k67R0J38
7871I9j56K02p6j41J51N5j44j32J21j04J21J11k47J16J60R8k83K17j73K81j39
7892A37P4k94J10l20K11J5J14k49M85N2l62j25O55r17l7K33Q01m65m23l2J62J66
7914il11J126J39r28j46K88j61Q48j282J102j031K83j57N5l16M87K35l15r3L38
7934A52k5m11K21K46l14M23l81j92M29J25j01k05r6O3K24r8o3K54j68j22J12Q6
7956A59K87l41J27n7j09j97J44L8p9J45j42l4P8n6o2N5N0j11j0J56k4k3J62m8
7980A08N1R0j67r1J78j35J12l41K36J88m21K26l6o1J41J09n1k5o0j67M39j88j42
$$ y = [131, -343, -57, -5, 19, -71, -81, 9, 75, -194, 257, 349, -205, 166, -57, -45, -37, 100, -24, 58, -97, -36, -69, -185, -302, -254, 48, -28, -52, -115, 88, -128, 7, -216, -143, 34, -14, -216, 22, 5, -144, 121, 73, 73, 229, 138, -129, -39, 99, -57, 145, 69, -72, 79, 134, -10, -142, -21, -125, -4, 107, -140, -24, 136, 234, -49, 168, -5, 276, 137, 211, -83, 27, -293, -82, -67, 47, -202, 283, 335, -27, -152, 503, -414, -451, -218, 583, 118, -305, -337, -175, -9, -320, 806, 945, 17, -129, 159, -2, 846, -436, 666, -365, -82, -239, -184, -500, -13, 222, -93, -186, 152, 127, -284, -63, 183, -131, 292, -89, -281, 148, 273, 172, -33, -129, -66, 158, 60, -3, 251, 83, -39, 73, 159, 446, 105, 232, 175, 66, -131, 13, 51, -28, 117, -25, -59, 19, -37, -99, -44, 6, -105, -115, 41, 17, -6, 156, 108, 159, 249, 82, -9, 169, 34, 146, -195, 41, 229, -192, 34, -2, -63, 78, 187, 136, 111, 51, -116, 323, 135, -7]
8003gj32J75k08J69K59l03J27k91M4K76k62K84Q3k82l20L66J3L7Nn0P2M4k00M4
8027e7J09k56M43m75L28r1K37j67L8J70k53rM0k96M70j83R3J4j01J11j61N0Kk1
8051C5p2R7k66J60J83j43j33J12J73q7R4j15J10j22j29J21J88k80K02k86L0J04
8073b4O8R4j48J99m7l00K14n2l52L76J72k73J29o1j5l4j61K34q4J1n5J63%k59
8097b05K26p5M04k31k58KK91k94J94p2o3J21J36k5k62J41O3k03K45R6k88K03r4
8120E2mk33J20M4kj48K75k26K81k88L18l66R0j29J51J23M6l79L95j04j39K14k37
8143a46J54k09J05L20m02N0J82K00j81Q4j69L0pj81K59Mj43JJ23j20MN0j58k57
8167d07L25J27j17J32j64J68Q3r1N7q8m1o6N18n05p5L57j34J36l16M27l59k27
$$ y = [-7, -139, 36, -172, -3, 256, -47, 80, -211, -167, 109, -153, 131, 214, -68, -388, -22, -9, 28, 33, -17, 55, 99, -101, -57, 52, -204, 239, -236, 92, 1, 238, 71, 109, 279, 26, 17, 57, -239, 231, 48, 141, 155, 54, 165, 4, 54, 56, 35, -37, 60, -206, -46, 137, -6, -139, -27, 146, 59, 153, 38, 148, 26, -103, 18, 206, -74, 128, -158, -128, -24, 44, 138, -10, 189, 142, -158, 56, 4, -348, 28, 200, -73, 56, -5, -20, -54, -215, 19, -65, -54, -109, 54, 54, -205, 21, -54, 350, 119, -139, -137, 154, -140, 54, -18, -81, 40, 176, 151, -111, 30, 93, -110, 135, 231, -57, 146, 52, 48, -185, -65, -21, -23, -171, 104, -122, 159, -129, 189, -177, -87, -216, -65, 58, 104, -275, 120, 16, -123, 91, -146, 8, -201, -96, 224, -178, -128, 54, 254, 73, 157, -12, 18, 11, -170, 89, 93, -50, -49, 74, -46, -42, 8, -150, -407, -82, 45, -72, 60, -104, 64, 147, 56, 113, 25, -16, -82, 436, -69, -144, 213, 79, 215, -101, 326, -33, -260]
8189b60J71J07
$$ y = [-260, -89, 18]
8191A8
$$ Imaginary data points
##PAGE= N=2
##DATA TABLE= (X++(I..I)), XYDATA
0@%%%%%%%%%%%%%%%%%Qj6J6j6J6j6K4l2L2l5M3m9N7o5P3q7R8j08J22j38J56j75
39i2J96k20K44k71L01l34L69m05M47m94N44o01O63p29Q03q84R77j083J203j341
59g07J501j692J919k200K558l029L682m649O276r763L4831k7363m234J4249j1058
74C21N0419l9688j9373L0555j8086K0771L281m7148L3242j068j2634K4493l7147
87a2062M180L3046l2831J3227n118k2936M1723j2988j9781K0887k3268K1323J5402
100B0804m1414J3764K469l641L5980l0575j5121K4582j4774K4601J331l7875K2512
113B643J09l623K1896l1203K407K3869k2065J5031p582j8555L3660j0680j1348
126e441J1662k5417J8288J6587k6824J1188p376o421K8775j8586o830J3152j5723
$$ y = [0, 0, 0, 0, 0, 0, 0, 0, 0, 0, 0, 0, 0, 0, 0, 0, 0, 0, 8, -8, 8, -8, 8, -8, 16, -16, 16, -19, 24, -25, 32, -33, 40, -47, 51, -57, 65, -73, 83, -92, 104, -116, 128, -143, 158, -176, 193, -212, 235, -259, 285, -316, 347, -382, 421, -463, 514, -569, 634, -707, 794, -898, 1021, -1179, 1379, -1650, 2032, -2617, 3659, -6104, 28727, 1364, -2870, 11379, 321, 50740, 11052, -8321, 22234, 4148, 24919, 28200, -18948, 14294, 13226, 592, 25085, -12062, -7882, 25164, -7667, 5560, 442, -22494, 19229, 6241, -13540, 7347, -15921, 5402, 20804, -20610, -6846, -4377, -8018, 27962, -2613, -17734, 6848, -7926, 16675, 18006, -19869, 2643, 2752, -871, 21025, -10178, -7771, 16098, -5967, 9064, 1482, -17073, 16587, 5907, -5441, 6221, -19196, -908, 15679, -11145, 43, -7333, -13754, 15021, -3565, -10395, 2757, -12966]
139a2966J8069K18k3692J9010k662j094J6543k5455K798J6525j1361J4547p663
152B817j7062K0935n663j550R844j9270J0827Q333j5605J1103p399m160J9521
165A2671j5005m048P077j2130J5286J495j5985R724o068O28J3593j4951K349N971
179F07r953J1417m504q494J4507n962k14O107j3369Q865O678p573P488p302l797
194e499J1982o043J782L697r400Q040L37o901Q246m435L6O539j0102J674L760
209C713m661P443l570o082N727l775K014M051p455L614L30n020N957l090r76N466
225C686n287M54J931m358N534M88l826L091l921L70M716l797K244O8l939L253
241G07r59j024L922k970j61J076l567K642J134j417J503k278j646K233q84J651
$$ y = [-12966, 5103, 5321, -18371, 639, -2023, -3117, 13426, -12029, -9231, 7294, -4067, 10480, 2817, -14245, 6690, 1027, -523, 9321, -9949, 878, 9211, -6394, 4709, -2690, -6850, 12671, -2334, -6382, 695, -11435, 3851, 5346, -10639, -915, -6983, -6355, 7238, -7713, -5364, 607, -9346, 2071, -2433, -10927, 3580, -2382, -2596, 3511, -9858, -993, 5685, -1888, 5600, -1702, -5499, 6483, 440, 2222, 5919, -3481, 4559, 4896, -2005, 6241, 1806, 1842, 8381, -1721, -47, 3713, -948, 6495, 2925, -3157, 2570, -1205, 809, 4860, -2595, 1019, 1349, -3671, 2286, -804, -1780, 3686, -1601, -1147, 784, -3574, 1960, 2448, -1378, 1713, -2208, -1838, 2878, -919, 1325, 1393, -2546, 707, -252, -1276, 2646, -324, -485, 591, -2976, -334, 800, -617, 886, -1392, -3038, -805, -1689, -38]
257c8R28l129R18p08o15L016o85J59M17k474J038J254k30J714n54j325J84j98
275c28J187J245n01Oj033p49J488K98N31M68j456m70K03J15J165O1m53q45q54
294G8j22R05Q30K23p60j354k50J20J104L47m11r14q58m00N14Q95K04n39q50p56
314a994p4R22L03k0n54n08q32J41J467N1J01n72j115K49P07L13Q71l39q12l66
334b061j59J026J205j13L36j047p79J308R3R74N53j648j45j4J9J966k04n04kj240
354d36N94P46m56J509r16j650J161j558J300J817j781K56k52j691K363p4o13J651
372A970k512J17Q73j132K546j02j969K103k558N3K924k039J265R1l538K656l72
389C76q56L150k937j1J274l294K592M22k417L512l282j616L357k874K567J967
$$ y = [-38, 890, -2239, -1321, -2029, -2644, 372, -313, -154, 263, -2211, -1173, 81, -149, 1565, 1011, -314, -130, -328, 859, 2104, 1603, 1609, 576, -173, 1315, 1613, 2144, 2612, 1156, 686, 889, 1004, 2169, 2230, 1777, 932, 78, -44, 861, 1691, 1914, 1154, -200, -450, -330, 774, 1121, 710, -204, -1062, -1462, -948, -53, 151, -388, -1238, -1994, -2068, -1146, -843, -863, -1417, -1925, -2757, -2616, -1149, -1098, -997, -1569, -2684, -2435, -1728, -1415, -544, -883, -1695, -2061, -2220, -1194, 11, -102, 234, -813, -1592, -284, -191, 783, 1336, -312, -457, -471, -452, 1514, 1310, 806, 804, -436, 158, 904, 448, 1957, 1041, -609, 552, -1006, 294, 2111, 330, 586, 334, -1357, 1006, 932, 319, 1970, -542, -425, 448, -684, 1862, 1760, -209, 1894, -664, -611, 2313, 274, 1539, 1630, -1908, 748, 376, -480, 2670, -267, -278, 996, -2298, 294, 716, -1701, 1811, -1471, -3087, 270, -2604, -37, 1930]
405A930m936K237o22j591N075l388q1K501m057K756R75l606N533j578k045L759
421B862m910K336M703m833K486j406l251O651k719r57L836n485L534J246n791
436a698N258j163k729N478o446r9N003m527M489j034o315N850j605j280N408p813
452c223K236L939o403N978j686m460Q686n449j450M757o577N746L068p764M111
467A509k584j433Q948p116n83M466n820O076o44p243Q115l186l27M101r297L985
483a033N296m728M313o133l104J0488m141j534L096q303P101K513p364N794l136
498h75j98Q188q563j0M506n434R171k758q456O956k689K334N944j1033K711M753
514D547n538P297n372m795J0207n311m37K315r520Q716L319p668M072o557P49
$$ y = [1930, -3006, -769, -1391, -2982, 2093, -1295, -1376, 1125, -2932, -176, 799, -2807, 2726, 1148, -897, 2862, -2048, 288, 4991, 158, 2644, 1238, -2013, 4638, 1919, 962, 4798, -687, 2847, 4093, -1698, 3560, 2397, -332, 5146, -1300, -1399, 3604, -923, 3566, 2532, -3783, 2067, 462, -818, 4590, -3223, -987, 2952, -3451, 2527, 841, -3619, 5067, -382, -1832, 2925, -3652, 2094, 5162, -2602, 1509, -1075, -2508, 6440, -676, -1259, 3207, -2613, 3463, 2819, -4424, 3691, 505, 178, 4279, -5018, -1033, 4263, -465, 3848, -2285, -5389, 5099, 958, -576, 2520, -5783, 1318, 3831, -3533, 2261, -875, -1073, 7115, -1448, -1458, 3048, -2386, 6785, 4027, -4429, 2527, -162, 2172, 8116, -2917, -206, 4547, -991, 6306, 934, -3861, 6346, 1035, 598, 2913, -6607, 2109, 5428, -2240, 1832, -4725, -3976]
529c976J0094p677k55P76n902R438j754p515O686m152K363N714j0812K292M574
544a06l468P256o591n703R727l457K741J533j0200P230K680m866O024p366K5R187
560D646o996j42M59m277J0006j354p694M460m570M748P071j0562R47J799k589
575d048Q269n687m289P123l161K433J468q344O679J732l251M978q357R36Q260
590D741m286K435j228p320R156j20l778K600n669L610N673p953K025J21j488Q076
606F595o198m125M264k662M434J665q993M223M71r10M994o681p93N965l870K488
622H67j300m562O920m17l112K303n111L808M851m937J128j508k236P141k781k189
638a135K578l070L249J195n331L250K67o27L409n417k74L804j706K588j478m673
$$ y = [-3976, 6118, -1559, -1814, -1038, -6940, 2498, 744, -6771, -85, -4237, -1874, 3840, -6972, -4680, -106, -3574, 3682, -2909, -8612, 1115, -2342, 399, 1932, -8268, -1038, 1642, -3224, 2800, -4566, -4541, 4646, -2350, -2492, -2033, -6310, 3696, 2342, -5352, -892, -5462, -714, 6357, -4205, -3258, -1459, -4048, 4221, -1466, -5755, 1368, -1793, 640, 2108, -6236, 443, 2175, -1076, 3902, -4455, -3519, 4741, 455, 2890, 1662, -5658, 3498, 3378, -400, 2200, -3469, 141, 5814, -2139, -114, 7, -1481, 6595, 397, -3728, 536, -2126, 2308, 3973, -5020, -797, -326, -1236, 3758, -2923, -3716, 2249, -1621, 867, -433, -4995, 1925, 1508, -1604, 699, -4412, -604, 4247, -690, 438, -1070, -3306, 3835, 1054, -1135, 1443, -1627, 1622, 2817, -2514, 736, 1003, 376, 3785, -1632, -1906, 1898, 192, 2780, 1302, -3371]
654c371M756n16l83K382m491J372K526k796J552q07j263M001k336j551J342j853
670a436L239P85l537J158p86J41L250k888n39J339j717J786k79j802K136p40m09
687b99R65k616J302J635j465P51j372j380K527l82p7M92j956J085M77j353J536
704a30o63j95J191j547J94J021n23J224l87j690R65n9N64J023r13j16K18q71J349
723F55k44k59O82p69k85P05o48J241K42r83N2m01J2Q63J67l93M8p65L36M1P3O50
745A020n13k01m78m21R70K59k25k22k97o17O45J94Q4J81l95p18O5L08L25K04l59
766a91k51p65M28K93K12K99k00o09l29L52L96M49j82l27l29N7L93J72K55j83j37
787a97k15K37l8N33J61m4m41j65m5Q47J48m4m14k08m2RN86L02l17j62k35j56N11
$$ y = [-3371, 1385, 869, 486, 2868, -1623, -251, 2275, -521, 1031, 224, -1039, 2962, 626, -925, 417, -1436, 1803, 2588, -949, 209, -577, -436, 2814, -74, -613, 726, -991, 795, 516, -1286, 850, 110, -299, 666, -1950, -648, 987, -478, 273, -1099, -2479, 48, -334, -411, 81, -1875, -790, -313, -1666, -130, -793, -988, 203, -1344, -1150, -129, -652, 572, 185, -1505, -540, -599, -35, 988, 75, -41, 177, -694, 655, 411, 152, 834, 65, -220, 485, -163, 1078, 1320, 337, 389, -12, 0, 863, 1030, 637, 685, -80, 256, 297, 370, 1020, 507, 306, -172, -593, 377, 636, 411, 189, -108, -725, -80, 114, 198, 379, -16, -734, -669, -361, -36, 168, -191, -442, -1207, -779, -486, -274, 25, -175, -784, -1113, -761, -365, 84, -98, -425, -754, -697, -304, -132, 123, -60, -197, -412, -175, -213, 320, 481, 437, -4, -169, -214, 633, 781, 737, 323, 115, 73, 82, 668, 970, 653, 491, 256, 100, 611]
810F11M19n4j72m16k43K88K09K50J01l40l77k33J13J147n61K9l69q25N87K71L7
831D72J58l31q52K56o4L45O73q06K78p26m28N40j01K22N97j361k2L82k69O58j8
852c97n88K90o71L28Q46n64K93J12o43O12n19K99J380p64l54K15j079J285M31
871E12l88N08j073J0Q89o29O65M42j285J113n51r22J593o41J30N10j927O14R90
890E60o24J719j520r85J534j071P52M83j740J502l76j254J268o39L96J532j952
907d15J48J66r99K191k87j810J030j233Q41J373k337J308K28j604K001j774j33
924a306K154j491M59K30k555K293O44j006J438k518M73K175j952P75J91j495K552
941A061j293j174K300j746J553J000l179J421L99p10K589k101j294K262j506J373
$$ y = [611, 1030, 976, 804, 388, 145, 433, 642, 892, 993, 653, 276, 43, 156, 1303, 742, 771, 402, -423, 164, 435, 472, 630, 299, -553, -297, -361, -16, 657, -149, 129, -597, -1025, -485, -586, -364, 233, -1128, -1150, -768, -1037, -379, -397, -985, -695, -1366, -1038, -192, -756, -463, -351, -994, -382, -901, -602, 778, 14, -340, -125, -1204, 81, 512, 124, 632, -441, -431, 458, -171, 494, 936, -349, 764, 213, -709, 884, 243, 373, 883, -1044, -430, 560, -64, 1655, 135, -850, 684, -387, 365, 848, -892, 610, 234, -1020, 248, -391, 5, 1537, -415, -267, -101, -1100, 1091, 804, -1006, 24, -1209, -368, 1005, -1332, -24, 204, -1400, 601, -1173, -1306, 848, -643, -184, 46, -2509, -216, 428, -578, 860, -1658, -1185, 990, -962, -187, 4, -1491, 1061, -232, -1406, 894, -852, 701, 1701, -1478, -57, 342, -368, 2221, 120, -1174, 1088, -418, 955]
957I55L21k595K477k20j541K089k268N64K848l015P12n57j252L323r73j685J220
974D03j937J921J401l319J713j27j195K528k257j010K820j522J063j56l484L418
990B60Q5p63J542l275K92L272k372J085nk276L303j155j457J710j682J932J192
1007A688l831J340J24k84L175k331j906K561j389J835L26l168K434L2r98J728
1023A336k619P80L021k517M97r53r12L352l53j707J113k459K365J173k462J248
1039I03p82k28K207k087j094K347j725J936n47k758K207L79l53J378l218J64K554
1056A283j557J566j055k149L324n15r17L21k110K320R24k675P91q17N88K691k605
1073e92j007R39r36K119M34k656J775o20P1J690k998R57J894j229R49j336j809
$$ y = [955, 1276, -1319, 1158, 938, -603, 1486, -782, -218, 2630, -385, 327, -230, -1482, 1841, 868, -817, 403, -1534, 387, 1788, -1531, 182, 55, -1140, 1388, -869, -1879, 941, -581, 482, 326, -3158, 260, 345, -418, 1124, -2151, -1859, 1413, -959, 126, 121, -2155, 1148, -7, -1464, 246, -1436, 496, 1688, -2143, -803, -679, -963, 2212, -119, -2025, 536, -853, 982, 1308, -1860, 574, 606, -392, 1336, -1283, -503, 2518, 1, 498, -455, -1367, 1985, 1632, -75, 1038, -1421, 944, 2117, -345, 903, 121, -107, 2100, 13, -1081, 1266, -459, 1477, 930, -1828, 379, 758, 405, 1783, -1435, -1271, 1283, -274, 1292, 237, -1912, 1412, 897, -20, 301, -1809, 511, 1435, -1240, -449, -1266, -678, 2013, -592, -1599, -660, -1596, 523, 957, -1699, 76, -544, -473, 1217, -1781, -824, 1070, -159, 790, -546, -2355]
1090b355K584K98l67R7k250K293J205j450M97j304k66K635j234p45J104j602J984
1107A124l20j662P93M94m3J576k536p9J458p94J685j302j469K134q14N53L57j735
1125e80R79Q54j503r0k44n5J733q70o23K42q60J407K92j387R18n30k88K027k037
1144f15K77R03q91P62j667k98J623j35o6L35j785J174K63o70R76m24q16J027o9
1163i6K67j47n29N58J32k56j07K29L29J97o28p71J120p04P28m2p38L52j59j84
1183d49P26Q4j51j85o9M10Mm61J002m37m16k55k07O49j2n90P78J20k35L51p84
1204a27j76O79k40J68l27l22J81J36k43j91N42l80J61m95N98J73p14L6l31J85
1224f87O30j87J96l0K59m45L11J36n24N89n1n98J72P9N21l96k77Q28n03l73L46
$$ y = [-2355, 229, 527, 160, 257, -1993, 300, 1505, 55, 552, -752, -1018, 1617, 383, -362, 742, -860, 1124, 804, -858, -65, 429, 386, 1962, -574, -653, 805, 11, 1696, 394, -1075, 1059, 245, 798, 1155, -580, 399, 1253, -250, -340, -584, -639, 1094, 224, -399, -157, -1017, 390, 682, -705, 213, -317, -605, 1422, -615, -338, 565, -326, 436, -1231, -1529, 94, -41, -107, 228, -1557, -383, -120, -790, 186, -238, -1054, -27, -96, 171, 24, -505, 53, 185, -71, -178, 51, 380, 577, -51, -822, 298, -406, 322, 280, -458, -106, -265, -449, 277, 361, 210, 25, -44, 366, 370, -91, 911, 474, 58, -197, -404, 245, 233, -357, 421, 541, 306, 657, -127, -303, 376, 136, 304, -23, -345, -164, -28, -271, -462, 80, -300, -139, -634, -36, 137, -577, -541, -872, -687, -57, -244, -48, -78, 181, -264, 47, 183, -341, 248, 197, -401, -229, -150, 371, -25, -302, 526, 23, -350, -4]
1245dN25n74L76q06L50N00m96P77k69K65j42l34K26J30o9K58o12J55k10M72O3
1266E81J39q22K5K47k70J05K05jk47Kjk29N58m19n64j1J68J92J26J03l07r0O6
1289d44J12j71O43m30k79L2k84O0K90J39pj59j94p5O4j5L71j52l09N1j76N98J76
1312a59Q1l30K71o09O07q0M58O0k76N37p31l59M92j43J17R04j365o5J056k57M57
1333F66p61J26J28O83p04N47m40MQ55j276L27M59n65O02k99n28K25L8M72l3q96
1354c70K14q2r4O44j52r43J617r75k08M09o84K84L88J60L53j281K41J627j204
1373e6k52n9p69J170N6j69L16j468M30J315j575R46O12r01J047j026p36J246q21
1392f94N77J076k637J596L80l63Q90k551J362J119o91o5M40j451L050j132j538
$$ y = [-4, 521, -53, 323, -483, -133, 367, -129, 648, 379, 644, 502, 168, 394, 524, 455, 713, 101, 256, 46, 518, 581, 720, -102, -77, 170, -100, 5, 210, 209, -38, -36, -37, -266, 292, -127, -691, -702, -534, -342, -216, -113, -420, -510, -444, -332, -503, 140, -290, -569, -537, -821, -761, -471, -332, -339, -498, -692, -767, -703, -718, -347, -499, -808, -757, -933, -335, -159, -78, -408, -137, -746, -139, -219, 239, 299, 23, 560, -171, -530, -38, -181, -64, 840, -525, -590, 466, 209, 666, -95, 31, 159, 842, 138, 685, 245, 249, 1104, -172, 155, 614, 49, 651, 352, -176, 49, 87, 559, 526, -370, -156, -238, -332, 312, 160, -783, 834, -141, -349, 60, -624, -340, 48, 208, 561, -720, -479, 1148, -56, -308, -367, -1136, 34, 90, -79, 237, -1231, -801, 514, -1061, -115, 497, -404, 643, -383, -1119, 127, -694, -117, 959, -1678, -82, 298, -65, 825, -1726, -364, 755, 64, -1, 439, -1012, 2038, 906, -632]
1409f32J242p43N64J255k009Q19l13q2J897q54j917J664j492J725r33j643J478
1426B6P10r19J074k067k64K834j912P74n88q02J738L67j683J301j544J64J725
1443I34k473Q43J00j37J271j256q47J881q16J038m32j920K120O2j007K010k144
1460g73k52K507j515J16n14r77K298M84j713J032k180J002K603k867N31k47j011
1477a476L217j761k09P69j343J333R44k906K472j089K76Q30k047J01J274j3R99
1494A371j847k127L664J44j212J034k979K646R88k233M85j73Q5J669m74j737q8
1511g84j25J866R00k908J206j045J02L524m248Q20O72j227J356n1k434L311n52
1528C83j003J491j889J032J245k147J426j237r95L340j076r78J288k868L083r30
$$ y = [-632, 610, -133, 431, 1686, -323, 496, 183, 101, 1998, 1144, -773, 891, -601, 1124, 191, -1452, 26, 736, -183, 891, -1176, -1440, 1394, -518, 256, -332, -1134, 604, 971, -712, 589, -955, -791, 934, -1539, -696, -596, -733, 538, -718, -1565, 316, -500, 538, 106, -1814, 306, 368, -639, 1371, -773, -1025, 1482, -33, 83, -431, -1408, 890, 1374, -339, 693, -1487, -485, 2118, -749, -218, -465, -1476, 1741, -20, -229, 540, -803, 530, 1474, -1432, 1040, -49, 227, 1057, -990, -889, 385, 372, 1371, -476, -2603, 1061, 1205, -7, 1027, -1952, 694, 1682, -551, -66, -239, -154, 1515, 1041, -696, -784, -909, 957, 1857, -1051, 155, -890, -788, 2736, -1512, -692, -20, -1247, 109, 58, -2376, 935, 383, -620, 871, -1018, 14, 1259, -888, 538, -699, -1694, 1646, 570, -408, 880, -1988, 1095, 165]
1544A65j372K227j446L75J216j593k57J268j560K178n27j587J878j266K69J183
1560A151j873J279K69j696K055j257k34J320j394j31J160j126J256j70j348Q75
1576A36r18N82J399j873M72L73j108J650k90j168J393j010L12N05j794J572N69
1593H02j369Q02p24m10J319o80J79J22j143J362J48j114R89r14R8J307j576M36
1611c66P52j115J230q42o71J026m37L91N93j368N13J85m55J186p06k90J022j071
1629d23M16N27q72Q91k5q44P07n50R3J141j127K38J62m69N59J05q52Q86o78J21
1649FK03n16K33L91n46K92l42k26O38n72L87J76q54O20j89k37L71n26J34K69o80
1670i68O72K73l05K86l7o33M70M9R8K89m94J28m8k25N47K2m50M83j98j11N7J43
$$ y = [165, -1207, 1020, -426, -51, 1165, -428, -685, 583, -977, 1201, 674, -913, 965, -301, -32, 1151, -722, 557, 826, -870, 1185, -72, -306, 1014, -380, -511, 649, -477, 779, 609, -739, 136, -782, -200, 1199, -674, -202, 171, -937, 713, 423, -745, 648, -362, -50, 455, -1339, 233, 802, -567, 235, -489, -899, 420, -260, -81, 41, -1102, 260, 408, -706, 283, -631, -533, 774, -802, -366, 386, -729, 501, -341, -1012, 14, -423, -32, 561, -807, -294, -109, -564, 622, -84, -374, 648, -423, -7, 520, -352, 539, 514, -330, 377, -173, -80, 1061, -66, 172, 334, -135, 424, 529, -323, 563, -115, 6, 209, -307, -74, 317, -229, 63, -279, -505, 133, -439, -52, 124, -730, -110, -299, -536, -165, -691, -557, -288, -968, -296, -23, -328, -42, -79, -712, -242, -193, -95, 194, -300, -172, -220, -445, 102, 124, -326, 157, -41, -152, -95, 48]
1692D8J24l1K3k17K6P6K22o9J28k59l34L48q5J72j4m99J05J89J40Q3rk9k06K06
1716A38rJ13J18M9K49m92Kk78L22K70j28%l1m31k73N17j87J30o4l3l05M03N3k56
1740a23l5k4k34J07o7N9J80j75l07J06J56M3Q4P1j18k44LJ91K52K3p8J0m0Q1j51
1765b30K46L12j27j37K64l45M92j46N0K5m20J69M7L7P5Q1m54M35l99K23Q1p9L8
1788B38J72m03N4J97q8J06l17r3M18k32K06M10p03J38l4O3R4L2j01L49o01J20
1810B5o5l8O72k33n69L80n96N05p4k74K18r3m04N25n12K71O26r01N24m65j70P44
1832I6r0k31L89j008N52N97r73Q54l14k68P63o19j95O89n32P13J49j173Q23j53
1852F9j01J202j411K08O23o75J136o80j087J365k03l76Q61j565Q72P64j384R13
$$ y = [48, 172, 141, 164, -53, -27, 49, 271, 202, 330, 71, -263, 85, 0, 172, 158, -341, -236, -47, 93, 176, 167, 138, -68, 138, 129, 242, 360, 409, 658, 166, 168, -110, 212, 482, 354, 354, 323, -108, -381, 136, -51, 79, 15, -18, -323, 80, 133, -123, -158, -182, -416, -309, -376, -317, -137, -312, -619, -513, -357, -314, -230, -159, -277, -521, -518, -327, -75, -52, -130, -120, -160, -79, -230, 16, 328, 201, 64, 328, -17, 475, 329, 379, 404, -16, 153, 200, 237, 312, 393, -61, 374, -25, 198, 279, 200, 238, 410, 7, 61, 258, 170, 276, -41, -134, 284, 52, 258, 668, -35, 103, 69, 132, 226, 258, 157, 506, -95, 25, -40, -78, 594, 361, -208, 172, -424, 81, 7, -267, -49, -142, -546, -21, -533, -262, 364, -537, -13, -478, -648, 96, 6, -225, 164, -844, -292, 305, -668, 186, -128, -396, 367, -252, -447, 242, -290, 423, 572, -601, 222, 69, -32, 1170, -241, -33, 590, -85, 1051, 371, -716, 649, 446, 70, 931, -634, 238, 1002, -382, 531]
1870E31p43l11J453o07m64L28r07J269K14j289N16m24K02J050j429K58P27j060
1888f86J224n58j339J601o07L24O21k198J210O76r09J189j055o57K126j277J68
1905a47N13j542J553J68j508J038j077O88J474j761P6M29j260K377n14j632J206
1922H1n47N68J042k407J044R14j242J563j533n94K227j070J61K84j967J909P57
1939A190j451J043j664K78K191j878M16K04j073K305q78j520J506j206J144Q57
1955A464k892J129N20o36J884j754j159J962q73O94M38k353J901p2j061J496j949
1972a261N85K264k246M16k14j113K593m15j516J023j184J098J280k070J105k19
1988A26m05J550j569q46J938q65J000j29k430K008J81n82J427j969J40J611j476
$$ y = [531, -212, -523, 930, 323, -141, 187, -720, 549, 763, -526, -10, -434, -232, 818, -611, -353, 374, -686, 538, -20, -1359, 242, -365, -41, 580, -1618, -408, 268, -641, 548, -507, -1164, 962, -315, -147, 366, -1176, 377, 545, -963, 75, -1002, -314, 1160, -601, -525, -96, -1356, 1021, 507, -1125, 81, -466, 102, 1144, -1263, -219, 695, -547, 1016, -517, -1111, 1116, 46, 207, 491, -1476, 433, 1190, -261, 782, -882, -604, 1587, -291, 125, 329, -744, 1561, 683, -837, 669, -537, 607, 1464, -1428, -299, 221, -415, 1469, -285, -1444, 518, -355, 339, 777, -1576, 325, 253, -808, 688, -1261, -676, 1588, -658, -242, -456, -1569, 1024, 609, -907, 116, -1068, 30, 1310, -760, 345, 126, -279, 1271, -298, -1144, 794, -71, 929, 800, -1630, 378, 559, -23, 1404, -565, -425, 1186, -290]
2005b90P40j91j173K048p36o21Q68j443J193J000j983N90l4o42K251j668q93J555
2023E71j293J251N14k213J475p5o88J509j898N62J177j190Q65n88j281K045l20
2040D23p44O76j366Q52R44j395P32o24l42J718j363k18J013j156J157p6j404J083
2058i0ol13J101j588M11Q13r03J017n22q85J350m90k69J006j363P39R38j380R16
2077D82m94l33J555j069o7O60r95J122j39r43Q49m89J78L04r71N54N25r76Q04
2096E57m89o11J018n20M9K98q56N28L86p45R65q57q8P30m71J87M33q02O00j69
2116A43p60Q16n32J78N98p60K07M72o70Q24l56m69M10l01J60N08p23O03kl94J00
2137E2k39r9N29l26l7K27l97J97Q4k18L29k26J41K70m95K98M51o11L05j91n1L64
$$ y = [-290, 450, 259, -914, 1134, 398, -223, 645, -798, 395, 1395, -588, 2, -32, -674, 1577, -91, -984, 571, -722, 529, 1043, -1170, 305, 230, -458, 1051, -847, -285, 892, -298, 567, -21, -1302, 743, 423, -321, 355, -1011, -159, 785, -610, 122, -502, -844, 874, -489, -707, 306, -850, 307, 231, -1173, -90, -96, -409, 692, -896, -485, 328, -575, 442, -80, -965, 385, -105, -374, 632, -731, 8, 946, -434, 482, -12, -345, 1210, 141, 74, 734, -261, 861, 722, -221, 628, 139, 317, 621, -350, 204, 729, -247, 557, 68, -543, 475, -45, 4, 302, -554, -26, 360, -385, 580, -277, -365, 365, -106, 81, 514, -288, 312, 143, -617, 199, -333, -155, 443, -317, -110, 362, -308, 516, 160, -309, 101, -200, -40, 468, -255, 348, 346, -48, 52, -187, -286, 243, -83, -120, 107, -290, -93, -9, -227, 102, -124, 17, 287, -208, 90, 541, -70, 235, 44, -7, 357]
2159C57m6o4K7j32J8J74j75L23k19J29p5k49m2L82j17k11J30l39K21j99K22j28
2181a3j16k25L18MK7j90KJ29j93R8NK3n4P4j29K6K60l36J3J74L26m48j18N6K82
2206eM1j67J58j68M3J98J7j21O5j37j84K46Oj20K35j17nk06R0J38L34k91j65p0
2230a85L63j98L17m2p4Ok26J01O9j4M9j28p3O7K04J10j71J47j3k56l5K15j26J46
2254B53J30m11J72m87K25J83M2j15k09r5j33J89J51k6k00L5J74k03K13J99j74
2275h7J10m98K48K58j99p0j26Q4L63k42M3K38k30r1L89n87N53K3l47O53n08r1
2297a14L74l78N41j84k77K76l1j5K41n91j44P00n82K30J04m1J76j34j93O7l69
2318c44M63M35q12N52k48k16P46o15l97J000q12J76L62r04O60J13k13M67r67J71
$$ y = [357, 311, 247, 274, 142, 160, 334, 159, 482, 263, 392, 317, 68, 26, 408, 291, 80, 210, -129, 92, -107, 115, -13, -129, -354, -36, -32, -5, -195, -193, -64, -257, -159, -154, -131, -185, -111, -240, -214, 46, -290, -277, -103, 223, -225, -343, -287, -5, 36, -131, 27, -141, -98, 100, 117, -4, 61, -76, -260, -14, -8, -128, 107, -10, -15, -221, -131, 7, 341, 50, -115, -185, 178, -20, 297, 255, 181, 187, -39, 62, 131, 117, 166, 38, -35, 32, 236, 346, 175, 322, 309, 53, 18, 233, 107, 253, 383, -28, 144, -343, -118, 65, 107, -8, -217, -312, -445, -256, -105, -131, -331, -296, -122, -325, -112, 87, -87, 23, -475, -227, 31, -168, -238, -364, -280, 83, -159, -116, 122, -108, -199, 190, -397, 156, 179, -168, 485, -23, -114, 260, -118, 423, 239, -38, 238, 207, 192, 433, -158, -302, 398, -184, 46, 150, 109, 285, 151, -42, 25, -344, 119, 554, -258, 294, 46, -170, 576, -39, -436, 564, -248, -72, 290, -614, 46, 159, -54, 413, -554, -383]
2338c83J028r49K49j86m04Q32k72k67N98p67O08L61j200P25l13l27J266r46l22
2357f69Q13m94L42M23j315J027l4j96P93j482M48R12q93N63r5r73J849o28m65
2376g4N38r89P44N34j116Q49p95P0J045p99j28Q07q67Q20R9j372R53j42K45O05
2396A027j722M33J069r76R05p97p21J444l47j87M72j410J066M55j249Q50o20k4
2414c32J190j266j36O51r33J550k58j298R45m31N2J063j611M65P50r49J034o95
2432b09j164J726m87K28O54j869J043M84o56P73r66j20J865j426j28N43j315J671
2450F47qj188Q07p50O70R87j712L10N24p76J403p06r20J029n76O44M08j724J027
2469I6L68n72P03j265J10J669j063J08n4j128J762k83q19P83q49M20J288j731
$$ y = [-383, 645, -304, -55, -241, -645, 187, -85, -352, 246, -521, 87, 448, -752, -27, -340, -667, 599, -347, -669, 144, -350, -8, 415, -900, 127, 93, -103, 690, -792, -344, 568, -325, 238, 143, -830, 1019, 391, -74, 464, -525, 219, 753, -363, 486, -309, -239, 806, 7, -121, 686, -181, 639, 738, -634, 319, 177, 422, 1027, -695, -262, 807, -169, 736, -61, -782, 662, 315, 128, 600, -810, 256, 711, -538, 312, -308, -332, 858, -408, -544, 107, -826, 724, 466, -832, 113, -318, -266, 797, -814, -349, 401, -548, 486, -209, -1373, 353, -134, 94, 748, -1121, -78, 406, -250, 523, -443, -563, 1302, -124, -252, 291, -1024, 647, 639, -549, 258, -492, 178, 1165, -547, -237, 287, -489, 914, 208, -712, 317, -259, 385, 793, -931, 96, 464, -108, 595, -670, -560, 1109, 46, 154, 100, -1028, 734, 451, -368, 415, -434, -14, 1274, -457]
2487d57K18K80m67J246p58r78J061m79M62M79j536R21J76m98P79r81k97J417p98
2506b10M10m02p50J183K50r18P68j081N62J181j622O07Ql37J150n35q63Q48m19
2525a70M93K92j234Q28K71l43N57j002K03P61q36N87k33p59R84k9k95J55j011
2544g81O93L37l48J60j67n10J458n05r77M39o1P8M80r76M75J93m89J022j047K80
2564b46Q40o89K32J39r83J211l73m77N66p07L80K43j087N21O1n68J443j108J48
2583d54L31n09P23k03p30J179k94j183J773k58j053M72k62J230m20o9m6K22k7
2602D22m43o57N15K55K45l28M19m11L71j31K9J72l35Q7N3j30j04n6Q3J16L8k28
2624a8J54j62J00p7k71N12l10k65M45r3k51J90q9J89k17J21J98k02q7K6j01m1
$$ y = [-457, -239, 41, -426, 820, 62, -916, 145, -334, 128, 607, -929, -8, 168, -330, 449, -532, -829, 588, -210, 200, -202, -952, 231, 481, -437, 331, -750, -188, 993, -629, -22, -14, -351, 799, 264, -599, 249, -170, 323, 615, -619, 209, 480, 137, 694, -308, -105, 656, -180, 407, 174, -585, 399, 370, 75, 230, -781, -88, 249, -99, 61, -106, -616, 842, 337, -640, -201, -262, -184, 296, -680, -205, -12, -501, 521, -526, -246, 594, -95, 137, 276, -707, 504, 131, -346, 220, -487, -107, 136, -951, -430, -369, -937, 506, -602, -454, -123, -632, 91, -112, -842, 337, 43, -1140, 633, 375, -678, -206, -468, 762, 342, 273, 227, 449, 422, -21, -678, -163, 92, 337, 9, 428, 17, 388, 257, 286, 458, 123, 210, 263, 133, 29, -27, 56, 172, 210, -18, 136, -26, 74, -3, -274, 238, -72, -337, 108, 15, -236, -46, -135, 54, -163, -42, 156, -46, -133, -107, -208, -249]
2646b49K65j39K35l40K01M7K21m55L64k02J05K4k58J30J29P5k04j2RN5rL3J84
2669B09l22qJ10Q3j66J72j51j1j9J84K42k43K01k81m0J22M4J25Jl9j97R0K13P
2693C26l21J24J01j36L49k32j47p4J90l34J91kKp4P6l4P1k75j5J62K0K0m28K35
2717b05M7N4J87k85K2L0j20J88l9K05j81j00K31J67l90J14j53J36N0J70k16J88
2739A00l37J90L2R0j36K81p7Q9k41k0J28p1p1P6j36L16q1r5m5J25L9K35q5q2k15
2764IJ4Q3J36k68L4r7J0M15o06M96rm02N11n30J05J76Jl3n8k37M46k52L7L38o28
2789c09J92K25l12J04J37m18M34m25Q5L90k57N0K12m12K05K22k45J27j02j82L56
2810G7j83K07J72o42N27J47k85R6n16K83N99o87R4J3QN53l62j25K49l18J57N91
$$ y = [-249, 16, -123, 112, -228, -27, 20, 241, -214, 150, -52, 53, 77, -181, -51, 78, 153, -51, -63, -54, 1, -8, 25, 209, -113, -121, -11, 72, -94, 78, -73, -84, -103, 81, 323, 80, 281, 0, -40, 82, 126, 251, 252, 213, 16, 106, 319, 326, 5, 129, 230, 94, 443, 211, 64, -10, 180, -154, 37, 35, 37, -37, 39, 5, 76, -199, -214, -52, -32, -12, -440, -205, -158, -104, 83, -202, -180, -150, -270, -82, -121, 84, -97, -197, 34, 201, -189, -75, -228, -92, -42, 128, -88, 100, -237, -47, -15, 75, -61, 220, 143, 232, -9, -29, 99, 28, -43, 33, -103, 213, 132, 37, -8, 117, 156, 391, 306, 224, 9, 23, 106, 242, -26, 8, -89, -79, 336, -270, 226, 217, -185, 326, -204, -99, 77, 78, 45, -13, -250, 196, -56, -19, 319, -309, -117, 108, -204, -100, 37, -381, 53, -372, -287, 103, -154, -104, 108, -304, -99, 123, -122, 5, -97, -279, 77, -106, 101, 273, -369, 158, 305, 20, 116, -400, -117, 482, -205, -111, -98, -90, 463, 101, -24, 225, -93, 64, 655]
2832F55j044N79jo8J26k02k17L69J80j18l04l53P75Pl44K61m73J99N03o88K99
2853A41k93k2O08m86m54M74k20M71R4q64M10L19m90O65q93K85J82k68N43m07m22
2874f27P94q3j52L04p13L45O46o64J16k0m71R62l89m36O23p77P93K96r56L65J27
2895H3k87O84n50k89Q06o51N15P3j114J018J1l52Q45j138M28N25o33J88k36o4
2915a38P52l97m98N11o05O47N18q83J17j14J18O69q80m7M63m04M82k66m85P36
2935B96j62m46O64p81K30O53p99P31p22l25J088n19k49O89r71R77J58r54K99j46
2955b89k61R10n54l22M32k97Q34m37m55P14m40K95M38j239N88J16K37M4r57P2
2975e71J419p24k2j26l95J017m13k72J88l43O2P34o02M9Q1k90N6P21j318Q72p0
$$ y = [655, -389, 190, 189, 121, 247, 45, -172, 197, 377, 259, -45, -398, 377, 384, 40, 301, -172, 27, 530, -158, 141, -152, -174, 434, -52, -506, -32, -252, 219, 313, -551, -141, 178, -312, 353, -540, -255, -73, -341, 202, -205, -627, 167, 84, -68, 236, -477, -132, 514, -150, -34, -54, -525, 437, 48, -388, 235, -542, 251, 547, -409, -44, 83, -204, 480, -70, -359, 447, -204, 311, 384, -730, 288, 299, -53, 792, -346, 82, 607, -26, 162, -74, -138, 614, 217, -281, 230, -375, 272, 790, -93, 24, -90, 28, 697, -183, -230, 233, -171, 311, 45, -440, 296, 134, -312, 352, -429, -199, 454, -345, 386, -336, -661, 427, -92, -341, 348, -623, 354, 512, -442, -143, -289, -550, 360, -194, -516, -84, -381, 453, 16, -439, 275, -165, 130, 568, -671, -83, 33, 270, 314, -643, -571, 848, 124, 102, -24, -419, 598, 185, -87, 101, -242, -180, 554, -48, 1, 82, -208, -152, 569, -749, 123, 53]
2996E3R3L38o76K79J73l04N11o70j07M34J1j39J9m50L63M85q45O56m43P4N38n02
3018a09J51k63l17O81P0n9j30K5N29k08p01J23L64q04J381j170k70J140J40j130
3038e57J054p44J65N49k86O02m95l27N23l37K20m02l65K48P36o27J77l35p1Q44
3058E72r26J57K89k3M71k95k48J97L18j98l95j02LO83o87J18R4k45L18j6l6r4
3080d5j79J75L08k21n1o1l5p3j28K96j07l4L03k39J01p1j53J42K2j92R0J15m59
3103d96M69j21p1Q2j80L73l8j45j0K30j00q2J20K6j8J39l83K38j26K66l17J11
3125c3J35k19J48k08N5K77j31J10J37j4k86O4Jl7J46j9l8k31J8K50j33Lo2O6j8
3150a9K33k72j75K39J35k9j80M7qJ04r7J99l17j0m8j8Q1J45k54K08r0j52L55r6
$$ y = [53, 146, 484, -192, 87, 260, -44, 467, -203, -310, 124, 135, -4, 15, -435, -72, 413, -432, 224, -219, -145, 393, -109, 42, -221, -538, 143, 213, 154, 24, 49, 578, 370, -331, -208, 156, -648, 733, -437, -707, 433, 573, -557, 497, -247, -82, 467, 181, 783, 288, -39, 484, 147, 367, -35, -400, -152, 584, -43, 134, -201, -272, 572, -354, -197, 92, 69, 540, 245, -3, 194, 512, 314, -81, -183, -180, 503, -184, -66, 28, -217, 101, 85, 49, -45, -224, -49, 259, 38, -13, -74, -109, -182, -310, -14, -121, -155, 148, -91, 10, -61, -214, -72, -50, -242, -152, -37, -496, -27, -148, -219, -137, -317, 56, 18, -127, -137, 93, -7, -89, 31, 57, 39, 178, -205, 33, -93, 173, -144, -33, 102, -117, 31, -177, -122, 155, 24, 134, 271, 257, -29, 35, 36, -1, 145, 126, 88, -143, -125, 125, -8, -5, -67, -1, -19, 214, -58, -233, 6, 141, 112, -68, -21, -29, 75, -22, 177, -140, -150, -198, -216, -135, 10, -244, -36, -126, -278, 77, -19]
3174a9N8j4r9j07K62n0j21R9o0j58J88n3J98l60J44O1m7J39L9p4o0J47j42o5K16
3199A22k07K68N3o8j28j3J98k8r3j14J02M4Jl1J7N7l7k09K6N2J58Pj60K38j92
3224F3j65K2J20o9o0J6K20j66p8J73o1p0k03OK13j5K06n00N12q6l70N12l32K29
3248A17l11j3K05P4l83Q3p8N14l00P1j11P4K6J25j45j23K28j87M74l26j53L10
3270A71k5j69J12l19L23J14k31J18k17J06Kj75K71P3k83P0J05j22K36j75j41M18
3292B62n46L60J61k38J56J48m11M50k26o8j7q5N3J88l96M31k22l2J83j37jK30
3314B43m13K56L30o06K35m19J61N96m44k41M68m59L36O9m32J97oj44L23l71J5
3335c06L31M0J24p8k96K17N6qJ04n18O39l8k94L81n52J14M13l06K3N2l72O21O1
$$ y = [-19, 39, 25, -74, -181, 81, 31, -90, 9, -51, -209, -21, -74, 124, -236, -92, -31, -78, 61, 100, 26, -34, 113, -29, -94, 122, -85, 183, 236, 168, 40, 27, 225, 197, 104, -10, 92, 136, 137, 106, 123, 180, 143, -66, -40, 12, 170, 177, 17, 255, 63, -102, -80, 40, -29, -89, -73, 147, -19, -97, 76, 15, -55, -258, -252, -39, -54, 152, -348, 164, 78, -292, 220, -112, 117, -194, -207, -2, 72, -311, -228, -306, 208, -92, -21, -132, -58, -32, 93, -52, -175, 53, -134, 340, 14, -139, 171, 146, -23, 89, -230, 93, 207, -24, 94, -123, -17, -15, -190, 81, 154, -129, -59, 46, -76, 160, -15, -156, 262, -284, 76, 237, -1, 155, 303, -108, 342, 116, 48, 31, -54, -1, 187, -209, 222, 0, -32, 151, 14, 13, 243, -170, 86, 416, -190, 45, -374, -213, 383, -61, -302, 166, -293, 43, 112, -320, -123, -129, -273, 50, -321, -306, 25, 65, 189, 111, -185, 32, 88, 80, 184, -334, 305, 267, -27, 354, -198, -84, 329, 23, 46, 98, -274, 347, 408]
3358D08n28K16qJ23J47o15J87L49m52K87l1k90L22j77J21K76p75L18K96l16L88
3379B46m38K31J37n3j33M12p36N68J38n47J83k43O7M94n62K67j22q3N87m77m18
$$ y = [408, -120, 96, 88, 211, 358, -257, -70, 279, -173, 114, 83, -207, 115, -62, 59, 335, -440, -122, 174, -142, 246, -192, 39, 176, 123, -10, 402, -334, 234, 372, -175, 8, -235, -168, 326, -236, 31, -91, -174, 413, -64, -482]
$$ [...]
8191i1
##END NTUPLES=NMR FID
##END=
