##TITLE=1H_SR30-kr2
 d6,8 sc, 
 11.02.2021
##JCAMPDX= 6.0         $$ Bruker NMR JCAMP-DX V2.0
##DATA TYPE= NMR FID
##DATA CLASS= NTUPLES
##ORIGIN= UXNMR, Bruker Analytische Messtechnik GmbH
##OWNER= root
$$ XWIN-NMR		Version 3.5
$$ Thu Feb 11 09:53:45 2021 Russian Standard Time (UT+4h)  she@DPX200
##.OBSERVE FREQUENCY= 200.1315066352
##.OBSERVE NUCLEUS= ^1H
##.DELAY= (6, 6)
##.ACQUISITION MODE= SIMULTANEOUS
##.ACQUISITION SCHEME= undefined
##.AVERAGES= 8
##.DIGITISER RES= 18
##SPECTROMETER/DATA SYSTEM= spect
##.PULSE SEQUENCE= zg30
##.SOLVENT NAME= CD3CN
##.SHIFT REFERENCE= (INTERNAL, CD3CN, 0, 15.7039)
##AUDIT TRAIL= $$ (NUMBER, WHEN, WHO, WHERE, WHAT)
$$ ##TITLE= Audit trail, XWIN-NMR		Version 3.5
$$ ##JCAMPDX= 5.01
$$ ##ORIGIN= Bruker BioSpin GmbH
$$ ##OWNER= she
$$ F:/spectra/data/she/nmr/H-F/1/audita.txt
$$ ##AUDIT TRAIL=  $$ (NUMBER, WHEN, WHO, WHERE, WHAT)
(   1,<2021-02-11 09:49:31.82 +0400>,<she>,<DPX200>,
      <created by zg, POWCHK disabled, PULCHK disabled
       configuration hash MD5:
       00 E9 B6 7A A2 85 ED C7 34 08 36 98 17 FE 4E 26
       data hash MD5: 16K
       F0 AD 84 D7 B1 88 85 48 9D DF E2 06 2F A3 0F F0>)
$$ ##END=
$$ 
$$ hash MD5
$$ D4 0B 9D CF 43 FA FC 15 52 0A FB 32 92 36 5F CF
##$RELAX= 
##$RELAX= 
##$RELAX= 
##$RELAX= 
##$RELAX= 
##$RELAX= 
$$ Bruker specific parameters
$$ --------------------------
##$DU= <F:/spectra>
##$EXPNO= 1
##$NAME= <H-F>
##$PROCNO= 1
##$TYPE= <nmr>
##$USER= <she>
##$AMP= (0..31)
100 100 100 100 100 100 100 100 100 100 100 100 100 100 100 100 100 100 
100 100 100 100 100 100 100 100 100 100 100 100 100 100 
##$AQSEQ= 0
##$AQ_mod= 1
##$AUNM= <au_zg>
##$AUTOPOS= <>
##$BF1= 200.13
##$BF2= 200.13
##$BF3= 200.13
##$BF4= 200.13
##$BF5= 200.13
##$BF6= 200.13
##$BF7= 200.13
##$BF8= 200.13
##$BYTORDA= 1
##$CFDGTYP= 0
##$CFRGTYP= 5
##$CHEMSTR= <none>
##$CNST= (0..31)
1 1 145 1 1 1 1 1 1 1 1 1 1 1 1 1 1 1 1 1 1 1 1 1 1 1 1 1 1 1 1 1 
##$CPDPRG= <>
##$CPDPRG1= <>
##$CPDPRG2= <>
##$CPDPRG3= <>
##$CPDPRG4= <mlev>
##$CPDPRG5= <mlev>
##$CPDPRG6= <mlev>
##$CPDPRG7= <mlev>
##$CPDPRG8= <mlev>
##$CPDPRGB= <>
##$CPDPRGT= <>
##$D= (0..31)
0 1.2 0 0 0 0 0 0 0 0.06 0 0.03 0 0 0 0 0.0002 0 0 0 0 0 0 0 0 0 0 0 0 
0 0 0 
##$DATE= 1613022571
##$DBL= (0..7)
120 120 120 120 120 120 120 120 
##$DBP= (0..7)
150 150 150 150 150 150 150 150 
##$DBP07= 0
##$DBPNAM0= <>
##$DBPNAM1= <>
##$DBPNAM2= <>
##$DBPNAM3= <>
##$DBPNAM4= <>
##$DBPNAM5= <>
##$DBPNAM6= <>
##$DBPNAM7= <>
##$DBPOAL= (0..7)
0.5 0.5 0.5 0.5 0.5 0.5 0.5 0.5 
##$DBPOFFS= (0..7)
0 0 0 0 0 0 0 0 
##$DE= 6
##$DECBNUC= <off>
##$DECIM= 32
##$DECNUC= <off>
##$DECSTAT= 4
##$DIGMOD= 1
##$DIGTYP= 9
##$DL= (0..7)
0 120 120 120 120 120 120 120 
##$DP= (0..7)
150 150 150 150 150 150 150 150 
##$DP07= 0
##$DPNAME0= <>
##$DPNAME1= <>
##$DPNAME2= <>
##$DPNAME3= <>
##$DPNAME4= <>
##$DPNAME5= <>
##$DPNAME6= <>
##$DPNAME7= <>
##$DPOAL= (0..7)
0.5 0.5 0.5 0.5 0.5 0.5 0.5 0.5 
##$DPOFFS= (0..7)
0 0 0 0 0 0 0 0 
##$DQDMODE= 0
##$DR= 18
##$DS= 0
##$DSLIST= <SSSSSSSSSSSSSSS>
$$ [...]
##$SUBNAM2= <"">
##$SUBNAM3= <"">
##$SUBNAM4= <"">
##$SUBNAM5= <"">
##$SUBNAM6= <"">
##$SUBNAM7= <"">
##$SUBNAM8= <"">
##$SUBNAM9= <"">
##$SW= 16.9725356469052
##$SWIBOX= (0..15)
0 0 2 0 0 0 0 0 0 0 0 0 0 0 0 0 
##$SW_h= 3396.73913043478
##$TD= 16384
##$TD0= 1
##$TE= 0
##$TE2= 300
##$TE3= 300
##$TEG= 300
##$TL= (0..7)
0 120 120 120 120 120 120 120 
##$TP= (0..7)
150 150 150 150 150 150 150 150 
##$TP07= 0
##$TPNAME0= <>
##$TPNAME1= <>
##$TPNAME2= <>
##$TPNAME3= <>
##$TPNAME4= <>
##$TPNAME5= <>
##$TPNAME6= <>
##$TPNAME7= <>
##$TPOAL= (0..7)
0.5 0.5 0.5 0.5 0.5 0.5 0.5 0.5 
##$TPOFFS= (0..7)
0 0 0 0 0 0 0 0 
##$TUNHIN= 0
##$TUNHOUT= 0
##$TUNXOUT= 0
##$USERA1= <user>
##$USERA2= <user>
##$USERA3= <user>
##$USERA4= <user>
##$USERA5= <user>
##$V9= 5
##$VALIST= <valist>
##$VCLIST= <CCCCCCCCCCCCCCC>
##$VD= 0
##$VDLIST= <DDDDDDDDDDDDDDD>
##$VPLIST= <PPPPPPPPPPPPPPP>
##$VTLIST= <TTTTTTTTTTTTTTT>
##$WBST= 1024
##$WBSW= 4
##$XGAIN= (0..3)
0 0 0 0 
##$XL= 0
##$YL= 0
##$YMAX_a= 47397
##$YMIN_a= -33526
##$ZGOPTNS= <>
##$ZL1= 120
##$ZL2= 120
##$ZL3= 120
##$ZL4= 120
##$ABSF1= 10
##$ABSF2= 0
##$ABSG= 5
##$ABSL= 3
##$ALPHA= 0
##$AQORDER= 0
##$ASSFAC= 0
##$ASSFACI= 0
##$ASSFACX= 0
##$ASSWID= 0
##$AUNMP= <proc_1d>
##$AZFE= 0.1
##$AZFW= 0.1
##$BCFW= 1
##$BC_mod= 2
##$BYTORDP= 1
##$COROFFS= 0
##$CY= 11.3945322036743
##$DATMOD= 1
##$DC= 2
##$DFILT= <>
##$DTYPP= 0
##$F1P= 15.9154993809931
##$F2P= -4.1035820241983
##$FCOR= 0.5
##$FTSIZE= 0
##$FT_mod= 4
##$GAMMA= 1
##$GB= 0.15
##$INTBC= 1
##$INTSCL= 1
##$ISEN= 128
##$LB= 0.24
##$LEV0= 0
##$LPBIN= 0
##$MAXI= 10000
##$MC2= 0
##$MEAN= 0
##$ME_mod= 0
##$MI= 1.114404
##$NCOEF= 0
##$NC_proc= 0
##$NLEV= 6
##$NOISF1= 3.799351
##$NOISF2= 2.8
##$NSP= 1
##$NTH_PI= 0
##$NZP= 0
##$OFFSET= 15.70392
##$PC= 1
##$PHC0= -10757.2
##$PHC1= 10.60095
##$PH_mod= 1
##$PKNL= yes
##$PPARMOD= 0
##$PSCAL= 0
##$PSIGN= 0
##$REVERSE= no
##$SF= 200.130013532006
##$SI= 16384
##$SIGF1= 3
##$SIGF2= 2
##$SINO= 400
##$SIOLD= 16384
##$SREGLST= <1H.CDCl3>
##$SSB= 0
##$STSI= 0
##$STSR= 0
##$SW_p= 3612.71676300578
##$SYMM= 0
##$S_DEV= 0
##$TDeff= 0
##$TDoff= 0
##$TI= <>
##$TILT= no
##$TM1= 0
##$TM2= 0
##$TOPLEV= 0
##$USERP1= <user>
##$USERP2= <user>
##$USERP3= <user>
##$USERP4= <user>
##$USERP5= <user>
##$WDW= 1
##$XDIM= 8192
##$YMAX_p= 0
##$YMIN_p= 0
$$ End of Bruker specific parameters
$$ ---------------------------------
##NTUPLES= NMR FID
##VAR_NAME=  TIME,          FID/REAL,        FID/IMAG
##SYMBOL=    X,             R,               I
##VAR_TYPE=  INDEPENDENT,   DEPENDENT,       DEPENDENT
##VAR_FORM=  AFFN,          ASDF,            ASDF
##VAR_DIM=   8192,          8192,            8192
##UNITS=     SECONDS,       ARBITRARY UNITS, ARBITRARY UNITS
##FACTOR=    0.0002944,     1,               1
##FIRST=     0,             0,               0
##LAST=      2.4114304,     0,               0
##MIN=       0,             -33526,          0
##MAX=       2.4114304,     47397,           0
$$ Real data points
##PAGE= N=1
##DATA TABLE= (X++(R..R)), XYDATA
0 0 0 0 0 0 0 0 0 0 0 0 0 0 0 0 0 0 0 1 -8 8 -8 8 -8 8 -16 16 -16 20 -24 25 -32 33 -40 44 -49 57 -63 70 -78 88
40 88 -97 108 -119 133 -147 163 -179 197 -215 239 -263 288 -318 351 -389 430 -478 534 -598 677
60 677 -770 883 -1032 1227 -1497 1897 -2545 3777 -6899 31165 47067 -17719 20365 18848
74 18848 5201 4458 21497 37608 4677 12042 25375 -8237 16691 35390 16275 4309 22097
87 22097 24720 -16727 13588 47397 1977 6018 19222 9360 1579 1957 31769 8957 -5531
100 -5531 24231 -8901 -7507 24977 6703 -4273 3689 13527 -11712 -19104 24682 5930 -17855
113 -17855 1960 953 -10973 -16889 7267 4046 -22512 3595 -8620 -27760 4124 -1262 -15215
126 -15215 -12654 -3002 -7264 -33067 -2610 10749 -25663 -14082 -1568 -15033 -20205 -7174 2345
139 2345 -18757 -10685 -2624 -24506 -8150 3102 -10112 -14229 -5693 2356 -23528 -12732 17860
152 17860 -10836 -15381 2880 -5090 -9225 -5904 8719 -816 -10415 7820 -6910 -9677 13770
165 13770 4692 -5684 1479 10815 -3902 -10728 19643 11705 -8080 6298 8327 1014 -504 12254
179 12254 13108 -3000 10348 7183 -6751 13809 14498 1396 3301 11588 7787 -8215 10204 21468
193 21468 -2431 1490 10819 2920 -684 6041 13131 98 2334 8875 -7253 2155 13166 603
207 603 -2813 3685 6385 -8991 -5476 15607 -291 -9533 3690 -710 -6938 -3081 4356 -1455
221 -1455 -6803 1773 -8453 -10000 4947 -852 -9514 -4905 1615 -8469 -15310 4996 2208 -13625
235 -13625 -4338 -2321 -8422 -8099 -1759 -493 -8578 -2962 -4217 -13226 -417 2775 -8508 -6241 1073
250 1073 -3167 -13121 -1465 7568 -6624 -6309 1546 -3319 -5431 -449 3485 -1984 -1224 2347 -6986
265 -6986 -1343 8621 -234 -3622 4482 4929 -5628 -2299 11854 3854 -2990 5016 3816 -152 2394
280 2394 7076 4638 2113 6462 0 -1375 10275 6755 -779 4619 8311 519 -2934 8927 9518
295 9518 -1111 2537 5856 601 1377 5386 4593 1752 4672 1242 -3940 4542 7414 -1630 -703 5441
311 5441 1079 -6178 1255 7349 -1525 -2974 1798 -1490 -3265 194 1005 -1692 -272 -553 -7063 -3258
327 -3258 3848 -2557 -6392 372 -69 -8110 -5892 2971 -884 -6115 -2404 -2265 -5747 -2964 -1043 -3031
343 -3031 -2304 -1552 -6408 -6396 1380 151 -6564 -2395 1855 -5434 -7120 1360 2022 -3920 -2453 -106
359 -106 -3139 -2586 771 -391 -632 1435 -1769 -4909 1769 4641 -1796 -1509 4763 788 -4501 1336
375 1336 5863 1670 -551 2273 1369 -203 3085 3054 1752 4236 2157 -2209 1586 6763 2861 -1182
391 -1182 4864 4832 -2115 755 6156 4486 875 1533 2767 207 1915 3722 1238 3427 3387 -1883
407 -1883 -1035 4448 3989 -1658 969 4635 -1542 -3224 2510 3553 -300 -1039 958 -1055 -1398 1432
423 1432 -1042 -119 1893 -2813 -4418 -36 2114 -2136 -3919 1729 -1068 -6508 -1358 1526 -1047
438 -1047 -2902 -2127 -1817 -3449 -1011 -1184 -2586 547 -1903 -5340 -2373 1364 -462 -4768 -377 1185
454 1185 -5052 -3008 1105 307 -1500 -2477 -543 -1985 -1129 689 -1394 1133 1349 -2997 -2082 2173
470 2173 2838 -1618 -827 3813 -1143 -2469 2278 2994 1631 -347 550 1476 -78 2540 1580 1387 3987
487 3987 -320 -1309 2796 4342 1580 -785 3380 2931 -2040 1176 4070 3125 369 47 2140 420
503 420 1860 1919 440 3432 783 -1912 839 2577 2548 -1460 249 3342 -2238 -1529 2260 1857 171
520 171 -1871 -176 -339 -858 554 -799 612 537 -3184 -2288 41 1463 -1800 -2957 1231 -1773 -4130
537 -4130 -428 231 -198 -2904 -2874 -358 -2188 -1093 -930 -1484 389 -2603 -3861 -1178 649 -582 -3650
554 -3650 -362 163 -3723 -1638 166 1054 -904 -3042 -125 -743 -1066 241 -765 1072 -108 -3103
570 -3103 -263 1113 1329 -886 -884 2319 -650 -1755 1072 2339 1770 -1133 129 1498 138 1390
586 1390 816 2119 2001 -1275 25 1814 2362 1426 -884 2284 1774 -862 1149 2577 3018 239 -436
603 -436 2180 1114 890 1160 1162 2511 -333 -753 1395 1853 1957 -901 378 2022 -881 -593 1000 2021
621 2021 624 -2196 688 667 -670 6 -270 902 -280 -2502 -760 494 521 -766 -2186 874 -616
638 -616 -2421 -899 260 605 -2910 -2111 399 -1272 -1367 -1006 -297 -209 -2716 -1712 -438 -144 -369 -2620
656 -2620 -683 198 -2259 -1542 -99 987 -1135 -2768 -75 64 -1164 -519 -335 859 -1299 -1940 285
673 285 647 718 -927 -782 1224 -590 -1025 157 1809 1285 -1569 71 2048 132 494 802 1469 1158
691 1158 -745 1028 1909 1803 1153 -498 1695 1109 -275 782 1647 3097 207 -470 2033 1168 -31
708 -31 1131 1767 1853 -1094 73 2167 1160 1725 -660 432 1990 -387 -131 907 1752 588 -1570
725 -1570 507 1244 -207 -636 -176 1319 -744 -1745 135 225 164 -863 -952 339 -574 -1505 -816 478
743 478 380 -2287 -1528 265 -557 -1483 -1100 273 -381 -2484 -1154 -116 -334 -924 -1434 -444 -502 -1726 -1384
762 -1384 -538 775 -1073 -2385 2 -145 -1118 -1201 -74 802 -1178 -1443 357 395 -29 -680 -211 634
780 634 -559 -720 118 1193 649 -1194 -49 1392 249 -351 305 1904 470 -1036 465 1675 1235
797 1235 219 419 1335 891 -126 665 1558 1911 -124 -342 1321 1253 255 211 1422 1458 -480 -19 1393
816 1393 1172 471 143 1007 915 6 -116 694 1395 433 -903 -97 1095 23 -646 380 1388 -708
834 -708 -1487 32 655 -132 -882 -126 318 -634 -1239 -560 372 365 -1429 -1337 -101 -24 -1155 -834 581 -363
854 -363 -2119 -1087 324 -212 -1033 -848 104 -756 -1191 -877 -153 231 -829 -1612 -498 356 -882 -1193
872 -1193 189 570 -1142 -1413 327 801 -561 -931 263 71 -758 -492 310 697 80 -807 -216 677
890 677 443 -287 185 1279 310 -1173 494 1755 534 -348 579 979 262 -365 829 1232 993 -29
908 -29 -308 724 1358 148 271 1816 1417 -442 -143 1559 1343 -265 242 986 565 -186 256 943 736
927 736 431 -323 -53 908 210 -741 530 959 -329 -1159 239 1161 -217 -916 270 287 -813 -901 149
946 149 440 -241 -822 -786 56 134 -981 -671 312 -389 -1425 -1094 805 -43 -1271 -401 146 -519 -983 -574
966 -574 169 -84 -1038 -1207 -558 60 -709 -1062 -147 512 -1032 -1502 182 656 -1040 -698 335 83 -519
985 -519 -650 623 803 -184 -423 -288 575 441 -416 410 1311 159 -669 279 1507 164 -361 589 904
1004 904 269 -69 828 1063 634 187 -14 724 1029 185 16 1106 990 -238 -173 1332 1180 -205 202
1023 202 1021 595 -117 -82 1030 532 -216 -425 29 1004 140 -330 331 578 77 -809 161 1098 -322 -668
1043 -668 129 367 -505 -934 182 347 -582 -579 -570 93 -115 -977 -553 237 -242 -1127 -739 564 -124 -1261
1063 -1261 -643 35 -392 -1339 -469 249 -302 -869 -921 -131 -31 -735 -620 85 107 -665 -823 75 146 -888
1083 -888 -784 84 298 -564 -610 520 313 -354 -524 65 486 12 -484 216 701 175 -373 127 998 318
1103 318 -249 229 1101 297 -534 752 1289 48 -286 248 838 586 -254 462 772 482 -116 -13 869
1122 869 850 -119 125 663 516 -271 -93 1156 338 -435 -100 313 734 -234 -17 611 168 -132 -311 244
1142 244 606 -161 -572 236 517 -261 -794 255 518 -463 -699 -26 320 -476 -670 -42 -97 -404 -659 -526
1162 -526 271 -112 -677 -213 -61 -175 -1021 -637 512 -188 -979 -479 22 -228 -649 -211 52 -243 -539 -486
1182 -486 333 141 -418 -346 139 41 -527 -611 548 346 -306 -296 265 432 -371 -149 691 400 -176 -323 150
1203 150 738 147 -326 521 777 392 -433 296 1172 317 -99 358 866 274 -336 515 454 180 -90 140
1223 140 821 486 213 209 232 593 -290 -214 632 302 -331 -123 665 525 -288 33 424 208 -358 -115 326
1244 326 377 -36 -306 156 310 -217 -821 127 380 -91 -599 10 315 -439 -649 78 -42 -210 -576 -165
1264 -165 214 -457 -569 -170 162 -74 -805 -257 141 -318 -794 -380 28 -156 -726 -298 245 -317 -535 -287
1284 -287 380 96 -488 -434 -112 295 -255 -437 328 240 -311 -557 374 559 -460 -459 451 276 -332 -365 293
1305 293 357 -99 21 18 260 65 -204 259 728 201 -294 333 774 38 -109 494 639 41 -188 357 617
1326 617 199 -34 82 805 426 -260 256 476 433 -405 -211 522 329 -264 -24 261 263 -184 -108 331 35
1347 35 -187 -113 31 151 -148 -384 287 432 -319 -521 -17 711 -347 -434 77 -28 -279 -414 31 -48 -370
1368 -370 -228 -318 -59 -242 -642 -274 329 -18 -727 -404 278 -71 -529 -157 222 -115 -495 -153 278 27
1388 27 -497 -194 -172 -89 -352 -224 300 170 -172 -308 225 229 -77 -137 498 198 -325 -36 752 156 -408 1
1410 1 199 355 122 -84 382 513 298 -416 7 717 -78 -329 545 521 94 -494 206 655 189 100 323
1431 323 385 400 -8 339 344 74 -200 -137 458 275 -314 -119 404 409 -599 -24 417 272 -504 94 124 -33
1453 -33 -89 -417 354 274 -228 -213 74 239 -273 -645 241 242 -92 -406 156 373 -223 -187 -80 103 -331 -352 11
1476 11 -44 -245 -440 -189 186 -76 -583 -117 169 -262 -486 -81 261 91 -317 -19 137 214 -160 -200 217
1497 217 119 -168 -232 358 239 -208 -422 120 21 -488 -78 370 240 -152 -95 155 233 80 -167 180 514 -10
1519 -10 -403 215 553 196 -139 62 388 64 144 271 275 -10 -320 72 373 144 -190 -15 277 327 -127 117
1541 117 495 124 -161 69 495 313 -270 65 226 240 -168 -183 310 -48 -85 -233 -244 174 -429 -222 376
1562 376 211 -530 -340 67 189 -382 -147 -41 -62 -260 -403 -221 -69 -90 -510 70 204 -140 -207 -45 178
1583 178 -107 -360 35 411 131 -256 -92 163 -239 -157 -226 108 203 -180 -285 185 227 -410 -106 136 132 -233
1605 -233 42 170 3 -278 104 -170 215 78 -17 114 269 -34 -19 505 320 -38 -293 312 466 33 41
1626 41 72 14 -57 96 264 148 302 -25 -106 291 81 -185 -47 487 172 -212 129 494 -99 -401 93 380
1648 380 -157 -40 35 -273 144 -92 -54 111 29 -194 -414 87 105 -435 -289 450 46 -482 -25 185 37
1669 37 -232 103 72 -112 4 -291 -165 94 -190 -555 114 241 -392 -343 181 164 -345 -172 317 -85 120
1690 120 229 -301 -205 -96 -219 -82 251 159 -281 -205 334 -35 -687 33 539 -119 -291 98 245 -12 -58
1711 -58 173 37 217 272 -236 -96 489 48 -385 460 389 -488 -205 297 182 -145 -22 447 -65 31 86 -236
1733 -236 74 548 201 -268 483 182 -311 84 552 -156 -287 373 154 -68 -180 274 392 -170 214 31
1753 31 6 163 -57 -346 10 427 -283 -334 401 -153 -595 -75 262 4 -309 319 161 -328 -335 17 45 20
1775 20 -92 -403 -48 275 -40 -632 317 131 -292 -416 240 20 -333 187 343 -32 -312 -93 -229 -155 193
1796 193 13 -398 144 54 -248 194 350 -195 -340 45 418 -164 -370 251 160 -273 304 -60 152 232 62
1817 62 -14 -44 268 -87 -303 202 365 -325 -104 551 -62 -296 94 376 24 -30 166 -27 47 48 -247 35
1839 35 362 6 -195 310 482 -350 -448 366 138 -250 113 249 -176 -279 -86 67 -68 169 70 -274 75
1860 75 32 -289 -95 235 147 -442 32 203 -117 -433 120 28 -116 -52 -118 -171 6 42 -237 167 365 -324 -123
1883 -123 282 217 -364 -154 118 42 -55 49 55 -153 -60 -37 -15 53 54 -288 -263 199 59 -410 36 227 -126 -266
1907 -266 59 123 -253 -130 178 -76 -41 97 135 169 149 -199 -342 155 153 -80 147 314 -90 -415 47 160
1929 160 -37 -173 110 -1 -82 -104 197 144 132 95 11 -92 210 -124 -113 103 297 -189 -176 200 143 -325 -161
1952 -161 67 82 -27 244 125 -143 98 -99 -185 133 -15 -325 -32 59 -54 -296 359 264 67 75 -93 179
1974 179 155 20 14 34 -9 -108 -188 157 112 -250 -136 361 -165 -225 -69 129 180 -243 -91 134 49 -142 -52 -173
1998 -173 204 -119 -432 257 131 -46 119 346 177 7 75 181 297 -371 5 -88 -160 -13 -199 213 53
2019 53 49 13 80 163 24 -100 139 317 -22 23 181 62 193 31 -38 -25 87 -14 132 166 230 228 3 134
2043 134 83 -3 43 181 152 -105 -156 -148 -137 -11 -281 -216 61 65 -214 128 -25 162 -41 54 129 -47 -147 -267
2067 -267 121 91 -13 70 232 -143 136 -40 67 -268 -82 -1 81 250 -262 -77 49 -20 -232 259 15 105
2089 105 -162 -95 -72 -40 55 -139 12 76 59 109 51 68 -384 -49 175 223 -187 -112 42 59 -118 -4 24 72 -130
2114 -130 53 -174 37 61 -89 -28 49 1 -9 256 145 -119 -95 132 149 -81 -116 59 4 32 152 174 -37 155
2138 155 -19 -55 72 -43 -193 -109 126 75 -131 153 -13 276 64 183 -87 90 99 25 29 167 -54 -109 -59
2161 -59 6 137 -168 10 136 -41 -19 -44 -113 29 67 22 -11 103 -170 6 3 17 108 -115 -156 -39 -438 147
2185 147 229 -46 -254 -94 125 -235 -246 -127 135 -45 39 -109 22 218 122 -12 167 69 -175 -183 20 -72 -132
2208 -132 62 67 5 -102 98 11 221 54 161 344 303 85 -180 -88 -80 -116 -108 15 181 -167 -126 230 62 -59
2232 -59 -8 -52 118 96 171 26 98 238 -118 26 -253 74 -10 72 128 -83 -160 -24 78 -456 28 234 111
2255 111 -19 -188 2 47 8 -89 43 -273 113 -161 -160 129 8 81 -9 173 63 196 136 -52 130 -284 -63
2278 -63 -178 -96 -207 32 15 106 -296 -22 -11 7 -122 -91 4 -5 -21 -196 -4 54 158 -83 -33 -66 99 -281 77
2303 77 32 -75 -160 25 203 109 89 -181 -195 264 53 197 159 39 69 -167 34 32 -285 -239 -78 167 42 68
2327 68 182 -243 -46 -196 -56 -31 -16 75 -44 163 156 157 -4 104 -83 -89 111 192 30 121 -193 60 112 42 15
2352 15 -112 63 46 43 92 207 -34 -84 -101 -67 -84 -151 -20 38 -241 176 232 -11 189 -102 -91 327 -102 100
2376 100 -131 396 -33 -189 -114 -41 104 -88 124 -68 51 59 71 -110 -374 -43 -40 176 -211 -338 337 -97
2398 -97 -84 -13 39 -29 -40 -24 -78 -248 46 88 77 -7 162 12 -57 240 -99 27 59 82 -68 21 50 45 -14 -303
2424 -303 147 130 -51 -82 193 -124 -69 -22 94 -160 -59 159 -22 -140 206 -108 -47 -92 21 167 122 -190
2446 -190 25 -32 184 47 68 8 -125 7 68 59 -14 -158 -5 -43 224 44 -111 13 -115 -79 -133 271 -188
2469 -188 30 126 -162 181 90 -35 -70 -108 -164 100 134 -141 -169 -46 -200 -167 77 159 -32 -53 -87 -108 243 -170
2493 -170 79 116 125 -204 -29 -35 137 19 -232 -47 -272 110 -53 -56 -64 -9 -58 -201 207 -107 21 30 43 -27 -220
2518 -220 -6 -54 -227 55 -79 -7 224 96 -39 -131 160 -58 -97 49 -115 71 80 -140 -142 47 -89 73 -73
2541 -73 131 -49 -74 -44 101 130 24 217 -35 77 134 -181 -45 -114 117 -10 159 31 -90 288 -202 64
2563 64 27 244 -72 -316 171 -1 -141 -105 -304 -13 -39 -147 -102 -75 -21 -27 -53 20 -237 89 87 126 9 -132 162
2588 162 159 81 -67 252 -25 171 -217 86 12 29 31 -167 13 145 64 -264 132 -141 106 56 19 76 187 72
2612 72 -27 -141 -28 43 -113 -201 74 362 64 -26 119 -26 -51 -79 -43 15 -25 43 131 -84 166 -21 -69 43
2636 43 84 255 315 -36 -54 -78 -131 -88 -78 -87 14 154 14 87 243 141 119 146 64 126 69 -5 -64 81 -134 115
2662 115 334 -28 183 -113 -32 297 160 -191 195 120 -182 275 -232 68 -156 -179 -120 -319 -102 -171 262 -586
2684 -586 -379 -503 -228 -145 -388 -1 46 50 247 -289 145 -235 227 83 -261 103 34 -300 -88 43 -21 -12 -100
2707 -100 -166 -103 -84 130 93 85 5 -176 17 149 -103 103 -65 25 -164 161 240 -11 119 138 127 24 -424 -56
2731 -56 145 2 -17 -45 -55 -26 -138 -178 -65 -37 -134 -2 69 112 36 263 140 56 -217 -147 -80 -160 -112 -48 121 73
2757 73 165 -233 -96 21 -115 48 84 -6 -6 69 -85 -28 79 -300 121 159 -16 72 -122 364 57 117 15 40
2781 40 60 -67 -42 12 -236 81 29 134 -286 115 -244 3 61 78 -121 95 -39 1 -17 125 140 -51 49
2804 49 54 -66 35 173 -47 62 -138 177 75 -34 -136 276 55 -53 156 15 -17 29 63 -97 -40 161
2826 161 -59 -295 -17 -18 -60 -238 -94 -95 -27 -285 163 -22 371 1019 255 -33 -491 -375 17 36 -244 45
2848 45 -275 -156 81 87 -108 -227 -120 -49 -34 35 186 -128 -173 80 72 -72 152 192 -185 -217 -198 -67 49 -19
2872 -19 -3 -14 107 208 -144 -140 -154 -41 80 -97 25 56 -232 -133 128 -77 33 -100 -30 -80 137 -214 1
2895 1 6 39 3 40 24 164 91 189 258 -180 -89 -227 -319 -139 -278 -236 -76 8 68 -23 -20 57 5 -55 335 191 -37
2922 -37 -94 111 -52 -4 63 -66 -4 -124 73 -110 -53 -72 -19 -124 -230 -34 -22 -8 15 123 162 -27 -159 -182
2946 -182 30 76 -220 144 -76 -58 70 -13 41 43 214 48 145 -50 -75 -119 233 46 57 -4 23 -104 -191 120
2970 120 -92 -18 11 76 -163 83 21 2 46 -163 59 -98 -74 165 -58 2 60 -20 -131 -2 -3 -32 329 77
2994 77 -28 -61 219 117 -328 -260 43 124 130 128 53 133 159 74 243 30 -41 -172 -38 156 -62 -112 -54 -8 114
3019 114 156 26 9 19 -13 -21 91 25 31 -166 122 18 -159 31 -219 107 -103 73 19 -136 -51 -296 156 -172
3043 -172 138 186 79 -95 -69 -178 -59 -107 142 -25 184 -119 -244 -183 17 86 54 -279 -60 -1 131 112 21
3066 21 -43 -126 96 -181 31 -60 -174 -83 183 204 11 -63 27 96 -4 -73 37 27 -99 133 121 -58 36 -164
3090 -164 32 -205 -29 -176 -123 107 -129 -126 104 112 -43 89 -22 93 166 55 -38 74 111 200 -159 235 107
3113 107 70 -3 -251 72 -281 299 22 15 -107 57 -114 204 67 148 -18 -143 -183 -82 -5 -109 -58 46 130
3136 130 141 221 57 268 -77 -60 29 -271 140 -254 31 27 -78 -79 -114 65 39 71 74 -121 -17 -166 166 -44
3160 -44 -180 186 51 10 -40 -45 82 307 8 4 109 20 -159 -23 -253 55 10 -137 48 99 -91 -103 34 29
3184 29 56 75 119 -7 -306 -15 132 58 -221 102 122 80 -185 20 137 198 -8 267 51 126 -64 3 238
3207 238 170 -51 -31 -124 120 66 -71 -96 -182 26 2 -109 165 -14 93 139 -277 -97 54 87 73 135 14 14
3231 14 18 4 -18 95 -73 231 58 218 -311 48 356 137 59 -73 61 -105 215 -72 -149 -297 -48 -46 -31
3254 -31 -21 -185 108 -165 -110 -116 25 54 -169 42 55 -204 97 64 111 -22 -44 -49 -159 82 53 -218 59 18 88
3279 88 197 -304 -170 -77 -197 -156 -124 88 -7 -1 -62 247 -179 -39 221 -48 50 134 18 153 -71 -119 79 197
3303 197 34 51 268 -131 -269 109 -33 -15 68 49 70 210 -56 -36 79 -75 -34 47 2 179 31 105 -31
3326 -31 73 87 -239 116 12 42 114 3 48 132 285 105 -65 -64 -81 24 157 131 -183 187 -125 -21 237
3349 237 258 208 328 562 194 -199 240 -315 -219 376 462 -187 -46 -116 -387 192 93 280 -354 -123 191 334
3371 334 27 -174 -166 -131 -27 304 -161 -87 162 105 -130 85 -276 140 -82 58 166 22 318 7 -227 -59
3393 -59 -50 -156 -55 36 294 -238 -96 -58 -70 246 -35 96 -71 160 -214 213 -92 -55 187 -20 37 -92 -19
3416 -19 95 -49 139 245 110 -88 -156 133 89 -208 -97 145 114 -89 -119 12 -309 -164 159 89 -182 -55
3438 -55 -159 -24 -2 56 -4 -13 20 -299 58 84 -189 -26 10 -157 -30 83 160 -165 0 127 -26 -92 100 62
3462 62 134 -255 179 136 -115 -246 -175 -293 125 -4 -184 -13 444 88 -365 168 63 -3 82 487 141 240
3484 240 -303 615 -154 -249 428 546 143 -93 59 -440 -209 206 144 -198 38 -214 -221 66 -132 13 125
3505 125 65 264 21 -147 96 -110 -145 -120 -129 -88 31 76 161 27 173 92 27 -3 -32 158 -43 -143 -139 -22 -56
3530 -56 -47 24 -81 199 5 -57 -42 41 253 138 -119 359 -163 -148 63 -35 23 -94 -97 -105 -196 -144 174 161 46 49
3556 49 65 -128 186 -52 -88 -175 76 -9 140 6 -122 -50 35 102 -85 6 -108 -9 92 202 178 -94 -63 -105
3580 -105 -113 -307 -6 -66 -145 -44 -11 0 -71 -155 -194 176 -107 -2 -35 -74 181 -19 -111 -116 97 -166 30 21 4 -17
3606 -17 29 -149 -33 67 -88 -142 16 87 91 -148 -6 -24 -107 9 90 139 120 -174 31 -52 -65 38 -88 32
3630 32 -165 59 203 84 204 -13 186 117 -196 59 -90 -182 24 231 215 17 169 -182 -135 113 1 -86
3652 -86 32 -18 -52 53 149 7 -13 -209 86 -29 -45 193 -64 -319 9 -29 26 -72 315 -122 25 17 9 -102
3676 -102 96 7 48 21 47 78 -155 -51 60 28 99 -240 325 95 -188 -44 2 55 -119 -49 -42 -135 -1 142
3700 142 -15 273 209 16 -183 10 -33 -81 57 -253 -227 -186 -49 47 -55 -236 -226 -185 -6 -306 -33 342 -297
3723 -297 149 271 243 -186 32 568 -393 -138 -139 -207 -232 -118 168 -149 -26 63 95 65 45 -60 53 81 -18 4
3747 4 -90 -17 -78 12 -272 62 -271 -20 -81 46 146 -183 162 45 101 -149 25 -158 -52 -83 -46 141 -67
3770 -67 103 -146 -27 70 -142 -204 -187 -32 -20 -194 27 -36 -34 74 205 128 -204 -76 126 -238 129 68 -141
3793 -141 -65 157 73 222 -47 -108 17 18 -34 77 10 -1 237 232 144 -142 -196 -80 165 -167 -150 -144 357 -24 23
3818 23 122 -56 -66 -4 -162 -72 -85 -67 94 -153 -134 -60 0 -45 -58 144 167 46 184 -39 -79 22 -109 155 -23
3843 -23 -2 158 -142 166 135 90 -110 -126 132 -283 -34 68 -192 -205 -239 77 -446 124 104 118 -101 -32 -113 -83
3867 -83 55 172 105 -53 -302 -166 37 -51 17 -203 -19 -215 -133 -136 0 -103 22 234 22 259 -31 107
3889 107 -398 71 -11 -193 67 27 -22 34 -121 -50 -105 -6 7 102 66 118 34 -129 -195 -164 2 -167 138 61 192
3914 192 -94 -17 9 74 -63 -5 -299 -20 -23 -72 -63 -34 -48 230 141 -561 -393 192 98 -133 -94 -53 -282 -175 97
3939 97 -218 -95 23 -125 62 -110 265 19 27 -74 -153 136 -44 168 -76 -24 -157 -96 24 -53 -242 -78
3961 -78 -64 135 -102 -89 21 64 -95 -71 -40 -81 -152 73 -26 83 21 53 -179 93 19 20 -121 -158 -265 73 11
3986 11 -153 7 -250 -150 0 -131 40 -135 98 25 -40 -19 -12 -56 -163 112 -30 34 91 -55 -156 -107 25
4009 25 107 102 14 -136 -148 81 164 -202 106 106 -222 158 25 -68 78 -1 -107 233 303 20 -72 -40 55 108 84 -16
4035 -16 -221 46 46 -63 -10 -54 -128 -34 223 -139 -139 -46 52 -113 -34 -95 30 -25 -50 -49 -224 98 -103 -117 -234 49
4061 49 -65 -249 147 -61 30 9 -191 -63 37 -82 -40 37 12 -29 71 43 -86 164 -33 -49 204 34 -43
4084 -43 -113 -45 -87 20 110 115 174 -71 176 -2 -63 52 28 -102 18 -7 -316 -113 -71 11 -79 -33 22 -238 -80
4109 -80 -54 22 -11 38 106 46 122 -144 -215 10 39 -118 20 173 52 -8 9 -2 143 29 -105 147 209 168 152
4134 152 -156 -97 0 -68 -47 -84 -124 42 -266 115 -202 3 93 25 -65 293 -146 -145 128 217 269 -328 -220 113
4158 113 649 -426 72 -258 125 38 30 -67 334 165 57 -120 -31 -127 -103 113 -54 47 -240 -76 19 -42 69
4181 69 35 -195 -83 -127 -200 -8 73 -106 78 134 -212 5 -176 64 115 -172 143 -18 -35 -27 138 -65 9 48
4205 48 -40 -97 -48 387 43 -99 32 -165 -123 59 50 -36 -51 121 171 -121 -229 -104 14 -134 15 -64 -171 50
4229 50 -167 -66 -149 64 -122 161 416 205 249 -514 229 -206 -160 -14 17 15 40 25 29 -107 59 -28 197 56
4253 56 -17 81 -166 11 -42 -97 -371 252 39 375 74 156 58 63 16 -27 83 76 187 45 71 217 45 -132 241
4278 241 -57 -161 99 183 -93 2 46 -4 82 40 -161 82 82 -130 -42 191 24 -20 -176 -48 345 86 -68
4301 -68 -38 -85 27 175 -67 -65 246 155 -216 17 -105 104 49 -139 30 7 23 0 -64 -357 -142 -113 256 421
4325 421 -40 -99 117 187 488 193 -51 -207 18 181 189 -181 -187 -123 -43 -75 -74 -87 -131 -87 77 -43 115 -243 -282
4350 -282 -162 -28 249 251 67 -20 -114 133 94 -33 -139 29 -47 85 -10 185 100 -62 129 126 93 77 10 -226
4374 -226 -189 13 95 -44 134 104 140 36 80 -47 7 242 -70 -7 62 -6 -69 -175 54 -34 15 62 70 42 18 67
4400 67 176 66 308 61 204 -29 42 -119 -106 -25 245 -243 -245 -381 53 164 -67 270 -210 -135 -8 -100 -32
4423 -32 -130 -106 61 -180 -183 50 -221 -130 64 -318 -64 207 -152 -79 97 -128 -197 92 -198 63 7 33 134
4446 134 -148 -42 -169 -178 -347 83 -106 -180 -156 147 -26 23 -83 7 -52 -94 -94 157 -179 2 46 -61 418 -210
4470 -210 -102 30 169 -76 82 123 45 -239 -27 50 216 121 195 -137 -35 -208 116 -44 -47 114 -185 -192 17
4493 17 -72 73 -4 136 138 191 -43 33 105 198 13 118 27 17 18 2 204 -183 122 -134 -72 -47 -230 1 90 129
4519 129 -63 -30 -96 104 -25 94 21 -183 -69 -8 -168 -32 25 101 166 -154 -24 6 -59 110 7 56 -68
4542 -68 0 -78 -12 77 -23 -50 2 -93 8 -100 101 -131 242 -3 -21 158 -255 -43 -33 64 -181 -21 -15 -45 -152
4567 -152 -91 -202 -79 -151 132 22 -18 171 9 -45 -80 154 33 131 -21 4 -72 -144 16 -83 -353 -101 158
4590 158 -277 25 19 180 96 108 128 -186 -17 -94 -77 27 200 16 -124 -207 -219 -111 160 -235 0 -87 -325
4613 -325 123 -30 -46 7 77 -27 -258 51 12 43 -2 81 -31 -138 -15 -124 -161 -1 220 91 -268 -183 256
4636 256 4 -216 73 -26 133 -61 140 56 -92 156 16 121 29 -23 -39 -66 7 -127 -139 115 -205 60 -204
4659 -204 229 -98 15 47 93 -77 -245 -38 -29 135 1 141 155 -172 216 -46 -146 72 -86 9 -4 195
4681 195 -79 -113 -30 -127 -14 3 92 -56 11 -229 -110 115 134 -61 -183 231 161 14 144 250 -71 36 145
4704 145 -35 -40 0 170 -38 196 18 102 -77 141 136 -57 -121 63 -160 -61 -285 79 245 35 42 83 50 -393
4728 -393 207 -5 -53 151 -28 97 175 426 -107 48 54 -44 21 243 -28 79 1 -74 86 145 -174 -57 93
4751 93 -40 -113 -45 -95 33 -113 242 110 -6 -87 108 407 -191 -175 -14 -8 -8 66 -68 -20 212 -104 -53 -26 62
4776 62 -79 -27 -135 -159 -153 61 -101 109 49 6 -10 170 -118 -21 -11 -39 -80 -72 115 207 -29 13 -64 -103 -48 -23 187
4803 187 -30 -150 -366 201 -111 210 -20 197 124 119 -36 73 -38 -123 51 74 189 -19 -77 -26 43 190 -53
4826 -53 62 133 -22 -106 -41 43 13 -75 276 127 134 -44 -211 -37 69 36 59 101 -94 100 -110 -108 -67 35 -51
4851 -51 89 -84 -81 -436 -62 -52 105 179 91 -37 -37 3 124 67 -36 2 140 -95 -298 84 254 164 -10 -141
4875 -141 -104 106 52 -104 -117 89 -44 136 197 -127 106 13 -108 51 -72 -93 -64 1 30 -178 115 -67 122
4898 122 -271 -65 45 -142 217 68 156 -124 -14 15 32 84 -99 -191 225 37 318 178 -77 18 -105 71
4920 71 -326 -84 -45 15 -204 -146 178 99 31 136 -137 -151 -217 82 -98 20 -156 -20 -168 -279 37 -191 161
4943 161 -200 -68 -47 86 85 -166 247 -80 -299 -210 228 90 30 140 -83 -7 219 33 40 123 -138 -4 -57
4966 -57 152 -192 -35 60 -85 70 -124 -57 -39 -57 -79 107 1 76 120 83 55 30 23 104 185 173 70 -2 54 107
4992 107 97 142 183 -161 108 118 -29 -9 54 164 205 109 81 148 8 16 177 -220 -78 211 49 98 -116 -52 -62
5017 -62 133 -176 -210 22 -134 123 51 -23 104 245 -66 -129 197 -110 59 1 -11 41 -119 -38 -196 9 106
5040 106 202 42 -4 -64 -65 -270 102 77 122 105 155 -9 -11 -34 -206 -28 101 -122 56 346 -34 -57 126 -26
5064 -26 18 35 -58 54 149 -102 47 -63 181 66 95 129 -26 -283 -97 76 197 -71 -173 128 30 -23 151
5087 151 -185 54 391 15 -27 -69 84 -369 46 15 -83 46 143 -10 213 133 -94 91 -201 32 -84 213
5109 213 -228 -17 323 -228 -199 158 -246 46 5 45 81 65 -121 -143 -2 -119 15 48 -29 24 -27 88 -23
5132 -23 122 49 46 -103 -165 -67 116 179 -165 20 99 -155 32 88 -10 75 75 -66 -9 66 -90 219 93 -66 2
5157 2 -25 -55 171 82 -41 -48 -54 -40 7 210 143 -50 98 67 96 51 168 -103 -26 -9 -172 -173 -59 -107 -127 122 31
5184 31 183 -5 246 115 233 227 121 -86 85 -54 63 -29 -25 -3 -40 46 -46 132 42 88 -69 123 -106 22
5208 22 58 -66 58 38 -124 -20 -46 51 21 -11 -135 55 107 111 -15 -129 187 -66 75 -35 182 -69 164
5231 164 181 -237 -16 -104 78 47 -195 -6 319 -70 -159 96 -43 -23 63 89 -181 -38 215 -25 105 -142
5253 -142 39 14 -183 64 1 -50 45 -34 -60 192 44 -59 -14 144 113 -81 13 73 -243 -144 60 33 60 77 222
5278 222 -5 -40 105 -10 -211 -69 5 93 -144 -57 -109 -266 -208 107 -86 -372 -157 -38 -26 -52 -60 -43 109 61
5302 61 -32 55 45 134 39 53 -79 58 36 -99 30 24 -35 -103 -167 28 -177 69 149 133 -26 -15 129 -121 174
5327 174 -334 0 169 135 166 -67 -344 122 112 105 282 -161 -74 110 -11 172 56 -157 197 170 -108 -33 -65
5350 -65 -30 -35 28 198 -231 -82 -168 109 144 -166 -40 -364 192 61 -138 -71 -345 136 -64 108 11 -25 -10 -98
5374 -98 73 181 128 -133 -3 -40 16 22 41 157 57 100 80 -173 -56 112 58 50 29 206 135 -117 -90 92 -169
5399 -169 49 -90 117 -41 152 -120 -222 -93 55 1 122 -358 15 -31 -88 266 -256 -246 -79 -108 -57 84
5421 84 -211 -201 -95 -2 -92 -136 -139 -87 2 112 -84 185 -29 138 -271 26 124 -319 -4 -1 30 -127 9 132
5445 132 -219 153 19 -98 -42 85 185 73 25 15 51 -275 109 -101 -52 118 37 22 136 -48 -89 199 -44
5468 -44 -236 -108 148 96 -177 105 40 115 -43 45 -15 -109 29 -194 113 127 -200 88 72 -68 -118 -115 -59 -150 465
5493 465 59 -178 318 292 -414 387 223 -347 -436 -234 187 -391 176 233 133 -43 -21 -246 -15 -350 38
5514 38 -192 -11 17 157 104 -90 154 -10 -72 -43 107 -7 93 323 -23 -231 49 119 107 80 122 -238 -59
5537 -59 59 18 169 107 27 312 -48 -35 34 -323 -235 44 79 -278 106 112 46 60 -257 -181 -86 24 -105 -178 -314
5562 -314 -52 -54 -67 -110 41 199 -92 -140 51 -33 246 -50 152 -26 -44 97 156 -16 -194 105 -59 -158 -62
5585 -62 -35 133 -81 -180 43 227 -43 41 16 -262 86 42 26 22 107 22 39 -25 -48 208 63 -29 -290 -316 95
5610 95 -93 157 7 -145 -21 -17 324 47 -83 -24 10 -95 46 -37 123 116 -350 165 -107 -62 -170 -66 -41
5633 -41 -73 24 379 -27 -100 -135 108 108 185 75 39 -242 188 -27 24 -49 68 34 66 122 -95 67 260 -76 -41
5658 -41 187 -99 277 168 78 56 19 -174 -183 196 134 -232 86 -108 -109 161 -17 -9 -98 -49 46 20 249 -74 167
5683 167 66 30 -98 -213 17 59 73 -17 61 -141 112 61 -440 -412 502 -232 98 183 -723 287 551 -98
5705 -98 -131 -153 97 34 87 -111 -83 39 -171 -46 -93 -58 -95 132 -8 4 -100 19 -119 216 184 -118 222 103
5729 103 -158 55 -17 250 -45 -140 -81 158 -98 -76 -24 -63 -39 -12 112 -1 18 -141 -235 16 127 -150 -283
5752 -283 162 -74 244 280 47 68 185 13 63 -2 -47 179 66 211 -106 293 51 187 283 5 173 238
5774 238 -49 -107 152 47 -43 -45 -52 -31 39 -278 -84 -78 67 12 190 94 -114 -284 -94 319 -96 87 60 -143
5798 -143 37 54 -32 -68 -151 -86 71 404 -22 88 -6 -32 47 224 -93 84 70 115 108 -57 -162 -332 42 129
5822 129 -544 202 137 -76 -117 150 -137 -265 -122 -295 -196 -59 -154 -142 255 9 471 -142 -161 -219 120 48 68
5845 68 -93 -154 109 -224 -45 303 -132 79 -12 2 -35 257 60 -23 -240 -3 -10 95 106 -91 -86 -195 119 -236
5869 -236 -11 -88 236 -96 72 -62 96 -50 -148 -25 23 -72 -116 30 -57 -17 -79 -30 -129 -206 174 54 121 221
5893 221 -104 80 -153 -158 -82 -137 156 -144 -139 31 213 158 -133 115 90 313 -56 33 75 -144 130 108 -47 117
5917 117 139 -4 61 12 142 -57 65 28 18 -15 197 -39 240 56 -7 102 92 -26 -56 -297 -147 188 -21
5940 -21 33 50 -58 397 240 -304 325 104 -37 -154 69 51 21 113 269 -35 75 -125 36 175 -146 -103
5962 -103 -55 98 -9 -62 -13 114 215 -141 153 -181 113 -166 129 -18 -1 190 -99 5 66 -80 106 -169
5984 -169 267 -15 -262 172 15 -20 -157 -153 -175 -2 -9 26 163 164 35 -65 -89 -49 138 282 -116 111 80 -103
6008 -103 -10 -127 -85 38 176 -121 -172 93 354 134 -180 57 111 -24 146 -246 -128 2 -115 -234 -18
6029 -18 -5 -111 238 -112 78 -107 19 158 -188 26 -49 -74 45 93 118 92 326 -309 1 -75 274 77 234
6052 234 -262 -230 -422 432 -314 -99 318 -378 270 61 234 -295 -186 -185 187 -150 159 -43 15 -245 6
6073 6 -124 31 -106 82 -63 70 57 -89 -42 89 249 -42 -213 39 -60 94 17 -221 -73 -55 182 -24
6095 -24 123 -11 2 4 -190 219 -153 77 16 -50 115 28 -139 -17 79 -159 -70 32 81 52 -49 135 71 11
6119 11 130 185 -128 120 95 -344 235 46 42 -34 119 34 -64 98 65 -56 -59 63 -136 -211 32 266 -84 186
6143 186 -73 26 99 154 -78 192 -76 -45 104 -31 -166 -155 191 -27 234 -113 54 107 -17 91 77 30 118
6166 118 -107 127 48 175 -99 32 162 -116 87 -25 132 144 -16 -279 -69 -23 72 -117 281 -44 -16 -51
6188 -51 -82 101 71 -35 216 -97 -45 -4 78 -120 -259 26 -86 106 -159 -4 -217 227 -134 309 284 40
6210 40 10 243 51 -30 219 26 146 -10 145 -40 -33 55 -213 104 61 -247 45 -117 36 -72 205 -146
6232 -146 45 -201 7 -69 78 -38 -52 -34 319 300 -125 -134 -154 -57 -91 41 -226 14 -295 314 186 -157 154
6255 154 151 4 -264 181 -38 98 118 -114 -25 -53 -90 -99 88 -213 -2 201 60 80 208 -88 18 -229 -185
6278 -185 61 226 4 -288 -74 15 80 19 -125 137 86 90 44 -35 15 156 -134 -202 101 39 109 -74 -82 299 -50
6303 -50 -77 -132 -189 -149 -188 -159 -116 -89 -301 207 42 -133 -339 150 -58 179 -220 18 -9 -161 141 65 32 -167
6327 -167 166 66 257 28 -51 -15 -48 2 16 -39 -124 65 -26 -178 -65 -183 21 -179 222 44 84 -55 -6
6350 -6 6 88 4 61 -209 37 -78 -131 211 30 189 51 88 71 223 -186 20 -167 30 59 -15 149 -6 215
6374 215 -81 -149 82 2 66 -108 -16 145 59 -165 176 -201 118 55 140 -7 -31 92 84 52 93 -42 34 -59 -4
6399 -4 83 106 -53 -159 27 11 52 76 75 -62 -223 18 -29 -41 -45 -95 61 1 121 173 -37 56 206 -66 -20 -175
6425 -175 -79 110 19 129 184 -155 -20 126 -8 -37 67 -171 99 172 125 231 -73 -7 -146 68 -42 60
6447 60 -125 -49 -3 -46 -47 74 227 -33 187 112 51 -75 244 63 -379 71 168 -41 40 89 -278 -27 57 -17
6471 -17 126 93 -168 -100 63 79 -51 139 133 81 41 115 -101 34 110 -230 2 -195 -112 126 -67 97 -45 -72
6495 -72 -14 -26 -25 191 -155 186 54 -24 -171 46 79 83 -290 3 179 13 146 18 -124 49 70 15 -83 -5
6519 -5 2 -96 62 -84 27 -75 194 91 -99 -51 -53 144 234 131 89 38 -17 233 26 80 -165 -104 22 -37 122
6544 122 103 -136 62 62 -81 247 -23 177 -209 -12 39 159 81 177 -204 -86 -37 -115 5 9 -167 63 0 34
6568 34 17 -186 175 -132 90 107 310 59 57 -125 -332 11 192 -299 222 -35 69 -189 174 140 4 -92
6590 -92 74 -40 -35 159 60 -31 218 -146 114 52 -68 -148 -83 14 170 -64 -105 146 -61 44 161 -86 -218
6613 -218 94 28 -93 -8 278 -92 306 -106 108 -38 60 22 -128 -25 -37 -94 -93 -209 -209 41 115 228 50 -54
6637 -54 75 -45 -3 388 54 115 46 -69 68 148 -39 117 13 189 -89 -167 88 -175 9 80 97 20 -6
6660 -6 -28 44 72 103 73 150 135 -103 -106 92 57 21 132 -282 -215 178 -70 -30 44 41 -121 102 1 -24 199 168 -164
6687 -164 -195 122 37 255 -173 120 29 2 130 153 -72 -115 -214 -20 -124 -158 102 -14 84 -81 -21 -45 -185 224
6711 224 87 -65 68 104 -96 -239 138 5 -95 58 -2 -2 -83 136 263 57 77 241 138 75 99 -148 -124
6734 -124 -14 -103 62 -65 -129 3 -80 -146 -5 -54 68 82 -186 258 -114 89 73 -204 -12 -43 106 -165 -247
6757 -247 304 42 136 -116 -21 123 181 65 -58 170 -7 -174 -199 23 11 -95 189 33 -179 -136 -4 -143
6779 -143 -16 -19 -20 31 -141 87 255 49 61 80 43 -218 -93 -232 -119 38 -32 177 -93 58 126 56 -154 84
6803 84 46 -25 -156 56 26 -40 25 -42 -1 -163 -8 -4 -227 -73 -1 -96 -58 -32 106 138 -7 88 175 -43 201 85
6829 85 -227 78 70 7 14 -83 -342 -266 32 -152 -5 107 -12 191 210 152 -46 -5 2 40 83 282 6 -108 120
6854 120 37 -65 153 43 -208 87 70 52 -177 186 80 -38 134 -171 12 134 123 201 -40 -76 87 19
6876 19 -76 149 67 -81 53 63 23 -69 236 -158 -97 331 -249 -115 53 -2 31 -373 142 -257 152 254 -211
6899 -211 -68 -31 -20 152 -54 165 -86 -111 58 74 -31 20 -282 -252 -51 181 143 -22 -29 -199 -195 -127 -117 79
6923 79 -94 159 51 210 7 46 196 -227 132 -47 -51 98 -131 -59 139 42 -21 -41 129 -42 13 160 -106
6946 -106 -75 31 178 -128 69 21 -316 -102 -215 -115 196 -119 -53 92 48 65 45 -20 -2 261 -64 43 142
6969 142 -162 -265 49 45 -230 -33 27 92 -129 -6 27 -142 59 -111 -138 50 1 158 25 1 -62 91 -103
6992 -103 38 26 81 -35 -158 53 231 99 -74 82 73 195 56 -44 87 184 18 264 9 42 93 -61
7014 -61 45 53 -69 -12 95 -106 82 -282 -228 234 377 -181 151 -146 -420 383 -477 249 -24 -4 37 111 -109
7037 -109 -49 76 103 135 22 -106 124 -180 -9 53 -159 -69 -54 105 -21 20 -40 -141 -118 -165 -112 32 164 74
7061 74 -1 206 55 126 35 104 132 128 94 61 219 262 -175 282 -17 -78 3 78 88 -73 88 5 -56 -94 58 -44
7087 -44 -134 46 115 57 303 53 -76 -135 -23 86 104 -87 -34 20 -52 -25 -140 -251 -21 -41 -128 -51 215 11
7111 11 32 137 -44 34 160 98 -107 -13 42 -105 -12 24 113 19 9 60 73 -173 -86 152 -115 -154 33 206 133
7136 133 -65 228 21 -32 52 48 -97 60 -158 208 95 153 19 35 13 -82 160 -130 -21 70 -69 88 12
7159 12 1 -52 -21 -57 -117 12 109 145 59 67 -129 -98 204 -42 61 -30 -46 88 173 2 421 -64 -253 163 -11
7184 -11 -75 89 106 -153 -143 -99 94 16 80 -125 -105 175 -8 162 155 157 31 -187 113 125 -202 -257 -60 123 56
7209 56 -150 -21 14 85 15 138 -23 -180 160 -62 54 -159 199 77 -28 21 -27 -45 -77 71 -4 -65 -83 -251
7233 -251 76 197 93 -117 -59 -164 355 -126 -157 -52 5 -93 -177 84 108 99 -34 34 87 74 118 -233 5 97
7257 97 78 177 30 251 2 -117 155 -10 121 46 13 235 0 -10 -70 49 11 -125 -74 176 -135 -220 94
7280 94 55 -130 -174 137 -97 9 89 -16 5 23 -84 35 179 5 176 40 -51 65 53 137 -132 110 51
7303 51 -45 -22 62 23 105 88 -193 -13 -265 43 -21 169 274 62 48 75 -59 36 -40 -237 53 297 -69 21
7327 21 -32 28 -160 67 -70 158 -96 67 39 -13 -43 -239 -33 -5 -45 53 -31 -9 248 -120 -174 -212 37 41 11
7352 11 250 34 131 8 -123 -71 220 52 69 -170 -153 -63 -107 4 -94 -101 -250 63 133 -201 -286 -59 -59 113 -41
7377 -41 -193 -94 154 4 35 136 235 -153 -175 9 271 62 -207 -190 84 -158 92 24 66 -194 -84 28 242
7400 242 50 -142 -37 169 -12 -49 -197 209 -108 136 -125 -83 -3 -35 -150 22 152 -147 -12 -162 -205 -144
7422 -144 -151 275 272 -121 2 36 30 154 -180 206 194 -213 118 179 -94 -58 -80 -83 307 66 102 -95 50 270 130
7447 130 40 -11 106 1 -88 139 82 34 115 -109 125 80 -112 -47 4 105 -207 -205 -84 -67 183 -130 -3 251
7471 251 -102 44 -160 121 252 341 1021 -460 -1090 -229 -363 -232 -329 57 -553 -282 353 2 -94 -151 22
7492 22 -299 -58 -42 -40 1 57 -93 -10 134 -81 -109 -129 279 -153 15 145 -105 30 -46 -110 -115 -81 132 -124 -222
7517 -222 -120 -26 -177 -8 -321 -137 84 122 19 -20 -55 165 -311 35 -221 97 5 273 -46 -25 1 -20 -273
7540 -273 200 6 -52 6 275 -200 -25 58 4 13 -10 24 -50 5 -179 -7 43 -51 73 233 101 87 -6 113 161
7565 161 1 281 222 145 -23 -53 -13 -33 149 47 296 170 -122 -13 20 33 -109 139 235 8 84 -11 33 132
7589 132 202 82 149 -35 40 -93 106 -50 42 -2 -44 188 -22 -319 -22 -135 230 -75 125 252 -136 -91
7611 -91 -127 -160 182 10 140 33 -86 -323 24 -44 181 -46 348 -11 -140 -8 -65 54 -101 85 -181 -11
7633 -11 -28 19 -61 75 209 242 70 -69 9 265 41 98 -155 100 232 -25 -175 -14 -51 -207 -41 -70 -79 101
7657 101 -292 -24 -164 144 133 227 268 39 -4 -77 93 -37 -14 44 -59 5 -41 -141 122 -90 -53 83 -76
7680 -76 42 -5 -68 -27 -39 -90 195 -39 126 -85 -86 78 196 -150 -188 322 58 108 36 169 39 9 -264 171
7704 171 -321 -7 73 104 -33 183 -143 -175 -383 90 -155 56 -36 -54 -174 -63 -207 72 -129 160 -21 -54
7726 -54 15 64 151 -101 169 28 87 96 302 82 -39 -21 -108 -40 343 -156 87 185 123 130 31 -11 113 253 -146
7751 -146 -67 25 75 -203 51 6 -54 204 49 -96 37 196 180 84 -35 -107 211 52 -34 -276 -36 -470 88
7774 88 225 52 -45 -1 164 122 19 -104 -45 24 -148 26 -21 112 48 57 -28 106 -251 14 270 61 -195 8
7798 8 111 -68 33 24 -108 202 -154 -83 136 63 -86 -123 -35 142 14 208 -65 108 104 108 -93 80 42 -82
7822 -82 122 -48 100 139 -98 -75 104 -3 -39 116 64 83 136 -166 -179 30 -79 15 -129 71 -167 -207 -178 -143
7846 -143 136 -192 -62 -74 -55 39 -46 5 -56 127 216 32 -21 105 111 193 26 23 -3 96 -139 -12 -36 -18 27 -18
7872 -18 -6 -41 12 -122 -146 -95 64 -214 143 71 55 -250 24 -143 -131 -101 -98 -27 129 18 -38 136 20 171 -59
7897 -59 2 -10 105 149 -47 103 112 208 41 128 21 -88 243 44 -74 153 51 -1 -12 -118 -150 -61 -210 102
7921 102 194 -94 -49 -40 -184 -23 -251 -145 -46 67 -24 24 148 129 26 5 -47 122 53 -250 -93 68 66 45 234
7946 234 100 210 38 -51 2 -79 91 6 -1 111 101 -3 50 -79 -70 1 -11 -7 -124 28 51 -7 -55 68 -93 -264
7972 -264 114 -113 -224 88 212 20 68 -100 188 -22 166 -52 225 61 162 135 -150 12 -118 -87 51
7993 51 98 43 137 -104 86 50 115 61 -35 190 -166 4 12 94 135 -158 -23 -249 -168 29 -153 -176 -43 -74 -32
8018 -32 121 -51 -72 32 -16 -112 54 -74 -220 -6 343 36 61 -114 4 104 -182 -264 100 86 224 48
8040 48 -234 -199 202 -168 -79 42 -305 -130 -178 -86 -98 62 11 34 3 42 8 20 -21 -81 -46 73 74 44 107 86 116
8067 116 -221 -75 81 -7 164 -140 -71 -222 -126 -73 11 78 128 179 -48 -17 -36 90 124 29 171 126 70 -181 162
8092 162 -34 112 -227 72 18 17 154 -83 8 -157 -18 -153 -126 -22 -266 21 43 36 -234 -42 -100 -74 -10 -7
8116 -7 -9 24 -93 -181 -102 28 10 -146 5 -13 212 -17 49 -94 9 -73 -180 -11 -3 -39 -11 -66 -20 -174 131 423
8142 423 -53 28 -111 144 -22 -85 18 44 234 46 -88 1 10 200 -80 25 9 -140 -75 -55 -139 184 223 96
8166 96 -105 30 17 -132 -1 -7 162 124 -83 -34 -93 -237 -86 -21 86 146 71 -45 48 123 68 -60 -86 -216 -110
8191a10
$$ Imaginary data points
##PAGE= N=2
##DATA TABLE= (X++(I..I)), XYDATA
0 0 0 0 0 0 0 0 0 0 0 0 0 0 0 0 0 0 0 7 -8 8 -8 8 -8 15 -16 16 -22 24 -27 32 -37 41 -47 54 -60 68 -77 87 -96
39 -96 107 -119 133 -148 164 -182 201 -222 243 -269 297 -327 360 -397 437 -483 534 -593 660 -734
59 -734 824 -930 1060 -1218 1420 -1693 2076 -2658 3673 -5989 27061 -10581 -2091 32513 -1873
74 -1873 9515 15244 29525 -600 -8403 18076 -6353 564 30083 1685 -10741 1369 11404
87 11404 -19817 -7930 35468 -9373 -25112 6174 -7112 -11535 -9969 9602 -266 -30257 1072
100 1072 -10307 -27324 12558 -3169 -23003 -11064 -3607 -15646 -28138 10151 4671 -33526 -10004
113 -10004 -2224 -16017 -16529 -553 5109 -25519 -8711 1427 -26273 2674 8138 -16297 -8770
126 -8770 -909 -403 -18429 -1504 22845 -15528 -13680 12149 -2751 -7198 4496 13763 -3379
139 -3379 -6171 12561 -5233 1460 20263 2533 -2521 5952 13648 -1459 -2632 30170 7868
152 7868 -11341 15912 10477 2030 8019 16281 12144 -3523 12157 9791 -3012 20113 14273 -3060
166 -3060 5609 13627 4991 -5413 18484 18402 -10322 3432 12455 1041 966 9042 11499 -5507 -3
181 -3 8209 -8592 5956 12809 -6752 -4987 3639 1587 -10823 -709 14849 -9357 -12881 4089
195 4089 -3392 -7988 -2254 3340 -7068 -11910 300 -10556 -8808 6656 -6807 -13197 -4445 -2120
209 -2120 -11384 -12453 7643 -2777 -19456 -3053 -2228 -11216 -5776 96 -3306 -11581 -3582 -5192
223 -5192 -11525 3493 1043 -11100 -5379 1314 -4353 -11580 4405 7989 -12226 -4548 4090 -3881
237 -3881 -2507 2847 4539 -3371 -1594 3678 -4845 3360 10887 -2661 -1972 6653 4197 -4080 3528
252 3528 14815 593 -4172 8179 4382 919 6065 8501 3639 1216 6507 876 2100 13104
266 13104 4721 -2128 6099 7670 -846 31 12682 6901 -4892 3895 6007 88 2472 6137 3677
281 3677 -685 2606 737 -3150 7143 5387 -4957 -498 4416 -1972 -6080 3818 6443 -6213
295 -6213 -4711 2257 -3054 -3627 954 -31 -3908 -2898 -2718 -6981 -1055 3323 -6049 -7221 135 -2612
311 -2612 -9174 -3055 4233 -4630 -8856 -1634 -2894 -5916 -1908 -800 -4017 -4020 -2723 -6456 -4142 3374
327 3374 -1965 -7426 -730 1026 -6136 -4633 4376 1414 -6460 -1989 1037 -2753 -661 2297 -144
342 -144 -751 633 -2006 -2259 4938 4512 -3274 -374 5298 -499 -3016 5221 6562 -797 -854 3630 1950
359 1950 1268 4534 3380 1677 3216 1593 -912 4401 7474 1045 -1045 5517 3068 -2378 2847
374 2847 7416 2145 -1576 2007 2429 328 2525 3418 351 1827 1264 -2625 433 5093 1406 -3277
390 -3277 1037 3010 -3892 -2223 4310 1787 -2932 -2248 136 -1647 -1632 1015 -1709 -1598 -501 -4427
406 -4427 -3897 1537 1012 -4875 -3527 1409 -3380 -6187 475 1151 -3355 -4515 -1897 -1743 -3441 -306
422 -306 -1515 -2960 -392 -3476 -4942 -28 1912 -2079 -4668 643 355 -5873 -960 3237 -777 -2925
438 -2925 -1678 98 -1240 -10 1426 -1071 1208 272 -2937 493 3736 2049 -2090 353 4223
453 4223 -1831 -981 5038 3019 397 -189 1793 2030 1301 3078 1625 1560 3155 -781 212 4516 4166
470 4166 402 -444 4603 1369 -1673 3597 4207 1379 -366 285 2653 782 2055 2390 232 2662
486 2662 -86 -1979 2644 3389 324 -2020 761 1953 -3056 -567 3166 628 -1749 -1923 470 -460
502 -460 -503 621 -1682 -396 -1052 -4335 -825 1215 -202 -3015 -2760 1134 -2719 -3735 1149 251 -2034
519 -2034 -3573 -2070 -771 -1974 -674 -1138 -1480 -598 -3428 -2512 916 429 -1539 -3530 545 -205 -3977
536 -3977 318 1460 -381 -1917 -2560 592 24 -540 734 -491 838 -767 -2033 1385 2331 822
552 822 -1815 372 2546 -1366 74 2679 1865 637 -1497 1241 2264 236 2080 1308 1376 1783 -1335
569 -1335 1150 3263 2009 476 -238 2727 1433 -782 2310 2923 1326 -746 116 2878 818 791
585 791 1324 816 1633 -1428 -429 2351 1456 763 -1452 677 1731 -1899 56 1939 673 -939 -2373
602 -2373 713 609 -1315 -220 -486 -36 -1409 -2593 586 308 -221 -1992 -2108 824 -1823 -2309 283
619 283 -61 -1052 -3356 -1518 793 -2072 -1486 -779 -944 -976 -3122 -877 445 -687 -1390 -2641 165
636 165 -107 -2582 -455 680 228 -1994 -2144 1213 -23 -1003 21 -9 628 -1640 -1090 1627 550
653 550 179 -888 -61 1844 -824 -328 1825 1520 425 -1517 1172 2309 -143 814 1098 1607 103
670 103 -477 1842 2017 1313 486 -135 2271 1017 -142 1677 2311 1810 -594 100 2765 933 521 977
688 977 1655 1224 -828 165 2232 692 215 -473 691 1040 -769 -202 323 523 -539 -1405 1276 1501
706 1501 -1104 -482 530 227 -1146 -1908 587 -789 -509 -1808 -1760 802 -1491 -1412 171 112 -1215 -2886
724 -2886 -1117 698 -1170 -1594 -608 -269 -1242 -2615 -277 230 -819 -1025 -1700 -322 -503 -1513 -564
741 -564 109 167 -1886 -1898 996 5 -1188 -855 626 195 -1443 -636 1205 466 -175 -196 294 649 -452
760 -452 -345 1255 1573 165 -1120 1159 1712 70 127 1131 1657 -321 -556 1368 1712 544 137 344
778 344 1712 531 41 1481 1729 1261 -429 280 2239 958 -45 837 1713 557 -1001 669 1894
795 1894 516 -86 -13 834 567 -576 183 1100 777 -325 -946 924 998 -883 -530 566 473 -1489 -1144
814 -1144 704 560 -877 -1041 -337 -109 -1017 -946 60 131 -534 -2062 -667 350 -901 -1411 -516 369
832 369 -1018 -1977 -447 345 -950 -1349 -473 -156 -821 -1000 -105 146 -411 -1295 -1402 490 126 -1150 -772
851 -772 484 357 -1702 -599 1150 538 -882 -360 535 130 -241 28 651 818 -178 -508 558 1210
869 1210 396 -472 1020 1209 -384 -535 1234 1609 50 -207 972 1004 -91 293 1131 958 646 -39
887 -39 355 1444 859 -112 222 1434 513 -553 211 1744 789 -518 468 852 81 -401 622 896 306
906 306 -451 -393 288 823 -327 -427 499 423 -1103 -936 750 481 -845 -869 453 -212 -851 -308 235 48
926 48 -780 -1040 -643 53 -382 -1194 -785 271 -827 -1765 -500 718 -821 -1508 -161 205 -1024 -1067 -5
945 -5 268 -577 -927 -757 -39 433 -956 -540 262 -247 -1235 -585 1025 251 -1216 -185 692 -242 -554 182
965 182 938 515 -432 -380 242 881 248 -245 700 756 -240 -586 1053 1742 -37 -247 994 740 277 226
985 226 1349 988 -237 -51 385 1066 890 -61 633 1134 258 -667 402 1655 499 -604 456 871
1003 871 241 -495 481 1042 -131 -312 -97 591 597 -186 -353 489 300 -860 -424 854 788 -871 -925 202
1023 202 -257 -590 -497 471 -114 -936 -582 -349 0 -488 -1147 -116 65 -693 -1197 -141 808 -845 -1452
1042 -1452 -148 -53 -709 -1030 30 183 -609 -1054 -432 183 24 -702 -260 199 -277 -768 -466 599 128
1061 128 -969 -247 419 136 -869 -17 892 162 -572 189 592 502 -72 23 528 495 -171 -174 842 1008 51
1082 51 -211 830 906 32 -15 936 848 -194 224 480 863 328 -53 555 719 100 -102 427 1281 419 -616
1103 -616 436 790 407 -178 618 1132 -23 -290 372 726 428 -440 -7 536 52 -378 -361 223 428 -333
1123 -333 -380 275 259 -697 -661 539 -130 -827 -505 78 47 -576 -725 -44 -154 -607 -782 -321 476 -401 -1105
1144 -1105 -357 44 -541 -1059 -76 469 -773 -897 -24 314 -298 -571 109 230 -239 -527 -416 233 -4
1163 -4 -731 -116 488 265 -724 -194 705 220 -323 -205 544 616 -405 38 450 317 96 251 649 781 -110
1184 -110 -17 610 532 122 -224 846 760 -243 -160 702 816 107 -178 568 399 275 66 294 747 -15 -219
1205 -219 393 414 565 -276 135 766 -122 -689 106 696 267 -579 69 345 -398 -285 -272 456 193 -578 -275
1226 -275 188 133 -482 -534 380 156 -519 -511 32 128 -832 -218 155 -92 -736 -451 -9 193 -732 -586 -220 -66
1248 -66 -401 -752 -82 326 -383 -925 -83 378 -451 -675 217 31 -444 -344 -152 186 -39 -523 159 -1
1268 -1 143 -569 -314 547 162 -752 -31 716 381 -452 274 673 127 -276 161 567 331 99 293 445 281
1289 281 93 -60 413 670 -84 -33 526 574 228 -242 804 607 -173 107 365 485 68 -48 374 155
1309 155 317 -247 393 743 198 -100 59 514 250 -219 105 251 -82 -264 273 350 28 -418 -120 84
1329 84 195 -521 -527 76 -153 -303 -407 310 199 -686 -358 226 -484 -673 -455 328 7 -436 -332 24 -138
1350 -138 -431 -549 -82 105 -474 -742 -298 377 -248 -445 -5 271 -553 -332 176 245 -100 -544 -71 425
1370 425 -90 -319 -69 205 103 -621 -46 527 340 -508 127 403 55 -324 96 718 206 -282 -39 426
1390 426 278 98 134 436 407 229 -185 431 419 -182 -272 410 162 -130 -20 567 348 -258 -142 296 120
1411 120 139 285 150 397 -22 -423 -104 638 -233 -662 152 428 -314 -426 170 442 -267 -256 43 105 -282
1432 -282 -460 -14 -4 -60 -453 -304 304 225 -707 -283 337 -135 -508 -195 107 -37 -749 -48 -42 -119 -243 -320
1454 -320 47 -152 -354 -388 -135 382 -248 -452 127 157 -381 -817 204 228 -346 -399 130 -20 -68 -81 119 132
1476 132 56 -203 -77 429 0 -273 -9 449 82 -450 254 539 -1 -8 30 482 263 113 -21 396 292
1497 292 -272 -190 362 472 -86 -60 474 293 -479 65 424 324 -90 -20 538 455 3 161 151 423 4 -163
1519 -163 376 323 119 -286 87 509 -291 -310 141 181 6 -83 -140 183 -138 -107 -234 198 96 -303 -99 267
1541 267 -31 -335 -134 449 -122 -354 -142 -107 -196 -384 -320 -120 -240 -186 -63 14 179 -250 -286 238 25 -273
1563 -273 -33 105 119 -280 -248 111 -69 -247 -57 -33 273 -82 -411 -213 463 -186 -348 -33 522 -111 -94
1584 -94 409 402 -381 97 350 78 221 -104 37 234 72 -113 42 313 508 -97 114 303 27 -42 6 267
1606 267 -27 49 302 414 290 -137 -168 173 300 52 -358 -53 494 -43 -283 248 410 -242 59 410 159
1627 159 58 -10 376 -174 76 -194 -362 -1 196 -447 -46 241 15 -593 -160 362 -227 -342 -58 202
1647 202 -328 -387 212 113 29 -171 -432 203 261 -413 -221 174 252 -379 -189 342 74 -387 9 89 -89 -429
1669 -429 -3 -77 -76 78 -91 -14 86 224 -248 -11 356 -168 -271 446 272 -414 38 174 78 -259 178 214
1691 214 185 -26 308 -104 126 450 76 -201 270 307 -381 51 563 -121 -247 328 286 -116 -98 94 -64
1712 -64 272 145 -239 49 347 81 -55 230 399 -179 -81 454 61 -397 88 334 -244 120 122 21 39 148
1734 148 -238 -63 200 6 -423 -56 351 -160 -335 86 304 -320 -88 160 75 -168 -107 -80 -238 -133 134
1755 134 -229 211 441 -179 -285 297 196 -374 15 135 -357 -407 255 182 -122 28 154 98 114 32 -2 -281
1777 -281 368 41 -145 85 395 -87 -308 158 113 -82 -121 93 -157 -197 102 27 1 -72 71 72 14 280 -398
1800 -398 -99 325 103 -444 -13 434 -359 -253 421 352 -67 49 59 213 301 111 -297 -43 250 3 -351
1821 -351 116 146 -216 -130 671 -112 -335 346 107 -259 -202 90 -36 28 88 -172 -210 277 57 -48 -199 186
1843 186 -35 -348 352 163 -181 36 224 -62 -221 -185 106 -45 -45 16 -437 -39 52 -245 -44 355 -21 -525
1865 -525 29 319 -176 -81 246 196 -275 -200 65 -74 -160 24 -361 -12 226 93 -325 231 318 173 -201 233
1887 233 -244 -218 -51 271 -91 57 169 0 -75 123 -75 47 435 -8 -98 -152 311 35 -143 18 313
1908 313 -91 -148 171 -66 -210 -66 -44 67 -28 -225 -56 -30 56 -153 73 107 -63 -391 -98 172 -275 -249
1930 -249 130 162 75 -21 15 199 180 -12 -138 -128 1 -79 -272 228 -23 -278 -182 323 -8 -128 5 -193 -145
1953 -145 51 49 -28 128 216 -78 54 253 158 107 -5 75 88 -210 32 79 -339 -5 -67 -15 -103 48 -16 33 36
1978 36 10 -223 95 10 -255 17 -55 57 -42 83 342 47 -102 -76 -74 -89 3 -27 -184 119 372 -145 97 315
2002 315 -87 -382 -79 -81 -167 246 216 188 -74 0 -109 -116 77 -19 -18 253 -105 -49 -63 145 67 -61 -55 255 104
2027 104 9 279 291 -91 28 84 86 -55 179 -64 -239 -42 -262 -112 231 65 -280 -269 86 34 -156 -228 175
2050 175 225 -203 -125 98 69 -100 50 8 -38 -229 -75 138 131 -185 -14 94 57 -260 -291 54 93 6 -40 -22
2074 -22 40 45 -46 -355 -66 -71 -79 -212 254 115 -197 11 295 -92 -56 41 300 -164 109 116 197 -132 136 -86 94
2099 94 -5 -387 -84 201 -99 33 -164 198 -45 -43 18 193 72 -106 42 31 -14 342 11 215 264 91 -188
2122 -188 -23 -11 -98 -254 44 69 -19 -135 33 -83 -255 -170 171 63 -6 252 -153 191 215 -200 -155 338 -8
2145 -8 85 3 135 -163 -234 -12 -2 42 -56 246 -43 -48 184 -145 35 382 175 -108 -9 228 -168 -94 177 12
2169 12 -77 -356 200 -17 -41 -28 -65 -212 -13 -97 -126 -40 162 -62 -201 156 -70 -93 64 53 -48 -102 -254 37
2193 37 220 -8 101 -122 -15 -5 36 117 228 94 -149 2 61 -259 -95 218 18 -91 -85 218 -202 137
2215 137 -242 -27 -77 -124 -6 -121 198 -206 -30 182 53 -320 -151 136 2 -19 -94 55 80 -122 32 48
2237 48 343 -62 -25 -230 174 21 110 -159 -72 -61 -100 76 -50 -164 -114 -67 4 94 -234 23 -3 124 -82 121
2261 121 -66 -159 -83 -6 -206 252 -162 -303 107 128 -47 -79 209 136 27 113 252 239 44 -209 59 183 173
2284 173 25 -70 -123 -27 -143 11 95 -13 -139 9 -67 -93 -4 -15 -63 104 35 105 -41 10 4 41 156 -134 -141 39
2310 39 31 6 3 0 126 269 -25 128 -24 31 -55 -104 29 252 31 -119 133 10 20 -25 276 -66 -22 -328 136
2335 136 211 -127 29 -9 134 56 -103 -16 -46 2 -75 6 -54 -99 -23 161 12 -7 -247 -39 37 52 57 119 123 -117
2361 -117 136 -4 284 -225 114 53 8 15 -25 -76 -140 -107 -109 -130 176 13 -188 -130 -263 202 -217 -245 135 297
2385 297 -25 174 262 -143 -37 197 -186 70 0 -16 -79 78 103 -212 -90 122 -39 -2 -86 105 85 85 114 111
2409 111 -62 -210 -5 143 143 -180 -2 20 -48 131 127 -56 86 29 -38 5 143 16 -148 -149 27 -80 -57 126
2433 126 137 -18 -32 69 137 92 -85 106 -25 -163 23 76 69 156 106 -2 89 115 -53 -78 -1 156 -123 -44 64
2458 64 80 -85 -259 -31 -101 -31 63 -79 -172 -263 -201 95 -18 -174 214 20 -216 231 -187 -44 -30 -73 57
2481 57 -121 75 48 206 51 104 39 -70 115 -22 -242 16 33 199 -173 57 169 60 322 10 159 60
2503 60 -196 -40 117 -64 -35 -231 97 211 200 -116 88 -105 -29 40 -5 29 42 -88 5 88 2 -119 -7 -110
2527 -110 -344 -65 81 -48 125 -181 -67 -46 -65 -51 -97 94 55 -135 -156 151 331 66 -198 -15 76 19 -49
2550 -49 -188 144 6 -108 174 -15 128 45 140 7 -36 -69 -35 -17 -153 31 -82 28 -33 -5 -99 -55 53 -159
2574 -159 -83 -196 22 248 6 -99 81 79 135 254 266 -3 -14 12 148 63 174 126 -146 91 71 22 -20 -143
2598 -143 242 216 -71 -238 -60 -212 226 76 -194 230 -94 13 -211 -191 56 74 -193 4 35 -122 -105 2
2620 2 170 151 -187 -211 36 -34 -196 57 2 -196 64 120 121 54 -12 137 -139 -61 -92 16 -113 21 286 -115
2644 -115 40 -44 -140 -242 198 21 140 -176 -187 -35 33 54 -70 246 -18 -37 166 83 10 8 -79 88 -173 -21
2668 -21 34 -121 -23 88 8 186 110 -40 -27 327 -129 -72 80 128 -31 -328 391 237 84 337 228 -66 104
2691 104 -90 682 -937 -339 170 598 -1076 -634 198 -45 370 -410 -12 -372 189 -120 -236 -72 97
2710 97 -120 223 -125 -93 -190 -50 -17 -145 122 80 -124 166 160 157 -68 139 -85 109 62 -26 -85 -89 276 -74 -110
2735 -110 145 -81 -16 127 52 106 -46 -139 52 -97 72 97 -223 -27 -60 -57 -41 -117 -201 -57 -155 74 -73 -21
2759 -21 251 -77 -100 169 7 -189 74 -144 -56 38 85 60 -31 -64 -6 292 5 -58 -21 -138 -89 -102 133 -60
2783 -60 108 183 77 -110 149 59 -200 45 64 -52 -8 -107 -202 -94 297 -239 -4 42 77 64 -5 161 106 -61
2807 -61 130 56 -157 -33 165 -6 -70 103 8 74 -49 -57 9 306 -60 62 43 -349 94 69 81 -153 101 128
2831 128 48 31 -72 108 212 137 -172 -360 -272 520 -353 390 -17 -384 -108 -248 101 56 -210 -117 -220 -134
2853 -134 -53 58 -55 53 -55 -3 -53 0 117 -12 113 -84 -164 -50 48 -128 111 -85 225 1 -53 -19 228
2876 228 -89 251 50 118 -73 43 -7 -63 126 4 -43 -29 97 153 52 -193 -216 -127 -271 -130 53 -33 131
2899 131 -59 72 89 156 95 -72 151 -47 -90 -245 68 -42 65 -68 -201 6 109 -36 60 -56 132 -70
2921 -70 -17 -29 -84 -139 8 -176 57 153 220 -112 68 23 -10 3 -92 76 152 68 60 220 138 45 -3 50 -52 86
2947 86 137 215 -108 -68 227 -3 19 37 -77 -34 -107 -50 -36 -212 135 32 139 -5 79 130 107 -41 16 -103 72
2972 72 70 -207 -193 203 -123 -151 -110 -205 63 -98 -85 12 -64 30 129 68 -26 30 -15 -158 -12 60 -173 41 -170 -193
2998 -193 19 -211 -126 -87 31 -98 -34 -71 -60 111 105 -98 -196 186 -151 110 -47 188 18 18 52 -22 -162 -20
3022 -20 -15 66 359 103 -3 -111 80 -43 37 21 26 -89 -226 69 -10 -75 -100 9 61 273 -48 -261 -164 -78 16
3047 16 23 -230 53 37 -164 0 -28 -67 -255 3 -252 -59 81 59 96 -61 106 -189 -121 -56 21 -48 178 31
3071 31 -19 -215 -61 12 61 -28 -39 -77 -49 122 -46 -18 -83 -90 39 -30 274 41 -56 149 111 236 171 -106 -40 87
3097 87 192 -27 -208 122 139 109 -132 -165 282 315 -33 -118 135 -268 210 4 -124 103 154 -105 161 -128
3119 -128 87 -133 -50 -70 23 -55 -4 -36 76 49 -75 -38 -45 -122 -1 -221 -15 -28 -45 -120 -14 -72 163 133 -16
3144 -16 -65 119 144 -49 35 -82 -2 -305 -139 -12 201 11 -21 -64 -20 82 161 -7 39 5 -10 -188 183 -414
3168 -414 134 73 -192 125 -30 -129 168 60 -157 228 -148 171 247 139 165 155 206 200 -7 -32 134 58 -45
3191 -45 -117 122 -34 -72 -10 -16 -35 61 243 73 105 -45 -79 237 -83 -42 167 -141 49 -70 -102 106 -125 187
3215 187 -135 5 107 -134 77 -3 -156 180 -104 -149 43 -6 154 -22 155 61 2 -178 74 -256 -168 201
3237 201 -176 11 -171 -61 69 -68 75 -58 -49 -22 -165 -223 122 39 93 23 -8 188 111 -24 78 -54 189
3260 189 359 -186 -56 121 -36 174 -47 -178 -172 9 20 -11 9 38 -89 154 174 149 15 37 -42 -27 -8 197
3284 197 119 59 298 -143 -71 -135 -126 -115 -35 15 165 295 -13 102 107 45 35 -178 -23 -106 -73 -360 -73 37 -28
3309 -28 86 124 -116 177 41 -10 -96 -65 -101 -61 101 30 -7 -115 12 -125 -50 22 10 -16 -63 -18 -121 221 -28
3334 -28 69 -98 -173 221 -240 -94 -287 62 -122 4 -19 -34 167 338 334 -278 201 354 -89 250 -85 18
3356 18 -215 82 -386 15 5 -10 131 -445 867 -171 126 237 136 -21 224 -104 -283 36 165 190 -211
3377 -211 172 45 151 -6 -134 -24 -75 -89 -52 86 -7 125 -307 19 94 -69 -36 -24 -38 130 15 -277 62
3400 62 74 34 -31 92 145 -208 101 32 -65 191 11 110 161 -43 -264 17 54 -236 -22 102 -69 170 130 -196
3424 -196 -9 -57 -174 103 104 -42 120 -97 -129 232 -86 -54 -12 36 210 -22 58 -313 -100 9 73 -165 90
3447 90 -59 126 12 11 53 124 25 78 231 6 61 64 285 107 63 -49 38 -142 383 -266 187 -303 85 0
3471 0 -92 51 47 343 -295 -232 -197 40 -330 -109 270 -349 143 -120 -495 -407 76 -11 -494 -247 68 144 577
3494 577 -18 4 201 49 25 32 -131 -111 -105 -4 42 -74 50 -54 -46 183 -267 267 -15 234 -27 -30 -177 -69
3518 -69 8 177 -105 15 -84 79 68 -150 44 22 -109 -143 92 -115 -99 -33 169 -40 -154 97 -35 -384 145
3541 145 -175 93 219 -49 -234 -128 110 34 -171 -228 118 -70 -102 46 -116 -47 41 73 98 -36 141 70 9
3564 9 160 -120 4 99 225 -111 161 -8 162 4 51 -42 -23 52 -63 321 202 -19 44 146 -150 -188 -114
3587 -114 -125 -21 24 -198 1 233 190 26 126 213 -140 133 118 -98 70 -73 -129 -52 49 141 -76 -87 27
3610 27 146 3 -171 11 69 85 75 140 51 -66 -267 -203 151 103 -3 -115 189 46 -203 37 -62 -104 34
3633 34 -102 -54 -51 -30 -92 -232 69 -230 -20 -189 -96 -20 -65 -82 -176 -203 144 -49 134 -15 165 107 141 150 -265
3658 -265 -49 112 169 149 -74 -66 -118 -165 -261 -54 -108 63 207 -40 -47 106 339 -19 -69 5 -243 -34 -10 52 -107
3683 -107 -13 -169 150 77 -97 65 12 38 -15 124 -139 84 97 161 -69 -152 156 -175 -60 -22 -97 212 164 -133
3707 -133 120 120 -37 231 -140 275 -133 -212 26 -32 317 -148 -517 1 -425 447 -89 -59 -336 -606 -416 78
3729 78 -523 -16 368 103 -318 -153 154 -123 -13 -64 22 -206 -69 -93 18 -45 22 -113 167 150 -19 -34 -134
3752 -134 -127 174 102 76 -70 -89 105 81 73 22 81 101 19 -4 180 -15 -14 167 16 174 207 17 -77 -114 -15 -1 -74
3779 -74 46 -19 -2 166 54 -6 -188 -195 89 25 7 93 26 8 108 -154 42 268 141 30 12 70 108 260 -17
3804 -17 235 -102 7 -232 -215 -14 206 22 15 -10 -91 97 126 -77 -78 171 29 -112 78 53 169 48 115 -157
3828 -157 58 28 -44 107 137 15 -264 -19 -5 -61 -166 39 26 -104 75 126 -53 197 128 -27 -13 67 -29 109
3852 109 14 58 134 61 110 -57 -60 -12 347 232 54 133 -117 65 -150 -11 -1 128 -14 114 -328 -7 4 -215
3876 -215 55 -118 -111 29 26 45 -341 -59 41 6 -162 -53 -174 91 4 176 -192 -33 108 0 -122 204
3898 204 37 43 -29 131 -61 79 47 -210 30 -51 76 13 143 234 1 13 340 -160 7 352 -42 -98 -77
3921 -77 -103 275 -43 -160 -172 426 -59 308 255 -3 -155 162 200 -24 -58 -17 -2 -9 -28 233 107 10 -191 -87
3945 -87 -25 153 91 101 113 190 48 -37 -136 -168 -154 19 -31 -79 -114 54 75 69 -36 -35 122 87 -136 166 1 -114
3971 -114 167 -55 -37 5 224 108 -237 144 -163 2 -48 -289 256 -13 142 250 100 -53 -62 -96 -71 80
3993 80 -4 49 41 -32 105 91 36 1 -24 8 -206 -70 41 140 -57 -264 -56 339 166 96 -1 107 73 115 -16
4018 -16 -183 -135 281 125 -137 259 -85 59 34 -169 73 -52 181 -49 -151 154 -223 84 277 -11 1
4039 1 -68 -27 165 9 -82 41 131 51 -229 -193 -78 238 -31 65 106 90 -222 -71 -89 -83 20 -6 21 101 -73 269
4065 269 4 -61 212 114 160 -48 -130 -47 143 12 62 -173 206 -94 96 148 -75 49 53 117 37 -106 190 64
4089 64 -99 122 227 -171 -57 -62 -139 -69 64 -75 -88 -76 -19 -130 86 -50 42 -205 187 138 155 76 -115 42
4113 42 -61 140 -136 -138 -51 -19 103 131 158 -235 -76 -91 -171 -94 -46 98 -17 23 139 -60 -87 -27 -254 -149 67
4138 67 -147 -35 -76 81 -125 -26 45 -29 -162 201 -163 -216 -97 249 -67 129 190 318 -194 138 528 416
4160 416 203 110 -44 -64 -211 53 -41 -101 99 -39 182 -70 -54 229 -49 -131 -233 -225 -110 106 -42 -100 -174
4183 -174 101 118 -21 242 -130 -111 33 54 111 97 56 -111 -87 -138 -23 86 -78 -218 60 92 -53 5 51 -74
4207 -74 -274 150 -31 48 -43 -62 97 336 189 4 18 -251 26 -140 106 -103 195 31 -190 178 -56 -50
4229 -50 -113 101 91 -66 243 -221 -690 194 -135 -92 -122 -231 -288 45 106 210 100 -16 147 25 -144 52
4251 52 -154 122 65 16 -39 -19 25 134 133 -41 -16 10 -153 -153 -91 -30 -34 101 -31 163 -110 199 83 -17 230
4276 230 55 -120 88 106 -296 -287 112 -171 -129 -158 -96 221 20 -24 70 71 -10 245 103 116 167 61 59 -50 123
4301 123 -98 -82 -146 -71 -77 -47 33 -103 47 -291 10 13 -80 -243 169 -136 235 148 25 419 96 -109 120 -227
4325 -227 -154 -414 341 41 59 -656 -395 -291 -13 120 -1 -181 -195 80 113 -21 38 -157 -41 -75 32 -79
4347 -79 -20 -17 39 -14 179 111 -65 -167 -196 125 38 100 91 117 126 -119 -46 -39 88 182 34 -219 -219 -369 -136 87 237
4374 237 -104 -5 119 -284 68 -181 216 156 145 -140 93 -150 -24 102 -104 -168 30 7 -101 106 -146 -124
4396 -124 -221 -97 -214 -81 -246 240 -189 -66 233 -118 -114 39 129 -98 69 -183 239 -171 -140 274 3 -65
4418 -65 33 13 81 87 171 111 47 55 -92 -13 -43 -22 -65 -51 -170 -22 54 154 107 -24 15 54 -48 37 -216 67 76 1
4446 1 165 -223 24 189 -6 -77 -230 1 40 -104 10 137 10 -116 -265 -282 144 12 -122 27 -49 -164
4468 -164 117 -163 75 -73 6 -189 -88 53 -110 88 -36 -20 -91 -38 -82 -247 -180 192 -253 72 81 41 -10
4491 -10 169 -4 27 -11 90 178 37 14 -108 244 143 70 77 67 11 -72 -63 110 -72 -122 -165 54 -14 94 257
4516 257 -80 8 260 -119 10 -2 -59 -28 -89 -63 188 64 -68 -4 19 115 86 91 -6 48 151 -63 134 -152 101
4541 101 75 -193 -125 -114 -7 196 -12 -70 50 -49 -158 -20 70 -61 91 -113 117 112 211 -139 69 -65 -223
4564 -223 -224 39 -129 -25 -123 -109 64 224 94 -205 113 93 63 -43 -8 -15 -102 244 -147 -385 22 11 108 0
4588 0 -90 73 -137 -12 -91 -191 -52 -89 -370 90 221 113 76 222 287 186 163 5 -2 -25 -95 220 -51 -217
4612 -217 -122 -51 260 -60 53 80 220 -103 -135 -260 12 -101 -186 -127 55 55 -145 -1 -57 58 171 12 95
4635 95 440 -120 -46 -12 13 -119 -9 231 93 113 62 -125 32 80 148 43 -80 -28 79 57 54 126 -95 71
4659 71 -7 -49 146 -90 81 32 -176 -117 147 123 -97 59 -99 36 -102 170 14 21 -3 113 129 60 -60 -195
4683 -195 -217 6 -219 -62 -311 -153 -98 180 119 -331 -57 -94 268 33 -94 169 -76 12 -10 10 -61 61 141
4706 141 -85 -19 -191 -109 146 -4 252 21 -207 -115 124 28 -91 4 -102 -6 -130 209 268 -27 -96 -49 33
4729 33 242 -60 157 149 -42 -190 -19 -62 134 -30 -120 -218 62 78 12 196 -43 -215 263 81 68 -20 -20 30
4753 30 -142 -44 -152 -98 40 -66 98 21 -7 142 74 158 14 133 -63 -236 -185 -101 -233 35 -95 198 -30
4776 -30 21 -22 -56 87 -47 -23 13 -141 -52 44 -112 63 189 -30 26 -26 -146 92 39 63 105 29 219 34 -85
4801 -85 165 117 3 -3 -21 -222 71 -81 66 46 -189 32 174 -127 9 75 165 -188 82 188 -229 11 -6
4824 -6 -129 -30 -178 62 -180 -38 -6 -135 -79 17 -182 6 -84 188 21 -76 -210 -14 -54 129 -132 -206 -68
4847 -68 144 207 -291 54 -48 180 -14 178 -105 53 182 -127 286 -16 70 -11 -67 148 -69 47 -162 -60
4869 -60 0 -117 -222 48 76 10 2 158 -82 121 15 -286 35 90 -109 -146 38 -55 -76 -101 -68 -135 19 -188
4893 -188 30 -22 -48 162 -4 -189 57 146 40 44 -100 -75 -36 -72 -53 -155 -178 95 27 -93 -161 -163 39 -79 -76
4918 -76 68 39 -33 -148 -54 -38 228 58 107 -27 -117 197 1 -106 -64 16 -176 -95 151 26 -174 -101 197 69
4942 69 39 73 -11 -98 125 -86 -25 153 -151 -170 21 -176 -54 -15 -70 -166 -64 117 -87 -108 -179 22 205 96
4966 96 -188 87 25 -56 218 -315 157 -230 -208 157 -23 -127 -155 -256 -92 -47 5 26 27 21 49 63 -42 53 134
4991 134 103 39 304 165 14 -68 -152 109 -34 -101 96 138 -65 57 62 -16 165 -52 11 -79 -94 -254 -67 -93
5015 -93 71 -78 -29 -198 -147 -33 -34 -72 -44 -82 -228 81 -217 -89 -31 142 -78 38 -18 -22 -24 43 78 -8 -13 38 -18
5042 -18 212 39 106 52 -25 -58 53 -120 101 -138 43 -98 21 -14 -10 -112 113 136 42 -30 2 -88 157 256 92
5067 92 270 14 -155 -121 131 -47 -174 158 -7 -259 37 -5 -71 130 58 -126 10 -201 -25 -244 -65 31
5089 31 -190 115 121 52 -206 46 -28 -148 -164 -36 28 80 -69 -84 63 -42 95 52 -2 -88 55 -34 -32 -31 51 36
5115 36 78 208 -267 15 62 -144 181 -76 -54 31 111 -182 -129 -121 -7 -1 124 55 -115 -104 198 37 69 -107 -92
5140 -92 13 -68 -103 294 269 24 -142 168 -65 -65 -118 -1 236 -34 -117 -52 76 -182 229 127 60 186 67
5163 67 194 -209 -198 -164 195 63 2 -150 -36 -211 -53 -120 -249 -97 -80 -115 146 141 -81 -9 -23 152 32 -110
5187 -110 17 3 124 -63 20 92 241 210 -3 15 -69 146 80 84 -5 75 125 -13 -11 1 75 134 32 128 -31 97
5213 97 -48 115 -281 9 -15 47 -169 81 -69 -7 233 -129 93 -218 -109 -29 69 60 -104 -57 220 -267 97
5236 97 -107 -6 220 -30 -47 -146 97 28 -50 -25 114 -111 -130 -42 94 65 -78 -127 44 122 1 -232 -48 0
5260 0 -58 105 50 -78 128 -6 -48 250 -92 -81 162 36 32 -103 -93 -62 -82 -73 85 37 194 175 -93 182 181 -38
5286 -38 350 344 -201 55 315 260 -135 94 -132 101 -122 0 192 -261 -72 77 119 31 241 121 32 -120
5308 -120 117 59 79 -53 -1 175 129 -75 -36 3 168 184 -169 -150 -135 230 210 206 7 66 140 31 -253 -28 -252
5333 -252 62 103 30 232 -138 -38 -10 -113 -52 -61 150 70 37 -7 59 -47 35 90 33 -59 179 138 -174 -136 -19
5358 -19 -62 124 -12 -139 -5 -140 -8 -85 5 -131 125 -370 109 39 106 86 -65 -3 150 151 64 63 -124 -41 -110
5383 -110 88 257 -224 105 1 25 148 112 -95 -16 -18 -97 345 -4 -9 -101 -16 153 17 80 -111 169 184 -210
5407 -210 -221 -20 -39 -6 -142 -114 0 -148 -93 -167 140 -39 106 11 -214 283 130 19 37 -32 207 165 14
5430 14 -85 -2 1 -122 239 89 -172 -52 26 125 133 99 13 -31 -143 146 51 22 37 101 12 302 73 -54 -28 -4
5456 -4 -88 323 54 -88 -260 56 -208 -55 -221 -232 83 112 -200 145 231 -115 -184 35 77 109 -232 -70 88
5479 88 35 8 5 27 28 97 81 -53 -92 18 -7 143 -115 -283 -64 -219 281 -55 80 9 -224 51 -60 -579
5503 -579 41 -240 -12 408 118 32 196 351 -22 312 95 62 -192 97 44 132 -20 250 -124 22 -63 14
5525 14 101 -53 178 -148 103 89 28 253 -71 37 1 -99 64 -27 -68 -178 -67 -47 -149 113 -79 -56 -1
5548 -1 -91 79 -47 24 -94 -204 55 22 13 102 140 -104 105 -148 -80 -127 -73 47 -115 201 -31 -95 -134 14 -55
5573 -55 55 93 196 -5 30 30 -61 -94 -41 -24 -104 56 241 62 347 107 59 4 -78 -14 -131 48 -275 -4 101
5598 101 -160 34 180 183 59 133 -159 56 -32 -40 -40 -27 -172 45 -36 183 -59 99 161 -50 29 -249 16 -167
5622 -167 254 7 189 220 -211 41 59 -139 46 -97 -58 6 28 -151 20 -186 -123 244 121 22 147 -32
5644 -32 -52 -20 -285 -48 71 -169 -105 42 -69 -76 -46 14 135 201 -104 -44 -84 -9 -55 150 149 75 -47 172 -57
5669 -57 -61 193 214 301 -25 81 96 -77 -22 -55 -22 -8 -240 10 22 -84 43 174 -167 14 255 8 220 -52
5693 -52 -232 -111 162 387 401 127 272 935 143 28 -26 161 119 -56 297 -428 201 -145 -130 66 77 167
5715 167 171 35 -128 82 43 49 318 124 -8 -94 119 -68 139 -56 -27 85 -97 -109 98 167 -29 1 58 -39
5739 -39 -23 48 -86 89 259 142 26 73 215 -213 -81 -6 25 -41 -25 -1 11 37 -65 114 -127 9 -162 -149
5763 -149 89 8 83 -123 15 87 -140 135 -235 -66 -92 -160 -225 55 83 168 -37 -1 66 -150 1 15 -40 82
5787 82 -16 -307 53 26 -105 -57 110 -162 118 67 111 201 -206 -116 -181 -120 -110 143 -73 -272 -93 0 90 -23
5811 -23 -103 -74 75 119 -383 54 -15 -597 103 148 -31 -68 -270 -8 -112 -218 -127 532 189 107 -482 -361 -299
5834 -299 297 204 140 159 204 25 62 98 -58 20 26 -76 180 -77 -42 214 -12 293 28 128 242 -49 -6 -150
5858 -150 -124 188 -91 82 -190 -108 57 -14 -116 -25 96 -2 54 62 -15 265 109 -95 134 178 228 -17 -82 -152
5882 -152 -150 98 -88 68 230 -178 38 -52 -142 129 -17 -65 154 56 80 123 53 -162 -219 61 142 -109 -21 123
5906 123 -118 -22 -125 6 172 -138 -162 286 129 103 139 -3 157 -28 -218 -101 -45 -92 -129 21 -167 -34
5928 -34 -5 50 101 -62 7 68 -149 158 -228 -38 100 -70 96 118 210 66 186 42 121 225 34 -96 8
5951 8 -69 105 -93 29 -131 -28 -26 -78 -250 253 105 -9 -173 58 25 43 -139 -119 -95 -127 86 -95 -182 -36
5975 -36 4 100 -73 -110 79 -140 74 -39 -75 8 -62 -35 139 84 68 -63 -27 257 78 -10 112 -162 -6 -203
5999 -203 171 207 144 126 -40 102 79 247 169 -11 -301 -151 35 -168 -303 18 -42 80 -73 -22 -41 -180 -258
6022 -258 -63 -47 -175 124 -38 181 -224 -86 -42 169 37 -1 -60 -186 65 352 -86 -367 104 -48 29 -94
6044 -94 -308 -318 -54 -35 -245 376 -211 114 -680 -397 -157 94 292 -572 -216 540 161 -372 -322 -187 181
6065 181 -57 113 85 -110 72 244 28 213 -55 313 -100 125 78 -93 -49 -158 -220 74 -88 22 -108
6086 -108 110 -78 333 -32 130 -160 32 -31 16 118 106 -165 91 -279 -107 -12 137 232 166 10 -358 16
6108 16 13 164 -174 -36 -21 -19 -139 -178 132 16 -59 -272 -157 20 -69 -51 48 -88 168 -7 154 -189 -196 99
6132 99 176 92 -108 -49 -108 19 149 2 41 64 21 -102 -9 4 21 -95 -42 123 6 55 81 -87 -49 -67 -28 -50
6158 -50 10 39 -289 152 -104 148 -185 73 -136 186 127 -92 71 74 -35 -8 -269 -155 -85 -146 -113 36 -169
6181 -169 -257 37 -387 72 -140 2 -14 -13 27 79 38 -222 -68 -87 92 -64 -72 139 -12 -49 -126 86 -14 68
6205 68 126 -46 28 -19 -97 218 93 -39 -247 -71 157 186 -30 116 -344 -167 -37 59 -115 -110 117 62 -180
6228 -180 -34 -94 210 -9 -250 106 -45 -255 75 113 90 -205 156 29 83 -145 -43 -142 29 131 38 303
6250 303 19 83 -124 2 -53 -66 271 95 13 67 -6 -136 -30 46 -53 82 -156 -137 -80 -43 -96 69 46 -22 41
6275 41 -45 -71 44 107 -153 65 3 -152 -228 -45 -191 -14 21 -207 85 -18 156 2 -414 -89 102 -142
6297 -142 68 79 -185 54 -137 12 -119 -36 85 -108 67 -102 74 167 193 26 123 44 66 137 231 -80 114
6320 114 44 59 111 13 -28 -2 -177 11 -79 -48 -30 -55 -96 -182 -57 -239 17 -20 294 68 134 311 93 -121 -157
6345 -157 43 27 -22 8 -276 170 105 24 -232 -131 41 44 -98 -134 131 -121 -224 -255 -2 -71 64 48 -77 -183
6369 -183 -131 -104 -26 -16 -74 143 214 59 9 15 -87 -186 -237 -74 89 20 -66 101 138 109 39 -111 -56 37 66 89 -155
6396 -155 22 5 -85 -7 -182 -124 51 136 110 67 219 48 -167 -82 106 -100 -189 107 195 95 313 -43 -147
6419 -147 140 -100 12 -223 -29 77 -256 -50 72 74 13 21 -168 -124 -53 56 -74 69 70 123 45 -135 114 -129
6443 -129 -79 -37 -155 202 -162 55 49 -199 87 -104 40 -143 43 -215 -105 -162 -102 -208 -88 -253 2 -104
6465 -104 75 0 -56 -169 -116 197 55 157 -184 -41 -26 -10 -46 189 234 -132 238 143 28 109 89 1 38 217
6489 217 81 -115 -182 -104 130 227 -99 -84 67 -19 7 -64 71 220 64 -110 -81 -72 -131 -114 64 226 269 -67
6513 -67 0 -71 -41 -102 -68 39 15 -85 221 -88 175 51 70 -92 -99 -51 -67 -166 32 215 95 -70 -222 169
6537 169 21 35 104 -167 146 40 -126 -56 119 -217 -66 27 -3 329 -143 65 92 -55 52 -153 -43 16
6559 16 -55 55 7 143 152 23 160 -62 -63 2 -125 -70 198 71 -179 -9 -14 -18 39 48 -87 -82 70 -51 155 -1
6585 -1 -52 -175 -200 -40 -22 -31 224 102 -133 -95 -284 45 29 -2 256 82 -161 71 -78 -270 150 -115 63
6608 63 -109 4 145 -15 -180 -155 325 231 -50 -277 -11 123 91 266 -72 276 -136 -122 -92 -37 60 36 22
6631 22 -1 -76 111 27 -199 -40 78 -17 -81 -158 1 -47 -296 22 -149 27 58 -26 157 54 329 -112 29
6654 29 104 -101 -141 30 -66 -218 125 -6 106 44 -39 93 -97 -127 17 -116 35 -1 184 -165 -333 224 113
6677 113 -101 -191 9 202 104 6 359 -173 52 80 90 213 36 12 100 -164 46 -101 23 198 136 -125 201
6700 201 62 96 -13 30 1 39 -89 36 -35 -183 -99 -297 -211 -25 64 -207 45 46 -15 -95 -190 69 -23 134 92
6725 92 -88 -8 319 -238 105 3 59 -46 -30 75 56 -16 14 -364 -127 183 -200 255 58 213 41 18 10
6748 10 -91 -91 -133 78 -91 29 177 -199 -226 -16 32 -186 -221 -281 88 179 -6 153 104 -173 -68 40 69 -25
6772 -25 -20 -58 35 -221 -146 -61 277 -52 -100 65 40 178 -285 238 -90 77 -120 -209 21 97 27 -31 137 126 117
6797 117 -68 25 -92 -208 -9 233 20 226 144 -186 -3 34 -103 32 -81 71 272 46 18 323 30
6818 30 -302 57 83 44 -160 101 -104 -166 38 -57 155 -247 -69 111 -82 -114 181 -102 51 -38 37 -63 77
6841 77 48 1 107 289 -47 97 198 3 58 128 45 -132 132 -16 24 -11 182 202 -62 5 -16 28 40 -109
6865 -109 54 33 3 -221 54 -49 28 -312 228 123 60 -241 15 -21 -86 -25 -24 168 -96 77 11 -36 101 -60
6889 -60 -122 150 -129 -28 -110 -349 81 -38 46 75 -80 5 -208 -45 -233 -233 227 -53 -80 -210 -169 32 -153
6912 -153 -71 105 -36 -62 -125 -141 133 -258 137 13 183 -45 15 123 -72 25 -121 99 119 161 11 -5 15
6935 15 133 77 150 -191 -90 138 -67 198 -191 160 42 -166 -169 -121 69 -75 147 -8 229 -87 125 133 8
6958 8 -111 227 -43 18 153 -47 -163 -134 6 -7 4 56 67 23 -84 -134 -119 39 -7 -87 154 -20 252 -40
6982 -40 87 -254 -42 -153 50 -232 -64 116 41 166 146 122 55 39 64 59 -59 54 -50 26 30 -202 -72 -41
7006 -41 39 73 -55 208 -227 -265 -41 96 45 -17 69 113 -236 208 -226 25 115 -424 298 -450 -115 339 175
7029 175 -95 127 -204 93 150 -213 130 -35 105 80 22 -154 -13 -157 -21 -9 4 -11 -121 -95 -220 -60
7051 -60 64 -239 -76 330 196 34 -32 -226 -52 -147 -279 -155 -3 148 202 15 97 -12 -72 -42 -108 145 -45
7074 -45 124 -42 78 -89 -49 204 -89 -65 -12 132 42 -63 18 67 -123 107 -27 -208 50 -13 9 31 84 184
7098 184 111 -182 -232 34 -155 -150 63 -3 -10 -71 123 91 -29 -120 -96 74 -38 46 23 152 -105 125 -29 -30 56
7123 56 -324 -27 57 -1 -19 -87 80 -80 99 -64 179 -119 170 7 -44 39 -224 -219 -43 35 -4 42 -256 262
7147 262 -148 -57 -58 -55 -37 -3 24 55 -15 -128 -100 -44 -76 13 -4 -137 246 -115 -53 145 -27 143 29 264 -214
7172 -214 -9 -7 -217 -172 18 71 -113 46 -76 88 -155 -69 -89 -35 -87 -73 -124 141 -89 -153 36 -101 136 -40
7196 -40 -33 -52 129 -10 164 68 -28 6 -161 -151 -46 155 -34 -48 -99 12 -18 -111 237 66 113 57 -78 -20 -41
7221 -41 -105 233 25 52 20 -78 64 176 -130 75 -152 110 61 -7 246 -26 -127 9 128 159 135 239 -175
7244 -175 117 -118 3 51 -79 33 -23 -146 32 -92 162 -528 -155 279 99 -71 -68 28 -105 -78 -215 -46
7266 -46 -147 84 209 -75 37 39 -118 140 263 -48 172 -92 5 256 -274 104 7 65 6 -123 -27 -72 110
7289 110 101 -137 -33 75 43 -53 -50 53 -74 74 37 -59 83 100 148 -25 -332 -28 -14 132 -25 -17 114 107 -74
7314 -74 -49 54 335 322 -110 123 -21 57 82 181 109 -73 -119 -76 -150 125 -161 228 -5 204 20 0 48 -108
7338 -108 -74 100 61 169 -142 -10 37 -112 -22 64 109 -102 129 15 45 -300 95 -150 -175 -273 -111 58 -168
7361 -168 -129 69 -75 43 -36 -42 19 117 -83 -20 161 -138 -56 -170 -87 -10 -24 -172 -145 95 -19 54 -103 4
7385 4 69 -170 -205 73 59 81 257 193 20 64 -113 34 206 110 -138 298 -214 20 -48 -77 21 -66 -212 -189 -6
7410 -6 -85 58 -374 -43 -102 121 -102 -150 -73 116 2 -19 172 -196 217 9 -31 220 99 -11 35 -99 -140
7433 -140 -88 3 -5 91 -29 -20 -284 237 66 8 37 -106 150 -164 38 -45 -24 38 108 -45 110 135 -296 -76 -65
7458 -65 -21 -4 132 -59 114 120 -230 -90 64 -93 -246 125 -52 202 74 -389 -350 188 -200 484 -241 -844
7480 -844 452 4 -364 -69 -537 -20 201 23 30 78 135 -74 12 -267 144 -42 131 -183 -57 157 -160
7501 -160 -76 -107 171 -122 -421 88 51 -233 -96 -54 -21 14 -154 -176 -86 -140 39 -146 4 -177 -80 239 422
7524 422 9 10 202 -104 -261 -143 202 -34 -173 271 -195 96 -52 38 -66 -98 140 171 237 -22 -12 72 62
7547 62 -64 236 94 -12 84 -151 -210 151 -9 -223 45 523 -6 95 19 -67 88 187 13 66 -66 180
7569 180 -165 14 133 180 18 -13 -143 -96 172 35 148 46 219 -58 -260 -92 -214 105 74 -139 -62 -82
7591 -82 42 -126 7 263 66 108 -87 -46 -95 -53 41 38 -135 -128 -234 66 111 -49 178 85 60 47 102 -2 273
7616 273 134 -76 196 -54 -123 -46 -51 -128 60 -90 180 60 27 90 -292 -21 76 30 44 -32 -34 57 113 198 148 -32
7642 -32 -77 -79 178 -38 81 3 83 131 -148 44 54 -63 -162 135 -105 60 113 13 67 -35 78 39 -29 -23 48
7667 48 43 -240 112 -190 1 -240 16 159 153 171 28 -126 -49 113 26 50 99 153 -99 -117 -87 80 -172 2
7691 2 170 103 24 -159 51 -58 28 21 -7 -18 -28 310 -25 123 30 122 192 -171 33 -98 -7 -150 -146 -169 -43 -28
7717 -28 34 111 35 -194 67 -72 -244 -76 -54 -168 -109 -134 128 205 -129 87 142 -178 -99 -49 277 -113 193 67
7741 67 -141 118 -15 80 6 48 179 -136 259 107 75 5 288 -46 166 -58 -36 112 59 -29 79 214 -285
7764 -285 79 81 47 -185 -143 -21 241 -19 -102 -188 231 47 -25 -91 293 244 -291 195 -51 252 -253 -32 -76
7787 -76 -114 109 50 75 91 -21 45 56 -44 -80 -78 32 -45 136 -143 -8 182 38 -62 -122 -41 25 163 21 39
7812 39 -198 191 35 110 26 46 143 102 -13 -275 27 167 270 -163 6 -58 -71 -74 -130 -81 -36 -205 70 -71
7836 -71 45 -27 -82 178 -288 -96 -164 47 -6 -77 191 84 -197 283 39 -135 -276 161 84 -91 -67 57 -142
7859 -142 -20 -9 -34 163 170 97 -110 -116 130 26 77 -124 -64 144 -54 163 -106 -380 -90 -5 -232 -206 287 159
7883 159 -25 8 98 37 -97 -6 151 -46 15 -33 77 51 47 -152 25 129 269 161 -110 -85 -30 39 -91 -112
7907 -112 -25 -52 28 -436 -171 143 75 109 -28 -147 213 -11 -36 169 -59 -16 321 65 -120 200 -63 110
7929 110 62 66 -135 -69 9 -253 11 165 -128 39 150 -172 -159 -68 -182 -209 71 -179 57 -304 -165 -113 69
7952 69 -94 13 -3 8 -53 182 69 -79 -136 351 173 -7 177 -13 -274 -96 -2 11 -291 -44 -8 7 -13
7975 -13 -181 201 -74 -194 203 -166 0 -179 -59 145 -102 288 -44 -132 20 -35 64 27 25 -186 53 -191
7997 -191 60 193 -110 19 -30 37 -38 -158 16 -38 -14 -144 -332 381 40 -71 117 259 119 1 90 -218
8019 -218 -5 10 71 -15 246 -76 -96 -270 -76 -202 33 40 61 -57 58 112 -310 69 -35 -310 -51 39 143
8042 143 65 -127 183 -82 36 -42 236 -102 195 -3 5 136 -327 134 -19 -110 182 -89 -49 -15 134 43 -242
8065 -242 -66 -119 74 -9 7 48 251 234 0 207 19 88 -31 131 -267 -135 69 -30 35 -19 66 14 36 -57
8089 -57 116 89 -1 -97 -138 -83 -138 -81 -9 4 -149 4 74 41 -110 140 17 -78 -32 12 -116 -60 15 -65 177 -8
8115 -8 -203 41 213 138 187 -5 -12 127 -48 112 152 -30 -44 -139 119 4 17 103 82 106 -83 20 -64 -122 -46
8140 -46 345 7 -168 118 -16 52 -168 -10 -29 18 -75 59 -189 -203 117 -151 323 20 -9 135 -18 -108 24
8163 24 30 119 222 105 -149 23 129 -21 243 -180 -8 95 133 341 -161 -154 -95 10 196 -173 -88 37 -245
8186 -245 -106 92 -66 208 38
8191C8
##END NTUPLES=NMR FID
##END=
