##TITLE=1H_SR30_Kr
 CDCl3,8 sc, 
 3.02.2021
##JCAMPDX= 6.0         $$ Bruker NMR JCAMP-DX V2.0
##DATA TYPE= NMR FID
##DATA CLASS= NTUPLES
##ORIGIN= UXNMR, Bruker Analytische Messtechnik GmbH
##OWNER= root
$$ XWIN-NMR		Version 3.5
$$ Wed Feb  3 10:11:46 2021 Russian Standard Time (UT+4h)  she@DPX200
##.OBSERVE FREQUENCY= 200.1315066352
##.OBSERVE NUCLEUS= ^1H
##.DELAY= (6, 6)
##.ACQUISITION MODE= SIMULTANEOUS
##.ACQUISITION SCHEME= undefined
##.AVERAGES= 8
##.DIGITISER RES= 18
##SPECTROMETER/DATA SYSTEM= spect
##.PULSE SEQUENCE= zg30
##.SOLVENT NAME= CDCl3
##.SHIFT REFERENCE= (INTERNAL, CDCl3, 0, 15.7039)
##AUDIT TRAIL= $$ (NUMBER, WHEN, WHO, WHERE, WHAT)
$$ ##TITLE= Audit trail, XWIN-NMR		Version 3.5
$$ ##JCAMPDX= 5.01
$$ ##ORIGIN= Bruker BioSpin GmbH
$$ ##OWNER= she
$$ F:/spectra/data/she/nmr/H-F/1/audita.txt
$$ ##AUDIT TRAIL=  $$ (NUMBER, WHEN, WHO, WHERE, WHAT)
(   1,<2021-02-03 10:10:51.98 +0400>,<she>,<DPX200>,
      <created by zg, POWCHK disabled, PULCHK disabled
       configuration hash MD5:
       00 E9 B6 7A A2 85 ED C7 34 08 36 98 17 FE 4E 26
       data hash MD5: 16K
       11 C4 A5 70 B6 79 9E 56 6D DD 64 27 14 FD 69 86>)
$$ ##END=
$$ 
$$ hash MD5
$$ FF 30 80 CD C0 B7 BC 51 DD 38 9D 36 84 AC A4 B9
##$RELAX= 
##$RELAX= 
##$RELAX= 
##$RELAX= 
##$RELAX= 
##$RELAX= 
$$ Bruker specific parameters
$$ --------------------------
##$DU= <F:/spectra>
##$EXPNO= 1
##$NAME= <H-F>
##$PROCNO= 1
##$TYPE= <nmr>
##$USER= <she>
##$AMP= (0..31)
100 100 100 100 100 100 100 100 100 100 100 100 100 100 100 100 100 100 
100 100 100 100 100 100 100 100 100 100 100 100 100 100 
##$AQSEQ= 0
##$AQ_mod= 1
##$AUNM= <au_zg>
##$AUTOPOS= <>
##$BF1= 200.13
##$BF2= 200.13
##$BF3= 200.13
##$BF4= 200.13
##$BF5= 200.13
##$BF6= 200.13
##$BF7= 200.13
##$BF8= 200.13
##$BYTORDA= 1
##$CFDGTYP= 0
##$CFRGTYP= 5
##$CHEMSTR= <none>
##$CNST= (0..31)
1 1 145 1 1 1 1 1 1 1 1 1 1 1 1 1 1 1 1 1 1 1 1 1 1 1 1 1 1 1 1 1 
##$CPDPRG= <>
##$CPDPRG1= <>
##$CPDPRG2= <>
##$CPDPRG3= <>
##$CPDPRG4= <mlev>
##$CPDPRG5= <mlev>
##$CPDPRG6= <mlev>
##$CPDPRG7= <mlev>
##$CPDPRG8= <mlev>
##$CPDPRGB= <>
##$CPDPRGT= <>
##$D= (0..31)
0 1.2 0 0 0 0 0 0 0 0.06 0 0.03 0 0 0 0 0.0002 0 0 0 0 0 0 0 0 0 0 0 0 
0 0 0 
##$DATE= 1612332651
##$DBL= (0..7)
120 120 120 120 120 120 120 120 
##$DBP= (0..7)
150 150 150 150 150 150 150 150 
##$DBP07= 0
##$DBPNAM0= <>
##$DBPNAM1= <>
##$DBPNAM2= <>
##$DBPNAM3= <>
##$DBPNAM4= <>
##$DBPNAM5= <>
##$DBPNAM6= <>
##$DBPNAM7= <>
##$DBPOAL= (0..7)
0.5 0.5 0.5 0.5 0.5 0.5 0.5 0.5 
##$DBPOFFS= (0..7)
0 0 0 0 0 0 0 0 
##$DE= 6
##$DECBNUC= <off>
##$DECIM= 32
##$DECNUC= <off>
##$DECSTAT= 4
##$DIGMOD= 1
##$DIGTYP= 9
##$DL= (0..7)
0 120 120 120 120 120 120 120 
##$DP= (0..7)
150 150 150 150 150 150 150 150 
##$DP07= 0
##$DPNAME0= <>
##$DPNAME1= <>
##$DPNAME2= <>
##$DPNAME3= <>
##$DPNAME4= <>
##$DPNAME5= <>
##$DPNAME6= <>
##$DPNAME7= <>
##$DPOAL= (0..7)
0.5 0.5 0.5 0.5 0.5 0.5 0.5 0.5 
##$DPOFFS= (0..7)
0 0 0 0 0 0 0 0 
##$DQDMODE= 0
##$DR= 18
##$DS= 0
##$DSLIST= <SSSSSSSSSSSSSSS>
$$ [...]
##$SUBNAM2= <"">
##$SUBNAM3= <"">
##$SUBNAM4= <"">
##$SUBNAM5= <"">
##$SUBNAM6= <"">
##$SUBNAM7= <"">
##$SUBNAM8= <"">
##$SUBNAM9= <"">
##$SW= 16.9725356469052
##$SWIBOX= (0..15)
0 0 2 0 0 0 0 0 0 0 0 0 0 0 0 0 
##$SW_h= 3396.73913043478
##$TD= 16384
##$TD0= 1
##$TE= 0
##$TE2= 300
##$TE3= 300
##$TEG= 300
##$TL= (0..7)
0 120 120 120 120 120 120 120 
##$TP= (0..7)
150 150 150 150 150 150 150 150 
##$TP07= 0
##$TPNAME0= <>
##$TPNAME1= <>
##$TPNAME2= <>
##$TPNAME3= <>
##$TPNAME4= <>
##$TPNAME5= <>
##$TPNAME6= <>
##$TPNAME7= <>
##$TPOAL= (0..7)
0.5 0.5 0.5 0.5 0.5 0.5 0.5 0.5 
##$TPOFFS= (0..7)
0 0 0 0 0 0 0 0 
##$TUNHIN= 0
##$TUNHOUT= 0
##$TUNXOUT= 0
##$USERA1= <user>
##$USERA2= <user>
##$USERA3= <user>
##$USERA4= <user>
##$USERA5= <user>
##$V9= 5
##$VALIST= <valist>
##$VCLIST= <CCCCCCCCCCCCCCC>
##$VD= 0
##$VDLIST= <DDDDDDDDDDDDDDD>
##$VPLIST= <PPPPPPPPPPPPPPP>
##$VTLIST= <TTTTTTTTTTTTTTT>
##$WBST= 1024
##$WBSW= 4
##$XGAIN= (0..3)
0 0 0 0 
##$XL= 0
##$YL= 0
##$YMAX_a= 95787
##$YMIN_a= -85878
##$ZGOPTNS= <>
##$ZL1= 120
##$ZL2= 120
##$ZL3= 120
##$ZL4= 120
##$ABSF1= 10
##$ABSF2= 0
##$ABSG= 5
##$ABSL= 3
##$ALPHA= 0
##$AQORDER= 0
##$ASSFAC= 0
##$ASSFACI= 0
##$ASSFACX= 0
##$ASSWID= 0
##$AUNMP= <proc_1d>
##$AZFE= 0.1
##$AZFW= 0.1
##$BCFW= 1
##$BC_mod= 2
##$BYTORDP= 1
##$COROFFS= 0
##$CY= 11.3945322036743
##$DATMOD= 1
##$DC= 2
##$DFILT= <>
##$DTYPP= 0
##$F1P= 15.9154993809931
##$F2P= -4.1035820241983
##$FCOR= 0.5
##$FTSIZE= 0
##$FT_mod= 4
##$GAMMA= 1
##$GB= 0.15
##$INTBC= 1
##$INTSCL= 1
##$ISEN= 128
##$LB= 0.24
##$LEV0= 0
##$LPBIN= 0
##$MAXI= 10000
##$MC2= 0
##$MEAN= 0
##$ME_mod= 0
##$MI= 1.114404
##$NCOEF= 0
##$NC_proc= 0
##$NLEV= 6
##$NOISF1= 3.799351
##$NOISF2= 2.8
##$NSP= 1
##$NTH_PI= 0
##$NZP= 0
##$OFFSET= 15.70392
##$PC= 1
##$PHC0= -10757.72
##$PHC1= 11.40095
##$PH_mod= 1
##$PKNL= yes
##$PPARMOD= 0
##$PSCAL= 0
##$PSIGN= 0
##$REVERSE= no
##$SF= 200.130013532006
##$SI= 16384
##$SIGF1= 3
##$SIGF2= 2
##$SINO= 400
##$SIOLD= 16384
##$SREGLST= <1H.CDCl3>
##$SSB= 0
##$STSI= 0
##$STSR= 0
##$SW_p= 3612.71676300578
##$SYMM= 0
##$S_DEV= 0
##$TDeff= 0
##$TDoff= 0
##$TI= <>
##$TILT= no
##$TM1= 0
##$TM2= 0
##$TOPLEV= 0
##$USERP1= <user>
##$USERP2= <user>
##$USERP3= <user>
##$USERP4= <user>
##$USERP5= <user>
##$WDW= 1
##$XDIM= 8192
##$YMAX_p= 0
##$YMIN_p= 0
$$ End of Bruker specific parameters
$$ ---------------------------------
##NTUPLES= NMR FID
##VAR_NAME=  TIME,          FID/REAL,        FID/IMAG
##SYMBOL=    X,             R,               I
##VAR_TYPE=  INDEPENDENT,   DEPENDENT,       DEPENDENT
##VAR_FORM=  AFFN,          ASDF,            ASDF
##VAR_DIM=   8192,          8192,            8192
##UNITS=     SECONDS,       ARBITRARY UNITS, ARBITRARY UNITS
##FACTOR=    0.0002944,     1,               1
##FIRST=     0,             0,               0
##LAST=      2.4114304,     0,               0
##MIN=       0,             -85878,          0
##MAX=       2.4114304,     95787,           0
$$ Real data points
##PAGE= N=1
##DATA TABLE= (X++(R..R)), XYDATA
$$ [...]
2261F80l26K37j93k10O63p73M92J30j04m05O22m70k87M19m84N15m82L18k79r6
$$ 680 354 591 398 188 851 78 570 700 596 191 813 343 56 475 -9 506 24 342 63 -33
2281c3j19N88J82o33N47p02K75k2M0J35l03l51L37J16j00K89m80K59o94R72q47
$$ -33 -152 436 618 -15 532 -170 105 83 123 258 -45 -396 -59 57 -43 246 -234 25 -669 303 -544
2302e44P48l24L88o70K53K83k63J52m08K04J0P4j49n6M0M84o56N16k85j37m8P88
$$ -544 204 -120 268 -402 -149 134 -129 23 -385 -181 -171 -97 -246 -302 -262 222 -434 82 -203 -340 -388 400
2324D00p59N18k25l22K27j78N37n75L46j22j9K83k5o33M07Q2J03m9o89M31Q7J35
$$ 400 -359 159 -66 -388 -161 -339 198 -377 -31 -153 -172 111 86 -547 -140 -58 45 -4 -693 -262 -175 -40
2346d0p4o14O11j14L81l15j25j12J76j08L92K27l69o1L60k55J75m84L02n0n5j66
$$ -40 -114 -728 -117 -231 150 -165 -290 -402 -226 -334 58 285 -84 -145 215 -40 135 -349 -47 -97 -152 -318
2368c18M63p5J22p5J5j7r7M56n36L22l1J16j49l0K96l06K1j96L16R8J60l22k59
$$ -318 145 70 192 117 132 115 18 474 -62 260 229 345 196 166 462 156 177 -19 297 395 555 233 -26
2391b6O12n15q1L79J01l46P0l09N15l08K53m23O84m88J72o01M12j15M46k05L1
$$ -26 586 71 -10 369 470 124 194 -115 400 92 345 -78 606 118 290 -311 101 -14 432 227 258
2412B58qn38M22m23L58m1M07k37o08J02q5O04m36N76n66K34n7k91o5K87j80K11
$$ 258 250 -288 134 -289 69 28 435 198 -410 -308 -393 211 -225 351 -215 19 -38 -329 -394 -107 -287 -76
2434g6n20L91k07M70l96K96O6j01q8p93O22L52Q0o59J33k60L76m78N55K86n68
$$ -76 -596 -205 -412 58 -338 -42 24 -77 -165 -958 -336 16 96 -563 -430 -690 -314 -792 -237 49 -519
2455e19L75Rl01P35m64j02K51j90n4K59q38J021l66K13N81l50J5k06P8k25J14
$$ -519 -144 -135 -436 299 -165 -267 -16 -206 -260 -1 -839 182 -184 29 610 260 275 69 147 -78 36
2476C6q29J267Ro75L54L40k76j81J36j79j87N52n76Q82L4r70j09L08PN86p40M18
$$ 36 -793 474 483 -192 162 502 226 45 181 2 -185 367 -209 673 707 -263 -372 -64 -57 529 -211 207
2498B07o09P25k27o19L12j43K7M48k89M55p0n73L39k96N02k74j05k72L57Q9k67
$$ 207 -402 323 96 -523 -211 -354 -327 121 -168 287 217 -356 -17 -313 189 -85 -190 -462 -105 -16 -283
2519b83N31m00pk32K50npl23K01O87l71J21j1J12l53l66L32K98Q2r05N61J92J35
$$ -283 248 -152 -159 -391 -141 -146 -153 -476 -275 412 41 162 151 263 -90 -456 -124 174 256 -649 -88 104 239
2542B39n07P63m49m3R3l89O92q16K40k18M21l6o3k53Q0K85m4J32P3O9l05o45Q98
$$ 239 -268 495 46 3 96 -293 399 -417 -177 -395 26 -10 -73 -326 -246 39 -5 127 200 269 -36 -681 217
2565B17l94K14o14N82J53n06L57L02p26K51N5L03r7l60K32j40L68J33n25j65L44
$$ 217 -177 37 -577 5 158 -348 9 311 -415 -164 -109 194 97 -263 -31 -171 197 330 -195 -360 -16
2586a6j73O1K45o53L60p0l27Q45m20J13j06K57j29j44j52K57k74j7J67j67l4l6
$$ -16 -189 -128 117 -536 -176 -246 -573 272 -148 -35 -141 116 -13 -157 -309 -52 -326 -343 -176 -343 -377 -413
2608d13M16M40m87o2K26p6M04l95k26R8J50r3K04j70q2J87J88J24m11k07Q3Ll44
$$ -413 3 443 -44 -106 120 44 448 53 -173 -75 75 -18 186 16 -66 121 309 433 22 -185 -102 -99 -443
2631d43M27l48Q7l35J283o36p8L73k94o31J88M98p98R30k21L9k64K45j88l17M06
$$ -443 -16 -364 -277 -612 671 35 -43 330 36 -595 -407 91 -707 223 2 41 -223 22 -166 -483 -77
2652g7n9L57p03M17K2J38n58k00M28K03l86l09L86K34j12Ko0J10m6m08Q16pl09
$$ -77 -136 221 -482 -65 -43 95 -463 -663 -235 -32 -418 -727 -341 -107 -219 -217 -277 -167 -213 -621 195 188 -121
2675a21J88O3l59K80L8J79l83K6k1J29Q1r3K24k94K65m8l50Q6Q0K16j0j6k30J80
$$ -121 67 130 -229 51 89 268 -115 -89 -110 19 100 7 231 -63 202 154 -196 -110 -30 186 176 160 -70 110
2699A10K11m88N8J76J62p1p3j2J29j1M8L84m06q9J37p7j99J38r4J83j83L6j8p8
$$ 110 321 -167 -109 67 229 158 85 73 202 191 239 623 217 128 265 188 -11 127 33 216 33 69 51 -27
2723b7K06r6k62P6m3J1O3O1J08p4j20J24j14L70k92J50O2l29P1J40Q2l68O13m46
$$ -27 179 83 -179 -103 -146 -135 -72 -11 97 23 -97 27 -87 283 -9 141 203 -126 -55 85 167 -201 412 -34
2747c4j22j2M3K5j03O8j31J31r6N3k5J02K86r0M4m12K50k51K19J67j36N3J22j40
$$ -34 -156 -168 -125 -100 -203 -135 -266 -135 -231 -178 -203 -101 185 95 139 -273 -23 -274 -55 112 -24 29 151 11
2771A1j65K49J21k29J25J66m62P7J80p2O3r7M9m0j33K44MK88l52J74j47k7l9l7
$$ 11 -154 95 216 -13 112 278 -184 -107 73 1 64 -33 16 -24 -157 87 91 379 27 201 54 27 -12 -49
2795d9P0n3K13k88J96j70L34k20pl4m2l3po1J56K2lj91M5N8R6L3J0K4p8J12n4
$$ -49 21 -32 181 -107 89 -81 253 33 26 -8 -50 -83 -90 -151 5 27 24 -167 -122 -64 32 65 75 99 21 133 79
2822G9M6l0K1p0J55K72n70J96k2r2P7N1q0R3k51J73P4k04J12N8j15K10J67l01
$$ 79 125 95 116 46 201 473 -97 99 77 -15 62 113 33 126 -125 48 122 -82 30 88 -27 183 350 49
2846D9Q5k0J25j56K30m24K02n1L8L98l29j7N2R0k91J06Rq7Q1m1J6n7j08K0J63
$$ 49 134 114 239 83 313 -111 91 40 78 476 147 130 182 272 -19 87 96 9 90 49 65 8 -100 -80 83
2871H3j34K44k58j17K78n14L94kl01K70j62J55R3q4j08L1j24J24nJ19l61O9J88
$$ 83 -51 193 -65 -182 96 -418 -24 -26 -327 -57 -219 -64 29 -55 -163 -132 -256 -132 -137 -18 -379 -310 -122
2894a22L1J6n9k1k4j60K68M1J16l71l5JK55n6P4j02L16j71k40O1n9Q5K21j04J00
$$ -122 -91 -75 -134 -155 -179 -339 -71 -30 86 -285 -320 -319 -64 -120 -46 -148 168 -3 -243 -182 -241 -156 65 -39 61
2919F1l2J7o8J99k38M01j68L1k05q3M1r4J95l55M06j09J95j47O8L43k21m34O63
$$ 61 29 46 -22 177 -61 340 172 203 -2 -85 -44 -138 57 -298 108 -1 194 47 115 458 237 -197 466
2942D66l65l04L12P4m35O41l31j21K89m55L69J05R0n53j65N88q27O07p3j58j5
$$ 466 101 -203 109 183 -252 389 58 -63 226 -229 140 245 335 -218 -383 205 -622 -15 -88 -246 -261
2963b61J07K36R5l02J77K58j013N95q5J31j98L45l28R04r28M04J51p31J72q6M88
$$ -261 -154 82 177 -125 52 310 -703 -108 -193 -62 -260 85 -243 661 -267 137 288 -443 -271 -357 131
2984A31J46J89l56j194J093l32L11m92L15J48K4K07l70m44R87p38k90P05P12j555
$$ 131 277 466 110 -1084 9 -323 -12 -504 -189 -41 -17 190 -180 -624 363 -375 -665 40 752 -803
3004h03K17R17j07k60k17J25K36m54K26k72K90k98M71p18K26J24k18k09O33l94
$$ -803 -586 331 224 -36 -253 -128 108 -346 -120 -392 -102 -400 71 -647 -421 -297 -515 -724 -91 -485
3024d85O7J277j107J90l96N12L1l83M38l33k58MN95N46r38j32J11n3o69M63P01
$$ -485 -418 859 -248 -58 -454 58 89 -294 144 -189 -447 -443 152 698 -240 -372 -261 -314 -983 -520 181
3045A81L22r85K11M52j68r35LM59O58j575J411L28m98o38O79o84Q51o02j18M27
$$ 181 503 -482 -271 181 13 -922 -919 -460 198 -1377 34 362 -136 -774 -95 -779 72 -530 -648 -221
3065b21L11j93p2J35j85R7L28j008M43N05no61l64J243l52N91l14kk80M35l27
$$ -221 90 -103 -175 -40 -225 -128 200 -808 -365 140 135 -526 -890 353 1 592 278 276 -4 431 104
3086A04O3m5P21j475O83k51O50j27j12k81m8k6M88n8k53k09M12j70j97K40l96
$$ 104 167 122 843 -632 51 -200 450 323 211 -70 -118 -144 344 286 33 -176 236 66 -131 109 -287
3107b87M29n6r2K70l19J18m72L55k63K8L63l49L06j94MK59K21m59k31k33N91k82
$$ -287 142 86 -6 264 -55 63 -409 -54 -317 -289 74 -275 31 -163 -159 100 321 -138 -369 -602 -11 -293
3129b93j06L58n90M22L80m9j06k16K65j43o9o6J2R6l21J77j06M21j72K68L99n09
$$ -293 -399 -41 -631 -209 171 122 16 -200 65 -78 -147 -213 -201 -105 -426 -249 -355 66 -106 162 561 52
3151E2j67l07K87j18J12o5M4r3j96M38L16R2O15j554P78j34R9J21o32nP52o32
$$ 52 -115 -422 -135 -253 -141 -206 -162 -255 -451 -13 303 395 1010 -544 234 100 199 320 -312 -317 435 -197
3173a97J63O29j74m91J36o00O88K42q62P48K3n00P3M35k75M62l38j82j78m37Q84
$$ -197 -34 595 421 -70 66 -534 154 396 -466 282 305 -195 -122 313 38 500 162 -20 -198 -635 249
3194B49J1m29L65l24k45M6N69n38N82M86q31K22n93J058p15Q40j001L69O40l35
$$ 249 260 -169 196 -128 -373 -327 242 -296 286 772 -59 163 -430 628 -87 753 -248 121 761 426
3214D26r65J13Q43N84J86j503M19m10K89M67p64m11J737j016j72M67K84Q5p55
$$ 426 -539 -426 417 1001 1187 -316 103 -307 -18 449 -315 -726 1011 -5 -177 290 574 659 -96
3233i6l32k50J164p65M44l43M48l97N91p24l58K33P86k54n76N44q4L37k02m24
$$ -96 -428 -678 486 -279 165 -178 270 -127 464 -260 -618 -385 401 147 -429 115 31 368 166 -258
3253b58l59N74n6NJ1L40m2Ko81L59n1n88K48M85o04L59N5l2M4M86j7q62N61Q02
$$ -258 -617 -43 -99 -94 -83 257 215 217 -464 -105 -156 -744 -496 -11 -615 -256 -201 -233 -189 297 280 -582 -21 781
3277G81j213L66m6P7J62n6J76j00m3j71K56k61K5K44R4j15p8N1J25l87K64P5k53
$$ 781 -432 -66 -112 -35 127 71 247 147 104 -67 189 -72 -47 197 291 176 98 149 274 -113 151 226 -27
3300b7K53m28K53M0J26l40L44j49K12o8Q0l49J88k86J84n8P1k46K76M8k68J39
$$ -27 226 -202 51 91 217 -123 221 72 284 216 296 -53 135 -151 33 -25 46 -200 76 124 -144 -5
3322eJ12p4K96l49l8L0J44q1j22N18o41K4QJ59k30K28j37J11J98r8K82m15j11
$$ -5 107 33 329 -20 -58 -28 116 35 -87 431 -210 -186 -178 -19 -249 -21 -158 -47 151 53 335 -80 -191
3345a91j6J24n8J76l5l33J26K1J6K61K1j30j31P9J71J10m95J10J58j14N5j61M84
$$ -191 -207 -83 -141 35 0 -333 -207 -186 -170 91 112 -18 -149 -70 101 211 -284 -174 -16 -130 -75 -236 248
3368B48l79J36J00P9J50l32M3r5P4J54l31K84PJ0J27j78P2p9j31j16K48K4q6r6
$$ 248 -131 5 105 184 334 2 45 -50 24 178 -153 131 138 148 275 97 169 90 -41 -157 91 115 29 -67
3392f7J95j79pK74j50k44Q0O8k02L67j90P4K16m14L14J01k59Q4K40l14j32K20
$$ -67 128 -51 -58 216 66 -178 -98 -30 -232 135 -55 19 235 -179 135 236 -23 61 301 -13 -145 75
3414G5J90j74n0J49j21k02O7p0K43l1L29p15K74KK82P3m46L75l90R9J0q2nJ96
$$ 75 265 91 41 190 69 -133 -66 -136 107 76 405 -310 -36 -34 248 321 -125 250 -140 -41 -31 -113 -118 78
3438G8OJ15k05N14r74M75o6M02p63O48o60N14J83j069J143j85r0K12k32J01o46
$$ 78 84 199 -6 508 -466 9 -57 345 -418 230 -430 84 267 -802 341 156 66 278 46 147 -499
3459d99R21j251L52K96j71L68o83M22j05L03K7Q1R9l99m2J3K50j97K11l04K54
$$ -499 422 -829 -477 -181 -352 16 -667 -245 -350 -47 -20 61 160 -239 -281 -268 -18 -215 -4 -308 -54
3480e4J49n21Q9j03O18l45L59m3o88O67J5n92L47P33l4N4q72j90O52p69N97l3
$$ -54 95 -426 -337 -440 178 -167 192 149 -539 128 143 -449 -102 631 597 651 -221 -411 241 -528 69 36
3502C6N29q14K92J36r04J305j222Q41l16L1N10M41j090J41O68p83J673j789J153
$$ 36 565 -249 43 179 -725 580 -642 199 -117 -86 424 865 -225 -84 584 -199 1474 -315 838
3521H38r33K17j64K7k15k15Q88n78o6q23J797m26L44j094L05l60O41P65o21m92
$$ 838 -95 122 -42 -15 -230 -445 443 -135 -201 -1024 773 347 691 -403 -98 -458 183 948 327 -165
3541a65l81J405j137K66k05K13O20j180Q62k24l4J62J68m80Q04j257P37p94M34
$$ -165 -546 859 -278 -12 -217 -4 616 -564 298 74 40 202 370 -110 694 -563 174 -620 -186
3560a86M2P81j049P30j368J171K02p18o7N23J01O22q59L82k15o34J058l38J77
$$ -186 -144 637 -412 318 -1050 121 323 -395 -462 61 162 784 -75 307 92 -542 516 178 355
3579C55k6l57n38K06j57K43N24J49j108J192k44l32L96R7k63l41J08J7O7j179
$$ 355 329 -28 -566 -360 -517 -274 250 399 -709 483 239 -93 303 400 137 -204 -96 -79 -12 -1191
3599a191J116J41P1J6O81p35M80r2o10J30J78r38Q95j18k54P68o18J49o0L75l88
$$ -1191 -75 66 137 153 834 99 579 487 -123 7 185 -753 142 24 -230 538 -80 69 9 384 -4
3620dO49l87K21j171J463r55M28l52O09K09q44O18P7q75O63k46m07M54Q9L77n28
$$ -4 645 258 479 -692 771 -184 244 -108 501 710 -134 484 561 -314 349 103 -304 150 239 616 88
3641H8M37n69r1L69l55L80j99K4o86M19J09k00M00KK5Q7k3j32K68j70m36M82j52
$$ 88 525 -44 -135 234 -121 259 60 84 -602 -183 -74 -274 126 128 153 240 217 85 353 183 -253 229 77
3664G7M59l85k01L62j046N54oj68j6O83m96K55k3j03O82m82j11p9l33K81M22l3
$$ 77 536 151 -50 312 -734 -180 -186 -354 -370 313 -183 72 49 -54 628 146 35 -44 -377 -96 326 293
3686B93l65n6k56P02o87k9M68J43j97k05L93K31m90J22j39l39J71L71o5k39R1
$$ 293 -72 -128 -384 318 -369 -398 70 213 16 -189 204 435 -55 67 -72 -411 -240 131 66 -173 -82
3707h2L78l04l13K68K10j85k23j6J44K09j86J44j39K12j72J21l11P3j1J5K99j29
$$ -82 296 -8 -321 -53 157 -28 -251 -267 -123 86 -100 44 -95 117 -55 66 -245 -172 -183 -168 131 2
3729BK15m75L17m0O6N7k02J31p1j68K72j81k5K27j12K59l98L30j86P3k68J48j04
$$ 2 217 -258 59 19 85 142 -60 71 0 -168 104 -77 -102 125 13 272 -126 204 18 91 -177 -29 -133
3752a33L0O2J15r5J9N8j32K42k19J1J57P5r4J73k42J44j61q4J72J7J42l6Ll17
$$ -133 -103 -41 74 -21 -2 56 -76 166 -53 -42 115 190 96 269 27 171 10 -74 98 115 257 221 224 -93
3776i3K25k70K81p7L4nn5L0J70l76N4K20l28J7j0K24j32L7K08J5r3l8j95L12j97
$$ -93 132 -138 143 66 100 95 40 70 240 -136 -82 138 -190 -173 -183 41 -91 -54 154 169 76 38 -157 155 -42
3801d2p8L64l40J90p8N5r9J5Q4j6Q1j58K7oj29J33K35k83nJ19j43P9m04K96J83
$$ -42 -120 244 -96 94 16 71 -28 -13 71 55 136 -22 5 -1 -130 3 238 -45 -50 69 -74 5 -399 -103 80
3826H0j74K73o3l14K27j90M63Pl98j96J18J98Q6J55m65lj6k4J4o1J80n2K49n19
$$ 80 -94 179 116 -198 29 -161 302 309 -89 -285 -167 31 117 272 -193 -196 -212 -236 -222 -283 -103 -155 94 -425
3850d25N70M0j13K16k40j52n7k17K47J68M3J28k18L37p36M99N4l31q2N6L06L47
$$ -425 145 185 72 288 48 -104 -161 -378 -131 37 80 208 -10 327 -409 90 144 -187 -269 -213 93 440
3872D40o28q2L53k78j05q1k68O67P4j56L41n61O12l41l71K31K92Q2J42k32j64
$$ 440 -188 -270 83 -195 -300 -381 -649 18 92 -64 277 -284 328 -13 -384 -153 139 221 363 131 -33
3893c3k49N59l31K9J69N29n92k77L73l11L23o43P51k57M71k58l88M09k23q7n4
$$ -33 -282 277 -54 -25 144 673 81 -196 177 -134 189 -454 297 40 511 253 -135 274 51 -36 -90
3914i0R9k46J49n2L36L60p96M25L00n08L95o77L22L01q48Q60m99O9k92M5M28n6
$$ -90 9 -237 -88 -140 196 556 -240 185 485 -23 372 -305 17 318 -530 330 -169 -100 -392 -347 81 25
3936B5L7N1k96R6K4m26M74K80m6m39M9j7J92l98J47J30j89L00k87m5O14m00L63
$$ 25 62 113 -183 -87 -63 -489 -15 265 219 -220 -171 -188 4 -394 -247 -117 -306 -6 -293 -338 276 -124 239
3959B39m23K68j16K55q6k00Q9J26K44kn62L42m71P79m15J2R3j22j7J0O1J78m32
$$ 239 -184 84 -32 223 137 -63 26 152 396 394 -168 174 -297 482 67 79 172 50 33 43 104 282 -150
3982a50O86n36k78K30M67j31rR4j97r6M18k20o08L17K12k74J04J63j14l23J35
$$ -150 536 0 -278 -48 419 288 279 373 176 80 498 278 -330 -13 199 -75 29 192 78 -245 -110
4003a10l4L26n02J18L66l02J12M3n4o9K87j74k59J20%J6Q1o6J53k35J42K24j28
$$ -110 -144 182 -320 -202 164 -138 -26 17 -37 -106 181 7 -252 -132 -132 -116 -35 -101 52 -183 -41 183 55
4026E5k06J30P7j08J19l1Pj32J1n2J63q5j23R3K4J49k64K13k46K63o4k79L44L2
$$ 55 -151 -21 56 -52 67 36 43 -89 -78 -130 33 -52 -175 -82 -58 91 -173 40 -206 57 -7 -286 58 90
4050I0K91m78J74m7J59j57J02j82K9N7k37K55j4L8K79k78j7r6k14K51J71k51j33
$$ 90 381 -97 77 30 189 32 134 -48 -19 38 -199 56 42 80 359 81 64 -32 -246 5 176 -75 -208
4073b08K53j79J35j34L9n9L41j76M1Jj51o6M28o9l70J07n3Q3P3q9O6j57L0J6j31
$$ -208 45 -134 1 -133 -94 -153 188 12 53 54 -97 -163 265 196 -174 -67 -120 -37 36 -53 13 -144 -114 -98 -229
4098b29K49L7J58j78r5K59l48K35n1n7J28P7j71n2MrP6n7k8lj4J16K46j96J19
$$ -229 20 57 215 37 -58 201 -147 88 37 -20 108 185 14 -38 -34 -43 33 -24 -52 -55 -69 47 293 97 216
4123B16j54OL2j1j06j8J36M9Q3j43k06L60l86J24Q6J26j60o3J41N7J5j31k03j13
$$ 216 62 68 100 89 -17 -35 101 150 233 90 -116 244 -142 -18 68 194 34 -29 112 169 184 53 -150 -263
4147b63K73m1K28l98K43N9l08J48k00M62j74j9j33J03K43k46j36J39N9j5n8q4
$$ -263 10 -31 197 -201 42 101 -207 -59 -259 203 29 10 -123 -20 223 -23 -159 -20 39 24 -34 -118
4169a18K3K05l16Q4l0L24l0m4qj61J9lK2l1J11o9M1j05K75k16J39j94M8J54l06
$$ -118 -95 110 -206 -122 -152 172 142 98 90 -71 -52 -55 -33 -64 47 -22 19 -86 189 -27 112 -82 -34 120 -186
4194a86K41J00k40J52K6R4j52K27k97J51J27j27oN5J54k65J73j4M8l53k36N44
$$ -186 55 155 -85 67 93 187 35 262 -35 116 243 116 110 165 319 54 227 213 261 -92 -328 216
4216B16k2k36K40P2K9M5m83P69r09K53P3l95M47k11k4P21j070L48M57o37L62j026
$$ 216 194 -42 198 270 299 344 -139 630 -279 -26 47 -348 99 -112 -136 585 -485 -137 320 -317 45 -981
4238i81J036k24J29K69O2m26m05R25p03L9N86r78J217n09O2N8k20m2l79P06k03
$$ -981 55 -169 -40 229 291 -135 -540 385 -318 -279 307 -671 546 37 99 157 -63 -105 -484 222 19
4259A9Q7o02O59n65P12J84o61K34j366N34P12L60l40N7k8K54p11N77r98M12N6
$$ 19 106 -496 163 -402 310 494 -167 67 -1299 -765 -53 307 -33 24 -4 250 -461 116 -882 -470 -414
4280d14P31l11N87l64n27L39k90J92l41l44J486o27o69J93L64M05L40j010K32
$$ -414 317 6 593 229 -298 41 -249 -57 -398 -742 744 117 -552 -359 5 410 750 -260 -28
4299b8Q8m79p4K11N9o88R88p9j20n2R9J63m94M78j64j30L06J86m25K69r3J39j24
$$ -28 60 -419 -493 -282 -223 -911 77 -2 -122 -174 -75 88 -406 72 -92 -222 84 270 -155 114 21 160 36
4322C6Q24o93k40n0o4L88k14K75j25L40q08p6M73L46k66k38jm28q13J759Jq31
$$ 36 860 167 -73 -123 -187 201 -13 262 137 477 -331 -407 66 412 146 -92 -93 -521 -1334 425 426 -405
4344d05J029j88P0n89K56K43L36o16J34M16l33K42j28j24j95l65Q0j0L75l91N67
$$ -405 624 436 506 -83 173 416 752 136 270 686 353 595 467 343 148 -217 -137 -147 228 -163 404
4365D04j95J74m69O4k12N64l18k8k38j86R16Q5l43k56K96PO79j346J23J0K06k16
$$ 404 209 383 -86 -22 -234 330 12 -16 -254 -440 476 561 218 -38 258 265 944 -402 -279 -269 -63 -279
4387b79Q22K1l41q4l47J37L7j41m40O32j30K37l41O3N3M8l5n0J44k26q2M89j82
$$ -279 543 564 223 139 -208 -71 -34 -175 -615 17 -113 124 -217 -154 -101 -53 -88 -138 6 -220 -302 187 5
4410Ej28P6Rlj56M09k52P3J59m45K50j82j9L14l41J10J13J06n3l06K91Q9k32L85
$$ 5 -123 -47 -38 -41 -197 212 -40 33 192 -253 -3 -185 -204 110 -231 -121 -8 98 45 -261 30 119 -113 272
4434B72k77J74j77K25l57K56Q6j36j25J7J28k7k77J53N1l5l7L47m38O99n41PJ69
$$ 272 -5 169 -8 217 -140 116 202 66 -59 -42 86 59 -218 -65 -14 -49 -86 261 -177 522 -19 -12 157
4457A57j00k07L9L62k89J75r3j41J70j36J48k60LK29j66J20o4Pk94L94k14J00
$$ 157 57 -150 -111 251 -38 137 44 -97 73 -63 85 -175 -172 57 -109 11 -53 -46 -340 54 -160 -60
4479f0M29m40J46j79J81j25R0J47m5k61R1L3J7K37j45o6q0q5J44j5M37m17J27
$$ -60 369 -71 75 -104 77 -48 42 189 144 -117 -26 7 24 261 116 50 -30 -115 29 14 451 34 161
4502A61k65k0N1N4L87k84R0o02O98m96L26k42K96MJ54m03l1r8J26k07J36k77M52
$$ 161 -104 -124 -73 -19 368 84 174 -428 270 -226 100 -142 154 158 312 -91 -122 -220 -94 -301 -165 -442 10
4525A0L7k65N6J00N23m08J44k21M57j66n32K10j70j11N93m03J35o0J9O2O47n02
$$ 10 47 -218 -162 -62 461 53 197 -24 433 267 -265 -55 -225 -336 257 -146 -11 -71 -52 10 657 155
4547A55K97k52j68L10j60o28N90%o54O55j43mM16p06j28M02m13O36l83L58m65
$$ 155 452 200 32 342 182 -446 144 144 -510 145 2 -2 414 -292 -420 -18 -431 205 -178 180 -285
4568b85L3M1J0J19Q6k23K59l74J26K83L07l37j80P1l3r4P80N6m35J22l88O5k28
$$ -285 -252 -211 -201 -82 4 -219 40 -334 -208 75 382 45 -135 -64 -97 -191 589 645 210 332 -56 9 -219
4591b19O42o73m0j3K23M08n57J61k18M10J21r1p4k16N71K27p32O17p87K64M42
$$ -219 423 -250 -290 -303 -80 328 -229 -68 -286 124 245 154 80 -136 435 662 -70 547 -240 24 466
4612D66j69J0k27n8R6J29P5P5p12J13j9M98k21O5K05j31K58l84l09M98o15K43
$$ 466 297 307 80 22 118 247 322 397 -315 -202 -221 277 56 121 326 195 453 69 -240 258 -357 -114
4634a14O4J20o84j23M56K99K12K01k14k90o9l12Q79M62j370Q55J76n94P7O9O81
$$ -114 -50 70 -614 -737 -281 18 230 431 217 -73 -142 -454 425 887 -483 372 548 -46 31 100 781
4655G81n47m34R0j02L2N68k08n60m02O29M78n67N39m80K03J93M94k57l48K39l07
$$ 781 234 -200 -110 -212 -180 388 180 -380 -782 -153 325 -242 297 -183 20 213 707 450 102 341 34
4676C4J12p4j92n2K32J02n16k76J84K56l86L33M62o65P95l42n79L21j23M67j03
$$ 34 146 72 -120 -172 60 162 -354 -630 -446 -190 -576 -243 219 -446 349 7 -572 -251 -374 93 -10
4697a0L16J59qm05M62l69k57l9Q3n34M96O12n52m53O20m68k20N71j55P10j149
$$ -10 306 465 457 52 514 145 -112 -151 -68 -602 -106 506 -46 -499 121 -347 -567 4 -151 559 -590
4718e90P35k47Q57j82m27K93m22K58q00N86o64P90J52l66K87k13o18N4M26R5n00
$$ -590 145 -102 755 573 146 439 17 275 -525 61 -603 187 339 -27 260 47 -571 -517 -91 4 -496
4739d96M55O84m04m16M00m86Q54l42j1N83p35J47l60L91n12K02O3K37R9l12M31
$$ -496 -41 643 239 -177 223 -263 591 249 238 821 86 233 -127 264 -248 -46 17 254 353 41 472
4760D72m88J46J49j6r95R96M42p19m82N49J04l20K17K3k66O5J60m87K44N85q58
$$ 472 -16 130 279 263 -732 264 706 -13 -495 54 158 -162 55 78 -188 -123 37 -450 -206 379 -479
4781d79k56O91N23l35O36p06J50j70p5L27J40j72K50r06Q1O08m53M85o46L19m46
$$ -479 -735 -44 479 144 780 74 224 54 -21 306 446 274 524 -382 -301 307 -146 339 -307 12 -434
4802d34J005q46m2K87P9J84k65O93o96oJ84J22J31L51J44n68K2n01k5m00L12K91
$$ -434 571 -275 -317 -30 49 233 -32 661 -35 -41 143 265 396 747 891 323 345 -156 -181 -581 -269 22
4824B2K14o48M46k75N23j93K10k97J74m10l83J393j142l70O63J40n08P7P82j19
$$ 22 236 -412 34 -241 282 89 299 2 176 -234 -617 776 -366 -736 -73 67 -441 -364 418 299
4844B99n52j98R42k21J4r9j31j76M19k4k76K07o35N84l17J48j87K11L2q8k13o35
$$ 299 -253 -451 491 270 284 185 54 -122 297 273 -3 204 -431 153 -164 -16 -203 8 40 -48 -261 -896
4866h96Q54m27O91n51O80j06m41N44p52kJ13L01m7O6l58J24q7O04m64M45q44J59
$$ -896 -42 -469 222 -329 351 245 -196 348 -404 -406 -293 8 -39 27 -331 -207 -294 310 -154 291 -553 -394
4888c94M06k28K58j94K71RN22l81o55P54n34J93j026M71N99n40m9L10L12r33O35
$$ -394 12 -216 42 -152 119 128 650 269 -386 368 -166 27 -999 -528 71 -469 -518 -208 104 -829 -194
4909a94k53M15j239R11N89L71r44M92R4k65j99Q3p3L85o20p3Q54n12P08m55k68
$$ -194 -447 -32 -1271 -360 229 600 -344 148 242 -23 -222 -139 -212 173 -447 -520 334 -178 530 75 -193
4930a93q3p4k33M21N66n05L67m10O95r85O23o78O87K1j48L77m8j44n54nM16L38
$$ -193 -276 -350 -583 -162 404 -101 266 -144 551 -434 189 -489 198 219 71 448 400 256 -298 -303 113 451
4952D51r35O46k98o21J613o91l75O41o37K45M50o00rL64o03N00o95O12l70K91
$$ 451 -484 162 -136 -757 856 165 -210 431 -206 39 489 -111 -120 244 -359 141 -554 58 -312 -21
4972b1K3Rj48K86k12q8J99l38J21p5K87m7l06L52N74l92Q6p1k74j9M7n39M84o5
$$ -21 2 11 -137 149 -63 -151 48 -290 -169 -244 43 -4 -310 42 616 224 310 239 -35 -54 -7 -546 -62 -127
4996a27j19MK82M0r8m0k84M41k97p2M80o30M69J20j49j99R4Q39m82p45O52k04
$$ -127 -246 -242 40 80 -18 -58 -342 99 -198 -270 210 -420 49 169 20 -179 -85 754 272 -473 179 -25
5018b5J28j78P2P0q9j75n84Q72nj12K56o21m4J85J52k70R10m87j34k67J284j363
$$ -25 103 -75 -3 67 -22 -197 -781 91 86 -26 230 -391 -435 -250 -98 -368 542 55 -79 -346 938 -425
5040d25Q4L58M29n90L66n53j10O59k84L3n35J075q59O84m38m02L96L00l56L03
$$ -425 -341 17 446 -144 222 -331 -441 218 -66 -33 -568 507 -352 332 -106 -508 -112 188 -168 135
5060A35M56k71N4n55nP97q87L28k65M41p4L0P7k43r1r1M19l70L89l26k84M76j80
$$ 135 591 320 374 -181 -186 611 -276 52 -213 228 154 184 261 18 -73 -164 255 -115 274 -52 -336 140 -40
5083d0K72l00J49L40n33P83p95p45P06J43ml63O03n02J96P2K76j92q87P96p94
$$ -40 232 -68 81 421 -112 671 -124 -869 -163 -20 -24 -387 216 -286 -90 -18 258 66 -821 -25 -819
5104h19J313n3n33l28M49M2j4k19K76n74K92N18l39m0j105J219n33P96M6m98l5
$$ -819 494 441 -92 -420 29 71 57 -162 114 -460 -168 350 11 -29 -1134 85 -448 348 394 -104 -139
5125a39j7J21J99m79k6J69K19l89O07J5j49k00m53j55J427j29n39o5k86N74l48
$$ -139 -156 -35 164 -315 -341 -172 47 -342 265 280 131 -69 -522 -677 750 621 82 17 -269 305 -43
5146d3m31j92Q79j30n70J64J4K85M45m05M21l67j24r6L28J90o66O79m50m3Ok43
$$ -43 -474 -666 213 83 -487 -323 -309 -24 421 16 437 70 -54 -150 178 368 -298 381 -69 -112 -106 -349
5168c49K08k3M0J7L20o16j99N94k6l70O97o07r9L27L4K59N8k06M00m75K18k33
$$ -349 -141 -164 -124 -107 213 -403 -602 -8 -34 -404 293 -314 -413 -86 -52 207 265 59 459 -16 202 -31
5190c1O9q95P61R5L85k49k89Jl82J96K05K49L3J25k39k59J13J32Lp2j30K22Nj50
$$ -31 38 -857 -96 -1 384 135 -154 -153 -535 -339 -134 115 148 273 34 -225 -112 20 23 -49 -179 43 48 -102
5214a02k27J16J64K56j84N5r5j90k60M58j16J09k59O12l61K80m91k86N91J64Q5
$$ -102 -329 -213 -49 207 23 78 -17 -207 -467 -9 -125 -16 -275 337 -24 256 -235 -521 70 234 319
5235C19m05K46j53j85J55L43J7k81M3q1LL68k33p4L0j99Nm7J27J0K2l3J71K3J88
$$ 319 -86 160 7 -178 -23 320 337 56 99 18 21 389 156 82 112 -87 -82 -129 -2 8 30 -3 168 191 379
5260C79k35J49j89j96j0K16m83nK88Q7oM19n42J71j77K21k23J08L25p13M57R7
$$ 379 144 293 104 -92 -102 114 -369 -374 -86 1 -5 414 -128 43 -134 87 -136 -28 297 -416 41 138
5282A38j83j17M07k78n7J32J95o19L93k30p9L02Q94r77q2L05n51L73l98O93l2
$$ 138 -45 -162 245 -33 -90 42 237 -382 11 -219 -298 4 898 -79 -161 144 -407 -34 -432 261 229
5303B29k45k78L34K6p40qJ111o64L42K57r7j67j11l13L05L2k01k37L15N27n94
$$ 229 -16 -294 40 66 -674 -682 429 -235 107 364 267 100 -11 -324 -19 13 -188 -425 -110 417 -177
5324a77K54L47p43k39J021n66L6K56J06L90j002P02J18k93p02L79O08r95O21J60
$$ -177 77 424 -319 -558 463 -103 -67 189 295 685 -317 385 503 210 -492 -113 495 -500 121 281
5344B81n28L45j26N4l2L62m46L61L05r95L92j34o32O13L61n07M15l01K98p10L41
$$ 281 -247 98 -28 26 -6 356 -90 271 576 -419 -27 -161 -793 -180 181 -326 89 -212 86 -624 -283
5365b83M67Oj91Q0k22N1K3K23K35n64M64O20J06p43mJ0k03j18J51n40j64P33k59
$$ -283 184 190 -1 79 -143 -92 -69 154 389 -175 289 909 1015 272 268 278 75 -43 108 -432 -596 137 -122
5388a22j60N35l29L34j151O51M65o21J05k20P91n93J055m88j36l53M21m17M38
$$ -122 -282 253 -76 258 -893 -242 223 -398 -293 -513 278 -315 740 252 116 -237 184 -233 205
5407B05l07K09J02Q0p82l2K64M28O7k42m45J031l24O9m92J63k09O23l94R3L25
$$ 205 -102 107 209 289 -493 -525 -261 167 234 -8 -453 578 254 323 -169 -6 -215 408 14 107 432
5428D32L15m80j21j001P8J297j577R89J75L32n90M29j43Rk25M60q19o96P61L90
$$ 432 747 267 146 -855 -777 520 -1057 -68 107 439 -151 278 135 144 -81 379 -440 -1136 -375 15
5448A5j19J3N64q96N12j07O96r08P72r63k52J236j379N47K91N63k79n87N75KL7
$$ 15 -104 -91 473 -423 89 -18 678 -230 542 -421 -673 563 -816 -269 22 585 306 -281 294 296 333
5469C33j52L64r97Q69m70j34K53P94r16R3p8l29L11M48p07K08n36J041o38R49
$$ 333 181 545 -452 417 -53 -187 66 860 -56 37 -41 -370 -59 389 -318 -110 -646 395 -243 706
5489G06n9n63k60N13o11J44O50j59L7n96K02o0n26Q10J18m37N13k04j98O90o04
$$ 706 647 84 -176 337 -274 -130 520 361 398 -198 4 -56 -582 228 346 -91 422 218 20 710 106
5510A06j03j270J708p17J19k67O41r67J268n68j27J474q33k44m70R18l97P3n99
$$ 106 3 -1267 441 -276 -157 -424 217 -750 518 -50 -177 1297 464 220 -250 668 271 344 -255
5529b55L16P59r81k42M28j18k58J560r71j21Rn02J11Q2M04P36q55O86j83l73l61
$$ -255 61 820 -161 -403 25 -93 -351 1209 238 117 126 -376 -265 -183 221 957 102 788 605 232 -129
5550a29l21L91l82L29o8R18q22N44m89J21M45l08r93J453p52O87k91j24j16J18
$$ -129 -450 -59 -441 -112 -180 738 -84 460 -29 92 537 229 -764 689 -63 624 333 209 93 211
5570B11N4n51L20p87R64m75L42m60R7J85K04L31K31q67p1O55j85N81j218l58O65
$$ 211 265 -286 34 -753 211 -264 78 -382 -285 -100 104 435 666 -201 -272 383 198 779 -439 -797 -132
5591a32j55oq3K07L11m96p5K00q1J192j894R33K16m6N2L2n75R00j44j371J263
$$ -132 -287 -293 -376 -169 142 -354 -429 -229 -310 882 -1012 -79 137 91 143 175 -400 500 356 -1015 248
5612B48J34M27r39j058K027j099j50M73J92m73O23K02j099M36J52m31L95J18m20
$$ 248 382 809 -130 -1188 839 -260 -410 63 255 -218 405 607 -492 -56 96 -335 60 178 -242
5631b42Q13o01M2k68L35l01J18K32K26o52M05l07N20l15j53n3N01o3l78l13P8
$$ -242 571 -30 12 -256 79 -222 -104 128 354 -298 107 -200 320 5 -148 -201 300 237 -141 -454 -376
5652c76K64K50o08O63J13n5k82K17L9M6m14L80J64k78J50m42K03K87l79O7N18
$$ -376 -112 138 -470 193 306 251 -31 186 225 271 -143 237 401 123 273 -169 34 321 -58 9 527
5673E27p30N64j165Q70r11O32j81N4L30k22M6L83j49m23K27k07P3q3O7P19r31
$$ 527 -203 361 -804 66 -845 -213 -394 -340 -10 -232 -186 197 48 -375 -148 -355 -282 -365 -298 421 -510
5694e10J118q90J62M00j09m3J97j37n14j6j78J430m66j545P20P93p17J06J31O75
$$ -510 608 -282 -120 280 171 128 325 188 -326 -342 -520 910 444 -1101 -381 412 -305 -199 -68 607
5714F07j000K93j81N06K0k01P84n94Mr8l32l5l28L2Q37n34O05q38L01k60J134
$$ 607 -393 -100 -281 225 245 44 828 234 238 140 -192 -227 -555 -523 314 -220 385 -453 -152 -412 722
5735G22o5o77N2j50P8o32O26K24k62P64r13M40L23j20j84K2p56M89k67N76q84
$$ 722 657 -20 32 -118 -40 -672 -46 178 -84 680 -233 207 530 410 226 248 -508 -19 -286 290 -594
5756e94Q74J385j812O70j59p18PK24J98M04o48R83l73o30m75J081K41m37k35N84
$$ -594 280 1665 -147 523 364 -354 -347 -123 75 479 -169 814 441 -189 -664 417 658 221 -14 570
5776E70n15l05L32K40l73K99K22k08m65O23k67n10J60q75J346l78O4J23m2o5O
$$ 570 55 -250 82 322 -51 248 470 262 -203 420 153 -357 -197 -1072 274 -104 -40 83 41 -24 -18
5797a8n97K16K29L49r50J138L39r30l43R02L21r62M98J82m26N98o63M29l5l39
$$ -18 -615 -399 -170 179 -771 367 706 -224 -567 335 656 -306 192 374 -52 546 -117 312 277 -62
5817f2K5j38j75L35J01K90J6l32j49L3J82o17P62k49Q9L4m78M84o37Q69l02k5
$$ -62 -37 -175 -350 -15 86 376 392 60 -89 -56 126 -491 271 22 111 145 -333 151 -486 383 81 56
5839E6j19L73p31K53m47Q96m92J49J89m80M12l15J7lO08j96l6k06k19M70l09j74
$$ 56 -63 310 -421 -168 -615 281 -211 -62 127 -353 59 -256 -239 -242 366 170 134 -72 -291 179 -130 -304
5861c04J62l61M49q9K45m62P87m62oj23M44l76M26m09m5N53n61P9k5k63L02J25
$$ -304 -142 -503 -54 -143 102 -360 427 -35 -41 -164 280 -96 330 -79 -124 429 -132 -53 -78 -341 -39 86
5883H6k83L25Q6J13l10O1L5q4k60N7L61nj07M4l08o99R78M25k90J11q46N60J90
$$ 86 -197 128 214 327 17 78 113 29 -231 -174 187 182 75 119 -189 -888 90 515 225 336 -510 50 240
5906B40j006P23Q4m52L19k69n9K21J56j85K51L68o85K62m67Q12k09o0k18m14J097
$$ 240 -766 -43 41 -411 -92 -361 -420 -199 -43 -228 23 391 -294 -32 -499 313 104 44 -174 -588 509
5927E09P7L10j087L43L9k32O67p13j48K93M31o12P8P2l3l43k5P98l57K01j00m80
$$ 509 586 896 -191 152 191 -41 626 -87 -235 58 489 -123 -45 27 -6 -349 -374 424 67 268 168 -312
5949c12O20k32K09k45L07q4k81O8K32K36j042P87m62Q35k29m45k17N92l81j37
$$ -312 308 76 285 40 347 263 -18 50 282 518 -524 263 -199 636 407 -38 -255 337 -44 -181
5969a81M74J9l95P21m60R1o8j95M23l08l39O00r93J189l80k53k3K92m14K10k73
$$ -181 293 312 -83 638 178 269 201 6 429 121 -218 382 -611 578 198 -55 -78 214 -200 10 -263
5990b63K90K46q2mk80J6l01J028p72m06P35M95o56N96o33K8L25j169K14J138q57
$$ -263 27 273 191 187 -93 -77 -378 650 -122 -528 207 702 46 642 9 37 362 -807 -593 545 -312
6011c12K52K8r3n70M47n5R02l69K88p76p2K87k4Q0l1n13R89k02j94lj55j41N28
$$ -312 -60 -32 -125 -695 -248 -303 599 230 518 -258 -330 -43 -67 13 -18 -531 458 256 62 59 -96 -237 291
6034B91l87q0L58l98J99M8j93m39K80Q57j186N03O0J055j580M8l74J384n89J239
$$ 291 -96 -176 182 -216 -17 31 -162 -601 -321 536 -650 -147 -87 968 -612 -564 -938 446 -143 1096
6054A096j360K51K25J05l23K9Q20p97k24M39L83M0N8p10L14q49J188n52J17K80
$$ 1096 -264 -13 212 317 -6 23 843 46 -178 261 644 684 742 32 346 -503 685 133 250 530
6074E30n13k54J002j391P56j0j57k81O22k63j93m8n45O69p64N04P73K20o73m49
$$ 530 17 -237 765 -626 130 120 -37 -318 304 41 -152 -200 -745 -76 -840 -336 437 657 -16 -465
6094d65J265j116N89j11m35O38n09P40q50M07p13p73J949o68M54l4q42O13l71
$$ -465 800 -316 273 162 -273 365 -144 596 -254 153 -560 -1333 616 -52 402 368 -474 139 -232
6113b32K47L69n17J42j01M08l50j05n72N41O73n41p55R72J91l22n14J193p27k68
$$ -232 15 384 -133 9 -92 316 -34 -139 -711 -170 503 -38 -793 179 370 48 -466 727 0 -268
6133b68P37o09k6M70l33j62L35q7L99j75J04m8r00R30j12k14j28L9l79N67k66
$$ -268 469 -140 -166 304 -29 -191 144 57 456 281 385 337 -563 367 255 41 -87 -48 -427 140 -126
6154a26o66O23N58p4J97m44j99M21l45l36O84k71kn05m24M85P6r2Q31P91j393
$$ -126 -792 -169 389 315 512 68 -131 290 -55 -391 293 22 20 -485 -909 -424 -348 -440 391 1182 -211
6175b11N46l82K01l43P76p48K13l71P56l65K63n39l72K76O8k1l5M31o90L40L81
$$ -211 335 -47 154 -189 587 -161 52 -319 437 72 335 -204 -576 -300 -232 -253 -288 143 -547 -207 174
6196A74k47j76P2L27J04k1l30K20m33k94P96l53K73M6k8r89J129m38K80o6J5j71
$$ 174 -73 -249 -177 150 254 233 -97 123 -310 -604 192 -161 112 158 130 -859 270 -168 112 46 61 -110
6218a10k78p3R29m12k62J05K95K0k49J12j63K49O9m36K52q3q5j19L86n85K52L38
$$ -110 -388 -461 468 56 -206 -101 194 214 -35 77 -86 163 232 -204 48 -35 -120 -239 147 -438 -186 152
6240A52O0o95M23j62J57k47N07k71j16K90K00k14jj42o7n1J96j00J75k25k26M42
$$ 152 212 -483 -60 -222 -65 -312 195 -76 -192 98 298 84 83 -59 -126 -177 19 -81 94 -131 -357 85
6262H5r7J1N2j2Oj48m7J26k17J33J37m19N08N8J5j58qj6J94n4o08L00K0M50l83
$$ 85 -12 -1 51 39 45 -103 -150 -24 -241 -108 29 -390 118 176 191 33 25 9 203 149 -459 -159 -139 311 -72
6287g2K17m42N81q3J10m50N2J59p5N5j64J80J15l03m59P77q38J389o72K31m02
$$ -72 145 -297 284 201 311 -139 -87 72 -3 52 -112 68 183 -120 -579 198 -640 749 77 308 -94
6308i4M75k9j87j89q6O00l37j23k95L69j83j37k41O38k00o31J157o21k79R57r48
$$ -94 381 352 165 -24 -110 490 153 30 -265 104 -79 -216 -457 181 -19 -650 507 -114 -393 564 -384
6329c84P77l62j40k71l49P87M79M33j132j23P23O1m5l28J28o28P07n97R88j98
$$ -384 393 31 -109 -380 -729 58 537 970 -162 -285 438 499 454 126 254 -374 333 -264 724 526
6349E26l79k54J40p5J15Q26j094Q60Rr41R32m71o74L89Q8l11P35J45r94O57m03
$$ 526 147 -107 33 -42 73 899 -195 665 674 -267 665 194 -480 -91 -3 -314 421 566 -428 229 -174
6370a74J49L74n06j20J031o76J10K18j420J111O4j041J443l96k63L20j27l76R9
$$ -174 -25 349 -157 -277 754 78 188 406 -1014 97 161 -880 563 167 -96 224 97 -279 -180
6389a80N59n69j53K3J30L03M65k19O01r87L04q82N96O0O1j66M29n04K33m80L21
$$ -180 379 -190 -343 -320 -190 113 578 359 960 -27 277 -605 -9 51 112 -54 375 -129 104 -376 -55
6410e5j02j62K99k27J46k87P08m05k2K75j48J96j80j80K68K18n10R8O5R4m32M73
$$ -55 -157 -319 -20 -247 -101 -388 320 -85 -107 168 20 216 36 -144 124 342 -168 -70 -5 89 -343 130
6432A30m24K98m5l27j13J51L74j87n5M63k20J23q8l90l47P77o8J79Rn59N99k94
$$ 130 -294 4 -41 -368 -481 -330 44 -143 -198 265 45 168 80 -310 -657 120 52 231 240 -319 280 -14
6454a4O5q7L26j68l82K62J94k75J59q2J48j06k26L31p3J76j2l61K08K66k51n98
$$ -14 51 -36 290 122 -260 2 196 -79 80 -2 146 40 -186 145 72 248 236 -125 83 349 98 -500
6476e00J85j31M89j92J58k47J49N65m74J27K4J40l78J36O7R2m17L72l14J10j58
$$ -500 -315 -446 43 -149 9 -238 -89 476 2 129 153 293 -85 51 118 210 -207 165 -149 -39 -197
6497a97N9K40o1k70P8L7L58K91n07Nl03L61n89O6O80J28j022M75P3J10M69m81
$$ -197 -138 102 41 -229 -151 -114 244 535 28 33 -270 91 -498 -432 248 376 -646 -171 -98 12 481 0
6519@K76p9n21Q52n84k66K64L43m35M74j68N2%K07n09J89l20K2K57J47J13O2k67
$$ 0 276 197 -324 528 -56 -322 -58 285 -150 324 156 208 208 415 -94 95 -225 -203 54 201 314 376 109
6542A09J04l59r1m38J094l05j93m85P90L67j259j80N56K78N65q9q39P34j127P62
$$ 109 213 -146 -237 -675 419 114 -79 -564 226 593 -666 -846 -290 -12 553 464 -375 359 -768 -6
6562fJ06L22n07M74l44j30O35n55p9K00k00o9m6m5L46p1k51M27m69L15N98j016
$$ -6 100 422 -85 389 45 -85 550 -5 -84 116 -84 -153 -199 -244 102 31 -220 207 -262 53 651 -365
6584c65J46J43k08L10l17m3L38OK65l4n18K00kP38n49K42o47r4J97N3K71l45M55
$$ -365 -219 -76 -284 26 -291 -334 4 10 275 241 -277 -77 -79 659 110 352 -295 -389 -192 -139 132 -213 242
6607B42m4l41K64l81L83N70j174m9J338o00m69O98l51k47J70J76m95K17L34j51
$$ 242 198 -143 121 -260 123 693 -481 -530 808 208 -261 437 86 -161 9 185 -310 -93 241 90
6627I0k15R68q58j64l40O18O84q16O26r59M96l13J53j5nn50N85J65j85k06M54
$$ 90 -125 843 -15 -179 -519 99 783 -33 593 -366 130 -183 -30 -45 -50 -600 -15 150 -35 -241 213
6648B13k62p0M29o19L32l6N5j08L61m47J87j20J20k66K41j24O5O6J39j7j85q6
$$ 213 -49 -119 310 -309 23 -13 42 -66 295 -152 35 -85 35 -231 10 -114 -49 17 156 139 -46 -132
6670a32K84p4l15R0J35l0J25k74L59k82J63l5K5J74j57j60KK84j26L1k21m5J15
$$ -132 152 78 -237 -147 -12 -42 83 -191 168 -114 49 14 39 213 56 -104 -102 182 56 87 -134 -179 -64
6693f4N4j30J80j60P0p3J25N5j36j19M04k86Q2j4M7n2M2J97k54O7J59n7j50Pj41
$$ -64 -10 -140 40 -120 -50 -123 2 57 -79 -198 206 -80 2 -12 35 -17 25 222 -32 35 194 137 -13 -6 -147
6718a47K9l12L15K36m28L65K3p9k48M14k54L24j9o69N47k11M52l18K14j12j15
$$ -147 -118 -430 -115 121 -307 58 81 2 -246 168 -86 238 219 -450 97 -114 338 20 234 122 7
6739GJ60j12K75j86O5l1l66K50N9k30J14o08K15L60K2k66O26l68k61L23l93M99
$$ 7 167 55 330 144 209 178 -188 62 121 -109 5 -603 -388 -28 -6 -272 354 -14 -275 48 -345 154
6761A54l14q5o9P63l30m10M64q6Lk77N66l03M18l57J68k1o76k27Q75%k01R0p01
$$ 154 -160 -245 -314 449 119 -291 173 87 90 -187 379 76 494 137 305 284 -392 -619 256 256 55 145 -556
6784e56J98N56J90L96o88r5J08j79K59K01k31l22l88J55K98R0Q09j032l25M49
$$ -556 -358 198 388 784 96 1 109 -70 189 390 159 -163 -551 -396 -98 -8 801 -231 -556 -107
6804a07L14K7n39K36j64P03p21K77n93R25k39l27R51n43j17k44P99j423Q63p7
$$ -107 207 234 -305 -69 -233 470 -251 26 -567 358 119 -208 743 200 83 -161 638 -785 78 1
6824AL50n11L16J46l39k69J02O13l06q1M91l97m6M78q10M18J59j39m69M14p1o
$$ 1 351 -160 156 302 -37 -306 -204 409 103 22 513 116 70 548 -262 156 315 176 -293 121 50 44
6846D4J38J2J98M31q48n40N96k47N53l16q7M96l20mo3K59J7kl97L2kk4J60l85
$$ 44 182 194 392 823 -25 -565 31 -216 337 21 -66 430 110 106 43 302 319 317 -80 -48 -50 -74 86 -299
6870b99K20L23l14L9k64N21m59J9L12J53m49K4J77K11%k05j11k90M69J8l83L37
$$ -299 -79 244 -70 -31 -295 226 -233 -214 98 251 -198 -174 3 214 214 9 -102 -392 77 95 -288 49
6892D9J02j93J9l28K89J5R7j10J01l49J77J63j48j4K32j88J11o6j57K73j40K52
$$ 49 151 -42 -23 -351 -62 -47 50 -60 41 -308 -131 32 -116 -130 102 -86 25 -41 -198 75 -65 187
6914A87l42j03J09K91j45o1J98l73K71m2L0m1K34k00q1Mm6R7J07K5l13K57k0K16
$$ 187 -155 -258 -149 142 -3 -64 134 -239 32 -10 20 -21 213 13 -68 -64 -110 -13 94 119 -194 63 43 259
6938B59l48J52l01L83k1j68K08m05L89M2m01J41K64k21k17J32J23J6q7p6K63k28
$$ 259 -89 63 -238 145 124 -44 164 -241 148 190 -211 -70 194 -27 -244 -112 11 27 -60 -136 127 -101
6960a01J73k80K58j57J85j7Ok64K77j00k6J2k06J92R1R4k74Q7J07O8j53l06K03
$$ -101 72 -208 50 -107 78 61 67 -197 80 -20 -46 -34 -240 -48 43 137 -137 -50 57 125 -28 -334 -131
6983a31J87p4J54k52M11j52j37kO0r6J37j35M6N3k01P7J73J5k88j22M82j64l2
$$ -131 56 -18 136 -116 295 143 6 4 64 -32 105 -30 16 69 -132 -55 118 133 -155 -277 205 41 9
7006Ij88j47L66r6K02j41R7k49J79q1J07j20j6M7K6k60J99J30l71L36q3P3r9K9
$$ 9 -179 -326 40 -56 146 5 102 -147 32 -49 58 -62 -78 -31 -5 -265 -66 64 -307 29 -54 19 -80 -51
7030e1q6k7r8K44l9J54j18r3J11Mn2J54j47j3P2m7m1K78k04k10L69j77j75K61
$$ -51 -137 -164 -262 -18 -57 97 -21 -114 -3 1 -51 103 -44 -57 15 -32 -73 205 1 -209 160 -17 -192 69
7054F9mJ16k16q8J71j16K16j19Q9j98J82o2J43p7q6J16n4j33J12J05M6j38J1j84
$$ 69 65 181 -35 -123 48 -68 148 29 118 -80 102 40 183 106 20 136 82 -51 61 166 212 74 85 -99
7078i9J16k3J71l89J50lJ5L1k02K76O3q2J5j83R1j66K32rK63m48J55J00N8k66
$$ -99 17 -6 165 -224 -74 -77 -62 -31 -233 43 106 24 39 -144 -53 -219 13 4 267 -181 -26 74 132 -134
7102a34P5j41K99mk39J18J01l5jL28o03L51k34O7k30L60l3L0k02l3K87j09k52
$$ -134 -59 -200 99 95 -144 -26 75 40 39 367 -236 115 -119 -52 -282 78 45 75 -127 -160 127 18 -234
7125b34L02kK88n37L44q3j47j28L57p6M6J44k13j42Q9K7L99l08l08L27k21J25
$$ -234 68 66 354 -183 161 78 -69 -197 160 84 130 274 61 -81 8 35 434 126 -182 145 -76 49
7147D9j54O59o87m9N66m41J90m76O54n55N34m57L19J96o30J58j43L74l36L51L35
$$ 49 -105 554 -133 -182 384 -57 133 -343 311 -244 290 -167 152 348 -282 -124 -267 107 -229 122 457
7168D57k30l3PJ49n24L69P8k66k79N34k38j12M14n9k87K7j90M29o22M70Jo0o9
$$ 457 227 194 201 350 -174 195 273 7 -272 262 24 -88 326 267 -20 7 -183 246 -376 94 95 35 -34
7191c4J58L67n64J44l17N77r5m06Q01q99K80j89N34l56j38J53Q78r92J99J74q23
$$ -34 124 491 -73 71 -246 331 236 -170 631 -268 12 -177 357 1 -137 16 894 -98 101 275 -548
7212e48k76M63j35P15j21K9O9m81M93q7l90o3J147j270P22J83P3O5j065O48p46
$$ -548 -824 -361 -496 219 98 127 196 -285 208 121 -269 -332 815 -455 267 450 523 588 -477 171 -575
7233e75O47o55P1R27j43j83K50L87o40k13L74m27j78L78N51r65K41K91L48k52
$$ -575 72 -583 -512 415 272 89 339 726 86 -127 247 -180 -358 20 571 -394 -153 138 486 234
7253B34l30M78m46rk59P10p68n8K19O12J02j101L72M51L8n59N82r5K08p57L58
$$ 234 -96 382 -64 -73 -332 378 -390 -448 -229 383 485 -616 -244 207 245 -314 268 173 381 -376 -18
7274a8l84O88o46m1Q71l40p5o8M29n16L55j068Q39O51q37K67L25l17m66J73L68
$$ -18 -402 286 -360 -401 470 130 55 -13 416 -100 255 -813 26 677 -160 107 432 115 -351 -178 190
7295A90r63L94K47J04L19m59J11p29N41N63j40n6o18N27J09k96L10k83K27K6O13
$$ 190 -773 -379 -132 -28 291 -168 -57 -786 -245 318 178 122 -496 31 140 -156 154 -129 98 124 737
7316G37p64K59l44j10m1O38o8o77Q40n72N8L4j72N7K30M92n58kJ34m81K61n35
$$ 737 -27 232 -112 -222 -263 375 307 -370 470 -102 -44 -10 -182 -125 105 597 39 37 171 -310 -49 -584
7338e84R73l61K02l88L15n4p2K68k93K99Q5j90J56j30J92l93j2R3N2k70K47k36
$$ -584 389 28 230 -158 157 103 31 299 6 305 390 200 356 226 418 25 13 106 158 -112 135 -101
7360a01j38N53o7m04L85L54j61m49K31j90K6k51N37K29m40J03n69J082m78j04
$$ -101 -239 314 247 -157 228 582 421 -28 203 13 39 -212 325 554 114 217 -352 730 252 148
7380A48o2O5r05O36M02n66K14j03O37M26j074K52m80M32k70j46K10k90Q37j72
$$ 148 86 151 -754 -118 284 -282 -68 -171 466 892 -182 70 -410 22 -248 -394 -184 -474 363 191
7400A91J03K65j091K89oP49K98r18k29P68o93Q24j98j14k87J67J9m14K37J046
$$ 191 294 559 -532 -243 -249 500 798 -120 -349 419 -274 550 352 238 -49 118 137 -277 -40 1006
7420A006j301l1N89q1p00J125m82J16n02J42N60o88M72j15K57m4o5l44OK52l37
$$ 1006 -295 -326 263 182 -518 607 125 241 -261 -119 441 -247 225 110 367 323 258 -86 -80 172 -165
7441a65L20j83j84J47j23L19oj22j74L79k06J57r1O3j55J55J06l72l8m8L01N4
$$ -165 155 -28 -212 -65 -188 131 125 3 -171 208 2 159 68 131 -24 131 237 -135 -173 -221 80 134
7463A34j28J31j35O6j44J56p8j39J54M4j27q0K50m5k92P7K73o6k57Q1J88k22K39
$$ 134 6 137 2 68 -76 80 2 -137 17 61 -66 -146 104 59 -233 -156 117 51 -206 -125 63 -159 80
7486H0k0j05J17j34j91J11j29M66k57j4O7O2o7Q1k54J34J48j76L48j34k70j7K48
$$ 80 60 -45 72 -62 -253 -142 -271 195 -62 -76 -9 53 -14 67 -187 -53 95 -81 267 133 -137 -154 94
7509I4K00o41K30J54j52L42j15j69kL7j24J49J50j80k8J28k45O3J1J41RN7p2k8
$$ 94 294 -347 -117 37 -115 227 112 -57 -59 -22 -146 3 153 -27 -55 73 -172 -109 -98 43 52 109 37 9
7533IQj27P0j65J48J52k21M9K05M8n4M9j35L5L4j28O6k41k9J53m0Kj45P2O7J48
$$ 9 17 -110 -40 -205 -57 95 -126 -77 128 176 122 171 36 71 105 -23 43 -198 -227 -74 -114 -112 -257 -185 -118 30
7559C0k51N2K68ol9J73k23p9J40J54l17J15O7j79O3R3o4J11j74J28j23J34R8k46
$$ 30 -221 -169 99 93 54 227 4 -75 65 219 -98 17 84 -95 -32 61 -3 108 -66 62 -61 73 171 -75
7583g5L74k54k24N4L32j97l00K91j08J96j12r5Q0J95k19l6N8L08k39JJ4M0j35
$$ -75 299 45 -179 -125 207 10 -290 1 -107 89 -23 -118 -38 157 -62 -98 -40 268 29 30 44 84 -51
7606e1o8N0J22R6L5j23j42K08p8p3m5J5j99L00l5K1K75j89k98J52Kl3J76P1j36
$$ -51 -119 -69 53 149 184 61 -81 127 49 -24 -69 -54 -253 47 12 33 308 119 -179 -27 -25 -58 118 189 53
7631E3J27o0o2j03j11J15k2p8L10m2L3l75RL13j94J30j7J25n3L0l76J04R2L3k53
$$ 53 180 120 58 -45 -156 -41 -63 -141 169 127 160 -215 -206 107 -87 43 26 151 98 128 -248 -144 -52 -19 -272
7656b72K16J38l33N27k06j78J04k35J00L62k32L5k03m2M84m88J89L9o4j86J24
$$ -272 -56 82 -251 276 70 -108 -4 -239 -139 223 -9 26 -177 -219 265 -223 -34 5 -59 -245 -121
7677a21m70O74l39J91R2J26L28k81o9N8l31N48n16M51o8N5o63JN50m07j25M41
$$ -121 -591 83 -256 -65 27 153 481 200 131 189 -142 406 -110 341 273 328 -335 -334 216 -191 -316 125
7699A25j88k61J16J32Q9k74K48l42p5K17J98l65K27k27M47Q2l54k2N19m03Q5L21
$$ 125 -63 -324 -208 -76 13 -261 -13 -355 -430 -213 -15 -380 -153 -380 67 149 -205 -227 292 -111 -26 295
7721B95l02k07j25N96o02L23K41k33m8L58l6m63N67J2j069J394o69M99k85k4L78
$$ 295 -7 -214 -339 257 -345 -22 219 -14 -62 296 260 -203 364 376 -693 701 32 531 246 222 600
7742F00o94q5o21R03J01o91pO94J98m0o85o7M14l3k29Q83n60M00j073R32n56o7
$$ 600 -94 -179 -800 103 204 -487 -494 200 398 358 -327 -394 20 -13 -242 641 81 481 -592 340 -216 -283
7764b83j7L48J73K50l85l95R1J51O30o49K07J32k50%L2Q3k9N0l25L07l49L83l86
$$ -283 -300 48 221 471 86 -309 -218 -67 563 -86 121 253 3 3 35 118 89 139 -186 121 -228 155 -231
7787b31K83J39l22K09j65J37j26J63p5J4q6J59m12K16k9J87j01O8n4k5K34k56
$$ -231 52 191 -131 78 -87 50 -76 87 12 26 -60 99 -313 -97 -126 61 -40 28 -26 -51 183 -73
7809g3j00K53J9r4J84k47N23m73M0N8k3j89J56j8m5l8P5J69k36m5J71M3k44K77
$$ -73 -173 80 99 5 189 -58 465 -8 32 90 67 -122 34 16 -29 -67 8 177 -59 -104 67 110 -134 143
7833A43j28j0k16J41L9M0K7o0Pr3n4O2K33k70J27p5MK58J09k36O8J07k79k86L69
$$ 143 15 5 -211 -70 -31 9 36 -24 -17 -110 -164 -102 131 -139 -12 -87 -83 175 284 48 116 223 -56 -342 27
7858B7n0Q5q6m1J25j26L9K2J53jj09j23J14l44L49nJ80k1k87J27j71J06k7J5m5
$$ 27 -23 62 -24 -65 60 -66 -27 -5 148 147 38 -85 29 -315 34 29 209 188 -99 28 -143 -37 -64 -49 -94
7883i4J71r7L23l18M8k0l10K19p3J59J55j49O3J59j19o6J46j80M3R1j26j94J89
$$ -94 77 -20 303 -15 33 13 -297 -78 -151 8 163 14 77 236 117 51 197 17 60 151 25 -169 20
7906B0O4k10J75L0Pj51Q4J31J62m12K43j24k58K43j12R4j26K14j97J47l8l5%N9
$$ 20 84 -126 49 79 86 -65 19 150 312 -100 143 19 -239 4 -108 -14 -140 74 -123 24 -14 -49 -49 10
7930A0j4k7q9J7J38j13LJ87j37K30K1l65K84O9K8l04J17P5R9j55j20K70j84O7
$$ 10 -4 -31 -120 -103 35 -78 -75 112 -25 205 226 -139 145 214 242 -62 55 130 229 74 -46 224 40 107
7954A07p0J18m2Q4j6l82L15k42J65j06m5J53M6K5j76J67J90j34k37j43K6J9M01
$$ 107 37 155 113 197 181 -201 114 -128 37 -69 -114 39 85 110 -66 101 291 157 -80 -223 -197 -178 223
7977B23N2m12J34J57R2k34R0j82L32l95L61n4k08j7N37l63Q8K15n45j8L33k36
$$ 223 275 -137 -3 154 246 12 102 -80 252 -143 218 164 -44 -61 476 113 201 416 -129 -147 186 -50
7999e0L31J8r49N34L04l34N11k23L12N6O36j032K31N48n72l62j3P75j016M83k26
$$ -50 281 299 -650 -116 188 -146 365 142 454 510 1146 114 345 893 321 -41 -54 721 -295 188 -38
8020c8l92L77Q55r18l40L51l71R75n09K19J43p3o96Q32o90K72J92n04L04mJ30
$$ -38 -430 -53 802 -116 -456 -105 -476 499 -10 209 352 279 -417 415 -275 -3 189 -315 -11 -15 115
8041A15o3m80N50j24K5N2M13q43N00k51J16k3k05O39l78o88L27N74n27K11m72
$$ 115 52 -428 122 -2 23 75 488 -355 145 -106 10 -13 -218 421 43 -645 -318 256 -271 -60 -532
8062e32N00K97n54K75j97M67n80P65m41k55k00J25M76L62o33l41M32O28l62j87
$$ -532 -32 265 -289 -14 -211 256 -324 441 0 -255 -455 -330 146 508 -125 -466 -34 594 232 45
8082D5J87l66j22M05o6P90p95m15N15K7l39N0l49O01m0l42m8N52k03j163J552
$$ 45 232 -134 -256 149 83 873 78 -337 178 205 -134 -84 -433 168 128 -214 -262 290 87 -1076 476
8103D76l44L8J74o21J72L06n48O29n18L60n72N25o34M76Q85n17r79J269m44j60
$$ 476 132 170 344 -277 -105 201 -347 282 -236 124 -448 77 -557 -81 804 287 -692 577 133 -27
8123b7l33k5j34M84K21n26O76k72l62J13J04j95J030j004M53k05oL70M75m15q45
$$ -27 -360 -385 -519 -35 186 -340 336 64 -298 -185 -81 -276 754 -250 203 -2 -8 362 837 422 -423
8144d23J54L14K53k83k98M18l70J41l4J54J45o68j5R46o26J70L63n57J05k7K84
$$ -423 -269 45 298 15 -283 135 -235 -94 -128 26 171 -497 -512 434 -192 -22 341 -216 -111 -138 146
8165A46N8l51L19k00K0O9J60m69J38L64o90K71l98R06o41L59j45J71p0k99L4K08
$$ 146 204 -147 172 -28 -8 61 221 -248 -110 254 -436 -165 -563 343 -298 61 -84 87 17 -282 -248 -40
8187d0k58J08L93m89
$$ -40 -298 -190 203 -286
8191b86
$$ Imaginary data points
##PAGE= N=2
##DATA TABLE= (X++(I..I)), XYDATA
0@%%%%%%%%%%%%%%nJ3j6J6j6J9k7L2l8M6n3O1p2Q7r9J12j29J49j69J91k17K44
$$ 0 0 0 0 0 0 0 0 0 0 0 0 0 0 0 -5 8 -8 8 -8 11 -16 16 -22 24 -29 32 -40 47 -52 60 -69 80 -89 102 -115 129
36A29k74L09l47L89m35M83n34N92o59P29q03Q87r81J080j187J307j440J588j752
$$ 129 -145 164 -183 206 -229 254 -280 312 -347 382 -421 466 -515 565 -622 685 -755 833 -919
55i19J936k145K381k651K964l334L779m323N008n904P135q951J1956j8243O0247
$$ -919 1017 -1128 1253 -1398 1566 -1768 2011 -2312 2696 -3208 3927 -5024 6932 -11311 48936
70D8936m1730J8329o799m8089J09595m3050J1771j142o3509K3279j5491K1013
$$ 48936 7206 25535 18736 -29353 80242 37192 48963 47821 -15688 7591 -7900 13113
82A3113K8121l8868L0453n3934j813L3448m5476N9700j7281m7099M9483o5356
$$ 13113 41234 2366 32819 -21115 -22928 10520 -34956 24744 7463 -39636 9847 -55509
94e5509K0207M3384m3224M1446k6545l3429J7984k4879L8974R41p99J1722n9591
$$ -55509 -35302 8082 -35142 6304 -20241 -53670 -35686 -60565 -21591 -20650 -21449 -9727 -69318
107f9318K3492o736j0796O7542m1351N467Q305o2483M8358l348n396M9028m7397
$$ -69318 -45826 -52562 -63358 4184 -37167 -31700 -23395 -85878 -37520 -40868 -46264 2764 -44633
120d4633N655O26k4922M2413r851J3433L349l3236K3702k1864J5531L3927l1604
$$ -44633 -38978 -38352 -63274 -20861 -30712 -17279 -13930 -47166 -23464 -45328 -29797 4130 -27474
133b7474K7709j7584k6844L5776j9611K5062J8251k6731J5776k4091o87K3109
$$ -27474 235 -17349 -44193 -8417 -28028 -2966 15285 -11446 4330 -19761 -20448 2661
145B661p088K7824j2103r299M754k4534K8411M097j182K5557l4632L665O208j7398
$$ 2661 -4427 23397 11294 1995 6749 -17785 10626 14723 13541 39098 4466 8131 14339 -3059
159c059L6197o150k653R179k9413J2818p32J804K6273j9921M827o401j9872K4931
$$ -3059 33138 26988 24335 33514 4101 16919 16187 17991 44264 24343 29170 22769 2897 27828
173B7828q691J2817R997k5414J0435j5111l617K5036j1147J1643m972j9890Q003
$$ 27828 19137 31954 41951 16537 26972 11861 8244 33280 22133 33776 28804 8914 16917
186A6917j0583J1678R259p124Q477k1288l193P050r369K1051m883p253K664k1412
$$ 16917 6334 18012 27271 20147 28624 7336 4143 11193 1824 22875 17992 10739 13403 -8009
200h009R298L586k975J7582j7440k196l060j3776J7610l048L878M651k0609N087
$$ -8009 1289 4875 1900 19482 2042 -154 -3214 -16990 620 -2428 1450 6101 -14508 -9421
214i421p460j459K0064j1817N899m553j8395J2702p352P479J1521j3552N810j2914
$$ -9421 -16881 -18340 1724 -10093 -4194 -8747 -27142 -14440 -21792 -14313 -2792 -16344 -10534 -23448
228b3448n661J3155m423J1950j485j1701M360j2130Q142Q176l949J1411j2914
$$ -23448 -29109 -15954 -20377 -8427 -9912 -21613 -17253 -29383 -21241 -13065 -17014 -5603 -18517
241a8517m096M059q045J6015J911k084N658j6195M411K560l21J5947p171P00j212
$$ -18517 -22613 -18554 -26599 -10584 -8673 -10757 -5099 -21294 -16883 -14323 -14644 1303 -5868 -5168 -6380
256f380j2084J2682M92L913J0567j4172N148m568m799J6539l763O316K345j4008
$$ -6380 -18464 -5782 -5290 -1377 9190 -4982 166 -4402 -9201 7338 3575 9891 12236 -1772
270a772O364m664M172J2918o228N149o372p315Q751m002R631M442q064L309r987
$$ -1772 4592 -72 4100 17018 10790 15939 9567 2252 11003 7001 16632 21074 13010 16319 6332
285F332O34Q132j257Q139m320o229R31p139P695L917j182M836j0170k486o75j775
$$ 6332 6966 15098 13841 21980 17660 11431 12362 5223 12918 16835 15653 20489 10319 7833 7158 5383
301E383J0601k442p21k89j1460L495L84M89Q309o626j443l440p647O832O6L180
$$ 5383 15984 13542 12821 12532 1072 4567 4951 5440 13749 7123 5680 2240 -5407 1425 1491 4671
317D671K073q610o67l306j586P425q29J568l049o832R71k115L711M405k388j56
$$ 4671 6744 -1866 -2533 -5839 -7425 0 -829 739 -2310 -9142 -8171 -10286 -6575 -2170 -4558 -4714
333d714m991l713K212J558M119J142l242k475m146J504L394K466K133k421k780
$$ -4714 -9705 -13418 -11206 -9648 -5529 -4387 -7629 -10104 -14250 -12746 -9352 -6886 -4753 -7174 -9954
348i954k482l45M493J964K110m55m379j135K5K250M325J159m99k565k434R47J688
$$ -9954 -12436 -12781 -8288 -6324 -4214 -4669 -9048 -10183 -10158 -7908 -3583 -2424 -2923 -5488 -7922 -6975 -5287
365e287L729K148q90k138j957k74K273L523J955l89j839k051o46K592K566K540
$$ -5287 -1558 590 -300 -2438 -4395 -4669 -2396 1127 3082 2693 854 -1197 -1843 749 3315 5855
381E855q17j559j880j559L232K215J402J573l426j967L92K71L798P00K1p73m180
$$ 5855 5038 3479 1599 40 3272 5487 6889 8462 5036 3069 3461 3732 7530 8230 8251 7478 3298
398C298O46Q87J604L365j515j436j863j776J887J181K103J81k863q76k176N50
$$ 3298 3944 4831 6435 9800 8285 6849 4986 3210 5097 6278 8381 8562 5699 4823 2647 3197
414C197K631N71P44j951k611q36o45K802R23k98k26m195k04k64N89L189j505r28
$$ 3197 5828 6399 7143 5192 2581 1745 1100 3902 4825 4527 4301 106 -98 -362 227 3416 1911 983
432I83j681l593K262J92J198J993l580p14k057j170L120k85J660j158l740Q07
$$ 983 -698 -4291 -2029 -1837 -639 1354 -2226 -2940 -4997 -6167 -3047 -3332 -1672 -2830 -6570 -5763
448e763k228J978K609j413J093k954j826J517j018L778J6j912Q46l836J497J324
$$ -5763 -7991 -6013 -3404 -4817 -3724 -6678 -8504 -6987 -8005 -4227 -4211 -6123 -5277 -9113 -7616 -6292
464f292J31L562l226L05n04k521M972r68J014K351m763J755k63n65N357k506J668
$$ -6292 -6161 -2599 -5825 -5520 -6024 -8545 -3573 -4541 -3527 -1176 -5939 -4184 -4447 -5012 345 -2161 -493
481d93R5l996M302j787K083L705l954K630j945j539M752k752M156K94m121M052
$$ -493 -398 -4394 -92 -1879 204 3909 -45 2585 640 -899 3853 1101 5257 5551 1430 5482
497E482l751J574M339l474L758k599j754L488l939M663J74k760L912n274J518
$$ 5482 1731 3305 7644 4170 7928 5329 3575 7063 3124 7787 7961 5201 9113 3839 5357
512E357J627k674N533l746m71J909n728N167j039j988N191o482J496Q65m502N899
$$ 5357 6984 4310 9843 6097 5626 7535 1807 6974 5935 3947 9138 2656 4152 5017 515 6414
528F414l056k77K338o817M286k244r25N241o059K344q22m642N649m038J617K514
$$ 6414 3358 3081 5419 -1398 2888 644 -281 4960 -1099 1245 423 -4219 1430 -2608 -991 1523
544A523o558M683l854j585O099n760L402m10n446N084m166J970K951n072M215
$$ 1523 -5035 -352 -4206 -5791 308 -5452 -2050 -2460 -7906 -2822 -6988 -5018 -2067 -7139 -2924
559b924l521j555M676m821N072r20l584M507n763L173K415m366O493m572j113
$$ -2924 -6445 -8000 -3324 -8145 -3073 -3993 -7577 -3070 -8833 -5660 -3245 -7611 -1118 -5690 -6803
574f803M022n361N386P8k828N128n484J739J902l253O033k996L50J823n065N056
$$ -6803 -2781 -8142 -2756 -2678 -5506 -378 -5862 -4123 -2221 -5474 559 -2437 -2087 -264 -5329 -273
590b73j021n91N248n703K522N15l534O232k841P53K865n343L755j492l64M870
$$ -273 -1294 -1885 3363 -2340 182 697 -2837 3395 554 1307 4172 -1171 2584 1092 728 5598
606E598l589K244o52l203M095k445K160J798l695L158k949j75M116l900L836q11
$$ 5598 2009 4253 3601 398 4493 2048 4208 6006 2311 5469 2520 2345 6461 2561 6397 5586
622E586l134L398l699K217K016k785K941l018o82J966k556L698r20j657J869l806
$$ 5586 2452 5850 2151 4368 6384 3599 6540 3522 2840 4806 2250 5948 5028 3371 5240 1434
638A434J768K36r80L198l350L74M14l317L294o66m49J528l211N64n91o00K365
$$ 1434 3202 3438 2458 5656 2306 2680 3094 -223 3071 2405 1956 3484 273 837 246 -354 2011
655B011j790J087j076k748K031j722J405J070k351J354k540l56J770j632K206
$$ 2011 221 1308 232 -2516 -485 -2207 -802 268 -2083 -729 -3269 -3625 -1855 -3487 -1281
670a281m99k320R17k232J169R52l92J391k459m49K93j481K939q10j60Q36k827
$$ -1281 -1780 -4100 -3183 -5415 -4246 -3294 -3686 -2295 -4754 -5203 -4910 -6391 -3452 -4262 -4422 -3586 -6413
687f413J268l08K73K472j797N76q32j418K329p01J409J043k082J125j523O17K190
$$ -6413 -5145 -5453 -5180 -2708 -4505 -3929 -4761 -6179 -3850 -4551 -3142 -2099 -4181 -3056 -4579 -3962 -1772
704a772q10K161r72j838J825j669K143J570j173J817k544N68J001m71L108p91
$$ -1772 -2582 -421 -1393 -3231 -1406 -3075 -932 638 -535 1282 -1262 -694 307 -164 2944 2153
720B153o49J057k758K283P65k41K914k412M47k43j954L414l48jJ703l156J158
$$ 2153 1504 2561 -197 2086 2851 2610 5524 3112 3559 3316 1362 4776 4428 4427 6130 2974 4132
737D132o62j16K936j649J078n62k623K170j337J399J530k508J106k075q26K286
$$ 4132 3470 3354 6290 4641 5719 5157 2534 4704 3367 4766 6296 3788 4894 2819 1993 4279
753D279j284K019m49k376J032k650J111J915j542J458k182j232Q98j885K553n7
$$ 4279 2995 5014 4565 2189 3221 571 1682 3597 2055 3513 1331 99 997 -888 1665 1608
769A608j067R80l124J78P36q42K455j386j093N98k963K014J52R9J462k174n86
$$ 1608 541 1521 -1603 -1425 -689 -1531 924 -462 -1555 -957 -3920 -1906 -1754 -1655 -193 -2367 -2953
786b953l83j071K489n53K69P61l434J393j019O27K387j430L84q37j990J928j36
$$ -2953 -3336 -4407 -1918 -2471 -2202 -1441 -4875 -3482 -4501 -3874 -1487 -2917 -2533 -3370 -5360 -3432 -3568
803c568J013J241j609L2j542j12J989j4J110p8j729K49o71J072J691p81Q91o80
$$ -3568 -2555 -1314 -2923 -2891 -4433 -4545 -2556 -2570 -1460 -1538 -3267 -3018 -3689 -2617 -926 -1707 -816 -1496
821a496j032Q68n75J963O79q20K05j057l84Q66J97K294p14j028o2m03O34O48Q33
$$ -1496 -2528 -1660 -2235 -272 407 -413 -208 -1265 -1649 -783 -586 1708 994 -34 -96 -499 135 783 1616
840A616M81j146l76J5k04K347J71N6o8j965R0R43P32J001N5o15o11q43N92m4R58
$$ 1616 2097 951 575 590 386 2733 2904 2960 2892 927 1017 1960 2692 3693 3748 3133 2522 1679 2271 2227 3185
861C185P88o74j332K04q0P89r9J204q8j678o57QM58J347P63r89j9j609m14Q26
$$ 3185 3973 3299 1967 2171 2091 2880 2781 3985 3897 2219 1562 1570 2028 3375 4138 3149 3130 1521 1107 1933
881A933J147L56q69j389r41N37k23J140L70n72j447p97L0l69J615j03m49J14j814
$$ 1933 3080 3436 2567 1178 237 774 551 1691 2061 1489 42 -755 -725 -1094 521 418 -31 83 -1731
900a731o15P35O92N52n96j97k285L28K44J008O35j6o67j449k38K75O29O47Q70
$$ -1731 -2346 -1611 -919 -367 -963 -1160 -3445 -3117 -2873 -1865 -1230 -1246 -1913 -3362 -3600 -3325 -2696 -2049 -1179
919a179j048j387n1m74J312J216k18l21n91p13O43N03J116j57m90k95o40P26O41
$$ -1179 -2227 -3614 -3665 -4139 -2827 -1611 -1829 -2150 -2741 -3454 -2811 -2308 -1192 -1349 -1839 -2134 -2774 -2048 -1407
938a407J121O9j100K35p06J49R46P29N84K69j768J86M1K81J410P75K43j205l39
$$ -1407 -286 -217 -1317 -1082 -1788 -1639 -693 36 620 889 -879 -693 -652 -371 1039 1814 2057 852 513
957E13M16p08J412J183r15r0r44m6R58L38M65P03j701P8r24Q23J212j192J295
$$ 513 929 221 1633 2816 1901 1811 867 821 1779 2117 2582 3285 1584 1662 738 1561 2773 1581 2876
976B876r22j106Q17n80J067J166j267L69j749L31K12n38K363j035p80Q0j475J339
$$ 2876 1954 848 1665 1085 2152 3318 2051 2420 671 1002 1214 676 3039 2004 1224 1304 -171 1168
994A168o09Q14J389k343J40o56q32J924r31J422l90k165Q39q87P15J462j391L14
$$ 1168 559 1373 2762 419 559 -97 -929 995 64 1486 1096 -1069 -230 -1117 -402 1060 -331 -17
1012a7o48j634J768j314J983O72j629N27k094p1J953p21J729n51k098J553j596
$$ -17 -665 -2299 -531 -1845 138 810 -819 -292 -2386 -2457 -504 -1225 504 -47 -2145 -592 -2188
1029b188P06J444r82J404j623j184J984k017J935O99r60O93k090O62P37j234L375
$$ -2188 -1482 -38 -1020 384 -1239 -2423 -439 -2456 -521 178 -782 -89 -2179 -1517 -780 -2014 1361
1046A361j612r67L88j463J262L15K59J301j597l03pj381K692p76M59L33j259Q61
$$ 1361 -251 -1218 -830 -2293 -1031 -716 -457 844 -753 -1056 -1063 -2444 248 -528 -69 264 -995 -134
1064a34q80N13J883j722P30k61j496J250j164K302R38k575J495j204O25Q73r44
$$ -134 -1014 -501 1382 -340 390 129 -1367 -117 -1281 1021 1959 -616 879 -325 300 1173 229
1081B29J696j103j204J552o57K23J708j426P55j448P8J109j743K072n63k55Q50
$$ 229 1925 822 -382 1170 513 736 2444 1018 1773 325 403 1512 -231 1841 1278 1023 1873
1098A873k210P25J010m39J190j121Q62j51k594K083m94O22Q16k378M74M70j030
$$ 1873 -337 388 1398 959 2149 1028 1890 1739 -855 1228 734 1356 2172 -206 268 738 -292
1115b92K360j013J15J09j793Q56q51m32K510j278m68j39j69k04P1O71L52j102
$$ -292 2068 1055 1170 1279 -514 342 -509 -941 1569 291 -177 -316 -485 -689 -618 53 405 -697
1133f97R1p87j01R47p44J183j077R6l02o78J125J8O41p8j605J004n67n14J482
$$ -697 -606 -1393 -1494 -547 -1291 -108 -1185 -1089 -1391 -2069 -944 -926 -285 -363 -1968 -964 -1531 -2045 -563
1152e63j74J97j22o22M58m93M16J108m96j37j037O8Q72O1O78p4l12j79K2r0P72
$$ -563 -737 -540 -662 -1284 -826 -1319 -903 205 -291 -428 -1465 -1397 -525 -464 214 140 -172 -351 -329 -419 353
1173C53o63J040k34o83M23n69J445j93M4J06k43l22j12K58J232q30Q6q6r12Q93
$$ 353 -310 730 496 -187 236 -333 1112 919 963 1069 826 504 392 650 1882 1052 1138 1052 140 1033
1193A033k16N49K71m82K82j107K93P19l60Q58m64j164P85q63M74O83p17P82q62
$$ 1033 817 1366 1637 1155 1437 330 623 1342 982 1840 1376 212 997 134 608 1291 574 1356 494
1212D94n47N99p57J006J52o62O75j541L12P20p75J302p07m56L34j460J197P7l11
$$ 494 -53 546 -211 795 947 285 960 -581 -269 451 -324 978 271 -185 149 -1311 -114 -37 -348
1231c48R63j179r5k6o00J034M3l57L01j098P79l27k30J225n08L0n18o38R00o01
$$ -348 615 -564 -659 -685 -1285 -251 -208 -565 -264 -1362 -583 -910 -1140 85 -423 -393 -911 -1549 -649 -1250
1251a250R63L34j131O08o95m76J367p31P78j68p57P71j106O77N85o21Q65q41n26
$$ -1250 -287 47 -1084 -476 -1171 -1647 -280 -1011 -233 -401 -1158 -387 -1493 -816 -231 -852 13 -828 -1354
1270a354P20n86J195r1m8M34j331K78M36o53J303l52j90J17p25N88K92k56J000
$$ -1354 -634 -1220 -25 -116 -164 270 -1061 -783 -347 -1000 303 -49 -239 -122 -847 -259 33 -223 777
1289G77r39N2Kn38J188k19K29K03o92K68k19K29M87K1p7M3n33M80r5M37J14l75
$$ 777 -162 -110 -108 -646 542 323 552 755 63 331 112 341 828 849 772 815 282 762 667 1104 1218 843
1311H43J94j89QM23l99L98K13q84K61j45L61K04n6J16m02m25N50l84N40N3j41
$$ 843 1037 848 856 1279 880 1278 1491 607 868 723 1084 1288 1232 1348 946 521 1071 687 1227 1280 1139
1332A139k28n68K55K92k06K29mn75K16m22J10L01m94K43J53m90n8j65K7k7J19
$$ 1139 911 343 598 890 684 913 909 334 550 128 238 539 45 288 441 -49 -107 -272 -245 -272 -153
1353a53J00m55j60l89L28M0j3L5n75J66j23Q6l7O1q4l58r3J1O4K10K70m22P2p8
$$ -153 -53 -508 -668 -1057 -729 -689 -702 -667 -1242 -1076 -1199 -1113 -1150 -1089 -1173 -1531 -1624 -1613 -1549 -1339 -1069 -1491 -1419 -1497
1377a497j55J79K66J9J67J9k28j11J07J96L40j23j68J32l07K76K42J35R7M0k26
$$ -1497 -1652 -1473 -1207 -1188 -1021 -1002 -1230 -1341 -1234 -1038 -698 -821 -989 -857 -1164 -888 -646 -511 -414 -374 -600
1398f00r9J46M55K01J44k19J52n2o7oK59M50k18J73j37o2J01K25K21j21K02m55
$$ -600 -699 -553 -98 103 247 28 180 128 61 55 314 764 546 719 582 520 621 846 1067 946 1148 693
1420F93lK11O6M14m14J22j53l07N50M3j26m5p4j14P7m25L40j88L72K06n67L37
$$ 693 690 901 967 1381 967 1089 936 629 1179 1222 1096 1051 977 863 940 515 855 667 1039 1245 678 1015
1442A015k33J07J28m47L07p2l46J44k06J10J04j51K77k46n62M68j53J0J01j62
$$ 1015 782 889 1017 570 877 805 459 603 397 507 611 460 737 491 -71 397 244 254 355 193
1462A93O9m13Q1l4L3K30j80j23n8m71J78M33n3Q6m97K06J10p47M93J11k74J58
$$ 193 262 -151 -70 -104 -71 159 -21 -144 -202 -673 -495 -62 -115 -29 -526 -320 -210 -957 -464 -353 -627 -469
1484d69n91N35k03j77N79n64J34p3k89L48l10L49P1n74M90k56L8N00n28K96Jl66
$$ -469 -1060 -525 -728 -905 -326 -890 -756 -829 -1118 -770 -1080 -731 -660 -1234 -744 -1000 -962 -462 -990 -694 -693 -1059
1506a059N22k67j80P23o95M68k64k06O66o75N68r6k69N90m72K8N36n02Q00m11
$$ -1059 -537 -804 -984 -261 -956 -488 -752 -958 -292 -967 -399 -495 -764 -174 -646 -618 -82 -584 216 -195
1526a95j20N71q85O29l0p2M92n38N8L62j87Q33l85j47O09p40N05j5k38P33m31
$$ -195 -315 256 -629 0 -30 -102 390 -148 -90 272 85 918 533 386 995 255 760 745 507 1240 809
1547H09J78M3o55Q39o1k06P49r03M17l18m01R11l36M73k17o68N67k78k02O28p24
$$ 809 987 1030 375 1214 1153 947 1696 793 1210 892 491 1402 1066 1539 1322 654 1221 943 741 1369 645
1568F45M15n25o6K04j54K13P1o63N48n37m4L51k04L2q2j85j02o03N19J89m31M00
$$ 645 1060 535 469 673 519 732 803 140 688 151 107 458 254 286 204 19 -83 -686 -167 22 -409 -9
1590ip74J08J50k61N39q8k56J6n52J27RJ52L98l74p1J57k85J5O0J54K81l08J0
$$ -9 -783 -675 -525 -786 -247 -335 -591 -575 -1127 -1000 -991 -839 -441 -815 -886 -729 -1014 -999 -939 -785 -504 -812 -802
1613h02r6M8J13Q3J32K59n13k8k5M8M37l7K08k29j56O2N0K19K8j82K02j48K24
$$ -802 -898 -850 -737 -654 -522 -263 -776 -804 -829 -781 -344 -381 -173 -402 -558 -496 -446 -227 -199 -381 -179 -327 -103
1636a03m4J50L28q8n0k22j07K08J43k2K41j68j9k54K19J04L14J78o87L62j36p6
$$ -103 -147 3 331 243 193 -29 -136 72 215 193 434 266 247 -7 212 316 630 808 121 483 347 271
1658B71O12m16K63l56j42J55j31J59K19k61L61m38J96K7m06O08n47M97j92n8j92
$$ 271 883 467 730 374 232 387 256 415 634 373 734 296 492 519 113 721 174 671 479 421 229
1679B29M75n20J26K34m23M17j18n90J129l88l4j45l03K79o24Q57M09j008n02R88
$$ 229 704 184 310 544 121 538 420 -170 959 571 537 392 89 368 -256 601 1010 2 -500 488
1699D88n38L32l34Q87j17k15n07p51P31M41k12J93j256M81l94K87q3P29r0K18
$$ 488 -50 282 -52 835 718 503 -4 -755 -24 417 205 398 -858 -377 -771 -484 -567 162 72 290
1719B90j391O87J72m43K36o83O14K19o01L37K31J25M44o80J17k55k50N66j11j51
$$ 290 -1101 -414 -242 -685 -449 -1132 -518 -299 -900 -563 -332 -207 237 -443 -326 -581 -831 -265 -376 -527
1739e27P5l30L90m63N37K93k67J02K13m73J50j40J64L74k04L1l16j08O35j59L66
$$ -527 -452 -782 -392 -855 -318 -25 -292 -190 23 -450 -300 -440 -276 98 -106 -75 -391 -499 136 -23 343
1760C43j31j96K24n79J08N21O6N51q29l9M09j6J82j42j35M07o68N22q0qL36n01
$$ 343 212 16 240 -339 -231 290 356 907 78 39 448 432 614 472 337 744 76 598 518 510 846 345
1782C45L86J11l17k46L43l41R19n22n08L20k02M82m30k9O90p20j67K89l05O79
$$ 345 731 842 525 279 622 281 1200 678 170 490 288 770 340 311 1001 281 114 403 98 777
1802G77o20K65j3q27L26l56J98N95k86n60L50j51M0N7p0L27k00j60J8j22n5O07
$$ 777 157 422 409 -418 -92 -448 -250 345 59 -501 -151 -302 -262 -205 -275 52 -148 -308 -290 -412 -467 140
1824A40K7p89k43K79l10O41MK32n2p57l21M30K90K30O07o20k67L47l11J10L14
$$ 140 167 -622 -865 -586 -896 -255 -251 -19 -71 -828 -1149 -719 -429 -199 408 -212 -479 -132 -443 -333 -19
1845a9j71L79N3l64p72Q95K57Ln73k84k13J93M88L27j11j4j15J99k27j88N86K56
$$ -19 -190 189 242 -122 -894 1 258 261 -312 -596 -809 -616 -128 199 88 74 -41 158 -69 -257 329 585
1867E85l92k31k04n53Q18N97o54k3P38nj347J053j51k68L85L46n64L40j03L63
$$ 585 193 -38 -242 -795 23 620 -34 -57 681 676 -671 382 231 -37 348 694 130 470 367 730
1887G30k98P06n46o41O18k16n14J307j16r21k63l10Q02n06M28n54L61k4n15l04
$$ 730 432 1138 592 -49 569 353 -161 1146 1030 109 -154 -464 338 -168 260 -294 67 43 -472 -776
1907g76J442l07N64K34j436n7j60N97M14P04j22j759Q38M20n15N38j02n84m6j3
$$ -776 666 359 923 1157 -279 -336 -496 101 515 1219 1097 -662 176 596 81 619 517 -67 -113 -126
1927a26q06P41l6J183q86j88n34M9P24q97J80P32l00M50j749J473O78j110P21
$$ -126 -932 -191 -227 956 70 -118 -652 -603 121 -776 -596 136 -164 286 -1463 10 688 -422 299
1946B99m87j07l24J166j026N09l11M58q62J896j781K7N6L48P49p3r68K18j419
$$ 299 -188 -295 -619 547 -479 30 -281 177 -685 1211 -570 -543 -487 -139 610 537 -431 -213 -1632
1965a632N44J508o50k02j7P12n41O53r0q79M33j138Q74J108p63K2j119J464K65
$$ -1632 -1088 420 -230 -432 -449 263 -278 375 285 -594 -161 -1299 -425 683 -80 -58 -1177 287 552
1984E52o50J398k74r7p07k20J052j243J61O61k52k37j55Q57j009O0m96L53J349
$$ 552 -98 1300 1026 929 222 2 1054 -189 -28 633 381 144 -11 846 -163 -103 -599 -246 1103
2003A103k72L72j191m58J486O53k558J291R78j322M79L43j089J70J112l00l12
$$ 1103 831 1203 12 -446 1040 1693 -865 426 1404 82 561 904 -185 -15 1097 797 485
2020D85p31J412r56M74j009O34N53j462J123n51r05R61r78P20L36K30l21k12m9
$$ 485 -246 1166 210 684 -325 309 862 -600 523 -28 -933 28 -950 -230 106 336 15 -197 -246
2039b46k38K14m50r94J668rj210J370k75K6K80j635J993k58K61j495K91J56m58
$$ -246 -484 -270 -720 -1714 -46 -55 -1265 105 -170 -144 136 -1499 494 236 497 -998 -707 -551 -1009
2058a009j60j84M18R45j465k03J569l29N16J05j326L20Q41j34N42p99J33J65o
$$ -1009 -1169 -1353 -935 10 -1455 -1658 -89 -418 98 203 -1123 -803 38 -96 446 -353 -220 -55 -61
2077f1j62R54J99j540J854k290j77J841l04q27P44p0O08l16o63M27l0j76L25p30
$$ -61 -223 731 930 -610 1244 -1046 -1223 618 314 -513 231 161 769 453 -210 217 187 11 336 -394
2097c94R72q73m9P35m05M72m66P49k92j245J075L19p90L38L32J63J20k94m7M7
$$ -394 578 -295 -344 391 -14 458 -8 741 449 -796 279 598 -192 146 478 641 761 467 420 467
2117D67l12%R9q5J46j53J94K0M61n43l46M86j31P18j014L10k53O0k94L55J8p4
$$ 467 155 155 254 169 315 162 356 376 837 294 -52 434 303 1021 7 317 64 124 -170 185 203 129
2139A29M09m43k4k01k4Q25k53k41m10L38K72n54JK41j6j38J17l2j14K33k69m38
$$ 129 538 95 71 -130 -154 671 418 177 -233 105 377 -177 -176 65 49 -89 28 -4 -118 115 -154 -592
2161e92K05J80p8O5k88N93k52K84o60Q7N66n63M18n51J32q7N6J04K51p4j0l59
$$ -592 -387 -207 -285 -220 -508 85 -167 117 -543 -456 110 -453 -35 -586 -454 -541 -485 -381 -130 -204 -214 -573
2183e73J6L09j45K86j17k38J77k02O1L76r6k99L20k67L09l76k47J12M64P6k20
$$ -573 -557 -248 -393 -107 -224 -462 -285 -487 -426 -50 -146 -445 -125 -392 -83 -459 -706 -594 -130 -54 -274
2204b74K05j85J96l59Q96o01P7j77K92J68k26l6R8J17o5j44J69J4r4n62M66M69
$$ -274 -69 -254 -58 -417 479 -122 -45 -222 70 238 12 -24 74 191 126 -18 151 165 71 -491 -25 444
2226D44%p4l3J85K11o08O15Jk16m07R02r38P96m69j24k32L72K2L39n53J40R5n00
$$ 444 444 370 337 522 733 125 740 741 525 118 1020 82 878 409 285 53 425 447 786 233 373 468 -32
2249c2N74o81P64l44n8j86JJ21J83J9k07k21n6N71n99O99k85l98j48J17N05l56
$$ -32 542 -139 625 281 223 37 38 159 342 361 154 -67 -123 448 -151 548 263 -135 -283 -166 339 -17
2271a7L55k57n53M27m1J02o70M25N27K39l43l12n80J78M36l08N8k89P92j69q1
$$ -17 338 81 -472 -45 -86 16 -654 -229 298 537 194 -118 -698 -520 -84 -392 -334 -623 169 0 -81
2292h1l71N75n82M01l54j83N70k69J21N6l6R1J31k37j40M0l38M57N10m97j27l4
$$ -81 -452 123 -459 -58 -412 -595 -25 -294 -173 -117 -153 -62 69 -168 -308 -268 -606 -149 361 -136 -263 -297
2314b97L59O5L45j01J5k24k53L69k09K38k99N2k25J66o6J33o7N7k49L82j03m9
$$ -297 62 127 472 371 386 162 -91 278 69 307 8 60 -165 1 -65 68 1 58 -191 191 88 39
2336C9M69m54q4k09L61l66J31J81j51pL01Q7L46r74L57K31J23m0m01J38n30R82
$$ 39 508 54 -30 -239 122 -244 -113 68 -83 -90 211 298 644 -330 27 258 381 341 -60 78 -452 530
2358E30m15K81j84J89p14L91k56M20j50L52o05K02K69J45K82k72P1m0k35L2l20
$$ 530 115 396 212 401 -313 78 -178 242 92 444 -161 41 310 455 737 465 536 496 261 293 -27
2379b7J03R6j00Q0r2k88K31J73j51J9j45J18j5J33l00L95l43J75j3k57K01k31
$$ -27 76 172 72 152 60 -228 3 176 25 44 -101 17 2 135 -165 230 -113 62 49 -208 -7 -238
2401b38K83r1l01N39m09k33R3L86K39m98j4Q2l74P26j72l34K2K8J8r0L40Qk70
$$ -238 45 -46 -347 192 -217 -450 -357 29 268 -230 -244 -162 -536 190 18 -316 -294 -266 -248 -338 2 10 -260
2424b60K32l59N1M14n00M87l98j31M22j01J85J87M0n47K69l4k85r6O36k9pJ89
$$ -260 -28 -387 -336 78 -422 65 -333 -464 -42 -143 42 229 269 -278 -9 -43 -328 -424 212 183 176 365
2446C65n72k68L60N46j80L1l77L91l93k9P9P2k59j11K10K93j3L89K02p92Q80n59
$$ 365 -207 -475 -115 431 251 282 -95 296 -97 -126 -47 25 -234 -345 -135 158 145 534 736 -56 824 265
2468B65m90K8K39k77L30p6j67N51j12k51l80L51m4j14pL63m59N97j65n65N56J68
$$ 265 -225 -197 42 -235 95 19 -148 403 291 40 -340 11 -33 -147 -154 209 -250 347 182 -383 173 341
2490C41q30N13j2q1o9L80q2L15n45l35M14L52m43M03o73J36Q7N10k88P3l26K76
$$ 341 -489 24 12 -69 -138 242 160 475 -70 -405 9 361 -82 321 -352 -216 -129 381 93 166 -160 116
2512A16l24j74L18j80K48j00N64o51J48j84L77j81j37m2K28k13J29k77K09j6J00
$$ 116 -208 -382 -64 -244 4 -96 468 -183 -35 -219 158 -23 -160 -202 26 -187 -58 -335 -126 -142 -42
2533d2K61k04Q15o37k47M61o70O51k23l70L07O59k80q14M24J36K97k24k70J6m85
$$ -42 219 15 830 193 -54 407 -263 388 165 -205 102 761 481 -333 91 227 524 300 30 46 -439
2554d39j68O78l3j86N24o73K47j71N43m47L04n42N59L0O9Q6l25k25M3L55m99J10
$$ -439 -607 71 38 -148 376 -297 -50 -221 322 -125 179 -363 196 226 295 381 56 -169 -126 229 -270 -160
2576a60k89K70J86o1L32j83N6o36R82n39M0K95l57m8k41K09L71n65K85m5K26K43
$$ -160 -449 -179 7 -54 278 95 151 -485 497 -42 -2 293 -64 -112 -353 -144 227 -338 -53 -98 128 371
2598C71j46o53J239m62r30j30O86o0L80J34J0k49j55k20l84R82j50k84N59j92
$$ 371 225 -428 811 349 -581 -711 -25 -85 295 429 439 190 35 -185 -569 413 263 -21 538 346
2618C46k22J06l60K01J47j47N16m43K73r13M61j44n33P97ql13K62l30j70P80o72
$$ 346 124 230 -130 71 218 71 587 144 417 -496 -35 -179 -712 85 77 -236 26 -304 -474 306 -366
2639c66L61k12q2N31l56j32O75p27P6k05M89J92j91m13O7n7R19p22K61j41K03
$$ -366 -5 -217 -299 232 -124 -256 419 -308 -232 -437 52 244 53 -360 -293 -350 569 -153 108 -33 170
2660A70k49J76k16K21p9M52m8n19M18M6j26l56NQ7J64r0j52L35J90q7q7j44K62
$$ 170 -79 97 -119 102 23 475 427 -92 326 372 246 -110 -105 -18 146 56 -96 239 429 342 255 111 373
2683C73jk39J5pl1j26J38k08J56k1kJ02j84k6J46j81K27J77j00j86k49J55p3P8
$$ 373 372 133 148 141 110 -16 122 -86 70 49 47 149 -35 -61 85 -96 131 308 208 22 -227 -72 -145 -67
2707f7j21K57p1P8R4j26j00j3jn0J24j44n4N8M7M7n5L0j24p4MK31k85L05l37N9
$$ -67 -188 69 -2 76 170 44 -56 -69 -70 -120 4 -140 -194 -136 -89 -42 -97 -67 -191 -265 -261 -30 -315 -10 -347 -288
2733b88K03K1K42l32k94L42j21R3k1lQ4R5o2l3k22K86J39l84J43J20l9o8l5k3
$$ -288 -85 -64 178 -154 -448 -106 -227 -134 -155 -158 -74 21 -41 -74 -296 -10 129 -255 -112 8 -31 -99 -134 -157
2757a57J01J19l3j0r2K50l42J31M5q0R2r5J82j88K1L8K29k19J9j96K80l55M13
$$ -157 -56 63 30 20 -72 178 -164 -33 12 -68 24 -71 111 -77 -56 -18 211 -8 11 -185 95 -260 153
2780A53L4k87J79l12K55K4k3Q3o8n2K7Q7MJ22j15J09J50l35o0j02L9N3Q4j12J28
$$ 153 187 -100 79 -233 22 46 23 106 38 -14 13 100 104 226 111 220 370 35 -25 -127 -88 -35 49 -63 65
2805F5o5N2Q9n8j50J92k02J25j20L1P3Kq8K31j57P5l41L75J07l05N8L25k43o6
$$ 65 0 52 141 83 -67 125 -77 48 -72 -41 32 34 -54 177 20 95 -246 129 236 -69 -11 314 71 5
2829EN7J32l58K61l8k8R6K6j61J78l60J77R2M2n9j05L1k9r0K51j6J6m10L06M7
$$ 5 62 194 -164 97 59 31 127 153 -8 170 -190 -13 79 121 62 -43 -12 -41 -131 120 104 120 -290 16 63
2854F3J0k1l43J08j8K94l21J77j87J72j10j71L75j01k53K27j6k19K32J92k43o1
$$ 63 73 52 -291 -183 -201 93 -228 -51 -238 -66 -176 -347 28 -73 -326 -99 -115 -334 -102 90 -153 -214
2876b14P3L8q1J87q9k4O2J42J5j54P2j11M7Q1k44J57L2p8n1J14Q4j51J50j6M7
$$ -214 -141 -103 -184 3 -86 -110 -48 94 109 -45 27 -84 -37 44 -200 -43 -11 -89 -140 -26 58 -93 57 41 88
2901H8J5l23M43l42J92j66K76j1r6K90n71M86p3J08m3p8j04kk3J34j42R7O5J54
$$ 88 103 -220 223 -119 73 -93 183 172 76 366 -205 281 208 316 273 195 91 89 66 200 58 155 220 374
2925C74m59r4n1K04M91l85j31k3J23J44l70N48l32L8j70Pq6p9M38j54L36l28K67
$$ 374 -85 -179 -230 -26 465 80 -51 -74 49 193 -177 371 39 77 -93 -86 -172 -251 187 33 369 41 308
2948C08n07L31k31K5K15j56k42R5j06K46j05K47K81n36J00J54l15p5J91J89M1
$$ 308 -199 132 -99 -74 141 -15 -257 -162 -268 -22 -127 120 401 -135 -35 119 -196 -271 -80 109 150
2969A50m75M5N84j44k1j89j89M35J2n11N44J80k51l82L08k52oM17J59k93l38K32
$$ 150 -325 -280 304 160 139 -50 -239 196 208 -303 241 421 170 -212 96 -156 -162 255 414 121 -217 15
2991A5K33j80k94J81q25P95L08n45j75M34j22K13l71L81k84J10J00P71q21M07
$$ 15 248 68 -226 -45 -870 -75 233 -312 -487 -53 -175 38 -333 48 -236 -126 -26 745 -76 331
3011C31k7J7m58M00m63n4J30J55k16J6K410k235m80N40k06pJ21J16R77r64l16
$$ 331 304 321 -137 263 -200 -254 -124 31 -185 -169 2241 6 -474 66 -140 -147 -26 90 1067 103 -213
3032b13M3K96n86O30o21J59N40j092N94L70M44Q7p78r3R08j60j057Q65N10j202
$$ -213 -170 126 -460 170 -451 -292 248 -844 -250 120 564 651 -127 -220 688 528 -529 336 846 -356
3052c56P28Qj21n34J74j8L17P1K08l00l64J69K34J13l02N28m63O50r6l65m89Q92
$$ -356 372 380 259 -275 -101 -119 198 269 477 177 -187 -18 216 329 27 555 92 742 646 281 -208 684
3074F84j229n6K28L99j256O38M23q35R10M40l85k10R9j56N71n99M81l29j40J38
$$ 684 -545 -601 -373 26 -1230 -592 -169 -1004 -94 346 -39 -249 -150 -306 265 -334 147 -182 -322 -184
3094a84l07L46L71n10L47m27M92J33j35n68M44l72L07p4M11l98J11l13K32Q9j95
$$ -184 -491 -145 226 -284 63 -364 128 261 126 -442 2 -370 -63 -137 274 -124 -13 -326 -94 -5 -200
3115b00J30K0M65p93L57k28M49o3L72l97l13n2K70K08J34m13r2J80J02n6J89P4
$$ -200 -70 -50 415 -378 -21 -249 200 137 509 112 -201 -253 17 225 359 -54 -146 34 136 80 269 343
3137C43k84K17m09L10J11k16O9j25O58l42j95j76J00K06k61k22N30n44L90L89
$$ 343 59 276 -133 177 288 72 141 16 674 332 137 -39 61 267 6 -216 314 -230 160 549
3157E49q2%m66K13j49l44J54L74l73Q61m14p81P90m62K74k09p94J038J59L84r35
$$ 549 467 467 1 214 65 -279 -125 249 -124 737 323 -458 332 -130 144 -65 -859 179 338 722 -213
3178b13M8L24p90O67k47n38P27R3k63M28o35P94j43J44l18n32Q86j22M46q98N48
$$ -213 -165 159 -631 36 -211 -749 -22 71 -192 236 -399 395 252 396 78 -454 432 310 756 -142 406
3199D06o11O66J86j22n48j23Q23j257N6P25L18l79J98J35m24J74M03q03N66r91
$$ 406 -205 461 647 525 -23 -146 677 -580 -524 201 519 140 338 473 49 223 626 -177 389 -602
3219f02L45j72Q28l16k05k57K12Q43j525J149p62O51o49R11Q4N1o74L25j56o98
$$ -602 -257 -429 399 83 -122 -379 -167 676 -849 300 -462 189 -460 451 535 586 -88 237 81 -617
3239f17O02l74L88j65M39n03M76k94r5l42l2O89nj32M49l21M0J83l29L10o63K39
$$ -617 -15 -389 -1 -166 273 -230 246 -48 -143 -485 -517 172 167 35 484 163 203 386 57 367 -296 -57
3261e7K86m82L68K10j13N6J9p7l78M78m6J48J1j81k61p1O09n32K16K20n01J17
$$ -57 229 -253 115 325 212 268 287 210 -168 310 264 412 423 242 -19 -90 519 -13 203 423 -78 39
3283C9N04p03Q3M04k41Op1K56J27k22R3L6k83j93K44R9j50k22J96K18l64K88j93
$$ 39 543 -160 -77 327 86 92 21 277 404 182 275 311 28 -165 79 178 28 -194 2 220 -144 144 -49
3306d9j09N02j78j04j25k52L1N22j75L21k86k59L76l09k05L01O1j97K94j59q3
$$ -49 -158 344 166 62 -63 -315 -284 238 63 384 98 -161 215 -94 -299 2 63 -134 160 1 -82
3327h2J4R2lRn4j89PK78m46L31J85k08n18J62K87L6Q5l2j99O13j08k54R7o0n9
$$ -82 -68 24 21 30 -24 -213 -206 72 -374 -43 142 -66 -584 -422 -135 -99 -14 -46 -245 368 260 6 103 43 -16
3352a6j54K16jj04j5J06Q9K9j19j11K89m10L26j17k76K43k0K52l66N23m26J0K64
$$ -16 -170 46 45 -59 -74 32 121 150 31 -80 209 -201 125 8 -268 -25 -45 207 -159 364 -62 -52 212
3375B12m40N07l24L5o4J82k14k0M2R7P6k17J42l9j18j9L80m64J72M55m22P1q1
$$ 212 -228 279 -45 -10 -74 108 -106 -126 -84 13 89 -128 14 -25 -143 -162 218 -246 -74 381 -41 30 -51
3398e1OJ30N6p9p1oJ3r6K83k8j56o9oMK34j97K26j17j6j68l24N08O8K83l47k47
$$ -51 -45 85 141 62 -9 -15 -2 -98 185 157 1 -68 -74 -70 164 -33 193 76 60 -108 -432 76 144 427 80 -167
3424a67j57L28l57N91j92o0l1j0K98r5l95L34k0N6k99N08n98J97j05J7k56N11
$$ -167 -324 4 -353 238 46 -14 -45 -55 243 148 -247 87 67 123 -176 332 -266 -69 -174 -157 -413 98
3446I8k54r3M40j65l93P8O82o62M29l47M72J38m52j71K38m73K06K73r7j3M33o19
$$ 98 -156 -249 191 26 -367 -289 393 -269 160 -187 285 423 -29 -200 38 -435 -229 44 -53 -66 367 -252
3468b52L20k24M50n58J80N29p28N04m76r7J20K7p8k99Q37J62k07O60p73J92n69
$$ -252 68 -156 294 -264 -84 445 -283 221 -255 -352 -232 -205 -283 -582 255 417 210 870 97 289 -280
3489b80n6N11j04L92m78N43m97J70q52J589j522l1J064j21P1k89j73J33K73m8
$$ -280 -336 175 71 463 -15 528 31 201 -651 938 -584 -615 449 328 399 110 -63 70 343 295
3509B95n54K76M64o49l17N64L49n88l30P33P7K54m52k08n05J001L24l25K35n32
$$ 295 -259 17 481 -168 -485 79 428 -160 -490 243 320 574 122 -86 -591 410 734 409 644 112
3529A12L51n20Q98j638J259l87K62o5k1j53N79r64o85J464j221J65M90k59K30
$$ 112 463 -57 841 -797 462 75 337 272 251 98 677 -287 -972 492 -729 -564 -74 -333 -103
3548a03k24o4K76k63r1N56o50k40J121l35J02L49m86n91R53q56P00K98j012R63
$$ -103 -327 -391 -115 -378 -469 87 -563 -803 318 -17 85 434 -52 -643 310 -546 154 452 -560 403
3568D03L26L0r50J88J70m6J108j34j686J001m67P5r9O1o97J220K48j287J033k51
$$ 403 729 759 -191 -3 167 121 1229 1095 -591 410 -57 18 -81 -20 -717 503 751 -536 497 246
3588B46m00K7R25K93j371J186p31j137J004K67o53R91r18L77N90r69P06n57Q77
$$ 246 -154 -127 798 1091 -280 906 175 -962 42 309 -344 647 -271 106 696 -273 433 -124 753
3607G53j084n63J390l89p88M26M12o23J148J65o00L10j059J604o59j45p44P20
$$ 753 -331 -894 496 107 -681 -255 157 -466 682 847 247 557 -502 1102 443 298 -446 274
3625B74N81j329Q4P4L17m19O20o4rm84O66k50j4o03O28k69O2J83J55M1l83pL62
$$ 274 855 -474 -390 -316 1 -418 202 138 129 -355 311 61 47 -556 72 -197 -135 48 203 244 -139 -146 216
3648B16p93P78k99K08M23p52O43l47k98o5N72l6k06q5J0n6J64j71J92k65R9K75
$$ 216 -577 201 -98 110 533 -219 424 77 -221 -286 286 250 44 -41 -31 -87 77 -94 98 -167 -68 207
3670B07n41J32Q00q28K21J98l16P1L89n54K10j41J65K98j64o5k16k1k7Q18j006
$$ 207 -334 -202 598 -230 -9 189 -127 -56 333 -221 -11 -152 13 311 147 82 -134 -155 -182 636 -370
3691c70M44J23k98J48K9P3p6J0M1r4L53M5p50M28m9k82P0K18j45J97n6N4k64K44
$$ -370 74 197 -101 47 76 149 73 83 124 30 383 428 -322 106 57 -225 -155 63 -82 115 59 113 -151 93
3715I3R9k70L4r9P3K4J87k51K87j84J26j65m3J26n8J90l71L72k05k7J59M4l03
$$ 93 192 -78 -44 -143 -70 -46 141 -110 177 -7 119 -46 -89 37 -21 169 -202 170 -35 -62 97 141 -162
3738a62K7L82l34J73N0J70n8m11K05j08j30K42K7R7J13k65J73n83M33j13J11L8
$$ -162 -135 247 -87 86 136 306 248 -163 42 -66 -196 46 73 170 283 18 191 -392 41 -72 39 77
3760G7k00J21j06K96j27j06J24o9J9Mmp1J6K04j50j18P6L21l05R3J33l33J41k52
$$ 77 -123 -2 -108 188 61 -45 79 10 29 33 29 -42 -26 178 28 -90 -14 307 2 95 228 -105 36 -216
3784b16j9K22K9j74L09j61kO2k8k4K05l20K17k10K24%l86J92J84K4Qk29L4L14
$$ -216 -235 -13 16 -158 151 -10 -12 50 22 -2 203 -117 100 -110 114 114 -272 -80 104 128 136 -93 -59 255
3808B55l50J61p3O3j58N7M6k47P8M59l73q2L02j44K21k49j26j18%L37k83J21K53
$$ 255 -95 66 -7 56 -102 -45 1 -246 -168 291 -82 -164 138 -6 215 -34 -160 -278 -278 59 -224 -103 150
3831A50l80PO1N5K85k45K64l01j95J17K18j38J15L33o0q1l80K39J24k47r2k06
$$ 150 -230 -223 -162 -107 178 -67 197 -104 -299 -182 36 -102 13 346 286 205 -175 64 188 -59 -151 -357
3853c57M93m38K11L45n05J55r8K13Q8m11p9N54m12L56j74J4k69M44l11O8J19J85
$$ -357 136 -302 -91 254 -251 -96 -194 19 107 -304 -383 171 -241 115 -59 -45 -314 130 -181 -113 6 191
3875A91m78P76o91p1L49j94N0l9j18J79J29J46o01N1O4M73J87l61l36O53l51L68
$$ 191 -287 489 -202 -273 76 -118 -68 -107 -225 -46 83 229 -372 -321 -257 216 403 42 -294 359 8 376
3897C76m04K1%m46M81J79n27J5K48j8L86J65j34o9q4J73k38l24P27j012J93L40
$$ 376 -28 -7 -7 -453 28 207 -320 -305 -57 -75 311 476 342 273 189 362 124 -200 527 -485 -292 48
3919D8l77M44j11O7k89N37l85R5n64O35o1N45q11L49K47o83k21M79p01P96r9l7
$$ 48 -329 115 4 71 -218 319 -66 29 -535 100 39 584 -227 122 369 -314 -535 -56 -757 39 -60 -97
3941i7o53Q50K7q0k1n9kN0m9N2L68o33M63p3r17Q97l42M74j14l15J11M13j97K19
$$ -97 -750 100 127 47 26 -33 -35 15 -34 18 386 -247 216 143 -774 123 -219 255 141 -174 -63 350 153 372
3965C72J41q67M40l15M45J09k55M01l52P1k92N26p74N34l49l36J78r7L07L66q7
$$ 372 513 -354 86 -229 216 325 70 471 119 190 -102 424 -350 184 -165 -501 -323 -420 -113 253 166
3986A66k26L22l29K87k53L38l47J74l50L37k45K34k31P3l01O92l17j17Q0l58N93
$$ 166 -60 262 -67 220 -33 305 -42 132 -218 119 -126 108 -123 -50 -351 341 24 -93 -13 -371 222
4007B22l20J95q9J8k4q0M0j31J4lJ36J92k72O7JK10k91J99k39L35PL7q3%M3k21
$$ 222 -98 97 8 26 2 -78 -38 -169 -155 -158 -22 170 -102 -35 -34 176 -115 84 -155 180 187 224 141 141 184 -37
4033c7O9o2k01L70J44k76J17k54K1J50rP6L5l21J14J62k54K67k6j92J78m2j18
$$ -37 32 -30 -231 139 283 7 124 -130 -109 41 32 108 143 -178 -64 98 -156 111 85 -107 71 29 -89
4056h9J37j14L21k2l79J66J36j66O2J04j22k83L60M6JO9j59k51L8J22j40L41j50
$$ -89 48 -66 255 233 -146 20 156 -10 52 156 34 -249 111 157 158 227 68 -183 -145 -23 -163 178 28
4079B8J49J61j87k36J18J20r8J84k35j02J80R9l1j48J78k46J86k32J32L9j72P6
$$ 28 177 338 151 -85 33 153 55 239 4 -98 82 181 150 2 180 -66 120 -112 20 59 -113 -37
4101c7J12J67l02Q4o8L3J45l0j92J36Pj29K5O6J01J87j44l6N6j84Q3j53M9k44
$$ -37 75 242 -60 24 -44 -11 134 104 -88 48 55 -74 -49 17 118 305 161 125 181 -3 80 -73 -24 -268
4125b68M72j58j35j22J61L06o2l42L5J9R5M3R8q6j19j22L01k97l2K99j2m4j86
$$ -268 204 46 -89 -211 -50 256 194 -148 -113 -94 1 44 142 56 -63 -185 116 -181 -213 86 74 30 -156
4148a56L26l38kJ92k9L9P9Q5l02M4L3J62j87o3P6p3m5J16M5Q3M5l52M92j33j13
$$ -156 170 -168 -170 22 -7 32 111 196 -106 -62 -29 133 -54 -117 -41 -114 -159 -43 2 85 130 -222 270 137 24
4173B4K8l8R2N5l07J21K2O5N4l2n4L06l47N7J36k19kR7j54J29J22j0j59L14m7
$$ 24 52 14 106 161 -146 -25 -3 62 116 84 30 336 -11 46 182 -37 -39 58 -96 33 155 145 -14 300 253
4198B53J40k35j49p9K09k36j53J24J76N5l93R1P6N37l90j22OJ20m2j68K85j61
$$ 253 393 158 9 -70 139 -97 -250 -126 50 105 -288 -197 -121 416 26 -96 -90 30 -12 -180 105 -56
4220e6j02M87o93N07J69q51Q41j095N48Q54r53L41m56L11m52M79k55k08J080q81
$$ -56 -158 329 -364 143 312 -539 302 -793 -245 609 -344 -3 -459 -148 -600 -121 -376 -584 496 -385
4240c85M9Q35n85M51k41n65M61N98l74j13J93l31M69p10O70M6n24J33j32j18L91
$$ -385 -336 499 -86 365 124 -441 20 618 244 131 324 -7 462 -248 422 468 -56 77 -55 -173 218
4261B18o82m8L18M41l3P42j021M95j02J67Pm29P7J73q35O28q78R97M71j067O51
$$ 218 -464 -512 -194 247 214 956 -65 430 328 495 502 73 150 323 -512 116 -762 235 706 -361 290
4282B90R7k91o43J91J034l85o23M98N2n09K51M2K2L36o13K40p19J534q17n5L7
$$ 290 387 96 -547 -356 678 293 -330 168 220 -289 -38 4 26 362 -251 -11 -730 804 -13 -68 -31
4303c1j27n0j9O73m86M27p15M87k4n16M63L62k51o46J08J81J21M06m82K49k76
$$ -31 -158 -208 -227 446 -40 387 -328 159 135 -381 82 444 193 -453 -345 -164 -43 363 -119 130 -146
4324a46L62l21j07K80j58J14l60N27k41j76J01J64k38L02l64L98o5K01n12J46
$$ -146 216 -105 -212 68 -90 24 -336 191 -50 -226 -125 39 -199 103 -261 137 72 273 -239 -93
4344i3J25k32L7M55r25N13K1K63p67J273j167N25J17n02L07k82l31Q42n48o4P02
$$ -93 32 -200 -163 292 -633 -120 -99 164 -603 670 -497 28 145 -357 -50 -332 -663 179 -369 -433 269
4365B69r29N38M21l31k14K12J45Ok13m63M98k31L72o35R90Q5o74N05j251J152
$$ 269 -660 -122 299 -32 -246 -34 111 117 -96 -559 -61 -292 80 -555 435 520 -154 351 -900 252
4385B52J3q60J029M77q81L72p63J87j5K52N8k18J31J4J66j86j01l0J65n4p6l7
$$ 252 265 -595 434 911 30 402 -361 -174 -189 63 121 -97 34 48 214 28 -73 -103 62 8 -68 -105
4407a05J78P1k0k12J47P4m38M65k52J21j75M2moK17n1J59o9k89oQ7K83l16J76
$$ -105 73 144 124 -88 59 133 -305 160 -92 29 -146 -104 -108 -114 103 52 211 142 -147 -153 -66 217 -99 77
4431G7m8K7j11K36j22R4n5j5p3p6O1J47j09Ko0r1J0J63j91j24oL27j37n9K43k53
$$ 77 29 56 -55 181 59 153 98 83 10 -66 -5 142 33 35 -25 -116 -106 57 -134 -258 -264 63 -74 -133 110 -143
4457a43J02o6n5K04j07N8P2K8J6l14j55P3K63L1m2l03K15J22K36j67r8L3p7J53
$$ -143 -41 -107 -162 42 -65 -7 65 93 109 -205 -360 -287 -24 7 -35 -338 -123 -1 235 68 -30 3 -74 79
4481G9P9J00r8j44K34Q7k99J49j69l2j12K45k06k34K36K20m10J32K45Q6j6n5L63
$$ 79 158 258 160 16 250 337 38 187 18 -14 -126 119 -87 -321 -85 135 -275 -143 102 188 172 117 480
4504D80l42m8l4L03m28l11L11N23l05k6m09J3K5M58j9O1J2R1n8l92J30j38J86
$$ 480 138 90 56 359 -69 -380 -69 454 149 123 -286 -273 -248 210 191 252 264 355 297 -95 35 -103 83
4527H3K06n50M21j83J75k1l49o9K14P69j059O7K32J77K25jp68Q7L75j18J76k25
$$ 83 289 -261 160 -23 152 131 -218 -287 -73 696 -363 -296 -64 113 338 337 -431 -344 31 -87 89 -136
4549a36J93q2L27l70j32l4N5P9L31k73J89n54k51L11R3q6M85R1J08n58K86j76
$$ -136 57 -25 302 -68 -200 -234 -179 -100 231 -42 147 -407 -658 -347 -254 -340 145 236 344 -214 72 -104
4571a04j32j56Q43o78j75K70P63m81K13k9o64k91l21J165J8n62N86j27l92k15
$$ -104 -236 -392 451 -227 -402 -132 631 150 363 334 -330 -621 -942 223 241 -321 265 138 -254 -469
4591d69O38M32m10l79L8L2l85j28Q50k68L29p1m63j1k18P43n40O67q22K88M8K85
$$ -469 169 601 191 -188 -150 -118 -503 -631 219 -49 280 209 -254 -265 -483 260 -280 387 -435 -147 -99 186
4613A86k81m79Q83l44j86R32o91p4j78N20l86n67N01N00l94P7m9N81l39Qj40k95
$$ 186 -95 -574 309 -35 -221 711 20 -54 -232 288 -98 -665 -164 336 -58 19 -30 551 212 220 80 -215
4635b15rj50R4j42J11l23K51Q3k27N03j31K10k0n71J37K43k02n10Q29L24k97K28
$$ -215 -224 -374 -280 -422 -311 -634 -383 -300 -527 -24 -155 55 35 -536 -399 -156 -358 -868 -39 285 -12 216
4657B16j85K16m76K41O16j873J049N04r04N30o4N88L27j515Q41l60r7K14n73N82
$$ 216 31 247 -229 12 628 -1245 -196 308 -596 -66 -130 458 785 -730 111 -249 -346 -132 -705 -123
4677a23O82m50p45L70L26m55N26o24J309j004K79n71Q14r28Q43n90M14O75j211
$$ -123 559 109 -636 -266 60 -395 131 -493 816 -188 91 -480 334 -594 249 -341 73 748 -463
4696d63L28j89p6O63l58J69k43J28o48P12n29Q95m63n37K84K75k23L81M53r96
$$ -463 -135 -324 -400 263 -95 74 -169 -41 -689 23 -506 389 -74 -611 -327 -52 -275 106 559 -437
4716d37N58q6K24p63R30p58O61n85m7J84L66j561J510kjj24L77m58j12J22n33
$$ -437 121 35 259 -504 426 -332 329 -256 -303 -119 247 -1314 196 194 193 69 446 -12 -124 -2 -535
4737e35J011r17M67l4l8J30k26k21N38m4N4l27j53Q40l66K9o7j7N62n93M02o98
$$ -535 476 -441 26 -8 -46 84 -142 -363 175 131 185 -142 -295 545 179 208 141 124 686 93 495 -203
4759b03K00k62N91K7m00M4j50l03J33M48k63L93j37L7l14o8P76q60J73k37j19
$$ -203 -3 -265 326 353 -47 -3 -153 -456 -323 125 -138 255 118 155 -159 -227 549 -311 -138 -375 -494
4780d94L41Q2n57M31J60j61L14O6p08N50o27N68j28l07Q31p63l97P23M38Q1j046
$$ -494 -153 -71 -628 -197 -37 -198 116 182 -526 24 -603 -35 -163 -470 361 -402 -799 -76 362 443 -603
4801f03J91O57l48N14p65L74L00m70j79M71n27j79K47k88O56l31l22J009J00r70
$$ -603 -412 245 -103 411 -354 20 320 -150 -329 142 -385 -564 -317 -605 51 -280 -602 407 507 -463
4821d63M46M71j037P81j45q68R01p43K35M93l82J4K42l63k17P29O03m47p29O97
$$ -463 -17 454 -583 198 53 -815 86 -657 -422 71 -311 -297 -55 -418 -635 94 697 250 -479 218
4841B18l30L61n35J67K88p66Q18K6o08M73n48O13n8k70N43l4m28M47p33O24o37
$$ 218 -112 249 -286 -119 169 -597 221 247 -361 112 -436 177 119 -151 392 358 -70 377 -356 268 -369
4862c69Q19j057K73L25J16K8N2j169J396K3q16R05m00l40K86n70P22N61p02n79
$$ -369 450 -607 -334 -9 107 135 187 -982 414 437 -379 526 126 -214 72 -498 224 785 83 -496
4882d96Q66K98l28n06L21o88J65N50M3p96K10J36l11j32N89J90l73M83l0q28O70
$$ -496 370 668 340 -166 155 -533 -368 182 225 -571 -361 -225 -536 -668 -79 111 -262 221 191 -637 33
4903C3Q2p11N46M86m34l51L7m98N50m7L65m32P10k26p72J048q31J663j760Q39
$$ 33 115 -596 -50 436 2 -349 -312 -810 -260 -307 58 -374 336 110 -662 386 -445 1218 -542 297
4923B97k33q52O13j076Q72J56J40N70j50K90o48r5N41r81L67q3k48P02j62k96
$$ 297 64 -788 -175 -1251 -379 -223 -83 487 337 627 -21 -116 425 -556 -189 -272 -520 182 20 -276
4943b76J2j25J88l49K41J10O0j05J014j023P30q00J8O08q35K0M24J40M52n79j14
$$ -276 -264 -389 -201 -550 -309 -199 -139 -244 770 -253 477 -323 -305 303 -532 -512 -88 52 504 -75 -189
4964a89M79q51L28j40J44j11k86M40O35q39K15N99m18m7J51j70o7j6R5j31J88
$$ -189 290 -561 -233 -373 -229 -340 -626 -186 449 -390 -175 424 6 -41 110 -60 -127 -143 -48 -179 9
4985IM50o39K49j02L3o76P22l04R00m04m32L98K09k18l01m5M05J47o20N80k93
$$ 9 459 -180 69 -33 0 -676 46 -258 642 238 -194 204 413 195 -106 -151 254 401 -219 361 68
5006F8m06M11k86K44L47m68K40J3L89o19Q7L66p63J26k36O92m64J08l22L60O2
$$ 68 -338 73 -213 31 378 -90 150 163 552 -67 20 386 -377 -251 -487 205 -259 -151 -473 -113 -51
5027e1J58l84K35n45L10P82n97l3L48l99Q1P5n3m27N02J72K90j046J01R66r60
$$ -51 107 -277 -42 -587 -277 505 -92 -125 223 -176 -95 -20 -73 -500 2 174 464 -582 -481 485 -475
5048d75j71J81J60l19N35j96l96K31K61l51Q46j48k52J38J72L0p3O63j123m00
$$ -475 -646 -465 -305 -624 -89 -285 -681 -450 -189 -540 306 158 -94 44 216 246 173 836 -287 -687
5068f87oJ064l15l3R9k5k66k75L76M76o71J37J05j13Q11j53q17L95m6k47j29K97
$$ -687 -693 371 56 23 122 97 -169 -444 -68 408 -263 -126 -21 -134 677 524 -293 102 56 -191 -320 -23
5090b3K16L70m37l96K58j67j84M11J29l63j00K24k04K85K95o98N45Q8l72l4J51
$$ -23 193 563 126 -270 -12 -179 -363 48 177 -186 -286 -62 -266 19 314 -384 161 249 -123 -157 -6
5111fO4J35k82M69l36l93K95K64p37O89K47m59O97j011M02L18r09K01L13L66J00
$$ -6 58 193 -89 380 44 -349 -54 210 -527 162 409 -50 647 -364 38 356 -553 -352 -39 327 427
5132D27m77m36K88R4l81L67J04R7k58k3j4J43K52l87N85q57J161m41p0k59K03
$$ 427 -50 -486 -198 -104 -485 -118 -14 83 -175 -198 -212 -69 183 -204 381 -476 685 244 174 -85 118
5153A18K39k65l48J9K32j70K49j19k12O97m69J89j11k43k58Q44m44j38J40K87
$$ 118 357 92 -256 -237 -5 -175 74 -45 -257 440 -29 160 49 -194 -452 392 -52 -190 -50 237
5173B37m54K86j38k6j90p5K8M90l1km41p2P13l48p9J95k52K78J5J53n68j59O31
$$ 237 -217 69 -69 -95 -285 -360 -332 158 127 125 -316 -388 325 -23 -102 93 -159 119 134 287 -281 -440 191
5196A91m60N69L15q89L13K9JK90R5l20J84J78k5l19j37J8k76J34M8N56j006N89
$$ 191 -269 300 615 -274 39 68 69 359 454 134 318 496 471 152 15 33 -243 -109 -61 495 -511 78
5218G8l02m5L34lk23l93O04J28n30P35l04j77L02k79J67l94N19l51l44R0L9O12
$$ 78 -224 -269 65 62 -161 -554 50 178 -352 383 79 -98 204 -75 92 -302 217 -134 -478 -388 -349 263
5240B63m83L19J82l8m04L54K88q24M41P9n46K51K26k86O2J47j86N56n46k41K71
$$ 263 -220 99 281 243 -161 193 481 -343 98 177 -369 -118 108 -178 -116 31 -155 401 -145 -386 -115
5261a15K10l06J57K35n93L32L46l51k72M29j07K43j40k02L89l99j1K06lj6j82
$$ -115 95 -211 -54 181 -412 -80 266 -85 -357 72 -35 208 68 -134 255 -144 -155 51 48 32 -150
5282a50L79k89k0j16L43K31n26k80P41m12l0L03j51m22J36r7L97J96n21O66m99
$$ -150 229 -60 -80 -196 147 378 -148 -428 313 -99 -129 174 23 -399 -263 -360 37 233 -288 378 -121
5303a21%r3N38R9p91O64p12N35L6o43K28K21L65N6p33M16P22r60J1P54q26j54
$$ -121 -121 -214 324 423 -368 296 -416 119 155 -488 -260 -39 326 382 -351 65 787 -173 -162 592 -234 -388
5325c88m5K46L37j0l11J39p46P02L51n07N23l95j05K12M57p02N65p9J13L19j057
$$ -388 -433 -187 150 140 -171 -32 -778 -76 275 -232 291 -104 -209 3 460 -242 323 244 357 676 -381
5346c81J17O64m71K01n38O67l4p19N75k2l15k73M42p7R12j547J107l48l74R20
$$ -381 -264 400 -71 130 -408 259 225 -494 81 59 -256 -529 -87 -164 748 -799 308 -40 -414 506
5366E06j144O19j50P02l04o62J025n61l20K85l30K39q00J232p44M29L01r56O99
$$ 506 -638 -19 -169 533 229 -433 592 31 -289 -4 -334 -95 -895 337 -407 22 323 -633 66
5385F6K13m22m01N49r6K6J62J34j07P15l46m18L90q69M55K29j73o82J56J62R15
$$ 66 279 -143 -544 5 -91 -65 97 231 124 839 493 75 465 -404 51 280 107 -575 -419 -257 658
5406F58k24n88KN56m79o86M22J93J93M16j98j34K0P3j16j56K99j09J02p63N42
$$ 658 434 -154 -152 404 -75 -761 -339 -146 47 463 265 131 151 224 108 -48 251 142 244 -519 23
5427B3JJ66J42l73J45m37J78l79O69m07O82kr90M63J34o85L94N88p62Q03M05p50
$$ 23 24 190 332 -41 104 -333 -155 -534 135 -272 410 408 -582 -119 15 -670 -276 312 -450 353 758 8
5449HK17n42j36j53J514j434O16j95l93j43M12L74j25n74Q20n84K13n1Q32r90
$$ 8 225 -317 -453 -606 908 -526 90 -105 -498 -641 -229 145 20 -554 266 -318 -105 -156 676 -314
5469c14m75NR85K24j410J049o10J424r78K02o99Q82K92n40j19N04m44M06L28p36
$$ -314 -789 -784 201 425 -985 64 -546 878 -100 102 -597 285 577 37 -82 422 -22 384 712 -24
5489b4n25N64l9j05J94L45J50l53K34n2j019R08o5k74l75j65O45n53O54r3L18
$$ -24 -549 15 -24 -129 65 410 560 207 441 389 -630 278 213 -61 -436 -601 44 -509 145 52 370
5510C70j76n0p11J098o80o8n61J63O41l38K88L52k30l57o81P13K77q15J174k31
$$ 370 194 144 -567 531 -149 -217 -778 -615 26 -312 -24 328 98 -259 -940 -227 50 -765 409 178
5530A78j58J7o41M79L58L51J16m03q90L79N74o71J12N6M91r8J06n77Q39q32K82
$$ 178 20 37 -604 -125 233 584 700 297 -593 -214 360 -311 -199 -143 348 250 356 -221 618 -214 68
5551F8k21l39M03n55N71Q27m64L74j37m41k79O70k97l09K41Q6j76L11m41k70k59
$$ 68 -153 -492 -89 -644 -73 754 290 664 527 86 -193 477 180 -129 112 198 22 333 -108 -378 -637
5572f37J321n13J63M85o85k04j8Q49l58o37M72q4K12j29o3n2p3j55M33j176J379
$$ -637 684 171 334 819 134 -70 -88 761 403 -234 238 154 366 237 174 122 49 -106 327 -849 530
5593E30m78r44K272j578k17K00N09k68j84n52J005n12J92n73K63J61J57j83J104
$$ 530 52 -892 1380 -198 -415 -215 294 26 -158 -710 295 -217 -25 -598 -335 -174 -17 -200 904
5612I04p02p11n2J012o33N10r62J081j20m68N67j297M17N42N21M7j122O98Po37
$$ 904 202 -509 -561 451 -182 328 -634 447 327 -141 426 -871 -454 88 609 656 -466 232 239 -398
5632c98M87M9K63k29ol50L99k07O1R2o9m2k51M5K59l8K96l51o72M55L99j25j55
$$ -398 89 138 401 172 166 -184 215 8 69 161 92 50 -201 -156 103 65 361 10 -662 -207 192 67 -88
5655h8J75k59n74N53L46m11K17m27o0L17K70l19j21N05m60J82K53j94K62N59o22
$$ -88 87 -172 -746 -193 153 -258 -41 -468 -528 -211 59 -260 -381 124 -336 -154 99 -95 167 726 104
5676A04n82N79Q5k0N88j689Q96K09m05J201n81p33n27O97k31j42R37k14N6J24
$$ 104 -478 101 186 166 754 -935 -39 170 -235 966 385 -348 -875 -178 -409 -551 386 172 228 352
5696C52m05J97o82J71J275n25mk90L84m7J95P0m63n17N70j519M37J268j003L07
$$ 352 -53 144 -538 -367 908 383 379 89 473 426 621 691 228 -289 281 -1238 -801 467 -536 -229
5716b29k44O50j61L59m74n18L09K73J72Rq9j8O8k25o91R05K64n65Q94j078k51
$$ -229 -473 177 16 375 -99 -617 -308 -35 137 146 57 39 107 -118 -809 96 360 -205 689 -389 -640
5737f40J30P55l93K4j32J5M03q1k18J59j15K89p46J07O19r0l80J95k5q89J113
$$ -640 -510 245 -148 -124 -256 -241 162 81 -137 22 -93 196 -550 -443 176 86 -294 -99 -124 -1013 100
5758A00l64P8J157l51k72m23K81n29O36M15k89n85J40p48Q41m82K41j66J24K07
$$ 100 -264 -186 971 620 348 -75 206 -323 313 728 439 -146 -6 -754 87 -395 -154 -320 -196 11
5778A1o69K58O1K63j3J87l00r1K76k50L25L87p36J109n25j183Q82L03l96L12l34
$$ 11 -658 -400 -339 -76 -89 98 -202 -293 -17 -267 58 445 -291 818 293 -890 -8 295 -101 211 -123
5799a23j73l2L88k67N8j97J19Q57j052J064k99o72M28J97K60j024M72k09N07l18
$$ -123 -296 -328 60 -207 -149 -346 -227 630 -422 642 343 -329 99 296 556 -468 4 -205 302 -16
5819a6n90L37J8N46o2n46M75l10n44J326j77o38Q14o36N8n90J74O43j60l01J40
$$ -16 -606 -269 -251 295 233 -313 162 -148 -692 634 457 -181 633 -3 55 -535 -361 282 122 -179 -39
$$ [...]
8191d52
##END NTUPLES=NMR FID
##END=
