##TITLE=1H_SR3-OMe-TFA
 CDcl3, 8 sc, 
 24.10.2019
##JCAMPDX= 6.0         $$ Bruker NMR JCAMP-DX V2.0
##DATA TYPE= NMR FID
##DATA CLASS= NTUPLES
##ORIGIN= UXNMR, Bruker Analytische Messtechnik GmbH
##OWNER= root
$$ XWIN-NMR		Version 3.5
$$ Thu Oct 24 14:40:01 2019 Russian Standard Time (UT+4h)  she@DPX200
##.OBSERVE FREQUENCY= 200.1315
##.OBSERVE NUCLEUS= ^1H
##.DELAY= (6, 6)
##.ACQUISITION MODE= SIMULTANEOUS
##.ACQUISITION SCHEME= undefined
##.AVERAGES= 8
##.DIGITISER RES= 18
##SPECTROMETER/DATA SYSTEM= spect
##.PULSE SEQUENCE= zg30
##.SOLVENT NAME= CDCl3
##.SHIFT REFERENCE= (INTERNAL, CDCl3, 0, 15.7039)
##AUDIT TRAIL= $$ (NUMBER, WHEN, WHO, WHERE, WHAT)
$$ ##TITLE= Audit trail, XWIN-NMR		Version 3.5
$$ ##JCAMPDX= 5.01
$$ ##ORIGIN= Bruker BioSpin GmbH
$$ ##OWNER= she
$$ F:/spectra/data/she/nmr/H-F/1/audita.txt
$$ ##AUDIT TRAIL=  $$ (NUMBER, WHEN, WHO, WHERE, WHAT)
(   1,<2019-10-24 14:38:57.87 +0400>,<she>,<DPX200>,
      <created by zg, POWCHK disabled, PULCHK disabled
       configuration hash MD5:
       00 E9 B6 7A A2 85 ED C7 34 08 36 98 17 FE 4E 26
       data hash MD5: 16K
       A8 8D EC D5 93 44 1B 27 04 1E 5A 98 31 ED 73 F0>)
$$ ##END=
$$ 
$$ hash MD5
$$ 98 F4 85 71 37 EC 26 58 9C 87 E1 D8 98 FF 7F 53
##$RELAX= 
##$RELAX= 
##$RELAX= 
##$RELAX= 
##$RELAX= 
##$RELAX= 
$$ Bruker specific parameters
$$ --------------------------
##$DU= <F:/spectra>
##$EXPNO= 1
##$NAME= <H-F>
##$PROCNO= 1
##$TYPE= <nmr>
##$USER= <she>
##$AMP= (0..31)
100 100 100 100 100 100 100 100 100 100 100 100 100 100 100 100 100 100 
100 100 100 100 100 100 100 100 100 100 100 100 100 100 
##$AQSEQ= 0
##$AQ_mod= 1
##$AUNM= <au_zg>
##$AUTOPOS= <>
##$BF1= 200.13
##$BF2= 200.13
##$BF3= 200.13
##$BF4= 200.13
##$BF5= 200.13
##$BF6= 200.13
##$BF7= 200.13
##$BF8= 200.13
##$BYTORDA= 1
##$CFDGTYP= 0
##$CFRGTYP= 5
##$CHEMSTR= <none>
##$CNST= (0..31)
1 1 145 1 1 1 1 1 1 1 1 1 1 1 1 1 1 1 1 1 1 1 1 1 1 1 1 1 1 1 1 1 
##$CPDPRG= <>
##$CPDPRG1= <>
##$CPDPRG2= <>
##$CPDPRG3= <>
##$CPDPRG4= <mlev>
##$CPDPRG5= <mlev>
##$CPDPRG6= <mlev>
##$CPDPRG7= <mlev>
##$CPDPRG8= <mlev>
##$CPDPRGB= <>
##$CPDPRGT= <>
##$D= (0..31)
0 1.2 0 0 0 0 0 0 0 0.06 0 0.03 0 0 0 0 0.0002 0 0 0 0 0 0 0 0 0 0 0 0 
0 0 0 
##$DATE= 1571913537
##$DBL= (0..7)
120 120 120 120 120 120 120 120 
##$DBP= (0..7)
150 150 150 150 150 150 150 150 
##$DBP07= 0
##$DBPNAM0= <>
##$DBPNAM1= <>
##$DBPNAM2= <>
##$DBPNAM3= <>
##$DBPNAM4= <>
##$DBPNAM5= <>
##$DBPNAM6= <>
##$DBPNAM7= <>
##$DBPOAL= (0..7)
0.5 0.5 0.5 0.5 0.5 0.5 0.5 0.5 
##$DBPOFFS= (0..7)
0 0 0 0 0 0 0 0 
##$DE= 6
##$DECBNUC= <off>
##$DECIM= 24
##$DECNUC= <off>
##$DECSTAT= 4
##$DIGMOD= 1
##$DIGTYP= 9
##$DL= (0..7)
0 120 120 120 120 120 120 120 
##$DP= (0..7)
150 150 150 150 150 150 150 150 
##$DP07= 0
##$DPNAME0= <>
##$DPNAME1= <>
##$DPNAME2= <>
##$DPNAME3= <>
##$DPNAME4= <>
##$DPNAME5= <>
##$DPNAME6= <>
##$DPNAME7= <>
##$DPOAL= (0..7)
0.5 0.5 0.5 0.5 0.5 0.5 0.5 0.5 
##$DPOFFS= (0..7)
0 0 0 0 0 0 0 0 
##$DQDMODE= 0
##$DR= 18
##$DS= 0
##$DSLIST= <SSSSSSSSSSSSSSS>
$$ [...]
##$SUBNAM2= <"">
##$SUBNAM3= <"">
##$SUBNAM4= <"">
##$SUBNAM5= <"">
##$SUBNAM6= <"">
##$SUBNAM7= <"">
##$SUBNAM8= <"">
##$SUBNAM9= <"">
##$SW= 24.0689530833862
##$SWIBOX= (0..15)
0 0 2 0 0 0 0 0 0 0 0 0 0 0 0 0 
##$SW_h= 4816.95568400771
##$TD= 16384
##$TD0= 1
##$TE= 0
##$TE2= 300
##$TE3= 300
##$TEG= 300
##$TL= (0..7)
0 120 120 120 120 120 120 120 
##$TP= (0..7)
150 150 150 150 150 150 150 150 
##$TP07= 0
##$TPNAME0= <>
##$TPNAME1= <>
##$TPNAME2= <>
##$TPNAME3= <>
##$TPNAME4= <>
##$TPNAME5= <>
##$TPNAME6= <>
##$TPNAME7= <>
##$TPOAL= (0..7)
0.5 0.5 0.5 0.5 0.5 0.5 0.5 0.5 
##$TPOFFS= (0..7)
0 0 0 0 0 0 0 0 
##$TUNHIN= 0
##$TUNHOUT= 0
##$TUNXOUT= 0
##$USERA1= <user>
##$USERA2= <user>
##$USERA3= <user>
##$USERA4= <user>
##$USERA5= <user>
##$V9= 5
##$VALIST= <valist>
##$VCLIST= <CCCCCCCCCCCCCCC>
##$VD= 0
##$VDLIST= <DDDDDDDDDDDDDDD>
##$VPLIST= <PPPPPPPPPPPPPPP>
##$VTLIST= <TTTTTTTTTTTTTTT>
##$WBST= 1024
##$WBSW= 4
##$XGAIN= (0..3)
0 0 0 0 
##$XL= 0
##$YL= 0
##$YMAX_a= 151725
##$YMIN_a= -133967
##$ZGOPTNS= <>
##$ZL1= 120
##$ZL2= 120
##$ZL3= 120
##$ZL4= 120
##$ABSF1= 10
##$ABSF2= 0
##$ABSG= 5
##$ABSL= 3
##$ALPHA= 0
##$AQORDER= 0
##$ASSFAC= 0
##$ASSFACI= 0
##$ASSFACX= 0
##$ASSWID= 0
##$AUNMP= <proc_1d>
##$AZFE= 0.1
##$AZFW= 0.1
##$BCFW= 1
##$BC_mod= 2
##$BYTORDP= 1
##$COROFFS= 0
##$CY= 11.3945322036743
##$DATMOD= 1
##$DC= 2
##$DFILT= <>
##$DTYPP= 0
##$F1P= 20.1720416913024
##$F2P= 0.152960286110954
##$FCOR= 0.5
##$FTSIZE= 0
##$FT_mod= 4
##$GAMMA= 1
##$GB= 0.15
##$INTBC= 1
##$INTSCL= 1
##$ISEN= 128
##$LB= 0.24
##$LEV0= 0
##$LPBIN= 0
##$MAXI= 10000
##$MC2= 0
##$MEAN= 0
##$ME_mod= 0
##$MI= 1.114404
##$NCOEF= 0
##$NC_proc= 0
##$NLEV= 6
##$NOISF1= 3.799351
##$NOISF2= 2.8
##$NSP= 1
##$NTH_PI= 0
##$NZP= 0
##$OFFSET= 15.70392
##$PC= 1
##$PHC0= -9570.255
##$PHC1= 15.00082
##$PH_mod= 1
##$PKNL= yes
##$PPARMOD= 0
##$PSCAL= 0
##$PSIGN= 0
##$REVERSE= no
##$SF= 200.130013532006
##$SI= 16384
##$SIGF1= 3
##$SIGF2= 2
##$SINO= 400
##$SIOLD= 16384
##$SREGLST= <1H.CDCl3>
##$SSB= 0
##$STSI= 0
##$STSR= 0
##$SW_p= 3612.71676300578
##$SYMM= 0
##$S_DEV= 0
##$TDeff= 0
##$TDoff= 0
##$TI= <>
##$TILT= no
##$TM1= 0
##$TM2= 0
##$TOPLEV= 0
##$USERP1= <user>
##$USERP2= <user>
##$USERP3= <user>
##$USERP4= <user>
##$USERP5= <user>
##$WDW= 1
##$XDIM= 8192
##$YMAX_p= 0
##$YMIN_p= 0
$$ End of Bruker specific parameters
$$ ---------------------------------
##NTUPLES= NMR FID
##VAR_NAME=  TIME,          FID/REAL,        FID/IMAG
##SYMBOL=    X,             R,               I
##VAR_TYPE=  INDEPENDENT,   DEPENDENT,       DEPENDENT
##VAR_FORM=  AFFN,          ASDF,            ASDF
##VAR_DIM=   8192,          8192,            8192
##UNITS=     SECONDS,       ARBITRARY UNITS, ARBITRARY UNITS
##FACTOR=    0.0002076,     1,               1
##FIRST=     0,             0,               0
##LAST=      1.7004516,     0,               0
##MIN=       0,             -133967,         0
##MAX=       1.7004516,     151725,          0
$$ Real data points
##PAGE= N=1
##DATA TABLE= (X++(R..R)), XYDATA
0@%%%%%%%qJ6j6J6k4L2l2M0n6O4p2Q8j04J24j48J71j97K26k59K98l38L83m32M87
31B59n50O17o92P75q64R62j070J187j317J459j614J787j979K192k430K697l001
48a582L349l750M222m784N464o311P401q867J0951j4172J9888l3085J20509N2492
62A51725j68620k9047l1312j08O2358J30833K7336o6630q1800m5654l5927M1394
74d5452J05501O8230l6574o4234n7392m8914l41R0169Q9742O432m4034m4230o9594
87e0691n7709M1639J13120N9282j0710k8539o6152j08011k6196J13665J17505
98I7203M450m8030l6159n8753o0805K9138J05809O9549q791n1997q3389p8237
110a20012J2404J04539Q7467J2631k9170n8675q6331m1812N7386Q8048L8349Q3
$$ y = [0, 0, 0, 0, 0, 0, 0, 0, -8, 8, -8, 8, -16, 16, -16, 24, -32, 32, -40, 48, -56, 68, -80, 91, -106, 120, -139, 159, -179, 204, -228, 259, -291, 326, -366, 409, -455, 507, -563, 624, -693, 766, -848, 939, -1040, 1152, -1278, 1419, -1582, 1767, -1983, 2239, -2545, 2919, -3392, 4009, -4858, 6093, -8079, 11809, -21276, 99233, 151725, -16895, -45942, -77254, -77362, -15004, 115829, 143165, 76535, -5265, -50919, -86846, -45452, 60049, 128279, 91705, 27471, -29921, -78835, -79176, 10993, 100735, 107167, 63133, 18903, -50691, -108400, -66761, 46359, 105641, 94931, 66392, 240, -107771, -133967, -20302, 97203, 101653, 53623, 17464, -41289, -102094, -72956, 32853, 102402, 93611, 41614, -41775, -120012, -107608, -3069, 84398, 97029, 67859, 9184, -77147, -118959, -61573, 26475, 64824, 64907]
122F4907k1059o5204p1761O514P3400N4021J7341K875m1713q8702m1367N8407
134e2341P6492K7194M811q816o0421q1356j3466O2190P1737M7405J0483n4306
146B9606r4788m5037L7832O5133M8287K8616j6475p5284p0529L129N9273O1005
158C0768M0403j556o3376q3728k8472L8742N9989N6067L2416k9081q3212n9399
170i0439J0701M4959M3443L9282J4197m1917o9211l2952K0565M5421M8234K9385
182F1668k0829o3016n1356m316L3283N1430N0349J1985m6932p0703m1247P558
194h2126M8932O6627M0940j9675o1825n4718j8532K2810N5925N6948Q150n0840
206A2616o2125k8500J3298M4816N6039L1410k3168o1307n4239j2584L1592N6473
$$ y = [64907, 43848, -21356, -93117, -86603, -13203, 40818, 58159, 61034, 19321, -69381, -110748, -52341, 24151, 51345, 56156, 47340, -13081, -94437, -107903, -45713, 26024, 73429, 83912, 29606, -65182, -110219, -72387, -7254, 41033, 69649, 53174, -22110, -92639, -89510, -30237, 30768, 71171, 69615, 6239, -77489, -105961, -67219, -7230, 48837, 81253, 52172, -31040, -90439, -79738, -34779, 8664, 47946, 62143, 20226, -48985, -81937, -61372, -15951, 32283, 61668, 40839, -22177, -73533, -77849, -44566, 6864, 57213, 69198, 22266, -48437, -89684, -82126, -33194, 33433, 74373, 54698, -7127, -61845, -80377, -57567, -1642, 55306, 63456, 12616, -49509, -78009, -64711, -19895, 36144, 67554, 44386, -16921, -71160, -83744, -52152, 4321]
218D321M8308Q299l6401n5919l9943P14M0021N2333L1024r614m2768m8584k2325
231g0534K0824M8922M3058R979k8483n1747m2143j919M2622N9186L5911j0054
243E5622m9442n7725k6906K0728N1259N0385J8650k5383n3516m3801j375L6641
255b4863M7016L1223m792m2950n1910j9019K6027M6304L9090J4356k3853n2205
267a5576m1832j551L3383M4849L6585N398l6379n2804k7616J1388L6493M3143
279C5481K5256j6443m7275l9389m691K5781M1829L8731M175m1367n3280k4448
291e5640J3261M0134M9875K8053k2059n5169m2109n494K3829M1971M0296O196
303F3144l6339m5423k0119Q015K8593M1175K3062k0159m4230l1050m479J7935
$$ y = [4321, 52629, 60928, 24527, -31392, -71335, -70621, -30600, 21733, 52757, 43143, 375, -48209, -70534, -49710, -788, 42270, 52249, 23766, -27981, -70124, -72043, -29421, 29765, 65676, 55622, 6180, -51545, -78451, -57723, -6464, 43921, 62571, 37188, -16328, -60129, -61504, -24863, 22153, 53376, 48584, 5634, -46276, -65295, -39268, 7036, 46126, 60482, 36629, -15576, -57408, -58959, -25576, 19273, 55858, 61256, 24877, -27927, -55543, -44155, -7662, 35481, 60737, 44294, -2981, -42370, -47061, -21280, 20549, 59280, 63455, 22088, -31192, -55640, -42379, -2245, 47630, 75683, 53624, -1545, -43654, -49148, -25319, 16652, 56948, 63144, 26805, -18618, -38737, -30722, -2129, 39046, 62108, 41949, -2281, -33331, -37810, -19875]
315a9875L8695L9162M796l4893m2105k4925k222K5825M7492L2763j0635l9108
327A4970l6584j9511Q081L9289M4123Q682l0062l9657k6553k791K9145M8380K7378
340F4890j7235m2765l8092j6528J5560M6667M3861M089l1574l8736k8133n339
352d3335K7749M3613K3112j2664k9720k8084j6634Q656L5388L1896L250k1888
364B1339k9380k6381p385K4872M1351K4826n543k6361l5179k7924L113L6048L9754
377C3150J5695j2379l2269l6467j4777K2485M1523K7104k684k7002l7305k4261
389d7187J0360M0146L7348Q701j9687l7205l4556p036K8510M1878K4354l593k5709
402A6324l4842k2870P381L0332K8739J0223j0040k5818k6684p597J7914K9074
$$ y = [-19875, 18820, 57982, 62778, 27885, -14220, -39145, -41367, -15542, 31950, 64713, 54078, 14970, -21614, -41125, -33044, 6245, 50368, 59050, 28988, -10669, -37222, -40013, -10868, 37512, 64890, 47655, 4890, -33202, -49730, -34170, 12497, 56358, 60447, 28873, -9863, -37996, -43335, -15586, 28027, 51139, 38475, 8755, -19329, -35963, -27307, 8081, 39977, 43227, 21339, -8041, -34422, -41807, -16935, 24416, 49242, 43699, 17338, -17841, -45765, -42652, -6604, 33150, 48845, 36466, 4197, -32270, -47047, -24562, 16961, 44065, 41381, 14379, -22926, -47187, -36827, 3319, 40667, 49368, 29681, -7524, -42080, -49116, -20606, 21272, 45626, 42033, 16324, -18518, -41388, -34007, -3675, 25064, 35287, 25247, -571, -27255, -34852, -16938, 12136]
414A2136K0812J437j9809l0757k3015K616K6323L3259J9626n321k9382l5495j7537
427d5107J2298L2803L1838J0344j7858l5594k7999q95K6584L4723J8437r168l1711
440a305l3004j0265J9257L5426K7462J994k4973l5142k3701L107K7667L3148J6279
453C5950q348k5648k6895j2243R943K4626K2409N219j3337k3998j8987k327J8381
466a5255K6222J7060l026k1448k8342j8058O594K7731K9997J2281j0821k9275
478f340k9964r906J7978L2068K3666K147k1394l1585k0105Q569K9728K6976P353
491B9191j4696k9071k4400k714K3949L1580J7904m747k4028k9757j5858R393K5383
504g871K3899R669p734k2160k2544o266J4207K1911J5588K046j3807k2975j6140
$$ y = [12136, 32948, 34385, 14576, -16181, -39196, -36580, -10257, 23002, 42628, 37307, 7925, -27570, -45107, -32809, -6, 31832, 42176, 24318, -11276, -39275, -40170, -13586, 21137, 39574, 30406, -1305, -34309, -44574, -25317, 10109, 37571, 39565, 14592, -20550, -44251, -41144, -13477, 19671, 35950, 27602, 1954, -24941, -37184, -27241, -2615, 19794, 25013, 11676, -12322, -31309, -33636, -15255, 10967, 28027, 25001, 3553, -24789, -42847, -36253, -8522, 21475, 33756, 22935, -6340, -36304, -46210, -28232, 3836, 27502, 29649, 8255, -23330, -43435, -34866, -5138, 21838, 29191, 14495, -14576, -38976, -41690, -17741, 13839, 31743, 26996, 2968, -26789, -42647, -33254, -7871, 16028, 25697, 17963, -4197, -26741, -33007, -18800, 3111, 18699, 20745, 6938, -16037, -32177]
517c2177M538K0378K2243J3815n387k4027k8119j0072J4665K6318K3172Q222j4596
530A8973l0341k3226Q79K1217K7514J6482n607k4315k4821o998J3668K4079K0185
543B7689K937j9088k8512j6203O708K2834K4942J2694p743k3246k3307q123R095
556a9323K0476K0828P968j1493k2307j5953p35J3202J9830J4036j932j7876k1736
569a5015j0476P585K1549K1493P751j2468k4067k0744n403J5167K7914K0543r00
582C2929k1228k5160j4272P040K1674K0514O802j0145k0658j7925k717J5824K2867
595A5545J4136m278j9723k3296j0617R160K1809J9698O708p960k0141j9857n814
608b4630J2149J8728J4847M131j0708k1245j6062L019J8316J8812Q519o823j9924
$$ y = [-32177, -27639, -7261, 14982, 28797, 23410, -617, -28736, -38808, -24143, 2175, 25347, 33569, 18973, -11368, -34594, -33715, -12498, 15016, 31498, 25891, 1576, -23245, -30243, -16575, 7504, 27689, 30626, 11538, -16974, -33177, -26469, -3635, 21307, 34001, 26258, 3012, -20295, -28418, -19323, 1153, 21981, 29949, 18456, -3851, -19804, -20539, -7337, 12493, 26529, 24597, 6721, -15015, -25491, -17906, 3643, 25136, 32887, 20419, -3648, -24392, -29795, -14628, 13286, 33829, 32929, 11701, -13459, -27731, -20691, 983, 21497, 28299, 18154, -2504, -20429, -23146, -7322, 15545, 29681, 25403, 5680, -17616, -28233, -19073, 2736, 22434, 29142, 21182, 1041, -18816, -24630, -12481, 6247, 21094, 25225, 14517, -6728, -22790, -19771, -1455, 17357, 25876, 19053, -871]
621h71k0124l171J3597J9478J5480M573j3441k5543j8297L735J9815K1780J2741
634B9752n092k2058k0916k989J1728J4904J3080M562j1326k1228j1308N965J4079
647h47J5678J2020l347k2059k1376l333J1510J6248J6171P791j1503k1267j2754
660a7068k94P713J6082J8417J203j9220k0621n571P143J4516J8986P377j6263
673A2400k2659r124K999R647J8375J8191k924k2803j8981n957L840J4952K2338
686B0294Q380j5505j9663p009M07N096J4878J4050l819j6225j0730n029l44J2291
700b928K1761P814j4373j7915r949n427M911K1260J8186k837j4531j1714j0888
713a6630o370J2302K4322R169j1026j4777j1476q345P549K3781J5435q817j6632
$$ y = [-871, -20995, -24166, -10569, 8909, 24389, 28962, 15521, -10022, -28319, -24584, -4769, 17011, 29752, 24660, 2602, -18314, -21303, -9575, 5329, 18409, 22971, 11645, -9583, -20891, -14926, -847, 14831, 26851, 23504, 1445, -19931, -23264, -11754, 4494, 20665, 28456, 16953, -4314, -17068, -17362, -9649, 6433, 24850, 26053, 6833, -13788, -19359, -12216, 2300, 21286, 28663, 12400, -10259, -19383, -16384, -6737, 11638, 29829, 26905, 4102, -14879, -20836, -16996, -2044, 20294, 28674, 13169, -6494, -13503, -13096, -8000, 6878, 20928, 17109, 884, -9846, -14875, -15219, -2928, 18833, 26647, 12274, -5641, -15590, -21017, -16106, 5154, 23340, 20503, 5972, -5742, -16630, -23000, -10698, 13624, 22793, 11767, -3010, -14486, -22831, -15282, 8499, 23934, 15117, -1515]
726a515j0488q969j973J7378K2558M765j1517j2721j2856j0619P501K3161J1766
739A6471o060q691o848j1096l960J4488J5808J180o482n004j1302j2083O177K0995
753C593J1721j965n126j2008j9077n085J8268J9465M339j795n281j6705j6504
766b6160O475K0661J2045L39m509j4086j7892J311J9895J4807J491k934r244j8957
780a6758r849J3114J9494P835N04l293j3748j6593O75J4506R288L649L481m993
794G312j6659q304R443J1164L711M336J181j2695j6831m91J2018J1254R179N222
808A9840r821k1046r849O442J0743J0604J1987J81j8524j7746M11J0969R643R703
822A3537L841j2317j8530m435Q702J0325R715Q865o217j9692j2602M063R887Q128
$$ y = [-1515, -12003, -20972, -22945, -5567, 16991, 21756, 10239, -2482, -15338, -25957, -18456, 4705, 16471, 10411, 1720, -5128, -16224, -20184, -5696, 10112, 11292, 4810, -194, -11496, -23579, -17402, 3593, 15314, 13349, 8223, -3785, -22862, -27947, -9679, 9786, 14125, 12330, 7049, -9656, -26160, -19685, 976, 13021, 13360, 8851, -5235, -23127, -21816, -1921, 12886, 14377, 11443, 2199, -16758, -26607, -13493, 6001, 13836, 14340, 11047, -2701, -19294, -18619, -4113, 5175, 8824, 12305, 7312, -9347, -17651, -8208, 2956, 6667, 11003, 12184, -511, -17342, -17833, -5815, 5439, 14618, 19840, 10019, -11027, -20876, -14434, -3691, 6913, 18900, 19081, 557, -17189, -16778, -5809, 3834, 13537, 17378, 5061, -13469, -17904, -9202, 1123, 10838, 19703, 13486, -6206, -18808, -14745, -4858, 3270]
836C270J0102L850j0412j4796m969K916N149R188Q975k187j2404p770n69J805
850g852O768J2553N110j0677j4254n916R68O025J3981J1952k479j4556j2364n881
864a6622J297J2236J7189M592j1376j3749o755O11P296J3013Q337n551j3076r264
878a1822k779N518J3199J1512l50j0495j1116o566r98Q026J3237P509l697q339
892B839p498n377L6Q410J0074L042l613p388q367l848O676J2913P313k511q596
907D105j0416p322J645J1173J3194N661m220j2142j2549m361Q493J2875Q395l0
921A4501q082j1386o957M673J0583Q825K009n508j0253q638l26Q273J0306O313
935A4333n23p507j1498o883L037Q245Q822M919j639p849q612l622L236O866Q240
$$ y = [3270, 13372, 17222, 6810, -7986, -12955, -10039, -4890, 4298, 13273, 11086, -1318, -9088, -9657, -7852, -1084, 11469, 16579, 5902, -8352, -14268, -13300, -7275, 6706, 18658, 16179, 1623, -10741, -16622, -15325, -3089, 14100, 18692, 7316, -6433, -13188, -12577, -5281, 7732, 16069, 10518, -2558, -11822, -14601, -9083, 4116, 15628, 15278, 4783, -6333, -12899, -13897, -5871, 7366, 14875, 11178, 2839, -4659, -10036, -10000, -1590, 8484, 11526, 7913, 525, -7842, -11690, -5014, 7899, 15212, 12701, 4105, -6311, -13633, -11988, -815, 12379, 18040, 13820, 1678, -10871, -15232, -6739, 6136, 14531, 14501, 6419, -4967, -11924, -7251, 3332, 12157, 14166, 8658, -1595, -10233, -10559, -2286, 8020, 14333, 13810, 6303, -5195, -12078, -9041, -796, 8026, 12945, 11306, 3457, -5155, -8777, -5541, 1325, 9565]
950I565L321o488j0472o025J810P070R200O954l078j1647j0771k533M487R941
964A334J0932L291p385j2539p027L35O532R782O870k815r984p407j455L475P792
979A731P763Q35q203q625m225m04O252J0688O769l532r406o793m540L39P595J0624
995F868L613n407p184n733l166L846R404P582k699p937o938m493J721R925J0325
1010I727J530o600r159p192k762O690J2178O456k586o105o821o892L56R408Q868
1025G096J69m447m245n747l088N184J0138L931k835n013o442o064O46R107Q976
1040G366K768k216o278q992n048M631R186N962J276l332p986p460R61Q618P045
1055F501K214k416o438r185k978P803R778M476o13m471q959p645J925Q786P332
$$ y = [9565, 12886, 6398, -4074, -10099, -8289, -1219, 7981, 14935, 11857, 210, -10561, -13094, -8607, 1334, 12266, 15557, 8172, -4367, -11394, -11059, -4527, 5255, 12125, 9310, -674, -8081, -9536, -6061, 1731, 9494, 10329, 2126, -6499, -10724, -11128, -4876, 5812, 12581, 9049, -357, -7150, -11690, -11351, -3756, 6868, 10481, 5074, -2110, -7843, -11009, -7163, 2241, 9823, 7124, -813, -7751, -12244, -10523, -598, 9727, 11257, 4657, -4502, -11694, -14456, -7766, 4412, 10868, 8282, 2177, -4644, -11536, -11180, -1772, 7096, 7265, 2818, -1427, -7174, -10262, -5078, 5060, 8991, 6156, 1143, -5299, -11363, -10717, -1610, 7366, 10134, 7918, 1640, -7352, -12400, -7769, 1417, 7379, 8655, 5323, -2663, -10123, -9162, -544, 6501, 8715, 6299, -139, -9324, -12302, -4499, 5279, 9755, 9142, 4671, -4288, -11933, -10008, -1222, 6110]
1070F110K219r15n428q256k855M213O446L213J375k611o755m930J253N867N414
1085D360L639o97o180r119k748L713O246O810M391k693r752q093L53N029O238
1100A497N467J100o419q823k889M593O348N585J782m714q687n699K058O500O950
1115D649M425j583p418p204k419K662M998O238K792k624o032l994l04J820M462
1130D68M858L31m816n432k298J045M484O699L715k673p229o792j958L247P569
1145A218P134K009n104q593m686L37N817P139L547k592o747n506n45M305P186
1160D919M333j773o437n779k759K477O282O127K325l296n489m795j987K504N019
1175A671M945L31k691l930l394o96K948M457L445p27m247n138k816K259N766N881
$$ y = [6110, 8329, 7414, 1986, -6270, -9125, -4912, 1534, 4747, 6122, 3511, -3244, -8174, -6921, -1054, 4360, 7999, 7302, 1122, -7997, -10745, -7032, -786, 6024, 10415, 7722, -2030, -10123, -9770, -4741, 1497, 6964, 8064, 1645, -7178, -10067, -5474, 874, 6459, 8241, 3527, -5160, -10859, -8801, -2301, 4649, 9074, 7491, 73, -7131, -9550, -6888, -1890, 4348, 7140, 4516, -1516, -5510, -5814, -3994, 468, 5326, 5657, 841, -4591, -6889, -5844, -1360, 5339, 9054, 6381, -848, -7640, -9598, -6351, 1218, 8352, 10361, 5257, -3336, -8022, -7685, -1868, 5271, 8818, 6226, -521, -6027, -6572, -2267, 4919, 9252, 7479, 1042, -4737, -7496, -5019, 1263, 7390, 9715, 6419, 930, -3865, -5852, -3348, 1671, 6616, 6947, 4256, 326, -3068, -3764, -816, 3641, 7086, 6359, 2112, -3026, -5842, -3583, 2183, 8064]
1191H064K030l424p476n683j197M754P363N406o86o068o257l217K239N796N434
1206G078J070m335o379l844J985N193N525J657l181m832n248j079K392N274M786
1221F062R81k514n619l676l57K231L992L143M64k403l937k856K56K994M489K551
1237E801j852m931n131j428K859O656N419J95n387o750l831J097M945N863L017
1252F542j673n029n253k064L603O314L517j736m937m492j187K277M966L844Q97
1267E589k999m638l924o59K951M647L608L29k211m177l372m85K913M150K128k77
1283C573k379l962j527J082L376M184J796k972n385m896M19N019O293K821j611
1298E831m685n350k620K256M572M821J516k810n436l202J284L693L551J401j437
$$ y = [8064, 10094, 6670, -806, -6489, -7686, -2932, 4431, 9837, 9151, 3083, -3174, -6391, -4152, 1644, 7078, 8148, 3813, -2566, -6410, -4425, 768, 6293, 7950, 4769, -63, -5311, -6390, -3998, 1276, 6062, 7043, 4529, -1090, -4766, -5123, -2892, 1100, 4243, 4707, 2304, -1633, -4489, -4233, -1239, 3250, 5801, 3949, -982, -6113, -7541, -4682, 1974, 7393, 7588, 2201, -4549, -8380, -7283, -2338, 3525, 6542, 4869, -160, -5413, -7477, -3874, 2440, 5957, 4221, -716, -5208, -6395, -4118, 848, 4692, 5589, 2590, -2048, -5972, -6631, -3680, 967, 4575, 4904, 2693, -1484, -4856, -5341, -2428, 1722, 3850, 3573, 1194, -2768, -4295, -3213, 163, 4347, 6143, 3171, -2214, -7110, -6691, -1672, 4621, 7442, 5831, 1146, -4204, -6824, -4568, 4, 4825, 6341, 3531, -1905, -5107, -3823, -130, 3421, 4822, 3385]
1313C385l912l964k02K776L845L206J37k828m386k739j66K289L402M045O58l280
1329B266m704j847Q54K227L348J715j114l372k910j140J903M311M042l22n143
1344A14n142j349J323L672N292K418k959n055l652k89J930M105L513o09l398k827
1360b913j432J58K780M312R96l189l877j763q8J930M052K977k02k760l315k983
1376e317j289L447N144K526k366k159k352k768O16M094L402J3k419k737k807k03
1392e175M051N002Q87k279l385l142k588K224N809L450p95k290k337l170j115
1407d853L579L236P62o74j162k774k062K205M077J136j330m62k169l326q98L931
1423g84M051J636l01k039m364l430J889L742K564J134N03k951m858n65L976L110
$$ y = [3385, -527, -4491, -4693, -1917, 1928, 5134, 5271, 2443, -1943, -4682, -4848, -2559, 843, 4888, 5546, 2266, -2438, -4285, -3431, -1204, 2144, 3859, 2745, -627, -3537, -4677, -2774, 1537, 5579, 5257, 114, -5028, -6377, -5054, -1382, 3910, 6328, 3369, -1686, -5338, -5627, -3697, 408, 3921, 3312, -86, -2913, -4345, -4187, -1407, 2905, 3901, 712, -3165, -4928, -5016, -3086, 966, 3943, 3741, 981, -2334, -5317, -6606, -3159, 1985, 4511, 2145, -14, -2366, -5134, -4518, -424, 2978, 2991, 572, -2165, -4972, -5175, -1124, 3878, 4765, 2486, -899, -4041, -6629, -4405, 1404, 4854, 4059, 1769, -568, -3738, -4853, -1274, 1962, 2724, 2050, 888, -1886, -3948, -1743, 2334, 3470, 2140, 1678, -491, -3817, -4715, -784, 3267, 4903, 4602, 2563, -1801, -5231, -3342, 400, 2964, 4098, 4601, 1650, -3208, -3773, 203, 3313]
1439C313K07P2k069m460j901L510M202J499M09j022m539m095J182L848J885J032
1455C073J401j329m521k203J915J831J139R90M84k819k603Q45J626Q20J464K066
1471D179k149m742j950J936K081K783L068n65m781m108N75J369J403L434K146
1486D679k725m436j021J753J388J891K482j606m885k349J619K428J615K594K72
1501C699l689k616m38K92P00K720K951q70l295r98J56r80J113L034Q08k018j878
1518a309L7r48J19L330L404j487l159k312j546m7L399M597J205l185l186j120
1534b208j169J357L672K468j565k697r52p97O4L391K877r97l224j630l67n26K224
1551g9L474P96j701j647r89j767o57K145K806N82o79o43j867j826R14K575J166
$$ y = [3313, 3520, 3592, 1523, -2937, -4838, -1328, 2874, 4373, 4782, 3760, -779, -4874, -3692, 156, 2041, 3073, 4474, 3145, -1376, -3579, -1664, 167, 1306, 2296, 2780, -39, -2642, -1797, -171, 649, 2113, 4179, 2030, -2712, -4662, -2726, -645, 2138, 5206, 4641, -140, -4248, -3673, -2304, -901, 2533, 4679, 1954, -2482, -3503, -1750, -362, 1529, 4011, 2405, -2480, -4829, -3210, -782, 833, 3427, 3699, 10, -2606, -3044, -2752, -2052, 668, 3619, 2749, -546, -1544, -1388, -2368, -1255, 1779, 2587, 569, -1309, -1272, -2220, -2101, 1229, 4633, 3146, -13, -2325, -3871, -3918, -519, 4078, 5283, 2098, -1088, -2208, -3377, -2020, 1652, 4120, 2555, -142, -1094, -1891, -1827, 1564, 4441, 3444, 220, -1410, -1777, -2303, -79, 3395, 4191, 2490, 843, -146, -1913, -2570, -425, 2381, 2963, 2284, 1641, -226, -2052, -1138, 1437, 2603]
1568B603p76k71j202k687l31K810L121M76o19j915l990j855K536M340J333kj194
1585B377l242k545L90L162K091k13p10j669k207k68K660K157K79p41j569k533
1601b581q80J472K368P56O58L7j544k626o55P05J311J146J426M9k170j626j20
1618b274J020P26J688O69k240k781o59J454K154K134Q79r63l987k078R3K209K612
1635F56K039l07k872k015k24R46J329J690N25k056j859M8N73J290J678Q16j108
1652A149k335j071Q8L46J355K118N68p52j468j064q38n48J964J825O07j287o28
1669B9j217n76R81K648N69j065j721j889o00J175L119K057n87j870k070j767J10
1686b674K527K383J45r60j291j058p91J129J761N97o95j027j020m62L70J897J011
$$ y = [2603, 1827, 1556, 354, -2333, -2664, 146, 3267, 3743, 3124, 1209, -2781, -4636, -2100, 2240, 3573, 3571, 2377, -865, -3410, -3020, 142, 2233, 2020, 1310, -359, -2566, -2834, -174, 1983, 2262, 1521, -48, -2581, -3461, -1989, 379, 1135, 1793, 1830, 286, -2340, -2995, -2290, -979, 167, 1593, 1642, -528, -2154, -2274, -1254, -528, 1160, 1829, -411, -3192, -3851, -2397, -243, 1891, 2770, 1807, -2180, -4258, -4165, -1956, 656, 2695, 2388, -484, -2499, -2723, -1777, -448, 1242, 1767, -289, -2148, -2100, -1527, -237, 1441, 2257, 1149, -1186, -2257, -2169, -1823, -468, 1650, 2218, 1466, -2, -1066, -1904, -2452, -488, 1337, 1944, 657, 29, -1188, -1764, -783, 1865, 2434, 1369, -352, -2241, -2841, -1666, 1453, 3510, 2923, 1053, -1017, -2784, -2674, -147, 2236, 2381, 1421, 130, -928, -1719, -590, 1171, 1768, 1073, 46, -974, -1436, -1066, 831, 1842]
1703A842m6j038m43j996r16R14K186R55M33k54j388k089o88J308J558P06J97o21
1721F20k113n83R66J578R69l7n38k063k237P64K419J726L15K7j602k409j087J809
1739a476J278N49N63l32j356j160N27J392J25q5N43j114j790K66J275P11P38P95
1757A449m73j954j405K41P65J074J562R80j127k428m48K00M55J559R94n67j683
1774h06j041P06Q49J016J314k10j779k124M3Q70J128J516J288j105j603r01K05
1791f34m2P68J505k3q50p67N8QK58R55O00r85j054k32r0Q1J279K045O4j626j162
1812A56q69p10O90K161J082q9j376j322k31j43J686J005n88p46j197k5M0J290
1830H14J783m7j688j043n84k38J89K024Q58m29o18l56o64q03M53Q88K11J40j28
$$ y = [1842, 1796, 758, 315, -1681, -2597, -1683, 503, 1458, 1891, 1637, 249, -1840, -2528, -1220, 338, 1044, 1241, 620, -1493, -2076, -1110, 468, 1437, 1400, 862, -1201, -3438, -2674, -255, 1471, 1786, 1813, 211, -2198, -3285, -1476, -198, 351, 914, 582, -774, -1934, -1407, -15, 110, 25, 568, -546, -2336, -2070, -795, -84, 654, 1449, 976, -978, -2383, -2142, -1377, -303, 1259, 2239, 1112, -1316, -1764, -1564, -1109, 450, 1444, 877, -806, -1847, -1141, -292, 724, 2038, 1828, 49, -2075, -2032, -1162, -34, 1482, 2770, 1665, 62, -839, -634, -676, 92, 1597, 1574, 724, -43, 15, 23, 281, 1236, 1836, 851, -203, -435, -525, -444, 835, 2880, 2944, 1318, 156, -713, -1423, -733, 1428, 2510, 2421, 1045, -277, -508, -651, 1035, 2040, 1452, 706, -491, -516, -476, 814, 2597, 2550, 862, -181, -765, -1003, -814, 1210, 2068, 1639, 1021, 665, 1, -802, -349, 539, 750, 890, 762]
1849G62p48p78J48J151O21l12k1r80j337l99J213J567J160m05r13j658j369M78
1867a820J536J322L48n22j080r33j79J267Q42n9n76o63j171Q9J107J441J31k14
1885H66o11r97p38J7J101N24K31M11J40p39q89m52K80O93O18L84m33j004k28L43
1905d83P10P49O86j178j503n24j75J567J426R26m45j597j338m43P46J317Q83N
1923A329p34r10Q0K16O90M07k0r74o03r8K05O02J059L92n91p76k38m41l76J50
1943f31M96R19N83l06r31m09m86L15N35N69J24p75p81n28Q56J057R57k11j257
1962I6j127n65M96J218J270J23p39j449o69J2Q56N47L81l87n56j35m38O41P36
1981C11k53k42o14n94j33O08M33J45M53J71m75p30o96R3J45L29R99K35J23j062
$$ y = [762, 14, -764, -616, 535, 1156, 844, 823, -157, -1494, -1893, -680, 887, 2047, 1642, 729, -929, -2298, -1820, -284, 1038, 1386, 864, -216, -1149, -1328, -61, 781, 722, 146, -517, -1688, -1599, -492, 949, 1080, 866, 255, -742, -1480, -1463, -362, 162, 393, 804, 944, 205, -684, -1136, -856, -163, 455, 839, 406, -598, -826, -483, 227, 976, 1662, 484, -1019, -1543, -1718, -151, 1275, 2201, 1756, 159, -1179, -1622, -876, 441, 1324, 1329, 595, -315, -235, -19, 671, 1078, 1058, 84, -519, -617, -412, 190, 1249, 1641, 1050, 274, 36, -405, -781, -631, -135, 784, 1367, 1061, 130, -279, -765, -450, 85, 654, 778, 3, -778, -1306, -450, 607, 1564, 1353, 96, -1031, -1596, -1100, 118, 1388, 1511, 772, -677, -1346, -1334, -478, 69, 450, 63, -493, -628, -1066, -425, 311, 58, -184, -798, -1392, -1525, -917, -484, -339, 114, 285, -190, -920, -1616, -1523, -1378, -1049, -50, 185, 308, -754]
2001g54p76m0O62R12K7k82j076k73R4J087R33O92r29j162j292Q7R19R76R92L4
2021H31q53j039l7L32N14L57m0l39m15j68M39M31J95L79l89l84k48l20J74J91
2041c89N95L53L41m70l72n35q81Q78Q71P13j91l92n86l84K38N65P57l67n11n33
2061c00o31N65J367Q59m3q24q70j048J82Q22J181J59n08k94l68j28L69K36k75
2080D51kj18r2m44J04O50L04ml75j05m07p00K04P23J24Q91M32q54j330l67J75
2101g40L80M84L11L99j128l22K5P53J07M30l83r48n27L7J322K78L66J0n24j098
2121g68m14O46n7O99J92l9k76l78M49n9j99J96O59o67o18JM92K48j29P47j79o37
2143i1p32N6q7M33P37J360p63r41l41N6l69N23J003M6q60m24N89K7L04O07k16
$$ y = [-754, -1530, -1570, -908, 4, 31, -251, -1327, -1600, -1506, -419, 514, 1206, 277, -885, -2177, -2090, -1171, -195, 797, 831, -22, -1061, -1098, -766, -252, 105, 65, -274, -689, -857, -418, 13, 208, 587, 198, -186, -434, -754, -580, -389, 206, 559, 900, 430, 58, -477, -1358, -480, 391, 1104, 913, 521, -65, -449, -211, 354, 1111, 744, 233, -300, -931, -366, 1001, 1860, 1817, 993, 123, -925, -743, 79, 1260, 1419, 911, 617, 249, 121, 490, 726, 451, 449, 331, 239, -205, -101, 549, 853, 849, 474, 369, -38, -738, -534, 189, 313, 1204, 1636, 782, -548, -915, -740, -360, 124, 435, 834, -294, -616, -591, 162, 269, 699, 316, -632, -1159, -1122, 200, 478, 844, 854, 330, -768, -1182, -536, -593, 106, 298, 259, -17, -395, 54, -5, -204, -8, 651, -16, -634, -633, -141, 107, -22, 725, 546, -91, -823, -767, -854, -421, 316, 1676, 913, -28, -369, -313, -682, -159, 844, 890, 30, -394, 195, 222, 526, 1133, 917]
2164I17r47l58M49n8j22R12J002q93p78j37r7j56R3R47M2m85K90J39n52k76M31
2185C63N31k31o87L18mj85K80Q83M7p60m42N6o99K60P40P29k04n14J3p35k73P42
2207B28M51l89m13k6Q6Q5L23K13O8m36n13m0l18K0P32O64m15o1P7k66r56N39j64
2230e11J28K83N53r0q18l03K79M62j45p5m0o29l84M55Q54O3J14O7p85j114L78
2251a258P18N16m2k28J47q39j43J011K02p36j37K97l62j0O87J89l34l49M02l42
2271f11l41K96Q4K0j4O16L79n08m60J80q4p20O91Q42k05n98l0J13k35N38M71j72
2293B52o89r46O47M04M91O70K98j209m94J72M39k68K38M26k98j79p0N12L9l68
2313F7N3O9l48m82P94O8o1L03K08m06l06K25l68n71L90P74M42l10j34j84m15n53
$$ y = [917, -30, -388, 61, 3, -119, 793, 1795, 902, 124, -13, -110, -266, -173, 774, 816, 331, 621, 760, 208, -68, 363, 894, 663, -24, 294, 290, 105, 385, 1268, 1315, 555, 113, 169, -530, -270, 470, 1199, 995, 481, 494, -241, -514, 228, 679, 290, -123, -149, -63, 22, 345, 558, 626, 190, -323, -363, -681, -661, 71, 735, 320, 259, 336, 70, -886, -347, -511, -383, -100, 453, 363, -455, -758, -479, -17, -162, -237, -277, -906, -1290, -835, 19, 82, 196, 263, -522, -1636, -1258, -540, -24, -66, -294, -147, -986, -1129, -118, 84, -652, -789, -492, -854, -864, -177, 12, -322, -671, -269, -611, -952, -656, -572, -552, -566, 50, 429, -79, -539, -359, -443, -1163, -472, 370, 165, -433, -463, -350, -585, -47, 424, 252, -437, -1383, -736, -332, 159, 829, 1127, -82, -576, -404, 35, -233, 5, 431, 133, -46, -116, 396, 435, 67, 120, 189, -159, -641, 153, 221, 160, 463, 671, 265, -41, 184, -184, -755, -365, 409, 851, 541, 407, 223, -192, -745]
2335g45R43J61N1l47J7k43k33L22Q32l97p08j65j0o25R69P29M13q01k11k80n3
2356c81L7L87J8j00m48K16K93j17j43O08j079J04R7j7M39P5j3j13J16k26L86n08
2378c69j92q2J64J84K90M22j50p75j97K69J52M17J28m11m61rM61O43P5o7o52n08
2400f68l45Q06L54K3K96nm27m64N50L88n76J6J12o8mO16K88m82m48J29L5K34j50
2423B10J17L11l92M53M44r4n20m75k64J92L41L96M41n03q3l10k57M26K97K03k85
2444F48m25J6J89P9M78K26n10n28k09J80kK65L65M9n74J33J87l0l73Q1p5j22Q5
2467A33M73Om12j67K37k2m16N7K03k96N9L31L2K17o7j18n31k86M50N92on78L67
2490B58k90l97L73k12K70j88m70M98o80O40R1O64m05p41J36j13r5N81J70m60J82
$$ y = [-745, 198, 359, 410, 63, 80, -163, -396, -74, 758, 361, -347, -512, -522, -1147, -178, 551, 964, 163, -48, -328, -381, -344, 43, 61, -39, -487, -271, 22, -95, -238, 370, -709, -605, -508, -525, -86, -11, -24, -137, -21, -247, 139, -369, -561, -643, -479, -295, -5, 417, 267, -508, -705, -436, -284, 133, 261, -150, -611, -620, -159, 484, 559, 492, -160, -668, -1013, -207, 147, 170, 466, 461, 34, -430, 120, 508, -68, -52, 60, -8, -12, 604, 892, 410, -38, 91, 126, 360, 210, 327, 638, 246, 699, 1143, 1049, 529, 54, -210, -18, 323, 719, 1160, 657, 574, 264, 7, 433, 730, 933, 648, 223, 239, 428, 507, 985, 1211, 701, 173, -36, 144, 142, 407, 772, 821, 247, 380, 567, 537, 164, 245, 170, 48, 133, 606, 612, 200, 33, 270, 248, -168, -111, 92, -204, -145, 186, 218, 435, 368, 250, -281, -567, -117, 475, 469, -109, 258, -32, -429, -56, -268, 2, -186, -656, -158, -838, -198, -107, 557, 152, -589, -453, -566, -661, -80, 90, -370, -188]
2511a88J07L6j33Lr8J2j25r8N30k66k37M19n4N0q7Q3l92k55M64k31O42J04L54
2534F40k67o53q3P5J42L8K48j50j56K83K87j51j51m9k26J45k73J70N49j84L5k9
2556B40o8k60n5K17N8k57M8M35J49j36l34L62o19K05m4K28p0K69l46L8L13j55
2578B18J60j99m47p2m2J85N19M19o69l67J39k18K5Q1LJ2l07L86K50k36J69m15
2600d06K33m00P0M26k28j32K68K60j43lj77j61l43j33P7M35L25l25L96j08m17
2621d86j36K70L50l10l07j5M18q2K95K46o44J45n17K65P9m0O04l66J01k70K1J42
2643b37j63J31l99M11m7K8N36l68J36k33Q1k2l6J19k13J46K0N6J69L9N5m58jj59
2667d09L49L57K44r3k85l30j47Q89j46J47o68k8L3L50M13J36j81j3m10k94N51
$$ y = [-188, -81, -45, -178, -175, -273, -261, -386, -484, 46, -220, -457, -38, -92, -42, -129, -46, -438, -693, -229, -460, 182, 286, 640, 373, -280, -363, -288, -146, -108, 140, -10, -166, 117, 404, 253, 102, 53, -173, -28, -301, -131, 418, 234, 269, 240, 172, -88, -143, 74, 132, -125, -77, 358, 507, 371, 37, 399, -220, -15, -59, 169, 99, 368, 22, 60, 373, 218, 378, 179, -268, -340, -382, -197, 322, 741, 72, -295, -156, -374, -349, -268, -265, -253, -560, -174, 76, -160, 9, -406, -173, -573, -503, -77, -305, -437, -169, 91, -52, -55, -232, -393, -736, -869, -792, -357, -32, -357, 39, -69, -486, -622, -352, -2, -312, -619, -634, -216, -298, -3, 243, -401, -256, -773, -508, -429, -469, 135, -231, -130, -400, -379, -237, -400, -269, -668, -257, -304, -276, 260, -108, 28, -205, -124, -146, -182, -63, -276, -130, -110, -54, 115, 154, 209, -249, -250, -409, -60, 297, 541, 448, 163, -167, -314, 575, 429, 576, -92, -120, -87, 263, 676, 812, 631, 618, 208, -86, 465]
2688D65l6K49l23j04L27J12k00K78k03m97r1J27K87N8k7k4j20n1J69J9q6j53j28
2711D8R5K70k64N84k05k60m07k95L41K95j42N45n11j27J9J84o7j80K60o61Q6L39
2733e3M72k7j56K8n12P5l29L88o2M8k7J58p6J00n1J05k95l28J82O4L67k2j22j97
2757b70K10P9L5J74m23j19j77J16J78K65K48j83j85l48J07J23kK6J71k02J53j65
2779a89J68L51%m28l18r9M11L37O6l3R4m09m9K36j64J1k57R8K0O58o1m44K21l57
2803a37m4L04R5K59n7j90k60J31N34m56J26r0k69j17PN25m6L20l90k94O4J43J81
2826C39o8j67o0J9R4p1L83j03j48k46j22L58j19J18k00j09K4q3L8K35k44k38l3
2849d03J41K0O36J17p35l6J60k70R0J50j30j04l59K23K40M59l12M4k74l31M65
$$ y = [465, 429, 678, 355, 251, 578, 690, 490, 768, 565, 68, -23, 104, 391, 449, 422, 398, 278, 227, 396, 415, 329, 176, 48, 143, 413, 149, 733, 528, 268, -139, -434, -93, 202, 60, 605, 94, -33, -14, 170, 103, -77, 183, -478, -392, -53, 419, 392, 236, 264, -248, -173, -502, -114, -176, -128, -155, 3, -73, 27, -24, 81, -214, -542, -360, -296, 71, 49, -73, -270, -60, 19, 54, 228, -195, -314, -491, -375, -197, 68, 316, 133, -52, -400, -293, -170, -172, -146, 25, -177, -24, -189, -21, 330, 330, -98, -416, -515, -104, 233, 299, 266, 360, -49, -98, 138, -26, -15, -272, -174, -154, 504, 443, -1, 220, -137, -181, 123, 218, 477, 420, 230, -30, 101, 635, 179, 305, 215, -54, -171, -164, 361, 315, 635, 245, -49, 15, 158, 339, 271, 104, 44, 63, 157, 86, 469, 366, 218, -28, -150, 208, 89, 207, 7, -102, -78, -161, -123, 112, -132, -370, -403, -262, -242, 394, 511, -224, -260, -100, -370, -280, -130, -260, -364, -723, -500, -260, 199, -113, -69, -343, -674, -209]
2870b09R2J8j04k8k6j05j06L22p0k64j23R9r4Q1M43j90r6p7J6l33K68R1M1P3k11
2895d92K28j0L67l21j20J55l55l01Q96K05o34M06J77k39p0J80m19J13J25p9J27
2916f1J49p5M35m81l70L90J5j65J82J45k91J92N48j58m35r5j48M05L6k8K65p0
2938C85m55N24R0k66J25k75k97M4J68J57P8L86k84l5m30K35%N4j3n6K72j38m6
2961B23Q5J61j74k89O8L02m95J41Q5k9n2K12n1P7l27J76l50J71J02oj16K14J48
2984B76m99K89k68O16j94K10k13j74o5j16P1K95l72k17L81l7K04j06J32l50k42
3005c79J65J65J83p3K26n06K62l28N78k09k1l33L25k79K46L3J47R6l49J65J80
3026B94j58k63K13k57l8J25L75j07j80J63l18r3K99j3K00o2q2m4J3J32M24O3n71
$$ y = [-209, -117, -99, -203, -231, -257, -362, -468, -146, -216, -480, -603, -504, -598, -517, -74, -264, -360, -437, -421, -754, -486, -395, -354, -281, -492, -264, -274, 93, -228, -348, -193, -548, -849, 47, 252, -382, 24, 201, -38, -108, 72, -347, -234, -109, -188, -61, 88, 13, 448, -33, -403, -13, 2, -163, 19, 164, -127, 65, 613, 455, 20, -75, -223, 182, 218, 190, 455, 385, -70, 454, 544, 278, 403, 128, -169, -125, 43, 200, 278, 664, 380, 345, -85, 150, 150, 204, 191, 135, 407, 269, 223, 308, 469, 295, 6, 74, 376, -119, 22, 107, 78, 26, 238, 187, 264, -63, 113, -237, -66, 36, 30, -86, 128, 276, -223, 66, -202, 414, 220, 430, 217, 43, -22, -138, -67, 228, -144, -361, 20, -17, 187, 81, 213, -137, -379, -214, -49, 134, 61, 287, -219, 43, -285, 293, 84, 63, -270, 55, -224, 22, 55, 202, 298, -51, 114, 294, 136, -127, 86, -171, -209, -84, 291, 184, 4, 167, -151, -244, 55, 42, 242, 180, 98, 54, 67, 199, 623, 686, 115]
3049A15j43J18LL84r8L7l91L83k33nJ89o9p0m06K73J87L6J69k5oj77k37J38N72
3073G44m51L10k90l7j60l3M3p0K39k51l6J08J46K00k58J05m24J99K44j0l07k2
3095a1K12k42j39O68n02J92l03k61K24k12M13j64J48j77J59j77O0J23j93m40n2
3116f74K59RL11k28J85k72j75M19j61k63P1K14j0J11m9O7j70n08M05j87K05K06
3138b35J38J4j93L8l55L16m9N33o69j26K97K96j56l8NK8k44J04j29Kj50J71R0
3161c12k42L28K34ql64m1L22l18L06J47N1j03k40J90p9N15l93J19j48k45K13K25
3183A57K05j10k04l28k4K23L80q8r9L9M4k05K53Q0M4l08j92J29Ro7N38j97P6j06
3207B49l57J61J6j84M8K07k80L94j39j43K0J37k30jQ8J25k77r8J90j11K77j63
$$ y = [115, -28, 90, 93, 477, 379, 416, 25, 408, 175, 170, 359, 290, 220, -186, 87, 274, 310, 479, 454, 448, 271, 34, 172, 744, 293, 603, 313, 276, 116, 83, 126, 56, 295, 44, 8, 116, 262, 462, 204, 309, -115, 84, 328, 318, 11, -11, 201, -41, -180, 488, -14, 178, -125, -386, -162, -374, 39, -125, 23, -154, 5, -172, -112, 11, -182, -622, -674, -415, -406, -95, -323, -138, -410, -585, -166, -327, -590, -519, -305, -315, -204, -253, -186, -356, -864, -459, -646, -441, -235, -97, -83, -276, -238, -593, -277, -326, 207, -462, -588, -291, 5, -151, -189, -184, -156, -400, -296, -425, -423, -573, -402, -312, -554, -226, 8, 0, -364, -405, -83, -401, -95, 52, 103, 0, -240, -50, -129, 386, -7, 112, -36, -281, -68, 157, 362, 252, 48, -280, -304, -81, 299, 211, 112, 151, 195, -10, 243, 323, 367, 59, -133, -4, 5, -62, 476, 279, 355, 249, -108, 53, 69, -115, -67, 140, -140, 254, 115, -28, -8, 129, -101, -102, -14, 111, -166, -264, -74, -185, 92, -71]
3229g1j73R1j58J94n6Q7K64q5m58J15j0q6N00m52L31J64k53p2J9j99K55J30n99
3252e22M66m30K03J53P8P1k4j60r1K78k70K97l33J57P9k21L07l8J08m29Q3J64
3274g4R8k44m72M56Q9K85l48L23p9m6k62K1M72n10N41K81o23M76n18J10K75Q2
3296C33k37k6j98J73M91n25M87l04K81m85M94j78M9k8J98Mk42K06k3j50k31o8
3318B1K95J16j79n1n9K78k78K04j79j15P8l3K35j0K1j82o2K39l32Q3j25Q1K84
3341C30%j39k83L51j01j89K61j52k48R6M5L31k14K08J1k60N2q4J23k9l61K82j57
3364a27K61Jj54k60m4j7K85L7K0l33K10j15l78R3O11L6m5k69j07O1m9J63R8k07
3388b29k57K28j62N39l69M1J70j18q0J29K22j13m1l1n4O9K7k26K18j73O4J69J9
$$ y = [-71, -244, -153, -311, -117, -173, -86, 178, 93, -365, -250, -260, -346, 154, -298, 33, 197, -56, -128, -109, -308, -53, 77, -522, -56, -486, -283, -130, -52, 19, -5, -165, -256, 22, -248, 49, -284, -127, -48, -269, 38, 0, 108, -321, -238, -74, 24, -220, -692, -236, -147, 138, -210, 113, 34, -12, -274, -253, 219, -291, 250, 531, -92, 384, -134, -24, 251, 333, 96, 70, -128, 45, 536, 11, 498, 194, 475, -10, 484, 306, 355, 327, 525, 529, 287, 493, 470, 320, 89, 21, 316, 432, 253, 202, 143, 421, 143, 347, 168, 53, 131, 98, 333, 323, 344, 162, 100, 339, 7, 90, -35, 46, 330, 330, 191, -92, 259, 158, -31, 230, 78, -170, -74, -29, 302, 88, 296, 307, 47, 99, 15, 138, 109, -252, 30, -127, 134, 135, -19, -279, -323, -340, -55, -18, 2, -331, -121, -236, -614, -521, 90, 126, 81, -188, -295, -234, -283, -120, -22, -229, -486, -258, -420, 119, -250, -209, -39, -157, -237, -108, 114, 1, -40, -71, -125, -56, -29, -255, -37, -210, -146, 23, 42]
3411D2j87k18K13k84K31j60M19J40k54q7j01J92J48k08P1k29K19j47J93K40k80
3432d7O05o09m5J94j30J70m2p2m7R2q4M18l83p0k12L51R9m7k15K17j51R4p4L03
3456C15k96J58k64R8K3n3J87l44M78j70m25J24K21J7N5J42j88m24L54j99J25m0
3478a06K03n18M09k70M88l3k89K38l86K35j19J2K80j8l16J17p6L1k65K29l28L13
3500a69n1K81j91K15l28l7J76q4P3J38n24j81K93K53K75j63j51k33K53l27J98
3521b84K50K17k99k17K34l0J9n0r7K46M7k91pK48M2jKl38L77k07K78K7k9p6j26
3546f5J78J2L98n56R0J42k87K54j94M79l11j76L1J47N0Q5j93J26n13M24q8J60
3568A93J30Q4k84j5L71k85J49k38K56n2k08l25N55j9k64j7K51k72K91M0lmm0k79
$$ y = [42, -145, -363, -150, -434, -203, -363, 56, 196, -58, -145, -246, -54, 94, -114, -43, -272, -53, -200, -7, 233, -47, 558, -51, -96, 98, -32, 138, 96, 24, -23, 69, -15, 403, 20, -50, -262, 89, 188, 141, -74, 143, -8, 86, 12, 315, 19, 177, -87, 11, 34, -19, 168, -176, 302, 132, -293, -169, 52, 69, 124, 266, 78, -346, 8, -191, -66, -106, 97, -421, -12, -282, 206, 173, -116, 122, -264, -29, -148, -136, 144, 126, -190, -73, -149, -118, -383, -154, -482, -169, -220, 61, -130, 85, -243, -280, -104, -188, -115, 23, -501, -682, -389, -136, 139, -24, -175, -408, -155, -482, -284, -34, 183, -116, -333, -99, -129, -110, -160, -257, -11, 36, -255, -262, -14, 28, 27, 29, -309, 68, -139, 139, 166, 137, 61, -65, 113, 125, 523, -33, 57, 199, -88, 166, -28, 451, 140, -36, -5, 142, 192, 277, 84, 210, -303, 121, 33, 193, 323, 407, 123, 108, 479, 194, 343, 105, 361, 309, 101, -224, 331, 312, 48, 31, 282, 10, 301, 341, 338, 334, 294, 15]
3592A5K73k08q9L37M0l15K31j51K7j6Q7l00K23k97L71k4p3j40K53j87mJ07j2l62
3616b14M4l7K72K59l45o8J74j79o5o1p4l1M80l80M23l09J86m5k00m3k31L89o9
3639a24J12l52J26J35M5k33o2K96k73J49K53j15J18j89J5K23l16J9J59R0j34j22
3661a80J42R1l44L79O5Ql54M6n5L0r3K46J81k84J60j49j92O43j18k8j63M3oJ63
3685B31j72L21j26k12K44j11J5J7j70k5L60k98K12k30L1o1j17L52k29J49n3oj65
3708d3j03K12j51L36k86J33j40qL53m27M33m42J39p5k4M7k12L98l48Q7J90l4J9
3731E4n9k88j21J99P8K52l44J10r6q0R7j53K73K63l95Q3j00J94K05j41l44O0O
3754b47J68K04l95L11m77J39j70L25K08k10J76l7k92L3K29O0l46m6K08m2l9j76
$$ y = [15, 288, 80, -9, 328, 368, 53, 284, 133, 160, 144, 231, -69, 154, -143, 228, 204, 131, -9, 244, 57, 53, 160, 148, -214, -170, -207, 65, 324, -21, -89, 85, -94, -159, -220, -294, -325, 155, -225, 198, -111, 75, 30, -170, -213, -444, -55, -124, -12, -364, -238, -103, -58, -291, -353, -57, -330, -181, 72, -43, 75, -114, -99, 124, -192, -173, -14, 76, -58, -180, -38, 53, -291, 88, 153, 161, -193, -147, -202, -172, -265, -19, 162, -122, 38, -111, -303, 340, 222, 194, 31, 74, 68, 231, 59, 380, 254, 42, 286, 175, 190, 207, 37, 12, 372, 74, 286, 56, 87, 26, -91, 261, 32, 181, 128, 122, -43, -146, 66, -85, 251, -35, 98, -42, -50, 303, -124, 309, -133, 6, -69, -93, -46, -258, 140, -208, -121, 69, 35, 54, -5, -293, -414, -215, -137, 115, -229, -119, -215, -295, -198, -351, -78, 185, -210, -127, -227, -33, 172, 31, -313, -253, -247, -79, 125, -270, 41, -436, -297, -467, -142, 66, -144, 32, -5, -297, -264, -35, 25, -321, -367, -159, -201, -240, -416]
3776d16K07q0J05KJ12r6M2L32k02p5j51J94k52L61k59j54M4L45o3N8O0l8O3l30
3800a91L20N3L3k11J40j26K87k98Q3J48J72n34L15Q6l29r0J17J24Q9J46l60J76
3822A50K7J12m54R1J88J22j37j86N11l37l1J32M8j60J01M4j01k1J59o2j97q5L9
3845d7R6L34o24M0Q3O8J44k41J85k42K38j30J8J98o9j45N8R7k67M0J75K88j02
3868A95j14j33k54N5L23k68J18J35l19K78L9k02R5Q1k8j50j0J05K77k89j77J27
3890a16rL54j53k61j29j82K66Q1m3J62M9K5Ql17Q1j15N48k28j58J04l33L49j71
3913a88L76l13K71k60K42O3J93o10M96j21J68k2n80K46j6J6N87l83k35L17n8j83
3935FJ39j15qJ2n8o7J77j95o3J88M7j63p4K00J16j42J08j60K57j68j99N14l04
$$ y = [-416, -209, -289, -184, -182, -70, -166, -124, 208, 6, -69, -220, -26, -278, 83, -176, -330, -286, 59, -4, 54, 114, 76, 139, -191, 129, 182, 215, 4, 144, 18, 305, 7, 90, 238, 410, -124, 191, 277, -52, -142, -25, 99, 188, 334, -26, 150, 177, 289, -165, -74, 114, 236, 99, -87, 424, 87, 56, 188, 236, 76, 177, 221, 120, 99, 258, 196, -1, -86, -47, 49, 383, -241, -201, -118, -50, 94, -147, 38, -204, 34, -96, -78, 120, 51, -94, -36, 61, -206, -166, 9, 297, 195, 81, -52, -306, -251, 72, -196, -78, 57, -262, 16, 55, -147, -52, 29, 1, -149, -159, -54, 223, -66, -243, -116, -125, 229, 76, -185, -314, -496, -230, -149, -192, -30, 19, 44, 52, -265, -184, -299, 249, 21, -137, -33, -366, -17, -188, 188, -125, 146, -114, 128, 191, 384, -226, 270, 149, 317, 295, -285, -39, -55, -39, 548, 165, -70, 247, 189, 6, 145, 30, 22, 34, -24, -91, 86, -109, -172, 16, 63, -100, -174, 26, 142, 0, 108, -52, 205, 37, -162, 352, 48]
3958D8j55L24r5Q4R6l67N3K06r9q7q3K05m59L57o0L43l12J63j07J58n4l20j68
3981c29K73l4P0L34q3m22J09j45L09l0k10L0L18l53J08j63J27jj38L77l44J34
4003f3L67p08M26l19R4l3K1Q0P7j55rL23R0m32PJ26J53j28J50k03k29M16K4k24
4027a49J73j62M12l15J3k22R8K18k0O8j76J01k09l4K93r1j72M32k87j8p8L84n58
4050b99M32M0l06j17K99j7K80m65P2K32M7j32k74K96lnP1r2J54k46k24J89K30
4073A62j6N2j96J41p9j77L84l39K58j14k08O9j10K02J7J57J79j87p9r5k32K22
4095A1J24k82q5M66j69M4R0k96O7N3k91L75j61K55l00J03k67P1K88k09J44j59
4117a28J79m57N09k07O4j21M9K70j42k16J45m30J79M34pj87r9M29n44l0J07j01
$$ y = [48, -107, 217, 122, 206, 302, -65, -12, 194, 95, 8, -75, 130, -329, 28, -32, 311, -1, 162, 55, 213, 159, -161, -329, -56, -90, -20, 314, 231, -191, -82, -227, 82, 52, -158, -128, 190, -163, -55, -218, -91, -92, -230, 147, -197, -63, 304, -404, 22, -297, -203, -236, -215, -135, -58, -213, -222, 101, 191, -241, -234, -108, 45, -83, 67, -136, -365, 51, 75, -149, 24, -138, 274, -41, -28, -250, -152, 66, 46, 114, -62, 39, -170, -204, 89, -2, -174, 258, -29, -47, -125, 259, -299, 133, 173, -133, -250, 49, 32, 312, -153, -81, 151, 198, 66, -208, 88, 85, 80, 151, 59, 213, -33, -257, -68, 162, 146, 198, 2, 143, 64, -113, 271, -68, 190, 76, -132, -63, -173, 29, 46, 203, 382, 195, 116, 21, -211, 11, 135, -147, -232, 234, 65, 109, 199, -97, -30, 23, -268, 107, -54, 201, -99, 4, -263, -192, 96, -113, 31, -128, 51, -406, 103, -104, -40, -161, -112, 158, 16, -200, -55, -485, -306, 128, 121, -66, -165, 264, -280, -310, -203, -304]
4139c04J89%j43J19Ll2p8R1J26p4P4J2j93K42J86o04M21O3m00J92J85j10l1K84
4163B18l02J10j12L11k56j13K3M3R4R7M3o1j56J22J84n8m9m1J3J85r0M5j43J66
4187B73j22l72L75rk87K24k31K10j27J45K33k02j1r6o5J89p3j47L39k03L7J44
4209B24j50J80j43o9Oj11J57K82l08j79J89M5j0k41L74k60k28K95m6n4K26Q8n47
4232b80M75l68m8J17K7O7p6k13N18J72n40K59J64m85J47L2j46L60k14J90m04K11
4254c5j65K46k50M1oOj02K67J3J23q5k69R4J06o1J22R0k10r2k50Q2L43R5k14L00
4279A89m50M4N33k52J85p2J1l75k8L11l67L94Ml85L78j92RJ69j16n6J23k31O34
4302D60k96k7k62J66J53p4j55K80n2j07J34K36p2l47j00J00r8l47M55J07R6p7
$$ y = [-304, -115, -115, -258, -139, -136, -168, -246, -155, -29, -103, -29, -17, -210, 32, 218, -386, 35, 98, -302, -110, 75, -35, -66, 218, -84, 26, -86, 225, -31, -144, -121, -78, 16, 113, 156, 95, -61, 61, 245, 187, 138, 97, 110, 295, 205, 250, 107, 273, 151, -221, 154, 145, -142, 82, -149, 61, -66, 79, 312, 110, 99, 3, -62, 127, 54, -93, 246, 43, 80, 224, 74, 254, 111, 42, 48, -63, 94, 376, 68, -111, 78, 123, 113, -128, 246, -14, -242, 53, 7, -47, 179, 267, -280, 195, -173, -221, -104, -77, -10, -86, -299, 219, 391, -149, 110, 274, -211, -64, -32, -178, 182, -32, 158, -246, -35, -200, 46, -204, -163, -169, -163, -265, 2, 15, 138, 53, -216, -122, -16, -77, 45, 135, -75, -167, -417, -335, 8, 103, -111, 189, -261, -217, 316, 64, 249, 177, 188, -187, -215, 96, -271, 123, 127, -258, 120, -72, -63, 106, -10, -66, 57, -174, 460, 164, 137, -125, 41, 194, 120, -35, 245, 193, 86, 220, 456, 384, 37, -63, 37, -61, -408, 47, 154, 250, 173]
4324A73Q4j7j22m8k2L02l36J14K35l74L01j64j80K59Qm08K56J03l55J77Q0PJ63
4347B36j05o5J43k33K0j76J99j51J42J0R5p8l7K3j89M26n40L40o6j64J84J03j91
4370g4k8J73l5j91J40k61L58j73l29L48k08j11L55k25L51k27K10Jk97J00K1n5
4392a57k45rK09J13L11n39K08k16J64K20j78O5j47Q0K4j80M43k22k1jR4rP6j06
4416b3l39P6J22L64l26kj37K21J1n3R3o5k53K09K33l37K0J76J51j79N6J15j33
4439@J01r2l1j11L20m4j51K39j84k5j32J75p9m3K12k29P2J23r4pj5K35k92J35
4463H3j95K23j32K74j29O2p5j35q1L13l14k4J47r8m0M54m90J79N2k42L09J17q1
4486A77q0r4K9M7R7k39J82k07j47JM53k09J06k08K3n8K00J17j77M4r4M1n4L2J81
$$ y = [173, 257, 240, 118, 70, 48, 350, 14, 128, 363, -11, 290, 126, -54, 205, 213, -195, 61, 164, -191, -14, 66, 73, 236, 131, 66, 209, -24, -4, -180, 19, -132, 10, 20, 115, 37, 0, 23, -166, 260, -280, 60, -6, -170, 14, 117, -74, -102, 71, 36, -155, -15, -276, 82, -91, -420, -72, -280, -391, -36, -261, 90, -137, 73, 74, -223, -123, -102, -157, -402, -411, -202, -89, 222, -317, -109, -325, -161, 59, -119, -54, -201, -121, -97, -277, 166, -56, -77, -78, 16, 7, 83, -23, -362, -286, -164, 200, -126, -128, -265, -44, -33, -86, 7, -58, -311, -102, 131, -206, -186, -10, 141, -38, 18, 133, 0, 101, 9, -22, -133, 187, 143, -8, 231, 47, 22, -110, 65, -14, -57, 155, -74, -2, 121, 27, 20, 5, 240, -52, 83, -112, 111, -21, 253, 124, 186, 111, -24, -105, 208, -106, -130, 17, -81, -121, 333, -157, 22, 74, -168, 141, 258, 177, 97, 3, 32, 79, 176, -63, 119, -88, -235, -234, 219, 10, 116, -92, -69, -127, 73, 190, 13, 57, -37, 4, -50, -18, 163]
4511A63k86J02q8k24L82m05L34n1Q0j32N7k2J65n2j76k6KJ81l9j7J17k35K51k4
4535E7K10l59o9J7L27k24j19K51l33M09m54L03j16m1J51P4N2M4j39R3oL92m63
4558E7J2K17o5J11l5k71J48oo0o8k7K75o9k15O4J03P2o4j60L25j89J7j2QkK80
4584D46k45j45l4j01o1K14j74J03J30k40K60j23k71K49j62M54l54M2K21j90n6
4605c7N9J0o6N5o6j40J06j05L24J06o5j26l82k3q3L64K38l33J13M2j30J55R8j28
4629a4k38P8j02L18q9j66J55j83j10J5O5KL51m41M13m1m6L5j1n4j11j06p9M33
4653G4p9J90k35j53Q7p5J56j66K99o0J49l11q3q2M51n1j16J4k88M72j81K5k70
4676b33O10l40l6L55r5k82rL39n3m54K61l8J92l2j49P5j52k70K48o8K08j43M9
$$ y = [163, -123, -21, -109, -333, 49, -356, -22, -73, 7, -125, -68, -90, 75, 23, -153, -179, -177, 4, -35, -52, 65, -170, 81, 57, 267, -92, -161, -144, 183, -41, -160, 91, -242, 167, -287, 16, -100, -141, 10, 84, 136, 180, 41, 134, 128, 520, 57, 69, 286, 221, 332, 297, 26, 174, 168, 108, 40, 13, 288, 219, 4, 68, 171, 243, 179, 19, 344, 155, 172, 160, 168, 166, 446, 201, 56, 22, -79, -140, 74, -100, 3, 133, -107, 153, 30, -241, 8, -154, 300, -54, -12, 209, 19, -37, 22, 32, -34, 21, -45, -185, -79, -184, 140, 246, 181, 55, -327, -350, -433, -69, 169, -164, -51, -9, -139, 16, 114, -14, -252, -174, -276, 42, -47, -213, -58, -241, -351, -336, -271, -269, 82, -359, 54, 13, -33, 2, -9, -63, -174, -280, -359, 74, -5, 185, -50, -203, -116, -191, -35, -201, 98, 38, 187, -124, -207, -289, 162, 111, -5, 9, -279, 193, 12, 37, -233, 377, 37, 1, 356, 261, -21, -30, 309, 256, -198, 63, 25, 217, 185, 36, 111, -41, -311, -63, -131, 77, -66, -17]
4699a7j33L12J09k93J74q4NO6j32j49J62n7J11O7j15J16j33k11M58k92J03j39
4721g2M75n78j9K40Q3k25j86P0M81k02P9l14K53k79K9J92J07p7k05P2O6k75K19
4744f6L17j42o2j98K83j29j76P1K79k57j67K86j95n9j62L58J1o2K83m24K59Jp8
4767b9J19j94J47m2J01l5J94m87J44n6K62k3j24k03K21J16k66L14o7k22Pm9J90
4790A8jO0j74l7L33n0qk12R5k75J31J74K6J32M0k07r2J75j06O9k26l0M12j79k53
4815a85K14K39r3j1k76J09j61L54k76L11l4q5j05J0J25Mj67J22J00k2N9L7q7k9
4839A53r5k23M35j15j85q3J37P5k9j58K10R6J15m50K86M9k98K09K62l53J53j83
4861Hq9K20P5l1o8q2j85L17p3n3l12p2K85K84j4l5j85r3L5J24j86J27NJ3k72J7
$$ y = [-17, -150, 162, 271, -22, 152, 68, 73, 139, 7, -142, 20, -37, 74, 141, 26, 142, 9, -202, 256, -36, 67, -72, 403, -175, -194, 46, 129, -96, -282, -212, 269, 67, 146, -168, 85, -194, -165, 27, 134, 57, -148, -76, -10, -285, -66, 251, 109, 47, -151, 132, 3, -173, -102, 177, -80, -247, 39, -156, -215, -377, -19, -8, -70, 213, -211, 48, 49, -29, 90, -104, 43, 1, 102, 67, 261, -226, -82, -138, 124, 101, -23, -226, -5, 111, -155, 159, 92, -130, -123, -172, 18, 17, 77, -97, -134, 199, 149, 141, -71, 24, -251, -120, 54, 80, 212, 252, 45, -47, 128, 22, 91, -135, -165, 247, 68, -185, 29, 268, 175, 164, -112, -3, -164, 190, -86, 225, 191, 106, 1, 11, 136, 140, -27, 95, 195, 173, 232, 269, 182, 153, 58, -165, 270, 155, -30, -113, 24, 99, 70, -88, 122, 218, 333, -117, 169, 218, -80, 129, 391, 38, 191, 8, -81, 139, 214, 183, 115, 33, -152, 165, 92, 39, -273, -345, -60, 224, 210, 175, -10, -103, -68, 56, -130, -3, 2, 15, -257, -240]
4887b40J70J61j00j37R2L2O5j50J27k82N02j77j95K65J83l20j20k5K68rLj03J74
4910A84k49J32j51J86m48K08M37k76j42K55k14O5Q2k30J73k04K15Lm1o7P7j18
4932a23K90j39L82l27J36L4j36j3k75o3M43k33j91L46m6k42k1L56k28K15J21k06
4954H0p9N5m2r5Q0J76l18M92l25N0j9o9j97j13K49J70J05p2J27j42kj70J34k18
4978a43J86L10k50n0J3j07mn6q3R6j14K69j60n9m8K48j1j54N2J40k3K1j64J67
5002G6K08l33r9o3J90l13P2R4K10J7j26o5QK5k49L31r2jJ89j09m53L28N8q6J14
5027f9N4K03k04o0n0J55k41J96N1j29j9J29P0%Q7j34j71L06k64j6k8J86J1n2L
5052A4j94K17k02L29J21j54k13k10L24M0k96N52n17J46l8K0Q7J5l38M10j14k03
$$ y = [-240, -70, 91, -9, -146, -54, -22, 43, -107, 20, -262, 240, 63, -132, 133, 316, -4, -124, -149, 119, 110, 113, 10, 184, -65, 67, -84, 102, -346, -138, 299, 23, -119, 136, -78, -13, 69, -161, 12, -192, 23, 26, -15, -82, -5, -123, 167, 28, 410, 83, 219, 253, 117, 104, -171, -234, 209, -24, -215, 131, 85, -157, -178, 178, -50, 165, 286, 80, 1, 56, 14, -81, -1, 175, -143, 349, 24, 74, 55, -14, -211, -324, -75, 95, 200, 128, 255, 113, 111, -59, 75, -143, 43, 353, 103, 53, 66, -41, -45, -101, -184, -88, -202, 67, -93, -152, -200, 48, 37, -117, -65, 75, 52, 73, -91, 76, 284, -49, -148, -211, -21, -334, -262, -168, 42, 59, -67, -132, -124, -99, -348, -17, -109, -110, 79, -30, -483, -155, -97, -183, -69, -15, 188, -16, -76, -126, 29, -212, -16, 35, -94, -113, 16, 86, 86, 173, 39, -132, 174, -90, -106, -134, 52, 63, 11, 14, -180, 37, -165, 164, 285, 131, -82, -292, 32, 72, -224, 328, -189, -43, -81, -61, 26, 41, -297, 113, -1, -204]
5074b04L73P6l06o4m6L60q7Q1m2J04k37R3j5j19r0Q6k8L93m0p7j1p8J69m78K8
5099a59L31l7j70L14j12k70L64q3l04K86j38o9J45k09K7J81j45K52K4l78k4p8
5121b52L62J03o9l44J3J63j77K21k92M33n0k59K56k09K34P2n78M19l23K0K70J88
5143B01m1r7P7k83k8R8Q6J0j41k08K82j39J01j85K00J64j76k25K66j2K53l21N9
5166e9O5j00L90k33k57K55k41Q1J65j10J91J75l38k37L40K3J43j27j51R6L4l76
5188b71oM99l99oL82m65N1M54k29Q8J80J4m10M5J14k54L38l02K5K64K7O9j49j88
5212a29M58l80n3P4L7n6r1K71q0O1k27K88J29l31j34R0k3K16o5o4k09J61L58k19
5236H2j98J90j23J39N2r4J35m52L54M4j84r1R2K7j15j49L06J99r7p8O3k83O6K88
$$ y = [-204, 169, 245, -61, -125, -171, 189, 102, 183, 141, 245, 8, 101, 86, -33, -123, -37, -65, 328, 288, 211, 200, 122, 291, -187, -159, 172, 135, -35, 279, 167, -103, 261, 178, -126, 160, 22, -47, 98, -111, -84, 97, -48, 204, 228, -150, -174, -252, 110, 213, 144, -200, -187, -24, -201, 20, -272, 161, 111, -148, 108, -101, 133, 205, -373, 46, -277, -257, 13, 201, 160, 63, 140, -143, -171, -73, 13, 23, -118, -326, -44, -183, -82, -267, -67, 97, -79, -304, -38, -50, 203, -118, -59, 6, -94, 296, 63, -194, 61, -180, -99, 66, -44, 147, 322, -16, -253, 87, 110, 253, 126, -25, 71, 105, -271, -277, 222, -177, -183, 199, -266, -215, 239, 10, 98, 278, 292, -118, -73, 41, -213, 125, -177, -152, 112, 139, 208, 59, -129, 329, -51, -104, -30, 7, -49, -140, 131, 51, 112, -115, 173, 302, -29, -163, -73, -96, 120, 55, -9, -218, -57, 301, 82, -116, 74, -49, 90, 142, 48, 183, -269, 85, 129, -55, -146, -54, -27, -142, -291, 15, 214, 117, 39, 102, -181, -115, 173]
5260A73J89n47Q9p8M6j67L35n9q3j4K9k68M9L35M0k63J60j20J62J24j42k30K49
5283IL6P7j4p4n4k60L72j93L28l77j79L61l35J36J20N9k42J40K18j05K49j88M1
5306A25q2k12K50l6j24O3o9J20k70M04N7k8j40o1k9J70j19J99n6k11M12k35j06
5329B2J56K14m83K57m16L95l14K07L05j1o05k6M36j41K70k39j60K55P3o2j35J75
5351A73l67J65j58M77n81K33N1o2j54K85m97L84j01J32k3k04K50K3j78J20P4j76
5373a34J34N1k94J43R9N7k79J11L5K59L3k03J57l52L24m6j39J3J9J07p9j81J50
5396a5j28K62j30k3m9m0j01O0J06J56oJ7k90M52m84K31L2M9p5n1p0K60k07l4J48
5421G0j14K68l03L04j07Ll70L14l64L82M8j78L68k87m8P6O0l2J48l67q3J87K04
$$ y = [173, 362, -185, -96, -174, -128, -295, 40, -19, -102, -116, -87, -355, -306, 29, 69, -194, -34, -154, 8, 132, -10, -240, 9, 45, 122, 108, 34, -20, -280, 92, -101, 227, -150, -329, 32, -303, -167, -47, 12, -230, -90, 128, 23, 272, 84, 125, 43, -169, 81, 45, -79, -16, -85, 35, -235, 169, 226, 198, 58, -3, -32, 138, 19, 218, 162, -49, 363, 128, 22, 178, 392, -91, 166, -250, 145, -169, 38, 343, 332, -273, -299, 137, -4, 266, 27, -133, 122, 195, 133, -2, 173, -194, -29, -187, 290, -291, -58, -7, -69, -223, 62, -435, -51, -152, -20, -43, -247, 3, 26, -152, -32, 42, -134, 0, 51, -243, -100, -1, 56, -223, -112, -77, 182, 215, 12, 169, -183, 141, 95, -44, -31, -12, 95, 16, -165, -15, -143, 119, -11, -34, -83, -123, -224, -164, -58, 98, 92, 109, -181, 271, -213, 18, 50, 99, 24, -27, -97, 163, -44, -78, 70, -44, 224, -79, 225, 118, 121, -249, 65, -299, 83, 131, -47, 321, 34, -14, 62, 122, 90, 238, -129, -212, -25, 179]
5444A79L9k91K30m2r6N7J5j00J38L2J5j99l0O1k80M41K66q2n62K25L00o47P6K48
5468gJ00O4J77l97N5r2L5K47l90L78Jk1k2Q4k22J14j4l29m5K31m1J04M6r4J25
5493H7j40K2J87M3l98J11J74J01j03o5q4Q4m3q3J70k75K85l70J82j58O9L76k21
5516d9Q7K9n87O20k70J53Nk81K80l05J20J64oj76Q3K86l61L23K8k64r7J89L55
5539C26j94m20L65J71l22q6K89J57k71Q1K7k55j23O2J46j37J01k1lJ33K37k44
5561A9R8j06Q2q5J28RK0q1K40l81J43K34l53r0K71K24n96K13j46K9M1l3J22j45
5585a43JJ00M33m46n0K89R2j09K00j53m20M24q7l3j0P1j33K13m17N5M0J7L33l19
5609e2J26k36Q0R1j6k17J71J12p9n0R7r8L2K43R1k40J07j14n0k42oM84n04J28
$$ y = [179, 218, -73, 157, 115, 19, 76, 91, -9, 129, 161, 176, -23, -53, 8, -272, 169, 435, 353, -209, 16, 316, -331, -255, -7, 93, 157, 334, -63, -8, -100, -65, 182, -208, 170, 171, 150, 128, 212, -10, 104, 90, -239, -284, -53, -94, 10, 56, -38, 87, -53, -31, 156, 199, -199, -88, 86, 187, 84, 19, -65, 19, -24, -107, 63, -212, 73, -297, -115, -273, -204, 172, -49, 38, 67, -520, 100, -170, -17, -12, -293, -13, -318, -198, -34, -40, -216, -133, 153, -208, 115, 143, -121, -218, -29, 326, 132, -288, 77, 248, -74, -160, 129, 286, 15, 96, 123, -132, -255, -193, -47, -184, -83, -104, -107, 26, 263, 19, 117, 11, 93, 8, 136, 145, 165, 84, 324, -57, 86, 320, -33, -123, 148, 372, -224, -11, -157, -128, -87, -120, 2, -143, -142, -42, 391, -55, -105, 184, 276, 167, 367, 214, -206, 218, 131, 98, 88, 159, 26, 239, -178, -123, -83, -66, 267, -52, 74, -162, -82, 9, -7, -224, -53, 59, -20, -70, 27, -71, -39, 204, 295, 55, 162, 48, -2, -244, -250, 234, -270, -142]
5633a42K64k94M2J26N4j61j15M2k14M31k38J59j26K02k69J64J45j57J28n2M97
5654D86o46K53L2Q7k28L1m0M5j68J4Q1K0K41k43K05l02k13J18P9k07N15J53l00
5677A3J07j20N0j62j07L04j93K64k95K24J39k74j44J60n8J47k12L61j05k34M7
5698h8J66k71M05j64P8l62M81k95P9j64K62j33j61M39m91N8L95j95n5J45m75L54
5720HR0J5k23J69j77J94P9k36J64q7Nl8J15K57m69L34k25j0k00o0M20k55J14M2
5744B6m6j26j06j19K91J25L8k07qK65k79J70N8j80L5p9Q1QJ71j32J05j08O8k9
5768B2Ml13L77q4NL43k56J44n8k2j49j31J23J91m51K49j72J1K23P0k96J48K9k82
5792b75K19K40J44m7j83j89L85Kj23l87N06k35n5J24k52rK65q5J04R9j7r7Jl07
$$ y = [-142, 122, -172, -130, -4, 50, -111, -226, -184, -398, 33, -205, -46, -172, 30, -239, -75, 70, -87, 41, -11, 486, -160, 93, 125, 212, -16, 15, -25, 20, -148, -134, -53, -33, 208, -35, 170, -132, -345, -227, -148, -355, 160, 313, 13, 120, 0, 50, -112, -219, 85, -108, 156, -139, 85, 224, -50, -194, -34, -92, 55, -157, 204, 99, -135, -88, 78, -193, 212, 48, 126, -236, 245, -50, 29, -135, 127, -6, -167, 272, -219, -161, 234, 39, -16, 129, -346, 8, 98, 113, -110, 59, -118, 76, 155, -81, 83, -4, 1, -37, 78, 335, -134, 200, -25, -35, -235, -295, 125, -130, -16, 26, -20, -146, -252, -371, -80, 45, 83, -124, -132, 133, -146, 24, 82, -98, -63, -142, -61, -53, 118, -14, 91, -17, 51, 22, 26, -287, 90, 6, 11, 354, 98, 242, 184, 162, 13, -118, 5, 196, -255, -6, -178, -167, 56, 126, -170, -22, 7, -275, -56, 184, 328, 281, 98, -91, 294, 296, 173, -214, 292, 57, 2, 126, -126, -135, 130, 45, 149, 248, 231, 134, 135, -172]
5816a72L70j84J0J14j71l0M0K01j3N9p8j54L13l4l44J14M0L48n09L48j61k50L00
5839A57n4j24J94j3k86L76J19m87K31j75PJ94K4m79L53n2M36m75K02l97J58m4
5861a35K41j9k51J53J36K9j51P2j44J24r2rL2p6j10J39j9J64j50L03l03k21R6
5884a91K30j19RR7K3j06Q8l5j6J31q3M0j60L15k17k08J80k57K23JK45j31k05J51
5908EK6K05j80J0n9M8j60Q4r9J32J58j88m50L92J71j53k8N7O4L07o10L54lJ04
5932A87l79K78k7J68n2j55K42n37K75R6p4J34K8j98k62K65L04k38j17K10j62M1
5954B7J01p6k4J74j03l3j67J53j38J50j95J96j43l6L2K21J83m04J47J91l45J51
5976F2k48k3K39J75l4o22L37r5J43M5o8q8R5m7q8J20P6J10K2j69M7J25l24K6L15
$$ y = [-172, 198, 14, 24, 138, -33, -63, -23, 178, 165, 224, 146, -8, 305, 271, -73, 41, 81, 429, -80, 268, 107, -143, 157, 103, -21, 173, 160, -126, 250, 369, -118, 113, -62, -55, 139, 163, -316, 37, -15, 421, -54, 148, -249, -91, -135, 106, 87, -164, -11, 125, 154, 3, 75, -69, 55, -37, -46, -14, -90, -200, -61, -80, 84, -66, 237, -66, -287, -191, 39, -80, -71, 26, 49, -57, 31, -4, -20, 111, 28, 68, -92, 223, 6, -202, -22, -279, -56, -55, 190, 59, -146, 5, 31, 236, 56, 66, 7, 55, -105, -21, -120, 12, 170, -18, -468, -76, 95, -58, -86, -29, 35, 342, -268, 86, 83, 187, -192, 86, 59, 227, 175, 20, 262, -275, 0, 96, 22, 156, 184, -14, -276, -11, 293, 55, -62, 148, -14, 27, 128, 52, 28, 202, 99, 66, -101, 52, -86, 64, -131, 65, -78, -114, -82, 139, 322, -82, 65, 256, -89, 62, -186, -209, 30, 205, 171, -451, -114, -209, -66, -21, -89, -177, -82, -129, -217, -97, -21, 89, 111, -58, -11, 114, -210, -184, 131]
6001A31j25l5j9j6K88l54P1o2p9P9K37n0J8j87J29k25K55k3K47l78O2N9j02M05
6025C26l21O4J81l96J12k59M27L4k92n9K68J26j50k89p7M43m1j02k09J57K75m42
6047b24K73j44l6j2J22J99k89J23j38K2J89Q9O8l35J39o8J07j33K9K95m23J75
6069B8K92m73M87j86K7L1k93J4j70K10o2N5N2k29P0M44n11L11l13Q3J98j88K47
6092A24J6p9K99l50j70K6L18R3l76P8k15L06j29K94j01n91M61P4k16l9N8m1L22
6115A62j29l99M22O5l28m7R0L00j60j21J33K23k48k90R0J33O1l2L2o5J57L2J14
6138A95l4k30r3j03K8L08m3k67K93j38K35j81R9j80J7%o6M32k19P3J67l53M67
6161D07m78jJ47L3J60m63j7J55J01K9k19K14k55K47k6p6M9j4o6o7J92m0N2r9K75
$$ y = [131, 6, -29, -48, -64, 224, -130, -59, -121, -200, -121, 116, 66, 84, -103, 26, -199, 56, 33, 280, -98, -36, 23, -79, 326, 5, 69, 250, -146, -34, -293, 134, 168, -124, -183, 85, 211, 61, -228, -305, 138, 97, -5, -214, -57, 218, -224, 49, -95, -131, -143, -21, 178, -111, 12, -126, -104, 85, 174, 242, -93, 46, -22, 85, -48, -19, 276, -147, 28, 320, -153, 334, 148, 175, 206, -87, -73, -243, -33, -95, -40, 12, -217, -147, 297, -214, 97, -216, -133, 65, -123, 124, 140, 61, 360, 10, -160, -134, 184, 277, -99, -21, -236, 70, -59, 235, 134, -457, 4, 78, -138, -177, -119, -160, 162, 33, -366, 56, 121, -207, -254, -164, 136, -24, -145, -12, 211, -37, -327, -237, -104, -43, -75, -43, -108, 49, 81, 195, 161, -69, -162, -265, -237, 71, 28, -239, 54, -84, 151, -30, 69, -111, -94, -94, -160, 272, 53, 126, 293, -60, 407, -71, -72, 75, 108, 268, -195, -212, -57, 44, 73, -146, 68, -187, 60, 34, -42, 7, -7, -73, -140, 52, 12, 64, -35, 240]
6186B40N2l3k61k43K39M8j06Q2Jj16M19l90J86Q9l91R2N6J9r9J39Q2J42k35P4
6210H6o9QK87j62r4k53R0l2K77j57l74K25J54K29jK7m9j45J95l84O1j8N1L0J66
6235A48J9l75r2K69q8l4J64KR4k09j43k5J77J1q2L45j51k19K03J42l12L54l10
6258a12J32R2j39J50l29N4O3L6O3pK1J58l34L39r2j76lq4J86k1r8O2J95j63M09
6283D02m13J40r4j18Q2j30j5k3K30K0j74J3QJ49j55j1K0L14k12J38k03qoJ44k05
6308a07o9L00n8k55M58l17jN3J44j13J86n66N32k05J75j43j17O85q99L63j6K5
6330E5j1L1j91J82K3P3j09q5J64l04M67n18K46M0j5j34J95O9l66K99n8N7l1J04
6354A83L1l11Q7N5J02m77K85J73L83o03j64K91K46m32M73l89J15J17r9l11L63
$$ y = [240, 292, 259, -2, -245, -6, 42, -64, 18, 19, -97, 322, -68, 118, 207, -184, -92, -36, -17, -116, 23, 105, 247, 12, 86, 17, 25, 312, 150, 56, -197, -107, -139, 138, -19, -393, -168, -14, 215, 214, 241, 192, 47, 242, -142, -81, -99, -48, -18, 148, 167, -208, -300, -31, -119, -153, 11, 13, 107, -102, -245, -270, -93, -82, -164, 181, 30, -189, 14, 156, -156, 198, -112, 20, 112, -27, 123, -206, -152, -89, -53, 10, 3, 24, 182, -152, 187, 95, -81, -84, -168, 18, -3, -101, -39, 156, -7, 402, -11, 129, 35, -83, -1, -131, -146, -169, 61, 81, -93, -80, -72, 77, -78, -89, -69, 245, 33, 171, -32, -40, -46, 98, -107, -176, 124, 66, -189, 269, -48, -49, 4, 148, 35, 221, -345, 187, -18, 157, 14, -103, 582, -317, 46, 30, 55, 44, 75, -116, 66, 89, 162, 53, -32, 132, -172, 295, -223, 23, 63, 48, -86, 109, 178, -188, 111, 53, 110, 79, 183, 214, -97, -10, 45, 147, -330, -45, 128, 511, -92, -256, 35, 281, -151, 322, -67, 48, 165, 66, -245, 118]
6375A18J22m79L59oj09j37R5Q1j02L03l06m8J00q9O3j03J51o0K52j76r0L7J99
6398A75j64k03K24O6m3O2k78K42j58K37j1j65mk5LP0j58j23L05l9j52K09k38L5
6422a33M6%j42J62j2K98k70M2q8L54l10J49j69p6Q5J24l5j30K72j99M1J14r0j74
6446a41J17J21J42j07J21pn81J53N04j25n6j59j00L08m80K34J90k19N2K88k31
6467B4J11J0k10K45L0J25k60J94l57M42l71m7K16m31M36p8j76j65L56j74l46L96
6489c0j85L92M8n58L19j66K20j0j73j3L50l04K13k59J75P5j12j74L84m15J66K81
6511B24j55j46j92P4K72k02qL82j80j84L6j60K98l5J10O9k46P2J34k04j16K61
6533A04q0K5q5j62Q8J64r8M7m6j64m8K31j21N30k97O5j64m0K49j35j85J71J02
$$ y = [118, 240, -239, 120, 114, 5, -132, -37, 44, -58, 245, -61, -109, -9, -98, -35, -138, 13, -47, 205, 29, -61, -24, 175, 11, -192, 32, 98, 55, 117, -161, 81, -77, 160, 149, -16, -20, -45, -42, 28, -130, -253, 52, 13, -139, 70, -168, -133, -87, -87, -229, -67, -79, 219, -51, -9, -97, 257, -53, 96, -73, -149, -64, 60, 25, -105, 167, -32, 9, 123, 33, -141, -24, 97, 239, 132, 253, 246, -335, -182, 322, 197, 141, -18, -118, 190, -290, -56, 134, -85, -33, 255, 24, 135, 145, -65, 180, 210, 335, 75, 269, -88, 354, -17, -64, 152, -279, 157, 79, -97, -262, 94, -80, -426, -30, -215, 177, 225, -333, -14, -180, 40, 30, -143, -156, 194, -110, 103, -156, 19, 94, -18, -192, 192, -223, -57, 224, 69, -77, -269, -195, 77, -125, -133, 249, 69, -115, -79, -239, 59, 24, 134, 203, -43, 29, 163, -41, -157, 104, 24, 49, -36, -198, -110, 54, -44, 3, -43, -207, -255, -24, -145, 385, 88, 153, -11, -51, 198, 63, -122, 49, 151]
6556A51l49R1Q9o2N8K1J7m2J28j27J2P1n4L9Q8j83M0J71l06k3K24l7j75M9J65
6581E6p8O7J0j75L3L68l77J24l69K1K26K24K8l12Q5K78Ql78M84l90J29j43J17
6604C6O1m8J0j53k33P00n84K06j64J67o6J15l5k69K11j21J35J89O6m09K88k50
6626a48K37k72J1J78k50j7M06ml39o5J25L10r2N8j23n4j28l8M27m54J46l2J86
6649F8l52K21Q9J02j33P2j64l26K57l2L29m3p7j1J21L2J14j04j89l9R4k14L52
6672A67j09J73j58Q6l14J21PK18j50K85n27M02j59k49J37K65l65N15o20K90j01
6693h6j55M08k08K29l3k71o1L33p5j72l3J14o7j53J27R0J65K78k55l44J59J28
6715A18m26M54k88K45K00m06J74L00l91j07K3m3P7Q6j56M7J95k47M8j07J93j25
$$ y = [151, -198, -107, -18, -80, -22, -1, 16, -26, 102, -25, -13, 58, 4, 43, 131, -52, -12, 159, -147, -170, 54, 17, -158, -109, 56, -22, 45, 55, -120, -87, 281, -96, 28, -341, -320, -94, 130, 158, -154, -69, 209, 217, -161, 323, -67, 62, -81, 36, 97, 49, 59, -94, -327, 373, -211, -5, -169, -2, -68, 47, 12, -257, -46, -167, -32, 157, 223, -186, 102, -148, 89, -183, -172, 6, -244, -261, 145, 141, -198, -263, -138, 172, 80, 138, 15, -39, -167, -205, 222, -232, -86, -118, 68, -284, -63, 26, 128, -5, 67, -97, -423, -166, -198, 131, 88, 11, 0, 121, 153, 267, 163, -26, -65, 29, -185, 167, 58, 231, 73, 159, -155, -34, -27, 191, 41, 326, -201, 201, 42, -207, -70, 195, -170, 345, -275, 15, -86, -241, 167, -41, 188, 155, -116, -177, 156, 81, -91, -124, -10, -77, -230, -103, -13, 152, 430, 175, -169, -10, 118, -308, 146, -142, 103, 303, -103, 71, 371, -20, -127, -104, -147, -70, 16, -140, -93, 102, -145, -97, -204, -11, -136]
6737a36L23j16j04j02J13K78k76L3k38MN60l68J23j81q5J30J98l03Q1K2Q4j53
6759a13J61o6k90M44l03K03l60M55l78J88J75n7j11j56K28J04k00J98j35l28K01
6780a40J70j32L30k10l3L9M0r6K78n61K77k07K40k3o8J60Q9r2j2k07K29j96K0
6803a05KJ51M2l85K75l0l3J65K35n20K73qj3k2J1Q2j40L59k91r7K55N7k8j7k10
6828HQ0j3l05L20o5K93r3k06J3j46K57J20k50j01L47k41L8P2q3L8j13o9L0J39
6852G0J24l61R4P8K56n38M4J51K51k14K19j29k06K25k40J63n9J94k68K70k79J16
6874c9j12L99j45j99j30j2K12O0L46k01l06L45k18r6j1J61l07L3J20J98k45L37
6896A90j70Nj23M3K61l81K83j30J45K29k66k78J15%J44j99O5j19O0J5L32l44Q3
$$ y = [-136, 187, 71, -33, -135, -22, 256, -20, 13, -225, -221, 339, -29, 94, -87, -172, -42, 156, -147, -66, -44, 40, -113, 48, -18, -308, 136, -167, 36, -324, 131, -247, -59, 116, 59, -52, -208, 20, 124, -76, 122, -13, -341, -140, 30, -102, 228, 18, -15, 24, 64, -32, 246, -315, -38, -245, -5, -28, -96, 64, 153, 61, 49, -158, 71, -125, -105, -103, 48, 90, -295, -20, -50, -83, 82, 317, -203, 70, 62, 49, 27, 38, 120, -20, 339, 48, -49, 206, 263, 235, 218, 8, 88, 75, -230, 90, 25, 318, 225, 19, 32, -114, 143, 263, 13, -88, 259, 18, 56, 128, 45, 83, -30, -99, -69, 70, 194, -167, -73, 5, 261, -277, -233, -82, 169, -45, 174, 45, -161, 64, -176, -13, -72, 122, -146, 124, -155, -39, -151, 248, 103, -96, -226, -238, -26, 34, 380, 179, -127, 218, 0, -96, -107, 54, -253, -220, -100, 98, -147, 190, 20, 25, -98, -55, 206, -175, 108, -22, 123, 352, 86, -192, -77, -77, 67, -132, -67, -186, -126, -111, 221, -123, -40]
6919d0P5q5R2j16k32L72k31l0K50k6J11j87J62l17K71m5M9l33Q8K45Q5l22J84
6942B0m1j52N13o32K60J87J1rk29k24J46J95p1J87k68j08L95j92j17J15j73J79
6964hk69L66M6j57L25m32L0N0L24j99j9j88K90k09O2j42J92R9n2j34k80M50j83
6987c8J08j65J73k54M15m28j14K37k28L51p6p9Q0O5p7J9J36m04K04L3p3nL66j90
7011E6J46j69l1qJ25l8r2J7j21j19K25o3j60J29j40L06o6Rj25K00j88N6J11j67
7035a07P9L7N7j38L2k13M24l28K26m2N1Q6k29r1J91O5k25L36P1k79K80j85Q9j47
7059D0J63r9j13m63N65mj81N8K20j67k49L49j94L31p4l22K96J0l93L14j06R0%
7082G1J22k09J94m8j52K21j08J58k26R0K8j17K74k67R2k09J35K76k2m37K48j09
$$ y = [-40, 35, -50, 42, -74, -306, 66, -165, -195, 55, 29, 140, -47, 115, -202, 69, 24, 73, -260, -172, 73, 158, -164, 20, -21, -173, 340, -292, -32, 155, 166, 157, -72, -296, -150, 45, -26, 161, -107, -215, 180, -12, -129, -14, -187, -8, -277, 89, 135, -22, 303, -129, -99, -49, 275, 76, 57, -131, 159, -50, 12, -130, 62, 161, 109, -25, -305, 145, -38, 70, -95, 78, -176, 239, -189, -303, -66, -294, 57, -19, -98, -18, 47, -30, -11, 125, -279, -75, -42, -115, -120, 246, 56, 202, 33, 2, -6, 119, 81, -11, 6, -115, -234, -9, -72, -232, -103, -243, 63, -3, 6, -119, 81, -107, -51, 60, -107, -28, 9, 66, -72, -40, -253, 171, -157, 69, 27, 78, 164, -65, -156, 35, 100, -125, 211, 282, 3, 283, 98, 187, 40, 203, 104, -9, -472, 93, 89, -92, -34, 186, 19, -230, 119, -75, 256, 182, -140, 156, 166, -227, 87, -19, 71, 71, 193, -16, 178, 130, -22, 199, 91, 249, 23, 113, 141, 24, 298, 31, 123, -86, 49, 325, 303, -134, 114, 5]
7104Ej11K45p6k57N01j61l66N95k37k53O4L55n05J57R3r7l41L38J46m40K48L30
7126B33l7m3k68p3mJ24J01j66J32k23K88J0M4k87J84P6k5n5q5N2J99J42l99k46
7150c26L68k44L45k71q5m9L04l88L81J03j73J14J22l98J49K86l05o5R2K06l50
7171a84O1J40J67k70J81j01j12J84K2k80J02J02k44k5J47L44m81j19L87J29j99
7192d9oK71m40L75j38j12P5J40j0K4j46J10l95M87j02l52J78q4N2n3J30K00l84
7215b29K76O3j61j18J77l2J65O0j98K96l9m7j72J75K96l04j89O7k02K30j78K43
7237A79l3j26j32q6o0L14l43L24l37L27K63l40k20L73k62m0J83m40M89j06J93
7258A20j4r3K37l26L5k5K34L8l91K00nJ50p6j48p5L14k14J76p8l02P35o50L06
$$ y = [5, -106, 139, 63, -194, 307, 146, -220, 375, 138, -115, -51, 304, -201, -44, 49, -48, -389, -51, 95, -345, -97, 233, 196, 153, -115, -188, -192, -68, 33, -133, -1, -224, 64, 74, 118, -169, 15, 91, 66, 11, -74, -22, 177, 319, -80, -326, 42, -202, 143, -128, -213, -262, 42, -346, 35, 138, -35, 79, 201, -197, -48, 238, -67, -132, -40, 166, -184, -123, 17, 184, -86, 95, -6, -118, 66, 88, -192, -90, 12, -232, -257, -110, 234, -247, -366, 21, 150, -49, -55, 216, -224, 151, 13, -99, -24, 116, 106, 130, -16, 94, -301, 186, 84, -268, -90, -174, -122, -175, -45, 155, -229, 47, 110, -51, -169, 8, -24, 141, 201, 3, 299, 260, 213, 41, 216, 512, 208, 19, 86, -116, 114, -64, 179, 146, 20, -112, -198, -258, 56, -287, 37, -300, 27, 290, -50, -270, 103, -159, -199, -16, -456, 33, -73, 120, 106, 13, 250, -76, -41, -66, 168, 206, -185, 15, 10, 160, 84, -64, -139, 175, -39, 137, 59, -243, 492, -158, 148]
7281A48l90J99K9K33l70J28k29L1L44K59l21R8j97K44J1j51k55J69m7lJ26j45
7303h9Q7L0J48j58j73Q4L03p8k95R4K15k79J79j45J51Q6o49O82q3k6J2j36j14
7326a54M58l45J31L3o41N84q2K35j05j65K67l1k42K24J0Po3k02J82J9o8J5k00
7349a33J0j4K13n2j08j10K25N6J07j04j19J56k27m9L04j83R9k60O6P9N8j29J02
7372a3N7K48l85J28Q6k86j82M74L4l49R6o8J41j48L6m1O5Q7P2j00J09J5n9L85
7396D02m86PK22l63K47k39K15j44L07j38J6R8l36L35J62l41J44j40J59l77J27
7417a23L00k91j21P06p38L26J08o0l5k16j11L41r0k56J81JL4mL09m33J39l8J15
7440D4k58K55J06l5P1J35l37j0j21J59j40K64j32J26l24P7K05k21M04m16K2k23
$$ y = [148, -242, -43, -14, 219, -151, -23, -252, -221, 123, 382, 61, 159, -38, 206, 217, 66, -189, -20, -67, -70, 56, -89, -2, 28, 176, 18, -155, -71, 232, 154, -141, -47, 168, -111, 68, -77, 74, 160, -489, 193, 110, 84, 96, -40, -154, 304, -41, 90, 123, -518, 66, -16, 219, 114, -51, 216, 185, -57, 167, 177, 184, 121, -81, 101, 120, 52, 67, -133, -123, -137, 76, 24, -84, -194, 31, 87, 194, 90, -29, 127, -100, -149, 155, -28, 71, -189, -123, -44, 14, -115, -13, 44, 292, -93, 35, 121, -165, -347, 127, 161, -188, -92, -160, -19, -167, -131, -172, -107, -20, 52, -48, 61, 76, 17, 402, -84, -77, 145, -218, 29, -210, 5, -139, 168, 30, 46, 144, -192, 143, 305, -36, 108, -32, 127, -250, -123, 177, -114, -235, 471, -267, 59, 167, 107, 72, -144, -255, 86, -4, -260, -79, -78, -44, -48, 261, -172, -33, -71, 44, -214, 41, 147, 112, 183, 318, -19, -29, -150, 9, -131, 133, 1, 127, -197, -120, 85, -136, 268, -148, -126, -349]
7462c49K61Q2M2K42j03k66L8o2j22N2J9K82l46p8L10k91L60k95L21R7l64K64j0
7485H4N0l8j96J8m1K44k47J34j34k15P5P9K41k35nJ21J04O9J17l88L43k22m7J24
7509C5K07k08j55LK47kj41k16K06K06l31K56O4M8j47k5q1j10L28p0l54K8J95l15
7533c32K12J91J56j44j94M43n64J06N4J35m5m4N0k8P6Rj62K17N4j09k49%k1m2
7557b31K39N7l4p9M2m8J41MJ81k98M7K3J0K03l79m0p5K71R2onl32M7K36Rj5J57
7584B17k70j1J86N3k25K9R0J37n9k17q7L17k99K84p4j96L55l06j93J69p4J14j14
7607a74J68n0j15L15K04l88M9R9j11r1K15l6l46L8K11j50J80j82J12k6j00M3K53
7630A18j62l5K24l45M4K12o1J15j24q9P1j03J85K10k79J1P0m07J70L12R7n79K55
$$ y = [-349, -88, -6, 36, 278, 175, -91, -53, -115, -237, -185, -166, 116, -230, -308, 2, -289, 71, -224, 97, 194, -170, 94, 84, 134, 96, -100, -82, -123, 121, -126, 8, -126, -341, -266, -187, 54, -181, -186, -65, 39, 108, 225, -163, 180, -42, -89, 35, 242, 34, -121, -118, 129, 127, -14, -230, -24, 182, -149, 107, 171, 219, 72, 47, -34, -144, 184, 114, -240, -212, -17, -332, -120, 71, 227, 83, -111, 332, -232, -126, -72, 63, 18, -26, 24, -4, 72, 81, -81, 136, 190, 81, -168, -168, -189, -231, 8, 65, 31, -48, -6, -54, 87, 91, 272, -26, 21, 44, 54, 257, -122, -162, -237, 34, 126, 120, 115, -217, -170, 66, 75, 60, 217, -53, -64, 122, 175, -50, -21, 69, 206, 147, -70, -157, 160, -139, 145, 71, -125, 230, -76, -269, -100, -174, -60, -174, -6, -56, -171, 144, 348, -40, 9, 108, -3, -94, 121, 85, -261, -223, -12, -162, 18, -164, -52, -78, -178, -135, 118, -44, -79, 145, -200, -156, 56, -5, 110, -14, -103, -32, -135, 50, 260, -19, -8, 62, -345, -175, 137, 234, -345, -90]
7653i0M6K72j27j69K2j86J34k1R5j16J60OO4N0o2J27m28J44L20j87k29L52k57
7676h0K27j44P1j92K58j54J18j08JJ28J4p6o6P7k48J24l2ML06l46L48l5j67M7
7700G5R5j52Q7J2k50j50L70J44j76M5lj08j26K98k13J47K1m4K27j86j27K20j98
7723HN4k88L93J06j01l03J32o7JJ19j66K80j42k85J41K20j22j19K54j5m55M03
7745D8J8k6J37l00k3J49k67N20j19r3R1k41J08J13m67K76O1k00L93k09K85k62
7767hO4p0l0j63K45L4J36p4r6j53r2L84r7J05p0j73q4j96K37J59L5Q4j85j0j55
7792a73P0J99j51n7K95j00j9J7q5J36k13M8JM0J6k34n2M74q0M3l39L84r4l25J87
7817a2J06P4m03L10r4K54k78j53K60K33n63K51K00m4m0j79k2J71j14j61L37J31
$$ y = [-90, -44, 228, 101, -68, -46, -232, -98, -119, -24, -140, 20, 26, 90, 140, 78, 205, -223, -79, 241, 54, -175, 177, -80, 147, 3, 74, -118, 140, -14, 104, -4, -3, 125, 139, 63, -3, 74, -174, -50, -82, -78, 228, -118, 230, 195, 28, 75, 170, 18, 105, 117, -133, -283, 87, 231, 55, 100, 97, -11, -137, 161, -52, 95, 116, 72, 299, 113, -14, 206, 8, 62, -226, 167, 273, 172, -131, 1, -66, -65, 54, -112, 168, 26, -259, -118, 102, -20, -139, 115, 100, -355, 48, 66, 40, 177, -123, -146, 3, -264, 256, 137, 44, 135, -106, 2, 115, -352, -76, -15, -215, 178, -31, 254, -8, 56, -14, -44, -207, 38, 72, 208, 134, 38, -115, -207, 177, 80, 185, 115, -58, -142, -338, -101, 58, 93, 177, -8, -18, -173, -103, 96, -55, -112, 183, 83, 64, 81, -4, 132, -81, -33, -32, 8, 24, -210, -262, 212, 132, 175, -164, 220, 126, -199, -12, 94, 168, -235, 75, -19, 235, -43, -196, 64, 297, -266, -15, 185, 141, 101, -78, -100, 71, -43, -204, 133, 264]
7839B64k26j79K97J62l19j56J80j44L08j48J17k1k49R1M5j04J15K75l07J22k23
7860a00O8K01j38j15K75j35k9k6k70K34j3K07k9j55j37J64j40o6J51J56j43Q8
7882D8J19k36k8J18K25k95l3L2J34K2o5k62M61k79K43r4j10j48J02k2j4l4J49
7905C3K12m71L80j57k2J34j53P7j85L25j38N2j11m33O90k4k48J36j88k8mJ69l5
7928A1o3K14k23j54L36k35R6K70m60L45p1L0lj02J02k25J95L0l43M18n31J49N39
7951C25j2l90Jl6O5J05j3J06l91K68PR2k8n9J67m79L07J46j34j9k75M39j28O2
7975A26l12L32l51J02L23k76j25K4J20N5L07k87P7j26N0j37K92j41J89m87M16
7996A71K5r8o1l9Q9k27J97J19k26oj56Rq9L02J9l4R6l65M37r9J18o6K81n23K15
$$ y = [264, 38, -141, 156, 318, -1, -157, 23, -121, 187, 39, 156, 135, -114, -23, 22, -82, 33, 308, 1, 123, -100, -32, 169, 31, -84, 191, 56, 27, 1, -269, -35, -48, 159, 130, -25, -162, 2, -138, -204, -53, 103, -40, 48, 167, -69, -97, 21, 246, -49, -82, -50, 84, 106, 41, -221, 240, -39, 204, 110, 0, -148, -46, -68, -82, -116, 33, 245, -226, 154, -3, -25, 109, -44, 33, -152, 173, 35, 87, -24, -457, 233, 209, -39, 97, -91, -119, -123, 46, 11, -52, 162, -61, -215, 121, -114, -18, 252, -208, 137, 66, 96, 93, -9, 93, -132, 63, 93, -250, 168, -363, -214, 325, 313, -77, -76, -112, -47, 58, 45, 151, -240, 28, 35, 127, 99, 40, 207, -272, 35, 181, 47, 28, -247, 192, 64, 126, -186, 146, -205, -103, 220, -56, -181, -157, -37, 18, 325, 38, 115, -11, 39, -98, 194, 53, 242, -245, 171, 196, 98, 37, -2, 87, -140, 57, 176, -50, -56, -212, -203, -292, 10, 29, -5, 91, -274, 163, 64, 182, 116, 397, -126, 89]
8021H9l90K43K41O8k42Q6j02k0J38j07K74l38J16k01J83k18L09l6j30J30q6R5
8043A02k94K86k34P0L6J04k0K72k14k10J38K76j41k58J89J19l21m4j57K00n1J54
8065BR1k97p4L59L7k61J8O3K46j37l2j58J82K32k14m51K96q7L6k2M25k69j76O5
8089a26J55O7J00k16K6K46k05Oj3L69l41P4k26O8L03m59J29r3Q7oj95K55o5K30
8113A70l21J35O9K7J8k16k9q3M99j50R0j30j23k3R8J95l81K15k33K21L0o1K1j78
8137a40K50J12m63K47r9K06P1j08j18J53j22n1Q0M9K65m07K36r8k6n0L13l71K49
8160A78j93L03k64L6m0j26l4M2K98j51k55K04J9J44k94J67k22K40Q1O1r2R9j96
8183El2K15J88l71JM3m4J29
$$ y = [89, -301, -58, 183, 251, 9, 95, -7, -27, 111, 4, 278, -60, 56, -145, 38, -180, 129, 93, -37, 93, 7, 102, -192, 94, -140, -70, -34, 70, 50, 322, 108, -102, 36, 312, 171, -87, 102, 221, -100, -144, -301, -101, -152, 2, 93, -204, -278, 81, 118, -143, -125, -62, 184, 47, 15, -143, 39, 271, 57, -394, -98, -185, -149, -171, 254, -15, -191, -126, 29, 96, 196, -20, 6, 252, 47, 53, 40, 409, 68, 142, -84, -16, 287, -172, -43, -136, -49, -55, -250, 5, -60, 170, -151, -16, 53, 80, 98, -118, -147, -230, 269, 119, 209, 79, -44, -67, 31, 226, -155, 60, -173, 48, 78, 17, 38, -140, 110, 222, -241, 6, -93, 113, 184, 76, -42, 111, -11, -62, 18, 67, 332, -75, 161, 63, 37, -13, 300, -71, 178, -15, 288, 24, 60, 20, -106, -140, -98, 200, 49, -206, -2, 17, 161, -133, 34, -188, 52, 133, 194, 102, 201, 5, -27, 188, 376, 5, 6, 49, 5, 134]
8191A34
$$ Imaginary data points
##PAGE= N=2
##DATA TABLE= (X++(I..I)), XYDATA
0@%%%%%%%%%%lPj2J6j6J6k0K8l2L4m2N1n9P0p9Q9j04J18j33J52j71J93k17K41
34A27k70L02l34L68m10M57n06N59o19O86p58Q41r33J037j160J300j464J663j902
53a016K200k587L108l856N026p121J1983m1345j0393J32824L1174j06921j14738
66a01662n953L0938N1434Q8337O0420o0527j12279o1768m404L1942R4298R8944
78A09720k857r7051q4902m0585r63P0598J18938M1725p5693r1361m1495j6245
90a10171L1532J03419P7737m5685r2197l2819r846k1425M4601J18101N3468p1477
102D5238r3451m3297j3966K2376P9156P1522m816m8398m5644n0155k8036N3371
114e6100R6186L5998l6329n2450n7426m8857K6537J04538P7388j2315n4696o2749
$$ y = [0, 0, 0, 0, 0, 0, 0, 0, 0, 0, 0, -3, 4, -8, 8, -8, 8, -12, 16, -16, 18, -24, 27, -32, 38, -41, 48, -56, 62, -71, 81, -90, 103, -114, 127, -143, 159, -175, 193, -217, 240, -266, 293, -326, 360, -398, 443, -490, 547, -613, 687, -777, 886, -1016, 1184, -1403, 1705, -2151, 2875, -4246, 7737, -33608, -44001, 88823, 119997, 13076, -101662, -107615, -76677, -25243, 63094, 123514, 62987, -49292, -111060, -115464, -83522, 10776, 109720, 106863, 9812, -75090, -115675, -116638, -46040, 72898, 114623, 38930, -52431, -93926, -110171, -78639, 24780, 102517, 56832, -35365, -68184, -78030, -99455, -54854, 63247, 116715, 45238, -48213, -91510, -105476, -83100, -3944, 67578, 62762, 14364, -31280, -81435, -109471, -56100, 40086, 76084, 39755, -12695, -70121, -118978, -92441, 12097, 89485, 77170, 22474, -40275]
126d0275o7654j6086Q1725J02575K4390l6607m4651o3017o1806K3660J07509P5533
138H5296j6004n5663n3442m5835p24O6102P1523J5109k5871m2002o0716m1682
150a03909L4358Q5673N4370r66l1340n6047o3084j4174N4523O6921L3094J44l6237
163B3326o8182m4313K7109O5253M6060J5789j4376o1372p4855j1257O5960P5163
175D4305L3771r823m9511p3198m3078K7542O9358N8055K2121k4540o5892o3734
187g4624o318N0368N9997L4419l994m4459n9019k7028K4421N1621M6936K0117
199G2437k5770o3604n1969j344L9297N1238M3077J1976l8534o6242m1350J1979
211e8809M7203N1198K9350j2330n1106n3386j6447L1006N6214M4322L308m1620
$$ y = [-40275, -107929, -124015, -42290, 60285, 84675, 48068, 3417, -59600, -121406, -97746, 9763, 85296, 69292, 13629, -39813, -85648, -86372, -20270, 51253, 66362, 40491, -1511, -62227, -103909, -69551, 16122, 70492, 69526, 38186, -17861, -80945, -95119, -40596, 26325, 59419, 59563, 23326, -44856, -89169, -62060, 3193, 49253, 65042, 50666, -10706, -85561, -96818, -30858, 44305, 78076, 68253, 18742, -54456, -97534, -69992, -634, 57421, 79542, 55002, -10890, -74624, -80942, -30574, 29423, 63842, 59848, 15389, -43630, -70658, -46237, 5384, 52320, 72437, 46667, -16937, -68906, -70250, -30953, 20285, 63362, 75338, 36804, -29438, -70788, -58809, -11606, 39592, 68942, 56612, 5506, -47880, -64327, -33321, 22893, 67215, 70523, 28903]
223B8903n9583l6555J0775N2255N9503K6832k2514n6406n2843j8437K9964N9249
235B1143M8181M250l7745n0959l3123L379L8635M7874K4818j3899m3097m5066
247c5609j6295K5924N1058M0419N162l0939n1127m2048q27M3200N3240K9653n637
260F6174l7963n3133l1136J7926N1320M3804J1689k3379m8253m3108q55M2563
272d351M8923K3675j0869m0716n0701k3074K5307N0708M0386J1454k3147n1070
284c475m4580j801L6622M2698K7446Q23l1707m7352k3661J6347L5646L1696J6642
297E5344j2932m4605m2648k873L2939M0820L0604M780l5808n4911k9208J4572
309d3926L8752M1616K6522j1580m9903m6456p136K6441L8627L4080O170l5229
$$ y = [28903, -30680, -67235, -56460, -4205, 55298, 82130, 59616, 3210, -49633, -68070, -38106, 21143, 69324, 73574, 35829, -15130, -48253, -44874, -6239, 41635, 66453, 52554, 9457, -35609, -51904, -25980, 25078, 65497, 70659, 39720, -11407, -53455, -54282, -11082, 42158, 71811, 66174, 28211, -24922, -56058, -38132, 13188, 56992, 68681, 45302, -2951, -46059, -46914, -4351, 44572, 68247, 57378, 16662, -34039, -57113, -31806, 18902, 59288, 70742, 47595, -3475, -48055, -49856, -13234, 29464, 56910, 57733, 26026, -21326, -44987, -28640, 7006, 38702, 55344, 42412, -2193, -44841, -47714, -14775, 26045, 56649, 61429, 25621, -29290, -58498, -43926, -5174, 36442, 62964, 51384, 1481, -44975, -52111, -25670, 12957, 47037, 53207, 17978]
321A7978m9871k0166J7236L4317L6182J8576j8843m7878l7513p38K4888L6626
333A0794L3766P246l1979m5542k3006O248K5334L4636K6268p161l7029l2973r760
346d3158J1957K9617L6043J1215k8099m2042k4578K144K6488M3101L0895j0670
358D2913m3960m0652j4920J2525L9772M3709J2168k8537m2165k6411q10K6028
370b0340M0575K4315j4051l7631l0590q915J6198L5522L3464L006k8181l4933
382b1561k2463p70K3354L7632K4386o713k8160k9841j8052L547K8089L3928J2890
395C6266j4231k7969k6361j0221J6961L5822K6637k968k7553l4268k2349O413
407d3821L5836M0930J4870j8439l7663l4679r955K2653M0595K8206j873k7728
$$ y = [17978, -31893, -52059, -34823, -506, 35676, 54252, 35409, -12469, -49982, -50720, -25832, 10794, 44560, 51806, 19827, -25715, -48721, -42473, -17139, 17497, 43765, 36604, -425, -33398, -43158, -31201, -1584, 34459, 45674, 17575, -24467, -49045, -46901, -20413, 22688, 53583, 42913, -1047, -41699, -56619, -44094, -4322, 39387, 51555, 23018, -19147, -45558, -46368, -20340, 20235, 44550, 30499, -7132, -37722, -46637, -30439, 5083, 38547, 41553, 13372, -21561, -44024, -44794, -21440, 16192, 40578, 33865, 5705, -24136, -42188, -38641, -10552, 23376, 36266, 22035, -5934, -32295, -42516, -25555, 10267, 36904, 33936, 6383, -27885, -50234, -43821, -7985, 32945, 47815, 29376, -8287, -42966, -52921, -30268, 10327, 38533, 36660, 8932]
419H932l4191j8936Q530L1028L0742Q276j7570l1099k4612k796K2034L2183K0725
432C3246l537k3932k9546j8318M340K4949K9730J6456p212k5040k7682j4177R680
445c1043K7035K6317P878j5852k7926k2858j387K2061L2462K0065q213l1624l2517
458c5602j2877J5742L5617L1939P134k2896l5881k4819j0K5573L3243J8485r391
471B6257k7492k6191q906J3542K8144K3270J425k0130k6080j6648K204K1868K8577
484A9840J4354p971k1870k3455j4829N862K5471K7619J0505j1227k3549k2774
496b2024r070J3570K7535K0267J03j8513k6060j7254O310K8424K8830Q947j5502
509B5563k8934k6695o475K1246L4532K1625k655k2488k9628j7700P488K7177K4823
$$ y = [8932, -25259, -44195, -35665, -4637, 26105, 34381, 16811, -14288, -38900, -41696, -19662, 12521, 33246, 29709, 5777, -23769, -42087, -37747, -12798, 16932, 33388, 26176, 1136, -26546, -40723, -31043, -4008, 22309, 30187, 14335, -13591, -36449, -37836, -15775, 16687, 36752, 28539, -3085, -35602, -48479, -32737, 2880, 34819, 41953, 19057, -16824, -41643, -41653, -16080, 17163, 35648, 26257, -1235, -27426, -36332, -22790, 5354, 28624, 30049, 9919, -16161, -32809, -30605, -8737, 19840, 34194, 26223, 4353, -19102, -33931, -28069, -2598, 25021, 35526, 24299, 750, -22024, -31094, -17524, 10011, 30278, 30381, 11868, -14192, -31446, -25136, 3288, 32118, 41065, 25563, -3371, -30066, -36541, -15295, 19237, 40862, 38207, 15719, -13909, -31609, -24121, 3056, 27879]
522B7879O347j1660k2180k0873m166J7879K5658J3749m171j8102k2505j3037O642
535a8540K1946K2323J0488q203k2621k4353r255J2391K3548J9804N820j1711k3668
548b031j9711j201J8422K3460J3743n638k3008k5250p328J5256K5925J9904K679
561C5222j7486k8811j9698K878K3085K5787J3372o878k2323k3514r088J0984K1872
574E402J8946L613j5314k1463j2779L506J5285J8419J0552n053j8310k0457j0007
587b7660P923K2818K2015O139j3179k2510j9050l851J3448K2161J6225K77j5089
600I667k1188j3627M715K1010K0948N284j2447k1374j8284k145J7807K6077J3028
613B9471o437j8325k0481j2205N408K0949K0933O653p735j8245j9917n879J4584
$$ y = [27879, 34226, 22566, 386, -20487, -24653, -6774, 18884, 32633, 28462, 10360, -12145, -25182, -18540, 3406, 25729, 36217, 28014, 5393, -18960, -28215, -15824, 7724, 27528, 33348, 21637, -2031, -21742, -22943, -4521, 18939, 32682, 27044, 4036, -21214, -28542, -13286, 12639, 32543, 35222, 17736, -11075, -30773, -27895, -4810, 20977, 34349, 27471, 5148, -18366, -27454, -16470, 5402, 24348, 27961, 12647, -8816, -21595, -18089, -2804, 15615, 26167, 21114, 2804, -17653, -27660, -19737, 3081, 25096, 31235, 18056, -4454, -23504, -27355, -13907, 8254, 24479, 24756, 9667, -11521, -25148, -20433, 577, 21525, 26809, 14362, -7012, -25296, -27441, -9634, 16443, 29471, 23034, 4709, -15772, -27977, -22569, -1620, 19313, 25966, 18231, -14, -19931, -25810, -11226]
626a1226K1480J0632k932j1568j6035j1822M355J7374J6133O057n109j7324k2458
639b2443p817J5282K3856J4629J955j1491k3055j7724L939J8893J6184P850j949
652A8109j4454k1677p163J3593J9007J2555J612j2841k3906j3892R558K0226J3928
665A4655O012k948j7017k0650n609J0892J4754J2448R406p153k2459j6202M987
678a8884J3465J0752R535J139j5836j9790l024J0103J1292J3342J1025q708k6103
691a1692j7354L499J3915J7242J6404N74k1133k1836l640Q217J0290J4634J0484
704A9604r607k1973j0631M494Q797J3703J4930k358k1981j7847J027Q075R781
717c986J5644R598j1091j9263q577n73J255J3116K0585L794j7805j5461l775J08
$$ y = [-11226, 10254, 20886, 17954, 6386, -9649, -21471, -17116, 258, 16391, 22448, 17339, 15, -22443, -30260, -14978, 8878, 23507, 25462, 13971, -9084, -26808, -22869, -3976, 12208, 20058, 18109, 3655, -18022, -25185, -11592, 7415, 19970, 21582, 8741, -15165, -29057, -19499, 727, 14655, 20667, 17719, 702, -19948, -25557, -14665, 89, 12537, 21943, 14790, -7669, -23871, -18884, -5419, 5333, 14868, 16007, 171, -19619, -22643, -12540, -1248, 12094, 23119, 14411, -11692, -29046, -25547, -11632, 5610, 22014, 22588, 1455, -20381, -24021, -15804, -5514, 9120, 19604, 9997, -11976, -22607, -18113, -9316, 4387, 19317, 16959, -5022, -22869, -21842, -13767, -3986, 11658, 21256, 10165, -9098, -17675, -18248, -16993, -3877, 16708, 20502, 2697, -12764, -16539, -16431]
731a6431P899J7824J0560j0894j6869p370l069K532J8261K1121r08j9841j6140
744a3325p606j430J3182K5155J0075j3719j7111q028m453K820J8826J6073n285
757A5174j4969p814m628l033J1542K1135M833j4414j2835n762n220L203J8019
770E231J4177k440r105p402j1578q798J0880K0401O856o148o285r158j2609J227
784a4751J9325J4166k156q258r812j4370n377J6993K1305N168o989r386j4831
797h973j4372O831K2236J4043k637p746r856j3343k447J4019J4379J687m157o375
811C289j2035q742R444J6447O191k718k991q940j4563l290J2742J2769N184K300
825A5087m326j5963j2475N197J1955P122N534K104j0243j7423m399J1792J2942
$$ y = [-16431, -8532, 9292, 19852, 8958, -7911, -15281, -18350, -15818, 2443, 23564, 22656, 2815, -13325, -20931, -22361, -9179, 15976, 26051, 12332, -4779, -12807, -17260, -14440, 4386, 20459, 15174, 205, -7609, -12237, -15270, -3728, 17407, 22240, 7826, -5009, -10771, -15991, -12788, 5231, 19408, 16968, 7863, 461, -11117, -19915, -9035, 11366, 18222, 12074, 5789, -3369, -15978, -14751, 4574, 18740, 16584, 8326, -1486, -15856, -21233, -4240, 17065, 22233, 15244, 5858, -8973, -23345, -16514, 5722, 19765, 17128, 9382, -474, -13817, -16264, -2245, 12134, 13821, 9664, 3289, -8746, -17488, -8044, 8403, 14594, 11876, 8885, -55, -14618, -17908, -5166, 7603, 12787, 15087, 10761, -5202, -17677, -12480, -525, 6597, 12131, 14235, 3992, -13431, -17830, -6038, 6904]
838F904O750K091q821j7973r639P177J4683J1682O569m138j6671j6164L8J1650
852e862J0726P463L439p813j5686p226O722R683P304M198l655j2529r675K565
866a0346P895O560P242M305o999j4517q027K220P578J0387R803m66j1132j1914
880g411m639K298Q918J2040N483p499j3239o989L39P437J2299R375l699j4351
894C62j3030l044O841J3229J2245J772r903j3300o720j35O975J1477P893k562
908A2100j0356r244k660M308R040P651O39o782q324n982j155O500J1051O906j891
923A1801p975j0290p271P31J0335J1459M965l752r781j0318l954O235J1084O796
937A0065j98p045j0215p070K972J1343J0423L252o335j2111j0727l26R169J1225
$$ y = [6904, 13654, 15745, 6924, -11049, -20688, -13511, 1172, 12854, 19423, 15285, -1386, -17550, -17512, -5862, 4864, 12327, 15766, 7953, -7733, -14959, -8237, 1446, 8750, 12948, 9293, -3236, -12911, -10346, -2451, 4109, 11351, 15656, 8657, -5860, -13887, -11667, -4089, 6298, 16101, 15635, 4503, -7411, -12050, -9752, -834, 11206, 16689, 9190, -4049, -11038, -10699, -3262, 9037, 18412, 14713, 362, -12668, -15712, -8871, 4358, 16603, 18375, 8472, -4828, -11548, -11683, -4708, 6769, 14662, 12100, 1744, -7500, -10160, -5852, 3188, 10839, 11478, 4696, -3628, -9610, -10765, -4265, 6786, 13692, 11801, 3826, -6464, -13735, -13004, -2669, 8790, 13755, 10003, 222, -10096, -14050, -7815, 3269, 10065, 9867, 2822, -7393, -14463, -11491, -148, 10275, 13527, 7192, -4919, -15646, -15972, -6803, 4422]
951D422O360kp020j1415p031K948Q805P106L904j903q322q420j167O107P428M694
967F494J222n819r767o310L180P468Q052O269r97j0233j1204l119L929Q675R681
982G521M129o023j1399o198J664N566P920P106k227j0913q749m26O133P429Q646
997A0179K039q130j2240n088K721O271Q564P096j864q808p449k635J673O204Q261
1012F794L047n348p424m285n81L447Q813O979k508r316o512l027R17P870J1749
1027A0615M016p202r823n848k268L586J0336Q677k084p979o529l549J342P103
1041C93Q755J311o818p100m575j047N623R671N518l137o940o309m853J1P570R529
1057G602J937l522m655n635n032K434Q830O156j038m501n054n620o00P345R322
$$ y = [4422, 10782, 10780, 3760, -7655, -14686, -11738, -2933, 4173, 8077, 6174, -2148, -10568, -11735, -5628, 1800, 6494, 7716, 1897, -7870, -14180, -11000, -3532, 4520, 10789, 9792, -441, -11645, -14764, -10835, -2160, 7521, 11650, 5627, -5772, -11970, -10306, -4740, 3180, 10286, 8059, -2854, -11603, -12029, -5896, 1533, 10179, 12218, 4088, -8152, -13240, -10519, -4248, 4316, 11412, 9548, 740, -6709, -9344, -7671, -1467, 6794, 9841, 4493, -2931, -7216, -7797, -4350, 4463, 11442, 8934, -382, -6894, -9921, -9004, -1134, 10615, 14631, 7429, -2394, -8242, -10510, -6924, 3412, 12089, 10005, 2026, -4503, -8052, -6710, 393, 9148, 10459, 3641, -3459, -8034, -9081, -3458, 6213, 11731, 8594, 1654, -4655, -9508, -9497, -1927, 7602, 9539, 6017, 1362, -4273, -9305, -6871, 1959, 8115, 7077, 2576, -2478, -8098, -8698, -1353, 7969]
1072G969K327m083o872p492l928M950J0737O844j02n656p919p239N51P691P949
1087E727J929j900n257o559k768N338P753K942j245l829n933n600J531P719O147
1102E995K020j217m466p272m720K787P417N246K342j441o097o749j197M435O161
1117C244M507m1n063q152l175L963P273O254J916l788r640o948P35O870P637M861
1133A0453j80o675q264l161L736N911M834J336k886o282m181O80N227M744K745
1148H037j412m758n753k200K401M947N116K765j922n743n939k279K187N917N649
1163G013K418m278o296m429j13M573O370L388k681o782n842j195M528P465N732
1178I871l74o332q292m345K332O449O624K609l109n746n244j241L442N088L365
$$ y = [7969, 10296, 6213, -659, -8151, -12079, -7129, 3608, 10452, 10350, 4694, -3225, -10464, -9913, -2222, 5727, 7656, 5756, 499, -6060, -8828, -3490, 4263, 7205, 5960, 2131, -3802, -9402, -7871, -152, 5995, 8015, 6798, 2332, -4940, -9660, -6873, 544, 5790, 8132, 6691, 594, -6155, -7352, -2917, 3244, 7751, 7710, 2647, -5505, -8680, -4717, 2556, 8810, 10726, 6938, -2702, -9650, -8915, -2045, 5592, 10453, 10273, 3598, -4666, -7827, -4091, 1820, 6654, 7990, 5104, -1178, -5359, -4679, 548, 5292, 8037, 6625, 1867, -3886, -6086, -3685, 1262, 6378, 9143, 7221, 1478, -4461, -6740, -4553, 1364, 7013, 9431, 5153, -1143, -5572, -5685, -1112, 5258, 8646, 5965, -817, -6659, -7854, -3326, 4139, 9871, 9497, 3165, -5127, -9472, -7140, -691, 5933, 8542, 5433, -313, -5557, -6798, -3356, 1732, 5097]
1193E097m29l861m763k222J407M313M428J362k111m434m651j439J998M890M618
1208D203K184k145n778n282j781L205O046M640K49m567n952k811K136N171M741
1223D259J643l642o681m607M99O183O555L375j992o308o184k424L289O060M765
1238D790P58l490m879k884O87K898L956J801r55k984l974j183J798M423L608R66
1254E336l034l882l557j334K122M834N206J318l681n695l817m07M190N784K868
1269F251j497m888m546j231L139N598M070j273m822n534k145J820N574N651J797
1284G964l459n670m891l69L811M867K907j261k285k827k162j93K918L458J504
1299D312j552l477l490o22K779L776K914J96j994m536m276n28L678N074L093J34
$$ y = [5097, 4668, 807, -3956, -6178, -4771, -458, 3970, 5332, 3221, -1213, -5864, -7303, -5305, -415, 4203, 6387, 4242, -1536, -6818, -8599, -5394, 652, 5292, 5541, 974, -4978, -7789, -5653, -482, 4259, 5902, 2260, -4421, -9028, -8529, -2346, 4209, 7584, 5592, -716, -6900, -9324, -6035, 25, 4790, 5548, 2058, -2821, -5705, -5018, -2120, 1836, 3637, 2682, -302, -4276, -5459, -3661, 762, 4370, 5336, 2302, -1580, -5137, -6471, -4349, 485, 5691, 7009, 3328, -2367, -6184, -6591, -2401, 3383, 6251, 4754, -134, -4680, -5911, -2772, 2826, 6896, 5623, 801, -4733, -6878, -5058, 516, 6167, 7964, 4505, -1165, -6056, -6425, -2614, 2253, 5160, 3899, 1614, -1213, -3375, -3568, -650, 2808, 4312, 2760, -717, -4207, -4829, -2050, 1726, 4640, 4836, 2842, -1694, -5970, -6498, -2820, 2254, 5347, 5481]
1315E481l672n488k600J723M069L941J275k519m777l861J863M214L534J236j123
1330C296m097m927j769L119N100M230M83l343n031k802J217K388K608K115Q10
1345C397k715l705j321J887K189K137J354j569l931k855O25K441L592L322L25
1360E173m302m781j761R75L159M064L520j458m942l955l38K398L584L265p86l842
1376b7l317k28J658K480L808J858l104n203k281P90K132L203L814p9l256l086
1392h38j940j6J343M251K399j920k912j020j087K12L460L147o9l466l183j608
1408c247k81L393N001J770k371l119k897k682N49M890M862j002l032k449j140
1423a755j049K510L986P47k753j911j324j578J316M567K607j623k703j728k283
$$ y = [5481, 1809, -3679, -6279, -4556, -487, 3454, 4729, 2210, -2567, -6428, -4565, -351, 3183, 4419, 3296, -801, -5728, -7497, -4378, 722, 4952, 5435, 2092, -2939, -5741, -4524, -2136, 472, 2587, 3397, 682, -3023, -4344, -2457, -268, 1869, 3223, 1654, -2277, -5132, -4507, -2066, 1526, 4848, 5173, 871, -3910, -5671, -4696, -1537, 2527, 6047, 4589, -353, -4308, -4646, -2248, 1336, 4601, 3815, -27, -3344, -3572, -1914, 566, 4374, 6232, 3128, -2075, -4356, -3566, -1434, 1769, 5583, 5504, 2248, -838, -2778, -2794, -1451, 2800, 5199, 3279, 367, -653, -1740, -1528, 1932, 5079, 5010, 1544, -1639, -3247, -3528, -135, 4866, 6636, 4265, 1146, -1751, -4433, -3884, 1006, 5868, 4866, 1834, -615, -1755, -2804, -294, 3692, 4439, 1686, -225, -1549, -3127, -1811, 2756, 5363, 3740, 1037, -691, -2974]
1438b974j790K988M240J563q03j249k269l892L72L885K527k25j78j919l357j761
1454d842L995M175K05j364j598l629l189J897N328L056k44q29l665m134k89L911
1470a216L128N03l44j066k703k016J810K912N27Oj90k516l132O45L516K031K20
1487B115P92q32m199k729J723K519J116K038J642k414m256j129J856J906J517
1502A665K016j432m323k020K181K633J697K179q22m562l937R62K761K164K636
1517C798J436k647m952j221K051J448J194J821r5l218j490J362J010O7J333J237
1533C134k013l113k80Q75J110J894K585k43l342j992q04m00P60M138K065j578
1549B796l193j356q47O32K557L424j027l798j984j68M75K973L239M44l779l178
$$ y = [-2974, -4764, -1776, 2464, 4027, 3224, 1975, -294, -4186, -3814, 71, 2598, 2373, 2195, 276, -3081, -4842, -847, 3328, 3533, 2169, 571, -3058, -6247, -4350, 978, 4034, 3790, 2961, -704, -4838, -5127, -1216, 1912, 2415, 2071, 1005, -1698, -3714, -1904, 1008, 1535, 1541, 1351, -1165, -4297, -3652, -136, 1895, 2115, 2907, 2075, -2124, -4853, -3130, -611, 505, 2543, 4185, 1771, -2485, -3614, -1758, 148, 1665, 3681, 2249, -2074, -4094, -1913, 720, 2417, 4596, 3774, -788, -4725, -3763, -1002, 1162, 3798, 5234, 2587, -2365, -3586, -1535, -87, 1107, 2928, 2833, -385, -1875, -513, 497, 564, 1897, 3134, 1121, -1992, -2272, -1397, -287, 1607, 4192, 3949, 607, -1385, -2189, -2589, -1829, 2309, 4374, 2796, -397, -1753, -2600, -1968, 589, 4013, 2986, -812, -2796, -2964, -2489, 484, 3723, 4167, 388, -2790]
1565b790n84l27J731L448K362j615l163j399j10J99J109K424j71j834o17j03n84
1582b024M80J995J366j292j481o68j843k2J902K976J049j071j420k471j968J027
1598c465K948K103N34q94k009k826p4K791K508L05j232j904k495l70K809L224
1614A953R53m93k496k507j463R04L013J909j71m34j157j442q08J429J406L82l08
1631F70P5j060j363M07J228J315K65L49j200k880m27Q37K292J551J484m18k901
1648B24k421k54J000J929K347M04k062k802m29J489J725J388P13k206k678q21
1664b454J168J827J884J206j004k546k318l0J027J384J693N01p35j719l59j78
1680f53J8Q74J111k9j248p48l26k37R16K155R88j629k085r72p18N08K585K027
$$ y = [-2790, -3374, -3701, -1970, 1478, 3840, 2225, -938, -2337, -2447, -2248, -1139, 1285, 1114, -720, -1337, -1440, -2024, -1544, 451, 1817, 525, -956, -1624, -3467, -3489, -1587, 1389, 2438, 1367, -53, -2524, -4492, -3465, -517, 1586, 2120, 1226, -783, -3609, -3683, -892, 1616, 1921, 689, -1215, -3710, -4080, -1271, 1953, 2906, 2413, -83, -2590, -4053, -3149, -136, 1773, 1602, 1168, 11, -1431, -2239, -810, 596, 978, 670, 745, -315, -1678, -1271, -43, 1272, 1537, 1886, 686, -2194, -2621, -1784, 508, 2059, 3543, 3125, 224, -2197, -2451, -1451, 478, 2825, 3229, 1167, -1635, -2064, -575, 1150, 2538, 3251, 1045, -1633, -2454, -1286, 541, 2425, 3631, 2627, 81, -2237, -2267, -1240, 144, 1837, 2338, 1603, -116, -475, -653, -635, 239, 1350, 1321, 73, -675, -1001, -1238, -322, 1833, 2821, 1192, -893, -1865, -2583, -2075, 510, 2537]
1698B537K74j770j780j515l91J719K212Q34j624j148j053q7P61K173J471j369
1714A244k207r38p44N80K303J666J88j389j070j043j016M74K024R57j35m12L0
1731E12j346q81J180J268L7m11m46j006j048J132J909J129pp31j492k256k27K149
1749e35J669Q85L38j046j997j160Q62K110N20k03j39j453j269O93K224Q78o84
1766A693k88o86j989m86J405J600O85L94l17r19j878j26Q73P69N66R26m81j453
1784B88q52P34N74Q06P09n27j774j310N28J233Q65J165N30j743k395p83P81J079
1802i2J192J314l81j958j206N58O28M49O17Pj357r11M36O29N02M97N35p94j348
1821f83p68L04j7Q55J410N92p37j501m78p00k3J279J645k8j516p86K9m8Q05J718
$$ y = [2537, 2811, 1041, -739, -2254, -2645, -926, 1286, 2120, 496, -652, -1705, -1792, -1031, 1142, 2613, 1244, -963, -1901, -2645, -2065, 238, 1904, 2092, 703, -367, -1410, -2426, -1952, 72, 1029, 894, 482, 512, -834, -1715, -535, 733, 770, 359, -87, -1093, -2141, -1009, 900, 2029, 2022, 1291, -201, -2457, -2684, -535, 1134, 2019, 2357, 1311, -686, -1846, -984, 1126, 1646, 1443, 1304, -149, -1418, -725, 1499, 2377, 1693, 1405, 719, -1270, -1756, -351, 1249, 1934, 2328, 2011, 1092, -786, -912, -39, 730, 1296, 2222, 1741, 288, -564, 170, 744, 1550, 2259, 1732, -42, -1352, -824, 409, 1274, 2439, 2969, 1226, -1169, -1952, -1171, -92, 1100, 2414, 2033, 75, -1131, -573, 55, 504, 1121, 1128, -229, -1140, -704, -75, 427, 924, 1459, 665, -683, -1451, -1147, -1164, -309, 1101, 1693, 956, -545, -1023, -1723, -1746, -467, 1178, 1150, -366, -1152, -1123, -1171, -366, 1352]
1841A352q7j709j583k12J11J245K267J65r54j228j160j09K02J164J429Rj083l73
1859e54k73j03L68O05K39p07m55o8K44j1Q15R14l4q85q37n00r01N99J585J249
1879A290J86p59p37r77o24J333P06N98l43n69j099k53J269J567J56p26j390j182
1897a554k53R50J633J004k15j132o71q95q5R48N52M42J08n02l25m36M16K30J20
1916C35k67N0m2n43n97P95M50Q25M72n69j204j275o3Q66R24J326j67q07j228q78
1936a597M12Q99J147p5q06j330m55O12J290R47K88j080j624l87k30J306J236J63
1954G16l08p41o54j32K2N04L86k26j1k1k16R3j54K05M02j92P3n41n71j13L42J166
1976B9N01J98o04j048j323J17J056J476P76k15j109q04k61P07Q37L72l34j002
$$ y = [1352, 1265, -444, -2027, -2239, -2128, -883, 1384, 1549, 595, -633, -1793, -1902, -1700, -536, 893, 902, -181, -554, -827, -930, -562, 43, 282, -425, -880, -948, -704, -715, 100, 1014, 980, 95, -742, -1242, -2143, -1544, 41, 1290, 1476, 717, -20, -997, -1621, -288, 418, 1016, 673, 104, -995, -1248, 21, 1588, 1744, 1018, -372, -1554, -1807, -857, 776, 1780, 1565, 433, -238, -1133, -1218, -270, 282, 724, 832, 330, 5, -431, -15, 215, 335, 68, 118, 76, -467, -1064, -269, 181, 1006, 1478, 909, -295, -1570, -1633, -767, 157, 1483, 1316, 509, -719, -1597, -1185, -286, 861, 786, -20, -1350, -1805, -1193, 97, 1044, 1332, 252, -1372, -1759, -1989, -683, 553, 716, 408, -333, -987, -1119, -1097, -593, -207, -433, -444, -465, -681, -588, -742, -537, -135, -327, -254, -795, -1366, -1479, -1137, 29, 530, 728, 124, -924, -2247, -2130, -1074, 402, 1178, 963, -146, -950, -1211, -504, 333, 705, 371, -631]
1994f31q81K61P65J359O60m10r30j174j7K22R40M04N13k72k33o23ml2K04J03J13
2015C37K30J02l25m9K9M71K32L8o04j19o34n2N6J259J078o5r04j209o82J32J217
2036E38N98P09o89r06o07P13K55O62K23p32j051l21N97P12O96M58q47o20l67m52
2056d31N6L18Q19M24o0n29j28k73l8l23M98N7m2rm16j59r3J066n5j91l56p64m47
2079a076J34O19J231K59n11r53n53l15M79R42R3L19m88p18k2K95Q11qo87l35j36
2100f20l56j0R31N25L66o70q4n87m89Q6J109l4j17M31J01p52m90L64j56P2M41
2121F1L53m37r03L57P77L17L35o7q18j099L5R09N73L04oJ08p95p01J42P88j8K34
2143D49J51m70n21L20P36J91m38L21k74o61l46N87L49q3L07M21m05q77j0J02k21
$$ y = [-631, -1512, -1251, -486, 873, 1533, 1123, 193, -981, -998, -776, 164, 568, 1081, 809, 576, -47, -51, -83, 121, 224, 337, 567, 669, 344, 295, 324, 795, 1027, 1065, 461, 342, -292, -344, -288, 971, 2049, 1984, 1080, -129, -811, -679, 538, 1136, 1845, 1156, 250, -357, 356, 611, 1273, 1496, 764, -287, -608, -11, 701, 1397, 1855, 1008, 388, 21, -431, -375, -57, 762, 1186, 1126, 597, 469, 196, 158, -165, 333, 390, 348, 339, -77, -236, -329, 737, 682, 491, 135, -629, -1076, -942, -323, 908, 1167, 656, -297, -850, -1165, -686, 256, 349, 668, 180, -538, -560, -265, 546, 538, -149, -484, -620, -976, -986, -55, 470, 836, 166, 82, -505, -994, -908, 201, 167, 50, 481, 582, -170, -660, -296, -452, -380, 61, 414, -23, -926, -569, 208, 525, 860, 793, -25, -1124, -1089, -180, 393, 697, 691, 799, 4, -697, -555, 233, 215, 449, 600, 130, -391, -71, 665, 856, 418, 739, 465, -196, -542, 45, 394, 311, 618, 1039, 634, -243, -253, -151, -372]
2164c72M85R13k35p60l91M41N7l4M56L28q66p94J33N76L80K07M74q96r57j48M48
2185e55J28J30J043j74m52p59M46lj96Q2J73n16j50N95N4l9k49R21p71p39L2J83
2207h16l97K27P93Q08n29m18l23l02o85Q35R73k48m70j0j23l52j7R93k69k40p06
2228a276L60k19K74J180M03r78p16q7Mj92N61J114n56j91M17j39n87nK19K16l88
2249e86R8N56j10l77L55M11l04M6k54k56j58j96N65P49J70L74m29j077k95O60
2269e8L07J80R7j9n71l34N84Q90k81m32k99j98l94M05R91O5k03n1j07p47J32J25
2291H2K77n1R0N3K10m10J03J05l09j8J50L59l85m32K84M3K71K87J57n70n54k54
2313e12J47L40O46L33o9j033l49L55J05K14M93k41o57j98L85O38J9R8n65n90n79
$$ y = [-372, 113, 1026, 791, 31, -360, 81, 138, 104, 560, 888, 22, -772, -639, -63, 317, 524, 998, 102, -855, -1003, -555, -427, -297, 746, 572, 120, -639, -193, -196, -392, -310, -137, -653, -803, -208, -154, -193, -442, 479, -292, -1031, -999, -816, -1213, -986, -193, 615, 86, -332, -655, -957, -1642, -807, 166, -82, -552, -562, -685, -1037, -1054, -61, -330, -570, -1276, -916, -1135, -861, 319, 722, -256, -972, -1059, -1055, -1247, -686, 428, -128, -319, 98, -41, -628, -633, -414, -198, -586, -488, 68, -42, -419, -64, 347, 43, 89, -165, -421, -579, -775, -210, 539, 709, 1083, 654, -423, -718, -58, 249, 429, 526, 507, -64, -398, 186, 1076, 795, 363, 64, -134, -528, -123, 868, 933, 730, 679, 572, -175, -43, 82, 359, 308, 398, 451, 661, 251, 354, 459, 150, 132, 282, 641, 256, -176, 108, 151, 422, 709, 866, 296, -258, -512, -365, -25, 621, 954, 885, -148, -497, -142, -37, 177, 670, 429, -228, -426, -41, 597, 616, 714, 149, -441, -1020]
2334a020L60O98L26o9L38n34m2n35L42N3k98J75n1L49K22Q3m27n55L22L79j58
2355d2k07O6j26l38O89L74K15m06l31l40k14J06P76N27R3o01l46L1j56M80K90
2376E40l23k51N2k15O72J91K82m48l88k11j32M84j34L50J59n3J12K5j37k04j83
2397A88Q2o2L62J6M09m28k54J40J68O2j07k49k03k76N32L33J39N0Kq25o91N07
2419a05M6N48mJ45k52q7k69N10k4M7m42m14J52R2L89M02k11k86j66k28j04P8J90
2442Gr3Q8K67M8k81J10l03l30l25K87L34k17M5L75j43m31K73J77M5q70m2K23P5
2465f81K60P91l36m38m12l5o7L66K92K29m25n0N3L68k15m50J95r5k60K62K92l8
$$ y = [-1020, -660, 38, 364, 295, 633, 99, 57, -478, -136, -83, -381, -206, -257, 92, 314, 397, -30, -585, -263, 116, -42, -249, -183, -309, -647, 42, 416, 631, 225, -106, -446, -660, -554, 222, 749, 842, 241, -105, -74, -230, 250, 540, 217, -34, 18, -197, 475, 666, 948, 500, 112, -99, -231, 253, 119, 469, 628, 575, 687, 712, 575, 371, 188, 270, 208, 570, 586, 995, 567, 313, 453, 621, 683, 576, 327, 124, -152, 380, 713, 852, 902, 904, 79, -612, -105, -59, 489, 485, 630, 378, 291, 22, 532, 508, 555, 113, -301, -149, -57, 332, 734, 523, 237, 71, -157, -261, -183, 7, -86, 2, 269, 317, 36, 146, -157, -487, -812, -525, -191, -408, -363, 12, -131, -562, -289, -112, -67, -937, -979, -756, -681, -421, 370, 34, -404, -816, -851, -918, -552, -260, -31, -456, -506, -453, -85, -300, -750, -555, -650, -910, -648, -356, -394]
$$ [...]
8191F0
##END NTUPLES=NMR FID
##END=
