##TITLE=1H_SR3-Host
 D2O, 8 sc, 
 25.10.2019
##JCAMPDX= 6.0         $$ Bruker NMR JCAMP-DX V2.0
##DATA TYPE= NMR FID
##DATA CLASS= NTUPLES
##ORIGIN= UXNMR, Bruker Analytische Messtechnik GmbH
##OWNER= root
$$ XWIN-NMR		Version 3.5
$$ Fri Oct 25 15:27:01 2019 Russian Standard Time (UT+4h)  she@DPX200
##.OBSERVE FREQUENCY= 200.1315
##.OBSERVE NUCLEUS= ^1H
##.DELAY= (6, 6)
##.ACQUISITION MODE= SIMULTANEOUS
##.ACQUISITION SCHEME= undefined
##.AVERAGES= 8
##.DIGITISER RES= 18
##SPECTROMETER/DATA SYSTEM= spect
##.PULSE SEQUENCE= zg30
##.SOLVENT NAME= D2O
##.SHIFT REFERENCE= (INTERNAL, D2O, 0, 15.7039)
##AUDIT TRAIL= $$ (NUMBER, WHEN, WHO, WHERE, WHAT)
$$ ##TITLE= Audit trail, XWIN-NMR		Version 3.5
$$ ##JCAMPDX= 5.01
$$ ##ORIGIN= Bruker BioSpin GmbH
$$ ##OWNER= she
$$ F:/spectra/data/she/nmr/H-F/1/audita.txt
$$ ##AUDIT TRAIL=  $$ (NUMBER, WHEN, WHO, WHERE, WHAT)
(   1,<2019-10-25 15:26:02.95 +0400>,<she>,<DPX200>,
      <created by zg, POWCHK disabled, PULCHK disabled
       configuration hash MD5:
       00 E9 B6 7A A2 85 ED C7 34 08 36 98 17 FE 4E 26
       data hash MD5: 16K
       D7 73 5D 50 98 6B AE 0C BF 3D C3 D2 50 E1 7E 8D>)
$$ ##END=
$$ 
$$ hash MD5
$$ C8 73 DE 40 F3 06 48 1B 3C C4 FD 05 D8 FF 84 92
##$RELAX= 
##$RELAX= 
##$RELAX= 
##$RELAX= 
##$RELAX= 
##$RELAX= 
$$ Bruker specific parameters
$$ --------------------------
##$DU= <F:/spectra>
##$EXPNO= 1
##$NAME= <H-F>
##$PROCNO= 1
##$TYPE= <nmr>
##$USER= <she>
##$AMP= (0..31)
100 100 100 100 100 100 100 100 100 100 100 100 100 100 100 100 100 100 
100 100 100 100 100 100 100 100 100 100 100 100 100 100 
##$AQSEQ= 0
##$AQ_mod= 1
##$AUNM= <au_zg>
##$AUTOPOS= <>
##$BF1= 200.13
##$BF2= 200.13
##$BF3= 200.13
##$BF4= 200.13
##$BF5= 200.13
##$BF6= 200.13
##$BF7= 200.13
##$BF8= 200.13
##$BYTORDA= 1
##$CFDGTYP= 0
##$CFRGTYP= 5
##$CHEMSTR= <none>
##$CNST= (0..31)
1 1 145 1 1 1 1 1 1 1 1 1 1 1 1 1 1 1 1 1 1 1 1 1 1 1 1 1 1 1 1 1 
##$CPDPRG= <>
##$CPDPRG1= <>
##$CPDPRG2= <>
##$CPDPRG3= <>
##$CPDPRG4= <mlev>
##$CPDPRG5= <mlev>
##$CPDPRG6= <mlev>
##$CPDPRG7= <mlev>
##$CPDPRG8= <mlev>
##$CPDPRGB= <>
##$CPDPRGT= <>
##$D= (0..31)
0 1.2 0 0 0 0 0 0 0 0.06 0 0.03 0 0 0 0 0.0002 0 0 0 0 0 0 0 0 0 0 0 0 
0 0 0 
##$DATE= 1572002762
##$DBL= (0..7)
120 120 120 120 120 120 120 120 
##$DBP= (0..7)
150 150 150 150 150 150 150 150 
##$DBP07= 0
##$DBPNAM0= <>
##$DBPNAM1= <>
##$DBPNAM2= <>
##$DBPNAM3= <>
##$DBPNAM4= <>
##$DBPNAM5= <>
##$DBPNAM6= <>
##$DBPNAM7= <>
##$DBPOAL= (0..7)
0.5 0.5 0.5 0.5 0.5 0.5 0.5 0.5 
##$DBPOFFS= (0..7)
0 0 0 0 0 0 0 0 
##$DE= 6
##$DECBNUC= <off>
##$DECIM= 24
##$DECNUC= <off>
##$DECSTAT= 4
##$DIGMOD= 1
##$DIGTYP= 9
##$DL= (0..7)
0 120 120 120 120 120 120 120 
##$DP= (0..7)
150 150 150 150 150 150 150 150 
##$DP07= 0
##$DPNAME0= <>
##$DPNAME1= <>
##$DPNAME2= <>
##$DPNAME3= <>
##$DPNAME4= <>
##$DPNAME5= <>
##$DPNAME6= <>
##$DPNAME7= <>
##$DPOAL= (0..7)
0.5 0.5 0.5 0.5 0.5 0.5 0.5 0.5 
##$DPOFFS= (0..7)
0 0 0 0 0 0 0 0 
##$DQDMODE= 0
##$DR= 18
##$DS= 0
##$DSLIST= <SSSSSSSSSSSSSSS>
##$DSPFIRM= 0
$$ [...]
##$SUBNAM2= <"">
##$SUBNAM3= <"">
##$SUBNAM4= <"">
##$SUBNAM5= <"">
##$SUBNAM6= <"">
##$SUBNAM7= <"">
##$SUBNAM8= <"">
##$SUBNAM9= <"">
##$SW= 24.0689530833862
##$SWIBOX= (0..15)
0 0 2 0 0 0 0 0 0 0 0 0 0 0 0 0 
##$SW_h= 4816.95568400771
##$TD= 16384
##$TD0= 1
##$TE= 0
##$TE2= 300
##$TE3= 300
##$TEG= 300
##$TL= (0..7)
0 120 120 120 120 120 120 120 
##$TP= (0..7)
150 150 150 150 150 150 150 150 
##$TP07= 0
##$TPNAME0= <>
##$TPNAME1= <>
##$TPNAME2= <>
##$TPNAME3= <>
##$TPNAME4= <>
##$TPNAME5= <>
##$TPNAME6= <>
##$TPNAME7= <>
##$TPOAL= (0..7)
0.5 0.5 0.5 0.5 0.5 0.5 0.5 0.5 
##$TPOFFS= (0..7)
0 0 0 0 0 0 0 0 
##$TUNHIN= 0
##$TUNHOUT= 0
##$TUNXOUT= 0
##$USERA1= <user>
##$USERA2= <user>
##$USERA3= <user>
##$USERA4= <user>
##$USERA5= <user>
##$V9= 5
##$VALIST= <valist>
##$VCLIST= <CCCCCCCCCCCCCCC>
##$VD= 0
##$VDLIST= <DDDDDDDDDDDDDDD>
##$VPLIST= <PPPPPPPPPPPPPPP>
##$VTLIST= <TTTTTTTTTTTTTTT>
##$WBST= 1024
##$WBSW= 4
##$XGAIN= (0..3)
0 0 0 0 
##$XL= 0
##$YL= 0
##$YMAX_a= 551674
##$YMIN_a= -882195
##$ZGOPTNS= <>
##$ZL1= 120
##$ZL2= 120
##$ZL3= 120
##$ZL4= 120
##$ABSF1= 10
##$ABSF2= 0
##$ABSG= 5
##$ABSL= 3
##$ALPHA= 0
##$AQORDER= 0
##$ASSFAC= 0
##$ASSFACI= 0
##$ASSFACX= 0
##$ASSWID= 0
##$AUNMP= <proc_1d>
##$AZFE= 0.1
##$AZFW= 0.1
##$BCFW= 1
##$BC_mod= 2
##$BYTORDP= 1
##$COROFFS= 0
##$CY= 11.3945322036743
##$DATMOD= 1
##$DC= 2
##$DFILT= <>
##$DTYPP= 0
##$F1P= 19.5091578491511
##$F2P= -0.509923556040331
##$FCOR= 0.5
##$FTSIZE= 0
##$FT_mod= 4
##$GAMMA= 1
##$GB= 0.15
##$INTBC= 1
##$INTSCL= 1
##$ISEN= 128
##$LB= 0.24
##$LEV0= 0
##$LPBIN= 0
##$MAXI= 10000
##$MC2= 0
##$MEAN= 0
##$ME_mod= 0
##$MI= 1.114404
##$NCOEF= 0
##$NC_proc= 0
##$NLEV= 6
##$NOISF1= 3.799351
##$NOISF2= 2.8
##$NSP= 1
##$NTH_PI= 0
##$NZP= 0
##$OFFSET= 15.70392
##$PC= 1
##$PHC0= -9579.561
##$PHC1= 17.40082
##$PH_mod= 1
##$PKNL= yes
##$PPARMOD= 0
##$PSCAL= 0
##$PSIGN= 0
##$REVERSE= no
##$SF= 200.130013532006
##$SI= 16384
##$SIGF1= 3
##$SIGF2= 2
##$SINO= 400
##$SIOLD= 16384
##$SREGLST= <1H.CDCl3>
##$SSB= 0
##$STSI= 0
##$STSR= 0
##$SW_p= 3612.71676300578
##$SYMM= 0
##$S_DEV= 0
##$TDeff= 0
##$TDoff= 0
##$TI= <>
##$TILT= no
##$TM1= 0
##$TM2= 0
##$TOPLEV= 0
##$USERP1= <user>
##$USERP2= <user>
##$USERP3= <user>
##$USERP4= <user>
##$USERP5= <user>
##$WDW= 1
##$XDIM= 8192
##$YMAX_p= 0
##$YMIN_p= 0
$$ End of Bruker specific parameters
$$ ---------------------------------
##NTUPLES= NMR FID
##VAR_NAME=  TIME,          FID/REAL,        FID/IMAG
##SYMBOL=    X,             R,               I
##VAR_TYPE=  INDEPENDENT,   DEPENDENT,       DEPENDENT
##VAR_FORM=  AFFN,          ASDF,            ASDF
##VAR_DIM=   8192,          8192,            8192
##UNITS=     SECONDS,       ARBITRARY UNITS, ARBITRARY UNITS
##FACTOR=    0.0002076,     1,               1
##FIRST=     0,             0,               0
##LAST=      1.7004516,     0,               0
##MIN=       0,             -882195,         0
##MAX=       1.7004516,     551674,          0
$$ Real data points
##PAGE= N=1
##DATA TABLE= (X++(R..R)), XYDATA
$$ [...]
1637a740K293J253K40j54r25k463j402J251R36P95J648J179j438j936o75q07j32
1654b077J280K034O06O5k81j576k156m10J104J085J206J209o0j296j210o29j037
1671b143K52J794J689K52j86o02j552j526k25J179J191J432M14m22j154r24j073
1688a604q41J268J787P79N64j88j773j416m83L96N31J315J433K73r15r53j195
1705a022j019K37J440J269P26L08r60j675j064L02O9M85J737J161l72q93p40j332
1723a343j016Q17K237M56K92L11p85k028p97O28K11P08J668Q07r85j007m80j534
1741a840l31J475J565L08N6M54j430j616q2M01J31Q90K084M6j810n00j98j402
1759a799k65K068J326m12K90L35j672j819M44P85O6J408J535p22j371m92l33j390
$$ y = [-1740, 553, 1806, 2046, 1892, 967, -1496, -2898, -1647, -711, 84, 1732, 2911, 1473, -463, -1138, -1945, -2077, -797, 1237, 1843, 1908, 1627, 51, -2105, -2515, -1411, -326, 880, 2089, 2029, 733, -477, -1106, -2143, -1891, -97, 1592, 1844, 1658, 1056, -496, -2022, -2247, -1068, 123, 1555, 1969, 1547, 393, -531, -1604, -2445, -1177, 610, 1389, 1953, 1765, -8, -1424, -1907, -1511, -980, 335, 1768, 2041, 1126, 173, -1022, -2041, -1804, -364, 905, 1631, 1939, 979, -696, -1760, -1458, -1389, -904, 833, 1994, 1622, 729, -11, -1343, -2359, -1542, 695, 1151, 1443, 1754, 969, -1059, -1856, -1228, -1017, -309, 1359, 2166, 1181, 174, -306, -1840, -2171, -696, 869, 1177, 1233, 1687, 257, -1359, -1441, -1040, -909, -19, 2065, 2111, 301, -199, -397, -1799, -2064, 4, 1330, 918, 1208, 1543, -129, -1948, -1504, -719, -653, 755, 2290, 1568, 197, -295, -628, -2018]
1777b018N62K175L78m40P43j99k208q93R81O34l04J589J314j296j408K73p14j243
1795b074J145J929L00m90N80q52j973m75J339Q7K81J611O20j641r84L26r32n51
1813a754J517J534m28n6L93j068k034L92J441k62L06J901q7j776p89K49p91j94
1831a506J797J212q74r2O00j503j491N82J243o6O37J275p14j685pM1j080L72K374
1850A115N40j278K30L52j775j244J106J154n2O78J053j192j440n3J99r02R15J670
1868A076L15r12L20o15j758m6J483N08l09J259L44j421j247K61j20q4R17J127
1886A098j69l26K35j005j663M37J702J58j89R96K30j553j117L85J49k94J355Q64
1904A293l25p05J53r49j026M93J366R9J34P79m15j596k92O35l88q7J669O97r73
$$ y = [-2018, -1456, 719, 1097, 657, 1400, 1201, -1007, -1900, -919, -285, -589, 1000, 2314, 1018, -390, -117, -831, -2074, -929, 1000, 1300, 810, 1390, 538, -1435, -1910, -571, -484, -203, 1408, 2028, 387, -597, -271, -1203, -1754, -237, 1297, 869, 813, 1206, 138, -1896, -1504, -63, -325, -19, 1882, 1795, 19, -770, -521, -1312, -1506, 291, 1503, 629, 537, 1137, -366, -1857, -1275, -32, -98, 539, 1814, 1100, -585, -592, -551, -1631, -1259, 1115, 1655, 377, 607, 959, -816, -2060, -954, 200, 148, 826, 1879, 687, -753, -806, -607, -1509, -594, 1076, 1391, 479, 799, 184, -1574, -1620, -137, 371, 62, 1321, 1665, 244, -1003, -742, -862, -946, -29, 1098, 929, 603, 838, -167, -1830, -1393, 309, 467, 278, 1274, 1504, -49, -1166, -781, -632, -926, 429, 1293, 968, 263, 416, -533, -1559, -1066, 300, 399, 533, 1312, 897, -699, -991, -356, -744, -831, 838, 1535, 562]
1923E62m36j5q24p19Q95Q21O2O34K99r59j264J87O37n64J25J457N16r99l85k32
1943b02o79k05J138M82Q3M05q1r01p90QL2j2J098P88m01o32N4n49q70K5J303O37
1965G31o0NO0q97p96J68K11L42P87O54n97n49k03l69o18O00P09N33m5J12l95q11
1987d28m34K2O28K99N82L52k34o92n10n05l6Q11M06J97K59J3o27o70l73L34M29
2008a77N58M22k1j22p49o13l23O20M99J29L29L07m60n17n08j05K04N30N27L97
2028I27k42n48n42l35Q9J83M39M88P52m31r40l19j33j02K94O78N19J61m35m06
2048I7q24j06P3O72K31M40L33k85p23m99L2j39L55P79J77p5k01k62p56j29L55
2069d55L66K50M99J45o40l91l17j54M0P33P33k75l67J37m16n75q8M91L50L18N18
$$ y = [562, 126, 111, -713, -1432, -537, 284, 346, 980, 1279, 320, -944, -757, -120, -684, -559, 898, 1414, 415, 30, -202, -881, -1086, 52, 534, 617, 1022, 941, 40, -750, -742, -710, -722, 376, 1164, 763, 131, 185, -364, -1234, -1209, 94, 731, 671, 676, 736, -161, -957, -789, -578, -236, 551, 1205, 608, 59, -144, -513, -1131, -531, 178, 711, 666, 778, 383, -428, -862, -840, -212, 87, 669, 1021, 787, 95, -415, -920, -956, -145, 261, 458, 717, 730, 103, -567, -940, -606, -177, 381, 803, 782, 660, -89, -702, -1025, -405, 94, 223, 552, 859, 399, -118, -626, -731, -527, 3, 530, 927, 685, 137, -405, -740, -651, -468, -29, 459, 1211, 780, -160, -479, -612, -714, -420, 258, 777, 938, 503, 97, -727, -833, -760, -88, 143, 583, 916, 631, -92, -591, -559, -698, -343, 436, 613, 538, 337, 75, -681, -810, -455, -89, 161, 660, 805, 165, -226, -543, -697, -657, 76, 809, 534, 167, 304, -112, -687, -775, -284, 66, 384, 902]
2090I02j29p20n99K40m59L56N45M39j09k02n2m38n09K34L32L61M48J67j94p88
2110a75l80J43p3M9O29N82k56k45k00o66j51K79N56R3L49K99n97n80K8p2j86N96
2132B2M95K19m41mn29n42LO26M12J85J49J30o95l56l07J62J54L44N53n8j99j49
2154A74m85l61L9M61L65J95K39k63l77o24J91L2Q3M60M97p3m10k11m13j42M37
2175a86L02J12J59J05k52m84k29J48k58N85L66K12o6l47l86k48o6J67M39K83K90
2196F46k48l32m52m9jO8M95N79j87k30n16j43k18J45M21jN54P6n02k80j67j93
2218e35J3L07M76L29nm49l83j67m3J38o6O17L63n2n70k95K93k53j36P30J94l88
2240A18L54l77k60m88K61J98L26K35Ml23l19M06k73m73K60P85J96m42j1J21o09
$$ y = [902, 773, 53, -546, -306, -765, -409, 136, 575, 466, 264, 212, -226, -735, -501, -169, 192, 640, 807, 613, -175, -555, -412, -485, -436, 193, 775, 519, 274, 74, -592, -743, -464, 92, 185, 534, 833, 236, -344, -316, -388, -574, 22, 517, 736, 295, 291, -238, -780, -777, -151, 261, 446, 595, 725, 30, -326, -633, -471, -317, 27, 580, 522, 323, 174, -311, -672, -633, -172, 193, 388, 627, 364, -13, -637, -446, -414, -331, 129, 626, 553, 143, -68, -481, -623, -186, 116, 228, 387, 492, 240, -244, -473, -325, -583, 2, 368, 580, 514, 167, -219, -467, -533, -366, 73, 356, 646, 398, 66, -386, -435, -436, -368, 127, 706, 519, 289, -227, -370, -588, -443, -22, -23, 531, 607, 105, -175, -342, -535, -522, -215, 261, 590, 585, 136, -247, -414, -457, -319, -385, 232, 595, 543, -27, -322, -29, -282, -418, 312, 506, 118, 472, 95, -165, -653, -392, -194, 132, 367, 371, 48, -271, 135, -138, -611, -351, 434, 630, 188, 177, 298, -311]
2261c11k64M92Q5O2K38L91p69j9P5l23j97M47O99n24J01K39l97m93p7N05J31j73
2283h2P33R0o68l23L21l69j78Q10L09o67J5N25p13o94O47M91k47j07O51j93m99
2304a48rK9l97J11J134k60n34L10K95q25n33O83L99l86L06N73o44o38L47K48n75
2325e14N15N52j64l89J72J2o63k57Q81j28k97M86O93r52m50N18ln70M17R05m30
2346C34n87P78n62n32R4R46l64j72P04r1q64j50M38K5l27K85O79n46l26N97m10
2367e1p93N47P54m40n9M78j6q06r2M79k13j60P77L24q25m5M05m57m05O32L64m89
2389i1K35J71j10p46M06K78m47m0J058k0r20J99L74o47l91P96K35k60mM94n84
2410a4o80O35J65m33o7R78j67q47O02K7o92n1R87k33m71N98K77r03j52N00J54
$$ y = [-311, -575, -83, 2, 64, 302, 693, -76, -95, -20, -343, -540, -93, 606, 82, 183, 422, 25, -468, -545, -40, 91, -82, 651, 741, 73, -250, 71, -298, -476, 334, 643, -24, -9, 516, -197, -891, -244, 247, 0, -107, 544, 351, -148, -157, -128, -525, -414, 720, 460, -74, 236, 531, -294, -827, -144, 255, -131, 175, 748, 104, -534, -187, 61, -514, 1, 553, 389, 0, 172, 184, -479, -736, 145, 17, -280, 206, 899, -53, -503, 15, 12, -558, -141, 764, 334, -253, 525, -37, -569, -475, 471, 107, -65, 639, 548, -316, -466, -28, -3, -330, -45, 634, 88, -238, 359, -51, -844, -297, 457, 17, -42, 436, 420, -386, -478, 1, -212, -372, 405, 729, -96, -141, 264, -193, -598, 34, 398, -91, 144, 315, 205, -541, -135, 143, -304, -344, 714, 694, -226, -27, 347, -300, -691, 105, 340, 80, 76, 570, -14, -694, -59, 106, -327, -394, 584, 417, -430, 172, 199, -493, -544, 443, 210, -261, 337, 614, -289, -441, 59, 213]
2431B13o43M65P68o53m90L94j72n56L01N61M1n00N16Mo05j63M77k03j38P08J81
2452E06m53k27L76k83n41M81P28n38k36M92j19p94K00M96k67O5M22L79q27j59
2472b99M18k00n57O70K41l7l36L01k6n81J19K96q4mN35k80l62J48Qm68M0N99J10
2495B51j92q0L92n54j95K45L23k22J8N09j56n74P9J56j42k03N97O8l05K20m6l03
2517a14k97L15L47j31j71N25m71q9J0N4l09L20L87k61j43J32J71m65j34L66J53
2538A95j65O5K44n81rK66j94q7L33L22n4k22R5l76k47K55L80l14N2M06j12m30
2560a78R1K28k49K1J27L48l95o3K2l4k68J24K61J9K1L96k72l96K8R9j36J42J87
2583A23J79j22r1O2k52k01K79J76j45J02J85k80k55J85Qj66J91L72J10n82Q5N5
$$ y = [213, -430, 35, 803, 150, -340, 54, -118, -674, -373, 188, 229, -271, 245, 249, -356, -519, -42, -245, -383, 325, 506, 53, -174, 202, -81, -622, -141, 587, 49, -187, 305, 186, -608, -408, 88, -179, -114, 308, 687, -140, -299, 119, -81, -638, 32, 273, 236, -100, 201, 175, -406, -287, 9, -75, -79, 456, 176, -186, -38, -30, -498, -458, 141, 251, 59, -21, 371, -183, -378, -133, 190, -32, -14, 495, 339, -235, -156, 0, -142, -345, 252, 320, 15, 235, 189, -114, -411, -96, 251, 120, -51, 474, 3, -86, -76, -22, -331, -11, 376, 115, -28, 104, 275, -190, -324, 42, 195, 30, 95, 339, -242, -251, 15, -179, -266, 67, 389, 335, 113, 208, -168, -415, -160, 220, -94, -42, 364, 252, -178, -87, 141, -108, -87, 40, 388, -7, -70, -48, -82, -350, -226, 35, 54, 75, 471, 199, -197, -169, -70, -206, -64, 123, 302, 180, 89, 151, -101, -302, -23, 153, 8, 110, 295, 15, -240, -55, -47, -213, -22, 350, 460, -122, -37, 18]
2605A8l9j64K11j28L10Q4j60k02j27J23q0l9L91r9J50l26M9j15n4m3J99R8K12
2628B69j05j30m0p7J15n0J34j10k7P5K4m5j90N8J86l8J43j45O6R1j99j39lL31
2652A94j30K22j29j80J50k99P5k75L06K28n7k5m1m6J29k18j3Q2L24r4M1k60L1
2675A5m1j71J93j3J07l8R3o5r6L4O2k00K02j4O6j92J68k05j03J85K70j01k08J9
2699c3N5o2j91J52J35j67L17j65m0K36k37j66q3K67j4kK04J13k63k1j17k5j09
2722b16K71J15J1k5j12j18J07r1l1k7J77o1K51O2l05J11k30J56o9P8J44j95J62
2745A65j28j06k7M0M0N4J44k07m3r8K39J2j58K77Q0j90n1k02J54j73Q2M1P5K97
2769C17l57J40j15R7j42k57K43K38r9K14k32K29k64q0J3J20j2j4M5n4q2o3KO2
$$ y = [18, -21, -185, 26, -102, 208, 292, 132, -70, -197, -74, -154, -193, 198, 99, 249, -77, -28, -143, -197, -240, -41, 57, 269, 164, 34, -6, -83, 32, -18, 116, 6, -21, 54, 78, 33, -157, -99, 87, 49, 192, 47, 113, 204, 5, -134, -137, 194, 64, 286, 157, -23, 127, -172, -97, -372, -66, 162, 105, 80, 39, -7, 122, -96, -109, -27, 297, 203, 244, -16, 15, -26, -197, -4, -17, 90, 52, 145, 80, -16, 18, 80, -120, 82, 68, 134, -58, 110, -95, -198, -13, 257, 156, -52, -33, 22, -40, -231, -79, 56, -111, 206, 41, 1, 237, 0, -166, -249, 18, 4, 2, 206, 319, 56, 35, -82, -107, -216, 55, 170, 181, 156, 44, -74, 33, -58, -89, -116, 61, 0, 251, 313, 8, 119, -111, 45, -24, 54, 198, 3, 165, 37, -69, -96, -56, -16, 38, 182, -25, -68, -166, 73, 85, -73, 204, 284, 94, 43, -159, -5, -178, -96, -55, 20, 317, -40, 100, -15, 82, -60, -317, -74, 164, 65, 279, 47, 276, 12, -68, -55, 65, 53, 39, 84, 30, -52, -115, -113, -51]
2793e1K04j70L00l99K08l7l35Q6K88P0l35L12J5j37k42O0p4J8L54p1j98K71J62
2816B99m60j6J14K11q5n9n5K6J12j89J30l05J25L99k13Q0q1j69J49k62J28R7N7
2839C3Q9q3j49L1P7K9j07R5m7P2J47j81j84R9m2K06j40J12J05j42m2j6n0j16K41
2864C7J60p5k20K38o9k43l1K78j12L6L59j62j90q0O6r7oK39l7n6j39J15K11m30
2888b08J90Q5r0jn0J05j82J67J19p5k59K78J69m53K25O3k46m9K64j2j90K55k0
2911H5l02J93jJ01k86J94O6k9k0N3J36l94%K49qj17J70N2m7l25M21k52j61K67
2935D5J77j87p3L11l81o8J55K68l14K9K42R3m73k4K70j96j6J02J27P5j70J0j67
2958a65N5M0J78K1j87L28j81l0k19M43m65P5J25J29j01j57J33m1k80J52K52k05
$$ y = [-51, 153, -17, 283, -116, 92, 55, -280, -194, 94, 164, -171, 141, 156, 19, -223, -163, -237, -219, 135, 64, -134, 137, 299, -161, -177, -63, 148, 63, 4, -51, -25, 87, -102, 28, -277, -152, 247, 34, 114, 33, -136, 13, -249, -121, -24, 33, 122, 39, -110, -79, -2, 27, -80, 15, -32, 40, 187, 6, -178, -79, -121, 85, -55, 57, 162, 20, -22, -38, -88, -204, 37, 197, 122, -98, 140, 71, -172, -203, 75, -37, -1, 358, 196, 6, -74, -8, -105, -111, 128, 91, 35, -104, 11, 222, -208, -18, 67, -23, -24, -74, 31, -151, 16, 135, 60, -199, 79, 248, -205, 20, 83, -163, -212, 52, 40, -150, 105, 85, -217, -24, -25, 76, -210, -16, 50, 21, 1, 54, 190, -204, -204, 45, 37, -80, 90, 142, 95, -230, 191, -61, -222, 45, 222, 35, -38, 273, -108, -176, -21, 247, -67, -38, 204, 297, -176, -200, 70, -126, -142, -40, 87, 162, -8, 2, -165, -110, -70, 108, 129, -58, 270, 89, 59, -160, 283, -182, -107, 18, 147, 46, -111, 22, -19, -299, -147, 105, -100]
2980a00L6L33k06k45J20K5q8J03K31k05lo9mok3R0J77n1J3P8l12K2J57j78J2J5
3006g8K56k10j58J38J2j21r3J80P9j51J1K59k98J85p6J17j23N4o6L8J25o9J60
3029A71l24L26j09J66k18k8N5m9R8j8Mp8L5p1j8J10J3j27k03K44J29o3J3M0k0
3054G8k48l7K07m9Q6l4J72j5q2j58j35K47j3j10j04L07n7J27k92J8M6m5M2Q0J37
3079A68j66J71m60K71K2J04j99J59J4n0j23J20j28K2k5K20Jq5K7k69J35K19J02
3102B50k86J54%N8k93J08n0J82l02J15R5r5P7p9J01p9Q9k03p7L27O2k80J20J38
3126A32j48j02p6K81K38k70q1j94K83J54j44l05K0L51q8k10J49O7k70N2J00J89
3148A28o1J69j02j17j94J95m6LP0K19k31L9j01j1j17J67J90j45k30J84J73l86
$$ y = [-100, -64, 269, 63, -182, -62, -37, -125, -22, 209, 4, 1, -68, -72, -78, -101, -11, 166, 115, 128, 206, -106, -84, 73, -105, -93, -78, 178, -32, -190, -52, -40, -161, -254, -74, 5, -146, -135, 124, -174, 11, -65, 52, -71, -17, -83, -45, 80, 11, 171, -153, 173, 64, 230, 12, -16, 39, -10, 88, 70, 74, -4, 31, -40, -58, 52, 65, -62, -265, -21, 108, 45, 58, 98, 78, -170, -207, 0, -49, 37, 3, 175, 160, 78, -80, -215, 32, 19, -91, -195, 112, 55, 182, -110, -92, -46, -91, -49, 31, 168, 2, 173, -287, -16, 6, 110, -89, 70, 84, 34, -89, 31, -97, -75, -100, 120, 121, 36, 63, -206, -71, 148, 250, -36, 118, 118, 176, -117, -9, -59, 123, -179, -64, 31, -64, 13, -66, 35, -44, 45, -158, -235, 92, 154, -126, -6, 132, -16, -118, -194, 87, 325, 55, -26, -220, 63, 217, 73, -232, -212, 139, 51, -159, -10, 57, -213, -161, -61, 128, 67, 236, 134, 17, -177, 18, -28, -25, 45, 264, 33, 72, -29, -40, -157, 10, 200, 55, -175, 9, 182, -204]
3170b04J40j72K94j2J38q8j23j91M09k80l5L0J31J7lN3j08N0k12J86jj4%J72p4
3195A03j70J26k5k47J53L29l04N2kN8l1j23L37k68o0L38j69j92o6J90j32r8L40
3218A39j52n9J60k46J88j44n7J87q4M2R3r2j06P7K54k77j67K89K36j99m2L9j52
3241g3k1Q3J67k58K62j79M4k55L59j79P0j34K43j9j64P5N0j95J4L71j18k25O8
3264a4J25j5k70K49o5lj6O7l4m6K0mo7M5O8K5l6j11J83j91J0J07j16n3O1K96k54
3291c9o9K12k5m5j81M3K44j54N8J59l03j49M17j85m2l0Q4n6r3K74j03k57J95J42
3315I7r3j33K86Lj54j67M08j00k58J63K2j30r2K16N1k83Q6J47L2j31O2J04j61
3338b5kJ9j88J46K05k50J40%r8L5k10J95n1j15R2J75J07j18q6l3N9k23K63n0o7
$$ y = [-204, -64, -236, 58, 46, 184, 96, -27, -218, 191, -89, -124, -94, 37, 54, 51, 104, -4, 46, -166, 20, 19, 5, 5, 177, 103, -67, 59, 34, -213, -60, 269, -35, 17, 15, 73, 42, -81, 256, -12, -72, 266, 97, -95, -161, 29, -103, -201, 139, -13, -72, 88, -158, 30, -114, -171, 16, -68, -26, 67, -25, -131, -54, 200, -77, -244, 45, 281, 82, 40, 79, -73, -94, -11, 156, -102, 160, -19, 25, -230, 129, -50, 20, -114, 129, 110, -54, 21, 71, -124, -110, 261, 143, -82, -14, 111, 96, -174, 75, 10, 7, -9, 58, 24, -22, -2, -6, -73, -28, 40, 65, 29, -82, 101, -90, -80, 27, -89, -142, -81, 215, -39, -108, 104, 79, 34, -147, -104, 140, -14, 44, 203, -100, -249, 168, -17, -59, -89, -5, -61, -154, 120, 17, -240, -45, 97, 4, -129, 157, 160, 6, -161, 247, 147, -111, 52, 74, -56, -148, 68, 119, -164, -78, 69, 101, -30, 32, 136, -25, -27, -8, -196, -50, 155, -95, 45, 45, -53, -18, -228, -33, -84, -199, -107, 68, 175, 57, -29, -62, -3, -226, 37, -13, -80]
3363h0J98j29J75k89J90J56n11K54Q6J3k61nJ98k61K32J04q7j38K10N1M8n8kR5
3387A89k18J70j8j60j6K3O2n5J86QJ3j37J21j64P4o5j00J20k4J45k71K7j00L53
3411A63k93L5Q5K08mj57N9j57J05Q4j60K7q1K39q7k48J58J67L9k29K31m0N7k49
3435d8J55j64K7j7J95k8j39n8R1l5j66N00l41J38m1L3j35J72qj56j5J06J25j71
3459B0m9J29k02J70j74K32j9m8l9L9o1j74J4K84P8j85p8J55j30N2o4K13m3m5J76
3484B51j01l55J09j92L82j15j41L83k78M1J72m5j63R0j20P3k5o8K79j89J40j49
3506b1O7j25Q3J99j34O5j65L0J02p9q4K51k3k23J94k20k5m2K68j7j04k33K23J03
3530I0l1K6Q2j51o0j4J43n8l3J39k47J24J28j34lL5J0N2o3q5r4J63j1p3L86l36
$$ y = [-80, 118, -11, 164, -125, 65, 221, -290, -36, 50, 63, -198, -203, -5, -266, -34, 70, -17, -155, 55, 106, 154, 96, 94, 189, -29, 141, 123, -37, -53, -30, 32, -23, 163, 171, 184, 47, 168, 4, 78, 13, -87, 33, 9, 154, -117, -90, -190, 163, -130, -95, -10, 198, 194, 37, 96, -61, 44, 128, -32, -5, -86, 153, 66, -182, -24, 143, 182, -47, 184, 144, 201, -48, 107, -57, -30, -47, 148, 120, -19, -77, 14, -21, -187, 313, -28, 110, 69, 102, -33, 139, 131, -25, -40, 66, 191, 20, -29, 100, -102, 68, -106, 126, 107, 59, 20, 59, -2, -176, -162, 122, 200, 15, -63, 92, -38, 14, -50, 163, 120, 75, 251, 150, -205, -96, -288, 94, -21, -162, 221, -57, -16, 156, 111, -52, 38, -82, -9, -34, -102, 177, -12, 128, -21, 46, -79, 4, 203, 69, 134, -31, -1, 101, 22, -62, 189, 166, -57, 137, -83, -108, -150, 118, 101, -3, -236, -13, 90, 59, 85, 167, 16, -44, -58, 85, 27, -6, 133, -114, 10, 138, 4, 1, 36, 46, 98, 35, -50, -144, 19, 8, -65, 321, -15]
3556a5j5J69j67K83k23l6l0m5J24K28l80J94Kk28J42o5J24j38nJ34j4o1J48Ok38
3581a06J50L6m36K61O6l3%J13j26K11j97k7j50J22J04R7j70R1P2r7m1J24j34p3
3605a43n6M19l8p3k40K1J01o2J48N3q9mN0k45N4j6O1K2p3J21j6M1q3pJ27J05k76
3632i8J81J2r3M1n8O2n0r8R2R8P4n4p5k00K84j46j92K97P3j46Q6k21J61j40J53
3657D3j11P4O3p4L0k8j9J26m0k30J98j00l7J27j05K3r9J65j67J91J5n6K2QM3j19
3683e7q6O3J61k36J24J14j48O8j22J84p0q1R9J29j53N5J35l02L7MJ37j65K00n
3707H5j58m4K68j40MJ0J2o7K0M1jk03O5K84l72K67J23K5l03J70R0j10K4j49K27
3732A68q4j74J0N2j14J00J41j33M4L2q2j30J58O2k06lK38j46K36k46J86l88K38
$$ y = [-15, -30, 139, -28, 255, 32, -4, -34, -79, 45, 273, -107, 87, 89, -139, 3, -62, 62, -76, -81, 53, 39, -22, 126, 132, -106, 44, 80, -356, -95, -29, -62, -62, 51, -75, 136, -61, -88, -238, -116, -12, 85, -85, 6, 78, -19, -60, 64, -70, -143, -199, 220, 182, 109, -131, -110, -9, -71, 77, 130, 41, 37, 87, -158, -104, -120, -59, -37, -110, 11, -5, 36, -47, -54, 73, 178, -98, 83, 95, 2, 43, -15, 47, -3, -101, -9, 89, 163, 109, 34, -166, 118, -28, -220, 77, 150, 4, 90, -131, 30, -110, 43, -68, 6, 69, -5, 25, -3, -22, 104, 64, -166, 32, -68, -105, 22, -83, -60, -159, 6, -161, 30, 45, -11, 11, 19, 62, -57, -143, -80, 81, -155, -31, 83, -65, 3, -119, 65, -5, -86, 13, 142, -11, 44, 179, -123, -86, -82, 55, -110, 90, 85, -73, -117, 151, 11, 15, 25, 37, -30, -10, 31, 30, -173, -108, 176, -196, 71, 194, 219, -84, 86, 176, 66, 90, -59, 168, 84, -90, -80, -28, -142, -42, 99, -34, 10, 42, -40, -170, -12, 50, -156, -159, 79, -67, 169, -77, 109, -279, -41]
3755d1L4J40l29K67l8j13N3J17Rj93Q5j71J58j47J52K43k05o1J97k42J16J6R1
3778A38j72J9Q0M1j14j6P1M4m9K94l08j63J05o9K10k39L52k59J62q4J8k9J6J4
3802F2k9L1j98J38K9j12J04K4j81J68n9J24k79L37j48j66J57J53j38k25K03l9
3824d4M1j46L44l22J9K49J26j22j86K1r5R3L0k0p0n7L06k89j04J03K75o1j03o
3848a8J34o4j58j2J75j85L10n2o3p3M7k11K00R9r9j52R4j07J68m4J77j69N2j33
3872h4J21j22J6PnJ97k43J51m0R8j28m0j8o1J15K14j54J08m6o8M2pJ39k86l0L02
3898A78j29m8P4L8j42l5N5J2pQ3K7l38J86R2j2j43n2L31k45p2J24J08j26O0K61
3923B80m12J36R4Mpk27J93L0j69O2l7j5J7J33m36L86p2J4q4J61n3K4R5l23J69
$$ y = [-41, -7, 133, -196, 71, 33, -80, -27, 90, 99, -94, -9, -180, -22, -169, -17, 226, 21, -40, 157, -85, 31, 47, 138, -34, -15, 65, 106, -8, -24, 47, 91, 42, 336, 28, -135, -30, -99, 111, -128, 224, -35, 127, 43, 61, 32, 48, 62, 33, 64, -134, 4, 33, -79, 25, 49, -132, 36, -23, 101, -178, 159, 11, -155, 2, 155, 17, -208, -5, -44, -3, -149, 195, -127, -108, 141, 267, 145, -41, -20, -115, -22, 8, -12, -82, -139, 167, -122, -226, -123, 152, 91, -12, -18, 116, 52, -106, -118, 57, -128, 182, 130, 67, -6, 41, -170, 30, 129, 30, -122, -28, -135, 33, -11, 166, -3, 49, -84, 37, -85, -69, -62, -67, 130, -113, 38, -2, 96, -32, -72, -90, -151, -36, 178, 24, 132, 86, 18, 60, 53, 192, -94, -124, 178, 49, 1, 75, 113, -29, -64, -9, 3, -4, 79, 106, -232, -46, 46, 34, -109, -161, 170, -75, -147, -23, 85, -41, 19, 280, -132, 4, 98, 102, 95, -132, 61, 91, -78, -16, -53, -68, -51, 82, -354, 32, -40, -26, -110, 51, -2, 22, 117, -206, -37]
3948c7N5o2M4Q2j33R6o5J71k78J95q7J52k03K43k34NJ18m9L3k11J04J02j65J25
3972AJ30n3j5j08nK6j61K55o9ln9N7P5j06J94j12K0r4Q0l7l1KL9j26P7P5N9k01
4000i0R0j39O0M5q3J2p2L29j35J44j20p3J9M9J93l9k35J53r2K6O4k20J2Q6p1M5
4026d2P4O9O5o2j34J80j93oK0j51K49J85k73J74j55J62p9j5p3l1p2J25q3m8R9
4051a5J94j78j49Q9J40K1j09J3J28J4j64Qm0j6O8j64J75J1P1j42J26k25K02K62
4075C20m84O6J0J24J6Q8k12L7k6J29N2j29l9J12j71nK15k47J58pJ2r9J55Rj21
4100c7N3q6L02j28j2k3qj9LN7k93J66qR6o9l1R0M8Nj33J24P6j78o6N7lN9J09k03
4129e2R8k7l8q8J80k7l9J63j97rJ10j16M2N5j63Q3J58j37RJ1m2j63K0J98P4L8
$$ y = [-37, 18, -44, 0, 82, -51, 45, -20, 151, -127, 68, -19, 133, -70, 173, -61, -56, 62, 13, 46, -165, -61, 41, -124, 1, 131, 78, 63, -45, -50, -24, -185, 70, 1, -2, -61, -4, 71, -35, 159, 47, 67, -27, 53, 16, -15, -13, 26, -100, -23, 52, 111, -90, 0, -139, -79, -34, -117, -105, -177, 152, 17, 161, 41, -32, -13, 36, 229, 190, -45, 108, 16, 42, 106, -114, -102, -16, -87, -42, 32, 101, 166, 104, -30, 150, -43, -49, -29, -180, 69, 254, -19, 155, 0, 162, 83, 68, -5, -36, -108, 17, -66, -114, -15, 179, 1, -148, -59, 81, 102, -7, 6, 134, 148, -16, -8, -48, -64, 4, -160, 15, 26, 97, -45, 81, -144, 58, 320, -164, -98, -88, 36, 52, 140, -72, -35, -61, 68, 120, -9, -48, 64, -107, -112, 103, -144, 14, 7, 19, -80, 75, 84, -37, 16, -70, 232, 104, 92, 69, 61, 42, 45, 102, -191, -25, -33, 63, -6, -37, 53, 101, 106, -27, 97, 173, -5, -71, -14, -17, 42, 151, -52, 46, 19, -19, -107, 73, 46, 7, 170, -27, -36, 74, -42, 0, 55, -108, -25, 133, -4, 5, 16, -26, -189, -169, 29, 103, 141]
4155A41k26J69N2k21L6Mj22J46K43j67L0k41J00J13r6j4R3j43J22k0n0J36j62
4178g7J98j26Q3J17l73L09j73P4m1P9J58l39N0J30q7k12K28PO7j07J57j07J21
4201A36j81K01Rj28Lq5J31j16oK0j25J66O0k25J32q3M1m9K08m7p5J01J10m5j48
4226Er7L01k02n0N7Mo3M1Q9N8k16J06M9R7Oj07j38l9J04j4M0j78L68j36j13J51
4252A23K4k6j50M2o3J49j31K1j20J84pP1K7k57K24j97j06K25N4J3r6OJ29k22J66
4277H3J79k09L7j39J23j70J91j52n8K20l26L81k16N7M4r1J11k3Q7q2K0mN0n0k20
4302a57J45O2o0l7O3j1l9Q4k1N2M6k59J14J2p6R8j21L4J88n4P6j06n5J41q1J23
4328A61k37k4Q2k5M4nJ4r5J33p7K41j13l8j87J03q8J50n3M4R6n6J74k70R1r7m3
$$ y = [141, -85, 84, 136, -85, -49, -45, -167, -21, 222, 55, 85, -156, -56, 57, -39, -53, 40, -103, 19, -1, -51, 85, -77, 121, -5, 78, 195, -178, 131, -42, 32, -9, 70, 228, -111, -61, 69, -18, -230, -2, 5, 72, -35, 122, 15, 136, -45, 156, 165, 37, 40, -45, 86, -30, -36, -16, -141, 25, 85, -140, -8, -91, -50, -99, 109, 62, -13, 88, 198, 153, 5, -92, 209, 7, -43, 14, 18, -45, -4, 85, 143, -73, 33, 82, 179, 185, 78, -60, -99, 5, -9, 31, -147, 221, 85, -28, 123, 147, 121, -29, 13, -50, 99, -32, -11, -131, 53, 46, 117, 144, -113, 111, -86, -192, 33, 87, 100, 4, 10, 139, -83, 83, 262, 53, 90, -49, 74, -96, 95, -57, -115, 105, -221, 160, -56, 1, 45, -46, 65, 42, 129, 47, 67, 63, 113, 63, -157, -12, 50, -10, -47, 16, 5, -34, 50, 29, 81, 127, -132, -18, -6, -82, 16, -105, -71, 117, 63, 139, 33, -22, 119, 38, 161, -76, -100, -18, -43, 1, -4, 10, -85, 48, -29, 212, 99, 61, -126, -23, -111, 39, -14, 30, 126, 70, 244, -26, 65, -32, -75]
4354g5q6J36N8mk8K0Q0J7k21K42n1j32j08lK16M4k14J42l41K76Q5q6p7O0J21M5
4380A16k88L3J69j96J38o9Q6J46m1j93j29M4K09J13k88K48J75m34M5P0J67j08
4402A3J32j27j4J24rm2j4k1Pl3k9J14k31M5J57j47j06J77R6k7k18O2K78j30k4
4427C3J53k62P6m4jp5L39j63Q2k8j56j89K30p2O5p5J53nk9M8j30j1N0p1J20p4
4453c6oj26J77j28N5p3J54j6nO6kp2j35K04j13J42j28PQ5m3k44K45r3L7J01q6
4479c3N4k65K77q1l3J71k1j03j84L37j78O8J46j35n1M2O0k9Lr7R1k0l7n1r9J62
4505fN3j12J46l8J34j71j25J5M1m4J62q5O7k17K67j1L4j34M4k97J75K19p6o3O3
4530D1P9k36J94n0J46j94j43N7J68j40J18j15r6M15k62k7k3J13m0p7O4j13J31
$$ y = [-75, -161, -25, 33, 29, 1, 21, 101, 118, -103, 139, 88, -44, -152, -155, 61, 105, -109, 33, -308, -32, 53, -33, -110, -50, 71, 116, -172, -139, 30, -166, -28, -97, -11, 135, 94, -99, -228, -184, 25, 138, -150, 98, 273, -161, -116, -46, 121, 13, 145, 18, 4, 128, 119, 77, 63, 42, 49, 16, -13, 101, -130, -85, 72, -75, -181, -4, 92, 65, -153, -91, 187, 57, 33, 186, -76, 0, -44, -45, -120, 219, 56, 138, 110, -46, -235, -5, -77, -12, -87, 66, 61, 32, 80, -50, -61, -11, -82, 38, -36, -42, -168, 9, -119, -64, -137, 17, 1, -4, 62, 60, -12, -147, 57, -56, 86, -42, -35, 50, 7, -237, 8, -85, -48, 53, -33, 21, -244, 33, -48, -81, 90, 69, -34, -218, 119, -59, 9, 155, 20, -31, 11, 71, 42, 45, -52, 39, 19, -18, -69, -168, -6, 47, -65, 81, 43, 177, 6, -119, -104, -63, -107, 55, -30, 37, -180, 87, 76, 110, -24, 20, -277, -102, 117, 41, -22, 41, 120, -116, 78, 28, 174, -20, -163, -106, 62, -78, 40, -75, -171, 244, -18, -45, -68, 45, 5, -72, -8, -121, 10]
4553A0k81m5L52j21q3K47kl09L40k05K41j70J28jj20J5J61l11J83p6l5J86N3m1
4577A16k06K06j58N7k01J71Q0j40J21j39nj08J35K94k12N4l6J38k47K89j35m4
4599C0j03J06o3J04m4K9M2j49n9J40n4m8J83k67K66j21QPn5Q7J9Q2j91J51r1r1
4625h2L8M9k6l6J69j65N3j30K14J04k47M5O7m2N2n7J1o1N2k4k60M03j75j14J36
4650b6J22p2j7L7j84K12Kj33J12j41N7l2J40k05J50J47k56P3J9o1k04M04l9q0
4674B5p8k2oJ47r2J40j78O5O2jj24P9K4p9K1J8j42J13J8J66l11NK65j48L7l1Q3
4701E6j23J04j31J13J08m1P7k02M1J26j59O5n0M5k9j12J11j80N0J45P5l3j26J93
4725A23r7r7N4J83j38j19l6K82j93K02j10k29L15l5lL4o4m2M0n4l0j59O8R7p9
$$ y = [10, -271, -316, 36, -85, -168, 79, 77, -232, 108, -97, 144, -26, 102, 101, -19, -4, 157, -154, 29, -47, -82, 104, 157, 116, -90, 116, -42, 15, -186, -15, 65, -75, 46, -93, -98, -206, -71, 223, 11, 65, 29, 167, -80, 209, 74, 30, -73, 33, -30, 74, 30, 59, 101, -48, -107, 33, -21, -69, 114, -153, 113, -8, 0, 7, -48, 39, 58, 140, -51, 100, 9, -82, -44, 5, -21, -57, 112, -53, 0, -130, 84, 188, -59, -14, 53, 11, 63, 6, 17, -44, 8, -16, -276, 127, -48, -162, -26, 96, 24, 7, 44, -140, 72, 74, -59, 53, -88, -31, -63, 77, -128, 22, 169, -87, -14, 5, -56, -260, 144, 105, 25, -53, -75, -81, 66, -26, 114, -64, 1, 63, 62, -62, 17, 41, -38, -17, 1, -141, -28, -10, 156, -155, -150, 115, -33, 4, -27, 56, -67, 37, -94, 19, 127, 86, 163, -39, 2, 128, -31, 34, -16, 29, 0, -112, -1, -181, -131, 14, 89, 56, -70, 123, 26, -71, -17, 166, 28, -91, -127, 155, -38, 164, 54, -175, 140, 105, 102, 136, 72, 30, 70, 16, -14, -173, -105, -8, -87]
4750h7J46k04K25K2j54m9J94j76K0J75m1k8jJ1J64j67p8j33K48k1k63L74Mp9m6
4775E6qj48j00Q5P6O2LJ34k16J11J59j40j15r3NK62j47K8j11kK36l03K04o7J30
4800A01j07M0N2j58L5k33L02k33J59J35k14J83l1O0l1N7k69j2K19j30K01j46q
4823b8N9k2M9j56J86pj35qj34J94J10L1M2j25n2j26J81j02k3Oo7K74q6k0q2M2
4849AP2p5K6K48m08JM7L9J35j34q6K93k08N4n3L5K0NK9q2pJ5J67J4l12K55o0o6
4877c5N6p2L3M2j3K2N7r3O4K0l8Lj60L2J08M8K0k1JK6Ql9j59R9r8K02j69on4O7
4907d9J18k01J66N7j73J61j28J21J03l28R4M6J50j52R9o8p7R5n4m8J30j7j6R3
4931A22J5j89jJ10j51M7o8o0J87j44K14N9k24o4qR5j05R6J59n7n2N2Q2m5rJ9j53
$$ y = [-87, 59, -145, 80, 102, -52, -101, 93, -83, -63, 112, 71, 43, 42, 53, 217, 50, -28, -161, 87, 66, -197, 177, 181, 102, 56, 48, -100, -200, -115, -39, 23, 26, 160, -56, 55, 214, 74, -41, -134, -129, 133, -14, 14, -97, -99, 137, -166, 38, -29, 101, -6, 34, 86, -72, -37, -270, 32, -201, -42, 93, -121, 62, 31, 91, 60, 117, -152, -164, 55, -75, 126, -20, -28, 31, 9, 58, -98, 88, 81, -54, -62, -196, -2, 108, 139, 181, 56, 4, -122, 59, -43, -66, -60, -127, 147, 61, 41, -41, 1, 73, -2, 24, 272, -136, -135, -88, -49, 86, -48, -134, 159, -49, 5, -48, -13, 7, 12, 41, -41, -48, -33, 134, 148, -164, 91, 31, -35, 21, -51, -18, 24, 11, 33, 90, -3, 61, 81, 43, 46, -114, -82, 26, 74, 94, 73, 74, 100, 108, 69, -90, 9, -89, 113, -56, -62, -116, -49, 69, -132, 34, 91, -82, 79, -49, 72, 175, -153, -59, -13, 137, -15, 84, 16, -61, 34, -20, -68, 62, 45, 29, 122, 137, -52, -53, 57, -94, -47, -115, -175, 12, -132, 82, 141, -83, -147, -155, -60, -165, -69, 90, 33, -19, 33, 115, 70, 61, 80, -73]
4958g3K1q6K32J13m23J77k2j08K48j91J42p4P8k7M8m7K3j14l5J02K21j48o5N7
4982D9j3n2j5L8J5R8l11K51L4m7j69J99k24J4K62j83J7O2r2j03K45j43J62p6K4
5007D2r8J87k29k9O4K18l44L45k87P6l5R3Q0n5j8Q8j74J42r8M4jl0R1r3jJ13m3
5034D8P3J6n0J54k44J16o4M3J60j29k22J3M2oK6J4j00P2K21q2j08l8R2O7mj03
5060GK9M7N0o5n1J4j38O1O7j79K25j50J30oo2m7O7j25J90k94K66j51J29J41k22
5085f7o3K92j36l1K3j09j1N8K2J36k39J06n3M7J22J70k70j28J56K5J5J6K03j15
5109A69j96L9l2j38O8O9j03R7J5K4k2m5M2M3j4J15k32K49l49J45M0R4r8j63J33
5134e0n4j01L92k47J25m5r5J92j05O9j07k0J6R0j48K51q1j45j1M7J17r9r3J98
$$ y = [-73, -52, -138, 94, 207, -216, -39, -61, -169, 79, -112, 30, -44, 34, 7, 55, 8, 31, -83, -118, -16, 205, 57, -8, 49, 36, -16, -31, 7, 22, 120, -191, 60, 94, 47, -122, 77, -147, -133, 129, -54, -37, 25, -67, -170, 75, -68, 94, 18, 42, -56, 131, -98, -127, -63, 155, -189, 156, -131, -55, -90, 3, 83, 28, 10, 98, -76, 66, -32, 12, 11, -19, 72, -21, -22, 91, 48, 121, 137, 87, 241, -3, 113, 49, 92, 252, 123, -99, -86, -44, -50, -24, -10, -110, -38, 183, 101, -7, -45, 47, 114, 110, 7, 36, 83, 133, 68, 17, 31, -107, -46, 21, -158, 67, -83, 47, 41, -21, -68, -1, -126, 64, -230, 36, -115, 14, 155, -67, -130, 162, 26, -5, 18, -91, -102, -44, -22, 114, -125, -19, -72, -25, 97, 267, -3, -131, 25, 50, 65, 81, 284, 169, -27, 12, -20, -158, -90, -21, -124, -27, -12, 12, -10, -55, -13, 30, 16, 131, -101, 148, -201, -56, -16, 78, -20, -183, -50, -104, -205, 187, -60, 65, 20, -75, 117, 12, 81, -26, -46, -30, 60, -88, 163, 82, -63, -74, -27, 90, -9, -102, 96]
5158I6J61m77Q7J41K0n5k02K48p0OL60n14J70o1R6l8m9J49j38l8J00K9j43O6N1
5183er9J19k7J03m0j12k1MK68j53l0J8m3k9O9lj78K05j44j4J35m8J5k3M7M5P5
5210A34j13M2j56K55j89p1j36K51%J04j56o3K18j20j3Pm0J58rj56L1m6J44P1J17
5235B64n2j74k7O5Q3k28J71k14Q9O4J07j25j37O5nJ58p4j26j0J12M1Q8J8j98j07
5260a52J35n8j2J97j49p8J70j10j29J66M6mn2j19J53j44K21j96J25qM0L3MO3k79
5285a37K21l5Qm1o6R5P3j75J21O6k32O3L6j99J1L61j12rJ16j55j24J18j41J13
5309b4n9K5m9L9j17K84J6k06J93j03K7K7r2N6n0k2L9R8k20PL03j43p5l9k8n0J84
5336B1k05K30j00o8J35O2M6j01j32J65j43J20j59K38j76j19K56L3k32J70j39P4
$$ y = [96, 257, -220, -133, 8, 28, -27, -229, 19, -51, -45, 315, -199, -29, -90, 6, -32, -81, 68, -70, -108, -8, 21, -122, -56, -5, -104, 15, -12, 91, 51, -61, -82, -78, 190, 37, 7, 25, -18, -47, 22, 19, -159, 46, -98, -112, 23, -25, -10, -33, 14, 59, 134, 21, 63, -93, 162, -27, -98, -234, 17, 17, 121, -35, -98, 120, 0, -13, -6, -46, 112, 103, -53, -22, -68, 76, 147, 264, 212, 38, 11, 76, 159, -69, 102, -112, -23, 41, 148, 23, -114, -49, -54, 104, 30, -96, -106, 6, 47, 135, 153, -45, -152, -17, -75, -87, 110, -39, -117, 53, -57, -186, -20, 26, 22, -30, -149, 4, -140, 81, -115, 10, 2, 42, 75, 79, 142, -137, 84, 49, 57, 16, -50, 45, 118, -57, 64, 130, -102, -39, -3, -202, -191, 170, 58, 49, 165, 10, -114, 4, -137, -24, -83, -58, -107, -68, -185, 99, 115, -91, 102, -1, 26, 53, -39, 17, -33, -55, -16, 82, -138, -131, 172, 29, -46, -85, -113, -163, 21, -184, 46, -54, -122, 13, 75, 121, 20, -112, 53, -90, 30, -129, 109, -67, -186, 70, 103, -129, 41, -98, -24]
5358b4l7J19j85L9K13j67K2m7o8P0J00k60K14L3m1NLKJ70k45J39o1J2Q8j10l4
5384e0J94k6k12J89k2j15L1j32J21O1l0J25n3j43J92j42j22O4Q2j05K54j60mk27
5408b30Q5J45o9J02N0Q4k28m0QMK7J23j42K2Q0J0J22ljj13pl2J38j18m2n1O8J12
5436A04l08J98K4K2q2N6%o2R3lM6j38j9J84j76K4J08j47J41j1j52J29k1R2l5p6
5462iNL6kq6L4l6lj37J73k9J95j85J60M1k11K3R9j33J79k59K19q0R0k26L3J75
5488F6k82L04o7O1Qj39J04n2J29l45K52K4o9R1J8k52k2J47M5O0%o7o6qL67l51
5514d4l4o3k0J76kn4L6J03l1N9l2j46%R5j32M9Ln4q5L9N4n2K27j70J08j22J1M7
5542c4l4n6L4K5J36j62J30o8Q4j71K5j13J20Q2N8j24K2K8O1r3K41k16K03l38J18
$$ y = [-24, -61, 58, -127, -88, 125, -42, -20, -67, -135, -65, 35, -225, -11, 22, -19, -14, -11, -9, 161, -84, 55, -6, 6, 94, -16, -50, 144, 118, -94, 95, 73, -42, -11, -143, -22, 39, 9, 134, 81, -62, 130, -12, -134, -70, 12, -93, 161, 1, -3, -230, -145, 0, -69, 33, 83, 167, -61, -101, -93, -89, -62, 61, -81, -59, 21, 31, 153, 150, 149, 36, 29, -3, 135, 17, -25, -76, -8, 104, -204, -6, 18, 40, -42, 14, 14, -48, 45, 42, 88, -50, -69, 115, -61, -37, 71, -76, 65, 54, -98, 31, 10, 102, 67, -9, -4, 32, 30, -56, -22, -58, -61, -198, -25, -54, 141, -44, 116, 157, -54, -31, 68, -65, 114, -145, 74, -6, 84, -142, -109, 66, -216, 88, 21, 82, 90, -49, 55, 3, 132, -213, 39, 63, -6, 85, 103, -149, -171, -24, 21, 81, 81, 14, -52, -60, 307, -44, -78, -141, -161, 15, 13, -41, -5, 98, 67, 126, 94, -52, -52, 43, -89, -40, -37, -91, -176, -137, -83, -135, 92, -78, 30, -92, -81, -34, -68, -124, -90, -65, 71, -91, 39, -29, 55, -116, -91, -204, -84, -2, 56, -68, -46, -18, 43, -50, 191, -25, 178, -160, -42]
5567d2J10L1ql8k2j43P5O3Q1k13K28J72k25j04j2J03r7k3J20R3p8L5k14k8K78
5592A42j69J1O2j3j77k6L21q2j07l4K12j70RPN5j3r4K38k35K8o6J23%j39J98j44
5618f3J20j1m9L4K9j8j47q1J92k1J7j86N1P8M9n2K99l43J00N4j75J61j78L10j80
5643a0j33r3M05o4k4j15O7r8J62k27J52n7J16q1r5Q1L0j16j34K64Q5k02P4oP3
5668E4p9o9K05k3l54K81L8N7p5R4j82j2K6m1rN0kj9k85L88k3p2O1j63J25J0l9
5695e8j52K90j30P3j16m6J76j83R9L8O1j74R5J7q6J77j14n2P5O1k51R5K57j51
5719AJ08Kl59L23R5j12k00OK01K4m9M7l3m6k6j12O6n0J15l1J32Qj38L7O6L3j32
5746b4k6R6r4QJ94j61l1J07j13J1Q3j01n6K37N2j67r1L34k51M3k39L99l10K24
$$ y = [-42, 68, 99, 91, 53, 31, -112, -37, 26, 107, -106, 122, 294, 69, -35, -47, 56, -41, -64, 56, 149, 71, 106, -108, -136, 142, -27, -16, 46, 33, -144, -170, 151, 69, -38, -72, 140, -30, -21, -14, 41, 28, -66, 172, -63, -35, -101, 22, 22, -117, 81, -63, 57, 46, -3, 31, 60, 42, -105, -186, 6, -15, 2, -184, -133, -55, -6, -58, 241, -102, -2, 52, -123, 38, -140, 170, -10, -143, -236, 169, 105, 81, -34, 33, -65, 97, -130, 22, -35, 81, 0, -95, -14, 16, -100, -234, 30, 115, -87, -13, -19, 54, -25, -94, 111, 88, -266, 15, 53, 110, 35, 129, -53, -65, -39, -80, -89, -39, -41, -60, -345, 43, 20, -52, 9, -154, -29, -19, -58, -210, 80, -50, 23, -93, -139, 37, -146, -47, -9, 52, -122, -27, -10, -96, 81, -33, -85, -10, 51, -200, -105, 152, 1, 109, 111, -248, 75, 170, 58, -142, -136, 65, 89, 40, 87, 54, 8, -18, -130, -64, -114, 1, -30, 102, 110, -28, 9, 75, 108, -24, -50, 46, -48, -40, 154, -7, -38, 69, -44, -33, 50, -51, -107, 130, 182, 15, -76, 258, 7, 50, -189, 210, -100, 124]
5770A24k26P1Q1K9J78l10k5j41N9J58J37j80M5K9k60O7K15j90L11lj91j04K44
5793A18L1k30J35j81N1o8J12rK6j9j3K18l46k2J71J11J3j31l1J72j98J19J19n6
5817I2r6j49J58J01p3j06M4K1K6nJ42k92o4Q9K42j85Q7o6j46p3J84J60J7j34J48
5842A22k44J38K5j55J28J1P1q4Lj2J80o0j23l3M1Q4j0N1j74J69L0M7k33j1J14
5867G5l5J69j90j3j05K30p3k1k7Jj6J6N6k56J50J1m5J53k0j77K53k07P3R6m2J0
5893F6%p3P8k7jqj84J05N3R3N6Jp4oj40J46q5L8j12J69j45ok6K2J26p4m0J51r3
5922A0K40k85O6j3q5J48k0QN1p7k12L08r6O3j42J8K11l03K60l25L16j20j0J27
5946A38j89kOQ0j20J05j10J73o3r4j01M18j18r5J8j32J68Q6k65K14k82J70Or4
$$ y = [124, -102, -31, 50, 79, 257, -53, -78, -219, -160, -2, 135, -45, 0, 29, -231, -164, 51, -139, 172, 169, -22, -126, 118, 149, -81, 54, -127, -76, -144, -32, -41, -15, -34, -47, 171, -175, -197, -26, 85, 98, -33, -64, 108, -90, 29, 148, 92, -4, -153, 5, 106, 33, -73, -29, -8, 18, 13, 155, -137, -201, -112, 130, -55, 32, -34, -180, -253, -69, 91, 108, -26, 122, -122, 16, 41, -114, 14, 25, 96, 12, 15, 3, 183, 123, 0, -33, 8, 92, 82, 133, -41, 128, 158, 205, -28, -39, 75, 40, 209, 19, 6, -99, 131, 58, 37, 10, 11, -5, 11, 67, -189, -39, -28, -73, 80, 60, -117, 136, -71, 2, 98, 56, 66, 66, -7, 71, 44, 43, 35, -149, -44, 9, 102, 158, 159, 85, 79, -61, 85, 0, 38, -74, 95, -50, -56, -82, -60, 66, -8, -48, 103, 10, 250, -35, 31, 18, -67, 81, 61, 69, 120, 43, -169, 139, 43, 106, -36, -18, 193, -110, 150, -175, 141, 21, 11, 138, -51, -53, -47, 33, -87, 18, -92, 81, 18, -76, -177, 241, 123, 28, 46, -86, 82, 168, -97, 117, -165, 5, 11, -83]
5970h3J09j79J37l7r0K60j92K3Ql2k57L49O1Np5m3R0l3j27K26k38J47J46l11K39
5995A03j42J34j56J99k39P2n4M5O0q3j5n0J70r5p3K00%qk80K35K9o9J61k22J11
6020C3k9J38j84J12k4O9k4j05j68J68Q0q8J03m8m2Pj49K47j48P6o0j29R7oK52
6045A78p5q8m7J49k68J96n5j3J77j23J1n2n8o8K77Lk97J35r6P9J57l07L65l43
6069a63j1J57P0J32l42N1MK00j43j53J24m1J29K3j31R0k40L19n0k68K21k3k9J04
6093C0nlj4jM1k09K03R5j48R4j14N8Pl0J50l41K29j14J94j17l2K8o7J48k9J7j71
6120a01J22O8r2j0PM5j83O8J17n4J73k37q7J14P8J9k18R9J9Q3M2j50j11K53k8
6145C6MK4Kj39j62K32N2j88J51n2r9J02J42p6J4NLj69K13l2j24J41N5o6k56K74
$$ y = [-83, 26, -153, -16, -53, -143, 117, -75, -52, -44, -76, -333, 16, 77, 82, 7, -36, 54, 21, -106, 120, -118, 29, 175, -136, 103, -39, 95, -61, 138, -101, -29, -83, -38, 22, -61, -76, -126, 44, -51, -124, 76, 76, 68, -212, 23, 52, -17, 144, -78, 33, 4, 142, -42, 70, 46, 115, 91, -14, -182, -14, 66, -22, 81, 33, -9, -2, -151, 96, -52, 24, -36, -165, -68, -74, 178, 103, 15, -32, 117, -151, 45, -10, -23, 154, 31, 42, -10, -68, -136, 141, 144, -153, -18, -114, -35, 122, -185, 180, -163, -174, -17, 53, 185, -157, -106, -102, 98, -45, -198, -74, -115, 14, 37, -94, -4, -244, 75, 25, -243, -22, -45, -74, 30, 25, 22, 8, 7, 48, -161, 42, 137, -11, 83, -31, 27, 34, 4, 154, -187, 42, -72, 122, 5, -27, 1, -66, 82, 53, 70, -101, 21, 89, -3, -13, -6, 39, -144, -76, 41, -13, 160, -77, -164, -50, 28, 47, -171, -72, -53, 30, 72, -78, -189, 64, 36, 40, 64, 66, -73, -235, -3, 49, -139, 12, -40, -139, -37, 105, 29, 43, 48, 51, -118, 95, 63, -61, 80, 135, 69, -187, 87]
6171H7j08j6pm5o7mJ2M1O0m4K8P5J07j79P9n5j26K88k49j32L49j12J18j07n4R0
6197B9RJ2k1P1p1j14J96r2M0r2O3j04P8Q4k23J55M7n9q2LJ43M4o3j89K5J00K2
6224A1n4R7p6j85K59j83J51p4QO5J1N1k15J14J00k84K22p7j3N7R8k69J88M4n8
6249a2n3K81l93K53k8k3k1J41j16J61mk99J97j92M1nP1l8M6n2J33k21m2P3J73
6274G1j05JO4PJ6K5j16N2j50J07J14k58j3J40K02o5j06j76K45k19K83k13J47J1
6298F4J1J01j08k12R0J43Jj94K5J19r8j0r1K11j4k16N2J18o9R0j05Nmk3R5J33
6324A14j52j63J64p8K23r1j18J35L2o6j03P7J04M7j71k8r1J34J31k27J04j04J02
6347b5K8Jk3qQ9j0j3J15k64J57j08Q0N2j60K11j82N2J60j1k31R0j14K3K40k58
$$ y = [87, -21, -37, -44, -89, -156, -160, -148, -107, -47, -91, -63, 12, 119, -60, 19, -36, -162, 126, -123, -255, 94, -18, 100, -7, -61, 29, 38, 50, 29, 100, 29, -85, 111, 19, 59, -33, 30, -74, 4, 88, -135, 20, 67, 8, -74, -71, 72, 116, 53, -136, -111, -11, 11, -43, 54, -22, -207, 52, -131, 20, -54, -46, 19, 30, 81, -134, -20, 80, -204, 18, -59, -72, -15, 83, -186, 2, 46, -12, -65, 216, -177, 76, 48, 25, 4, 145, 29, 190, 186, -113, 84, -108, -67, -72, -1, -39, 7, -45, 88, -133, -175, -102, 71, -34, -33, 31, 38, 54, 79, -37, 15, -135, -28, 86, -172, -185, -45, 157, 92, -14, -190, 55, -164, 119, -94, 53, 64, 75, 176, 68, -144, -54, 89, 90, -104, -79, 40, -58, -68, -159, 52, 38, -178, -126, -8, -77, 13, -92, -87, -91, -114, -19, 114, -38, -201, -37, -115, 108, 17, -101, 34, 66, 0, -103, -26, 78, 125, -46, -74, -165, -31, 100, -127, -23, -127, -25, 3, 4, -19, -27, 62, 52, 39, 154, -110, 47, -61, 19, 71, -89, 122, -60, -8, 152, 141, -90, 0, -114, -91, 149, -109]
6372a09M4j40R8J81j41K11k80J80M0k49R4K30o9j42P1q8P9P1j91R1o0l1K28j31
6396a3l0J21M5k14J49K4j26r4J24q3m0J83k03J77j98J63r0J35r9K38k43J41j89
6419a22NJ10m4L5l6J49K47j93m5j63K04k98l7K55l16L23j10K5J33k60O4M4J17
6442H7j30q9R9j0J84n1k20J32k2K09k78M4J47k34k0J26kn4J51j87QJ11n5J44j34
6467d4O7R9o6M1nk06K71j94N4l7L3J39q1J2k91J31k3qM1J25k4l9K23p5j14j15
6493h6K79o2k25R9n4P5M8R1j83J31j59MlL6K12j29j77j58L64j48R8j66k5J68j30
6518a00K49j37j09K02j62K45l01J56j19J57Q4k30m7K60J5k7j62k4j18l8J24m2
6540a24J54L1n2J08j16J01J9k86K52n6j59L05k20J60l4j98L48l52O6J14j43J0
$$ y = [-109, -65, -205, -107, 74, -67, 144, -136, 44, 84, -165, -71, 159, 90, -52, 19, -69, 10, 81, -110, -19, -79, -110, 118, -13, -43, 78, 123, -91, 58, 82, -44, -138, -14, -97, -137, 46, -157, 20, -178, -15, -105, 30, -69, 169, -74, 67, -122, -117, -7, -51, -16, -52, 97, 344, 151, 106, -57, 147, -151, -188, 67, -249, 74, -36, -11, 122, -138, -74, -30, 87, -43, -132, -33, -43, 141, 90, -130, 2, -20, 189, -89, -45, 102, -132, -152, -26, -28, -82, 69, -118, -110, 1, -54, 90, -44, 23, 122, 56, 97, 92, -114, 157, -37, 17, -20, 13, 152, 71, 83, -208, -77, -100, -108, -67, 58, 34, -5, 218, 143, 29, -86, 193, 131, -94, 5, -49, 26, 74, 165, -18, 113, -46, -42, -45, -9, 203, 74, -103, -261, 103, -45, 53, -113, -138, 30, -100, 149, 12, -97, 105, -57, 188, -113, 43, -76, 81, 165, -65, -112, 148, 163, 136, -26, -50, -168, -206, -82, -124, 30, 61, 9, 117, 1, 102, 121, -165, 87, 31, -128, 177, -43, 117, 83, -115, 233, -119, -53, 61, -82, -72]
6562g2J51j55O6on8J1PL7j8J00n6j05K32j32M8pp1J02K2o6j83J71l7J72j31k8
6588fj4o3Q3R2J1j19J70l13K57q3j47J79M1q8Qj14J42k12J03N6J41j92J37m1J44
6613A72M9r9j28m6J0j74R3J58j82J80j37M6R7j11NL9Oo7L4J15J53j93q4j17k0
6638b01K51R0J13j34k08J86k33K87l10K64o8j02J64M1j48J26k04r7L21q4P5l8
6660I1p5J65j42p1J75j64O0m7r6J86l4m9M1j8j52J70K8k75L16P3l54L28l91M0
6684a95K04o1o6J14N6J6p6k0J80j70N7k81J72J10p1Q0k3Q1k58K47L8j02K1q5J58
6709A26k10J89j21PL4M7P5j71M3Rl5q2J78L3Qj06j07R2j60J71p5n3J76Q3j15n
6735C1J16k26k8q7P1N4Q8j80J80p7k2n8P7J00j34K37l30K00J38p0k82Q4J03n1
$$ y = [-72, 79, -76, -10, -16, -74, -63, -56, -19, -37, 63, 7, -98, 134, 2, 50, 43, -28, 74, 96, 30, -153, 18, -19, 153, 22, -6, -20, -83, 0, 92, 103, -16, 154, -159, 98, 15, -132, 47, 88, 0, 8, -106, 36, -176, -73, -17, 124, -68, 69, 28, 172, 221, 122, -6, -52, -42, -216, -123, 35, -147, 33, -104, -58, 39, -72, -67, -28, -22, -89, -55, 60, 213, 20, -64, -181, -201, 50, 140, 253, 119, -89, 97, -136, 151, -159, 105, 37, -65, 99, 140, -8, 118, -86, -183, 138, 54, 129, 91, 16, 181, 39, -32, 143, -21, 39, -8, -104, 82, 48, -1, 40, 22, -130, 40, 68, -207, 109, 182, -172, 156, -235, -195, 9, -52, -118, -4, 52, 68, -8, -28, 152, -18, 39, -242, -70, 40, -31, 49, 26, 107, -151, 96, 134, 32, 53, -32, 126, -84, 105, -16, -9, 25, 72, 147, -24, 19, 28, -7, -89, 89, 122, 130, 24, -83, 9, -151, 20, -55, -108, 68, 151, 36, 31, 147, -79, -107, -194, -123, -69, 19, -161, 19, -58, -80, -138, -61, 39, -95, 142, -188, 12, 150, 80, -202, -118, -15, -66]
6759f6k2O4j4R4j9k0j09L5J03rp1Pj1r2P6J00J10j99Pj6k2K37j87o4l1K18O2r4
6787F7m27K77J67r9R0r8J43j02j63j11O5J24J95k42J21K2j55Q6p3J2N9O9J09q2
6811E4o1o4N7J7L2KK1p0J75k51J08p9m8L14k91M0R3k2J17r2R4rj42Q5k12K4J28
6838B0l4p6K49k62J35l4R1j80J36J9M2r8j08J35lR8j70j32L38o9j84N3M4o4P1
6863A7J5j24j38J88j1j6J5q6j46K25q4J45j05O3Q6k8m1pr3K23K8j53P3p4J66k62
6889a24J92o0j81J01J49j07J39j43m0K88k46M8PQ7p7K0M8n2r3Rj18J9J44J22k05
6914g3m1J76l4q4J76l86L38m0j83J34K3N9l7k2N0k49j00K14J5N2M7j86M3R8q5
6939i5N7O6J7j7j08P7Q8J5k04J94Q6j11MM8k71J19K09j92j45J38O9k08L30j66
$$ y = [-66, -88, -24, -38, 56, 37, 17, -92, -57, 46, 37, -34, -27, -38, -130, -54, 46, 156, -43, -36, -52, -74, 163, -24, -88, -119, 99, 161, 67, -360, -83, 84, -15, 75, -23, 120, 18, -145, -256, -191, -67, 128, -114, 7, 29, -126, -40, -113, -101, -42, 27, 136, 54, -7, -71, -14, 3, 35, 37, 58, -12, 163, -88, 20, -59, -107, 207, -84, -44, 49, 27, 144, 52, 146, 137, -5, 80, -132, -108, 20, -14, -90, 159, -103, 32, -2, 89, -91, 45, 64, 106, 8, -100, 35, 32, 130, -40, -172, 166, 97, -87, -34, 10, -54, 17, 32, -92, -230, -42, -53, -69, -54, -140, -286, -61, -145, 0, -105, -42, 44, 16, -25, -32, -125, 98, 126, -27, 46, -28, 138, -124, 68, 8, -173, -72, 77, -30, 109, -34, -74, 214, -32, 16, 23, 110, 33, 53, 101, 49, -44, -35, -153, -134, 10, 132, -73, -114, 62, 28, -56, 120, -266, 72, 32, -151, -17, 6, 65, 28, 6, 56, -193, -293, -79, -64, -12, 35, -151, -108, -10, -95, -38, 28, 45, 28, -80, -3, 85, 100, -104, 90, 176, 65, 69, 117, -154, -35, 174, -18, -163, -25, 44, -164, 166, 0]
6963@j08K09m7j64K9O7k2J40j51K91k7k20o4J36p4j17J16J57k74J45j18Q0J15
6986I9r0m2N5j65K41p0K7n7n7o6L3j00K09Qp2K19r6j3j57K13L4j91P4L8k6j19
7012g1j7K06p9j39J36P3j77R5P0n1p6j76L39k25p8J69q1R9j55K12l39J40J63m9
7036a1j35J63O0j83Q0K52l05J7K4J24j14p5J19j47K66j65J08j07Q3j95N1OP4O2
7060E2k17J82l0O3j45O7K24l01m8J20j2J00j9Q7k24m1k7K11K06k49q7J16j43O8
7084d7Rj10J80K4JM1l1p3o2Q0k67J09J78j8j1j74K44k14K02j45K52k12ppJ83k53
7110a28K62j46L3o8J84j17j45J68Qo3m5J77lp1K1j55pL1p0J46j60R1k5P2N6p4
7136b8P2N7L2o4j48O7M9l61K44q8K69j4Jq8k2j10J90K6j16J20pO6k87j3K32o3
$$ y = [0, -108, 101, 54, -110, -81, -14, -36, 104, -47, 244, 217, -3, -67, 69, -5, -122, -6, 151, -123, 22, -96, -16, 99, 9, -33, 22, -143, 98, 28, 55, -2, -59, -125, -92, -192, 17, 25, -47, 172, 76, 63, -94, 119, 153, -38, 36, 74, 48, -71, -88, 118, 39, -100, 36, 109, -68, 27, 97, 46, -30, -206, 133, -92, -170, -1, -82, 17, -138, 74, -265, -125, 38, -11, -146, 17, 77, -106, -26, 226, -79, -62, -38, 86, -28, -103, 16, -131, 135, -30, 78, -29, 54, -141, -90, -84, -10, 52, -165, 17, -13, 50, -95, -28, 196, -105, -153, -33, -45, 55, 36, 123, -101, -142, -169, 42, 248, -1, -88, 28, -115, -47, -38, -148, 32, 56, 57, 98, 67, -6, -68, 12, -255, -146, 32, 14, 3, -171, 73, -141, 61, -84, 168, -44, -51, -58, 125, -128, 134, -12, 21, -47, 137, 20, -125, 43, 51, -12, -57, 120, 117, 46, 67, -88, -95, -64, -134, 12, -148, -57, -82, -10, 46, -28, 44, 101, 133, 69, -79, -12, 37, -324, -80, -168, 101, 87, 88, 0, -22, -132, 58, 84, -32, 88, 81, 147, -140, -153, 79, 16]
7162A6n5J4m1L6Qr7LJ61j95J59O9q9N7j8K23k69M1j08mN2n1R9k2J1ko9M1J03J9
7191I2p6k3m6J54j2j76N1KJ72p2j30q0L5J69P1M4j59k45J35K38q9q5Oj16P5K4
7217d1J07j77N9L4j80J95j11L9M2j28J57j92J33N0L5m1q3K36j18K7j74J75O1m1
7241F4j98J04J15j70J17k33K43j11J03p2n3J35j69K09Mj20j01J29p4K06m1k15
7263a28K9J73J39k28P2j72N4P1j89J37o5O6K32k41R4r0J3L9L5r0J19o9j19Q2L1
7288eM0j14K49k05K30j57o2k1j74K93K1pk19J14J03j26M6P8k4j18L42l39l8J51
7312E8J36q7k84L1N1Jl1N6K2K8KN0k52L58j34p7O3j35N0M1J56j7j45J20j92J31
7338@J24j69n9J08oP9j95J36O7j51k0O0P6p9O6Oj10j03J3J64J26k5j83J37m4l6
$$ y = [16, -39, -25, -66, -30, -22, -119, -116, 45, -150, 9, 78, -11, 46, 28, 251, -18, 23, -85, -89, -37, -88, 11, -11, 0, -2, -71, -30, 73, 92, 16, -7, -53, 101, 89, -87, -36, -34, 138, 66, -64, -144, -109, 60, 131, 175, 16, -229, -94, 144, 55, -30, -24, -140, -65, -41, 66, -111, -52, -18, -198, -3, -114, -75, -33, -161, -4, -196, -63, -13, 22, -19, -102, 134, 16, 43, -131, 44, 105, 64, -134, -30, 85, -85, 32, -201, 42, -69, 34, -38, -91, 44, -125, 84, 88, -32, -133, -4, -78, 128, 87, -128, -99, 74, 213, -15, 57, -115, -61, 10, -179, -42, -107, -41, 191, -50, 44, -46, -33, 6, 41, -49, 70, 1, -118, -36, -5, 35, -79, 170, -35, 195, 38, -24, -45, -219, 74, 95, 88, -131, -17, 86, -40, 6, 84, 60, -58, 284, -55, -93, 58, 194, 107, -177, -146, -95, -94, -125, -69, -47, -19, -17, 33, -219, 139, 5, -72, -9, -144, -94, -53, 103, 86, -59, 61, -131, 0, 124, -45, -104, 4, -2, 77, -118, 18, 85, -66, -86, -26, 50, -29, 37, 43, -67, -170, -157, 7, 133, 108, -75, 62, 18, -18]
7364a8j17R1L31l52M4K5m7Q2r0L1j40K45r9JK0N4Q5k37K36j35J0j29J14J97k58
7389e6Jo1R2PNk3j24L41l18N9j0R0j15K29o3K4k1O6L2p7Q4k03j29N9J59m6q1R6
7417A7j72O0Q0J16n0k1J53j31q0k9P4J45j69o6P4r3Q4r1k9J67j00L6k2P4Rm5J10
7444A01k7J6N7k37J49K7j59J85K1l04J49q2J44Q3j93Np3J07J17j35Q7r0k3J0N9
7469fL8O1j16P2J0j74J70r1j1q4K52j32j12K7J29j22j17J89N6j50J39j95j2K05
7493B6J09j19N8m2p9j33K98k7j47o9K49L4j80j8%J0q7J55O1m2rrL5J14k36R6p2
7520b4j64K58l8k34J90kMj62L05k20J81p8m6J33q5k9L9J24j82p5m7J24Q4j58J56
7545E4q2P6q0o0n0K11q1q6J87n5o1J9j02o2R7qq7R3N6R3L9k51L16k05R0j24L3
$$ y = [-18, -135, -44, 287, -65, -21, 4, -43, 39, -51, -20, -160, 85, -14, -13, 7, 61, 146, -91, 145, 10, 20, -109, 5, 202, -56, -55, -116, -24, -17, -12, -35, -159, 182, -136, -77, -87, 3, -112, 117, 54, 78, 57, 123, 155, 78, 162, -41, -170, -111, 48, 2, -79, 17, -155, -95, -15, 101, 51, 30, 183, 52, -28, -57, 17, 162, -7, -73, 1, -92, -8, -99, -128, 39, -61, -25, -47, 27, 36, -9, 101, 74, 90, 147, -90, 59, 86, -73, 112, 133, -171, -22, -104, 40, 123, -70, -65, -138, -31, 86, -49, 38, -52, -75, -65, -6, 32, 93, -23, 49, 59, -115, 55, -36, -47, -131, 121, -11, -123, -96, 33, -89, -206, -17, 39, -111, 28, -167, -179, 26, 135, 16, 74, 32, -47, -180, 118, 91, -56, -125, 124, 158, -22, -40, -40, -30, -117, 38, 99, 57, 48, 39, 74, 188, -48, 48, -24, -188, 70, 32, -202, -12, -14, -10, -172, 133, -87, 94, 16, -30, 103, 18, -11, 28, 152, -30, -105, -152, -28, 56, -102, 54, -28, 48, -32, -92, -142, 69, -12, -98, 89, 34, -27, -8, -110, -172, -75, -83, -170, -77, -21, 72, 111, -140, 176, -29, 61, -63, -30]
7572c0J64N7k65q2K15r5k20L31j2Km8j67J45j51M9K64r7q9Om4J96m6r1k01L59
7597A50mj11l9m1j62K11j03n4K19n4K2j27K12J34j22j99K9P4N7oj75K94j95r4
7621h4jQ1K9k0p8J01q6%R5Q3mq8P4Q4j33j41o8K17j87K11n4q6J73J2q1j41J18
7648B6J40r4q8k3O8P6m6k24L62k97K1K3q2L67k10r9J68j03JM5r7KQ0m0J27o8p8
7675d3J03m0j6m2K3J0O2l19K87j59J12L7q7K6J47q7P1k3k03J42p4o6P0P7J26l1
7701A03j46j43J17J7J41M6m8j35J23n9j20J78J1j5K3P0j41Jj32K07j74M8m3q6
7725a57J09R0n6k9l8J05q0Q1n5m3J06N1j57Q6m1K59k09l6J12j08J84j41J47k06
7749b6J6J20q3rj7K8N7k9Mr6n9P0Q7jo8l9M3o6P9m3K04j25j02J6K37j23n1J0q1
$$ y = [-30, 134, 191, -74, -156, 59, -36, -256, 75, 63, 65, 17, -150, -5, -156, -107, 157, 60, -29, -23, -67, 129, 83, -8, -209, 150, 146, 35, -4, -45, -207, 4, -99, -153, 66, 12, 34, -93, 119, 253, 131, -68, -39, 35, 92, 86, -89, 205, 10, -84, -85, -4, 25, 5, -73, 28, -58, -58, 37, 120, 116, 28, 102, 186, 53, -88, -156, 61, -126, 85, 31, -55, 118, 130, 49, -92, 26, 166, 72, -16, -39, 29, 105, 59, -165, 197, -100, -79, -56, -138, 229, 19, -80, 88, -15, -14, 31, -66, -64, 16, -24, 103, 35, -43, 60, 20, 4, -38, -15, -5, 57, -262, 25, -134, -22, 15, -72, -46, 101, 14, 85, 62, -141, 1, -73, -139, -69, 8, 134, 103, -43, -186, -69, -52, 89, 135, 87, -48, 75, 16, -104, 74, 85, 70, 93, 163, 22, 23, -109, 98, -76, -28, -71, -157, -48, 42, -14, -43, -81, 24, -56, 25, -30, -73, 33, 84, -73, 13, -28, 231, 22, -14, 98, -10, 174, 33, 180, -26, -10, 110, 27, 18, 1, 29, 86, 57, 61, -35, -94, -24, 63, 62, -6, -45, -2, -68, 11, -32, 172, 47, -55, -39, 198, 75, 24, 34, -47]
7778d7m4R4j28j30K23ONJ02J22k86Q7K71l64J33L0j96k2J11n5J5J34O0p8j02M5
7803a4J01k13L7J81k78K15o7J2M6o5L0k4N1J85L7k57K73j30j25k3K98j26j65k
7827b3J58j82R7j30J71n9M9P1l3r0o5K3J96k83R3j08K1O9Pm7K62j83l4J46j09
7852A7oj41K75j81N3nm2N5j64J32QM4P0p3j26J18n5k2K53j84l6k7P0K7p0O9q2
7879b3J9L6L3j17j8R3j48M8M3m0K70k34O5M4j67Q0k8K77l00Q3k75K71o0L9Kj44
7905a51J34J8J3j97J39q5J83P7j36q0J06N1Q9k1k92J57J22o8o8J24r2N8j86K37
7929A32r0r1J97k09Q9j0j22K69j21k19K08o5m5R5j42K57j99J35m4k5P2j46J23
7952D9K4N5j69j19J99r9m2J98o3j70K34j32k9J89j02j18Q7j3L1q7J95j23R7k07
$$ y = [-47, -91, 3, -125, -255, -32, -26, -21, 81, 203, -83, 4, 275, -89, 44, 74, -122, -144, -33, -88, -73, 61, 121, 43, -59, -14, 87, -126, -89, 92, -186, 29, -38, -26, 20, -45, -15, -39, 12, 197, 234, -23, 250, 120, -5, -28, 270, 144, -21, -23, 135, -47, 50, -80, 91, 32, 81, 152, 119, 29, -36, -13, 183, -100, -7, -115, -94, -25, -18, -65, 197, 14, -20, 126, 17, 11, -130, 145, -36, 17, 12, -30, 25, -139, -7, 1, 45, 115, 42, -84, 34, -21, -43, 210, 26, -10, -37, 33, 60, -10, 59, -23, -4, 32, 65, -52, -70, 23, -125, -77, -34, -74, 196, -38, 27, 71, -96, -16, -44, 233, -67, 16, -259, 12, -48, -9, -7, -151, -17, 1, 14, -183, -44, -129, 54, 131, -5, -85, 21, 72, 161, 140, -152, 5, 127, 59, -9, 115, 23, 81, -105, 132, 42, -49, 148, -61, 28, 18, -104, 165, 44, -175, 33, -32, -77, 18, -124, 133, -66, 69, 25, 0, 72, -74, 49, 73, 128, -41, -160, 39, -60, -102, 96, 33, -137, 97, -35, -64, 125, 23, -95, -8, -21, 10, -77, 118, -5, 92, -115]
7976a15R6j3J02k1l3r9J20J00j76l6J18j22J39j4j99J86k5rk73K87p4q7R8K6K2
8001bQ3j0j08j7K8r1L2J23R5j69M8l1j56L02j54M7j3KK2J1q3J7R9lj7n6l3J38
8029A04o0L9j0j42J56q8R8O8o4l1J3j67J78k03P5P8n5J95r9j51M4J83j46o5J34
8054H4q1j93J43J0R3p1q7J73j19K11j03q4J49n9J4j38N2k5Q7R3l9l5m1j69J49
8079A4K52k57mK2K8R2l19K30k75J28K01mj08P4J02j65M4r4K07k78J45k0j10J72
8103G7l06J56l8J75j26l5J44K06j96k20J85K2j05n5R0L3m4R1p7P0M9q4J51k19
8127e6m3J25j86J80q9J54k05J43k32K52P2j9k70K10q6MP2J64k29PnJ7m5J12J9
8152F6Jq4k0p9K97q3q6j43J84p9Q9k2j56J92M1l5J9o0j25j4M9J28Op0L2J71k51
$$ y = [-115, -19, -32, 70, 49, 16, -83, 37, 137, -39, -75, 43, -79, 60, 46, -153, 33, 8, -1, -274, 13, -61, -148, -50, -24, -2, 81, 71, -37, -54, -26, -117, -85, 38, 133, -36, 12, -19, -175, 127, -27, 20, 7, 9, 31, 42, -41, -24, 75, 72, 55, -1, -34, 104, 44, 83, 73, -69, 87, -1, 97, 165, 101, 70, 83, -84, 94, -109, -34, 44, -11, 184, 85, -66, -22, 161, 15, -50, 84, 3, -190, -47, -37, 56, -15, -102, 71, -48, 163, 60, -24, 125, 66, 80, -58, -6, -31, 56, 149, 110, 75, 34, -135, 14, 266, 9, 5, 27, 55, 147, -172, 58, -217, -89, 112, 108, 0, 74, 176, 11, 55, -39, 168, -110, 35, 15, -95, 77, -229, -73, -111, 64, -62, -97, 47, 253, 57, -163, 22, 44, -61, -116, -26, 7, -37, 54, -23, 47, 96, 12, 163, -56, -99, 26, -160, 20, -69, 85, -120, 23, -209, 43, 115, 96, -174, 36, -50, -46, 26, 190, -39, -32, -37, -20, -65, 47, 66, 67, -17, -37, -116, 181, 98, 12, -131, 53, -26, 63, 41, -115, 77, 118, 83, 102, 42, -83, -97, -48, 80, 86, 16, 48, 219, -32]
8179c2J82j71p8Q0n1J03m2K8n0n8J28J12
$$ y = [-32, 150, -21, -99, -19, -70, 33, -9, 19, -31, -89, 39, 151]
8191A51
$$ Imaginary data points
##PAGE= N=2
##DATA TABLE= (X++(I..I)), XYDATA
0@%%%Qj6QqJ6k4L2l2M3n9P2q8J04j26J50j75K07k38K77l24L70m26M89n58O37p17
29c78Q08r12J024j147J280j430J595j771J968k182K417k681K965l281L632m025
45b118M470m965N533o191O952p854Q939j0276J1970j4189J7250k1742K8990m2606
59b5837P6663l10110o22911N82606L88299j43151J32588M73527q5594m60127k42093
70b36140j13581j23102K51194M25387J18097k2575P5768k36774m98748j19747
80d80221K41453R6865J59658M15830Q4481m27104k30514N3197k12569k21042L61918
91a58048M99345M0628j10804l3890k91235l60826P9986K35881j7923J35587M38804
102D57505N1196m77640k87268N5285n0110n5644K62689L16723Q3176l7466j87698
$$ y = [0, 0, 0, 0, 8, -8, 0, -8, 8, -16, 16, -16, 27, -32, 40, -48, 56, -70, 80, -95, 112, -126, 151, -173, 197, -229, 260, -298, 339, -378, 430, -482, 542, -605, 675, -755, 840, -931, 1037, -1145, 1272, -1409, 1556, -1725, 1907, -2118, 2352, -2613, 2920, -3271, 3681, -4173, 4766, -5510, 6460, -7729, 9521, -12221, 16769, -25837, 50826, -259284, -882195, -299589, 88710, -54441, 78147, 551674, 466080, 5953, -236140, -349721, -472823, -221629, 203758, 321855, 299280, 375048, 138274, -360474, -480221, -238768, -141903, 17755, 433585, 518066, 90962, -139552, -86355, -298924, -519966, -158048, 341297, 381925, 271121, 237231, -54004, -414830, -334844, -98963, -116886, 18701, 457505, 508701, 31061, -256207, -200922, -251032, -306676, -43987, 272736, 355912, 318446, 130748]
113A30748l74988j55292K14570J17683l8246K56933L38366j74808m12930q5245
123a83209j007j70224J03723M47468J72282j81063n1424m895k89801k52694J38552
134b72292K47150J27816J49625P7504j84974k18204p3305j18296q0446K67688
144g7734L65777O249j62956j0482q4112k77709j00921J75224J54666J26294K00531
155C14827N578k93799k04530J5919m4350m3868K35336K91805k649j37090o3714
166G3465j40884k09032Q47J87554J35880J08003J24893n1765k39577j65655l4523
177b10794j0410R7906K30968J24171m8015l7825p0560k38104j68496J37490K13908
188B0239O6661O7816J02123q8712k41752j23428M491J5813J08867K11253R7862
$$ y = [130748, -244240, -399532, -184962, -67279, -105525, 151408, 489774, 314966, -97964, -183209, -184216, -354440, -250717, 196751, 369033, 187970, 136546, 131651, -158150, -410844, -272292, -25142, 102674, 252299, 329803, 144829, -73375, -146680, -264976, -345422, -77734, 288043, 294292, 131336, 120854, 36742, -240967, -341888, -166664, -11998, 114296, 314827, 320405, 26606, -177924, -162005, -206355, -250223, -14887, 276918, 274269, 137179, 73465, -67419, -276451, -275604, -88050, 47830, 155833, 280726, 228961, -10616, -176271, -210794, -221204, -123298, 107670, 231841, 183826, 146001, 75441, -162663, -331159, -193669, 20239, 86900, 154716, 256839, 168127, -73625, -197053, -192562, -176749, -67882, 143371, 241233]
199B41233o8247q4606j04016j74813p7492J28735J68592R4839P8264R412j49955
210F1946j76608n7961m231K4668J50337J92482L4465r3592q8675j13343j42208
221b12720r803J51776J39700O7466N5132j9351j56917j62683m2043L4117P1701
232h3625J37596J31940J1147r0497j15633j20084p4103M6227J28527J12692P5752
243A59939K6535p9202j54438j05893j6709L5066R6253J47224Q7482l8927j00848
254E6482j02880r8763m3157P0129J32289J02124M7440j2519r4366j35555q5161
265a63937L255O9566J10963J09319M2982m5152j00631j12877p7745R080R1772
276f3405J10326Q0781L3155m0709j13765j18476m9053K9797Q1310J05894Q7277
$$ y = [241233, 172986, 88380, -15636, -190449, -267941, -139206, 29386, 124225, 202489, 211901, 61946, -114662, -172623, -176854, -152186, -1849, 190633, 225098, 131506, 42831, -70512, -212720, -222523, -70747, 68953, 136419, 191551, 172200, 15283, -147400, -189443, -155326, -83625, 53971, 185911, 197058, 106561, -9072, -129156, -203259, -157032, -28505, 84187, 159939, 186474, 107272, -47166, -153059, -169768, -134702, -38449, 108775, 196257, 157330, 56482, -46398, -145161, -188318, -118189, 14100, 116224, 163664, 151145, 56779, -78776, -163937, -160682, -91116, 19847, 129166, 172148, 126996, 26365, -86512, -164257, -155177, -63405, 46921, 127702, 160857, 120148, 6383, -112093, -161146, -131349, -50039, 55855, 143132]
287A43132J4435o8463j07529r3482m1971K9082R1900J10747P0361o769p3921j00047
299c2525q4288l3672M0743J00766J02540N0476j6477p3918j03312p9451j1897
310a41015N4530R2214R3852M7775l0740q8012r3912o3078p085O2809J01082P9289
322A07709K6471k9887q4319j02668n3503K1227O4468Q2916Q1466K7487n6635r4360
334i628p4930m0075R797P5938J00710N7870j952m6866q4338q7384k9712L9534
346i1036P1955P9621O2024k251p1426q5276n9274k6293L0051Q9878Q7284L0312
358A15569j7747n2375q7114p4343q72N8040O8929O7475M4730k4565q2960p5327
370f0560l9384p419M4808R0925P0151Q617l1679n9246q2617n2707K1870O5032
$$ y = [143132, 157567, 89104, -18425, -111907, -153878, -124796, -32896, 77851, 148212, 141443, 67522, -32525, -116813, -150485, -109742, -8976, 93564, 144040, 127563, 53645, -49667, -129118, -141015, -86485, 5729, 99581, 147356, 116616, 28604, -65308, -128386, -135471, -72662, 28420, 107709, 134180, 104293, 19974, -82694, -136197, -114970, -50502, 32414, 113880, 141367, 84732, -9628, -84558, -124633, -114836, -38898, 61812, 119682, 117730, 70864, -13474, -100858, -130570, -91036, -19081, 60540, 122564, 120313, 48887, -36389, -95663, -121956, -91905, -2027, 85257, 115569, 97822, 45447, -41667, -116010, -116882, -58842, 10087, 77562, 122292, 97727, 14767, -60560, -99944, -107363, -62555, 28370, 98521, 107138, 75459, 16213, -66404, -119111, -97241, -32209]
382c2209O5460N8481K4014m6634q4459n9138k3943O108N8565Q9738M9029j2784
394I2228m0788o0495p3056l0934L9995O7477N7307M4379M475n9029q0133m5439
406h4013r820K2870O7207P8326K7950k6821m8182o1917n8796o341N2908O2935
418A6306M8691L1387j4482o8413o9920k9794K782L4402P0956O3787P482l6862
430E6322n0631n9246m2842J4367N9979N6585L8740J7089l0515p2531n8349j3141
442h4173J7291M3398O5867M6484p823m3426n2378n1995k4988K8917O1173N1470
454D9817K9284p09m4018o6896m3197k940K6349N2127N9960K5459k3281m5250m7898
467c1193m1788r979L9255O0782M5298J6621j7884n1472n6430k8310O713L3830
$$ y = [-32209, 33251, 91732, 115746, 69112, -15347, -74485, -98428, -92320, -33755, 55983, 105012, 92228, 51440, -9055, -82111, -113045, -73050, -5573, 51734, 96113, 100588, 41559, -38574, -84013, -93833, -70963, -3756, 74570, 102520, 75699, 27517, -34400, -93196, -99537, -46629, 16306, 64997, 96384, 81902, 13489, -56431, -86225, -83443, -49041, 21915, 85702, 93184, 56322, 5691, -53555, -96397, -82030, -22051, 34534, 73274, 90363, 59848, -12683, -71032, -84173, -66882, -23484, 42383, 88867, 81044, 37618, -14760, -66755, -91743, -62826, -1653, 49817, 79101, 78392, 34374, -32522, -75719, -78659, -52310, -183, 59777, 85236, 61955, 16705, -31193, -72981, -82960, -43705, 17077, 62375, 78996, 61112, 9640, -46790, -75100, -68387, -34557]
479c4557N4481N0960J0272l4371n0105m3900k6061P046M3052N4237L7950M881
491G3885l1777n3972m5028j4178J5617L9745N2304L6151m233l8643m8698l9051
503e7878j4981K1830M9956M8468K1531j0382l4903m6130l9464r867K9841N2162
515A0183M1938J2990j3721l3430m6053l7744k544L6026N0616L6968Q414j9382
527D4261l6395m2299l1319J914L9859N1472K9423J669j9064l9179m4469k1130
539f5257J3518L5391M2207L3846K780l1865m2754l3876j6882J3425M3870M3076
551C7479J7172l367k0633m4476m4286m652L0766L4357K9578K4653r54l6314m5595
564b6272k9069k082K7544M1922K8487Q910k455k6442n2148l3799J5391L4479K5287
$$ y = [-34557, 19924, 70884, 81156, 46785, -3320, -47220, -73281, -66235, -23183, 31054, 69004, 73885, 42108, -11864, -56892, -71070, -55453, -15708, 36596, 72747, 68514, 29871, -18827, -57878, -72859, -51029, -1073, 47395, 68926, 58544, 23641, -22489, -61953, -71820, -41979, 10183, 52121, 65111, 51390, 17960, -28093, -65837, -68381, -32355, 18261, 55229, 63643, 44261, 7866, -34433, -65752, -63838, -23979, 27493, 56916, 58585, 39521, 342, -44127, -65257, -51739, -16348, 25859, 59705, 62485, 30620, -12134, -46010, -62892, -49467, -5597, 37479, 54651, 51284, 30651, -13825, -58111, -62763, -31997, 2360, 31938, 56591, 55637, 19323, -26272, -55341, -57423, -29879, 12043, 40530, 49440, 46985, 20543, -31605, -65404, -50013, -15534, 9753]
577I753K8355K3524j6786m8701l4774r809K815K3028M1928L0203J673j7384l4478
590f53m1066j4814J9343K7346K7832L2611Q423l6320m3126j6620n659O07L1033
603a1063M5792J7519j0714k0237l3335l7484l628K9000K6871K2610K5984j715
615D9600m1857l6679q100k928M704L7253M3206O550k1336k3938k9216k5835M491
628d4085K8343K6901K4885J5474j8854m0602k1615m850p472J4762M8440L1634
640E2961j2978k2945j6274k9692k4145J7231L6489K0174J2504J0699j7279l9633
652a2888k5505k762R662K6962L5740J2067j2262j5161k3990l3599p185L0669K8335
665A0083J1265J4403N772k8750l8037j3034K435J0246L2022L4881K87k2558j4925
$$ y = [9753, 38108, 61632, 44846, -3855, -38629, -48438, -45623, -22595, 19333, 49536, 51209, 33825, -653, -41719, -56533, -37190, -9844, 17988, 50599, 59022, 22702, -20424, -37044, -42703, -42096, -11063, 34729, 52248, 41534, 21297, -12038, -49522, -53150, -24150, 2721, 25331, 51315, 49600, 7743, -28936, -37036, -39964, -35260, 1993, 45199, 51749, 30413, 6475, -22741, -48576, -44085, -15742, 11159, 36044, 51518, 32664, -7938, -29553, -34403, -41875, -27113, 21327, 52961, 39983, 17038, 764, -28928, -53073, -35842, 647, 20821, 33325, 44024, 26745, -12888, -38393, -41155, -31493, -4531, 31209, 43276, 31014, 15853, -8137, -41736, -48921, -18252, 10083, 21348, 35751, 41523, 12773, -25264, -38298, -35863, -25617, 6405, 41286, 41573, 19015, 4090]
678D090j7640k6416k587K9787K8601J4036R299q767l3482k8063l322N564J3070
691a5830L0747K6427m016k1751k1613k0596j1886J2243K2894J6650J8804J2313
703D4386k2195m3513j7004J1638Q715R395K7520K2246q672k4941k0680j7159o970
716c7234J6023K7452J9263P505m447k0838k5974j4886M00J4783K7918K2533j668
729C0830j4431j1145j6517k3974l534K7033L0310J2303j745j1055k0208j8840
741b0973r253K382J5805K7623J9435m647j8691j8024j5186r178N209J9605K3844
754A7951J5541l353k0893k2361j0861k662N159J9201K3524R696o129j4373k1663
767a1223k0390j46K0375J9503J0384P218j31j6851k5095j5534L420J9470K0911
$$ y = [4090, -13550, -39966, -42553, -12766, 15835, 29871, 39170, 30403, -3079, -31142, -34464, -28900, -15830, 14917, 41344, 37328, 15577, -6036, -26632, -38518, -26275, -3381, 13269, 32073, 44386, 22191, -21322, -38326, -26688, -17973, -8578, 18942, 41188, 32516, 7575, -13105, -30264, -37234, -21211, 6241, 25504, 33009, 28562, 7724, -18250, -33136, -32736, -17953, 9965, 32498, 30830, 16399, 5254, -11263, -35237, -38771, -11738, 18572, 30875, 29130, 18075, -2133, -20973, -30226, -27844, -12039, 15584, 35019, 30372, 11681, -6343, -21529, -30707, -25498, -5893, 17951, 33492, 30139, 9246, -13115, -23976, -26638, -21479, -2278, 21246, 30942, 24813, 10440, -11223, -31613, -31759, -11384, 8119, 18503, 25721, 25590, 8739, -16356, -31890, -28470, -9000, 11911]
780A1911Q974J430n1j3437k9005j6198J3312K1450J1289J0592Q494j0515k2944
793d698j4803n502J31J6037K5894J1825o607j1031j4863j8552o224J1490J4178
806b725J4816J6433r6k3036j9398m129l191M7J9880K3928L793q265r183j8969
820a0095j9410N788J8300P631Q610J8046j996k8654j8946J464M85L555K1783J8639
834B5200l201r127q851j9270j4418J0435J7878P815J0808J1522j3579k5298o811
847a6897R34o063J0961K9607R709j4678o780l933k0883j2626J6870J9117M600
860I938R146O603j7969k2786j972J492l015J5641K6141Q86j4640l881q684k1475
874b4575j555K1990J1564K160J2117J759k4958j8012N347N07k677K0862K3100
$$ y = [11911, 20885, 22315, 22264, 8827, -20178, -36376, -23064, -1614, 9675, 20267, 28761, 18246, -4698, -19501, -25003, -24872, -8835, 17059, 28884, 22277, 11246, -3617, -22169, -28393, -16903, -2725, 12091, 28524, 28428, 5392, -14006, -18135, -21326, -21279, -1399, 22529, 26322, 18057, 8874, -10095, -29505, -23717, -5417, 2214, 10824, 28870, 26874, -1780, -20726, -19262, -18777, -15222, 6561, 25200, 21999, 12872, 4021, -15249, -29667, -19232, -1354, 6461, 17269, 28791, 15212, -10086, -16897, -15963, -22026, -11065, 18542, 28251, 13573, 6793, 2860, -18023, -30649, -13779, 5338, 9938, 19084, 25687, 7718, -15068, -17040, -15548, -18563, -2922, 23219, 24105, 9465, 5584, -3100, -24575, -26130, -4140, 7424, 9584, 21701, 23460, -1498, -19510, -14163, -13656, -16333, 4529, 27629]
887B7629p725j5699q21j0718j9685N910K4084P080Q08J0972m436k6441j0782P521
901a2303j467K402K4385J4463j4699j1107L7j5159j5124J5838K2024n3J595J1519
915B2351j1147k6945m003J0075j991N866K4111O956j7499q281q64j5895q326K0302
929e290J7295k898L810P033j6918k2084K440P788j848J1768K2248l179j8824k759
943a418k004j6918j406K3503J1838n001N108K718k0478j7159P733P083j268J4741
957G072J7221r112j6944p95m796j4406P036K2315M599l753P133l239k4140r641
971b1450J2305M637j19J6314J1641j3884j3690Q27p148j0475J2357K0214O35l306
985H858N417q570k1619k861J2171K840L457J6165L993j6222q739R93r378n720
$$ y = [27629, 19904, 4205, 3384, -7334, -27019, -21109, 2975, 10055, 10863, 21835, 17399, -9042, -19824, -12303, -13770, -11368, 13017, 27480, 12781, 1674, 1711, -13448, -28572, -12734, 9290, 9237, 10832, 22351, 11204, -15741, -19744, -9669, -11660, -5794, 18317, 25273, 7774, -507, -1371, -17266, -25592, -5290, 12005, 9107, 12917, 19950, 3032, -19052, -16612, -8824, -10672, 1096, 23344, 20165, 1341, -1418, -3422, -20340, -21746, 1757, 13595, 8594, 13702, 16420, -4058, -21217, -13484, -6401, -7669, 7072, 24293, 15181, -1763, -2558, -7354, -21760, -14724, 7591, 12190, 8437, 15570, 12331, -11809, -21450, -9145, -4508, -4627, 11687, 23328, 9444, -4246, -3419, -10567, -21042, -8685, 11529, 12164, 8858, 14275, 5705, -15914, -18775, -6604, -3764, -307, 15858, 19851, 3629, -5110, -4117, -13495, -19215]
999a9215J7099J6424l025k653L125j2447j7851L379J1949Q89M976J4812p20j6622
1013A20o787j24q000N76J7620J0952m535j216o84j4444j1974P565R318M20P915
1028F722J1234o283j4970l715j710o508O121J8338N164o801o19k024j4928p451
1042a7430R575P809J318Q723P152r950j3131k363j638l149R783J4784J027n804
1056F706m59n702j3264j986J0118N432K577R487K443j3315j1017L73n66n50J0390
1071F67J1753j453n237j484p380j0713J406J0082N138L786O498j982j2684p810
1085i413L17J52L004J0448P139k622l586l074r504p446N575R311M069L517M607
1100A2494n446j2071m512J503N01L851J0473N270m271m341m467p928m364O623
$$ y = [-19215, -2116, 14308, 11283, 8630, 11755, -692, -18543, -15164, -3215, -2326, 2650, 17462, 16742, 120, -6667, -6791, -14791, -14215, 3405, 14357, 9822, 8606, 7922, -6522, -18496, -10931, -1613, -1193, 6722, 17956, 11673, -3297, -7012, -8722, -15230, -9109, 9229, 14393, 7592, 6973, 4949, -9979, -17430, -7855, -46, 1272, 9995, 17147, 7197, -5934, -8297, -9935, -13084, -3301, 11483, 12510, 6706, 6247, 545, -12719, -14705, -4587, 845, 3422, 12909, 15352, 2037, -8980, -8607, -9173, -9723, 667, 12420, 10967, 5730, 4246, -3134, -13847, -12441, -2359, 2779, 6565, 13063, 11081, -1603, -9413, -9096, -8944, -5940, 4508, 11647, 9025, 5439, 2365, -7139, -14585, -9010, 301, 4370, 7887, 12494, 7048, -5023, -9535, -8032, -7531, -3680, 6793, 12063, 7792, 3451, -1016, -8944, -13308, -6685]
1114f685R055M023K916M65o940q910k764M44J695O801R031K001m749m414n937
1129c968o791J12P859O747K784K580j056q149p884j159K195K436O650P474P53
1144A0583n656o453n305l047K503O755N313K724J827l677q126n780l46K814M509
1159a362O813M257j676n095n706n354j626M627O928L755K225K41m679p821m833
1174i306J236M248M999N493K527k930n925n329k860N83L563N560N234K220l566
1189E747o891n109j117Q27L054O456N649J06n011o027l343j205Q10L575N951M904
1205H376n8m938o448l713n74K057M676N346L184j137m140n691m182j03K991M827
1221D73M875K882j857n674m795k037o61J993O318N819M97l774l834l112l470j356
$$ y = [-6685, 2370, 6393, 9309, 9774, 2834, -6076, -8840, -8396, -6701, 100, 9131, 11132, 6383, 1969, -3968, -10759, -10647, -2788, 3959, 6743, 9323, 8267, 118, -7766, -8925, -6730, -4294, 2356, 9830, 10583, 4927, -1526, -6831, -9878, -7375, -620, 4693, 7417, 9244, 5567, -2559, -8339, -8685, -5871, -1362, 5451, 9708, 8032, 2937, -2769, -8123, -9749, -5122, 1806, 5561, 7786, 8027, 3348, -4473, -9306, -8070, -3822, 1177, 6670, 9197, 6267, 342, -4987, -7847, -7264, -3701, 1859, 7093, 9313, 5747, -1144, -6253, -7370, -6543, -3489, 2967, 8616, 8722, 3711, -2316, -5659, -6864, -6054, -2479, 3472, 8376, 8318, 3380, -3068, -6781, -7355, -5298, -622, 4724, 7908, 6771, 2631, -3060, -7242, -7345, -4354, 473, 5348, 8230, 6373, 699, -4096, -6133, -6794, -4801, 1517, 7336, 7833, 4059, 225, -2887, -6357, -7713]
1237g713L754P206M768r01m347l528k722k978p87M449P425L146k099k726l254
1252c07m488k630J770N229M596K602m37l507m833l797p24J747M933M913J381j161
1268E287k967m504m797l56M536M480K843R59n04l152m661l705l52L689N736L076
1284E608o09j429j725n201m650J423N973M065P18R45p06m068n216j903K153L552
1300a070L819K586O62k972m389l855p87K485K737L468L049N89l588n733k890O84
1316e205K443K632L485K753n31m333m468k085O82J945L207L519J899j065m025
1331H53m443k218J001K868L692K523J187j454m021l780j405R81K425L812K984
1346E005N29k692l860k949r19O27L015L847K659J17l493l796j770o38J55K907
$$ y = [-7713, -3959, 3247, 8015, 7114, 2767, -761, -3483, -6461, -7248, -2799, 4626, 7772, 5673, 2947, -307, -4795, -7425, -5655, -426, 4170, 6772, 6335, 2828, -2005, -5802, -6526, -4779, 154, 5067, 6448, 5287, 2320, -2184, -6981, -7337, -2801, 1679, 4522, 5481, 4977, 1825, -2836, -6541, -6893, -3204, 2532, 5608, 4999, 3570, 1845, -3356, -8006, -6583, -610, 3455, 4173, 5118, 4412, 344, -4872, -6775, -4622, -1070, 2749, 5335, 5997, 3025, -1364, -5219, -6006, -3521, -784, 2684, 5733, 6322, 2734, -2999, -5889, -5205, -2762, -130, 3355, 6108, 5577, 1244, -3224, -5309, -4627, -2682, 525, 4044, 5943, 4878, 853, -3590, -5808, -4807, -1939, 1753, 4276, 5463, 4009, -12, -3792, -5197, -4216, -1791, 2021, 5005, 5534, 2842, -1018, -3967, -4886, -4259, -1244, 2603, 5262, 5379, 1886, -1910, -3680, -4318, -4163, -1256]
1362a256N113K241k336l079j922k419j745K294M113K714O67l43k711l839k163
1377d671L20J644L186M136N68k429k212k378l318j68M192L861N39M88Q4l682m397
1394d237l64J860J107K712L957p3l570k536j285k153J58M353L460L21l42l64m086
1411a082l878P82K192J255L108K897j358l655j627j819j563J758M415J707j42
1426B990P90j628n133k166K409J546P70L813K254l234l704m33j255j719K705M939
1442B944M41o15L08k217m692p03K534J108J423M043N74m566k336N07k061j580
1458d888M669M443j393q28R63l078n186J074L795M33R37L654j95m912j972N84
1474a900j615l19M960L154j660p84J89l711l552K097L109K56J681K959k026m524
$$ y = [-1256, 3857, 6098, 3762, 683, -1239, -3658, -5403, -3109, 1004, 3718, 4385, 4042, 1331, -2508, -4671, -4351, -2707, 479, 4615, 5183, 2754, 542, -1836, -5154, -5322, -1130, 2731, 3270, 3758, 3842, 160, -4237, -4601, -2741, -1634, 1078, 5035, 4962, 1392, -1144, -2429, -4582, -4424, -71, 3389, 3710, 3368, 3004, -1082, -4960, -4178, -1986, -731, 2377, 5274, 3916, 261, -1366, -3185, -4748, -2990, 1425, 3132, 2990, 3780, 2152, -2981, -5147, -2738, -1192, -422, 3391, 5645, 2411, -1293, -1726, -2981, -4700, -1995, 2944, 3385, 2770, 3078, 861, -3831, -4534, -2000, -892, 531, 4574, 5148, 582, -1754, -1247, -3308, -4888, -219, 4224, 2831, 2003, 2966, -112, -5298, -4224, -429, 4, 941, 4595, 4400, -512, -2484, -1900, -3515, -3834, 1126, 4280, 2620, 1836, 2025, -1686, -5238, -3141, -32, 224, 1905, 4864, 2838, -1686]
1490a686k17K6k075J350N425J082k318J84k98m525k113L644K289n52K180K221
1506D617l170l727J03j55j186K833M332l71k070P69j550m842N9M268J089p88L221
1523C432R76m703k646J377q10j325M259M091k112k055R57j774m028P30M233N53
1539A155p8K669n33m429j487J329r86k29M439K670k681j559N17k696k789K653
1555b035K972j3P67K222j730m618n17J667p77O91L976J058k181j055l56k917j083
1572c929L372K198j104J366J826k687l891n2J193n9K132K801p28j881P7j012l270
1589c648J81L843J134o30J452M39l106k492R51L20J19K563K810j764k277Q5q79
1606h99k362P05K983J263K33R02j131l346j273J615M01J14K429J828j785j785
$$ y = [-1686, -1903, -1877, -3952, -2602, 2823, 3905, 1587, 1771, 1473, -3052, -5165, -1521, 768, 216, 2396, 4617, 1447, -2280, -2177, -2332, -3518, -685, 3647, 3276, 1206, 1975, 425, -4417, -4358, -90, 999, 211, 3432, 4408, -295, -2941, -1564, -2374, -3699, 560, 4651, 2539, 484, 1441, -333, -4361, -3631, 602, 1155, 1077, 3746, 3213, -1216, -2703, -1374, -2360, -2589, 1850, 4520, 1839, 280, 797, -1899, -4688, -2035, 937, 924, 1691, 3913, 2183, -2435, -2952, -1285, -2062, -1371, 2605, 3663, 1482, 427, 71, -2846, -3929, -557, 1641, 537, 1903, 3729, 1042, -2849, -2901, -1708, -1767, 365, 3166, 2438, 557, 634, -378, -3648, -3467, 376, 1510, 880, 2332, 2771, -335, -2827, -1876, -1556, -1437, 1126, 3936, 2172, -105, -20, -899, -3261, -2556, 427, 1690, 1923, 2825, 1694, -1652, -2925, -1310, -909, -795, 1634, 3462, 1677, -108]
1622a08l04j394j061J536K113N47P67O03j973l045k30J201N49P80K128O78j629
1639A158j247q29j428j48K136J844N6L69m3k040k024J76M64R47J394J675m96j428
1657E36q67j103j226N70K392J331L72k48q58j868j148L32L75R28J980J230r82
1674A746j596q88q69o52J069J799J191J42l86j545j538m43M72M45J466J431K30
1691B074p28j404j289j032O82J503Q47P59N03n66j834j104j93L13O72J900J004
1708B107l70q92j261j252n23J332J106M89Q38M99j550j669k05qk24J473K072Q6
1726B048p34q02q58j466j61J708R55L11Q28j76j692j205q6n5J79J818J441n71
1744A482o72n94j220j007O68J530K99M52J133q32k242p33N68n8M41K374O35j257
$$ y = [-108, -412, -1806, -2867, -1331, 782, 1329, 2096, 2699, 726, -2319, -2549, -1348, -799, -19, 2109, 2787, 1158, -89, -918, -2346, -2494, -358, 1486, 1542, 1911, 1868, -172, -2196, -2020, -1556, -609, 785, 2460, 1964, 536, -331, -1434, -2660, -2090, 302, 1633, 2005, 1757, 899, -969, -2117, -1785, -1410, -482, 1498, 2728, 1746, 150, -738, -1607, -2259, -1190, 609, 1800, 1942, 1556, 11, -1527, -1970, -1498, -1053, 413, 1844, 2074, 1346, -58, -1347, -2379, -1697, -194, 653, 1412, 1915, 1349, -485, -1589, -1782, -1469, -797, 1103, 2107, 1737, 845, -416, -1668, -2191, -859, 247, 736, 1574, 2073, 523, -1146, -1351, -1359, -1583, -110, 1962, 2048, 1314, 512, -346, -1812, -1973, -265, 690, 1001, 1829, 1653, -39, -1244, -1330, -1385, -1206, 612, 2053, 1482, 810, 216, -1004, -2011, -1343, 187, 486, 938, 2071, 1239, -1003, -1736, -1168, -1226, -785, 1589, 2224, 967]
1762I67p46n3j449r53J309J522J49N51N90j337k248N9P98l51J234J799Nj545k36
1781F5o0j777m40J827J297j75O18M50j766j705N85N95o94J160K052l64j394m31
1799a57l50j450L30J831R57o00Q32j77k054r57Q82L70j45J313J644j133j288J07
1817d5q88j215J038K115r9k92Q06l10k364m38J084k8K53J597R11j580j135N92
1835Br52r25J208J872j37l31K82p98j735J20P81j71Q15J821J9k000m35N09j061
1854a116o29J766J440m31m21M87j540j527P18J071k25P03J410l52j577m32j2p33
1872a400K82J713N93o78Q6M40j771j093Q49J058j68Q19R94j026r60M5m98j081
1890a796Q51K096K67j049K16K29j770q25J049Q03Q4R03O04j198j163J18j88m73
$$ y = [967, 221, 168, -1281, -2234, -925, 597, 746, 1297, 1887, 550, -1698, -1639, -841, -1192, 42, 1841, 1846, 301, 65, 5, -1772, -2212, -385, 912, 737, 1355, 1805, 39, -1666, -1081, -486, -1180, -20, 2032, 1668, 274, -157, -507, -1957, -1627, 204, 1161, 561, 1393, 1216, -838, -1795, -913, -543, -688, 625, 2269, 1136, -152, -45, -933, -2148, -1110, 1005, 906, 614, 1420, 1110, -1254, -1692, -608, -636, -383, 1214, 2125, 545, -590, 2, -950, -1875, -667, 1205, 1068, 737, 1019, 221, -1514, -1394, -613, -784, 31, 1852, 1871, -129, -564, -55, -1116, -1745, 21, 1461, 1030, 609, 1096, -444, -1971, -1253, -182, -407, 296, 1706, 1354, -223, -655, -667, -1400, -1118, 595, 1188, 510, 596, 1036, -735, -1828, -979, 79, -89, 730, 1724, 698, -262, -217, -715, -1796, -945, 1151, 1418, 369, 585, 814, -956, -1781, -732, 71, 155, 1058, 1662, 464, -699, -581, -769, -1242]
1908a242P77J755l90m60J91o83j369N04O90L18P9J085K68j674q09J11J91j29R65
1927A78Q85l5l18k60r26j083O48J296k85K09R76j51j386n42%N2K61J150L47l63
1947F53k92k00p67n89O78N68J19P27O22j163j141K74k0o04O46J185N33q42m28
1966d1j62o10j24N20N54L10M94o1q42o92N9j75J48P55R29K12r38l72l38m99kO62
1988b13M03M85J89k05n03q17j71J13L99J071J49j98m74k57l46n45l0P05Q75J99
2008H29r3m39m47l67l77K80P86N94j47k11l0n13p08j85N33O59L72M23m11l58n95
2029d05n59K54N93K75K42L45N1o81n45n73L82M43L23M16M41m02p36l03m51L11
2049e79N51N10K77k71k5o51n15r7M60M53L9N74J4m46m22l60j53J72N75N15j66
$$ y = [-1242, -465, 1290, 900, 440, 631, -52, -1421, -917, -227, 91, 170, 1255, 1523, -151, -960, -849, -658, -787, 178, 1063, 1028, 710, 450, -476, -1559, -911, 385, 100, 309, 1285, 1134, -252, -794, -794, -742, -481, 669, 1016, 653, 361, 161, -606, -1195, -517, 51, 170, 897, 1519, 356, -785, -511, -531, -1135, -489, 696, 1229, 387, -41, -203, -813, -937, -417, 137, 447, 941, 880, 38, -654, -595, -770, -622, 133, 1062, 1274, 336, -36, -374, -873, -875, -213, 190, 675, 864, 659, 156, -661, -832, -719, -320, 751, 900, 702, 228, -29, -375, -920, -950, -245, 630, 829, 736, 297, -150, -517, -894, -614, 172, 766, 619, 408, 378, -135, -843, -1028, -495, 164, 536, 959, 548, 190, -405, -964, -710, -117, 158, 400, 745, 796, 115, -430, -1003, -621, -178, 145, 561, 1002, 600, -136, -439, -890, -579, -28, 482, 759, 488, 463, -188, -703, -800, -340, 113, 152, 726, 740, 294, -128, -488, -641, -469, 106, 621, 455]
2070D55K74l66p65m14K13M97J08M31M70l59o19j72k56j89K01J035Q4j57M6k77
2090B40o96l75O31K2L11M81M13n03q06K4n5l38K84P12M45k62j95l23p12R5M38
2111a69J71J59M60J52o57l40k99KJ06N06K19J22L8j90m44n12K28K63K34L80K51
2132F80j47o13k37J3m07L05O51K85j66j63j85k84l62J16M81R8L52L44k98o65k62
2153d64K6n9J80P26L02k83q8j95o39l31M93M67J25P6L30n74l18j97j2R4M12L46
2175D17l3K01l77m55l64j67N82L42K47J88j12l04n42m82N60J62M50L6P2nm09m40
2197d33nK3M50Q5L51j6r5l74l43m6J0M85K9K56PN0p92k25K16K41j20L83M80j54
2221D63l70m61j6OJ82L05J28K80Q3l82n99ML08k15J03P05M8m50l59p1k24k7N22
$$ y = [455, 729, 363, -402, -816, -603, -106, 2, 433, 903, 544, -75, -247, -503, -692, -491, 544, 628, 471, 517, 240, -456, -831, -200, -178, 133, 614, 1027, 524, -282, -258, -313, -651, -367, 345, 790, 528, 333, 10, -702, -607, -169, 2, 161, 621, 773, 116, -224, -523, -521, -415, 91, 310, 432, 470, 280, -164, -676, -448, -185, 49, 429, 680, 533, -80, -317, -304, -711, -406, 245, 530, 364, 201, 16, -268, -630, -514, -33, 65, 417, 761, 463, -202, -464, -438, -497, -317, 409, 711, 428, 340, 145, -494, -825, -332, 135, 260, 336, 666, 92, -226, -423, -435, -341, 71, 417, 384, 585, 208, -247, -611, -778, -196, 146, 393, 581, 469, 165, -377, -859, -299, -137, 313, 349, 421, 416, 7, -433, -438, -415, 35, 120, 471, 455, 360, -14, -357, -403, -393, 92, 121, 377, 384, 434, -358, -583, -367, -126, -246, 137, 617, 463, 93, -368, -384, -378, -196, 109, 237, 517, 600, 218, -381, -377, -69, -284, -181, 524, 572, 122, -237, -308, -532, -559, -37]
2244c7K65J26J11K9m97n27L25rk74M11Q18Rq04o1K23o52K05M46L44j69Q1M3o56
2267b50k63L83k14J00M73N89n34m69K92l96k33L9R06P6m90L49L9q47p5M93k09
2288b41O7O34R7m94l43L56l33m75N32Q25k70l03L41l27o64R2M25o1J01O86q9o83
2310a27m1L03n75k19O75L53k45m1N38o03r45O67N20n85K45O47j12q25O3L87n51
2331d71j66J075J79n54K34L7n12o62P62M24o09K14P02k50r31K03J66n14K84R92
2351F03j74o18L98L02j029k97Q40K76o03N74L51o48m31O91l93l65M48P42k74n63
2371a70N02o6r58J31Q22j4n38N99L12p61j76O09k29n12M48N44m08l69N42k54q61
2392h07N58P23n65M9M74O6r20J14M77l36k71N17O98q44l3L84n40n22N34N14l38
$$ y = [-37, 228, 354, 465, 494, -3, -530, -205, -214, -488, -77, 741, 750, -54, -115, 108, -544, -339, 107, 451, 282, 363, 406, -250, -513, -130, -344, -244, 229, 818, 284, -185, 107, -289, -522, -483, 423, 499, 9, 358, 397, -450, -525, -32, -241, -174, 460, 557, 63, -280, 76, -257, -732, -200, 625, 355, 52, 393, 66, -598, -506, -81, -142, -41, 645, 556, -127, -168, 135, -440, -659, 16, 369, 124, 83, 621, 18, -927, -260, 260, -325, -80, 567, 455, -370, -307, 80, -471, -637, 438, 617, 63, 297, 334, -178, -840, -78, 346, -263, -49, 653, 403, -528, -325, -159, -673, -389, 603, 429, -189, 209, 511, -518, -815, 25, 301, -302, 272, 623, -25, -456, 235, -158, -523, -75, 667, 393, -170, 332, 266, -692, -561, 261, 247, -291, 308, 620, -141, -317, 292, 63, -449, -1, 543, 135, -234, 308, 54, -807, -249, 474, -91, -42, 432, 498, -422, -308, 169, -167, -438, 79, 777, -67, -100, 284, -256, -778, -244, 270, -68]
2413f8L7O26m02o50J48M53o08n9Q67J84n29J0L29n93l28P72J49l90N6M58m34l84
2435c56J25L10l45Q5P41l14m33L36r8n40J0N40K40m21K77L81o80k32M11J7j82
2456a28J36M61k18m08L73j78o23K01P62k36k10M73l9o30j63M05j7m93O49K32k72
2477G7l46L57k71k16L68K66j26l3L64k88o13J26K64k4k8K48K79l53k20K67k60
2498a62l41M58M23k87j92N69o13k63J64J56M5j9N82k05n97Q1L46l74j70L24L61
2519B86n05L38M5l02j44J42r8N6J31N86m17k61J27M7l10l8N12kj45J12m2k48j77
2542c07J67M6O7J32K20nl40L8k9l24L19K88k87L3jJ71m46j67M43J45l53L51l3
2565A28o5j02o3m3m5L62R0k37n9L31k76k56j29L85J15j32qJ20k1j33l2q8N9J98
$$ y = [-68, -31, 595, 193, -457, -309, 144, -464, -523, 344, 528, -1, 9, 338, -255, -583, 189, 338, -52, 4, 462, 28, -356, -231, 79, -266, -181, 560, 246, -187, 149, 51, -489, -479, 61, 301, -120, 157, 538, -142, -374, 37, 54, -128, 8, 469, 251, -157, 216, 38, -585, -384, 378, 142, -68, 405, 366, -264, -427, -22, -39, -532, 117, 349, 77, -269, 88, -183, -399, -31, 235, 109, 76, 440, 152, -461, -335, -71, -95, -123, 125, 404, 51, -169, 98, -162, -503, -45, 378, 91, -101, 468, -145, -408, -244, -88, -43, -62, 520, 315, -282, -201, 145, -229, -399, -75, 286, -219, 119, 164, -138, -282, -140, -238, -182, -51, 535, 118, -143, -16, 31, -279, -317, 195, 193, 48, 160, 118, -130, -307, -140, -94, -27, 105, 325, 320, -20, 18, -11, -335, -16, 272, -15, 18, 17, 188, -258, -425, 18, 163, -190, 161, 128, 63, -39, -102, -145, -190, 172, 262, 25, -34, 297, 21, -235, -364, 21, 136, 4, -4, 116, 95, -38, -70, -158, -99, 99]
2589I9J78l05J16m3P7l74J43M4k2J19O9%k18n4J28j02K45O1J7j29l3O4k33J22
2613c1q8M9J88M7J35l12j02r8J40J97j33qJ79o7l7j73k9r7J55J16K7J43J06k05
2637A02j29j22njK27J4p4J21n1j43L2k70j6M19K69j70k19Qk5j02k18K12J52L06
2661C17k27p7q7k6L7J57j88L59n9J18l17k06K43k00N4N9J29l0M1O1k88j09j4K25
2685b8K4J05p8q9p9J74k53j23M34r0J58j08j16L16l31j27M7J6L7K97j65K59k93
2708a3O5j26j96K41mkk2n4R3k02J14L2L2J01J39j34j63J07j01r4J06R6O2o7J83
2733A93o3k08k24L19p7j62J71K99k09p5Pj15p7K39J91j54l0K03l61Q7J75j77J6
2756c2q0K95J7j02j15Q6k05M3K9L65j98j39J5q8qJ73Qk15J46J80Q3j61l93L24
$$ y = [99, 277, -28, 88, 45, 122, -252, -109, -65, -87, 32, 101, 101, -117, -171, -43, -145, 100, 161, 178, 49, 16, 80, -153, -31, -119, -70, 118, 165, 300, -12, -114, -212, -72, 125, -8, -16, 163, 96, 59, -114, -143, -240, -85, 31, 58, 201, 307, 102, -27, -149, -154, -155, 72, 86, 12, 133, 82, -61, -29, -299, -315, 104, 373, 203, -16, -8, -33, -135, -353, -141, 11, 317, 90, 13, -74, -100, -63, 94, -94, 265, 206, 324, 7, -199, 44, -156, -102, -43, 86, 56, 97, 158, -130, -239, -253, -28, -4, 101, 23, -66, -145, 29, -224, -347, 87, -3, 155, 47, -69, 247, -84, -211, -164, -148, -111, 186, 21, 280, -13, 52, -74, -270, -29, -33, -35, -57, -111, -18, -220, -106, -74, -42, 59, 198, 64, -99, 8, -93, -187, -81, 15, 77, 10, 193, 130, -78, -302, 17, -60, -222, -51, 248, 39, -36, -29, -144, -221, 18, 209, 55, 25, 228, -133, -46, 129, -48, -32, -112, 183, 200, 98, -17, 69, -136, -93, -64, 301, 103, -36, -21, -109, -117, 56, 64, -151, -5, 175, 258, 97, -296, 28]
2780B8j06k3J14q3K82k40rL3n5L7M0rq7K91k10P3j78R9k21K54mj68P7O0J67k51
2806h9k7kl3R8K70j73q5J18j47m0K3l3K32j07L1o5Jl1J74j76L6K5O9K07l32R3
2832C7j14J5M1J85j45L14j62j72L0l7r3m6O5O1l4K20j17P9k17r7K18J51j68N7
2856G1N5j7k28P9N2q2J84J7o5k65K76O7j94k26L53K4k09L54j80q9J49j81m0q7
2880a82K68O1N1k69J87r5k54K52J04m8r2Q9J01m14K0L76l05j46M98l0n9k15n4
2903a56r7J36Q8P2pJ2m9o4j19J31J72p7j0J40n2l40J40J84k78k7K45J41m09L08
2927H4J03k12K33k40k0j24J01J57M5k19O4K04n04K07M21n1k20N2p6p5j04Q1j3
2950a06N2J44L2l10K33J82k79j96J88K00j13q5J93p3j80O6J67l87K52Q1l9Mr8
$$ y = [28, -78, -101, 13, -70, 212, -28, -37, -4, -59, -22, 18, 9, -78, 213, 3, 76, -102, -3, -224, 30, 26, -142, -65, -5, 162, -89, -116, -118, -151, -53, 217, 44, -41, 77, -70, -110, -87, -120, 112, 5, 36, -29, -28, -59, 115, -61, -25, 0, 69, 276, -56, 37, -77, -62, -21, 164, 19, 333, 171, -1, 29, -8, -101, -147, -82, -21, -55, 165, 48, 127, -90, -187, 31, 182, 14, 71, 126, 109, -119, -40, 12, -70, 114, 131, 66, -199, 77, 144, -50, -276, 77, 101, -108, 246, 66, -23, 126, -55, -95, -182, 86, 147, 198, -71, 116, 21, -233, 19, 123, 75, -17, 72, 173, -241, -221, 155, -150, -296, 202, 172, 113, -102, -156, -253, -117, -29, 43, 36, 48, -1, -65, -184, -53, 119, 42, 32, 172, 120, -220, -80, 104, -174, -201, 44, 185, -224, 84, 187, -25, 208, -32, -52, -176, -75, 82, 127, -92, -28, 176, -328, -121, 300, 249, 29, 81, 5, -70, -174, -93, -106, -54, 90, 122, -188, 45, 227, -52, -248, -60, 140, 27, -58, 135, 62, -118, -52, 115, -272, -20, 61, 22, 26, -72]
2973g2L5m1J0K8Q3p6n2J07j1j93L10j04k66P2L79j20k80N5L00j82J17J67j76r7
2997gj28K92k67j06L42Pk20J8O2J37m10L91p8j41K6O0K33k50J09O9q0k02L4K15
3021A06p5j32J02L3j43K92k18j6M7K29j85J1K28k01j22L2K8q0J39N2j15j52J47
3044GJ01k20m0L0J98J4r6J83l04j14K75Q4j66L4R8j44N7K0p6Q7J52M9p0l52M85
3069B92k41k7j73R8k2O9n5P4L9k42J53o2J50R1k01k47L66O0O7k10m6Q2j31K9L32
3094B45l11J23m7j14k02K16J04mL5j37J13p0j75K61o7l8K69j91Jn5J74j74l4K42
3118A64n5j08o5J53k32J15o1r0J53r2K08m8o8n1m1M1K26m2k06O3K13l3l04L9K98
3143A77j49L5l6N7q5j11P3%q0L5J31j91J28j2k1r5k4J85J95j37oJ03j74j60M6
$$ y = [-72, -37, -78, -68, -40, 43, -33, -85, 22, 11, -182, 128, 24, -242, -170, 209, 89, -191, -136, 164, -18, 99, 266, 90, -7, -135, 157, -110, -216, 126, 133, -87, -69, -7, 130, -280, 111, 33, -108, -82, -22, 211, -39, 70, 139, 59, -143, -109, 106, 31, -101, 1, 34, -109, 183, -35, -51, -4, 225, 40, 51, 279, 78, -44, -12, 16, -64, 75, 127, 12, -140, 7, 108, -112, -152, -122, 76, 90, -6, 177, -127, -241, 34, 118, -48, -14, 84, -60, -3, 17, -59, 28, 180, 229, 159, -193, 292, 51, 24, -149, -51, -73, -4, -59, 15, 54, -188, -35, -97, 53, 144, -57, -304, 62, 122, 189, -21, -67, 15, -116, -87, 245, -66, 57, 10, -104, -306, -90, 14, 10, 45, -92, 21, -49, -224, 37, -30, -68, 201, 10, 11, -44, 130, -44, -78, 164, 109, 1, -64, 89, -143, -28, -89, -179, -26, -118, 90, 42, -26, -77, -118, -77, 149, 107, -99, -36, 177, 144, -160, -121, 177, 28, 63, 27, 84, -1, -112, -39, -39, -119, -84, 47, -144, -16, -28, -49, -144, -168, 17, 212, 75, 69, 172, -2, -162, -116]
3168a16K63j91J73j31J55o6p3J4l11L97j14p5L2K50k5m02K66J6j39o9M9J50j71
3191a18N0J37k28q4L72j80l4O2K08k56K2J31j42K3M3J10j11K9J37k27j31n8J91
3214e4P5j12J72O9l15J58J01P5l28L41J5m07K7K58n6j20J1K3N4k2PJ33k74J07
3238f2J75j64J10q0L02l57J24O7j41o7O5NK7j8K96k74p8J06lj56J1K70%k43J05
3263B0J39j50m7P2M3kJ37P6k19k80L44L0k74l1K25K37m86K11L7k02k9J6J88p3
3287a8J29L4k24K5J18j3k04J76m4j94J42J67n6J00l10K08j11J32j6Q8k04j3K4
3310f4O1k63J59J45J9J13l2j99J7r3J10n6k05L32L0k20n7K48L6o6q5J62O3k19
3334f4K66k27k12L78k07J12p0J12j09L0q9m3L04l89K85J36k07k8J2R2j14P4O7
$$ y = [-116, 147, -44, 129, -2, 153, 87, 14, 28, -283, 114, 0, -75, -43, 207, 182, -220, 46, 62, -77, -146, -97, 53, -118, -68, 69, -159, -243, 129, -51, -85, -23, 185, -71, -49, 82, -60, -37, 6, 116, 5, 34, 171, -56, -187, -245, -54, 21, -91, 81, 150, -165, -7, 94, 169, -159, 182, 197, -210, -183, 75, 19, -101, -90, -67, -13, -35, -28, 105, -169, -62, 113, -51, 59, -21, 281, -76, 48, 115, -26, -93, -28, -23, 4, -14, 282, 8, -70, 36, 33, -123, -112, 158, 158, -85, 20, 159, 9, -38, 34, 77, 75, 212, 288, 69, -211, 133, 163, -111, -142, 83, 320, -166, 45, 82, -120, -149, -133, 55, -18, 111, 145, -79, -54, 64, 51, -153, 23, -21, -215, -73, 94, 38, 138, -172, 36, -75, 57, 41, 129, -75, -88, -64, -3, -266, -107, 38, 57, 170, 138, -61, -44, -137, -27, -83, -288, 44, 74, -146, -203, 45, 81, 15, -70, 92, 155, -64, 202, -25, -237, 141, -66, 46, -24, 88, -21, 9, -80, -123, 181, -208, 77, 213, 6, -22, -10, 82, -32, 42, 109]
3357A09j8j66L02j35l60J89K55k73J39m6M5p2r1K23P7k80K10L6k56K05p6j1K9
3380C5J3j25J77j49M62k71j90j01J50o4M7J37jm24K69kk82K68J17j63R8J16J35
3403B52l88K01J01j66o2O8Q2Rl8m3N7j59l5J85j91J6K54j29j88J72J30j48K2M3
3427D5J28p8j18K39j43k13M7Q8j15O5k4J44K2l1N6o5j32J42m5r6P9L5K34k24j51
3452a11K12n3J14k28J04j81J49J08r6Ml4M2j22l1J46o1J01Mmo6L6m9K33l93J28
3477d8j08M1J39j4J8j36J83L5k55J36R3m5K7p0J3Q6j29J6J44l5l6j67J35p9J46
3502I0n1J0q6Q4l2m2J38K0k75P8O4N%P0l1O0n5r3J89k81J01j07O4l0R9J61k89
3529a39J74J2n5q7j6L34k23m6oJ4K19k03Q3j07J45m4j98N8M4N3L9p0j13J77l7
$$ y = [109, 91, -75, 227, 92, -268, -79, 176, -97, 42, -4, 41, -31, -122, 101, 178, -102, 108, 144, -112, 93, 17, 6, 35, 48, -77, 100, -49, 413, 142, -48, -149, 1, -63, -16, 121, 120, -304, -35, -37, -319, -51, 66, -97, 1, 117, 252, -136, 65, 166, 0, -62, 6, 88, 97, 59, 16, 73, -86, -121, 64, -127, -111, 143, 14, -174, -2, 128, -20, 2, 45, 173, 95, -23, 216, 73, -140, -93, -5, -120, -55, -79, 65, 87, 56, 112, 47, -85, 57, 12, -84, -5, 30, 264, 40, -111, 101, 48, 162, -66, 38, -143, 6, 114, 18, 22, -12, 30, -92, -123, 23, -38, 63, 67, 63, -3, 33, -16, 217, -176, -48, -156, -115, 24, 10, 28, -108, 75, 110, -145, -9, 84, 39, 66, -4, 9, 95, -34, -18, 126, 91, 55, -112, 23, -56, 90, 39, 49, -37, 47, 15, -27, 111, 131, -144, -66, -2, 3, 3, 73, 42, 102, 47, -46, 143, -138, -37, -144, -80, -110, -11, 150, -139, 35, 47, -8, -95, -111, 223, 0, -46, -52, -38, 181, -22, 61, -46, 99, 55, -143, -85, -41, 12, 51, -19, -132, 45, 8]
3554HM5r8K5R9j96J44N7j97J30j45J59j77Q5J04J06q4r7MO7J40j71L6K1j65J91
3579I1r3N8K2j32J66j06m2J9j64K40m8o7L5R0J51j68q1J2Qr7J14o8l6P8J66k47
3605i9K7J44j02Ro0N7o9J91r0L6j70J38M6j43j2m2J4J46j00K27k04J52j29K2p7
3630h8LJ18m8lJ64l22J89M2j6J63j66L3l7j05J09J6L0j14M1J34j69J20j15O4j26
3655h3O1J6L0k34L75j57k05J70n7p6J59P2q8N5lJ09q1p7J1j12L10k67R3q6l0O8
3681b7%q0J38K23k96m0K88k16p4J23J40k0k54L17j60r5J05k5q7k3p1K27j8p0Q4
3706H9m9r2L5J56M2j56J80j81J8k3k14J57J0J96J05k90K0n3j25K16k3nj12K45
3730A46Pm13J21K14j80K5K78j67J28k32L70m11J08p7J37m2p9K13K0l15Q9K59k33
$$ y = [8, 53, -45, -20, 79, -117, 27, 84, -113, 17, -128, 31, -146, -61, 43, 149, 65, -32, -28, 39, 179, 8, 44, 65, -100, 91, -2, 56, 78, -54, 112, 6, -36, -17, -181, 59, 11, -56, -21, 69, 220, 52, -29, -17, -9, -106, 8, -60, -96, -18, 148, -99, -72, 72, -30, -21, -81, -24, -93, 98, 8, 44, -126, 12, 58, -85, -97, -139, -125, 21, -79, 148, -56, 96, -33, -11, -88, -85, 33, -15, -18, 146, -176, 13, 55, 39, 202, 36, 69, 32, -73, 36, 52, 82, -32, 9, 143, -26, 94, -21, 43, -83, -22, -6, 24, -210, 165, 8, -197, -27, -84, -160, -1, 71, -17, 38, 35, 144, 63, -14, -3, -115, 195, -72, 21, -65, -95, -27, -27, -107, 31, 254, -42, -82, 206, -10, -84, 39, 179, 159, -95, 222, 62, -33, 72, 47, -40, -63, -134, 93, 75, 5, 89, 40, -52, -17, 139, 181, 25, 205, 24, 42, 19, -195, -38, -28, 168, 273, -17, 3, -50, -175, 41, 18, 13, -99, 146, 153, -260, -139, 75, -105, -80, 198, 31, 159, -73, 297, -114, -6, -83, 54, 12, -67, 146, 166, -149, -60, 199, -34]
3753c4q8J82j46n6J15K14j3l73L30J03k74l7m9J1J37r0N9oR3J14m7k46K11Q4k31
3778c7m6P6m6lJ38J0r3l6J07J77l84L61K5l22J35J27p0j50k7J13J95j94j37K13
3802A32j60l9K35j71m7M4K03j80j0J08M3k41J87M3j10j95K82r9k02J86q5J95k38
3825a19N5J05pm0J35j73o3J70R3j11j44J74m9k02L68j45r5n4K68q3k2J21j78m8
3849d4M5L6P8j57J71j79O3j66J90n4o4R1M9q2r4J34r1m4J22o0JJ14j93K32j65
3874f7m1K18j38j12L9J39j54L0L24j40o8J29j00K7l06K62k4KK0J95k99J38L6k2
3898H8j71J41j3j18j0O8K30l03R7M6p2j06K49q0j20O1j3J20j07j41J05N4J63j97
3922b9k8j99K43m7K83l83J4J0J60nR9k07J06L1j29J10L0l8K8k04K30j29J89j36
$$ y = [-34, -122, 60, -86, -142, -27, 187, 174, -199, 131, 234, -40, -77, -126, -115, 22, -68, -9, -15, 78, 192, 145, -101, 110, 194, -37, -83, -7, -53, -56, 82, 92, -1, -37, 70, 247, -137, 224, 249, -73, 62, 189, 119, -31, -58, 55, 250, 56, -81, 132, -28, -67, 168, -3, -50, -6, 197, 17, 7, 115, 158, -83, 104, 147, 37, -158, 124, 25, -177, 9, -76, 119, -119, -64, 41, 34, -6, 129, -44, -107, 63, 156, 45, -99, 75, 26, -176, 192, 47, -48, -102, 166, 83, 61, 182, 4, -44, 1, 37, 115, -42, 129, -50, 13, -153, 37, -17, -81, 10, 59, -23, -117, 17, -74, -118, 4, -56, -55, 59, -134, 98, -67, -108, 110, -28, -140, -101, 38, -116, -86, 238, 98, 30, 159, 59, 86, -220, 42, 18, 20, 40, 235, -64, 74, 110, 88, -83, 58, 45, -73, -83, -15, 215, -88, 9, 55, -17, -123, 126, 46, -74, -13, -26, 94, -13, -154, -49, 5, 168, -29, -57, -256, -13, -60, 223, -160, -146, -136, 24, 19, 118, -89, 17, 48, -81, 29, 59, 21, 49, -155, 75, -54, 135, -1]
3946ak6J67j90J47n3j67K87j04k64J69L8J8R0j41M5o6O8J5Pk8jj20J72j78K27
3971A11j95J02J2qP3q1k3J31m9j53J01o9k2q2J78l6k7J43j42K3l0n0P1O2O6J12
3997B18j50p1j71K35n1n3K70k49o2k0O6J74k35K74q7k3J02k17kL8Q3j32r0K38
4021H5j05k0L6j16O7m1J88o8jj48J93J32n6q6j19oM5K8j62L35k21pJ97K4o8r7
4047Il2M9l15L81p9R0J44l00l0RK97j73p1l1Q9o7OJ54j03N5l10J66O0L0LMr4N5
4075dJ13j17LM8r5k8K04j77l2P2m7j54K91n5lN5j8O9j85l8J49Q8O2r0l1R1k07
4102c6q4M4P8Ql9J60l2O9j41J02j22J7Q8r3j42k8O4P1J32Mj37J21l2p9j50J88
4128C1n5rJ5r9M3Q3o0J14r2M2j58J55j27K31p3j06Q3m5j56K57L6l05K98o6j75
$$ y = [-1, -27, 140, -50, 97, 44, -123, 164, 60, -204, -35, 3, 21, 111, -30, 15, -51, 17, 32, 39, 11, 10, -110, 62, -116, 111, -84, 18, 30, 22, 95, 14, -9, 122, 73, -80, 21, -48, -70, -152, 26, -10, -37, 106, -36, -13, -43, -93, -22, 40, 106, 218, 68, -3, -174, 61, 10, -43, 227, -22, -84, -104, -38, 136, -99, 175, 88, 65, 167, -50, -52, -14, 69, -63, -153, 85, -20, -40, -4, -120, -53, -94, 94, 26, 25, -123, 70, 202, 146, 60, -59, -65, -20, 8, -154, 181, -40, -47, 150, 174, 106, 9, -23, 26, -289, 92, 13, 103, 247, -53, -83, -74, 223, 50, -21, -52, 37, -30, -24, 130, 27, 82, -228, -62, -2, 28, 31, 35, -59, -4, 109, -8, -5, 43, -52, -80, 124, -53, -85, -13, -60, -214, 77, 22, 19, 74, 56, 125, -60, -98, 51, 139, 201, 111, 80, 171, -36, -120, -76, 2, 10, -29, 131, 99, 168, 27, 129, 7, 24, 112, 19, -123, -151, -87, -16, 116, 120, -17, 104, 72, -7, -157, 31, -24, -33, -18, -117, -74, 9, -51, 63, -29, 13, -145, 10, -117, 114, 41, -65, 18, -27, -183, 74, 110, -195, 103, 37, -138]
4153a38J53O6j32j16J07L7J17nq3R6n3P9p9k10N1j7N0J30m0r5J76j37j42K11J31
4178A57k82K33nj79J6j13J59pj80L0K72j69J70j24k2l3J2J52j68p1oR1J38L2M
4203A07j41J43J07l18J66q4J01j25J73j68M4o1J35k03o2J65p1K11j52j09J49r7
4225i0J31L8m4l1M4l4j3n2J27k81K38J28p3J22k05n6J02q7nQn8J71j7Q8k91J32
4251hJ78j97l4k7J57j67J3K8n2J14K8kj41Q9J28k00J29J54j45jj55K41j62R7q8
4276b3K12J7q8l15n2J67J19k9L7k08K01j03Q3Rr6k6J28n8J51j90qK36m09K53j82
4301a74K76k12R0L0J6n0kJ3J77j69o6P6p1N9jL9k97K62Qj12K35q3m2Q8j66J7j
4328f0M8J93k08J04n2L9j12MK68k20l6N5j25Q8Q4l6Q1P1p0j09j26K21r2J58k88
$$ y = [-138, 15, 81, -51, -167, -60, -23, 94, 89, 6, 102, 49, 128, 49, -161, -110, -127, -77, 53, 13, -82, 94, -43, -185, 26, 157, -125, 108, 103, -76, -60, -173, -14, -21, -201, -171, 101, -68, 102, -22, -44, -77, -65, 87, -81, -152, -158, -67, 71, 103, 107, -34, 109, 216, -102, 64, -20, 81, -44, 129, -39, 5, -56, 79, -124, -186, -21, -92, 119, -33, -142, 7, -90, 41, 79, 35, 4, 48, 14, 1, -51, 76, -205, 33, 161, 88, 210, 5, -51, 51, -36, -41, -33, -91, 80, 63, 151, -140, -8, 170, -27, -61, -88, 69, -98, -85, -57, -109, 5, 33, 31, -110, -21, 107, -93, 36, 190, 45, 44, -111, 130, -32, 65, -23, 189, 206, 118, -197, -249, -82, 37, 8, 45, -163, 38, -65, 18, 27, -69, -95, 33, -25, 126, -64, -72, 164, -245, 8, -174, 102, -110, -20, 10, 26, -24, -26, -13, 164, -5, -71, 5, -66, -7, -8, 31, -266, -4, 4, -108, 127, 44, 2, 90, -76, -59, -60, -12, 181, -27, 77, 25, 64, -48, -44, 224, 4, -32, 23, -102, -14, 70, 34, 115, 186, 116, 7, -119, 102, 10, 168, -120]
4353a20p0K57P9j40M1J21j06o9j05J35J9k61Q3J85j31J52R5k01J7p2K24o5k2m8
4377b%Qj75Q3J79rk42J20k9M0L3P2j16L9j24J02j9J28Kj71J1K45r3j16M6p4J02
4404D0N9j62j8J87j89J48j40J50NJ4j10mQ3O5k79P1R5k2J71j50L0l5K7n6j03J27
4430DO2p0J05j99J44P3j39r7K54k33J95j02J20k49M14j41j69K24j57k8K9O0j4
4453H6M7j6k31M8O8p1%j26K37oK4k52J17M5J46j65K44k98J7J01Ll4k22L26K9k04
4479h7L2J16j1j02p5L34j65j31J6M3J37j59R1j29k1J96j04k6n8J67o0jj4ro5K17
4505A32j51J21j10N9r3o9J80o7J53l1j36k0J76k0k50J15K19k05k5L0J04j11n0
4528d9Q3Ro6M0K03q3r5J8j27l2J52j42R5O7j10o6J67o8j2np2J31j62J75p9p5K41
$$ y = [-120, -190, 67, 146, 6, 47, 168, 62, -7, -112, 23, 42, -219, -136, 49, -82, 70, 165, -36, -19, -91, 133, 68, 46, -2, -2, 6, -169, -86, 93, 84, -158, -38, -67, -27, 6, 78, -38, 1, -123, -21, -40, 88, 90, -81, -70, 175, 82, -34, 12, -62, 40, 99, -63, -81, 106, -83, 65, -75, 75, 80, 94, -16, -20, 63, 128, -151, -80, 15, -7, 164, 14, 44, 9, 36, -20, -123, 4, 66, -4, 101, -98, 46, 119, -20, -117, 137, -96, 99, -3, 117, -132, 282, 141, -28, 196, 39, 11, 40, 100, 86, 133, 117, -114, -66, 2, -69, -69, -195, 42, 36, 60, -192, -75, -30, 116, -49, 195, -103, -86, 15, 18, -16, -238, 88, 117, -87, -55, 61, 50, -52, -127, 207, 42, -89, -73, -30, 107, -52, 39, -90, -111, 85, -19, -45, -103, 64, 4, 3, -11, -20, -85, 132, -19, 102, -8, 51, -42, -111, 69, 2, 155, 124, -12, -32, 144, 124, -126, -11, 208, 3, -22, 8, 112, 1, -49, 34, 43, -23, 17, 220, 137, 42, 60, -67, -99, 53, -89, 6, 73, -37, -103, 64, -4, -16, -21, -93, 38, -124, 51, -28, -103, 138]
4555A38o9j22J7J24r7N8L5r8K49j88L2k18J46N9o4K55k66J20k45J2J19r0J71m7
4579C1k63K63j29K69l43M7K44p3n7l4Q9or0P7n3J22n3m3K46k42J48l5m3j95J21
4604bN7J0r5O8j03J41Pj21J60j60J12r9J00m8j95P5K27k45R5l4Q0q6J40R7j90
4629iO2Ql5K9j11j28L43q1n2J09k10K5K21k23N1N7l7L2N8j18Q7j27Rl1j12J89
4655Fj91J79j6J0q8K06j44j29K84r3p4K32j23j39p8J94%m1k8M6J45k66Q2o2m4
4680a32J56j19K06j24q5N4m2M9J19k2k59J43J58k26N0K14k4K1m5L0k16N6J45j49
4704d2J06j62M3K5MJ37j98J71k47K78P8l01J61n5n1k9q3r0J85l1L4mJ19P6p6o5
4730a7p7J6j71J71J92J1k86J36J42j67R0N4q5K6K0j25J99k2j25j38n3J59J43l1
$$ y = [138, 69, -53, -36, 88, -9, 49, 84, -14, 235, 47, 79, -139, 7, 66, 2, 257, -9, 111, -134, -122, -3, -93, 78, 31, -232, 31, -98, 171, -172, -125, 119, 46, -11, -45, 44, 38, -52, 25, -28, 94, 41, -2, 244, 2, 150, 115, 72, -123, -2, 55, 65, -30, 38, -65, 76, 83, -38, 122, -38, 74, -25, 75, 27, -168, -93, 134, -111, -16, -50, 30, -56, 84, 181, -9, 53, 61, 26, 55, -56, -184, 159, 78, 26, 135, -75, -50, 171, -52, -1, 56, 19, 51, 109, -9, 78, -49, -40, -71, -183, 6, -185, -6, -22, -12, -100, 106, -38, -167, 117, 24, -50, 182, 59, -80, -158, 36, 36, -5, -33, 13, 158, -108, -26, -88, -132, 24, -95, 111, -13, -98, -44, -86, -37, 82, 60, -199, -56, 102, -124, -74, 140, 116, 137, 92, 122, -94, -38, 107, -42, 64, -98, -55, -30, -26, 111, -87, 84, -163, 115, 193, -108, 53, -2, -53, -82, -165, -255, -70, -101, -67, -71, 48, 124, 48, -17, -94, -78, -249, -78, 114, 125, -161, -25, 117, -50, 40, 94, 9, 35, 55, -70, 129, 107, -18, -156, -209, -50, 93, 62]
4754F2k15l9M12j42r9k6N2j07O1j1M3p3J91m0j33O1J37j62M2o6M2O9j00q0J80
4779E9k08JR1k1kL18k22j31j10J07K38k50K32k46P2L9o7K14j47K4J36j39j84L10
4803A14j85N3J13L8j09M9j68J10m2j45O4P4N9j84R3j53L12k8j01j7om7J88j62
4827h0K9l7Q9n4J01J63k65P0rJ5O3j46q3R8K66j40j1j68P1p0M3N9j07j7q5K29
4853B4Kk48P9J78Nj09j88L92k79o0Q4M6k2O6R1j9k50J53Q5p9O0j5L3J05j38j55
4879a59J26k2M8M4p6J18p5n8K78m0k46J62j50J51j1j57J45j53k1L32j84R6j91
4902d3n5J13Q8j58L1k0R5k03K54j42O9J36j47k5j62J98K7O5j72J00k73K80L1j36
4926d9O9P2j03o5N6r6J32N7k13K74k23J77J3l2r8j07J14p3J10k15J56L0R8j57
$$ y = [62, -153, -192, 220, 78, -21, -47, 5, -102, -41, -52, -9, -82, 109, 69, -64, -3, 134, -28, 14, -52, -10, 59, -41, -121, 59, -149, -148, -57, -78, -80, 238, 16, -115, -225, -118, 120, -130, 102, -144, -72, -33, -100, 114, -33, -9, 127, -12, -196, 114, -71, -18, 95, 133, 24, 73, -95, 15, -27, -172, -108, -34, 25, -159, -66, -219, 93, 65, -36, -53, -59, -106, 82, -80, -51, -88, 1, -53, 48, 211, -54, 16, 7, 22, 85, -61, -144, -46, 220, 80, 69, -99, -28, -98, -55, 4, -103, -120, -205, 24, 26, -222, -143, 35, 40, -69, -257, 135, -144, -204, -120, -74, -96, -30, 61, 42, -208, -55, 30, -49, 11, -4, 29, 134, -4, -159, -33, -55, -7, 37, -39, 79, 4, -54, 224, 184, -62, 100, -50, 101, 90, -67, 78, -75, -96, 236, 52, 148, -43, -98, 15, 103, -55, -24, -44, 51, -152, 102, -40, 29, 165, 18, -7, -169, 29, 56, 121, -51, 49, -224, 56, 87, -49, 20, 92, -11, -76, -20, -116, 16, 73, -140, 134, -89, 88, 101, 69, -29, -136, -22, -95, 15, -200, -44, -14, 84, -73]
4950g3j1J20J76l24J27l2K32j26KP6l94J95J4Q3k15K42k34J06MO4oJ4J8o8O2p5
4976b3J32N2p1k00M5J55j27J66o0o6j34J25J29p8j02J79j52p1L5p5J32M4j5P2
5000I2k8J37k78J27R4n5j23J79l65L24j54j7m9o2K26J13L7m42M04J3j61n7M6J41
5024A42j40p1J97k2q9k1J34n0j47J54j2k44J25Q9j43N3L4k9n4J97n4l4p8j06L17
5049A48k04N5j09K33q4N9K7j78J96j56o5J44q0J61j46j44J33n9K11k04o5K94J8
5072A85k77o3K37j2J0p3N7O7k87J26k4J33j88K34j36q1j36K22J3o1MJ71J14j55
5096H0r9L0L9k23P6K10l04J39M2k2J1J33j01l6k4K43n2k12J10rk31R4L37l23o8
5121a60J16J37l9mMj12j75J11K47j45O2M0n7N0j76L1J08N0j14N7p6l8J9K6P7M6
$$ y = [-73, -84, 36, 212, -112, 15, -17, 215, 89, 91, 167, -227, -32, -18, 65, -150, 92, -142, -36, -32, 32, 26, 40, 58, -10, 52, -23, 109, 161, 90, -110, -65, 90, -37, 129, 69, 3, -131, -6, 123, 45, -57, 122, -30, -101, -66, -141, -9, 35, 20, 92, 64, 201, -77, 50, 144, 89, -34, 145, -220, 104, -50, -67, -116, -178, 48, 161, 198, -244, 160, 173, 12, -45, 1, 142, 2, -69, 128, 106, 17, -4, 130, 80, -67, 87, 75, -169, -44, 45, -98, -45, -11, -40, -94, 103, 49, 15, -63, -169, 148, -56, -1, -110, 123, 39, 98, 125, -53, 143, -13, -78, 66, -14, 147, 1, -143, -10, -69, 142, -62, -127, 167, 185, -92, -155, 82, 70, 80, 7, 64, 131, -156, -30, -54, 79, -109, 125, -11, -92, -228, -6, 7, -54, -50, 121, 235, 80, -19, 11, 50, -173, -97, 113, -191, -52, -10, -32, -21, 112, 11, -25, -49, 194, 142, -70, 40, 31, -200, -106, 231, -92, -160, -44, 93, 54, 50, 54, -58, -233, -122, 125, -20, 42, 82, 25, 75, -101, -70, 38, 88, -26, 31, -45, -83, -64, -38, 39, 85]
5147H5M2k05K27j91pP2j70K93o2o7J25j80J48j9r5kO9l7j04N0o1J02j8j47j6K62
5173I4j08K1j56K03o9J56n2p0j1J50j05L3j28n0Q9Nm7P7J93k93J09j77j60K73
5197b3J12j64o1K1O8J24M3j34J15j1k01P0k45K78J4q8O1N7M0j42O6N1p2m7J83
5222A15j09P2j84J18n7K6p8MJ24k54K25j1Q9j31P7j08o8J48k02J42j14J11J17
5245E2Jk74J52J51l88J33J62j51K31k2j20J30m3K8n8Q8j69Q6J36Nk6MM9j54L5
5270C8J88k96K7JR9k48J99N9n8j05K9L0O6O8j7n9R8N9o4m1Q0j66R2l24L99k60
5296a06J50J6j0JK6k17J51J7m7j30Q2J08n8J46k19J71o8KP3k09O1L1J63M2l11
5321a35P5q4P5nJ04J51j19j15J06l9R0m1j10L8m3N0O5n4k04Q2J03J77j35L8m1
$$ y = [85, 127, -78, 149, -42, -49, 23, -147, 146, 84, 17, 142, -38, 110, 91, -4, -6, 63, 26, -78, -28, -89, 13, -5, -152, -168, 94, -14, 7, -149, 54, -15, 141, 89, 19, 8, 158, 53, 86, -42, -92, -3, 2, -45, 32, 225, -68, 41, -136, -296, -23, 89, -75, -136, -115, -47, 77, 120, -14, 101, 90, -111, -41, -286, -8, 6, -82, -21, 36, 76, -66, 0, 51, -21, -68, 115, 6, 78, -106, 12, -45, -19, -97, -93, 31, -223, 2, -9, 80, -51, 26, -82, -150, -2, -204, -62, -176, -65, 52, 53, -221, -69, 82, -306, -173, -11, -162, 69, 47, -73, 57, 14, 42, -16, 72, -97, -11, 125, 130, 104, 108, 157, 3, 38, 226, -70, -43, -42, 57, -191, 8, 67, 9, -96, -67, -37, 29, 97, 80, 21, 119, 178, 114, 73, 153, -13, 79, -245, 154, -106, 44, 60, 50, 51, 77, -140, 11, 28, -19, -149, -67, 41, -17, 129, -90, 81, 13, 15, 88, -121, -60, -29, 134, 176, -135, -60, -144, -69, -74, 30, 181, 62, -53, 53, 14, 104, 63, -47, -9, -52, -2, 63, 9, -195, -113, -10, 167, 32, 70, 29]
5346B9j07m1K89k54j38J21P2k56M69j25l6P9k19R5R7K7jk03L6O7M3j15O7K2j05
5371h7Q7R9k51J62p7J33J18k28J9o9k6J63%K7j33N4N3j47Q8j17K43o3k58J69j6
5396e7m5R4q7J41m0K0j6l5M7j4p6J46j18r9J65L9o5K5L8n2m0l3M6J32m5nr8l0
5424f2K06n8O1j11r6R4j57L5NN8J6l4p3L0K13j40j01J89P4k34J20j4m8j8j62K76
5450F9o1J95r7q2J72k52RJ26j84J08l1O8j15N8N0n7J28k96J63J26j38J89K3j86
5474a5J14k00N3R2q6K00r3N6j27K09k2j54j24K02k50R5J77j48J3M9N1K9j84j17
5498a80L60k2l20K12J03j17J4j73J71lJ9j58J01J81j80m6J36j60L19n23K95j68
5520a39K57j1m8l7k26K63j2o5k2K88j65j7L5O1j59P9%m9L7j81M9R0k57L34p8M9
$$ y = [29, -78, -119, 170, -84, -222, -101, -29, -285, 184, 59, 23, 102, -117, -22, 75, 102, 101, -102, -66, 1, 44, -71, -4, 18, -87, 0, 99, -152, 10, -67, 66, 184, -44, -25, -94, -120, 43, 43, 70, -63, -9, 44, -103, -15, -132, 111, 48, -210, -41, -57, -102, -8, -95, 46, 6, 26, 10, -25, 22, 8, -68, 78, -40, -139, 26, 65, 0, 25, 63, 11, -29, -62, -16, 116, 71, 66, -32, -62, 144, 86, 147, 36, -60, 34, -123, -88, -83, -25, -9, -43, -116, -86, 127, -13, -114, 75, 149, -85, 35, 21, -27, -45, -207, 69, 8, 203, 106, 24, 196, -56, -47, 79, -105, 3, -28, 40, -75, -17, 33, -24, 104, -192, -29, 97, -41, 148, 171, -15, 99, -101, -48, 44, -42, 158, 65, 121, -6, 203, 181, 27, -97, 105, -145, -50, 127, -21, -8, 41, 92, 121, -63, -180, 180, 158, -162, 50, 153, 36, 50, -123, 48, 45, 64, -94, 7, 188, 8, -38, 98, -62, 257, -266, 29, -139, 118, 107, 59, 22, -204, 59, 47, -18, -40, 248, 83, 66, 101, 162, 3, 82, 82, 33, 70, -111, -62, 28, -229, 105, 27, 76]
$$ [...]
8191F0
##END NTUPLES=NMR FID
##END=
