##TITLE=1H_SR_rmo
 CDCl3, 8 sc, 
 14.10.2019
##JCAMPDX= 6.0         $$ Bruker NMR JCAMP-DX V2.0
##DATA TYPE= NMR FID
##DATA CLASS= NTUPLES
##ORIGIN= UXNMR, Bruker Analytische Messtechnik GmbH
##OWNER= root
$$ XWIN-NMR		Version 3.5
$$ Mon Oct 14 14:15:18 2019 Russian Standard Time (UT+4h)  she@DPX200
##.OBSERVE FREQUENCY= 200.1315
##.OBSERVE NUCLEUS= ^1H
##.DELAY= (6, 6)
##.ACQUISITION MODE= SIMULTANEOUS
##.ACQUISITION SCHEME= undefined
##.AVERAGES= 8
##.DIGITISER RES= 18
##SPECTROMETER/DATA SYSTEM= spect
##.PULSE SEQUENCE= zg30
##.SOLVENT NAME= Acetone
##.SHIFT REFERENCE= (INTERNAL, Acetone, 0, 15.7039)
##AUDIT TRAIL= $$ (NUMBER, WHEN, WHO, WHERE, WHAT)
$$ ##TITLE= Audit trail, XWIN-NMR		Version 3.5
$$ ##JCAMPDX= 5.01
$$ ##ORIGIN= Bruker BioSpin GmbH
$$ ##OWNER= she
$$ F:/spectra/data/she/nmr/H-F/1/audita.txt
$$ ##AUDIT TRAIL=  $$ (NUMBER, WHEN, WHO, WHERE, WHAT)
(   1,<2019-10-14 14:13:42.18 +0400>,<she>,<DPX200>,
      <created by zg, POWCHK disabled, PULCHK disabled
       configuration hash MD5:
       00 E9 B6 7A A2 85 ED C7 34 08 36 98 17 FE 4E 26
       data hash MD5: 16K
       73 F7 3D D3 BC 1F ED 0C F5 97 90 92 4F F9 DA 36>)
$$ ##END=
$$ 
$$ hash MD5
$$ AB 4B DD 31 AE B0 CC B3 FE 48 47 A4 E1 7B 29 BF
##$RELAX= 
##$RELAX= 
##$RELAX= 
##$RELAX= 
##$RELAX= 
##$RELAX= 
$$ Bruker specific parameters
$$ --------------------------
##$DU= <F:/spectra>
##$EXPNO= 1
##$NAME= <H-F>
##$PROCNO= 1
##$TYPE= <nmr>
##$USER= <she>
##$AMP= (0..31)
100 100 100 100 100 100 100 100 100 100 100 100 100 100 100 100 100 100 
100 100 100 100 100 100 100 100 100 100 100 100 100 100 
##$AQSEQ= 0
##$AQ_mod= 1
##$AUNM= <au_zg>
##$AUTOPOS= <>
##$BF1= 200.13
##$BF2= 200.13
##$BF3= 200.13
##$BF4= 200.13
##$BF5= 200.13
##$BF6= 200.13
##$BF7= 200.13
##$BF8= 200.13
##$BYTORDA= 1
##$CFDGTYP= 0
##$CFRGTYP= 5
##$CHEMSTR= <none>
##$CNST= (0..31)
1 1 145 1 1 1 1 1 1 1 1 1 1 1 1 1 1 1 1 1 1 1 1 1 1 1 1 1 1 1 1 1 
##$CPDPRG= <>
##$CPDPRG1= <>
##$CPDPRG2= <>
##$CPDPRG3= <>
##$CPDPRG4= <mlev>
##$CPDPRG5= <mlev>
##$CPDPRG6= <mlev>
##$CPDPRG7= <mlev>
##$CPDPRG8= <mlev>
##$CPDPRGB= <>
##$CPDPRGT= <>
##$D= (0..31)
0 1.2 0 0 0 0 0 0 0 0.06 0 0.03 0 0 0 0 0.0002 0 0 0 0 0 0 0 0 0 0 0 0 
0 0 0 
##$DATE= 1571048021
##$DBL= (0..7)
120 120 120 120 120 120 120 120 
##$DBP= (0..7)
150 150 150 150 150 150 150 150 
##$DBP07= 0
##$DBPNAM0= <>
##$DBPNAM1= <>
##$DBPNAM2= <>
##$DBPNAM3= <>
##$DBPNAM4= <>
##$DBPNAM5= <>
##$DBPNAM6= <>
##$DBPNAM7= <>
##$DBPOAL= (0..7)
0.5 0.5 0.5 0.5 0.5 0.5 0.5 0.5 
##$DBPOFFS= (0..7)
0 0 0 0 0 0 0 0 
##$DE= 6
##$DECBNUC= <off>
##$DECIM= 24
##$DECNUC= <off>
##$DECSTAT= 4
##$DIGMOD= 1
##$DIGTYP= 9
##$DL= (0..7)
0 120 120 120 120 120 120 120 
##$DP= (0..7)
150 150 150 150 150 150 150 150 
##$DP07= 0
##$DPNAME0= <>
##$DPNAME1= <>
##$DPNAME2= <>
##$DPNAME3= <>
##$DPNAME4= <>
##$DPNAME5= <>
##$DPNAME6= <>
##$DPNAME7= <>
##$DPOAL= (0..7)
0.5 0.5 0.5 0.5 0.5 0.5 0.5 0.5 
##$DPOFFS= (0..7)
0 0 0 0 0 0 0 0 
##$DQDMODE= 0
##$DR= 18
##$DS= 0
##$DSLIST= <SSSSSSSSSSSSSSS>
$$ [...]
##$SUBNAM2= <"">
##$SUBNAM3= <"">
##$SUBNAM4= <"">
##$SUBNAM5= <"">
##$SUBNAM6= <"">
##$SUBNAM7= <"">
##$SUBNAM8= <"">
##$SUBNAM9= <"">
##$SW= 24.0689530833862
##$SWIBOX= (0..15)
0 0 2 0 0 0 0 0 0 0 0 0 0 0 0 0 
##$SW_h= 4816.95568400771
##$TD= 16384
##$TD0= 1
##$TE= 0
##$TE2= 300
##$TE3= 300
##$TEG= 300
##$TL= (0..7)
0 120 120 120 120 120 120 120 
##$TP= (0..7)
150 150 150 150 150 150 150 150 
##$TP07= 0
##$TPNAME0= <>
##$TPNAME1= <>
##$TPNAME2= <>
##$TPNAME3= <>
##$TPNAME4= <>
##$TPNAME5= <>
##$TPNAME6= <>
##$TPNAME7= <>
##$TPOAL= (0..7)
0.5 0.5 0.5 0.5 0.5 0.5 0.5 0.5 
##$TPOFFS= (0..7)
0 0 0 0 0 0 0 0 
##$TUNHIN= 0
##$TUNHOUT= 0
##$TUNXOUT= 0
##$USERA1= <user>
##$USERA2= <user>
##$USERA3= <user>
##$USERA4= <user>
##$USERA5= <user>
##$V9= 5
##$VALIST= <valist>
##$VCLIST= <CCCCCCCCCCCCCCC>
##$VD= 0
##$VDLIST= <DDDDDDDDDDDDDDD>
##$VPLIST= <PPPPPPPPPPPPPPP>
##$VTLIST= <TTTTTTTTTTTTTTT>
##$WBST= 1024
##$WBSW= 4
##$XGAIN= (0..3)
0 0 0 0 
##$XL= 0
##$YL= 0
##$YMAX_a= 317276
##$YMIN_a= -601607
##$ZGOPTNS= <>
##$ZL1= 120
##$ZL2= 120
##$ZL3= 120
##$ZL4= 120
##$ABSF1= 10
##$ABSF2= 0
##$ABSG= 5
##$ABSL= 3
##$ALPHA= 0
##$AQORDER= 0
##$ASSFAC= 0
##$ASSFACI= 0
##$ASSFACX= 0
##$ASSWID= 0
##$AUNMP= <proc_1d>
##$AZFE= 0.1
##$AZFW= 0.1
##$BCFW= 1
##$BC_mod= 2
##$BYTORDP= 1
##$COROFFS= 0
##$CY= 11.3945322036743
##$DATMOD= 1
##$DC= 2
##$DFILT= <>
##$DTYPP= 0
##$F1P= 20.1720416913024
##$F2P= 0.152960286110954
##$FCOR= 0.5
##$FTSIZE= 0
##$FT_mod= 4
##$GAMMA= 1
##$GB= 0.15
##$INTBC= 1
##$INTSCL= 1
##$ISEN= 128
##$LB= 0.24
##$LEV0= 0
##$LPBIN= 0
##$MAXI= 10000
##$MC2= 0
##$MEAN= 0
##$ME_mod= 0
##$MI= 1.114404
##$NCOEF= 0
##$NC_proc= 0
##$NLEV= 6
##$NOISF1= 3.799351
##$NOISF2= 2.8
##$NSP= 1
##$NTH_PI= 0
##$NZP= 0
##$OFFSET= 15.70392
##$PC= 1
##$PHC0= -9572.746
##$PHC1= 15.60093
##$PH_mod= 1
##$PKNL= yes
##$PPARMOD= 0
##$PSCAL= 0
##$PSIGN= 0
##$REVERSE= no
##$SF= 200.130013532006
##$SI= 16384
##$SIGF1= 3
##$SIGF2= 2
##$SINO= 400
##$SIOLD= 16384
##$SREGLST= <1H.CDCl3>
##$SSB= 0
##$STSI= 0
##$STSR= 0
##$SW_p= 3612.71676300578
##$SYMM= 0
##$S_DEV= 0
##$TDeff= 0
##$TDoff= 0
##$TI= <>
##$TILT= no
##$TM1= 0
##$TM2= 0
##$TOPLEV= 0
##$USERP1= <user>
##$USERP2= <user>
##$USERP3= <user>
##$USERP4= <user>
##$USERP5= <user>
##$WDW= 1
##$XDIM= 8192
##$YMAX_p= 0
##$YMIN_p= 0
$$ End of Bruker specific parameters
$$ ---------------------------------
##NTUPLES= NMR FID
##VAR_NAME=  TIME,          FID/REAL,        FID/IMAG
##SYMBOL=    X,             R,               I
##VAR_TYPE=  INDEPENDENT,   DEPENDENT,       DEPENDENT
##VAR_FORM=  AFFN,          ASDF,            ASDF
##VAR_DIM=   8192,          8192,            8192
##UNITS=     SECONDS,       ARBITRARY UNITS, ARBITRARY UNITS
##FACTOR=    0.0002076,     1,               1
##FIRST=     0,             0,               0
##LAST=      1.7004516,     0,               0
##MIN=       0,             -601607,         0
##MAX=       1.7004516,     317276,          0
$$ Real data points
##PAGE= N=1
##DATA TABLE= (X++(R..R)), XYDATA
$$ [...]
2358B300k564M58J329j153r71K521J370k367k392J411L060j43j838k029r66J608
2374c66J831O5o86l19L21j404j522J775K357j684l203N84L478O26j627l78l83
2391e35j102j213R80J665J010p45j471q83J032K247m57k754j229J902J025r18
2407a446Q97J872q51l133r72K150J515o23j096l11L57R77J049o88j118p71l27
2424b519q26J356K730N80k600j656R87J473m73j011N29J84j181J69K169Q48j064
2441c05j946j213J71K028J325r87q23L10O25p39r3J336J41k234j350J298K615
2458A59M08j154j217j2P8pJ56O99M6n42q01O42K393M11k122k258P55J174Q69n1
2478c74Q42j41j034l88j25J013O90o80j816P6K232J529j058j352N72k48j061K41
$$ plain form
2358 2300 -264 194 1523 370 -601 1920 3290 923 -1469 -58 3002 2859 1021 -1008 -1974 -366
2374 -366 1465 1530 844 525 846 -558 -2080 -305 2052 368 -2835 -2251 1227 1853 226 -152 -535
2391 -535 -1637 -2850 -1870 -205 805 60 -1411 -2294 -1262 985 528 -2226 -3455 -1553 -528 -1446
2407 -1446 -549 1323 472 -2661 -3633 -1483 32 -591 -1687 -1998 -1641 -664 385 -303 -1421 -2192 -2519
2424 -2519 -3345 -1989 741 1321 -1279 -2935 -1948 -475 -948 -1959 -1430 -1246 -2427 -2258 -89 759 -305
2441 -305 -2251 -3464 -3293 -1265 60 -927 -1750 -1440 -815 -1554 -1647 -311 -170 -2404 -3754 -2456 159
2458 159 567 -587 -1804 -1816 -1738 -1745 -1589 -890 -844 -1386 -2187 -1545 848 1259 -863 -3121 -2366 -1192 -323 -374
2478 -374 468 327 -707 -1095 -1220 -207 483 -197 -2013 -1937 295 1824 766 -586 -14 -262 -1323 -1082
2496a082K151R36j409k113R38J865P56p16j479m39N25Q13K63L04J224M1k587j077
2514a086J875K480j297k450N84K180M09m22N6J37o43j372j61J006K138J222l020
2531A636j732J629K394r61k144P00R37J18j638J519K160o36k339j438J143J603
2547B951Q50j174j728N75J935m24j466N34J451k112k489J207L659Q11k776j083
2563G21M66J203o57o34OJ71M11j192l85J377K121j255m168o38L509J278k040j021
2581g27J508N25j680r15J399J171j480j607o77J839K587r25k422j241J481O23
2597e41j754l16K423L39k561j021K058J911q09k980n27M36J766N39r65n05R75
2614a532o0k164l81K799J196l175k306K506K977q40j963L7M23n67l15j91J570
$$ plain form
2496 -1082 1069 2005 596 -1517 -579 1286 2042 1326 -153 -592 -67 746 1009 1313 2537 2578 -9 -1086
2514 -1086 789 3269 1972 -478 106 2286 2695 2273 2329 2466 1823 451 290 1296 3434 4656 1636
2531 1636 -96 1533 3927 2966 822 1522 2459 2577 939 2458 4618 3982 1643 205 1348 2951
2547 2951 3801 2627 899 1474 3409 2985 1519 2053 3504 1392 -1097 110 3769 4580 1804 721
2563 721 1187 2390 1733 1099 1105 1276 1687 495 110 1487 3608 2353 -1815 -2453 1056 2334 294 -727
2581 -727 781 1306 -374 -1289 110 1281 -199 -1806 -2483 -644 1943 1018 -1404 -2645 -1164 -541
2597 -541 -2295 -2611 -188 151 -2410 -3431 -1373 538 -271 -3251 -3778 -3342 -1576 -1037 -2002 -2507 -1532
2614 -1532 -1592 -3756 -4137 -1338 -142 -3317 -5623 -3117 -140 -980 -2943 -2906 -2483 -3050 -3365 -3556 -1986
2631a986J113n61k161n38K443K144k312k952J061K484l01j388J465J310j238k408
2647c825R72J493Q95p12j020m51J583J385k35j543k68J423j101j189J840K576
2663A823k58k955q89K339J136j165n12M25k66M45O41L74M34o1r52j879O11K712
2681B003Q90k171j081J380J464q03m90O37l3j287q93J617J842p3r97j282k57J021
2699A487J047m31r51J14P29m23J75J043N48j496k117M70J761R33l34p68m8k30
2717A509k42K24P22m66m02k58l79R60J350o6j842p14J80Q40J03j07m1P4j043Q1
2737D83J065O85o32j381o37P83N30M15L70p14q29k43P47Q7j37nm35m12N49R66
2757A255P5r43o07m41k71O98J060L50q79j145N55P46m99p0m3N7r27M9J124J070
$$ plain form
2631 -1986 -873 -1434 -3595 -4133 -1690 454 -1858 -4810 -3749 -1265 -1566 -2954 -1489 -179 -1417 -3825
2647 -3825 -2853 -1360 -465 -1177 -2197 -2648 -1065 320 85 -1458 -1726 -303 -1404 -2593 -753 1823
2663 1823 1565 -1390 -2279 60 1196 31 -481 -56 -322 123 764 1138 1572 1511 559 -1320 -709 2003
2681 2003 2893 722 -359 1021 2485 1682 1192 1829 1796 509 -384 1233 3075 3002 2005 723 466 1487
2699 1487 2534 2103 1152 1266 1995 1572 1747 2790 3338 1842 -275 195 1956 2889 2555 1787 1739 1509
2717 1509 1267 1491 2213 1747 1345 1087 708 1668 3018 2952 1110 396 576 1416 1519 1412 1371 1445 402 483
2737 483 1548 2233 1601 220 -417 366 896 1311 1681 967 138 -105 642 729 592 587 152 -260 289 1255
2757 1255 1330 387 -220 -661 -932 -234 826 1176 297 -848 -293 453 -46 -116 -159 -102 -1029 -980 144 1214
2777A214n81p81j004l44R35Q15l24q95K41M87l62M3J041j78j038j622N61J839
2795D7O92j032p56K27N2O1q4j62J58J5j072K37J135J515r28k452l7J243P95o89
2815a035K8M49L31j174o29J111J043p78j750m42J557J310J29j480n11N48N77q96
2833a612n14J620P08j752j374J478K031l74k141r44R26J279j92o05Q54P30j199
2850a081j078j8J227J470j316j991N38K464P28j790q56R97L36j569o17K609J673
2867A726j902j873M91K006M25j149j136R4J191J73n35K48J764Pk320j541J998
2884c33K603r15l019J56K715O92j682k21J390j77j504o91J606J531K10j548j374
2901e61R01K338k90k127m48J836J021k120k04K639J032k933j931J638K396o49
$$ plain form
2777 1214 633 -148 -1152 -1496 -561 254 -70 -965 -724 -237 -599 -556 485 307 -731 -2353 -1792 47
2795 47 739 -293 -1049 -822 -770 -709 -793 -955 -797 -782 -1854 -1617 -482 1033 105 -2347 -2384 -1141 -346 -1035
2815 -1035 -1007 -558 -227 -1401 -2030 -919 124 -654 -2404 -2846 -1289 21 150 -1330 -1841 -1293 -716 -1612
2833 -1612 -2126 -506 202 -1550 -2924 -1446 585 211 -1930 -2874 -1948 -669 -861 -1466 -612 118 -1081
2850 -1081 -2159 -2177 -950 520 -796 -2787 -2249 215 943 -847 -1703 -706 -370 -1939 -2556 53 1726
2867 1726 -176 -2049 -1558 448 873 -276 -1412 -1318 -127 46 -489 -241 1523 1530 -790 -2331 -333
2884 -333 2270 1355 -1664 -1508 1207 1899 217 -4 1386 1209 -295 -986 620 2151 2361 813 -561
2901 -561 340 2678 2388 261 -187 1649 2670 550 346 2985 4017 1084 -847 791 3187 2538
2917B538j482j14Q18M96m78j40m83J663m51j855j046K841K217k181k557R75K410
2934C171o17k245N99J627k21j801p3J679J174j062k248o85J458K184r67j609J47
2951E11J626m02k075J70K287q2k409j338K346J951j157j915j17P70L38r70k71
2968g37R41P43q91j663M65K248M79k743j553J038J982l48j310N71P37k98j662
2985b001m30J973M00j383j477Q63J952M03j792r23L31N61m50l50Q78J141n95j615
3003b514l93J878J255j456j809N26J579M9p46PR03l91j297r9J421N03k96j290
3021b170k6P30J418l89r03p9L62j16j155P93J973J70k303o47J611J110j044o30
3039a295L33N10j74K55Q84k61j80k8j232r0J889R95j641j180J043J083o95m37
$$ plain form
2917 2538 1056 942 1760 2256 1778 1638 1155 2818 2367 512 -534 2307 4524 2343 -214 761 3171
2934 3171 2554 309 908 2535 2314 513 440 2119 3293 2231 -17 -702 756 2940 1973 364 511
2951 511 2137 1735 -340 -170 2117 2035 -374 -1712 634 2585 1428 -487 -604 166 504 -466 -737
2968 -737 204 947 56 -1607 -1142 1106 1585 -1158 -2711 -1673 309 -39 -1349 -778 -41 -339 -2001
2985 -2001 -2431 -458 -58 -1441 -2918 -2055 -103 300 -1492 -2415 -2084 -1523 -1973 -2323 -1445 -304 -899 -2514
3003 -2514 -2907 -1029 226 -1230 -3039 -2513 -934 -885 -1631 -1624 -721 -1112 -2409 -2508 -1087 -584 -880 -2170
3021 -2170 -2196 -1466 -48 -437 -1340 -1419 -1057 -1173 -2328 -1535 438 608 -1695 -2342 -731 379 -665 -1295
3039 -1295 -962 -452 -626 -371 513 252 72 44 -1188 -1278 611 1606 -35 -1215 -172 911 216 -221
3057b21O05K86o09q29J209Q37J75r27n52K0J90R87j42n42j53L90J6l94L57J403
3077B106j244j640O49J644l39o61J79N53q48j43P82J54j45n26k1m82R43O61K7
3096A649j340k80P93J69q22O76R30r17j198M23J176J66j229j8n0J02P0N98K07
3115A105m72m49o1j91L77R97l68j450o5J357N14p37o61N96l68p33L8J571K66o66
3135F00p52N7N98M39q6q43l03M65J38m57M69P15k31j251o27J304R73o11j119j30
3155f52Q92K83k20n9K42K33j278l57J015J398j53j646o32J103O35n07p15J50O80
3174D12j37o62L19J087N1j453o09J39J489L50j512J2P05J21r51k91J406N68j499
3193d55j114P10J500L28j070j175O47Q23l47r03M84Q61m12q98l42J781R53j835
$$ plain form
3057 -221 384 670 61 -768 441 1278 1453 526 -26 -6 184 1171 1029 487 334 724 740 346 703 2106
3077 2106 862 -778 -129 1515 1176 515 694 1247 399 256 1038 1192 1047 521 500 18 961 1622 1649
3096 1649 309 29 822 991 169 845 1775 858 -340 83 1259 1425 196 178 128 230 300 898 1105
3115 1105 633 184 123 -68 309 1306 938 -512 -577 780 1294 557 -104 492 124 -609 -571 1000 1266 600
3135 600 -152 -95 503 942 856 13 -290 175 313 -144 325 1040 809 -442 -1069 235 1208 597 -522 -652
3155 -652 240 523 303 244 486 719 -559 -916 99 1497 1344 -302 -934 169 804 297 -418 -268 412
3174 412 275 -387 -68 1019 1070 -383 -992 -853 636 986 -526 -514 191 312 -639 -930 476 1044 -455
3193 -455 -1569 -859 641 969 -101 -1276 -629 194 -153 -1056 -572 289 -123 -1021 -1363 418 1371 -464
3211d64j454L73J238L29q76L7N53N3q70n26M31J113J44j712n31J819J303j064
3229a04j460o6J175j50o73R7J273K27j645q44J224Q47K95j677l51J024Q45j44
3247a07j249N08J273q42j364K96J914J27j865m43J329J019n10o23k33M71L42n83
3265e40q16J589R65o69j527l7K076K97j333j173J253J157q91m22P89N75o26j160
3283d93k38J256J098o08j041k15J217Q61j032m68J157L21j236r43J464J330o76
3300A754j603j48J162L34m46n89M24j36M72k93l16J070K84j385r58P35J684r4
3318A951j536N2Q55k60l41l86O45P2l96m32J93R05R9m46j680M71J409j4j206%
3338d5J143n06j264L87J378j65q14p28J5M57N66n1p13m46Q95k91m94RJ290n34
$$ plain form
3211 -464 -1918 -1545 -307 22 -854 -817 -264 -211 -1081 -1607 -1176 -63 81 -1631 -2162 -343 960 -104
3229 -104 -1564 -1630 -455 -605 -1278 -1181 92 319 -1326 -2170 -946 -99 196 -1481 -1832 -808 37 -107
3247 -107 -1356 -848 425 -417 -1781 -1485 429 556 -1309 -1752 -423 596 86 -537 -770 -299 43 -540
3265 -540 -1356 233 1198 529 -998 -1035 1041 1338 5 -1168 85 1242 351 -71 718 1293 667 -493
3283 -493 -731 525 1623 1015 -26 -241 976 1837 805 337 1494 1815 579 -364 1100 2430 1754
3300 1754 151 3 1165 1499 1053 464 888 752 1224 931 615 1685 1969 584 -374 361 2045 1951
3318 1951 415 467 1322 1062 721 335 980 1052 656 224 417 1322 1421 975 -705 -234 1175 1161 -45 -45
3338 -45 1098 592 -672 -285 1093 928 114 -614 -599 -142 424 373 -340 -786 109 -182 -676 -667 623 89
3358H9j361n0J512M75j178m46J03J80j97M56m1n9k17k3n81J81R14m7j136o58J459
3379f25L74m65l55O15L54j370K40Q20K94n66m42k5L00O7P88m45p98r3P27j50k69
3400a024J018K44o33j090R03M91l31m89Q06Q0o71J91P86k01l10n01J40j9N44O99
3420F33o94o09K29O23O9m19N39J16p75m25R56P13m38n22J39m9J78J17M15m72k56
3441F8k87K85J39Q26j0r77n88J92J250O7o43o5L09J77r65O03Q86o33n23o10K79
3462b20Q39K48l95n86Q0Q8k0k46N99K58n99m10N5Q53L60j26r21J12L08K38m70
3483D5n8L56j0p75j65Q86O53r19o83M4R84K30m54l56L68j91nl28N28M81J46q67
3505i0j038Q12J233m47j457O15Q52o83k43L99R92k97o92k26Q9P92J02q11l70M00
$$ plain form
3358 89 -1272 -1322 190 665 -513 -959 -856 -676 -873 -417 -458 -517 -734 -757 -1338 -1157 -243 -290 -1426 -2084 -625
3379 -625 -251 -716 -1071 -456 -102 -1472 -1232 -412 -118 -684 -1126 -1151 -851 -784 4 -441 -1239 -1332 -605 -755 -1024
3400 -1024 -6 238 -395 -1485 -582 -91 -422 -911 -105 -25 -696 -505 281 80 -230 -731 -591 -610 -66 633
3420 633 -61 -670 -441 182 251 -168 371 487 -288 -713 243 956 518 -4 135 86 264 381 796 324 68
3441 68 -219 66 205 1031 1021 44 -544 -352 898 965 322 257 566 743 -222 381 1267 634 111 -499 -220
3462 -220 619 867 472 -114 -34 54 34 -212 387 645 46 -364 -309 544 904 778 -143 -31 277 515 45
3483 45 -13 343 333 -442 -607 279 932 13 -670 -626 358 588 134 -222 146 -45 -50 -378 150 631 777 -90
3505 -90 -1128 -316 917 470 -987 -372 480 -203 -446 -47 945 648 -44 -270 -181 611 713 -98 -468 -68
3525f8R65m57n56J73O25j88j432J76J659K25j566j84Q06N62p3q31O76J21k59j92
3545A82n1N24J11k72j186k28J661N10j123q99J018Q87r66o01P10L14m19n20J05
3564b43J046L04m59o24l50K47N54Jr24M66M58r27m42M39J312l97j467k13J349
3583A30M67q21J8O2O8j13l22j03O40N29j567m11N27J130O3j167n89Q61K77o68
3603i89j30J061L98j084o11Q49O52m63m27o27M38N88L49o28l55L86L95p23m51
3622a372Q76L95p48j073Q00J447j30q22j37L27J73l09K13R7J53K98r91O0N37N95
3642C89l79p26J73N99J66m82J8R04k22j065O1Q25P26n73m73j8K87L07n1R5l08
3663B53M93n17r0j09R50P8o67m81M39O73l26l54j23P55n72p3K17P84m28q10L16
$$ plain form
3525 -68 897 440 -116 57 682 494 -938 -762 897 1122 -444 -628 178 740 667 -164 512 633 374 182
3545 182 131 655 766 494 -692 -920 741 1251 128 -771 247 1134 168 -433 277 591 172 -348 -243
3564 -243 803 1107 648 24 -326 -79 475 476 -448 18 476 -451 -893 -454 858 461 -1006 -1219 130
3583 130 597 -224 -206 -144 -76 -189 -511 -614 26 555 -1012 -1423 -896 234 297 -870 -1459 -598 -321 -989
3603 -989 -1119 -58 340 -744 -1355 -506 146 -317 -744 -1371 -933 -345 4 -624 -979 -593 -198 -921 -1372
3622 -1372 -496 -101 -849 -1922 -1122 325 195 -627 -764 -437 -264 -573 -360 -263 -110 188 -803 -743 -206 389
3642 389 10 -716 -543 56 222 -260 -242 662 440 -625 -564 261 987 414 -59 -77 210 517 466 561 253
3663 253 746 229 139 30 980 1058 391 -90 349 1022 696 342 219 974 402 329 546 1330 902 92 408
3684D08K88N03r7k73j36k13K01J40M3o0J06l64m73L67Q99K6p10j24p0M24m02J64
3706F47J38j40o71n0N83L19j06l46k23Q5J36K2k34r7L55O6n57l12Q03j58m51o94
3728h85N01Q70n15l04r9j17J08j66j05O03rn94K46k86N94L76k78q63J48O18N5
3749a02p08J46M80l19r41K91J059P0o35n48P70K08k52N7o6N9K26l31j66j19R32
3770A11K33r27l49Q07P31q02r04N01R35o81o50P66R72q95p54K61N32L87K11n77
3790i2k75L05P94p03m66M36P15o85r04N10J478k84j223j61P25M52o81j22J84N48
3810E51l86k60j41Q03M83m40j419O8J433P8r13j70R65N4r79j50J201P8o98p94
3830f36M8J469J1o90o77L70O98j0q79J09P38J51j099n85P77J449p76j359N9J160
$$ plain form
3684 408 696 1199 1102 829 693 480 681 821 864 804 910 546 73 440 1339 1365 655 531 461 885 483 647
3706 647 785 645 -26 -76 507 826 720 374 151 236 372 394 160 63 418 484 -73 -385 418 260 -191 -885
3728 -885 -384 486 -29 -333 -432 -549 -441 -607 -712 -109 -118 -712 -466 -752 -158 218 -60 -923 -775 -157 -102
3749 -102 -810 -664 -184 -503 -1444 -1153 -94 -24 -659 -1207 -437 -229 -481 -424 -490 -431 -205 -536 -702 -821 111
3770 111 344 -583 -932 -125 606 -196 -1100 -599 336 -345 -995 -229 743 -152 -906 -645 -113 274 485 -92
3790 -92 -367 -62 732 29 -437 -1 714 29 -875 -365 1113 829 -394 -555 170 622 -59 -181 3 551
3810 551 165 -95 -236 567 1050 610 -809 -741 692 770 -143 -313 652 706 -273 -423 778 856 158 -636
3830 -636 -588 881 892 202 -475 -105 593 583 -296 -187 551 702 -397 -982 -205 1244 468 -891 -832 328
3850C28jo07o5L13N97o65m58P3J111j52j157m83J106Q67m22j232M70M64K30j040
3870g23J50J054K49p71j015M44R27K3n94m62N14O69k07n36K61N77l66p18j64J393
3890G05R8o80j112L65J440k53p42k80Q57J34p79l46Q09O39l01j172J03R96J92
3909F73l97l85J39L42J98m59l87R29k1m69q36R89Q20l11j138J42O10M11r51n9
3929a60P15N28n38n89L10N96O3p20n47M58O21J00p57k51O47o1o08K38M78M14p32
3950B05o81L06N88K06n40j35K28QK21o52l5O54k37n01m30J034J95n11p30J54P31
3971G8l26j11J93K90k41j69k78J17K54K1m90k18oJ009l83j87j37M39n82Q1J28
3992e18M78m60k19K82k58O74j28o31j44K45Q0P1K0J15l9k43PJ81J25N0j80j50
$$ plain form
3850 328 327 -280 -345 -32 565 -100 -558 -485 626 474 -683 -1166 -60 807 385 -847 -377 87 317 -723
3870 -723 -573 481 730 -41 -1056 -612 315 338 -256 -718 -204 465 258 -278 -17 560 194 -524 -688 705
3890 705 803 123 -989 -624 816 563 -179 -459 398 532 -247 -593 216 855 554 -618 -515 481 673
3909 673 276 -109 30 372 570 111 -276 653 632 163 -673 316 1136 825 -313 -171 439 850 -101 -160
3929 -160 555 1083 545 -44 266 862 925 205 -342 116 737 837 80 -171 476 415 -193 45 523 937 205
3950 205 -476 -170 418 624 84 -51 177 185 406 -246 -281 373 136 -365 -795 239 434 -77 -807 -653 78
3971 78 -248 -359 -166 124 -117 -286 -564 -447 -193 -172 -662 -880 -886 123 -260 -447 -584 -145 -727 -646 -518
3992 -518 -40 -500 -719 -437 -695 -21 -149 -780 -924 -679 -599 -528 -508 -393 -432 -675 -668 -487 -362 -312 -492 -642
4014f42M41K05k54L56l22j63n6K50O8J37J25o7n08O3N26j36k56K19J23l89k2O38
4036C36K86j44p91M89L80j20j70N36m87l16J57J38K55J76j03n0n83M07L70k0j10
4057F36qr2J27l99L01L94p23N1R4J99j9J7j80j20L44J50O0m30ML38k06p36L44
4080A46P93j39q93P9L55L69m15J46k01R4lm95K1O50K42n70q34K19J202k83p33
4101b50q2M63O6o56m10R88L91q77n9n7N84L16l48n44o2N54o3o13J3P09k27n84
4123g48k4O18M90n42q12L14N86J64m80m60M55L38l97l44L16Q53j62q74o37J370
4143B4M86m19p42L71O89l77p47K77J051k72n97p52Q17O93l56j34l50J64O75l73
4163A28o44L93O52o8r28oQ01N01o25q00O35P98m43m31m3K78O20q38l38P27O68
$$ plain form
4014 -642 -201 4 -250 106 -216 -379 -435 -185 -117 20 145 78 -430 -367 159 23 -233 -14 109 -280 -302 336
4036 336 622 478 -313 176 556 436 266 802 315 -1 156 294 549 725 622 572 -11 396 766 746 636
4057 636 628 536 663 264 565 959 236 287 381 580 561 578 398 278 622 772 832 402 406 744 538 -198 146
4080 146 939 800 -93 -14 341 710 295 441 240 334 331 -164 -143 507 749 179 -655 -436 766 483 -250
4101 -250 -332 131 197 -459 -869 119 510 -367 -426 -483 101 417 69 -475 -537 17 -46 -659 -646 63 -164 -748
4123 -748 -772 -154 336 -206 -1018 -704 -118 46 -434 -894 -439 -101 -498 -842 -526 327 165 -709 -1346 24
4143 24 510 91 -651 -280 409 32 -715 -438 613 341 -256 -1008 -191 502 146 12 -338 -174 501 128
4163 128 -516 -123 529 461 -467 -473 328 829 204 -596 39 837 394 -37 -80 198 818 -20 -358 369 1037
4184A037m12j104K89Q69K5n31m54N95K49m18l57J47O70P4p09n76Q54R65l72j038
4204a97p6Q39K24n13m66L63L58o99l25L40O66m4o34n92O32P11l83r62J13J036
4224C91j01p55k10J208J01p54r43O63J107n27m78m97P92N7l14k96J35M27J7o94
4244f71l31J204M75q65r33O76R15l28o83J23N17m44k46j99N99M07k01n72m20O28
4264c49Q38n64p62N15N76l00k98k2J066k62r17J25M87J42j83j87r9R3N93k59j70
4285F3j59K92K61p42J97L05O76p41n93O38L65l27l7J84N3j40k40O05j73J4k71
4306B30k40J2J9P55m93r3p9L44j75j86L33L48n25k67J04M12j4j54j35o4p7J4K61
4329C30n28N31j47m94K85J81L25m61k89M7K54j2oL51m98K2l61P2K46k12J27m9
$$ plain form
4184 1037 625 -479 -190 679 704 173 -281 314 563 145 -212 -65 605 679 -30 -606 248 1213 841 -197
4204 -197 -273 566 790 277 -189 174 532 -167 -492 -152 514 470 -164 -756 -124 587 204 -758 -645 391
4224 391 290 -465 -675 533 634 -120 -1063 -400 707 180 -298 -795 -3 54 -260 -556 -421 6 23 -671
4244 -671 -1002 202 677 -188 -1121 -445 470 142 -541 -418 99 -345 -591 -790 -191 216 15 -557 -977 -349
4264 -349 489 -75 -837 -322 254 -46 -344 -366 700 438 -479 -354 133 275 92 -95 -194 -101 492 233 63
4285 63 -96 196 457 -285 -88 217 893 152 -441 197 562 235 198 382 435 295 55 660 487 501 230
4306 230 -10 2 21 776 283 190 111 455 280 94 427 775 250 -17 87 499 485 331 196 132 55 69 330
4329 330 -198 333 186 -308 -23 158 483 22 -267 -220 34 22 16 367 -131 -109 -470 -398 -152 -364 -237 -286
4351b86K0M2j94L27j85k12o5K73k22N09M0l89j88K19m13M94K91l01o1k39K62P7
4373b01k01J88j54k50J22K10k08L44j66j51K22l71M25J65j03k28j38R2K25M49
4393B71l06m59o2N30j16q3K29L73l21m70J64O87M3l75m27M23J51q6j3K67k63J79
4415C36J25p08N20J57J35n86l25Q73K25l38o3QM09o87q0N67K56l46q0j69J65K72
4437F66n1k22m05K74L53j20o47K42M72l00m75J21J060l12o45L0J44N58n94K0L1
4458B00M2K55l19n23M62O53n02q38j2J288o0n50q37R65K50n89l77O84L27m35o56
4479e72J56M91K04j93n17j84O84J63l68n77M35O53o45n42O90L63j93r67k9Q95
4499e3Q0l51k08J63M00Op01j00P61m4m19p78P22J085n99o56N8K76M26n34j30M13
$$ plain form
4351 -286 -266 -224 -418 -91 -276 -488 -553 -280 -502 7 47 -342 -530 -311 -724 -230 61 -240 -301 -540 -278 -201
4373 -201 -402 -214 -368 -618 -496 -286 -494 -150 -316 -467 -245 -616 -191 -26 -129 -357 -495 -403 -178 271
4393 271 -35 -494 -556 -26 -142 -225 4 377 56 -414 -250 437 480 105 -322 101 252 166 153 420 157 336
4415 336 461 -247 273 430 565 -21 -346 527 752 414 351 359 768 81 1 568 824 478 398 229 394 666
4437 666 615 393 -12 262 615 495 -152 90 562 262 -213 -92 968 656 11 41 185 743 149 169 200
4458 200 242 497 178 -345 117 770 268 -570 -582 706 646 96 -741 224 474 -115 -492 192 519 84 -572
4479 -572 -416 75 279 86 -431 -615 69 232 -136 -713 -278 375 -270 -812 -122 241 48 -919 -948 -53
4499 -53 27 -324 -532 -369 31 37 -664 -764 -3 -47 -466 -1244 -522 563 -36 -692 -634 -358 68 -466 -596 -183
4521a83N34m13m15p1R03J1o62l81L26O77l73l41m4K62M75m79m54Q91J99k27o44
4542d09k0J169l05m14j56K43J89k55L2J00P1K47p39m78P51N55k27q06L99P40k10
4563D77l93j87M06J02j57m33L49O35j52o39j15L60L32m96m83N31M13K8o22j33
4583a77O16R6o04j86J35L86j3j57r0J3M12k84o27L91K90j63m95L69M19J25l88
4604F8n15K0N52J6m90J57M58k75j46l83O30K83n30k92J50K05J84n26n3K92j01
4625b96J45m33M28J92k28m5j05R3L83J7l04j01K25J43p9n2M35k50l39k60J65M14
4647A48j56M9L4m3J16m6J07K3J26j85n39L46M23J84o98n9L69J68l54m9K94J16
4669C74k4q8K88J35l25j18k47P5M19K41j52l23j7K07l72K3M17k07k65r0N6O12
$$ plain form
4521 -183 351 -62 -477 -548 355 366 -296 -677 -351 326 -47 -388 -432 -170 305 -174 -628 263 462 235 -409
4542 -409 -429 740 435 21 -135 108 297 42 74 174 245 492 -247 -725 26 581 354 -452 -53 687 477
4563 477 84 -103 303 405 248 -185 164 799 647 8 -107 253 585 89 -394 137 550 578 -44 -177
4583 -177 439 535 -69 -255 -120 266 253 96 6 19 431 147 -480 -89 201 38 -457 -88 331 456 68
4604 68 -447 -427 125 141 -349 -192 266 -9 -155 -538 92 375 -155 -447 -297 -92 92 -434 -487 -195 -296
4625 -296 -151 -584 -156 36 -192 -237 -342 -249 134 151 -153 -254 -29 114 35 -17 418 168 -171 -431 -266 148
4647 148 -8 41 75 32 148 102 209 232 358 173 -366 -20 403 587 -111 -170 199 367 13 -36 258 374
4669 374 350 262 550 685 360 242 -5 70 489 730 578 255 238 445 73 96 513 306 41 -49 7 619
4691F19m46J39J51l10J26j63Q3R2J19k56J05k35o9L75m77k72P82k27n38K97M48
4712C43L6m80l87K60O0K53j57m5k39M90k41j62r6L57k24j60j55K94K76l56k40
4733e73J87J85N5n28L27J37R9j38m84J75N86p0m79r3K72K14k27k21R7M20l79m90
4755i28O38K6l7k70j64M01K02r9j58j81L57J79k76k9J45L00Qn17K16N34j91o21
4777d65M5O72j37k0k21J51j07o5L12j57L52L98o07m93M22N97np85R0N50k7k84
4799B16l70P64Pj72m53J55N82m1k79m64M37K87j72l04Q8N74L4o12k06O72L09q30
4821B22k52PQ19k6m73j47M3J07P2m44J42M34J93n75n35M73M62j91m57Q0M64L8
4843D56p03K19L02K68p2r08L15O64j98m80k01K45N79o39l29M40J83j20l99J27
$$ plain form
4691 619 173 312 463 153 279 116 199 291 410 154 259 24 -45 330 -147 -419 363 136 -402 -105 343
4712 343 379 -101 -488 -228 -168 85 -72 -117 -356 134 -107 -269 -365 -8 -232 -392 -547 -253 23 -333 -573
4733 -573 -386 -201 -146 -674 -347 -210 -111 -249 -733 -558 28 -42 -521 -614 -342 -128 -355 -576 -479 -59 -438 -928
4755 -928 -290 -264 -301 -571 -735 -334 -132 -231 -389 -570 -213 -34 -310 -339 -194 106 114 -403 -187 347 156 -465
4777 -465 -420 252 115 95 -126 25 -82 -147 165 8 360 758 151 -342 80 677 672 -113 -23 527 500 216
4799 216 -154 610 617 445 -8 147 729 688 409 -55 382 669 497 193 281 855 889 277 71 743 1052 222
4821 222 -30 -23 796 770 297 150 193 300 372 -72 70 504 697 122 -413 60 522 331 -126 -46 418 456
4843 456 -247 -28 274 542 470 -438 -123 541 343 -137 -338 -93 486 -153 -482 -42 141 21 -378 -251
4863b51M52m7n74j94J72L60l26n2q1K47J75Q4n10K66N43l34l70j87P28j01j18
4884a18r5k39K17J28k71K59J39j95n12K43K98L07O8p95L14K42K38o29Q8K57O5
4905Ik38m2K47K78k50l51j10K20P18j80m56J8N66q9k46j42M24j4q91N70J31K59
4927D31k80L5o1K58j06l1j84j33M61l59J7j25K40L13n91jK68J85m71K06K60j88
4949A44j00N5k8k3K13p8j75m2K08K91l41j45nK03j39QR9J38l67J1PK99j56l10
4973b33K94k54O0r6M21k32J71l50K79k64k0L52j42p0k30J67n4J84r6J34J03n09
4995c85j30N10l4J57m34j65N55R1k87k5j44J29K34j14l07L58J96j56p84P89M82
5016E36n80l18J59L89j98k03L41o1J59o36K03N13m4k5J92n85K90J09Q6o10L36
$$ plain form
4863 -251 201 154 -420 -614 -442 -82 -408 -460 -541 -294 -119 -35 -545 -279 264 -70 -440 -627 101 0 -118
4884 -118 -213 -452 -235 -107 -378 -119 20 -175 -687 -444 -146 161 229 -566 -252 -10 228 -401 -313 -56 9
4905 9 -229 -271 -24 254 4 -347 -457 -237 481 301 -155 -137 429 340 94 -48 376 362 -529 41 172 431
4927 431 151 186 125 383 277 246 62 -71 390 31 48 -77 163 476 -115 -116 152 337 -134 72 332 144
4949 144 44 99 71 48 261 183 8 -34 174 465 124 -21 -26 177 38 46 145 283 -84 -73 -66 233 77 -233
4973 -233 61 -193 -133 -229 192 -40 131 -219 60 -204 -224 128 -14 -84 -314 -147 -201 -17 -113 21 124 -385
4995 -385 -515 -5 -39 118 -316 -481 74 165 -122 -147 -291 -162 72 -42 -349 9 205 49 -735 54 536
5016 536 -44 -362 -203 186 -12 -215 126 65 224 -412 -209 304 260 235 427 -158 132 241 327 -283 53
5037E3M30l77ll16Q60k33o01P5K60J61K74l60j73J38J20l42L36J70M6k15m94J03
5059h8M83j45l48K82K60J36m19k24M57M02o10k83P8M41M4m52j27K46L14l38k34
5080a25P3K91J42n88K64R3J72j65n64L50P34l18p27p4L63J28m01M4J20L27l28
5101a89J5l51L75Pj95l04J46O48m76j76k52N44J48np79N17M00m56k35K23K50o6
5123b11j62K6J11k1n4K6j15J68L36k43m54p8O48P0n83K19K73K60o35j02P46m3
5145A82k88k32j15M51P5l08r9J14N18m27k4k7L54n9j63p2K38N04q15j17L06P17
5167G13l06m91K68L97l14J32l30qJ93J88l69j08L88J69J8n46K74L53k72k86J92
5188B55L72k20n84N83N6K9j39q7R1p7N1j86J19K03K36k90l97k19P09j2j56j54
$$ plain form
5037 53 483 106 103 -213 647 414 -187 -112 148 309 583 223 50 188 308 -34 302 472 518 303 -191 -88
5059 -88 395 250 -98 184 444 580 161 -63 394 796 186 -97 -19 422 466 14 -113 133 447 109 -125
5080 -125 -52 239 381 -207 57 150 322 157 -407 -57 677 359 -368 -442 -79 49 -352 -308 -188 139 -189
5101 -189 -174 -525 -150 -143 -338 -642 -496 152 -324 -500 -752 -208 -60 -65 -844 -327 73 -383 -618 -395 -145 -211
5123 -211 -373 -347 -236 -257 -311 -285 -400 -232 104 -139 -593 -671 -23 47 -536 -317 -44 216 -419 -521 225 182
5145 182 -106 -338 -453 -2 73 -235 -334 -220 298 -129 -153 -180 174 115 -48 -120 118 622 -193 -310 -4 713
5167 713 407 -84 184 581 267 399 69 61 254 442 73 -35 353 522 540 -6 268 621 349 63 255
5188 255 627 407 -177 406 462 491 352 265 356 279 330 144 263 466 702 412 15 -204 505 493 337 183
5210A83pl2K14k62J05O0m4j77P8j21J73m9j76j98K45J5j20j92M95j94N5j96p8
5233b23M40j78o35K25M91l66J22Km0J85k0q3M5l26J63j6n7M24n45J89k00j32L18
5256b17l4l2k91N45j64k08J30j5L9K13l08o4pQ8L76J22k77l14M44m06J99mj93
5279c78K63l17K88K40j53j02J28Ql4oK28j60j02K09k26K16R9N1j79j76k2J34L8
5302D7Q5l36K82q9J47K76k92J12j11j23J64j32K0K59J99j05l81n8L24p5j1l65
5324a63K90L9L1R3m16M30m46N07k61p5K72L23q11q2M04K53k33l74K88K59q1n66
5346c19Q9K13J67l21k56M83J14q0k95O9N02m22k53j17J74K20k20P3KK32L98q12
5368c59LL84jk34k23J38K05Q8l94L53K0K14k98l13NM34M13n53j97K6M65l66n3
$$ plain form
5210 183 176 144 358 96 201 261 217 40 118 -3 170 121 -55 -253 -8 7 -113 -305 190 -4 51 -145 -223
5233 -223 217 39 -596 -371 120 -246 -124 -122 -162 23 3 -80 -35 -361 -198 -214 -271 153 -392 -203 -403 -535 -217
5256 -217 -251 -283 -574 -29 -193 -401 -271 -286 -247 -34 -342 -406 -413 -325 51 173 -104 -418 26 -380 -181 -185 -378
5279 -378 -115 -432 -144 96 -57 -159 -31 -23 -57 -63 165 5 -97 112 -114 102 201 252 73 -103 -125 9 47
5302 47 132 -204 78 -11 136 412 120 232 121 -2 162 30 50 309 508 403 22 -36 288 213 202 -163
5324 -163 127 166 197 290 -126 304 -142 365 104 29 301 624 -187 -269 135 388 155 -219 69 328 247 -319
5346 -319 -230 -17 150 -171 -427 56 170 90 -205 -136 366 -56 -309 -426 -252 -32 -252 -179 -177 55 453 -359
5368 -359 -356 28 27 -207 -430 -292 -87 1 -393 -40 -20 194 -104 -417 -412 22 435 -118 -315 -289 176 -190 -243
5391b43P3M57j17m75J19K11M29j84l45l01O69j38j13l7K51j43j5k95L90K51k80
5412A64l79L02J89J51j80q8J08k14M62n97K38J65N26n95n07L14N86m94j27j35
5432a11K40M92l43q9j49L22j78m58K29M46j01l25k7m8M96j54n05K18K77r5m31
5453b94n3L37L55l73m8k14N70J3m22m35L60M77m25l21L92L2J96m78j21L15M27
5474B90m49P8k93J0M97k57n94M91L16j54l49p9N03k09k61P3O1J46O3k28k78N35
5496h8J93q4m40J95L55l23o58N90K02J35l98p8K44K32j35n88L06L61j43k10j67
5517d99O21m80J33k17K34K18K9m61k4L51J24k32p5o9N79j79j77PL40Rl46L82j82
5540H6M12n90L62k42N7Q6J25k22Q1K54R2l81j5L18J09k35p7R7pQ3k93LK93j01
$$ plain form
5391 -243 -170 287 170 -305 -186 25 454 270 -75 -376 293 155 42 5 256 113 98 -197 193 444 164
5412 164 -215 87 276 427 247 159 267 53 515 -82 156 321 847 252 -255 59 645 151 24 -111
5432 -111 129 621 278 189 40 362 184 -274 -45 401 300 -25 -52 -100 396 242 -263 -45 232 137 -294
5453 -294 -347 -10 345 -28 -76 -290 280 293 -129 -564 -204 273 -152 -473 -81 -49 147 -331 -452 -137 290
5474 290 -159 -81 -374 -364 133 -124 -718 -227 89 -65 -414 -493 10 -199 -460 -387 -326 -180 -117 -345 -623 -88
5496 -88 105 21 -419 -224 131 -192 -850 -260 -58 77 -321 -399 -155 77 -58 -646 -340 21 -122 -332 -499
5517 -499 122 -358 -225 -442 -208 10 39 -422 -446 -95 29 -203 -278 -347 232 53 -124 -117 223 232 -114 268 86
5540 86 498 -92 270 28 85 171 296 74 155 409 501 120 105 423 532 297 220 317 310 393 100 103 396 295
5564B95q4j46K76o0k25K11q2R4j41j63J79J58K25k51m10K61K35j45k8j07K28j17
5586B03K04m74L09R3J18k77j02L27j54m23%L76j89M1j47K50j77J46k88r2K02L12
5608B58n40J29K27p6J91l22J8J81k19J48k85L26O5l72j97M62k46L4P3n8Q3n2j65
5631c37j6K42J38k22q3J27J45m4k02J15P3m36J52p2N05P4l50K4l7J71k0L12m90
5654b31L3j60K69q7n5K77K68n06j76K71K79k12l57N12j75K5r1J56L11j31m02L47
5676A65k05N23j1n96M2k16N26j52Q7j11L62k81k44J48M33l43p6k84J80K58j51
5697E4k25J52Q1J67j55j89J33K82n3j67l79N61K2k69j95Q8J91n3pJ73j0o5j19
5720A8j85q9M72l80k94K92R6L31m58k77M97p5k38k67M91L50o0m64P5M76l79j28
$$ plain form
5564 295 211 65 341 281 56 267 185 279 138 -25 154 312 537 286 -124 137 372 227 199 92 320 203
5586 203 407 -67 242 335 453 176 74 401 247 -176 -176 200 11 52 -95 155 -22 124 -164 -256 -54 258
5608 258 -282 -153 74 -2 189 -133 -115 66 -153 -5 -290 36 101 -271 -468 -6 -252 -218 -145 -203 -120 -172 -337
5631 -337 -353 -111 27 -195 -278 -151 -6 -50 -252 -137 -64 -500 -348 -420 85 159 -191 -167 -204 -33 -53 259 -231
5654 -231 -198 -358 -89 -176 -231 46 314 -192 -368 -97 182 -30 -387 125 -50 -25 -116 40 351 220 -182 165
5676 165 -40 483 472 -124 -82 -298 228 76 163 52 414 133 -111 37 470 127 51 -233 -53 205 54
5697 54 -171 -19 62 229 74 -115 18 300 247 80 -299 262 284 15 -180 -92 99 46 39 212 202 137 18
5720 18 -167 -256 216 -164 -458 -166 -70 261 -197 -474 23 -52 -290 -557 -66 284 224 -240 -165 311 -68 -196
5742a96p9l6L48n7j71j59K26L15m34j48J15L99l01j79M9N32j80l45m08N29O90
5763E10l69l32k45O04Q5n33k48M28P1J67n05n0N26J83l60q1M67L20o21l30M45
5784A32R8M3k17J0L16%m6m56J62L40L1o92K35N82n2l51P0n25N80Lk32m9L96N8
5808D36l41o1K30J91l40n13N94K41k81n6k4m8M51k44l53K14J56K51k82m76K91
5829C6K72j38k41O0M45j85m88pM30J23k41k77L24J62l51k15J87j58L77Mm65K0
5851c26J92K41Q2p11N00L27n75k16L92L61m77k03N9J38pJ26j91L47l53R4o8l84
5873f52J19M78j8l95J3L77J23n24m6K34O0r5P3J00L4O9j83l19L73J93j01j35J9
5896b03N7M13o58O6M16R1l37k07L05K05n3m82L30J49m5k9Kq1N26m42K7l9K37j88
$$ plain form
5742 -196 -275 -311 37 -20 -191 -350 -124 191 -243 -391 -276 123 -178 -357 -308 224 44 -301 -709 -180 510
5763 510 141 -191 -436 168 253 -280 -528 -100 -29 138 -367 -417 109 292 -68 -149 318 638 17 -313 132
5784 132 230 273 56 66 382 382 336 -120 42 382 413 -279 -44 538 486 135 205 -320 260 263 31 -18 378 436
5808 436 95 34 264 455 115 -398 196 437 156 100 76 28 479 235 -118 96 252 503 221 -255 36
5829 36 308 170 -71 -11 434 249 -239 -246 184 307 66 -211 113 275 -76 -291 -104 -262 115 119 -346 -326
5851 -326 -134 107 189 -522 -22 305 -270 -486 -94 267 -210 -413 -354 -216 -223 -97 -288 59 -294 -200 -268 -652
5873 -652 -533 -55 -73 -468 -455 -78 45 -479 -525 -291 -231 -326 -253 -153 -119 -50 -233 -552 -179 14 -87 -222 -203
5896 -203 -146 267 -391 -325 91 182 -155 -362 -57 148 95 -387 -57 92 47 18 20 -61 465 23 50 11 248 60
5920F0q0p8qK37J32m07K01K87k70L3J33Q5k19q2K32J18K01l33j2K7m22P10j24
5943D21k87J08L18j27o62M02j38K19l20M26o4j39m7j14L23o5k17J11l44K06N6
5964F6J13j31K71l29P3K50l38J55n8o8k4Q4J89m44K48k11J52J30l92K95r0l07
5986c66K66J09J61j66j65N6k2J30k29J36k3O4j50jjK8J16J22j52k58J23L44m44
6009c22M3J41M28o27k5J68Q8k6j03P4K32J2j4k11L66l0j74r8j0o4L30m60J07J27
6033d8k64K94q2O9K43J70m47k7rL41k17p6M9oJ34k1K12j72M6k69J93K17j50j34
6057D6MJ5O5K86l79j01P0K82j8pj88P0J54o0R7l76M05l21K04l86K66j1o9j71O3
6082f0J31J41l44J00jM1J11l36J97n0J06k58K01K10j12n08K47K71j98J42l71K31
$$ plain form
5920 60 -20 -98 -106 131 263 -144 57 344 74 107 240 325 106 24 256 374 575 242 230 257 -165 545 421
5943 421 134 242 560 433 -229 173 35 254 -66 360 296 157 110 -4 319 254 37 148 -196 10 66
5964 66 179 48 319 -10 63 313 -25 130 72 4 -20 64 253 -191 57 -154 -2 128 -264 31 -59 -366
5986 -366 -100 9 170 4 -161 -105 -127 3 -226 -90 -113 -49 -199 -200 -201 -173 -57 65 -87 -345 -222 122 -322
6009 -322 -279 -138 290 -337 -362 -194 -106 -132 -235 -161 71 83 69 -142 224 194 20 -78 -88 -152 178 -282 -175 -48
6033 -48 -312 -18 -100 -31 212 382 -65 -92 -101 240 23 -53 -4 -10 124 103 315 143 189 -80 113 330 180 46
6057 46 50 65 130 416 37 -64 6 288 270 263 75 145 299 239 336 -40 365 44 248 -138 128 117 48 -123 -60
6082 -60 71 212 -132 -32 -33 8 119 -217 -20 -70 36 -222 -21 189 77 -431 -184 87 -111 31 -340 -109
6104a09j00L37l50r6M70n39M41l75R7K76j09j12n7L4M32k69k80J37J77J4j60k42
6126c83L57k68K19l51L75J32J3k72j32N02j9l3n89M85L6k37O3p4M64k42k2k03
6148a79K49p4K27k82J07j73J69Q4j78J62J8M8l06K17N2K07m14j33L69k92J77K73
6170C28p2o7j56j54J12J68K54k72m27O60j21j1k29J33k13M40l20K9j65M71j48
6191B40j28N2oK0j41L0N9L02l38J29l90J89J64j43L8K6J35k36OJ95r9L18l28k46
6215a52L40k05O6l06K30J42J53j72l0l26K92k47O8J64K5k63p7L30l7j24j76J75
6237a30L0O1m24K88M5Q7n5l60P7k2K90N3k58M15l28r0M3J1J1J91k98n8J87K4l2
6262b42m2K25J20k25L0m23L55n9J30m4o1L34p0j71l3L13O3m05j9K56J03j83q3
$$ plain form
6104 -109 -209 128 -222 -318 152 -387 54 -321 -224 52 -57 -169 -226 -192 240 -29 -309 -172 5 19 -141 -383
6126 -383 -26 -294 -75 -426 -51 81 94 -178 -310 192 173 140 -449 36 72 -165 -102 -176 288 46 24 -179
6148 -179 70 -4 223 -59 48 -125 44 128 -50 112 130 178 -128 89 141 348 -66 -199 170 -122 55 328
6170 328 256 189 33 -121 -9 159 413 141 -286 374 253 242 13 146 -67 373 53 82 -83 388 240
6191 240 112 164 158 178 37 67 126 428 90 219 -171 18 182 39 77 103 238 2 8 203 104 422 94 -152
6215 -152 188 -17 49 -257 -27 115 268 96 66 -260 32 -215 -147 17 42 -221 -298 32 -5 -129 -305 -130
6237 -130 -100 -39 -463 -175 -130 -43 -98 -458 -381 -403 -113 -60 -318 97 -231 -321 -278 -267 -256 -65 -363 -421 -234 -210 -242
6262 -242 -284 -59 61 -164 -134 -557 -202 -261 -131 -175 -236 98 28 -143 -176 137 200 -205 -224 32 135 -48 -131
6285a31M1M5K09l54J41J27P6J09m38K69o8K5n8j66N55l05Q1J21j23m8J3N4Q0J15
6309C70J60l92j50J66j2P5l17M4L72m8J51l02l0M96p6n37k6J95K35l31k37K53
6331E9j6K51k31j47K02J17j32j79K89l6k81n4J64J92l34K72j96J91k6N3k28k35
6353c05L33n4j66J13K64k4k81j7j03L21k99q3R9J78M38j07o37K51R4Mn6k13P6
6376a74K98k08k17j51N04j27l17J80K92K17n91J78N5o8L2j73K54L3k39O3L6l7
6398a60J14J26l22O6M43J37l51l22K13J68R7n78J54M32k75Rj13M82j73j99j41
6419a93Q6L82J96n15j61M38J3j20l32J23K87L15o98O7L95n1q0k25l05P46j34m11
6441a77J20P4J78j32n8m0J63j94J01M5m1O3K49n15K35K28j82J80l09k06L10j70
$$ plain form
6285 -131 -90 -45 164 -190 -49 78 154 263 -175 94 26 51 -7 -173 382 77 158 279 156 108 121 175 255 370
6309 370 530 138 -12 154 142 217 -100 -56 316 268 419 117 87 583 507 -30 -56 139 374 43 -194 59
6331 59 43 294 63 -84 118 235 103 -76 213 177 -104 -158 6 198 -136 136 -60 131 105 158 -70 -305
6353 -305 28 -26 -192 -79 185 161 -120 -137 -240 81 -218 -301 -202 -24 414 307 -330 -79 15 19 -37 -250 -174
6376 -174 124 -84 -301 -452 52 -75 -392 -212 80 297 -294 -116 -61 -129 -97 -270 -16 17 -222 -159 -123 -160
6398 -160 -46 80 -242 -176 267 404 53 -269 -56 112 209 -369 -215 217 -58 -49 -162 320 147 -52 -193
6419 -193 -107 275 471 -44 -205 233 246 126 -206 -83 204 519 -179 -112 283 232 152 -73 -378 368 234 -177
6441 -177 -57 17 195 63 5 -35 128 -66 35 80 39 102 351 -164 71 299 117 297 -12 -218 92 -78
6463g8J12k0M1K4m04R7O30n23O6k02P3O88n72j74o2N51j76o9k57N5K30p3l17K70
6487i0l7m7m4k42N78j07q4k28p3QK72n2j45L61J35m4m05J45J5J73k55K32q9K55
6511B32k28m39K17oN09n73L34l98M04l2m97L05M61m1n58M08J12m6o7o7J6J98k73
6534b9J34k34L81m17P1m1J16K29j0J75k63K71L2k74j20K77o5n7n3J59j59J2N6
6557A91m07L13L26m24L55j67k11K61o2q5j47L77j67j67o1L83j17j3j96p9J34M5
6579H2P5l33K08r9J20l11O03j46k15m74L46J48O7j41K67o6n0k51L5N9o3M0J54
6602E5q0j11r9J21L85l90q8O4L2p7L99m11N4o6O3m2Nr4K21n8o6J32k38N1j88L43
6628h3j36Q8K6k9k05K50L8j43P1l31L88J4O3k43J52j25J53J25k65K26j07M5k13
$$ plain form
6463 -78 34 14 55 79 -325 -228 402 -121 -55 -257 -184 504 -68 -242 -304 247 71 2 -255 -200 30 -43 -360 -90
6487 -90 -127 -174 -218 -460 118 11 -73 -301 -374 -366 -94 -146 -291 70 205 161 -244 -99 -84 89 -166 66 -23 232
6511 232 4 -435 -218 -224 285 -288 46 -352 52 20 -477 -172 289 248 -310 98 210 164 97 30 46 244 -29
6534 -29 105 -129 252 -165 -94 -135 -19 210 200 375 112 383 415 141 21 298 233 176 123 282 123 135 191
6557 191 -216 97 423 -1 354 187 -24 237 175 90 -57 320 153 -14 -75 308 191 178 -18 -97 37 82
6579 82 157 -176 32 -67 53 -258 345 199 -16 -490 -144 4 71 -70 197 131 81 -170 -135 -76 -139 -99 55
6602 55 -25 -136 -235 -114 271 -119 -207 -143 -111 -188 211 -200 -146 -212 -149 -191 -186 -280 -59 -117 -183 -51 -289 -238 -426 -83
6628 -83 -219 -131 -105 -134 -339 -89 -51 -194 -123 -454 -66 -52 11 -232 -80 -205 -52 73 -192 34 -73 -28 -241
6651b41J3N28k89m94M69K6J81j67k12K32J29k81N0L12k85J88k59j43L62L89k4
6672D84p09J14M11n2j01J77k05o7J0Q7N1J35l45K59j45KJ09J09m12N57k22k99
6694e2M27j01K03K8o49J62M42j12k11k34k2J98N1j64K56k2N7j89m2j27M93n35
6716a43j7n5L69Jl10l6K98K61m14n3O2n9pL4k12K13q2K95n49M07M5J23m96K95
6740c0j22l1J58q9p3K11k81j10K09J30n9p1K81l26J54r0J07k0R2L2j79k36K16
6763a27K26k33O0j5J8L05n02K38N4k60K25k64J53Q2j5N8Ll3j88J50j86P7J09L48
6787B83l69o5K03P2n2O2l36N15k05R7j79K52l28J31J03P1J01o6l30J52K0j84J43
6810I1n9K68j91M6k51J89o4q0J93N5l5j13j27P6O8R3Q8j81J05k93O6L09l95J90
$$ plain form
6651 -241 -228 300 11 -483 -14 12 193 26 -186 46 175 -106 -56 256 -29 159 -100 -243 119 508 484
6672 484 -225 -111 300 248 147 324 119 52 62 149 200 335 -10 249 104 106 215 324 -88 469 247 -52
6694 -52 375 274 477 505 -144 18 460 348 137 -97 -119 79 130 -34 222 200 257 68 26 -101 392 -143
6716 -143 -160 -215 154 155 -155 -191 107 368 -46 -99 -37 -96 -103 -69 -281 -68 -150 145 -404 3 48 171 -325 -30
6740 -30 -152 -183 -25 -114 -187 24 -257 -367 -158 -28 -87 -158 123 -203 -49 -139 -32 -52 40 72 -107 -343 -127
6763 -127 99 -134 -74 -89 -71 234 -268 -30 24 -236 -11 -275 -122 -40 -55 3 6 -27 -215 -65 -251 -174 -65 283
6787 283 -86 -151 52 124 72 134 -202 313 108 205 26 278 -50 81 184 255 356 290 -40 112 132 -52 91
6810 91 32 300 109 155 -96 93 29 -51 142 197 162 49 -78 -2 66 159 247 66 171 -122 -56 253 -142 48
6834D8J72k10j64M7k2m8n2J79Q0k95L01Mj11n2m2J53k53M39j74l44M76k24P7j39
6858a54m4jL49k12j94L36j29k83M94m91K78j3j07K55k26O5o0R9K36m89K21J3k19
6881b76L70N2j78j81m2J16O5J84k86P8j57N77m71J94r1j40L7Q8J4L25m87K55J59
6904B05K6j74k4j30J96k62l0L18l37L73j09J25l3qL0l8k64L21j86Q1l4l8L29m9
6928B88j11k24K36J02l65N3K9J78p6J72n4j4M11m21j22J27J12j63r5j80L85J41
6950D09l29j60J12R7k66O1j13J95L96k80k43M7K04N8k68J93Pl2n9k7L2o1K07k80
6974a00j14M25Mn40J70P9J64q3j23P9n1J32r9k82K46K84j39k82K67j74P7m93L31
6997b22j92M16J8l60r7L51L30l99l96M12J52j66Q8l69L62K45l92J62j49L5K24
$$ plain form
6834 48 220 10 -154 -107 -129 -177 -229 -50 30 -265 36 40 -71 -123 -165 -12 -265 174 0 -344 132 -92 -15 -154
6858 -154 -198 -199 150 -62 -256 80 -49 -332 162 -329 -51 -64 -171 84 -142 -77 -137 -38 198 -291 -70 -57 -276
6881 -276 94 146 -32 -213 -255 -139 -74 110 -176 -98 -255 322 -149 45 -46 -186 -149 -61 -47 278 -209 46 205
6904 205 231 57 33 -97 99 -163 -193 125 -212 161 52 177 144 136 166 128 -136 185 -1 80 46 8 337 288
6928 288 177 -47 189 291 -74 -21 8 186 110 282 228 214 625 204 82 209 321 158 63 -117 268 409
6950 409 80 -80 32 129 -137 -76 -189 6 402 122 -121 -74 130 188 -80 113 120 88 29 2 34 -27 180 -100
6974 -100 -214 211 215 -325 -155 -76 88 5 -118 -39 -90 42 -57 -339 -93 191 52 -230 37 -137 -60 -553 -222
6997 -222 -414 2 20 -340 -437 -86 244 -155 -551 -139 13 -153 -65 -434 -72 173 -219 -57 -206 -171 53
7018E3k60K54q1P6k25k0P0N63m98j13L0K15m41L19Qn5K68n7q8j15L25r7o5k22
7042a56M00N2k81k29M57L6k11j65L0J69J51j35l3o4J57K03n32L00K29k14j43j59
7064a38K79J77j61L31n61L49K32n36L5k4K65j45k5r8J68Q2j84k13J74o8K10m2
7086A07k27J32J95j56k33J58p7K97n10N31K72l30j95m29M83J21p2m47J57K05R9
7107H1k11m83O96k27p5J62J60jM8m00j15N74l7m44k76L94P8N9l51M96j71k12J04
7130a51q9K54k37J34j69j6K10J49L1l74J0M61l45j53L18j45K10k95K88k32J31
7151a0P9l01L6J5J50l06J31J04L56j10k60p9L89r2k00j23O1k1J48R5r2M48l97
7174B1J64m58J35K47M3l50J70J78K08m63K79M8J12k56P4p4M3J16k77j9K11j74
$$ plain form
7018 53 -207 47 -34 42 -183 -203 -133 430 -68 -181 -151 64 -377 -58 -50 -105 163 106 18 -97 228 131 66 -156
7042 -156 244 296 15 -214 243 279 68 -97 -67 102 253 118 85 21 178 381 -151 149 378 164 21 -138
7064 -138 141 318 157 488 -73 276 508 -28 7 -17 248 103 78 -20 148 230 46 -167 7 -61 149 107
7086 107 -120 12 207 51 -182 -24 -101 196 -314 217 489 159 -36 -465 18 139 67 -380 -223 -18 81
7107 81 -130 -613 83 -144 -219 -57 103 102 150 -250 -365 209 172 -272 -548 -154 -76 -17 -368 128 -43 -255 -151
7130 -151 -240 14 -223 -89 -258 -274 -64 85 116 -258 -248 213 -132 -285 33 -112 98 -197 91 -141 -10
7151 -10 69 -232 -196 -181 -31 -337 -206 -102 254 144 -116 -195 194 102 -98 -221 -160 -181 -33 62 -30 418 21
7174 21 185 -273 -138 109 152 -198 -28 150 358 -105 174 222 334 78 152 78 121 237 -40 -59 152 -22
7196b2j04K74j93N07l04j34rJ22l58L15J35l35N97m93j96J78lJ38l6j23K09j63
7218BK68k25k9q8l7j74K04j52K18k09J09L52m01M3J32j21J49Q3k80j20Q5K93j92
7241i0p4rK53K8k23J83L2m2J1l16J08J75L4l61j48J80J57k7n5P3K09k02k07P7
7265b34K12l3r3l01P4L40l83K82q6q8N16n20Q2K84k14j47J94J0K52l2l5m09O26
7288B97r3k11j38L7L51j61K70n03M50k86J48j5o2m04M71l15K49lM20j84j02l4
7310A82m1l7k51J51J09k54L45l16J85J81l03N6m2QK79J59k91K37n86L40o2k9J61
7333A81q1j93J50j40J04r6L5Q8L26n67J49R8j81M97o47q4j0M40j98J64r5K0j9
7356e9Jl53L46J27j72M3k5p3m2R4j3R0J38m58j3L17l43K88j16N8J45K22o16J39
$$ plain form
7196 -22 -126 148 -45 462 158 24 15 137 -221 94 229 -106 491 -2 -198 -20 -23 115 79 -44 165 2
7218 2 270 45 16 -72 -109 -283 -79 -231 -13 -222 -113 239 -162 -119 13 -108 41 124 -156 -276 -191 102 -90
7241 -90 -164 -173 80 108 -115 68 100 58 69 -247 -139 36 70 -291 -439 -259 -102 -129 -184 -111 98 -104 -311 -234
7265 -234 -22 -55 -148 -449 -375 -35 -418 -136 -222 -310 206 -314 -232 52 -162 -309 -115 -105 147 115 80 -329 297
7288 297 204 -7 -145 -108 243 82 352 -151 299 13 161 146 84 -320 151 -164 85 82 502 318 216 182
7310 182 141 104 -147 4 113 -141 204 -112 73 254 -49 7 -35 -27 252 411 120 357 -229 111 49 20 181
7333 181 100 -93 57 -83 21 -75 -40 48 374 -193 -44 54 -127 370 -277 -361 -371 69 -129 35 -60 -40 -59
7356 -59 -58 -411 -65 62 -110 -67 -92 -165 -207 -113 -126 -36 102 -356 -369 -52 -395 -107 -223 -165 -20 202 -414 -275
7380b75Q5l9M01k48j71q3M82l61ql1J13N8N6j21k84M50n5n7j13K6Q9K5k88K77
7404g2j3J08L7k75J21J59J3l89M26M2l39K3J34N1j8P7k12L21J09Q6l08k5J42l62
7428a64L36O2O7k12j1J8j42J33o7K7k10L26nn0L9O8J06m22K04O4jm15M22l7m2
7453I4l44P4L09Q0l34M73k03j05R3k51K17M7r9L9j46j86L30o10P57K3m7k56l7
7476h2K14j07K1r6J02j12p3Q4O6L2j68J48p5k39K83JK1j01J75k40K3K44r0m27
7500c96K63K12J7j47J00k01K21J34k75l02K04J13J58l86J3K32K54l87J36J31j3
7521H1j49J88j9o4J5j51J58j01M74m31mRK18j30J28k22l0j6J54%J32j30j15l2
7545c7L22l60l2J57J69j15o3J23p7J16n2k9J94k07q2M8J2L0k1K58j2l24K10m9
$$ plain form
7380 -275 -190 -229 172 -76 -247 -330 152 -209 -217 -248 -135 -77 -21 -142 -426 24 -31 -88 -201 -175 -86 -61 -349 -72
7404 -72 -85 23 60 -215 -94 65 78 -311 115 157 -182 -159 -25 26 8 85 -127 194 303 389 81 56 198 -164
7428 -164 172 234 301 89 78 96 -46 87 20 47 -163 163 158 108 147 215 321 -101 103 167 166 -249 173 136 94
7453 94 -250 -176 133 213 -121 352 149 44 137 -114 103 150 51 90 -56 -242 88 -522 235 258 211 -45 -82
7476 -82 132 25 46 -50 52 -60 -133 -49 17 49 -119 29 -46 -285 -2 -1 20 -81 94 -146 -123 121 31 -396
7500 -396 -133 79 96 -51 49 -152 69 203 -72 -374 -170 -57 101 -285 -272 -40 214 -173 -37 94 81
7521 81 -68 120 101 37 52 -99 59 -42 432 1 -3 6 224 94 222 0 -30 -46 108 108 240 110 -5 -37
7545 -37 285 -75 -107 50 219 104 41 164 87 203 151 122 316 109 27 75 87 117 96 354 342 18 228 179
7569A79l21K03K0k63L31k25K41K89n17Q4RJ07l88PM14l21L36k79J50k79J76J25
7591G8l43L50j56J28Mk56K59O6j39k26M71l94J07J49n4k25K24O5j54K29j14n9
7613A0j29J36k74J9K04k86N76l04j77N18l03pl04ON5j20J47P0K57l11R6K37j61
7636d5k43K03J6J11L5j00m4n3j94J25K83j02K6L7K85m11j39K56j08J13J18k73
7658a04J84L4l3j11J26l8N1j92J68j00qK17j59p1K84l12M6P7j8J11o7J75p5j01
7682H4N5k9J51j94j03M95m35P3K5R1M2o2K8o6k22L14k84k18M27n6P8L3Lm49J54
7707f5l4j6P1l4K37q5k15L0R4K88j20j23j12J45k51K47K23m84J75j89J81K1OL0
7731B0j48K11k65K50k37O5J61J6j96j49J36J5j05j88P77k76m56K20N3P9j86o3
$$ plain form
7569 179 -142 61 81 -182 149 -76 165 454 -63 21 30 137 -251 -244 170 -151 185 -94 56 -223 -47 78
7591 78 -265 85 -71 57 61 -195 64 130 -9 -235 236 -158 -51 98 44 -181 43 108 -46 183 69 10
7613 10 -119 17 -257 -238 -34 -320 256 -48 -225 293 -10 -17 -321 -315 -260 -380 -233 -163 94 -217 -121 116 -45
7636 -45 -288 -85 -69 42 77 -23 -67 -120 -314 -189 94 -8 18 55 340 -71 -210 46 -62 51 169 -104
7658 -104 80 114 81 -30 96 58 109 -83 85 -15 -23 194 35 -36 248 -64 -18 59 41 152 85 260 185 84
7682 84 139 110 261 67 -36 459 24 97 122 213 255 193 221 155 -67 247 -37 -255 172 116 194 227 230 -219 -65
7707 -65 -99 -115 -44 -78 159 74 -141 -111 -17 271 151 28 -84 61 -190 57 280 -204 -29 -218 -37 -16 -10 20
7731 20 -128 83 -182 68 -169 -104 57 73 -123 -272 -136 -121 -226 -414 363 87 -369 -149 -96 -17 -203 -266
7753b66K82l0J64k26k31K18K23m17J49L70l37K4p3K38J52j70J44J9k95O3J40k37
7775i6L7kJ79j08j2J75k09K22j67k84L39k26N01l52oL67j27p3L2k15O33o47L4
7798ej0J91m79L34J88k33J12o1K40l21L15k86K94k55J44j82m0j10P0K82j06l3
7820D9K47k11k79K01Q5J1M8j38o7l06M35L1k82J36j4K08J19l06K18q0j52j98P0
7843a75K29j02j16J77k59L68k61J84l40J03M38o17K57j0r8K11l98L85m4N4k13
7864b27j90N10j23N5Q4j08k35N49m24k25J87K35j5p7l0m9J81m93l5M15J77p3l05
7887b16L99j74K7k75p3P3L01p1l10L84j5k36J36n0J93K77m30K95j46J41l10Q3
7909Cj49o7P65l31l04J06K08j64j16m6K17J9J20k94r5N11l13j40O3M06k39k23
$$ plain form
7753 -266 16 -14 150 -76 -307 -89 134 -283 -134 236 -101 -77 -150 88 240 70 214 233 -62 1 141 -96
7775 -96 -59 -61 118 10 -2 173 -36 186 19 -265 74 -152 349 -3 -9 358 231 158 190 -25 608 -39 -5
7798 -5 -15 176 -303 31 219 -14 98 37 277 -44 271 -15 279 24 168 -14 -54 -164 -94 188 82 49
7820 49 296 85 -194 7 92 103 151 13 -54 -360 75 106 -176 -40 -54 154 273 -33 185 105 -47 -245 -175
7843 -175 54 -48 -164 13 -246 122 -139 45 -295 -192 246 -371 -114 -124 -222 -11 -409 -24 -68 -14 -227
7864 -227 -417 93 -30 25 109 1 -234 315 -109 -334 -147 88 73 -4 -34 -83 98 -395 -430 -15 162 89 -216
7887 -216 183 9 36 -239 -312 -239 62 -9 -319 65 50 -186 -50 -100 93 370 -60 235 89 230 -80 3
7909 3 -146 -213 552 221 -83 23 231 67 -49 -95 122 141 261 -33 -128 383 70 -70 -7 399 160 -63
7931f3K07r6J50j01l11M31K21k00m1k79J73q1N9o3J09j70K55j92Jj63K76R5m18
7954b01J22K55j97nK36q9J51J99l57l45J38P4j13q7L09K08n11O6j19L49o5m17
7976c99N09j84J04k5J0j85M94o10J24k3o0K89j32JK29J02l41j81j6K54n8k47j3
7999c58M38Kj62j39O5J29M3k61J81J17j2k70n6J40L71k97k36M72k22k54L35j64
8021a38o5K28J35Q1o45N51j73k49K13J54L28n09j73K49j50K32k65M3K20J55j49
8042G3k56K38J45mn34L87Q6L05k26M7N4k34j90J48j97K85l1L46j48k52K42k26
8064E8k66L51Q5k53K93q4j98L74j61j61k9J05K9j56J52K2J85k39j21Q9J72J01
8086C48Nq6j35j88L00r5k14M18k14k43M1j45K84j89K66k22n4K58k53L4l8L56k43
$$ plain form
7931 -63 144 48 198 97 -214 217 438 238 197 -82 91 10 69 6 115 -55 200 8 9 -154 122 217 -201
7954 -201 -79 176 -21 -26 210 121 272 471 114 -231 -93 -19 -132 -219 90 298 -213 -147 -266 83 18 -399
7976 -399 110 -74 30 5 15 -170 324 -286 -162 -185 -245 44 -88 -87 142 244 -97 -278 -294 -40 -98 -345 -358
7999 -358 80 82 -80 -219 -154 -25 18 -243 -62 55 43 -227 -283 -143 228 -69 -305 167 -55 -309 26 -138
8021 -138 -203 25 160 241 -404 147 -26 -275 -62 92 420 -89 -262 -13 -163 69 -196 -153 67 222 73
8042 73 -183 55 200 196 -338 49 135 440 214 261 315 81 -109 39 -158 127 96 442 294 42 284 58
8064 58 -208 143 228 -25 268 184 -14 360 199 38 9 114 143 -13 139 161 346 107 -14 75 247 348
8086 348 353 267 132 -56 244 149 -65 353 139 -104 -63 -208 76 -113 153 -69 -123 135 -118 -84 -122 234 -9
8109iOM4l0qk01l6K25j81R1k25L03J23k19j08L3P0K51j74J3j11K21J1l45j42K07
8134a91J42O9j04R8j7j51J62j54K57j10L5l71K78o3P1j16K75l7Lj67J61J29k90
8157i1L08m84M36M5j97Q4j53J2j25J35K72k79K73j95J58j70K11J37k74j83J44
8178F4p0K59N8n75J75M11k29rn1k45K84R9m3
$$ plain form
8109 -9 -3 41 11 3 -198 -234 -9 -190 -99 -324 -21 102 -117 -225 -192 -122 129 -45 -32 -143 78 89 -256 -398 -191
8134 -191 -49 20 -84 14 -3 -154 8 -146 111 1 36 -335 -57 -120 -49 -165 110 73 76 -91 70 199 -91
8157 -91 217 -267 169 214 17 101 -52 -40 -165 -30 242 -37 236 41 199 29 240 377 103 -80 64
8178 64 -6 253 311 -264 -89 322 93 84 33 -212 72 171 128
8191A28
$$ Imaginary data points
##PAGE= N=2
##DATA TABLE= (X++(I..I)), XYDATA
0@%%%%mMqJ6j6J6k4L2m0M8n6O9q2R8j15J32j55J83k08K37k76L17l60M08m60N21
30B77n87O56p35Q24r20J025j139J263j402J554j720J903k106K334k586K868l191
47a682L561l980M467n053N757o624P728r181J1188j4151J8966k8076N1069k07620
61a73631m27976N08359L51495k95952j94266K93985O7081k66771l5924J78241
71D641q4405j40778R4802L0023j68860R6316L22572l2420l12954P252J85287j26265
83a24789j74238J96574J64284k31795j62994K37911J75377j53496j21668N6873
93a37961p552l4994R9669M3723j14322J4821J51993q1336k28544P9843K56690
104D2030o8784k58404M5991K42136K7733j14367j1805r557q8016J4078J13469
$$ plain form
0 0 0 0 0 0 -4 0 -8 8 -8 8 -16 16 -24 24 -32 37 -45 53 -62 70 -85 98 -110 127 -149 168 -192 216 -244 277
30 277 -310 346 -389 435 -485 540 -599 664 -738 816 -904 999 -1107 1227 -1359 1509 -1682
47 -1682 1879 -2101 2366 -2687 3070 -3554 4174 -5007 6181 -7970 10996 -17080 33989 -173631
61 -173631 -601607 -93248 258247 -37705 -231971 62014 129095 -137676 -173600 4641
71 4641 -79764 -220542 -125740 -95717 -264577 -168261 154311 121891 -191063 -183811 1476 -124789
83 -124789 -299027 -102453 61831 -169964 -332958 -95047 80330 -73166 -194834 -137961
93 -137961 -145513 -180507 -80838 -37115 -151437 -136616 15377 -65959 -294503 -214660 42030
104 42030 -26754 -285158 -239167 2969 30702 -83665 -95470 -105027 -193043 -178965 -65496
115f5496N001n0663O3325M1362j05077k8345J35532J2249j73342l5370J49062
126e1762L3573p7833P1536J32809q3441j87421j008J26026L6728l9225j8557o463
138f5038K5671R1821M4455q6098p5634L7559J4189p2768O725J34492O8996p6531
150D7839p0001K3883L7702O83j6341l2326l0846K4773O8399M3367N650j0944m3270
163D8568o2702k401O3501L6180k5226j6935K3106J8229j694L792L030k0788l6684
176B9976k7504J3507P2749P6895j7721r3090l9179M7267L1267k3221j3462J4297
188G1781j065l460K8074K9931n101k8816m2711m6601L888P2354N2810k4195l3227
201G3662Q990k328k7893P368K8302l0754n8885J8079P4498L2865j5678j7454l0954
$$ plain form
115 -65496 -60495 -111158 -47833 -6471 -111548 -139893 -4361 7888 -165454 -200824 -51762
126 -51762 -18189 -96022 -24486 108323 24882 -162539 -163547 -37521 -793 -40018 -58575 -65038
138 -65038 -39367 52454 96909 10811 -64823 -27264 -13075 -85843 -79118 55374 124370 47839
150 47839 -22162 1721 39423 40106 23765 -8561 -39407 -14634 53765 97132 102782 91838 48568
163 48568 -14134 -16535 46966 83146 57920 40985 64091 82320 80626 84418 87448 66660 29976
176 29976 2472 15979 88728 165623 147902 54812 15633 62900 94167 70946 57484 71781
188 71781 70716 67256 95330 125261 120160 91344 48633 2032 5920 78274 131084 106889 73662
201 73662 82652 80324 52431 59799 88101 57347 -1538 16541 91039 123904 108226 90772 59818
214E9818m6612n836L4228J0474r906J4614R671k5801P05M8100r78q0527n0897
227d2947L0084L8294J2369K5864J8020l6806m6590N780J9831j2417j3531K387
239C38j3143o715M6049M7973k5520n8980k0576n149j8497J8511N9383J3622m9109
252a1813k3276K9082J4769j9144j4298j4619k9815j647M7336L9175m533j7247
264f030k0291l8772k1366L3695L6405j8877l1251J3595K9018L189j074M530k6145
277d3374n0242j3001L6575L9742J6682k941k1684k6738k44J8245j959k2052q075
290g9066P466M985J7827L7917J3721m0978n2092j0168K3571K4075J3541L828o928
303d2301n246N179P199%o285j8011k8270l895M3519N1388L513l2822k2793k875
$$ plain form
214 59818 13206 7370 41598 52072 42166 56780 66451 40650 41355 89455 88477 7950 -42947
227 -42947 -12863 25431 37800 63664 81684 44878 -1712 4068 23899 11482 -2049 338
239 338 -12805 -19520 26529 74502 48982 -9998 -30574 -35723 -54220 -35709 23674 37296 -11813
252 -11813 -35089 -6007 8762 -10382 -24680 -39299 -69114 -70761 -23425 15750 11217 -6030
264 -6030 -26321 -65093 -86459 -52764 -16359 -35236 -66487 -52892 -23874 -20685 -21759 -17229 -43374
277 -43374 -93616 -106617 -70042 -30300 -13618 -16559 -38243 -64981 -65225 -46980 -48939 -70991 -79066
290 -79066 -71600 -66615 -48788 -10871 2850 -38128 -90220 -100388 -76817 -52742 -39201 -35373 -42301
303 -42301 -47547 -42368 -35169 -35169 -41454 -59465 -87735 -91630 -48111 3277 6790 -26032 -48825 -51700
317e1700k036J670J3528R971o228r400R943K8702K2203r193m0688l7045L737L5204
331c1332K7030O409L700N36j4721j5562R333J9622n995k9552j1322K7366M1570
344B7082K2180q589k6400k2641r214K026J3050K2199J5299r357j7638P871L0281
357D6149R098k9547l5351l976K0270K1646J7858J5367K027k1064k8420l327K3858
370C4588J7144j4032k4738K490L2298K7185j105j7802j8282j7347j4211P331L2028
383D5547K8622k494k6553j4730J3801J8733n313k5201j7416M360J5408J6298J9378
396G0440J0938j5532l9334k4514J2624K8190Q256j3449q584Q994J2877J719o254
409D6371p963j4615k1574q538K2570L7567J2687k2807k8118l180J0637j044j3286
$$ plain form
317 -51700 -53736 -52066 -38538 -28567 -34795 -44195 -34252 -5550 16653 7460 -33228 -70273 -66536 -31332
331 -31332 -4302 2107 5807 6343 -8378 -23940 -14607 5015 -980 -30532 -41854 -14488 27082
344 27082 49262 40673 14273 -8368 -17582 -15556 -2506 19693 34992 25635 7997 15868 46149
357 46149 55247 25700 -9651 -13627 6643 28289 46147 61514 63541 42477 14057 10730 34588
370 34588 51732 37700 12962 15452 47750 74935 73830 56028 37746 20399 6188 13519 45547
383 45547 74169 71675 45122 30392 44193 62926 57613 32412 14996 19356 34764 51062 70440
396 70440 81378 65846 26512 1998 14622 42812 51068 37619 29035 38029 50906 52625 46371
409 46371 38408 23793 2219 -6319 16251 53818 66505 43698 15580 12400 23037 21993 8707
422H707o693L617L525L142J4341J7820m503l4128l3620j447K5281J9951j980r462
436D551j856K347j95j720k060r931k0069j5485J1282L4510K5182r058l0845k0246
450c3593q0N379R48M624M806n449r190P516K4192Q465k3404l5416j4774J3190
464e2786K2492J5022L801l286r322j2011o713N565R653o230k0479m716K5222K9275
478d513L227j8313j8749j1298n662N393J6090J2519q35r444l473R123J1342l295
492a7888k1416j7315L028J7289J6066J1912P074q760k4261j3936J3703J9756r59
505a5707j6787n012J4470J9133R036l860j3953j5804j0221n23J4750K5682J6127
518A7331j0784k0927l175J4310N795r621j0216k453L070J2450K2300J4197r226
$$ plain form
422 8707 2014 5631 9156 12298 26639 44459 39956 5828 -27792 -29239 -3958 15993 14013 4551
436 4551 2695 5042 4847 3127 1067 -8864 -28933 -44418 -33136 1374 26556 17498 -13347 -33593
450 -33593 -33673 -28294 -27346 -22722 -17916 -23365 -32555 -25039 -847 7618 -15786 -51202 -65976 -52786
464 -52786 -30294 -15272 -11471 -14757 -24079 -36090 -42803 -37238 -27585 -33815 -54294 -59010 -33788 -4513
478 -4513 -1286 -19599 -38348 -49646 -55308 -49915 -33825 -21306 -22141 -31585 -35058 -25935 -14593 -17888
492 -17888 -39304 -56619 -53591 -36302 -20236 -8324 -1250 -10010 -34271 -48207 -34504 -14748 -15707
505 -15707 -32494 -37506 -23036 -3903 5133 1273 -12680 -28484 -38705 -39228 -24478 1204 17331
518 17331 6547 -14380 -17555 -3245 2550 -7071 -17287 -19740 -16670 -4220 18080 32277 23051
531B3051k5166j6392J273J2243J1804L994j421J306N686K778k063M73k511j6495
545a440j7058J0274L5250J9680j1872j9421l759M820M68j776k442k648Q54O503
559A7433J0594J1337N582j0536k5766j5858J0852K0647O903l96L197l547j1727
572A8715J417J5977J46k5433j7760J2342K5026J3949R20r535j5980r580P62J045
586A2011K063J2952R299j4301j4900J6002K4886r632l2474j2606R174P839Q978
599A9291J5391M016j6505j3107J279J310j433J928l640j1446M749K4855R884j5731
613B0841j0504K07j5781j9394J6508L4603k37k5970m704J7030M341r444p470j1843
627a1817j1805Q968J9836N132k129Q419n013l1561j5480K6057J9894j9555j7298
$$ plain form
531 23051 -2115 -18507 -17234 -4991 6813 10807 9386 10692 16378 19156 17093 17566 15055 -1440
545 -1440 -18498 -8224 27026 46706 34834 15413 11654 16474 16942 15166 12724 10076 10930 17433
559 17433 28027 39364 44946 34410 8644 -7214 3638 24285 31188 30792 33989 30442 18715
572 18715 20132 36109 36255 10822 -6938 5404 30430 44379 45299 35764 19784 10204 10966 12011
586 12011 14074 27026 36325 22024 7124 23126 48012 38380 5906 -6700 2474 10313 19291
599 19291 34682 38698 22193 9086 10365 11675 10242 12170 8530 -2916 1833 26688 36572 20841
613 20841 10337 10544 -5237 -24631 -8123 26480 26243 273 -4431 12599 16940 7496 26 -11817
627 -11817 -23622 -14654 5182 10314 8185 16604 11591 -19970 -35450 -9393 10501 -9054 -26352
640b6352J6144J4746p625N11J0156j3653l0117m135K0823J2798L824N069q151
653e962j8143J385J6949n955k1490K809J5216n965p720K3265K2670k2336l7377
666d2654k728K0375P227k409K900J380l512K498N329m192o889k493q690j0088
680d3946J4106L1024O502k2868j3641O944O75r540L244J1933j457j0433N053J7220
694e184Q846o639j6574j7942k469J8339J7365k102n245P417K440j5096n991J6923
708e912O313k2739j4677K0812K7604K282r308m052q115j2192J305J4328O076j889
722a64L463k67o105P143J8334p468l3024q086K6531J4837r017N148J9018r288
736B1055k9445Q88K5101K393j8600k441J1086M717P853J3408p000k3394o218R597
$$ plain form
640 -26352 -10208 4538 -3087 -2576 7580 -6073 -36190 -40325 -19502 -6704 -2880 2189 -5962
653 -5962 -24105 -22720 -5771 -11726 -33216 -30407 -15191 -21156 -28876 -5611 17059 -5277 -42654
666 -42654 -45382 -25007 -17780 -20189 -17289 -15909 -19421 -16923 -11594 -15786 -22675 -25168 -33858 -43946
680 -43946 -29840 1184 7686 -15182 -28823 -21879 -21204 -30744 -27500 -15567 -17024 -27457 -22404 -5184
694 -5184 3662 -2977 -19551 -37493 -39962 -21623 -4258 -6360 -11605 -4188 -1748 -16844 -22835 -5912
708 -5912 401 -22338 -37015 -16203 11401 13683 4375 323 -7792 -19984 -18679 -4351 1725 -164
722 -164 3299 3032 -3073 4070 22404 14936 -18088 -26174 357 15194 6177 11325 30343 21055
736 21055 -8390 -7502 17599 19992 1392 -1049 10037 14754 22607 36015 29015 5621 -597 9000
750I000l553n96K4626J4317k5401j8921K4037J7964k2246j9233J1339O506j0361
763G478J1224K4992j851k1261o296o67r298O724K2893m295k6517O451L1343k300
777C8620k5895L539J2056k2375k0061K7462L0965j1968j8332N511M5j2919N204
790A1852J1865j4352j6326J5877J6312r905P8J9660j2465m1177k380L6386O715
803B2140k1697L546J8009r704j6158J3006Q630k0563j4707R908M582m50J9179
816A5721J1850k6907k5006J5726J4302j8962p392K2902K576k3911L404L0096M79
829A4878k9309r808O214m424J817K0789N690j7901m897J1807n857j4120J0109
842a5012J0580k1308j5144K5976K6329j1551j7868L007j406j5930P07J9457O123
$$ plain form
750 9000 5447 4851 29477 43794 18393 -528 23509 41473 19227 -6 11333 17839 7478
763 7478 18702 43694 41843 20582 14286 13619 4321 11045 33938 29643 3126 9577 40920 38620
777 38620 12725 16264 28320 5945 -14116 13346 44311 32343 14011 19522 19567 6648 11852
790 11852 23717 9365 -6961 8916 25228 15323 15401 35061 22596 -18581 -20961 15425 22140
803 22140 443 3989 21998 12294 -3864 9142 17772 -2791 -17498 -7590 -3008 -3458 15721
816 15721 27571 664 -24342 -8616 5686 -13276 -20668 2234 4810 -19101 -15697 14399 14878
829 14878 -14431 -24239 -18025 -22449 -20632 157 5847 -12054 -16951 -5144 -11001 -25121 -15012
842 -15012 -4432 -25740 -40884 -14908 11421 -130 -17998 -14991 -16397 -32327 -31620 -12163 -6040
855f040r856k210L920p83M087N524j2072k0598L852K0829N278m879P294N536j6584
870a6702j5228R814J3803l283q865O11N660O945Q080m26j2558r644O55l09J701
885a9746J3567J2876q006j5267M142J3795k182j3082l333M213J934M561J0081
898C553P300j868r728j2692m973J0423J3961k252j1713K013J3989M716o989l083
912B657p56p719p942O276J5869J0938j600j0719p888K648O251p81o086n71M108
927D685M78K194J0935Q660j0493k0194n900J1341J1360J869k216K42J430N01k874
942A2018k000K748J28j0534q080J2069K1495M016j5259j2177J331K410j925J478
956G718M995J787k629j237M532P055L12j1922j4005k43J2634Q852j290Q1L099
$$ plain form
855 -6040 -15896 -18106 -14186 -14969 -10882 -5358 -17430 -38028 -34176 -13347 -8069 -12948 -5654 -118 -16702
870 -16702 -31930 -22116 -8313 -11596 -20461 -19850 -14190 -7245 835 409 -12149 -21793 -21138 -21447 -19746
885 -19746 -6179 6697 -1309 -16576 -12434 1361 -821 -13903 -17236 -13023 -11089 -6528 3553
898 3553 10853 8985 -743 -13435 -18408 -7985 5976 3724 -7989 -5976 8013 12729 5740 2657
912 2657 1901 -5818 -13760 -7484 8385 19323 17723 7004 -884 1764 8015 7234 1148 577 4685
927 4685 5163 7357 18292 26952 16459 -3735 -9635 1706 13066 14935 12719 12961 14391 14892 12018
942 12018 10018 12766 12894 2360 -5720 6349 27844 31860 16601 4424 5755 8165 6240 7718
956 7718 12713 14500 11871 10634 15166 22221 22533 10611 -3394 -3637 8997 17849 16559 16640 19739
971A9739m745j0820j492R835J643j1103q081Q582J5924N846p158j0896n377j66
985A731p61r13N900R299L44j0658l842R371O461r994j5074k797R662Q544K635
1000I908R27J48n341r522m111N783P745j939r540k395J0615R783k745r813m767
1015e264k242m776j986R209J2694O80j2631q484N606R287k260j2003o583N249
1029a3504Q357L483J786L348k083j2494j2264K072J3297P223n817p333K460O691
1043d778K525n282m908l049m495k801O504J4347O854q328j2820l197O200L336
1057i892k917l609J446L027M43K111N914K806q485j4931m106J1559J2590O72o330
1072i702j024L536M2k635j040L22l003m314J604J0112J0452O66j0478r993j06
$$ plain form
971 19739 14994 4174 2682 12517 14160 3057 -5024 3558 19482 25328 18170 7274 1897 1731
985 1731 970 57 5957 15256 15600 4942 1100 10471 16932 6938 -8136 -10933 -1271 7273 9908
1000 9908 10835 10983 5642 -3880 -7991 -2208 5537 3598 -5942 -8337 2278 12061 9316 -497 -5264
1015 -5264 -7506 -12282 -14268 -5059 7635 8315 -4316 -12800 -7194 2093 -167 -12170 -18753 -13504
1029 -13504 -5147 -1664 122 3470 1387 -11107 -23371 -21299 -8002 -779 -6596 -13929 -11469 -4778
1043 -4778 -2253 -7535 -12443 -15492 -19987 -22788 -16284 -1937 4917 -3411 -16231 -19428 -13228 -9892
1057 -9892 -12809 -16418 -14972 -11945 -11502 -9391 -3477 -671 -9156 -24087 -28193 -16634 -4044 -3372 -9702
1072 -9702 -10726 -7190 -7148 -9783 -10823 -10501 -13504 -17818 -16214 -6102 4350 5016 -5462 -15455 -15561
1087a5561N320K219l9K258K852n21j081M790M668m337j1027o103O303J0921O723
1102G385m58l278l455j438j138L27K944J133m104l344O390J1904M376p633r511
1117A00m195J691L795N629M739N63l370k285J815M059O20n843p592j159P129R152
1133A4848N072q37m730p175m517K092O000L135j864k679N9N157N616l5o769q656
1149D717l423K831N806O870L978l074p073l148K346K437j132l486k348J26N075
1164A0502P745L246m463q723p193j112M790N552J932k050k663j11J117R74m70
1179I073m508p385l008N846R577M410k846n562n691k222R93K220J404r42k772
1194a413j269L685P102Q58q757j0124j934L995L710L825L165j310n089l182J103
$$ plain form
1087 -15561 -10241 -8022 -8061 -5803 -2951 -3472 -4553 237 4905 568 -10459 -16562 -10259 662 7385
1102 7385 6927 3649 194 -1244 -2382 -2055 889 2022 -2082 -5426 964 12868 17244 9611 100
1117 100 -4095 -2404 1391 7020 11759 12322 8952 6667 8482 12541 13161 7318 -274 -1433 5696 14848
1133 14848 19920 19083 14353 7178 2661 4753 10753 13888 12024 9345 9404 14561 20177 20142 13373 4717
1149 4717 1294 4125 9931 16801 20779 17705 10632 7484 9830 12267 11135 7649 5301 5427 10502
1164 10502 18247 21493 17030 8307 1114 2 4792 10344 12276 10226 7563 7452 8569 9543 9073
1179 9073 4565 -2820 -5828 18 9595 14005 11159 5597 -94 -2316 -1323 897 2301 1359 -1413
1194 -1413 -2682 1003 8105 8963 206 -9918 -11852 -7857 -4147 -322 2843 1533 -3556 -6738 -5635
1209e635K434n78m137n514l09Q251Q966n16p144m401k521m439l18Q613N482m356
1225f122n665K434N664J281l860n754n634L12N870N779J733J573p27p819p520
1240a8455M436R117j727r330o97Q146N335q9l56k286n727n134O58N220P050M860
1256A021l970q163P06Q998J157r721m924M475K761q98N132Q971j223j1232p066
1271a3976K090N821M652K95l919j357O081M527l468l805J988k399q756J307J4571
1286C652Q763p123q724Q03L983j179n47K33j010m74K355K958L165M542j677j1673
1302a953r028P655J2088j34o956J587N830k030m624K601L306n021p539N52Q207
1317D541Q988L559o157r376j549N359R60l335K333M829j563o167L233J1031p32
$$ plain form
1209 -5635 -3201 -3779 -7916 -13430 -13739 -5488 3478 2962 -4182 -8583 -11104 -15543 -15861 -7248 -1766 -6122
1225 -6122 -11787 -9353 -3689 -2408 -6268 -12022 -17656 -17344 -11474 -5695 -3962 -2389 -3116 -10935 -18455
1240 -18455 -14019 -4902 -6629 -15959 -16656 -8510 -3175 -3264 -3620 -5906 -11633 -16767 -16109 -10889 -3839 1021
1256 1021 -2949 -11112 -10406 -1408 -251 -9972 -14896 -10421 -7660 -8558 -3426 5545 4322 -6910 -13976
1271 -13976 -11886 -6065 -1413 -1118 -5037 -6394 -313 4214 746 -3059 -1071 -3470 -12226 -10919 3652
1286 3652 12415 5292 -3432 -2629 1354 175 -372 -139 -1149 -1623 732 3690 6855 11397 9720 -1953
1302 -1953 -10981 -3326 8762 8628 1672 3259 9089 7059 2435 5036 8342 3321 -4218 -3666 4541
1317 4541 13529 17088 10931 1555 6 5365 6325 2990 5323 10152 8589 2422 5655 16686 15954
1332A5954j2886q534M038P844L318J078l95p36k343k740j029K529L414k458p585
1347e31l61J1516Q764n611j0305j551K577k697j272N935N897l248o492P64N969
1362I354K365n183p043l754L902P968K834j973o07k11n210p371L259J0277l64
1377H243j0811l017J0618O526m050n305j475k573m431K172O740M235j62l356n827
1392b473j678N732M091o787q948L406P717J99k217M958J556j0171r336M548Q888
1407e15N96l506p49N33P34K925m2n773l623J663n52k075O640R491l716j3723k004
1424a3696R849J455p806o90M655j049k051N044N626l601o683l373j590J505P549
1439d856N206n484o300M227M906m698l367M013k3q469j06J2290P237n793o881
$$ plain form
1332 15954 3068 -5466 -1428 6416 9734 10812 10417 9681 7338 4598 3569 6098 9512 7054 -531
1347 -531 -892 10624 19388 13777 3472 1921 4498 1801 529 6464 12361 9113 2621 3385 9354
1362 9354 11719 6536 -507 -4261 -359 7609 10443 8470 7863 7652 2442 -4929 -1670 8607 8243
1377 8243 -2568 -5585 5033 11559 7509 2204 729 -1844 -6275 -4103 2637 6872 6710 3354 -2473
1392 -2473 -4151 1581 5672 -1115 -10063 -6657 1060 1259 -958 4000 5556 -4615 -13951 -9403 -515
1407 -515 81 -3425 -4174 -3641 -2907 18 -24 -5797 -9420 -7757 -8309 -10384 -3744 5747 2031 -11692 -13696
1424 -13696 -3847 -2392 -10198 -10888 -6233 -7282 -9333 -4289 1337 -2264 -8947 -12320 -13910 -12405 -4856
1439 -4856 350 -5134 -11434 -7207 -2301 -6999 -10366 -6353 -6376 -14845 -14951 -2661 4576 -1217 -8098
1454h098o68j246j116M297L726j606k002J627J034m21L331J574p545q079M316
1469a0876R734K270l090J375O86n280k413N221L742m047l640K273L140L364L634
1484F093j091o816m354L132K341r53M051M876l431o029L490P321j974q285j790
1499c419L881K091J899N425J746n167n328j78J657J934K843m4m684o81P122M114
1515A3211m534l912J138j954m654L689J0307J630p002l955K688J600n11m28j143
1530F170k995L87L781K959P00J277k879q151l308P197N889l217m091K860K945
1545I524k472j390K347p81n762l526L371O200L797p22n692n082J319L551j650
1560C032k918K007K852l061k362N467N347n132r870k740N722M449L44j106n46
$$ plain form
1454 -8098 -8766 -10012 -11128 -6831 -3105 -4711 -6713 -5086 -4052 -4473 -1142 432 -7113 -15192 -10876
1469 -10876 -1142 1128 -1962 -587 99 -5181 -7594 -2373 1369 -2678 -6318 -4045 -905 2459 6093
1484 6093 5002 -1814 -6168 -3036 -695 -1648 2403 7279 3848 -2181 1309 8630 6656 -1629 -3419
1499 -3419 462 2553 4452 9877 11623 6456 1128 950 2607 4541 7384 7340 2656 1975 9097 13211
1515 13211 8677 4765 5903 3949 -705 2984 13291 14921 7919 3964 6652 8252 7741 7313 6170
1530 6170 3175 3562 7343 10302 11002 12279 9400 1249 -2059 5138 11027 7810 3719 6579 9524
1545 9524 7052 5662 8009 7228 1466 -2060 1311 7511 11308 10586 4894 -188 1131 4682 3032
1560 3032 114 2121 4973 1912 -450 5017 10364 5232 -4638 -7378 -1656 2793 3137 2031 1485
1575A485n93r50j276k41J872K2n555m070N257R367P13o970m619R41M40k559R36
1592e800M340J464l336l250K293N434P1p057o830J937O249K421j320P82J687k426
1608c341o343k24N535K999m449n219K201P253L594l878n491n34J177j893j390
1623a0003N263O224k181p759q11O488L227n070n655M98L612K949M35J132K053
1638D02j220n799m790L802P900K27p376j655P057M473l570m157J311Pl402j474
1654h264N738O274O43n297m707O15N497J349n304k873L837M225k169n51N119K189
1670F321p824p655L352Q156J990l470j752J871K258n80j704j176Q22o26k992J04
1686b905P764O681n036q672j121O075Q98l346n62L574J102k439J7L778K016l166
$$ plain form
1575 1485 892 -58 -1334 -1575 297 319 -5236 -9306 -4049 5318 6031 -939 -5558 -4617 -4177 -6736 -5800
1592 -5800 -1460 4 -3332 -6582 -4289 1145 1216 -5841 -12671 -10734 -4485 -2064 -3384 -2602 -915 -3341
1608 -3341 -9684 -9908 -4373 -1374 -5823 -11042 -8841 -1588 2006 -1872 -7363 -7897 -6720 -8613 -10003
1623 -10003 -4740 1484 -697 -8456 -9267 -2779 448 -4622 -10277 -9779 -6167 -3218 -2783 -1651 402
1638 402 -818 -6617 -11407 -7605 295 522 -6854 -8509 -1452 3021 -549 -4706 -3395 -3388 -6790 -8264
1654 -8264 -2526 3748 4391 -906 -5613 -4998 499 1848 -3456 -6329 -2492 1733 -436 -987 4132 6321
1670 6321 -1503 -9158 -5806 2350 4340 870 -882 989 3247 2667 963 -213 609 -17 -3009 -2905
1686 -2905 4859 11540 6504 -2168 -3289 2786 3684 338 -224 3350 4452 2013 2030 5808 7824 4658
1702D658o854j946M975O930K65m416j213L462m48m152O1L954O2n712j160O651
1718E117O174j266o159l910Q16K311J18j03J864K426j444l650J113N019m51p254
1734G21m271L881O347J112j267j264P6j871k838J7L440K401k809l914J489O349
1750G599K353m893n026l20J815k74O37K856K191k421m104p25L797K237k920n628
1766b826l94M786K974N2j026K27k615m665r90M204L652j021l657r50K791K978
1782C520j066l831k477k32M31K18K686M713o91o344l705K791L350j514k095m24
1798d670N88J031J598J233p75k407l135k018J074M332K958k564l450J208K006
1813b991o78j631M04r89k883M48M860L420j098k986k884j768J449K536O44j685
$$ plain form
1702 4658 -2196 -4142 833 7763 8028 3612 2399 5861 5413 1261 1322 5276 5338 -374 -1534 5117
1718 5117 11291 10025 3866 -44 772 3083 3201 3098 4962 7388 5944 2294 3407 8426 7975 721
1734 721 -3550 331 6678 7790 6523 5259 5335 3464 626 643 4083 6484 3675 -239 1250 7599
1750 7599 9952 5059 33 -287 1528 1254 1891 4747 6938 4517 413 -312 3485 5722 2802 -2826
1766 -2826 -3220 1566 4540 4592 3566 3793 1178 -3487 -4477 -273 3379 2358 -1299 -2249 542 3520
1782 3520 2454 -1377 -3854 -4086 -3655 -3437 -751 3962 3271 -3073 -6778 -3987 -637 -2151 -4246 -4670
1798 -4670 -4082 -3051 -1453 -220 -995 -3402 -6537 -8555 -7481 -3149 -191 -2755 -6205 -4997 -2991
1813 -2991 -3669 -5300 -4896 -5885 -8768 -8320 -3460 -40 -1138 -4124 -7008 -8776 -7327 -4791 -4147 -5832
1829e832k57J676j25L44K266l40m817m185K524N099K217n10k28j959k067L96J941
1846c857P10j165j008k11P37L754L156j680m736j350J458pJ399L278J223l432
1862a731j650K590K398r77k285j509l83J282L622K748r46j602p71j945r16K966
1878H91L143j915k894J827L995Q40j723p72j393k756P6L605L367N57j205k381
1894C262j301J774K943j227l761K9K228J072J19L128J273m243n313K75M177K036
1910F471j76r86j081J58J954O93j625j345k62j448j516L832N330q70n258k345
1926A526J629Q81r95N94O13m66j129N23K370J071j471l730l623J454M068J870
1942E185k068j419J474J70k581n58K416o49l151k022L389M228O55k901l723q32
$$ plain form
1829 -5832 -6089 -4413 -4538 -4194 -1928 -2268 -7085 -11270 -8746 -3647 -1430 -1940 -2168 -4127 -6194 -5798 -3857
1846 -3857 -3147 -4312 -5320 -5531 -4794 -1040 2116 436 -4300 -5650 -4192 -4199 -2800 478 1701 -1731
1862 -1731 -3381 -791 1607 630 -1655 -3164 -3547 -2265 1357 4105 3159 1557 786 -1159 -2075 891
1878 891 4034 2119 -775 1052 5047 5887 4164 3392 1999 -757 -681 2924 6291 6848 5643 3262
1894 3262 1961 3735 6678 5451 1690 1719 3947 5019 5138 8266 9539 5296 -17 258 4435 6471
1910 6471 6295 5309 4228 4386 6340 7033 5408 4063 3801 2353 837 4669 9999 9129 3871 1526
1926 1526 3155 4036 3041 3635 4248 3782 2653 3176 5546 6617 5146 1416 -2207 -753 3315 5185
1942 5185 3117 1698 3172 3342 761 203 2619 1970 -1181 -3203 186 4414 5069 2168 -1555 -2387
1958b387J002L89k03J265O48r85j581Q41K515J11l566l942M51L189K782j05j205
1975g81l71o45k384p64K619K375k597l649J043M112K326j549k883j708k97L51
1991d802N43J429J735j19k323k277K269L701j520n425q84L448J989l28J657P81
2007a26k247l742m76K418J850N23j373j736R81L792R24l537k471J404p8k046K765
2024c175M748K92m774k187J875J818m7q28j243p29J457K320N91o1O09j929m115
2041e378n51N235L454l128k847K076K159j281o18J339j108k885j86K947K497J536
2057C261o66k643l230J302L422p45k132J123J899j088p92K996J797l682m342R96
2073b524L410J660L15j4j084j197L61J181O6p68K27j522j421K851M607n58m399
$$ plain form
1958 -2387 -1385 -996 -1199 66 714 -271 -1852 -1011 1504 1615 -1951 -5893 -5442 -2253 529 424 -781
1975 -781 -1152 -1797 -4181 -4945 -2326 49 -2548 -6197 -5154 -1042 1284 -265 -3148 -4856 -5153 -4802
1991 -4802 -4259 -2830 -1095 -1214 -3537 -5814 -3545 156 -1364 -6789 -7673 -4225 -2236 -2564 -907 -126
2007 -126 -2373 -6115 -6591 -4173 -2323 -1800 -3173 -4909 -3928 -136 788 -2749 -5220 -3816 -3894 -5940 -3175
2024 -3175 1573 1865 -2909 -5096 -3221 -1403 -1450 -2278 -3521 -4250 -2793 -473 118 57 666 -1263 -5378
2041 -5378 -5929 -694 2760 -368 -3215 -1139 1020 -261 -879 460 -648 -3533 -3719 -772 1725 3261
2057 3261 2595 -48 -3278 -1976 1446 701 -1431 -308 1591 503 -289 2707 4504 822 -3520 -2524
2073 -2524 886 2546 2861 2847 1763 566 927 2108 2174 1406 1633 111 -1310 1541 6148 5590 1191
2090A191j774J623M96j004J599K137j177k375N71K462J352j857k329j124N64K582
2106B937K034J98j253p49j197o21J35K414P44k943j551K468L257l10k241j422
2122A900m17p40m42K274K634m45k408j158N22J666P03j666k774J59K359J458l16
2139C309M14N20k363l601M05M493J205l203j740K057J220l12m94K10j756k140
2155a776j6J747J831J594o44m060j988L140K378k221k847J474J605j362o14L323
2171A564J410l705m660J353K613R45k17j063l55n55J447l02j133j18O52k422j865
2188f411L575M729j059n294j308K951J33k048N48K197j65k226M3J985J379r30
2204a901k964k574J532L841J498k591j143K318P2k984J04L401O19m099k263L726
$$ plain form
2090 1191 -583 1040 1536 532 2131 4268 3091 716 1287 3749 5101 3244 915 -209 355 2937
2106 2937 4971 5169 3916 3167 1970 1349 1484 3898 4642 1699 148 2616 5873 5563 3322 1900
2122 1900 1483 743 301 2575 5209 4764 2356 1198 1720 3386 4089 2423 -351 -192 2167 3625 3309
2139 3309 3723 4243 1880 -1721 -1316 3177 4382 1179 -561 1496 2716 2404 1910 2120 364 -1776
2155 -1776 -1792 -45 1786 3380 2736 -1324 -3312 -172 2206 -15 -2862 -1388 217 -1145 -1759 1564
2171 1564 2974 -731 -5391 -4038 -1425 -480 -697 -1760 -2115 -2670 -1223 -1525 -2658 -2776 -2124 -4546 -6411
2188 -6411 -2836 1893 834 -4460 -5768 -2817 -2684 -4732 -4184 -1987 -2152 -4378 -4335 -2350 -971 -1901
2204 -1901 -4865 -7439 -5907 -2066 -568 -3159 -4302 -1984 -1912 -4896 -4792 -1391 -772 -4871 -7134 -3408
2220c408L673k61k737j407L56K42K83k30J381J445k93k760K80L874J817m128l798
2237e671J435M234P62j233L02J364j221k833o3L115J889j273k372r0L082K266
2253C693j655k864J17J315l05j191K412L132p41m074j251L631K629j966k701m22
2269b41K452J134k05j77J077J92k755k012J793M100j9l583j353K451K651o85k550
2286B270l35O72n62j592J337M109J066l594l511J133K918J10k205j047J847P58
2302C374n68k22J370N99k282l466Q1M253K413k574k872Q21K019j45k496O31J666
2319B602j361k615M11L324K148j962l466j116K011J562r62j482O41J990j478j572
2335a325J534K574j578m572j003L644K760q55k272K67K00r89k37L99Q10J0j450
$$ plain form
2220 -3408 265 4 -2733 -4140 -3784 -3542 -3259 -3489 -2108 -663 -956 -3716 -3436 438 2255 -1873 -5671
2237 -5671 -4236 -2 760 -473 -171 1193 -28 -2861 -2924 191 2080 807 -1565 -1655 1427 3693
2253 3693 2038 -826 -709 606 301 -890 1522 4654 3913 -161 -1412 2219 4848 2882 181 -241
2269 -241 2211 3345 3140 2963 4040 4232 1477 -535 1258 5358 5339 1756 403 2854 5505 4820 2270
2286 2270 1935 2607 2045 453 1790 5899 6965 3371 -140 993 3911 4021 1816 769 2616 3374
2302 3374 2806 2584 3954 4553 2271 -1195 -1114 3139 5552 2978 106 927 2946 2801 305 936 2602
2319 2602 1241 -1374 -963 2361 4509 2547 -919 -2035 -24 1538 576 -906 -265 1725 247 -1325
2335 -1325 209 2783 1205 -3367 -4370 -726 2034 1179 -1093 -826 -626 -1615 -1852 -1453 -643 -633 -2083
2352b083j131J169L319K81l413k765J503J904n37p32K001P26k160j739J710K637
2368F90j095k543j517J189K081J505n72j625m69Q10j132j158K342K228j938l155
2384d359J390L589L66l054q14N98l18o12J801J560L31j558j778K45J307J673l84
2401a7l105l27K752J260j161l49J143q55k642J84L073J405j824j387M52O65P09
2418b4M26p94j306j60N22R7J361J834k71l069j550K000J764q11r68P72K59l82
2436c00J18J500J44j520j680l61J466K082M93j206j375M74Q57l10j96Q67k99j576
2454h22n35K191K067l87k092r46L38P20N96O2J31K17o66j49N25J687m39k405j364
2473a271J586K017N41p26j38l62q19o86O38J257N27j370j295J103K090J246k492
$$ plain form
2352 -2083 -3214 -2045 1274 1555 -1858 -4623 -3120 -1216 -1753 -2485 -484 242 -1918 -3657 -1947 690
2368 690 -405 -2948 -4465 -3276 -1195 310 -262 -1887 -2356 -1546 -2678 -3836 -1494 734 -1204 -4359
2384 -4359 -2969 620 986 -2068 -2882 -2284 -2602 -3214 -1413 147 478 -1080 -2858 -2613 -1306 367 -17
2401 -17 -3122 -3449 -697 563 -598 -947 196 -659 -3301 -3117 -44 1361 -463 -1850 -1398 -733 -24
2418 -24 402 -392 -1698 -1858 -1336 -1239 122 1956 1685 -1384 -2934 -934 830 19 -949 -177 82 -300
2436 -300 -182 1318 1462 -58 -1738 -2099 -633 1449 1942 736 -639 -165 692 382 186 1053 754 -822
2454 -822 -1357 834 2901 2514 422 -524 -186 534 1130 1192 1323 1540 874 725 1250 2937 2498 93 -1271
2473 -1271 315 2332 2873 2147 2009 1647 828 142 780 2037 2564 1194 -101 1002 3092 4338 1846
2490A846j207L72N93n03K70J889L87k050j354R12J736K27j457j130k3J209J202
2507B919m64j39M66p36k237n51K921J543j703k421O91K642j76j153n45m07l79
2524B71m53K39J386J823o74k844j374K070K421j985j952M89J530j48j061J226
2540I64J064j600k256o49J795J798j89j471j495Q49J599n27j797L87J257j414
2556a685k328J815L592r9l576j574J339J391l98q07K60R4L80o73l40J159J186
2573b64k010k976M42L878R13k291j302J547O00j938n49J739Q57j331j555M79K418
2590a343J407j253k588q27K185J370j701m57K088L78k465n40K407J644j756k328
2606c779J27J930J686j01j357l21O58p8j011k4K272J042k776j481K574K926j427
$$ plain form
2490 1846 639 1011 1604 1101 1371 3260 3647 1597 243 1155 2891 3118 1661 531 508 1717 2919
2507 2919 2455 2316 2782 2046 -191 -742 2179 3722 2019 -402 289 2931 2755 1602 1057 650 271
2524 271 -182 57 1443 3266 2592 -252 -1626 444 2865 880 -1072 -583 947 799 -262 964
2540 964 2028 428 -1828 -2477 -682 1116 927 -544 -2039 -1190 409 -118 -1915 -1528 -271 -1685
2556 -1685 -4013 -2198 1394 1295 -2281 -3855 -2516 -1125 -1523 -2330 -2070 -1976 -1596 -2269 -2609 -1450 -264
2573 -264 -2274 -5250 -4808 -930 -17 -2308 -3610 -2063 -1463 -3401 -3950 -2211 -1354 -2685 -4240 -3761 -1343
2590 -1343 64 -1189 -3777 -4604 -2419 -1049 -2750 -3207 -1119 -741 -3206 -3746 -1339 305 -1451 -3779
2606 -3779 -3652 -1722 -36 -137 -1494 -1815 -1157 -1235 -2246 -2270 2 1044 -1732 -3213 -639 2287 860
2623H60k370OJ020P46m19P50O08L41q14j682K83K481J002j896k827J983K703l83
2641B392j606Q52J245j892j650J274K597Q2j617p87K46J293J152p92j782j53J336
2658B190J59q13J012K416j264l548j10K715J107j548j165O78P74R3J51n8k64n37
2676A988p50o55P69K236N75k825r29J646J142j167j026L33o0q82l7J497J419r30
2694B344j522j053J35J561N02r41j014L67P27n9n01N72K81j645j710R34K531K65
2712A774j414r02K19J02L4O4K58n84k87l74N63P25N63q46j266p38J022Q73L47
2731A33j165K33k63l66M6J147j6j096q93J60J149M36O30k84q93j334M61J270k25
2750h70J70n00m54j61Q47P61m60q94p09J87R6R72P50L24j282p80L10J071k40o87
$$ plain form
2623 860 -1510 -1504 -484 262 -157 593 1201 1542 728 -954 -671 1810 2812 916 -1911 72 2775 2392
2641 2392 786 1638 2883 991 -659 615 3212 3294 1677 890 1136 2429 3581 2789 1007 854 2190
2658 2190 2349 1536 2548 4964 3700 152 42 2757 3864 2316 1151 1829 2603 2696 2847 2789 2525 1988
2676 1988 1238 583 1352 3588 4163 1338 409 2055 3197 2030 1004 1337 1277 395 358 1855 3274 2344
2694 2344 822 -231 -96 1465 1967 1026 12 379 1106 1047 546 1118 1399 -246 -1956 -1022 1509 1774
2712 1774 360 -542 -323 -221 -187 -123 135 -449 -736 -1110 -547 178 741 -105 -1371 -2109 -1087 -214 133
2731 133 -1032 -799 -1062 -1428 -1382 -235 -251 -1347 -2240 -2080 -931 -495 135 -149 -1042 -2376 -1915 -645 -870
2750 -870 -700 -1200 -1654 -1815 -968 -207 -667 -1561 -2270 -2083 -1987 -1015 -265 59 -1223 -2003 -1693 -622 -862 -1549
2770a549n7L62m14J45J541J25q66j302l88Q60P86R08m41j375L69O87R1l69L77
2789e10l0j338o97J246K172j10j038j285L29M82k14PL92Mr4j17J34O48Q07j260
2809d72j898J97J970R73j058n68N54M21j080j34R98M60o20j215p6K313M19l79
2827H05j457k60O66O59m24n45J289M59j487r68J638K058p92k780m85J882J297
2844A555m06p75L22M95p30p51L66J643J98j446j352J112K202N68k439p37J224
2861A049R14j289p23K296R45k174j631J220K058L28k125o54M92J480N0n20k19
2878A497J067k50j591j468K420K230j733k615O32K747M22k321m03J322j58j445
2894C53RJ670J184n93k010r06J118K070m41k173q17K562O03k254n06K271N91l179
$$ plain form
2770 -1549 -1606 -1244 -1658 -1513 28 153 -713 -2015 -2403 -1543 -757 151 -290 -1665 -1296 -609 -518 -887 -510
2789 -510 -540 -1878 -2575 -1329 843 733 -305 -1590 -1261 -779 -993 -986 -594 -590 -684 -801 -667 -19 788 -472
2809 -472 -2370 -2173 -203 770 -288 -856 -302 119 -961 -1095 -97 363 -257 -1472 -1548 765 1184 805
2827 805 -652 -912 -246 413 -11 -556 733 1192 -295 -1263 375 2433 1641 -1139 -1624 258 1555
2844 1555 1149 374 696 1191 461 -290 76 1719 1917 471 -881 231 2433 3001 562 -175 1049
2861 1049 1963 674 -49 2247 3192 1018 -613 607 2665 2993 868 214 706 2186 2236 1716 1497
2878 1497 2564 2314 723 -745 1675 3905 2172 -443 189 2936 3358 1037 634 1956 1798 353
2894 353 362 2032 3216 2623 613 -293 825 2895 2454 281 -536 2026 2629 375 -131 2140 2731 -448
2912d48j704K644K185j209j859l4J154N26q65m14m33R91n25j092m11K175J802
2929B483k278k804J021K380m23k203K27J820j95j734L05J547J11j393k043L13
2945b866K045J533j586j644N20J293k03j792J8K353n00k291l43K729J452j939
2961a221k211O19J214M71p16p49J224K97o33j093N66K004N0k774r77K129J758
2978d2p48j316K68R27l95j221J86J867J74j133j074J119J837j10j701r75R55J160
2996b22k31p56R33R01q79j198J30J657R37j803j544J413J437L16j378J38Q28k84
3014C95j175K24J286Q47m31j429NJ007J174o38j243M9J062J47j249R50J425m16
3032A990j655r44J942P52p48j274O74Q95j50K45l83k6l08l76q7K20J702K72k134
$$ plain form
2912 -448 -2152 492 2677 1468 -391 -425 729 1255 390 -24 -457 534 9 -1083 -1494 681 2483
2929 2483 205 -2599 -1578 802 379 -1824 -1597 223 28 -1706 -1401 146 257 -1136 -3179 -2866
2945 -2866 -821 712 -874 -2518 -1998 -705 -908 -2700 -2682 -329 -829 -3120 -3463 -734 718 -1221
2961 -1221 -3432 -2813 -1599 -1128 -1844 -2593 -1369 -1072 -1705 -2798 -2232 -228 -178 -2952 -3929 -1800 -42
2978 -42 -790 -2106 -1838 -911 -1306 -2527 -2341 -474 -300 -1433 -2507 -1388 449 339 -1362 -2337 -1382 -222
2996 -222 -453 -1209 -276 625 -254 -1452 -1322 335 1272 -531 -2075 -662 775 1091 -287 -149 679 395
3014 395 -780 -556 730 1577 1146 -283 -278 729 1903 1265 22 71 1133 1280 31 981 2406 1990
3032 1990 335 -609 1333 2085 1337 63 737 1632 1482 1727 1344 1318 1010 634 547 767 2469 2741 607
3051F07r05J440R80q39r44O87N78j183j67J251P53n82j137NJ18R2O70l60n70P4
3071E68P00m3q75Q02o4j026j246J133J826m82j131J08K15k63p36Q11Q15q62l93
3090a43k10O36K44O32o38j289m42J006Q35j018J87N77m13r99M79J561l61j486
3108h42j6N79K17L0L98l20m52l85J56k39O59P67o53j037MJ409M70j123l76L79
3128c75j26l49K97J417j55j043o42K36O81M52q77l25N2K94M87n73L60K52k0j528
3148a485K95J331O45q99r13M12P75P7l29j63K44m53p60N34Q42Q93m94j579n23
3167a550P94J309o62j160P59K64j74p44R87O29l53j572n17J090J612l52j341j45
3185a126P08N08j294P1O20Q13j410n38P01J836l66j238r33O77J132l20p95J15
$$ plain form
3051 607 -298 1142 2122 1283 339 1026 1604 421 254 1505 2258 1676 539 544 662 754 1424 1064 494 568
3071 568 1268 1225 350 1152 1088 62 -1184 -51 1775 1293 162 270 485 222 -514 297 1112 250 -143
3090 -143 -353 283 527 1159 521 -768 -1210 -204 631 -387 -200 377 -36 -1035 -556 1005 644 -842
3108 -842 -858 -279 -62 -32 366 46 -406 -791 -635 -874 -215 552 -101 -1138 -1134 275 745 -378 -754 -375
3128 -375 -501 -850 -553 864 709 -334 -976 -740 -59 393 -484 -809 -757 -463 24 -549 -189 63 43 -1485
3148 -1485 -1190 141 786 -113 -1026 -614 161 238 -91 -254 -10 -463 -1223 -689 153 1046 552 -1027 -1550
3167 -1550 -756 553 -109 -1269 -510 -246 -420 -1164 -177 452 99 -1473 -1990 -900 712 360 -981 -1126
3185 -1126 -418 90 -1204 -1133 -513 300 -1110 -1648 -947 889 523 -715 -1648 -971 161 -159 -954 -839
3203h39P58q2j004j49J487O57j737j380J025J741L14j447l84J030J02n23k93N80
3221a44P33j89j308k64J633J300j616j653Q22J029K92q42k4J129J08j495l84J545
3239F72Q04o42j250l19J156J136p01q83N11R80p32j233O50J746j62j755o98J625
3257I05J257r71q57j00J046l10k03k86Q06J034j123j620N48J747K38j556p70J106
3275H91Q61n18n88J50Q24r03r15O08R12O24o89j326K48J355L93j395q43J096M39
3294A224j155m57J264Q50r62j394p2J393K27q84l30k42O60M04l79l61M18J83j285
3313h98n90R30J915j053j327K91N70l7q19K03L18J30l34m24M97N29L26j092j011
3332a876O40J045J40j016j77R27k71j090L27J272l94r87l61N99N50J67l03q20
$$ plain form
3203 -839 -81 -163 -1167 -1316 171 828 -909 -2289 -1264 477 791 -656 -1040 -10 92 -431 -724 -144
3221 -144 589 400 -908 -1172 461 1761 145 -1508 -686 343 635 -207 -231 898 1006 -489 -873 672
3239 672 1476 834 -416 -735 421 1557 856 -27 484 1464 732 -501 149 1895 1733 -22 -720 905
3257 905 2162 1191 334 234 1280 970 767 481 1287 2321 1198 -422 126 1873 2111 555 -215 891
3275 891 1752 1234 646 796 1620 717 -198 410 1322 1946 1257 -69 179 1534 1927 532 -311 785 1224
3294 1224 69 -388 876 1726 764 -630 -702 691 918 34 -296 -538 122 526 147 -214 204 387 -898
3313 -898 -1488 -558 1357 304 -1023 -732 -162 -199 -1018 -815 -497 -367 -701 -1125 -628 -99 227 -865 -1876
3332 -1876 -1236 -191 -51 -1067 -1244 -317 -588 -1678 -1351 -79 -473 -1460 -1821 -1222 -672 -505 -808 -1628
3350a628K33N06M25q05R0Q08k91q68N44J254P9j185o54L91M48l63Q18j30n00K52
3370e76j7n43N32Q47J07j092o03J383Q31j124j57L27K06p43K10J221j26q39l7
3389a93J48M24J42J46l94o88J41R02k60n8R86j99r39l04Q52N72o30l20K06J81
3409G15n01L81N51k19p80j86N91LN43l6m14m90L74O42j21o83N80j41m36n14J179
3430A038L72p24r68L83K62j91J98j06J47j08j52J93j78M24L30p99m78K55R46k72
3450E72l26k54N89n18l47L71J96j7m73l43L54N29K87p60m72L06K71j06l4N40J29
3471D94m36p88M18P83m14k77l40J95L50K71k84j00J40N2p59j5J176J69p92q83
3491a040J179N08l9p27k00K36P0n26K92L41N78m03q42m38J257N80o31j105M46
$$ plain form
3350 -1628 -1395 -889 -464 -1269 -1179 -371 -662 -1530 -986 268 347 -838 -1492 -1101 -653 -1016 -198 -328 -828 -576
3370 -576 -593 -1136 -604 243 350 -742 -1345 38 869 -255 -412 -85 121 -622 -412 809 683 -156 -193
3389 -193 -45 379 521 667 273 -415 -274 628 368 310 1296 1097 158 -146 706 1278 648 328 534 715
3409 715 214 595 1146 927 147 -39 552 555 1098 1062 648 158 532 1174 1053 370 950 809 373 -141 1038
3430 1038 1410 686 -282 101 363 172 370 264 411 303 151 344 166 590 920 121 -357 -102 844 572
3450 572 246 -8 581 63 -284 87 283 266 -207 -550 -196 333 620 -140 -612 -306 -35 -141 -175 365 494
3471 494 58 -730 -312 471 57 -220 -560 -365 -15 256 -28 -128 12 64 -695 -710 466 635 -157 -1040
3491 -1040 139 647 608 -119 -319 -83 -13 -539 -247 94 672 269 -573 -1011 246 826 195 -910 -464
3510d64J070p7q10L36R12n96q82o8O88P07m27p87J62J43P01k00q93j14P96n3q14
3531f70K30J598j64j566m67J318N51q36m55J49P22m63P2K4J3Q1l59p93P6J250
3551C11O68j362p43R19P64o01j021Q54O76o33j015P26O72J76m38o82k87R04N48
3570D36q66p97N34P65k67j118J034P45k84j591L19J125K76p33l10L56J43k98k96
3589h27L28P0J74l21o34N64J212l65j114r8P76O80p56l81J054J63j109l26R50
3608D0N83l64p41k37P12O59k25m21l06L87K48n80j60P64R85r57r52O91J098l94
3628H30p69L0L25K57k59k3N61P1m48o12j34O66N03l67p03K5R82L90o33j96O94
3649A190l44p58J10P28M23p89p02N80L62J32k16Q8k49Oj11j85J63P35n0j011l94
$$ plain form
3510 -464 606 529 -281 55 967 371 -511 -579 109 816 389 -398 -236 -93 608 408 -485 -599 197 144 -670
3531 -670 -440 1158 994 -572 -1039 279 830 -6 -461 -312 410 -53 19 43 56 137 -222 -1015 -939 311
3551 311 979 -383 -1126 -207 557 -44 -1065 -211 465 -168 -1183 -457 215 391 -47 -729 -1016 -112 436
3570 436 -430 -1227 -693 72 -195 -1313 -279 466 182 -1409 -1090 35 311 -422 -732 -376 -233 -531 -827
3589 -827 -499 -429 -255 -576 -1210 -646 566 201 -913 -1011 -235 445 -311 -692 362 525 -584 -910 40
3608 40 623 259 -482 -719 -7 652 427 6 -300 87 335 -245 -405 359 1344 387 -565 126 1224 830
3628 830 61 91 416 673 414 391 952 1023 575 -37 -171 495 998 631 -72 -47 935 1325 692 496 1190
3649 1190 846 88 198 926 1349 560 -142 438 800 932 716 804 555 561 450 265 428 1163 1113 102 -292
3670b92M17J006n72n31M07K06p3n26K43J34p8r01M6Q58R6k53j6j77l69O05N0j53
3692A27k66P2l13r1M05K79P7j183J70K61L28l70J1J04k44k58O9L86L59k00n39
3713h16j01M11J43J59j85m39J94R7k52j60M02J67n76n67O91R93m14r14J95L52
3733f20k23J3L33L90l0m20j79J59L40J59m20k45k6R47j31m33m20O53J37o47j3
3754f76J127K20j236k4N92P44n98n5J01m2J00n35l7M80O43L9j090l41J089Q32
3774A333j451l84P43Q73p70m59O27O78r64r82Q74O83K02k82k96m34M83L64l94
3793D44o87M29N76j41j179Q50J009n15j223j62J175K98p05j32n6N32n60J09m57
3812c95R72J67n61j057N82J423l32j154k51R09K05r09l62J309Q7q12o77K62J390
$$ plain form
3670 -292 125 1131 559 28 435 641 568 42 285 419 341 -560 -514 344 440 187 171 -6 -375 230 280 127
3692 127 -139 -67 -380 -471 -66 213 290 -893 -723 -462 -134 -504 -493 -389 -633 -891 -822 -436 -77 -277 -816
3713 -816 -917 -506 -363 -204 -389 -828 -634 -537 -789 -949 -547 -380 -956 -1523 -832 161 -253 -1167 -972 -620
3733 -620 -843 -830 -497 -107 -137 -557 -736 -577 -237 -78 -498 -743 -769 178 47 -386 -806 -153 -16 -663 -676
3754 -676 451 671 -565 -589 3 747 149 94 195 153 253 -282 -319 161 804 843 -247 -588 501 1333
3774 1333 -118 -502 241 1114 344 -115 512 1190 226 -756 118 801 1003 721 425 -9 474 838 444
3793 444 -243 186 762 621 -558 292 1301 786 -437 -599 576 874 169 37 -19 513 -47 62 -395
3812 -395 577 744 183 -874 -292 1131 799 -355 -606 303 508 -401 -763 546 633 -179 -856 -594 796
3831G96j13q20q54M33J163j81q46l69J171k24n39n57P92J335j150j207K13J340
3849C83K18p07m32L49N87n31o55O04R58j18j340n24J295P62o51j157L83P25j3
3868A36n88k71J275O3r05l07R69P29m81j023m7P59M91o24m11J76M99q6j056M28
3888b74J012K58j042o10N31Q59J5o44m50O58L75p62q9P04M93n51j208M94R40L12
3908A021r74o78L96P03Pp65K46M22L76r27n93N75J152j29j447q7J027K03r28l87
3928g87Q43L28m92j79M09K38k77p62m05P37Q61k25q49k18O78L52r71j18R91K51
3948D05j100n41R40P57m14n90k09N6N82Q7m80k04M50j45l27J95L69O23j036p03
3968a285P30K57J17k41Q5R3l73l38M25L58L5k66j94L8M44M93k50p04K35M69j50
$$ plain form
3831 796 683 -137 -991 -558 605 424 -422 -791 380 156 -383 -940 -148 1187 37 -1170 -957 383
3849 383 601 -106 -538 -189 398 -133 -788 -184 774 656 -684 -1208 87 849 198 -959 -576 149 136
3868 136 -452 -723 552 615 -290 -597 372 1101 620 -403 -450 309 800 176 -235 -59 440 354 -702 -274
3888 -274 738 996 -46 -656 -125 734 749 105 -345 313 688 -74 -163 541 1034 483 -725 -231 709 1021
3908 1021 47 -631 -235 468 475 -290 -44 378 754 -173 -766 -191 961 832 -615 -702 325 528 -400 -787
3928 -787 56 384 -108 -287 122 360 83 -679 -1084 -347 514 289 -560 -778 -100 252 -719 -837 154 405
3948 405 -695 -1236 -296 461 47 -543 -752 -696 -114 -27 -507 -711 -261 -406 -733 -538 -169 454 -582 -1285
3968 -1285 -555 -298 -181 -422 -337 -244 -617 -955 -530 -172 -137 -403 -597 -559 -115 378 128 -576 -341 128 -22
3989b2p0O4J99Ll86k92N83L10k26k81k96N04N1L3J18J9R5j26k45M66J8O3n15J54
4013B21L51K06m83M38l48J5l04M99L67j73k04k67j6N6M95m45j10M1J87p5m14N69
4035F06O22q03n12L14K80j30J04j53N73n89R6L42J22m83k44P8k68M97K65j74l09
4056B34k01L16l94M4M76k35l47k73L64M48k45l06p9Ml2L93l43r7K86J76m49l61
4078f21M86M57n53n53O4L92K92l63j54J50M9k55j5m3M67J26n95l43M40N36k76
4099c12o38J25M48K63n94rN02N93j096k58N65P90k44m60m64L39P10k05o15K68
4119b92J86J54p55j80J179Mn20p25N51O97J46o49M2L50j57Q7k90N84Q0r7q04m27
4141h36J262L75n54p56L19R65k88r53R09L07k31r25LO78L67J54p87j72M76M56
$$ plain form
3989 -22 -92 -28 171 174 -212 -504 79 389 163 -118 -414 90 141 174 292 311 406 280 35 501 519 582 67 221
4013 221 572 778 295 733 385 400 96 595 962 789 585 318 302 358 853 408 298 339 526 451 37 606
4035 606 1228 425 -87 227 507 377 481 328 901 312 408 750 872 389 145 223 -45 452 717 543 234
4056 234 33 349 -45 -1 475 240 -107 -380 -16 432 187 -119 -198 -194 -226 167 -176 -273 13 189 -260 -621
4078 -621 -135 322 -231 -784 -720 -328 -36 -399 -553 -403 -354 -609 -624 -667 -200 -74 -669 -1012 -572 -36 -312
4099 -312 -950 -825 -377 -114 -708 -717 -215 378 -718 -976 -411 379 135 -325 -789 -450 260 55 -560 -292
4119 -292 -106 48 -707 -887 292 296 -224 -949 -398 299 445 -204 -162 188 31 118 -172 412 492 395 -409 -836
4141 -836 426 801 247 -509 -190 775 487 -466 443 750 519 -406 -403 275 642 796 9 -163 313 769
4161G69m66m94K16R74p34p36L24Q26K61j057m65J005L03l04p81KP63l3m27l29
4181c83O60N93o45j052K75J356l04n74k81O5P24k59p65K68P41K2o62l35N86O02
4201F32l18j063N4J042j40m90m16P67J10n27o57P17P37j63o42m88P58M65r42j78
4221g42K13N12M63j042k35J146K77j465k37R97L88k00r07L42K50J68K9k96Q2N23
4241B66k46o12q6R07N89p98o04N34J029q16o15L28K38L36o97J43P15j43l54l02
4261a88oN06N68m38o50K35P78k18r56J32J309l70o70j34Q12J12o69j97K42M06
4281F04m05K67l28K6K34J49o41J17O92J77p77p04Q85M83o23m11O84r5r0m31K39
4302E2P5l8m98J57l6N27L3k49l45J01N87m88j80L32M08o20m37L44M00k31l97J98
$$ plain form
4161 769 303 -191 25 999 265 -471 -147 679 940 -117 -582 423 726 422 -359 -357 406 373 -54 -383
4181 -383 277 870 225 -827 -552 804 500 -74 -355 -290 434 175 -590 -322 419 441 -221 -556 30 632
4201 632 314 -749 -695 347 207 -283 -699 68 178 -349 -1006 -289 448 285 -357 -845 -87 378 -564 -742
4221 -742 -529 -17 446 -596 -831 315 592 -873 -1110 -113 275 75 -832 -490 -240 -72 -43 -339 -257 266
4241 266 20 -592 -678 229 818 20 -584 -50 979 163 -452 -124 114 450 -247 -104 611 468 114 -188
4261 -188 -194 312 880 442 -208 27 805 587 -369 -237 1072 702 32 -102 710 822 153 -44 198 604
4281 604 199 466 138 164 398 547 -94 23 715 892 115 -589 296 779 156 -255 429 334 244 -187 52
4302 52 127 89 -409 -252 -288 239 272 23 -322 -221 366 -122 -302 30 438 -182 -619 -275 125 -106 -503 -305
4324c05k44J25J44Qm5n3J89p1l04J12N38j76p39K44K50K27q0k46j69J53m1j7N24
4347B4k28k92Q4j18N03j35j45K50o23L20L17l09K85o4N0k11O5J53M2K0k26K10
4369b8j66Q4M42Jm47k3P6R8J56l9l81K80M7K63l03J14M05l25O7n9k30M07J50l13
4393B76l85N63j01K23n25M20qQ0o95K80N14M5m61K8o7N88l81q6J40j47J4l6l02
4416b3L65L30k01n19j87Q05N8k56p61N95K13O3o62K61P34m84p02M23J21L29j18
4437C84m92j62J01O86m80m59K01P50p35m93M01P55r2p14k39N75l28j94K74j12
4457c73Q7J43n1l73J90O13m21p32K51Q65K47j062k00P84J54p04l75O07K66l51
4477d35l97K95K04K72o19j31K2O11J61l11l55O27K32n99l09N14P29l93o49q9R76
$$ plain form
4324 -305 -549 -424 -280 -272 -317 -370 -181 -252 -556 -444 94 -82 -821 -577 -327 -100 -180 -426 -595 -442 -483 -500 24
4347 24 -204 -496 -412 -530 -27 -162 -307 -57 -680 -360 -43 -352 -67 -131 -81 -292 -227 -74 -32 -12 -238 -28
4369 -28 -194 -110 332 333 -114 -137 -61 37 193 154 -227 53 100 363 60 174 579 254 321 262 32 439 589 276
4393 276 -109 454 353 576 51 471 463 543 -152 128 642 687 226 254 187 775 394 308 448 301 315 279 -23
4416 -23 342 672 471 -48 -235 570 628 372 -389 206 419 482 -180 81 815 331 -371 52 173 502 384
4437 384 -108 -270 -169 517 37 -422 -221 529 -206 -699 -298 457 365 -349 -588 -13 -341 -535 -261 -373
4457 -373 -286 -143 -194 -567 -377 236 -185 -917 -666 199 446 -616 -816 -32 122 -582 -957 -350 -84 -435
4477 -435 -832 -537 -333 -61 -680 -811 -789 -178 -17 -328 -683 -56 176 -423 -732 -218 511 118 -531 -620 356
4498C56j02n44k16N27Q9k78j66j27L79M98l80o23N92M57k45n10l69J003K65p19
4518a13J4L77N20r85p0N49K22J38o07n13P73K44m22j58K7K87L86m29j38M65L78
4539I45p42k66K0Q33k19o50j2J15L48k06l39L86N14k44m79m52Q91N3k97l71K64
4560I2O08k36n36l3K45L32n03j76N44j9O7j099J30N22M08R3q25M8P34n31j96k11
4582e42N19J48j80n11J90O94l38k64l83O64Q5j97k84L04P3m99j01J43P13J52r12
4603e26J62N8M55k17j38q8L55rk77j00M62K88p88PK89K48J2l10M5K24n2j49O7
4626A8j1L38j6n31j95Q11J24m93q0j23L07J23n52L88L42O0p96J01O64k05j57j72
4648e5L84l97L44n8L17k53j53K26k90J12j42L71k40j26J30N2m5Pj70J49j92j14
$$ plain form
4498 356 254 -290 -506 21 110 -168 -334 -461 -82 416 36 -587 5 462 217 -293 -662 341 606 -113
4518 -113 -99 278 798 -187 -257 292 514 652 45 -468 305 549 127 -31 -4 283 669 240 102 567 945
4539 945 203 -63 -43 790 571 -79 -91 24 372 166 -173 213 727 483 4 -448 443 496 199 -172 92
4560 92 700 464 -72 -105 140 472 -31 -207 337 318 385 -714 -584 -62 346 439 -386 -338 396 -135 -331 -542
4582 -542 -23 125 -55 -566 -376 318 -20 -284 -667 -3 82 -115 -399 -95 -22 -521 -622 -479 234 386 -526
4603 -526 -364 -306 149 -68 -206 -294 61 52 -225 -325 137 425 -363 -356 -67 181 193 -117 -72 152 100 -49 18
4626 18 7 345 329 -202 -397 414 538 45 -35 -158 149 272 -280 108 450 510 -286 -185 479 274 117 -55
4648 -55 329 -68 276 218 535 282 129 355 65 177 35 406 166 40 170 222 177 184 14 163 -29 -143
4670a43N09j8k06o8n5J37j29k9p7j16J15R2J02k21M32l18m23Q4n8O10l49l40K16
4693b53j2J03J48Mk80J60j45J31j15K25j18l84k26K67K41k08j26L39J60m52K2
4714e19J82L59k33j06j30J17N8r0J70l89J36J42k09K03K04J07n45M5M19J98r0
4735B9k82p9L77k01k05K77o0K93K10n71ML09L69n47k09K12N44m27j71K16L62j85
4757B65m12J87O48p1j01k47j51N44k35m1j71p1N56l42k45L12N80j88j112L97M81
4778E83K07m20j16K81r4l4j71K07L26j70O0q16O25L77o0q07j43O91l0m89j45M01
4800B63L49m15k92K10O97k18n58k24Q3N98j32o88L85L6J68o53M8N23K10k91p14
4821f15N00L16j22m26L17Rj11k8m49L71K67j40j88l21P39j31m27l93K57N99m78
$$ plain form
4670 -143 366 348 142 74 19 156 27 -2 -79 -195 -80 12 114 -107 325 7 -416 -332 -390 220 -129 -469 -253
4693 -253 -265 -162 -14 -10 -290 -130 -275 -144 -259 -34 -152 -536 -762 -495 -254 -462 -588 -249 -89 -541 -519
4714 -519 -337 22 -211 -317 -447 -330 -272 -362 -192 -581 -445 -303 -512 -309 -105 2 -543 -498 -79 119 29
4735 29 -253 -332 45 -156 -361 -84 -144 149 359 -212 -208 101 470 -77 -286 -74 470 43 -128 88 450 265
4757 265 -147 40 688 617 516 269 118 662 427 386 215 144 700 358 113 425 1005 817 -295 102 583
4778 583 790 370 254 535 441 407 236 443 769 599 659 -157 468 845 785 -22 -165 526 496 7 -138 263
4800 263 612 197 -95 115 812 594 36 -188 -105 493 361 -327 58 94 262 -391 -343 180 390 99 -615
4821 -615 -115 201 79 -347 -30 -21 -132 -160 -609 -238 29 -111 -299 -620 119 -12 -439 -832 -575 24 -454
$$ [...]
8191i7
##END NTUPLES=NMR FID
##END=
