##TITLE=1H_SR2_OMe-TFA
 CDcl3, 8 sc, 
 22.10.2019
##JCAMPDX= 6.0         $$ Bruker NMR JCAMP-DX V2.0
##DATA TYPE= NMR FID
##DATA CLASS= NTUPLES
##ORIGIN= UXNMR, Bruker Analytische Messtechnik GmbH
##OWNER= root
$$ XWIN-NMR		Version 3.5
$$ Tue Oct 22 13:51:38 2019 Russian Standard Time (UT+4h)  she@DPX200
##.OBSERVE FREQUENCY= 200.1315
##.OBSERVE NUCLEUS= ^1H
##.DELAY= (6, 6)
##.ACQUISITION MODE= SIMULTANEOUS
##.ACQUISITION SCHEME= undefined
##.AVERAGES= 8
##.DIGITISER RES= 18
##SPECTROMETER/DATA SYSTEM= spect
##.PULSE SEQUENCE= zg30
##.SOLVENT NAME= CDCl3
##.SHIFT REFERENCE= (INTERNAL, CDCl3, 0, 15.7039)
##AUDIT TRAIL= $$ (NUMBER, WHEN, WHO, WHERE, WHAT)
$$ ##TITLE= Audit trail, XWIN-NMR		Version 3.5
$$ ##JCAMPDX= 5.01
$$ ##ORIGIN= Bruker BioSpin GmbH
$$ ##OWNER= she
$$ F:/spectra/data/she/nmr/H-F/1/audita.txt
$$ ##AUDIT TRAIL=  $$ (NUMBER, WHEN, WHO, WHERE, WHAT)
(   1,<2019-10-22 13:50:31.73 +0400>,<she>,<DPX200>,
      <created by zg, POWCHK disabled, PULCHK disabled
       configuration hash MD5:
       00 E9 B6 7A A2 85 ED C7 34 08 36 98 17 FE 4E 26
       data hash MD5: 16K
       FE 2D A7 23 D0 95 19 07 FD F5 A6 3F E9 0D 3B 3A>)
$$ ##END=
$$ 
$$ hash MD5
$$ 25 12 54 15 96 15 27 C9 C1 9C E8 26 77 01 72 BF
##$RELAX= 
##$RELAX= 
##$RELAX= 
##$RELAX= 
##$RELAX= 
##$RELAX= 
$$ Bruker specific parameters
$$ --------------------------
##$DU= <F:/spectra>
##$EXPNO= 1
##$NAME= <H-F>
##$PROCNO= 1
##$TYPE= <nmr>
##$USER= <she>
##$AMP= (0..31)
100 100 100 100 100 100 100 100 100 100 100 100 100 100 100 100 100 100 
100 100 100 100 100 100 100 100 100 100 100 100 100 100 
##$AQSEQ= 0
##$AQ_mod= 1
##$AUNM= <au_zg>
##$AUTOPOS= <>
##$BF1= 200.13
##$BF2= 200.13
##$BF3= 200.13
##$BF4= 200.13
##$BF5= 200.13
##$BF6= 200.13
##$BF7= 200.13
##$BF8= 200.13
##$BYTORDA= 1
##$CFDGTYP= 0
##$CFRGTYP= 5
##$CHEMSTR= <none>
##$CNST= (0..31)
1 1 145 1 1 1 1 1 1 1 1 1 1 1 1 1 1 1 1 1 1 1 1 1 1 1 1 1 1 1 1 1 
##$CPDPRG= <>
##$CPDPRG1= <>
##$CPDPRG2= <>
##$CPDPRG3= <>
##$CPDPRG4= <mlev>
##$CPDPRG5= <mlev>
##$CPDPRG6= <mlev>
##$CPDPRG7= <mlev>
##$CPDPRG8= <mlev>
##$CPDPRGB= <>
##$CPDPRGT= <>
##$D= (0..31)
0 1.2 0 0 0 0 0 0 0 0.06 0 0.03 0 0 0 0 0.0002 0 0 0 0 0 0 0 0 0 0 0 0 
0 0 0 
##$DATE= 1571737831
##$DBL= (0..7)
120 120 120 120 120 120 120 120 
##$DBP= (0..7)
150 150 150 150 150 150 150 150 
##$DBP07= 0
##$DBPNAM0= <>
##$DBPNAM1= <>
##$DBPNAM2= <>
##$DBPNAM3= <>
##$DBPNAM4= <>
##$DBPNAM5= <>
##$DBPNAM6= <>
##$DBPNAM7= <>
##$DBPOAL= (0..7)
0.5 0.5 0.5 0.5 0.5 0.5 0.5 0.5 
##$DBPOFFS= (0..7)
0 0 0 0 0 0 0 0 
##$DE= 6
##$DECBNUC= <off>
##$DECIM= 24
##$DECNUC= <off>
##$DECSTAT= 4
##$DIGMOD= 1
##$DIGTYP= 9
##$DL= (0..7)
0 120 120 120 120 120 120 120 
##$DP= (0..7)
150 150 150 150 150 150 150 150 
##$DP07= 0
##$DPNAME0= <>
##$DPNAME1= <>
##$DPNAME2= <>
##$DPNAME3= <>
##$DPNAME4= <>
##$DPNAME5= <>
##$DPNAME6= <>
##$DPNAME7= <>
##$DPOAL= (0..7)
0.5 0.5 0.5 0.5 0.5 0.5 0.5 0.5 
##$DPOFFS= (0..7)
0 0 0 0 0 0 0 0 
##$DQDMODE= 0
##$DR= 18
##$DS= 0
##$DSLIST= <SSSSSSSSSSSSSSS>
$$ [...]
##$SUBNAM2= <"">
##$SUBNAM3= <"">
##$SUBNAM4= <"">
##$SUBNAM5= <"">
##$SUBNAM6= <"">
##$SUBNAM7= <"">
##$SUBNAM8= <"">
##$SUBNAM9= <"">
##$SW= 24.0689530833862
##$SWIBOX= (0..15)
0 0 2 0 0 0 0 0 0 0 0 0 0 0 0 0 
##$SW_h= 4816.95568400771
##$TD= 16384
##$TD0= 1
##$TE= 0
##$TE2= 300
##$TE3= 300
##$TEG= 300
##$TL= (0..7)
0 120 120 120 120 120 120 120 
##$TP= (0..7)
150 150 150 150 150 150 150 150 
##$TP07= 0
##$TPNAME0= <>
##$TPNAME1= <>
##$TPNAME2= <>
##$TPNAME3= <>
##$TPNAME4= <>
##$TPNAME5= <>
##$TPNAME6= <>
##$TPNAME7= <>
##$TPOAL= (0..7)
0.5 0.5 0.5 0.5 0.5 0.5 0.5 0.5 
##$TPOFFS= (0..7)
0 0 0 0 0 0 0 0 
##$TUNHIN= 0
##$TUNHOUT= 0
##$TUNXOUT= 0
##$USERA1= <user>
##$USERA2= <user>
##$USERA3= <user>
##$USERA4= <user>
##$USERA5= <user>
##$V9= 5
##$VALIST= <valist>
##$VCLIST= <CCCCCCCCCCCCCCC>
##$VD= 0
##$VDLIST= <DDDDDDDDDDDDDDD>
##$VPLIST= <PPPPPPPPPPPPPPP>
##$VTLIST= <TTTTTTTTTTTTTTT>
##$WBST= 1024
##$WBSW= 4
##$XGAIN= (0..3)
0 0 0 0 
##$XL= 0
##$YL= 0
##$YMAX_a= 86816
##$YMIN_a= -99871
##$ZGOPTNS= <>
##$ZL1= 120
##$ZL2= 120
##$ZL3= 120
##$ZL4= 120
##$ABSF1= 10
##$ABSF2= 0
##$ABSG= 5
##$ABSL= 3
##$ALPHA= 0
##$AQORDER= 0
##$ASSFAC= 0
##$ASSFACI= 0
##$ASSFACX= 0
##$ASSWID= 0
##$AUNMP= <proc_1d>
##$AZFE= 0.1
##$AZFW= 0.1
##$BCFW= 1
##$BC_mod= 2
##$BYTORDP= 1
##$COROFFS= 0
##$CY= 11.3945322036743
##$DATMOD= 1
##$DC= 2
##$DFILT= <>
##$DTYPP= 0
##$F1P= 20.1720416913024
##$F2P= 0.152960286110954
##$FCOR= 0.5
##$FTSIZE= 0
##$FT_mod= 4
##$GAMMA= 1
##$GB= 0.15
##$INTBC= 1
##$INTSCL= 1
##$ISEN= 128
##$LB= 0.24
##$LEV0= 0
##$LPBIN= 0
##$MAXI= 10000
##$MC2= 0
##$MEAN= 0
##$ME_mod= 0
##$MI= 1.114404
##$NCOEF= 0
##$NC_proc= 0
##$NLEV= 6
##$NOISF1= 3.799351
##$NOISF2= 2.8
##$NSP= 1
##$NTH_PI= 0
##$NZP= 0
##$OFFSET= 15.70392
##$PC= 1
##$PHC0= -9569.695
##$PHC1= 9.000891
##$PH_mod= 1
##$PKNL= yes
##$PPARMOD= 0
##$PSCAL= 0
##$PSIGN= 0
##$REVERSE= no
##$SF= 200.130013532006
##$SI= 16384
##$SIGF1= 3
##$SIGF2= 2
##$SINO= 400
##$SIOLD= 16384
##$SREGLST= <1H.CDCl3>
##$SSB= 0
##$STSI= 0
##$STSR= 0
##$SW_p= 3612.71676300578
##$SYMM= 0
##$S_DEV= 0
##$TDeff= 0
##$TDoff= 0
##$TI= <>
##$TILT= no
##$TM1= 0
##$TM2= 0
##$TOPLEV= 0
##$USERP1= <user>
##$USERP2= <user>
##$USERP3= <user>
##$USERP4= <user>
##$USERP5= <user>
##$WDW= 1
##$XDIM= 8192
##$YMAX_p= 0
##$YMIN_p= 0
$$ End of Bruker specific parameters
$$ ---------------------------------
##NTUPLES= NMR FID
##VAR_NAME=  TIME,          FID/REAL,        FID/IMAG
##SYMBOL=    X,             R,               I
##VAR_TYPE=  INDEPENDENT,   DEPENDENT,       DEPENDENT
##VAR_FORM=  AFFN,          ASDF,            ASDF
##VAR_DIM=   8192,          8192,            8192
##UNITS=     SECONDS,       ARBITRARY UNITS, ARBITRARY UNITS
##FACTOR=    0.0002076,     1,               1
##FIRST=     0,             0,               0
##LAST=      1.7004516,     0,               0
##MIN=       0,             -99871,          0
##MAX=       1.7004516,     86816,           0
$$ Real data points
##PAGE= N=1
##DATA TABLE= (X++(R..R)), XYDATA
$$ plain form
0 0 0 0 0 0 0 0 0 0 8 -8 8 -8 16 -16 16 -24 25 -32 40 -48 55 -64 72 -81 96 -109 125 -142 161 -181 203
31 203 -230 256 -287 321 -358 399 -441 491 -544 602 -666 739 -819 905 -1004 1116 -1243 1389
49 1389 -1557 1756 -1995 2287 -2656 3136 -3793 4746 -6265 9090 -16156 73464 85834 -26366
63 -26366 19935 25252 -22623 -44598 14944 28368 15694 42531 86816 57587 18933 17542 2870
76 2870 -53491 -50122 20353 58434 39850 49127 68373 27424 -32380 -22547 9401 -6842 -28710
89 -28710 4648 46897 57597 55858 41238 -8441 -47660 -32479 -10903 -22289 -13436 38495 62061
102 62061 27796 5511 15994 4989 -31336 -41200 -26610 -19218 -1091 42163 59867 26359
114 26359 -7704 -16460 -30646 -43931 -20849 11112 5562 -7685 15927 38243 13175 -22902
$$ packed form
0@%%%%%%%%Qj6J6j6K4l2L2m0M9n7P2q8J03j19J36j53J77k05K34k67L03l42L84
31B03m33M86n43O08o79P57q40R32j035J146j268J405j558J724j909K120k359K632
49A389k946L313l751M282m943N792o929Q539j1011J5355k5246Q9620J2370j12200
63b6366M6301N317m7875k1975N9542J3424j2674K6837M4285k9229l8654j391j4672
76B870n6361L369P0475L8081j8584R277J9246m0949n9804R833L1948j6243k1868
89b8710L3358M2249J0700j739j4620m9679l9219J5181K1576j1386Q853N1931K3566
102F2061l4265k2285J0483j1005l6325r864J4590P392J8127M3254J7704l3508
114B6359l4063q756j4186j3285K3082L1961n550j3247K3612K2316k5068l6077
$$ plain form
126 -22902 -26737 -26506 -42672 -38591 -1932 25728 27792 23836 13519 -17224 -41601 -32474 -15714
139 -15714 -19756 -24101 -6214 15883 20431 14159 3607 -17065 -38142 -42162 -29457 -11915 3609
152 3609 12343 10178 254 -8736 -16722 -23567 -26505 -23807 -19367 -12295 194 13371 17160 5860
166 5860 -14223 -33901 -39931 -28121 -10811 -2373 -96 3283 3292 -2743 -9076 -14351 -22227 -29115 -25893
181 -25893 -16530 -6856 4827 12628 4215 -14792 -24362 -21960 -20620 -18328 -7661 -93 -3729 -6393
195 -6393 -373 -645 -12868 -22145 -22765 -23690 -20109 -3111 10344 4675 -7198 -8631 -12174 -23377 -23420
210 -23420 -9622 -6399 -14171 -10201 2977 2732 -7074 -8985 -10529 -22478 -25364 -10558 1357 -757
224 -757 -1950 1552 -6550 -20412 -17541 -6894 -9508 -16254 -8307 1923 -314 -2582 1697 -3748 -19379
$$ packed form
126b2902l835K31j6166M081L6659K7660K064l956j0317l0743k4377R127J6760
139a5714m042m345J7887K2097M548o272j0552k0672k1077m020J2705J7542J5524
152C609Q734k165r924q990p986o845k938K698M440P072J2489J3177L789j1300
166E860k0083j9678o030J1810J7310Q438K277L379Ro035o333n275p876o888L222
181b5893R363R674J1683P801q413j9007r570K402J340K292J0667P568l636k664
195f393O020k72j2223r277o20r25L581J6998J3455n669j1873j433l543j1203m3
210b3420J3798L223p772L970J3178k45r806j911j544j1949k886J4806J1915k114
224g57j193L502q102j3862K871J0647k614o746P947J0230k237k268M279n445j5631
$$ plain form
239 -19379 -21748 -11027 -5611 -4926 2662 7674 -1347 -9771 -5924 -4697 -12347 -13747 -4593 -1334 -3545
254 -3545 3039 11228 4454 -9190 -12115 -9425 -10695 -6067 6436 9749 2669 1213 5969 1682 -8003
269 -8003 -8512 -4050 -5449 -3871 7607 15723 11471 4787 2491 -3201 -10767 -7611 2775 6684 5472
284 5472 9290 13552 9802 4049 3001 -738 -8270 -6905 4446 12967 14031 14873 14263 6811 -1345
299 -1345 -2192 -8 -263 1535 8818 13703 14249 14420 13854 7360 -2547 -6016 -2616 2745 9227 16320
315 16320 18318 14047 8988 6233 3639 -775 -2583 247 4503 9924 16114 19658 15679 7499 948
330 948 -3321 -4169 -435 6322 11581 12717 12954 12724 9930 5238 720 -3013 -4538 -1307 6563 13981
346 13981 16429 14111 8775 2023 -2676 -3930 -1757 786 3685 7279 10702 12590 11126 7459 1284
$$ packed form
239a9379k369J0721N416O85P588N012r021q424L847J227p650j400R154L259k211
254c545O584Q189o774j3644k925K690j270M628J2503L313p080j456M756m287r685
269h003n09M462j399J578J1478Q116m252o684k296n692p566L156J0386L909j212
284E472L818M262l750n753j048l739p532J365J1351Q521J064Q42o10p452q156
299a345q47K184k55J798P283M885N46J71n66o494r907l469L400N361O482P093
315A6320J998m271n059k755k594m414j808K830M256N421O190L544l979q180o551
330I48m269q48L734O757N259J136K37k30k794m692m518l733j525L231P870P418
346A3981K448k318n336o752m699j254K173K543K899L594L423J888j464l667o175
$$ plain form
361 1284 -5143 -8079 -4794 1973 8390 12030 11940 8146 3199 501 -1168 -2823 -3587 -2339 1039 5586
377 5586 10159 11498 8254 1706 -4981 -7761 -5543 -1234 3921 7031 7178 6114 4651 2990 292
392 292 -3032 -5842 -6195 -2891 2670 8614 10729 7870 2082 -2787 -5191 -4891 -2866 -187 1258 2513
408 2513 3623 4813 5436 3046 -1763 -5639 -7320 -4718 229 5426 6997 4775 1046 -1827 -3215
423 -3215 -3032 -2133 -1813 -2139 -1406 1345 4599 5428 3261 -1057 -6076 -8054 -5722 -1448 1780 2954 2106
440 2106 35 -1405 -1304 -970 -2290 -4308 -5307 -4334 -1363 1452 3369 1618 -2627 -5905 -6198 -4830
456 -4830 -2367 -496 -545 -2190 -3204 -2021 -1056 -1560 -3428 -5496 -6951 -5952 -2426 690 1030 -1279 -3774
473 -3774 -5841 -6097 -4154 -1915 -2193 -4297 -5058 -4330 -2939 -1927 -1435 -3120 -6270 -6990 -4798 -2018 -1058
$$ packed form
361A284o427k936L285O767O417L640r0l794m947k698j669j655p64J248L378M547
377E586M573J339l244o548o687k780K218M309N155L110J47j064j463j661k698
392B92l324k810l53L304N561N944K115k859n788m869k404L00K025K679J445J255
408B513J110J190O23k390m809l876j681K602M947N197J571k222l729k873j388
423c215J83Q99L20l26P33K751L254Q29k167m318n019j978K332M274L228J174q48
440B106k071j440J01L34j320k018r99R73K971K815J917j751m245l278k93J368
456d830K463J871m9j645j014J183R65n04j868k068j455R99L526L116L40k309k495
473c774k067k56J943K239k78k104p61P28J391J012M92j685l150p20K192K780R60
$$ plain form
490 -1058 -1047 -2861 -6040 -7222 -5078 -2540 -1847 -2964 -3865 -4671 -4494 -2575 -1154 -2034 -4676 -5791 -5549
507 -5549 -3613 -1019 488 -1055 -4207 -6152 -5215 -2883 -1779 -984 -1421 -3521 -4036 -2380 -726 -1233
523 -1233 -2770 -4165 -5315 -4229 -800 2576 1846 -578 -2124 -3547 -3968 -2696 -67 -468 -1771 -1710
539 -1710 -544 876 1716 1396 -916 -4261 -4549 -1636 1085 2393 2847 1888 -818 -2171 -840 448
555 448 -499 -953 -295 17 989 4192 4774 2528 -1049 -2603 -2772 -1680 935 4374 4199 1493 784 1811
573 1811 1808 455 232 -354 -2154 -808 3262 5200 4518 3323 1581 -1548 -2737 -372 2022 2132 1773
590 1773 3026 2891 1730 2798 3155 509 -2902 -2191 238 2114 3801 5859 4287 281 -436 675
606 675 122 -704 634 1606 925 1499 4398 4859 2066 -8 -780 -2244 -2219 1377 4693 3628 1759 1867
$$ packed form
490a058J1j814l179j182K144K538O93j117r01q06J77J919J421q80k642j115K42
507e549J936K594J507j543l152j945R37K332J104P95m37k100n15J656J654n07
523a233j537j395j150J086L429L376p30k424j546j423m21J272K629m01j303O1
539a710J166J420Q40l20k312l345k88K913K721J308M54r59k706j353J331J288
555D48r47m54O58L12R72L203N82k246l577j554j69J092K615L439j75k706p09J027
573A811lj353k23n86j800J346M070J938o82j195j742l129j189K365K394J10l59
590A773J253j35j161J068L57k646l411P11K429J876J687K058j572m006p17J111
606F75n53q26J338R72o81N74K899M61k793k074p72j464K5L596L316j065j869J08
$$ plain form
624 1867 2143 225 56 1341 -121 -2336 -492 3677 4413 2888 3322 2045 -1619 -3004 -55 1211
640 1211 703 1643 3658 2522 968 2127 3468 196 -2291 -1221 439 898 2935 4773 3394 120
656 120 -101 1232 18 -552 1128 2270 936 1343 3593 3687 1178 520 639 -1318 -1905 1593 3699
673 3699 2921 1420 2273 1513 -556 555 1810 102 -1854 615 3098 2131 1658 2931 1758 -1212
689 -1212 -1945 652 1050 63 804 2648 1124 -119 1415 2473 77 -1779 -520 183 -346 1134 3060
706 3060 1838 -637 -256 643 -321 -939 219 450 -793 -440 1322 1403 -79 -606 -226 -1644 -1464 -168
724 -168 866 -109 -569 137 -620 -1089 -171 -106 -1166 -1848 -1181 -406 -744 -495 562 -772 -2206 -1572 -483
743 -483 -880 -1493 -580 -723 -1514 -1619 -242 9 -1386 -1485 -1172 -1627 -1690 -542 -364 -1069 -1729 -998 -968 -817
$$ packed form
624A867K76j918j69J285j462k215J844M169P36j525M34j277l664j385K949J266
640A211n08R40K015j136j554J159J341l272k487J070J660M59K037J838j379l274
656A20k21J333j214n70J680J142j334M07K250R4k509o58J19j957n87L498K106
673C699p78j501Q53p60k069J111J255j708j956K469K483r67m73J273j173k970
689a212p33K597L98r87P41J844j524j243J534J058k396j856J259P03n29J480J926
706C060j222k475L81Q99r64o18J158K31j243L53J762Q1j482n27L80j418J80J296
724a68J034r75m60P06p57m69R18O5j060o82O67P75l38K49J057j334j434O34J089
743d83l97o13R13j43p91j05J377K51j395r9L13m55o3J148J78p05o60P31L0J51
$$ plain form
763 -817 -933 -818 -1259 -1820 -1693 -969 -713 -807 -695 -1206 -1715 -896 -509 -862 -1335 -1142 -1221 -1421 -751 -32 -208
784 -208 -1054 -1297 -919 -1265 -984 -288 -397 -1351 -789 97 64 -556 -562 -377 -1369 -2052 -648 208 3 -9 38 -176
806 -176 -770 -174 17 -530 -1059 -413 -216 100 90 1065 132 -1065 -796 -525 -637 -683 396 559 -360 -306 594
827 594 808 -130 -561 -455 -1162 -775 471 1197 751 205 354 42 -933 -499 295 -61 -1008 2 866 518
847 518 310 691 -335 -1171 -1472 95 387 204 734 687 103 -506 202 259 -504 -1190 -636 14 -222 870
867 870 1338 671 -790 -845 -316 -360 -334 620 489 -341 104 889 910 -61 -374 -253 -750 -853 511 1287 682
888 682 102 459 -14 -551 -269 419 -43 -408 -46 641 981 1152 876 177 -863 -791 -311 694 463 798
908 798 890 259 -240 734 724 -24 -20 -161 180 403 714 1572 1158 -47 143 -114 40 775 848 938 324 506
$$ packed form
763h17j16J15m41n61J27P24K56r4J12n11n09Q19L87l53m73J93p9k00O70P19j76
784b08q46k43L78l46K81O96j09r54N62Q86l3o20oJ85r92o83J404Q56k05j2M7k14
806a76n94N96J91n47n29O46J97L16j0R75r33j197K69K71j12m6J079J63r19N4R00
827E94K14r38m31J06p07L87J246P26m46n46J49l12r75M34P94l56r47J010Q64l48
847E18k08L81j026q36l01J567K92j83N30m7n84o09P08N7p63o86N54O50k36J092
867H70M68o67j461n5N29m4K6R54j31q30M45P85K1r71l13J21m97j03J364P76o05
888F82n80L57m73n37K82O88m62l65L62O87L40J71k76o99j040P2M80J005k31L35
908G98R2o31m99R74j0p48Mj41L41K23L11Q58m14j205J90k57J54P35P3R0o14J82
$$ plain form
930 506 953 1052 595 334 157 -466 -133 711 1448 1255 880 486 263 130 395 582 320 -60 121 480 783
951 783 1051 1315 717 74 -471 142 348 655 703 684 251 242 213 682 594 -132 -274 -98 249 533 781 800 189
974 189 -392 -472 71 273 245 97 -44 -159 315 415 444 166 -107 -990 -775 -74 96 461 3 -137 -475
995 -475 -477 -42 330 100 -326 -697 -488 116 320 511 -63 -531 -641 -675 -390 150 -30 -309 -243 -257 -260 -185 141
1018 141 10 -537 -569 -630 -183 46 202 -147 -610 -157 -396 -71 -321 -278 -293 -516 -484 125 -7 39 -103 -317
1040 -317 -703 -514 -5 -57 100 -407 -442 -152 -246 43 -419 -495 -477 -315 -334 -10 267 5 14 -260 -610 -171 -337
1063 -337 276 -272 -243 -479 -17 156 435 165 -394 -529 -376 -5 -62 -114 23 -81 -221 164 -70 -157 -174 -449
1085 -449 -326 -524 -160 119 206 -271 -268 -237 -381 -88 -265 -39 -365 -56 -158 119 134 249 -276 -127 -192 -540
$$ packed form
930E06M47R9m57k61j77o23L33Q44P37j93l75l94k23j33K65J87k62l80J81L59L03
951G83K68K64n98o43n45O13K06L07M8j9m33rk9M69q8p26j42J76L47K84K48J9o11
974A89n81q0N43K02k8j48j41j15M74J00K9k78k73q83K15P01J70L65m58j40l38
995d75kM35L72k30m26l71K09O04K04J91n74m68j10l4K85N40j80k79O6j4lP5L26
1018A41j31n47l2o1M47K29J56l49m63M53k39L25k50M3j5k23L2O09j32M6j42k14
1040c17l86J89N09n2J57n07l5K90r4K89m62p6J8J62j9L24K77k62Rk74l50M39j66
1063c37O13n48K9k36M62J73K79k70n59j35J53L71n7n2J37j04j40L85k34q7j7k75
1085d49J23j98L64K79Q7m77LL1j44K93j77K26l26L09j02K77J5J15n25J49o5l48
$$ plain form
1107 -540 -330 -5 199 54 -184 -507 -216 -22 -23 -588 -110 -401 -340 33 547 405 68 -121 -196 -400 -55
1128 -55 -129 -23 19 23 142 342 358 -104 -134 -330 -397 -54 294 235 237 -17 -159 -213 34 -137 -297 -111 -135 66
1152 66 246 318 249 67 -220 -149 -42 110 165 367 124 309 257 194 290 351 -237 -23 -258 -53 276 475 343
1175 343 18 55 437 96 302 280 30 275 862 234 481 259 608 13 -102 47 27 428 397 260 295 -36
1197 -36 265 115 127 -71 -159 238 57 598 587 521 200 168 -171 271 -18 185 291 11 302 232 397 141
1219 141 -99 167 -85 -154 -303 170 525 277 56 66 10 -67 -103 200 1 -148 337 121 145 106 483 11
1241 11 -359 64 -13 326 -135 99 282 138 -11 -229 180 -122 -17 7 -135 -150 224 278 -13 -97 77 -140
1263 -140 -168 213 329 -106 -91 284 186 -250 -194 -130 63 -332 -150 -25 -9 -230 91 69 -37 -114 56 -96 -240
$$ packed form
1107e40K10L25K04j45k38l23K91J94jn65M78k91O1L73N14j42l37j89p5k04L45
1128e5p4J06M2MJ19K00J6m62l0j96o7L43L48n9Kk54j42n4K47j71j60J86k4K01
1152F6J80P2o9j82k87P1J07J52N5K02k43J85n2o3R6O1n88K14k35K05L29J99j32
1175C43l25L7L82l41K06k2k50K45N87o28K47k22L49n95j15J49k0M01l1j37L5l31
1197c6L01j50J2j98q8L97j81N41j1o6l21l2l39M42k89K03J06k80K91p0J65k56
1219A41k40K66k52o9j49M73L55k48k21J0n6p7l6L03j99j49M85k16K4l9L77m72
1241A1l70M23p7L39m61K34J83j44j49k18M09l02J05K4j42j5L74N4k91q4J74k17
1263a40k8L81J16m35J5L75r8m36N6O4J93l95J82J25J6k21L21k2j06p7J70j52j44
$$ plain form
1286 -240 -307 -122 -56 -119 226 94 108 -289 -300 -381 -72 31 -428 117 126 178 421 211 48 -207 -217 -280 -51 167
1310 167 188 -16 -224 65 92 -106 -75 -112 -73 -25 -43 261 182 180 155 47 -324 148 -124 65 -40 23 8 -307
1334 -307 26 268 95 -159 -365 -100 79 -118 150 106 -182 -49 -54 -148 272 62 -173 -216 -484 303 107 293
1356 293 -112 -283 -177 -338 -331 34 -326 -231 -63 -161 -83 43 -18 -132 9 -198 191 -45 -214 -82 40 12
1378 12 390 -11 -4 156 -88 -173 -114 -112 -37 182 -65 86 87 -473 -172 -38 101 -142 354 -46 63 -53 -128 -91
1402 -91 114 -70 -136 130 -9 83 104 242 -233 -101 79 -14 -196 -19 33 -220 -83 263 -22 -103 -155 -141 -39
1425 -39 -87 -83 355 249 -51 -70 -180 383 29 20 -15 -24 -317 189 141 23 99 -260 -116 -140 121 535 -44 164
1449 164 84 43 48 -71 -207 -32 161 11 201 241 110 169 77 48 143 239 231 -116 25 -69 185 -92 82 88 82 -98
$$ packed form
1286b40o7J85O6o3L45j32J4l97j1q1L09J03m59N45RN2K43k10j63k55j0o3K29K18
1310A67K1k04k08K89K7j98L1l7L9M8j8L04p9kk5j08l71M72k72J89j05O3j5l15
1334c07L33K42j73k54k06K65J79j97K68m4k88J33nr4M20k10k35m3k68P87j96J86
1356B93m05j71J06j61PL65l60R5J68r8P8J26o1j14J41k07L89k36j69J32J22k8
1378A2L78m01PJ60k44q5N9KP5K19k47J51Jn60L01J34J39k43M96m00J09j16p5L7
1402i1K05j84o6K66j39R2K1J38m75J32J80r3j82J77N2k53J37L46k85q1n2J4J02
1425c9m8MM38j06l00j9j10N63l54rl5rk93N06m8j18P6l59J44k4K61M14n79K08
1449A64q0m1Nj19j36J75J93j50J90M0j31N9r2k9R5R6ql47J41r4K54k77J74Ooj80
$$ plain form
1475 -98 -209 65 264 -46 71 25 91 48 -276 -189 303 182 37 -112 130 196 151 218 69 -53 -220 -205 254
1498 254 -87 -127 -182 148 61 -123 -226 467 140 -146 146 -167 -101 -7 86 247 -161 223 -93 -110 116 -68
1520 -68 50 353 -231 273 347 154 -63 -127 -122 -250 173 222 66 46 265 108 -204 -62 154 -150 -232 3 -52
1543 -52 103 131 365 -228 228 -107 1 -10 -194 -4 -34 -136 -76 414 307 264 -142 10 129 1 125 -25
1565 -25 -166 105 221 -15 -357 20 7 -104 13 -119 192 -109 246 -73 42 213 -76 68 -14 -173 -259
1586 -259 234 227 -206 1 28 143 28 -18 -43 -170 -62 98 164 -157 124 307 49 75 -53 -113 -204 114 100
1609 100 108 240 165 -27 -245 -95 61 -270 11 4 -59 116 -112 -212 -103 40 -67 -2 18 -275 300 203 239
1632 239 44 -84 188 -181 -146 77 212 13 43 -37 -306 -56 -31 170 -40 -183 -226 -49 -99 -183 90 -209
$$ packed form
1475i8j11K74J99l10J17m6O6m3l24Q7M92j21j45j49K42O6m5O7j49j22j67J5M59
1498B54l41m0n5L30q7j84j03O93l27k86K92l13O6R4R3J61m08L84l16j7K26j84
1520f8J18L03n84N04P4j93k17o4Nj28M23M9j56k0K19j57l12J42K16l04q2K35n5
1543e2J55K8K34n93M56l35J08j1j84J90l0j02O0M90j07m3m06J52J19j28J24j50
1565b5j41K71J16k36l42L77j3j11J17j32L11l01L55l19J15J71k89J44q2j59q6
1586b59M93pm33K07K7J15j15m6k5j27J08J60O6l21K81J83k58K6j28o0r1L18j4
1609A00QJ32p5j92k18J50J56l31K81po3J75k28j00J09J43j07O5K0k93N75r7L6
1632B39j95j28K72l69L5K23J35j99L0q0k69K50K5K01k10j43m3J77n0q4K73k99
$$ plain form
1654 -209 -226 -39 234 112 -389 -25 -28 -57 -11 38 -149 151 -45 -81 -105 -179 386 106 -263 8 61 -29 68 28
1678 28 -14 -181 -51 -55 96 126 39 83 170 -71 116 -57 -22 -5 134 162 55 236 -100 -85 -138 -355 14 83 -26
1703 -26 -49 49 116 -64 232 -88 -80 -330 117 -140 -82 -169 -49 44 -12 22 -113 -23 -215 -96 28 381 346 211
1727 211 83 45 11 -95 -7 -24 -74 -1 -207 41 79 -35 257 75 157 -282 -217 48 74 -449 -300 182 -161
1750 -161 -261 -356 121 244 -258 310 -78 -92 -96 94 147 -89 95 217 -206 -136 12 40 -72 -283 76 56 -29
1773 -29 62 -113 -219 26 151 58 44 -9 216 -100 209 -152 206 -202 -33 16 4 73 166 -34 -84 -128 132 -29
1797 -29 -225 162 315 -26 346 118 2 -14 -45 457 28 317 -35 99 11 -28 -12 1 17 -65 140 -239 34
1820 34 294 -113 -37 -25 203 306 211 -28 46 -41 45 -22 109 -140 12 -198 3 105 -88 -148 -7 161 -14
$$ packed form
1654b09j7J87K73j22n01L64lk9M6M9j87L00j96l6k4p4N65k80l69K71N3r0R7m0
1678B8m2j67J30mJ51L0q7M4Q7k41J87j73L5J7J39K8j07J81l36J5n3k17L69O9j09
1703b6k3R8O7j80K96l20Qk50M47k57N8q7J20R3n6L4j35R0j92J19J24L53l5j35
1727B11j28l8l4j06Q8j7n0P3k06K48L8j14K92j82Q2m39O5K65K6n23J49M82l43
1750a61j00r5M77J23n02N68l88j4mJ90N3k36J84J22m23P0J48K8j12k11L59k0q5
1773b9R1j75j06K45J25r3j4n3K25l16L09l61L58m08J69M9j2O9R3k00n0m4K60j61
1797b9j96L87J53l41L72k28j16j6l1N02m29K89l52J34q8l9J6J3J6q2K05l79K73
1820C4K60m07P6J2K28J03r5k39P4q7Q6o7J31k49J52k10K01J02j93o0J41J68j75
$$ plain form
1843 -14 -77 35 -63 -108 275 -296 -101 254 -47 -18 165 172 -20 -21 -38 346 217 -126 -87 -249 27 -4 -13 -34 54
1868 54 -302 -178 125 27 250 -46 -102 -53 -25 39 64 17 141 -93 -109 -130 293 -218 -57 31 -155 -80 -17 -79 74
1893 74 -35 -28 -44 216 35 -249 -8 160 -183 -21 8 29 -153 60 -106 109 83 138 223 -213 158 47 83
1916 83 116 281 -173 -159 -125 25 70 62 -38 -301 -128 -119 295 60 -294 35 -48 -1 24 -54 -85 141 120 -203 146
1941 146 -89 106 119 -283 -148 -28 -130 -135 267 74 24 155 -388 -47 -135 -175 -20 -202 16 152 -144 4
1963 4 236 -133 73 -273 276 -365 62 -180 -124 182 -122 -231 -127 -7 51 -174 74 295 -235 157 69 86
1985 86 51 269 -59 37 246 13 -29 -139 -24 12 127 -101 -189 -227 -39 -11 -9 91 238 28 56 222 187 -180
2009 -180 265 -25 102 19 69 -100 -42 -95 -6 181 148 -267 -3 -49 38 99 132 -88 -234 -159 378 -123 -180 -67
$$ packed form
1843a4o3J12r8m5L83n71J95L55l01K9J83Pj92jj7L84j29l43L9j62K76l1rk1Q8
1868E4l56J24L03r8K23k96n6M9K8O4K5m7J24k34j6k1M23n11J61Q8j86P5O3o2J53
1893G4j09Pj6K60j81k84K41J68l43J62K9K1j82K13j66K15k6N5Q5m36L71j11L6
1916H3L3J65m54J4L4J50M5qj00k63J73RM14k35l54L29q3M7K5p8l1K26k1l23L49
1941A46k35J95J3m02J35J20j02nM02j93n0J31n43L41q8m0J55j82K18J36k96J48
1963DK32l69K06l46N49o41M27k42N6L06l04j09J04J20N8k25K48K21n30L92q8J7
1985H6l5K18l28R6K09k33m2j10J15L6J15k28q8l8J88K8KJ00J47k10K8J66l5l67
2009a80M45k90J27q3N0j69N8n3Q9J87l3m15K64m6Q7O1L3k20j46P5N37n01n7J13
$$ plain form
2033 -67 -66 -86 -203 -75 -265 -198 42 100 54 -29 8 84 -91 394 -228 -113 -182 31 23 -94 305 301 126 -123 -161
2058 -161 -150 -119 -121 -52 165 -324 -52 -134 1 342 -238 -91 -55 118 -66 -145 253 109 -23 -47 75 -124 17
2081 17 232 -28 157 95 33 30 77 103 -82 56 -305 -58 115 -82 178 79 314 9 59 -360 -73 -84 -205
2104 -205 -71 -21 270 33 -104 48 172 -200 -99 345 -329 -127 -111 -174 -146 -33 85 111 -71 -192 -32 14
2126 14 -136 -202 -178 -233 -35 -83 -76 -265 67 60 -224 18 -149 -153 29 41 -74 198 -186 -15 242 -249 54 -123
2150 -123 -140 -203 159 -41 71 -67 -180 -105 -27 235 207 -31 110 -27 -27 88 -125 -180 -136 30 55 -8 68 -155
2174 -155 33 78 171 -324 -33 6 75 301 166 206 94 227 -66 28 115 -223 113 -40 -60 -133 81 121 -68
2197 -68 -75 115 63 156 8 52 110 -74 -120 98 -10 -142 63 -196 92 -122 -17 -231 -160 238 134 143 -60 -24
$$ packed form
2033f7Jk0j17J28j90O7K40N8m6q3L7P6j75M85o22J15o9K13qj17L99mj75k49l8
2058a61J1L1kO9K17m89K72q2J35L41n80J47L6J73j84p9L98j44j32k4J22j99J41
2081A7K15k60J85o2o2lM7K6j85J38l61K47J73j97K60r9K35l05N0m19K87j1j21
2104b05J34N0K91k37j37J52J24l72J01M44o74K02J6o3K8J13J18K6j82j21J60M6
2126A4j50o6K4n5J98m8Pj89L32pk84K42j67mJ82J2j15K72l84J71K57m91L03j77
2150a23j7o3L62k00J12j38j13P5P8K62k8k38J41j37%J15k13n5M4J66K5o3P6k23
2174a55J88M5R3m95K91L9O9K26j35M0j12J33k93R4Q7l38L36j53k0p3K14M0j89
2197f8pJ90n2R3j48M4N8j84m6K18j08j32K05k59K88k14J05k14P1L98j04Rk03L6
$$ plain form
2221 -24 160 43 66 -155 -65 28 -109 75 95 212 -44 193 -11 59 -14 -27 -99 -64 188 -146 44 234 -360
2244 -360 -42 15 65 -226 -168 105 -54 63 49 -166 82 34 -97 115 72 52 226 15 -124 250 227 52 225
2267 225 -169 41 14 145 252 87 167 43 40 191 17 -147 -19 -184 -73 38 57 -274 221 213 146 1 93
2290 93 -125 -66 -124 58 192 60 -202 60 96 -36 -262 27 -183 156 -2 -113 -172 191 -343 38 106 328
2312 328 71 401 9 85 33 -202 146 -11 42 14 212 -49 284 -40 -103 -179 2 92 -281 -226 25 -139 189
2335 189 -19 -49 -71 -8 -34 -76 -31 -172 215 -62 -54 -28 -85 245 196 -49 0 -264 66 -78 -63 8 33 -42 32 -200
2361 -200 -50 -113 -186 -100 57 89 -145 77 239 -15 -331 54 211 -240 -165 -20 -265 -64 -84 162 -48 118
2383 118 -63 -263 112 -107 -412 -320 233 -40 -173 -19 -17 189 99 92 -16 132 -28 442 -55 52 -429 -182
$$ packed form
2221b4J84j17K3k21R0R3j37J84K0J17k56K37k04P0p3j3p2L5K52l34J90J90n94
2244c60L18N7N0k91N8K73j59J17j4k15K48m8j31K12m3k0J74k11j39L74k3j75J73
2267B25l94K10k7J31J07j65Q0j24lJ51j74j64J28j65J11J11J9l31M95qo7j45R2
2290I3k18N9n8J82J34j32k62K62L6j32k26K89k10L39j58j11n9L63n34L81O8K22
2312C28k57L30l92P6n2k35L48j57N3k8J98k61L33l24o3p6J81R0l73N5K51j64L28
2335A89k08l0k2O3k6m2M5j41L87k77QK6n7L30m9k45M9k64L30j44J5P1K5p5P4k32
2361b00J50o3p3Q6J57L2k34K22J62k54l16L85J57m51P5J45k45K01k0K46k10J66
2383A18j81k00L75k19l05R2N53k73j33J54KK06r0pj08J48j60M70m97J07m81K47
$$ plain form
2405 -182 -130 -86 1 51 116 -293 151 28 -94 150 113 166 -88 -135 40 -57 276 22 -156 70 -41 -188 86
2428 86 151 196 80 -104 115 174 -151 -155 42 -309 166 51 -190 52 -24 111 80 -79 -137 10 123 17 44
2451 44 -161 38 251 -188 134 -188 -256 45 -38 7 -338 -339 24 -51 56 -262 -57 -216 -314 6 261 -75 30
2474 30 -73 -119 -63 -130 -40 -203 -241 325 137 -83 18 -200 -66 -263 322 52 186 71 213 -272 402 157
2496 157 219 -188 443 141 -127 -261 35 23 -65 129 -38 210 -217 -132 232 310 -72 245 -1 6 -44 120 119
2519 119 -195 -45 56 260 -155 -175 -158 73 -96 -151 -87 208 -201 -113 -5 47 -212 -227 -9 -201 58 -178
2541 -178 259 -11 6 -54 174 66 -84 -178 -19 -4 -261 109 -15 102 21 315 65 -119 183 -109 99 -132
2563 -132 112 -327 -13 -109 -167 -86 -325 84 12 211 260 183 -132 143 208 -50 -2 -16 -150 -48 -48 -13 -112 84
$$ packed form
2405a82N2M4Q7N0O5m09M44j23j22K44l7N3k54m7J75r7L33k54j78K26j11j47K74
2428H6O5M5j16j84K19N9l25mJ97l51M75j15k41K42p6J35l1j59n8J47J13j06K7
2451D4k05J99K13m39L22l22o8L01q3M5l45jL63p5J07l18K05j59r8L20K55l36J05
2474C0j03m6N6o7R0j63l8N66j88k20J01k18J34j97N85k70J34j15J42m85O74k45
2496A57O2m07O31l02k68j34K96j2q8J94j67K48m27Q5L64P8l82L17k46Pn0J64j
2519A19l14J50J01K04m15k0J7K31j69n5O4K95m09Q8J08N2k59j5K18j92K59k36
2541a78M37k70J7o0K28j08j50r4J59J5k57L70j24J17q1K94k50j84L02k92K08k31
2563a32K44m39L14r6n8Q1k39M09p2J99M9p7l15K75O5k58M8j4j34J02%L5r9J96
$$ plain form
2587 84 35 73 145 20 131 -232 27 -75 73 -88 296 -83 138 -15 -87 192 76 208 215 -107 -337 -42
2609 -42 -66 -110 -191 -94 86 -8 16 -211 -44 43 119 131 75 -305 7 37 -90 64 -314 -57 128 128 98 -128 -216
2634 -216 -29 -10 -73 127 29 96 113 242 -31 -64 -47 125 -109 243 -39 61 20 245 50 -63 121 -68 162
2657 162 140 -36 -31 -10 -237 170 145 -146 -42 -91 21 -123 81 181 -39 -66 27 6 -91 -130 22 98 -225 -164
2681 -164 139 123 -74 37 11 -64 44 63 164 -93 -154 -62 254 -120 -147 232 175 -104 28 19 -196 -20 -61 49
2705 49 0 59 38 -103 97 -27 -131 427 42 -8 196 -82 -240 -90 -21 82 144 -232 -190 -111 90 -28 -65
2728 -65 -300 -252 -152 9 127 220 -59 143 187 -161 -43 30 -97 -10 -104 191 178 -131 69 -142 -134 -509 90
2751 90 86 185 -268 -24 -114 58 563 -105 -64 37 -16 -128 -45 35 -133 -47 81 -153 123 -197 98 2 249 -117
$$ packed form
2587H4m9L8P2j25J11l63K59j02J48j61L84l79K21j53p2K79j16J32Pl22k30K95
2609d2k4m4q1R7J80r4K4k27J67Q7P6J2n6l80L12L0j27J54l78K57J85%l0k26q8
2634b16J87J9o3K00r8O7J7J29k73l3J7J72k34L52k82J00m1K25j95j13J84j89K30
2657A62k2j76NK1k27M07k5k91J04m9J12j44K04J00k20k7R3k1r7l9J52P6l23O1
2681a64L03j6j97J11k6p5J08J9J01k57o1R2L16l74k7L79n7k79J32rk15J76m1J10
2705D9m9N9k1j41K00j24j04N58l85n0K04k78j58J50O9J03O2l76M2P9K01j18l7
2728f5k35M8J00J61J18R3k79K02M4l48J18P3j27Q7r4K95j3l09K00k11Ql75N99
2751I0mR9m53K44r0J72N05o68M1J01n3j12Q3Q0j68Q6J28k34K76l20K95r6K47l66
$$ plain form
2775 -117 153 100 35 -103 -34 54 -162 -106 -39 166 -10 108 71 -21 170 291 32 -9 1 -7 75 238 107 123 131
2800 131 35 -216 18 -328 -20 64 379 166 156 104 -74 99 232 113 79 -260 -102 -33 235 -4 44 26 114
2823 114 66 75 74 24 92 -124 -43 -106 230 -106 142 -96 61 58 -43 83 135 -100 -33 -111 121 115 -89 -55 225 -57
2849 -57 -197 183 -36 -256 -260 196 -48 -52 -42 104 -223 -187 -146 -4 282 109 -76 33 38 -67 104 119 -62 -79
2873 -79 -278 -44 -63 36 -200 182 -138 110 -140 278 114 -16 -16 -105 -283 136 -61 321 35 177 5 -74
2895 -74 124 202 42 -114 -107 -96 169 163 11 -290 139 9 12 -147 549 38 -118 251 -21 25 -366 160 310
2918 310 -278 -94 76 32 61 -102 -340 -128 -106 122 196 82 301 -43 -54 238 116 315 -69 41 268 -48
2940 -48 -83 97 -226 -194 -122 -138 25 190 -71 -186 -37 98 317 -51 4 241 -45 -130 -114 112 -12 200 119
$$ packed form
2775a17K70n3o5j38O9Q8k16N6O7K05j76J18l7r2J91J21k59m1J0qQ2J63j31J6Q
2800A31r6k51K34l46L08Q4L15k13j0n2j78J73J33j19l4l39J58O9K68k39M8j8Q8
2823A14m8Rjn0O8k16Q1o3L36l36K48k38J57lj01J26N2k35O7p8K32ok04L4K80k82
2849e7j40L80k19k20mM56k44mJ0J46l27L6M1J42K86j73j85J09Nj05J71J5j81j7
2873g9j99K34j9R9k36L82l20K48k50M18j64j30%q9j78M19j97L82k86J42j72p9
2895g4J98P8j60j56PJ1K65oj52l01M29j30Lj59O96n11j56L69k72M6l91N26J50
2918C10n88J84J70m4K9j63k38K12K2K28P4j14K19l44j1K92j22J99l84J10K27l16
2940d8l5J80l23L2P2j6J63J65k61j15J49J35K19l68N5K37k86q5J6K26j24K12q1
$$ plain form
2963 119 207 -295 -44 -16 -110 -88 142 -73 6 34 26 267 2 -183 78 55 204 153 -107 -189 -12 -19 126 156 -181
2988 -181 77 114 220 22 -164 128 -335 152 -417 -10 61 257 -148 -57 120 -55 -65 -162 -45 -307 -10 -148
3010 -148 -101 36 -2 93 171 -192 -22 -114 -90 191 -162 288 102 -141 126 186 -20 -132 -148 -319 196 -65 -112
3033 -112 82 56 217 -78 18 11 117 77 -275 143 288 16 116 74 -129 -194 29 14 25 52 -195 23 156
3056 156 -115 -226 -396 26 236 221 -104 70 -73 29 181 64 7 -95 58 288 3 -27 259 -243 -44
3077 -44 -282 68 -22 314 205 -167 214 -52 -79 178 45 24 -179 -164 195 -98 -103 203 199 -210 296 17 -68
3100 -68 127 4 -219 104 234 -127 -152 69 -153 40 216 -55 46 -102 -48 19 19 -229 58 -242 -88 -50
3122 -50 -180 -166 -164 -134 -88 -4 -188 214 173 242 -186 -17 46 237 19 -62 247 19 -151 17 -28 -95 -168 -133 -58
$$ packed form
2963A19Q8n02K51K8r4K2K30k15P9K8qK41k65j85K61k3J49n1k60q2J77pJ45L0l37
2988a81K58L7J06j98j86K92m63M87n69M07P1J96m05R1J77j75j0r7J17k62K97j38
3010a48M7J37l8R5P8l63J70r2K4K81l53M50j86k43K67O0k06j12j6j71N15k61m7
3033a12J94k6J61k95R6pJ06m0l52M18J45k72J00m2k03o5K23j5J1K7k47K18J33
3056A56k71j11j70M22K10j5l25J74j43J02J52j17n7j02J53K30k85l0K86n02J99
3077d4k38L50r0L36j09l72L81k66k7K57j33k1k03J5L59k93nL06mm09N06k79q5
3100f8J95j23k23L23J30l61k5K21k22J93J76k71J01j48N4O7%k48K87l00J54L8
3122e0j30J4KL0M6Q4j84M02m1O9m28J69O3J91k18q1L09k28j70J68m5o7p3L5P5
$$ plain form
3147 -58 -56 -74 -138 158 107 251 -268 -60 109 242 191 138 171 3 -23 -139 -163 96 -11 105 -236 -104 -149 -167
3171 -167 -34 -204 -134 39 44 87 31 91 222 -131 78 -282 4 -138 -220 32 8 -37 -25 56 -137 -91 -36 -61 -99
3196 -99 5 -292 118 215 32 74 125 210 -154 -162 -71 124 111 -182 172 -80 -137 -38 -37 -108 -130 147 -24 -84 167
3221 167 -10 -43 243 44 292 -165 226 -124 40 -94 -96 24 -5 -105 -337 -230 314 303 -36 69 25 87
3243 87 47 -187 27 -57 -87 163 241 -133 2 -108 -389 11 -191 -144 94 -145 -192 -127 3 -159 34 -88 -21
3266 -21 304 188 -26 -127 112 353 29 -47 -173 329 197 6 114 -27 -51 80 -163 -234 -332 -219 -7 231
3288 231 -30 -4 -96 28 395 365 -65 271 91 -117 32 45 -53 -193 -109 52 113 -76 31 425 45 80 265
3311 265 13 -190 83 123 -271 7 -47 -38 242 -109 -75 12 -90 -28 -105 240 214 93 49 212 -176 47 95 27
$$ packed form
3147e8Kj8o4K96n1J44n19K08J69J33n1n3L3j68k6j16k4K59j07J16l41J32m5j8
3171a67J33j70P0J73NM3n6O0J31l53K09l60K86j42q2K52k4m5J2Q1j93M6N5k5l8
3196i9J04k97M10R7j83M2N1Q5l64qR1J95j3k93L54k52n7R9Jp1k2K77j71o0K51
3221A67j77l3K86j99K48m57L91l50J64j34kJ20k9j00k32J07N44j1l39J05m4O2
3243H7m0k34K14q4l0K50P8l74J35j10k81M00k02M7K38k39m7O5J30j62J93j22O7
3266b1L25j16k14j01K39K41l24p6j26N02j32j91J08j41k4J31k43p1r8J13K12K38
3288B31k61K6r2J24L67l0m30L36j80k08J49J3r8j40Q4J61O1j89J07L94l80L5J85
3311B65k52k03K73M0l94K78n4RK80l51L4Q7j02O2p7L45k6j21m4J63l88K23M8o8
$$ plain form
3335 27 189 -7 57 286 -62 43 -185 270 80 -59 -3 152 73 160 18 -36 93 -66 -117 -64 99 101 73 -95
3359 -95 171 -170 234 18 -184 61 158 80 -136 81 -161 -224 -305 528 133 -255 173 123 40 129 -111 -63 -49
3382 -49 7 -182 154 9 -344 100 -173 -31 52 -59 206 -171 71 -163 -106 -244 -120 15 -27 155 -214 100
3404 100 -146 -130 -71 -9 135 157 22 -249 67 126 -431 166 18 314 -40 168 -31 222 96 -296 116 -190
3426 -190 74 238 -21 -17 -40 27 187 -188 277 -10 3 29 -203 171 -120 -85 -392 118 89 52 134 -160 64
3449 64 -153 -29 199 190 -18 -91 9 177 52 109 -310 4 85 185 358 -177 -93 2 -93 176 -68 -42 68
3472 68 -348 -235 -107 -52 -53 -385 57 -22 195 -21 17 7 6 -137 140 38 27 -128 -120 50 157 -147 -51 -21 12
3497 12 52 -33 122 39 -284 -25 -100 -205 178 28 -43 13 54 -108 63 -185 253 130 78 -115 156 153 11 80
$$ packed form
3335B7J62j96O4K29l48J05k28M55j90j39N6J55p9Q7j42n4J29j59n1N3J63Kk8j68
3359i5K66l41M04k16k02K45R7p8k16K17k42o3q1Q33l95l88M28n0q3Q9k40M8J4
3382d9N6j89L36j45l53M44k73J42Q3j11K65l77K42k34N7j38J24J35m2J82l69L14
3404A00k46J6N9O2J44K2j35k71L16N9n57N97j48K96l54K08j99K53j26l92M12l06
3426a90K64J64k59Mk3O7J60l75M65k87J3K6k32L74k91L5l07N10k9l7Q2k94K24
3449F4k17J24K28rk08p3J00J68j25N7m19L14Q1J00J73n35Q4R5r5K69k44K6J10
3472F8m16J13J28N5jl32M42p9K17k16L8j0jj43K77j02j1j55QJ70J07l04R6L0L3
3497A2M0q5J55q3l23K59p5j05L83j50p1N6M1j62J71k48M38j23n2j93K71lj42O9
$$ plain form
3521 80 127 -49 1 40 171 -190 -142 113 51 -45 179 -45 98 0 -65 13 163 -6 -106 -171 -197 33 -236 2
3545 2 -197 28 102 38 83 -233 22 -271 -75 -198 123 -41 -147 102 139 11 68 -19 -83 -122 -223 225 -126
3568 -126 256 -98 -131 46 75 33 7 -141 98 -112 16 -48 -127 38 79 24 429 284 -151 20 -129 37 111
3591 111 -94 -159 -111 -125 52 -164 -94 73 91 -99 88 -117 -63 85 -251 -128 -36 117 -7 24 -371 354 258
3614 258 -121 277 75 199 75 150 -217 92 -33 51 -160 -67 8 -26 -35 163 -277 -262 -70 -33 22 65 -261 44
3638 44 10 -9 44 -84 11 -213 -273 124 53 -91 122 75 -72 -135 -66 41 31 -2 97 28 208 20 183 95 87 290
3664 290 -99 -227 -137 118 20 -43 90 -284 18 -208 165 -27 -158 -33 147 27 -34 -104 164 -1 118 -33
3686 -33 -107 -49 -217 154 -166 17 -74 106 54 197 -124 -118 11 -180 -120 -280 -191 212 43 22 213 112 -37
$$ packed form
3521H0M7j76N0L9J31l61M8K55o2r6K24k24J43r8o5P8J50j69j00o5k6K30k69K38
3545Bj99K25P4o4M5l16K55k93J96j23L21j64j06K49L7j28N7q7o4l9j01M48l51
3568a26L82l54l3J77K9m2k6j48K39k10J28o4p9J65M1n5M05j45m35J71j49J66P4
3591A11k05o5M8j4J77k16P0J67J8j90J87k05N4J48l36J23R2J53j24L1l95P25r6
3614B58l79L98k02J24j24P5l67L09j25Q4k11R3P5l4rJ98m40J5J92L7N5M3l26L05
3638D4l4j9N3j28R5k24o0L97p1j44K13m7j47o3O9J07j0l3R9o9J80j88J63q8qK03
3664B90l89j28R0K55r8o3J33l74L02k26L73j92j31J25J80j20o1p0K68j65J19j51
3686c3p4N8j68L71l20J83r1J80n2J43l21OJ29j91O0j60Q9M03j69k1J91j01j49
$$ plain form
3709 -37 110 93 138 215 57 257 304 -220 45 82 187 -93 -100 -81 -23 16 -217 160 7 85 -231 -126 -93 -401
3733 -401 -124 69 -123 54 4 45 26 23 -217 -328 -26 -183 243 -53 213 270 -139 -187 38 231 28 253
3755 253 -25 -225 -126 205 -14 -177 50 187 386 -82 -13 -76 -65 -23 46 177 163 20 -3 141 -73 94 31
3778 31 3 -81 -219 -9 -6 -323 14 -154 -166 11 -42 181 265 16 -5 -6 71 42 -46 -49 63 10 2 28 115 82 128 -5
3806 -5 -20 225 240 -104 107 -172 -18 -86 28 106 58 159 -219 14 106 -143 -81 132 -112 -11 -141 -95 159
3829 159 -162 -106 -21 199 71 -130 -275 92 -113 -167 -283 78 -117 208 245 294 39 -50 35 -42 -43 10 135 -160
3853 -160 -230 343 63 51 235 -50 39 116 -97 111 -84 -184 10 -16 -119 0 -93 -117 -269 -200 -21 -122 -110
3876 -110 -45 172 -3 160 -219 269 -88 -9 144 62 -68 -156 6 22 -114 -5 54 -165 102 34 -101 -218
$$ packed form
3709c7J47j7M5P7j58K00M7n24K65L7J05k80pJ9N8L9k33L77j53P8l16J05L3l08
3733d01K77J93j92J77n0M1j9lk40j11L02j57M26k96K66N7m09m8K25J93k03K25
3755B53k78k00R9L31k19j63K27J37J99m68O9o3J1M2O9J31j4j43k3J44k14J67o3
3778C1k8q4j38K10Ll17L37j68j2J77n3K23Q4k49k1jP7k9q8lJ12n3qK6Q7l3M6j33
3806ej5K45J5l44K11k79J54o8J14P8m8J01l78K33R2k49O2K13k44J01j30M6K54
3829A59l21N6Q5K20j28k01j45L67k05n4j16L61j95L25L7M9k55q9Q5p7jN3J25k95
3853a60p0N73k80j2J84k85Q9P7k13K08j95j00J94k6j03J19r3k4j52O9J79j01J2
3876a10O5K17j75J63l79M88l57P9J53q2j30q8J62J6j36J09N9k19K67o8j35j17
$$ plain form
3898 -218 68 135 -109 -246 -57 270 -189 -268 59 69 -127 174 -78 210 217 69 -52 17 5 308 108 82 412
3921 412 -121 45 278 153 -74 228 245 -58 -175 236 -130 144 6 44 232 -133 137 109 42 56 56 153 123
3944 123 -29 89 46 40 -46 -74 -107 -148 -100 -24 -404 72 2 90 185 266 -184 69 206 -42 21 -72 -190 -343 307
3969 307 -115 -28 69 161 -25 83 -99 -66 83 118 -161 -57 -97 -199 -316 280 30 -17 52 -106 -11 75 111 -48
3993 -48 15 -22 171 219 -186 -222 170 127 7 -170 -221 -160 -118 167 102 -129 -214 -89 10 -72 -316 103 81 -60 155
4018 155 -260 -21 -301 71 -76 -168 79 171 -71 69 -134 69 24 -220 245 -101 141 94 -36 56 79 16
4040 16 -249 59 -222 -18 79 28 34 125 39 -98 496 192 -187 100 -25 40 -3 -26 -15 15 71 -373 342 -65
4064 -65 -171 -134 102 -165 98 -241 2 -46 -157 80 167 -92 -199 93 51 -98 -236 0 113 -3 -46 -89
$$ packed form
3898b18K86O7k44j37J89L27m59p9L27J0j96L01k52K88Pj48j21O9j2L03k00k6L30
3921D12n33J66K33j25k27L02J7l03j17M11l66K74j38L8J88l65K70k8o7J4%R7l0
3944A23j52J18m3oq6k8l3m1M8P6l80M76p0Q8R5Q1m50K53J37k48O3r3j18j53O50
3969C07m22Q7R7R2j86J08j82L3J49L5k79J04m0j02j17N96k50m7O9j58R5Q6L6j59
3993d8O3l7J93M8m05l6L92m3j20j77n1O1M2K85o5k31q5J25R9q2k44M19k2j41K15
4018A55m15K39k80L72j47r2K47R2k42J40k03K03m5k44M65l46K42m7j30R2K3o3
4040A6k65L08k81K04R7n1OR1q6j37N94l04l79K87j25O5m3k3J1L0N6m44P15m07
4064f5j06L7K36k67K63l39K43m8j11K37Q7k59j07K92m2j49j38K36J13j16m3m3
$$ plain form
4086 -89 246 94 81 -80 -155 205 109 -42 -90 24 691 146 -356 57 47 -76 -170 158 -246 92 22 15 117
4109 117 74 -143 201 -171 37 -46 17 130 -385 -79 -141 60 59 -106 83 48 -79 -152 -23 -120 176 -125 120
4132 120 70 163 -89 -150 23 -41 -192 25 -369 -99 330 75 -323 -81 -43 83 46 -48 -443 55 126 -32 -113
4155 -113 -50 238 51 136 -86 -188 -94 101 196 -45 2 381 -92 97 42 115 -92 68 -24 -8 -33 -32 28 94 1
4180 1 68 341 156 -135 64 306 49 3 118 2 55 -9 14 -252 -108 106 -80 -2 -45 488 -317 -218 235
4203 235 -6 70 -36 60 74 -231 39 59 -174 39 92 61 107 77 114 -52 56 -56 179 220 -232 -280 58 -61
4227 -61 -271 -144 -337 -211 69 96 -239 36 40 -7 14 157 -229 -123 112 12 88 -82 -236 100 18 -22 -83
4250 -83 -23 24 -171 19 5 -61 -133 165 263 -77 -163 47 228 262 42 -36 78 -152 -10 41 163 -66 -10 -172
$$ packed form
4086h9L35j52j3j61p5L60r6j51m8J14O67n45n02M13j0j23r4L28m04L38p0pJ02
4109A17m3k17L44l72K08q3O3J13n15L06o2K01jj65J89l5j27p3J29r7K96l01K45
4132A20n0R3k52o1J73o4j51K17l94K70M29k55l98K42L8J26l7r4l95M98P1j58q1
4155a13O3K88j87Q5k22j02R4J95R5k41M7L79m73J89n5P3k07J60r2J6k5JO0O6r3
4180AO7K73j85k91J99K42k57m6J15j16N3o4K3k66J44K14j86P8m3N33q05R9M53
4203B35k41P6j06R6J4l05K70K0k33K13N3l1M6l0L7j66J08j12K35M1m52m8L38j19
4227f1k10J27j93J26K80K7l35K75Mm7K1J43l86J06K35j00P6j70j54L36q2m0o1
4250h3O0M7j95J90j4o6p2K98R8l40q6K10J81L4k20p8J14k30J42N1J22k29N6j62
$$ plain form
4274 -172 156 -65 -117 160 165 250 163 -1 76 73 -52 46 -320 63 161 -111 78 129 3 230 8 54 -52 202
4298 202 212 121 165 49 85 -76 22 -166 -158 -82 -121 170 55 28 19 -22 -200 -92 224 -189 92 147 -120 39 133
4323 133 -17 129 -189 -120 -85 122 184 -107 -188 80 111 126 -79 -76 111 312 300 311 217 -121 187 -28 286 -200
4347 -200 214 -107 75 -49 -112 59 67 -35 55 168 176 -85 -134 12 65 206 -54 46 -206 34 -206 4 81
4370 81 -361 66 -278 20 -104 -39 133 83 23 156 18 -160 25 164 -217 203 20 -126 -428 135 36 93
4392 93 32 31 -125 79 77 -3 9 284 -93 115 123 -221 191 -100 165 138 -107 165 -14 -83 -101 -184 49 45 -199
4417 -199 -119 133 50 65 3 -13 153 -55 42 123 -83 -8 -173 148 50 -203 63 154 11 -88 27 149 -73 -64
4441 -64 209 -25 -305 217 190 -99 -11 39 21 -11 23 -175 -172 -33 -51 45 -93 -24 27 120 -29 139 -121 -169 226
$$ packed form
4274a72L28k21n2K77NQ5q7j64P7lj25R8l66L83R8k72J89N1j26K27k22M6j06K54
4298B02J0r1M4j16L6j61R8j88QP6l9K91j15k7rm1j78J08L16m13K81N5k67J59R4
4323A33j50J46l18O9L5K07O2k91q1K68L1J5k05LJ87K01j2J1r4l38L08k15L14m86
4347b00M14l21J82j24o3J71Qj02R0J13Qk61m9J46N3J41k60J00k52K40k40K10P7
4370H1m42M27l44K98j24O5J72n0o0J33j38j78J85J39l81M20j83j46l02N63r9N7
4392I3o1jj56K04kq0J2K75l77K08Ql44M12k91K65k7k45K72j79o9j8q3K33mk44
4417a99Q0K52q3J5o2j6J66k08R7Q1k06P5j65L21r8k53K66R1j43r9J15J22k22R
4441f4K73k34k80N22k7k89Q8N0j8l2L4j98LJ39j8R6j38O9N1R3j49J68k60m8L95
$$ plain form
4466 226 106 -211 67 139 -166 160 -4 36 235 125 204 12 241 -1 49 96 -88 102 -211 23 272 20
4488 20 -289 -47 198 48 54 -306 -4 -33 -229 183 282 -33 -198 55 91 83 13 -120 33 56 114 46 227 -237
4512 -237 -130 108 89 -201 -45 -3 107 -185 -5 92 141 8 74 100 -122 -252 -95 56 60 -148 107 -153 -123
4535 -123 288 -141 -237 364 -7 -96 -12 54 19 64 9 251 218 -148 180 160 41 11 83 132 229 -202 72 97 -79
4560 -79 119 85 133 234 -187 250 -107 -146 64 89 181 -37 -148 124 -242 95 278 -143 -25 -190 118 -38
4582 -38 25 288 -103 317 -87 -51 174 35 9 20 27 -124 78 261 23 62 -44 2 -96 -122 -166 -118 7 -101
4606 -101 -17 43 0 173 39 357 244 -233 -57 83 22 143 -101 75 52 86 187 -84 -1 48 -299 -139 279
4629 279 -121 -14 329 168 -72 31 102 80 -181 -160 220 -43 -232 34 -25 -17 55 159 -146 -122 -107 -120 266
$$ packed form
4466B26j20l17K78P2l05L26j64M0J99j10P9j92K29k42N0M7j84J90l13K34K49k52
4488B0l09K42K45j50Ol60L02k9j96M12R9l15j65K53L6qp0j33J53K3N8o8J81m64
4512b37J07K38j9k90J56M2J10k92J80R7M9j33O6K6k22j30J57J51Mk08K55k60L0
4535a23M11m29r6O01l71q9Q4O6l5M5n5K42l3l66L28k0j19l0P2M9R7m31K74K5j76
4560g9J98l4M8J01m21M37l57l9K10K5R2k18j11K72l66L37J83m21J18j65L08j56
4582c8O3K63l91M20m04L6K25j39k6J1Pj51K02J83k38L9j06M6r8k6m4M8J25j08
4606a01Q4O0m3J73j34L18j13m77J76J40o1J21k44J76k3L4J01k71Q3M9l47J60M18
4629B79m00J07L43j61k40J03P1k2k61K1L80k63j89K66n9QP2J04l05K4J5j3L86
$$ plain form
4652 266 101 -77 380 103 38 -83 -45 -40 343 7 -228 -238 63 324 106 -232 -7 56 160 -52 -38 158
4674 158 -280 -118 -94 -43 -15 -230 -335 37 -153 172 -132 140 -11 130 194 -132 -81 250 16 80 -185 46
4696 46 -265 31 18 -5 15 -138 -172 -56 75 -80 83 140 81 -107 -76 93 -188 -16 -10 56 0 -104 81 -69
4720 -69 140 214 -93 39 -29 -29 128 -146 -64 -24 -235 -141 69 274 -62 -272 -11 210 106 213 79 24 35
4743 35 -18 142 -138 103 -140 119 4 -130 -96 226 -56 -146 159 -115 -103 -64 3 -70 46 -226 77 147 -37
4766 -37 -76 -167 26 -108 192 236 191 -154 -162 130 -8 275 71 -200 -24 214 25 -234 286 43 96 -97 -194
4789 -194 -97 41 -115 -82 -149 -9 176 306 55 -382 72 -178 -128 29 -162 -57 -119 -159 -103 -352 -95 22
4811 22 136 -27 75 -132 -128 -75 79 -11 -382 232 150 -31 -130 -220 322 31 11 -191 -47 257 97 -12 -151
$$ packed form
4652B66j65j78M57k77o5j21L8NL83l36k35j0L01K61k18l38K25O3J04k12J4J96
4674A58m38J62K4N1K8k15j05L72j90L25l04K72j51J41O4l26N1L31k34O4k65K31
4696D6l11K96j3k3K0j53l4J16J31j55J63N7n9j88L1J69k81J72OO6n6j04J85j50
4720f9K09P4l07J32o8%J57k74Q2M0k11R4K10K05l36k10K61K21j04J07j34n5J1
4743C5n3J60k80K41k43K59j15j34L4L22k82r0L05k74J2L9O7p3J16k72L03P0j84
4766c7l9r1J93j34L00M4m5l45qK92j38K83k04k71J76K38j89k59N20k43N3j93r7
4789a94R7J38j56L3o7J40J85J30k51m37M54k50N0J57j91J05o2m0N6k49K57J17
4811B2J14j63J02k07MN3J54r0l71O14q2j81r9r0N42k91k0k02J44L04j60j09j39
$$ plain form
4834 -151 -29 -63 25 -135 -180 9 314 -33 14 -98 -38 -34 6 124 77 -177 -138 -358 242 -215 -173 94 -62 106
4858 106 100 -106 -112 -20 -101 65 -100 27 -95 204 -105 -113 0 -122 10 25 348 202 -260 -210 -92 -114 -270 -131
4882 -131 149 13 4 36 -16 110 -58 72 102 119 4 191 -43 -87 342 -160 -4 26 37 108 -26 -19 -71 -62 59
4907 59 315 -338 -7 -22 65 -155 -87 213 -5 85 3 -130 -134 -82 -2 8 -147 -99 -201 83 -58 -158 -95 -113 -48
4932 -48 -225 -56 259 -233 136 95 -206 -305 -171 -291 -172 -111 3 -154 -140 148 171 259 15 -38 101 111 -37
4955 -37 -274 300 -16 170 42 -39 413 27 -5 77 -52 -2 -194 -224 31 -150 103 -59 -227 -140 -177 -123 182
4978 182 13 -3 193 -100 1 65 -155 96 172 130 242 -63 2 -213 68 -112 154 85 136 114 -1 -81 366
5001 366 -3 -462 189 -51 -47 -48 -107 -219 150 -156 80 -80 -270 159 -201 -156 126 282 -29 -126 -298 91
$$ packed form
4834a51J22l4Q8j60m5J89L05l47M7j12O0MM0J18m7k54L9k20O00m57M2K67j56J68
4858A06ok06oR2q1J66j65J27j22K99l09qJ13j22J32J5L23j46m62N0J18k2j56J39
4882a31K80j36rL2n2J26j68J30L0J7j15J87k34m4M29n02J56L0J1P1j34Pn2RJ21
4907E9K56o53L31j5Q7k20O8L00k18R0q2j33mN2Q0J0j55M8j02K84j41j00O3j8O5
4932d8j77J69L15m92L69m1l01r9J34j20J19O1J14j57J4K88K3Q8k44n3J39J0j48
4955c7k37N74l16J86j28q1M52l86l2Q2j29N0j92l0K55j81K53j62j68Q7l7N4L05
4978A82j69j6J96k93J01O4k20K51P6m2J12l05O5k15K81j80K66o9N1k2j15q0M47
5001C66l69m59O51k40Mjn9j12L69l06K36j60j90M29l60M5K82J56l11r7j72L89
$$ plain form
5023 91 9 -45 -191 50 -205 77 -149 -210 -34 -226 -84 179 -101 28 189 126 216 -73 -97 -11 71 -22 204
5046 204 72 -33 -64 -93 -68 32 -48 -32 152 48 21 190 200 -67 -86 252 -298 102 -187 -50 -37 5 212
5069 212 -26 -154 -172 145 169 51 -55 -23 26 115 115 -63 -74 -74 116 66 -24 -170 15 17 -266 -142 -81 116 189
5094 189 122 -12 3 18 -49 -37 -25 -209 198 -27 -256 -130 149 -137 175 -68 -247 -59 -226 -96 -64 141
5116 141 -172 130 5 126 65 124 44 148 282 -166 41 -164 -76 195 119 213 -120 -107 120 63 98 110 -345
5139 -345 -186 204 -63 -114 11 -32 142 16 17 -303 -145 -141 -65 186 -135 -256 -129 -129 -37 -46 -244 104 126 -91
5163 -91 -109 65 -13 -220 -70 -180 26 -170 -43 -11 -375 139 -68 58 -14 72 -177 -268 -307 -23 659 47 326
5186 326 -68 34 229 129 -277 -122 -147 -198 -131 120 -185 184 143 64 145 228 222 -74 239 -253 -38 34 -145
$$ packed form
5023I1q2n4j46K41k55K82k26o1J76j92J42K63k80J29J61o3R0k89k4Q6Q2r3K26
5046B04j32j05l1k9K5J00q0J6J84j04k7J69J0k67j9L38n50M00k89J37J3M2K07
5069B12k38j28j8L17K4j18j06L2M9Q9%j78j1%J90n0r0j46J85Kk83J24O1J97P3
5094A89o7j34J5J5o7J2J2j84M07k25k29J26K79k86L12k43j79J88j67J30L2K05
5116A41l13L02j25J21o1N9q0J04J34m48K07k05Q8K71p6R4l33J3K27n7L5J2m55
5139c45J59L90k67n1J25m3J74j26Jl20J58MP6K51l21j21J27%R2rj98L48K2k17
5163i1j8J74p8k07J50j10K06j96J27L2l64N14k07J26p2Q6k49r1l9K84O82o12K79
5186C26l94J02J95j00m06J55k5n1O7K51l05L69m1p9Q1Q3ok96L13m92K15P2j79
$$ plain form
5209 -145 250 -52 -3 105 -38 -79 -294 -44 -125 -90 79 161 60 -54 9 -65 -153 -76 -66 -89 227 -143 82 94
5233 94 324 107 -51 7 44 -106 -160 43 -198 194 75 -68 23 -321 -185 84 -82 53 143 -240 -60 102
5255 102 69 -226 -34 220 -51 36 107 89 3 424 185 33 -164 32 -67 7 -15 -64 -64 -112 108 -31 226 -202
5279 -202 -314 -40 37 -195 22 -35 275 128 -26 73 92 -83 -130 -284 39 186 -159 -142 -131 -103 145 -149 57
5302 57 -250 12 205 -149 -21 -47 112 -166 -66 -114 -50 52 141 93 209 -11 -110 -110 -113 94 77 88 144 -143 -42
5327 -42 -35 58 110 -29 197 -72 140 68 280 34 -133 47 81 205 172 -177 -28 254 -100 -48 124 57 55 89
5351 89 38 -105 277 -23 -225 125 -249 78 -13 116 -146 -162 -149 -68 -30 -43 110 174 132 55 -248 24 119 -117
5375 -117 -73 -127 -4 -245 5 -311 102 109 69 35 129 169 -83 -46 -20 52 296 42 154 -171 85 137 104 -81
$$ packed form
5209a45L95l02M9J08j43m1k15K50q1L5J69Q2j01j14O3p4q8P7J0k3L16l70K25J2
5233I4K30k17j58N8L7j50n4K03k41L92j19j43R1l44J36K69j66J35R0l83J80J62
5255A02l3k95J92K54k71Q7P1j8q6M21k39j52j97J96r9P4k2m9%m8K20j39K57m28
5279b02j12K74P7k32K17n7L10j47j54R9J9j75m7j54L23J47l45J7J1K8K48k94K06
5302E7l07K62J93l54J28k6J59k78J00m8O4J02Q9m8J16k20r9%lK07j7J1N6k87J01
5327d2PR3N2j39K26k69K12p2K12k46j67J80L4J24l3l49J49K82l54N2J72o7kL4
5351H9n1j43L82l00k02L50l74L27r1J29k62j6J3Q1L8j3J53O4m2p7l03K72R5k36
5375a17M4n4J23k41K50l16M13Pm0l4R4M0k52L7K6P2K44k54J12l25K56N2l3j85
$$ plain form
5399 -81 -16 -121 -16 11 -183 292 -43 139 131 -151 -79 -181 -281 -5 102 -99 -76 216 -13 -122 110 -112
5421 -112 -365 -102 278 245 -152 335 -134 -164 291 24 259 -152 83 18 105 100 -44 156 -78 28 -204 -42
5443 -42 -186 15 -73 24 -216 15 244 99 162 95 71 -177 -125 -210 -32 102 134 152 280 -60 -4 -21 -67 102
5467 102 137 35 -191 96 67 -103 -27 140 -553 -233 -393 94 -119 42 48 -335 -69 38 -115 -16 -4 34 -119
5490 -119 -339 260 -62 159 -63 -91 -98 32 -82 29 104 136 220 -173 452 95 -24 -23 -124 -239 -318 -68 -68 136
5514 136 64 -200 106 17 -277 -32 -39 -246 16 -24 195 391 -40 149 -41 -2 109 91 163 -154 -35 -46 37
5537 37 140 158 116 83 51 -126 -40 20 -165 227 -32 41 192 -136 201 -12 -107 -50 -111 62 -253 339 91 -192
5561 -192 5 248 -23 4 42 354 223 13 -64 28 -16 183 262 -280 96 83 33 95 87 116 173 -28 -56 223 51
$$ packed form
5399h1O5j05J05K7j94M75l35J82qk82P2j02j00K76J07k01K3K92k29j09K32k22
5421a12k53K63L80l3l97M87m69l0M55k67K35m11K35o5Q7nj44K00k34J06k32J62
5443d2j44K01q8R7k40K31K29j45O3o7k4k48N2q5J78J34L2J8J28l40N6j7m6J69
5467A02L5j02k26K87k9j70P6J67o93L20j60M87k13J61Ol83K66J07j53R9J2L8j53
5490a19k20N99l22K21k22k8pJ30j14J11P5L2Q4l93O25l57j19Jj01j15p9K50%K04
5514A36p2k64L06q9k94K45pk07K62m0K19J96m31J89j90L9J11j8P2l17J19j1Q3
5537C7J03J8m2l3l2j77Q6O0j85L92k59P3J51l28L37k13r5N7o1J73l15N92k48k83
5561a92J97K43k71K7L8L12j31k10p7R2m4J99P9n42L76j3n0O2qK9N7k01k8K79j72
$$ plain form
5586 51 -240 365 0 -188 -100 25 186 -181 -81 -1 -89 318 114 -249 132 221 -267 119 144 69 273 32
5608 32 -56 -32 -73 -85 93 232 -109 166 319 -327 239 -31 272 -74 227 -208 -8 -79 -48 218 179 -123 -122
5631 -122 23 -315 163 180 111 -135 50 -271 -13 248 -251 -65 -135 345 37 79 268 -84 293 338 83 11
5653 11 200 125 -302 242 -14 71 -21 6 192 -216 -80 -45 -87 -161 2 -16 -168 -56 -317 -31 -231 -337 -91
5676 -91 6 211 266 -97 209 19 52 74 -40 211 -255 207 7 -8 173 -36 28 246 -294 264 18 -330
5698 -330 4 106 -61 40 -119 -347 264 -385 69 -213 -113 -129 -108 -42 32 -129 -56 -169 -61 -145 135 -197
5720 -197 -46 -28 150 124 -97 342 42 76 28 -43 144 -109 -314 76 -157 67 -161 -220 -31 -319 370 -5
5742 -5 8 67 -27 -299 36 -81 172 -37 -38 -111 -68 423 131 -143 -70 194 87 84 -20 -112 -312 -84 -81 -196 293
$$ packed form
5586E1k91O05l65j88Q8J25J61l67J00Q0q8M07k04l63L81Q9m88L86K5p5K04k41
5608C2q8K4m1j2J78J39l41K75J53o46N66k70L03l46L01m35K00p1L1K66l9l02J
5631a22J45l38M78J7o9k46J85l21K58K61m99J86p0M80l08M2J89l52L77M5k55p2
5653A1J89p5m27N44k56Q5r2K7J86m08J36L5m2p4J63j8j52J12k61K86k00j06K46
5676i1R7K05N5l63L06j90L3K2j14K51m66M62k00j5J81k09O4K18n40N58k46l48
5698c30L34J02j67J01j59k28O11o49M54k82J00j6K1O6P4j61P3j13J08q4K80l32
5720a97J51J8J78k6k21M39l00L4m8p1J87k53k05L90k33K24k28n9J89k88O89l75
5742eJ3N9r4k72L35j17K53k09jp3M3M91k92k74P3K64j07lj04r2k00K28Lj15M89
$$ plain form
5767 293 -47 -79 183 72 66 -118 40 54 24 20 123 25 288 0 221 -162 103 409 -3 275 -226 347 -235
5790 -235 108 82 -79 0 402 -222 118 -75 98 -64 -159 288 -19 186 -48 -21 153 156 175 99 -71 46 -26
5813 -26 42 -127 -1 -294 -228 178 -251 -297 -177 44 35 117 -250 40 132 -233 292 27 -77 81 -61 -153 -181
5836 -181 15 -93 169 -398 58 3 362 -187 -57 67 -100 251 7 81 -40 19 -53 16 -39 -13 -71 -241 317
5859 317 -73 -28 -82 270 319 -139 76 -140 -13 -216 60 -201 -130 -7 -99 55 -189 -186 -137 300 130 59 -58
5882 -58 120 163 -173 -214 -232 99 -107 -182 -77 -117 97 -7 51 16 27 121 34 -64 48 51 118 127 55 237 98 -225
5908 -225 -47 0 109 -279 72 107 -25 -84 -20 -96 250 41 294 14 -74 -48 -45 0 140 -198 -124 -133 -45 -95 279
5933 279 -54 70 -20 72 62 -118 262 44 284 39 -106 139 123 72 -80 -51 43 208 -162 -67 -206 -74 204
$$ packed form
5767B93l40l2K62j11oj84J58J4l0mJ03r8K63k88K21l83K65L06m12K78n01N73n82
5790b35L43k6j61P9M02o24L40j93J73j62r5M47l07K05k34K7J74LJ9p6j70J17p2
5813b6O8j69J26k93O6M06m29m6J20K21rQ2l67K90R2l65N25k65j04J58j42r2k8
5836a81J96j08K62n67M56n5L59n49J30J24j67L51k44P4j21N9p2O9n5K6n8j70N58
5859C17l90M5n4L52M9m58K15k16J27k03K76k61P1J23r2J54k44LM9M37j70p1j17
5882e8J78M3l36m1j8L31k06p5J05m0K14j04N8l5J1R4q7r8J12LO7Rp2J82j39l23
5908b25J78M7J09l88L51L5j32n9O4p6L46k09K53k80q8K6LM5J40l38P4rQ8n0L74
5933B79l33J24r0R2j0j80L80k18K40k45j45K45j6n1j52K9R4J65l70R5j39J32K78
$$ plain form
5956 204 -20 53 6 279 -36 184 167 -250 145 168 -163 17 95 -1 305 -24 -193 180 -70 -1 157 206 -120
5979 -120 86 129 -324 -21 149 -227 211 32 0 22 -22 23 100 -179 -8 86 209 -221 -12 38 328 63 54
6002 54 119 100 152 142 -185 83 -165 -41 -212 -73 -151 -25 -146 225 -55 126 -282 254 1 -150 -49 -173
6024 -173 -64 90 130 106 -241 -101 368 85 8 -7 -109 -5 36 -171 -103 -179 42 -191 2 -58 180 -174 -31
6047 -31 -75 73 -92 -178 42 -331 85 58 -300 -48 13 -105 -32 155 272 -49 -155 -13 301 227 0 -225
6069 -225 -115 -34 252 68 -145 122 -139 -85 67 -212 140 -45 -30 105 26 273 -291 144 24 59 -55 -97
6091 -97 171 -158 82 -36 87 263 68 -177 -177 52 46 73 -196 32 -197 -34 -76 15 -36 162 -73 64 193
6114 193 -52 280 113 -29 -197 13 -140 -231 99 -40 190 29 -257 -101 213 -173 -60 57 -105 211
$$ packed form
5956B04k24P3m7K73l15K20j7m17L95K3l31J80P8r6L06l29j69L73k50O9J58M9l26
5979a20K06M3m53L03J70l76M38j79l2K2m4M5P7k79J71R4J23m30K09N0K90k65r
6002E4O5j9N2j0l27K68k48J24j71J39p8J26j21L71k80J81m08N36k53j51J01j24
6024a73J09J54M0k4l47J40M69k83p7j5j02J04M1k07O8p6K21k33J93o0K38l54J43
6047c1m4J48j65q6K20l73M16k7l58K52O1j18P3J87J17l21j06J42L14p4k27k25
6069b25J10Q1K86j84k13K67k61N4J52k79L52j85J5J35p9K47n64M35j20L5j14m2
6091i7K68l29K40j18J23J76j95k45%K29oK7k69K28k29J63m2R1n1J98k35J37J29
6114A93k45L32j67j42j68K10j53r1L30j39K30j61k86J56L14l86J13J17j62L16
$$ plain form
6134 211 -306 -33 -265 61 329 -129 -137 225 17 -271 -120 -48 94 -49 208 -172 101 -65 -368 119 -46
6155 -46 50 -208 142 165 152 84 16 -46 200 24 -85 -216 231 135 -112 101 -8 165 -146 -192 -139 33 -17 205
6179 205 -134 48 -27 -109 129 -303 52 41 206 307 71 354 90 -81 297 -26 -314 -19 3 -294 168
6200 168 103 -34 -44 -219 -219 239 -8 19 12 62 268 100 -99 -198 74 87 -10 313 85 60 37 -23 -72 -32 35 -1
6226 -1 185 206 325 -122 57 155 46 -315 124 73 -154 28 41 -11 -28 -180 0 15 41 -332 181 -114 -208 26
6250 26 72 318 -162 129 252 111 -229 -72 14 107 -145 114 -53 38 11 131 -91 -331 -104 90 -256 32
6272 32 75 110 179 71 40 -205 -300 65 -41 -179 66 345 -264 65 -185 -340 152 -51 -66 -303 149 75 94
6295 94 34 60 -214 189 -133 -335 337 110 299 286 -46 189 32 -146 61 87 -18 14 161 -88 144 -156
$$ packed form
6134B11n17K73k32L26K68m58qL62k08k88J51P2J42j43K57l80K73j66l03M87j65
6155d6R6k58L50K3j3o8o8o2K46j76j09j31M47r6k47K13j09J73l11m6N3J72n0K22
6179B05l39J82p5q2K38m32L55j1J65J01k36K83k64j71L78l23k88K95K2k97M62
6200A68o5j37j0j75%M58k47K7pN0K06j68j99r9K72J3r7L23k28k5k3o0m9M0O7l6
6226aJ86K1J19m47J79R8j09l61M39n1k27J82J3n2j7j52J80J5K6l73N13k95r4K34
6250B6M6K46m80K91J23j41l40J57Q6R3k52K59j67R1k7J20k22k40K27J94l46K88
6272C2M3L5O9j08l1k45r5L65j06j38K45K79o09L29k50j55M92k03j5k37M52p4J9
6295I4o0K6k74M03l22k02O72k27J89j3l32K35j57j78K07K6j05L2J47k49K32l00
$$ plain form
6317 -156 132 -190 110 -187 -214 -110 44 28 -134 39 -128 -143 185 -178 125 -43 -24 2 -139 98 -94 -26
6339 -26 -6 16 -332 130 328 79 -236 -38 -294 110 -145 135 241 -110 69 114 -83 -72 -38 -141 -90 -85 -212
6362 -212 217 240 -239 73 -71 -138 -56 58 -215 -148 234 -150 6 -131 79 122 20 295 23 -142 -68 -100
6384 -100 -129 -76 202 -14 53 -340 151 58 179 -46 75 50 -57 -345 -195 18 345 116 -38 -28 -79 46
6406 46 -5 -20 -133 -70 120 -309 -221 201 -171 4 205 50 96 246 -22 -278 -122 -59 -199 142 107 -196 271
6429 271 98 -37 -59 -149 134 -38 310 108 -108 201 189 184 -24 31 42 -77 -268 159 102 -119 -199 -34 219
6452 219 164 -375 -275 -182 -99 -315 -161 213 -118 -103 415 61 -8 -216 141 53 -334 118 73 103 88 -107 -128
6475 -128 109 159 109 174 -153 323 -38 -74 115 -130 -159 113 -101 -181 -69 123 79 -6 -84 -232 127 -134 -24
$$ packed form
6317a56K88l22L00k97k7J04J54j6j62J73j67j5L28l63L03j68J9K6j41K37j92O8
6339b6K0K2l48M62J98k49l15J98k56M04k55K80J06l51J79M5j97J1L4j03N1Nj27
6362b12M29K3m79L12j44o7Q2J14k73O7L82l84J56j37K10M3j02K75k72j65P4l2
6384a00k9N3K78k16O7l93M91r3J21k25J21k5j07k88J50K13L27k29j54J0n1J25
6406D6n1j5j13O3J90m29Q8M22l72J75K01j55M6J50k68k56J56O3j40L41l5l03M67
6429B71j73j35k2r0K83j72L48k02k16L09j2nk08N5J1j19j91M27n7k21q0J65K53
6452B19n5n39J00R3Q3k16J54L74l31J5N18l54o9k08L57q8l87M52m5L0j5j95k1
6475a28K37N0n0O5l27M76l61l6J89k45k9K72k14q0J12J92m4q5p8j48L59k61J10
$$ plain form
6498 -24 -123 140 56 181 123 -114 20 119 -58 -217 -82 -285 152 -262 177 47 -202 -54 43 103 110 -200 -238
6521 -238 47 5 42 -141 14 -148 -55 -68 -144 139 178 -154 12 137 43 10 -24 199 135 154 53 10 -61 -266
6545 -266 50 211 -4 275 -88 -111 146 12 138 -173 -77 -52 -189 -86 243 -37 -31 219 94 -47 171 -104
6567 -104 91 -8 -159 136 117 225 235 -212 -126 79 -152 72 12 192 177 -70 197 -222 55 152 -92 -8 -240
6590 -240 -131 -279 -121 39 -11 -59 -52 -52 121 366 -96 -94 86 -118 -268 -126 60 109 37 128 251 5 -144 -64
6614 -64 11 -32 192 -86 210 19 -198 -35 31 -45 -168 -208 -3 91 54 53 137 22 -108 -142 10 158 95 7 62
6639 62 31 39 -126 -208 45 -234 -113 31 -85 -75 -97 61 179 186 -73 -67 -220 89 -169 -130 -8 -158 -106 18
6663 18 324 241 -100 149 -145 132 24 325 91 109 -137 -234 128 9 185 163 9 44 -147 172 -289 282
$$ packed form
6498b4r9K63q4J25n8k37J34R9j77j59J35k03M37m14M39j30k49J48R7O0Pl10l8
6521b38K85m2L7j83J55j62R3j3p6K83L9l32J66J25r4l3l4K23o4J9j01m3p1k05
6545b66L16J61k15K79l63k3K57j34J26l11R6K5j37J03L29k80OK50j25j41K18k75
6567a04J95r9j51K95j9J08J0m47Q6K05k31K24o0J80j5k47K67m19K77R7k44Q4k32
6590b40J09j48J58J60n0m8P%J73K45m62KJ80k04j50J42J86M9p2R1J23k46j49Q0
6614f4P5m3K24k78K96j91k17J63O6p6j23m0K05R4l7jQ4j15j30l4J52J48o3q8N5
6639F2l1Qj65q2K53k79J21J44j16J0k2J58J18Pk59Oj53L09k58L9J22j50N2J24
6663A8L06q3l41K49k94K77j08L01k34J8k46r7L62j19J76k2j54L5j91L19m61N71
$$ plain form
6685 282 -12 66 -252 129 53 85 -105 -21 258 -52 -58 -41 -78 4 -69 80 65 50 198 171 -181 -164 -265 284 -39
6710 -39 122 262 -149 108 34 -42 -157 -52 -50 373 -26 39 -93 39 67 124 235 -292 24 6 -58 10 297 11
6734 11 81 83 215 250 82 36 -108 -105 8 -29 40 142 -109 -312 -62 -235 -238 30 272 181 -47 8 -295 28 -89
6759 -89 13 119 200 291 34 36 51 94 -281 -97 -64 -188 118 -213 34 45 -43 -206 -2 59 148 117 -261 -21
6783 -21 122 9 -330 44 -84 -107 120 22 94 20 -35 311 279 -3 -247 36 -46 -1 -9 -52 -23 110 124 -91 42
6808 42 152 -120 81 49 53 118 181 35 -32 -103 -194 -115 -120 -265 -280 -39 -178 -44 113 -39 127 46 48 73 33 94
6834 94 -140 6 -205 133 98 -74 -105 -133 -45 -37 60 -226 227 -33 -58 -154 -12 149 -213 142 -158 112 -134
6857 -134 78 -35 87 21 -151 122 66 422 94 -139 123 -144 -15 12 193 -125 -159 -227 147 -9 -35 35
$$ packed form
6685B82k94P8l18L81p6L2j90Q4K79l10oJ7l7Q2p3J49j5j5J48k7l52J7j01N49l23
6710c9J61J40m11K57p4p6j15J05KM23l99O5j32J32K8N7J11n27L16j8o4O8K87k86
6734A1P0KJ32L5j68m6j44LJ13l7O9J02k51k03K50j73lK68K42r1k28N5l03L23j17
6759h9J02J06Q1R1k57KJ5M3l75J84L3j24L06l31K47J1q8j63K04O1Q9l1l78K40
6783b1J43j13l39L74j28k3K27r8P2p4n5L46l2k82k44K83q2M5qm3K9J33J4k15J33
6808D2J10k72K01l2MO5O3j46o7p1r1P9nj45j5K41j39J34J57j52J66q1KK5m0O1
6834I4k34J46k11L38l5j72l1k8Q8QR7k86M53k60k5r6J42J61l62L55l00K70k46
6857a34K12j13J22o6j72K73n6L56l28k33K62k67J29K7J81l18l4o8L74j56k6P0
$$ plain form
6879 35 225 -122 -34 249 -93 131 -19 37 102 55 338 5 -220 -209 277 -51 -259 -82 -233 28 -143 12
6901 12 76 1 260 -85 -42 -135 -265 -59 -47 -105 -25 10 98 44 -45 202 9 -35 282 -34 151 151 -230 278 -253
6926 -253 195 -13 193 -205 -62 197 -234 48 204 -37 -164 236 68 23 98 380 -87 -97 -245 -81 202
6947 202 -187 -162 -1 3 62 -161 -98 15 212 93 36 -94 246 237 47 10 91 36 -159 -73 226 -38 102 -300
6971 -300 35 -123 -231 127 91 -78 -4 226 215 21 70 161 -154 104 -41 -42 -88 23 -27 203 -245 -507 62
6994 62 -31 30 88 -117 187 83 6 -220 -228 63 107 204 -94 -102 -106 -149 -56 -76 83 -172 -1 30 54 -57 -427 211
7020 211 -370 12 -149 7 211 115 -97 261 -36 -119 43 255 -217 22 -191 59 -246 -179 -10 -122 168
7041 168 19 -40 -131 90 162 -59 62 327 -194 -210 388 37 -16 400 241 -169 29 260 112 30 -226 -228 91
$$ packed form
6879C5J90l47Q8K83l42K24j50N6O5m7K83l33k25J1M86l28k08J77j51K61j71J55
6901A2O4p5K59l45M3r3j30K06J2n8Q0L5Q8n4q9K47j93m4L17l16J85%l81N08n31
6926b53M48k08K06l98J43K59m31K82J56k41j27M00j68m5P5K82m67j0j48J64K83
6947B02l89K5J61MN9k23O3J13J97j19n7j30L40rj90l7Q1n5j95Q6K99k64J40m02
6971c00L35j58j08L58l6j69P4K30j1j94M9R1l15K58j45jm6J11n0K30m48k62N69
6994F2r3O1N8k05L04j04p7k26qK91M4R7k98qmm3R3k0J59k55J71L1K4j11l70O38
7020B11n81L82j61J56K04r6k12L58k97q3J62K12m72K39k13K50l05O7J69j12K90
7041A68j49n9r1K21P2k21J21K65n21j6N98l51n3M16j59m10J98K31j48q2k56kL19
$$ plain form
7064 91 60 -5 -198 -182 -26 74 81 182 83 -10 -28 95 69 -203 110 20 -85 272 -238 64 46 -7 -168 -55
7088 -55 -178 179 285 -4 -145 -52 -170 -241 283 -49 141 -389 -171 -211 39 -49 29 243 37 156 131 -116
7110 -116 258 49 -8 -57 53 90 -174 -92 97 -76 -94 156 -45 -16 140 298 104 -20 -138 -119 -26 -54 -358
7133 -358 -80 109 -4 -25 224 391 162 -76 -149 -124 -110 -54 166 -149 -101 -60 49 5 63 187 104 -121 -172 -144
7157 -144 27 -107 3 -324 -8 -63 -93 -108 14 176 105 48 30 -48 147 39 -17 -253 130 16 -152 -82 60
7180 60 -115 18 59 118 90 196 20 -24 -54 -82 -157 156 -24 -23 40 142 429 -14 -298 164 391 67 -13 86
7204 86 146 -46 -70 -236 256 -123 -125 -273 -40 -175 71 125 110 177 -4 -208 -354 199 -131 35 130 -162 -9
7227 -9 50 -174 65 92 -220 29 21 234 10 304 106 125 -70 -33 -74 -81 -68 -219 -74 -54 89 -88 -204 110
$$ packed form
7064I1l1o5j93J6J56J00PJ01r9r3j8J23k6k72L13r0j05L57n10L02j8n3j61J13
7088e5j23L57J06k89j41R3j18p1N24l32J90n30K18m0K50q8P8K14k06J19k5k47
7110a16L74k09n7m9J10L7k64Q2J89j73j8K50k01K9J56J58j94j24j18J9R3k8l04
7133c58K78J89j13k1K49J67k29k38p3K5J4N6K20l15M8M1J09m4N8J24q3k25n1K8
7157a44J71j34J10l27L16n5l0j5J22J62p1n7j8p8J95j08n6k36L83j14j68P0J42
7180F0j75J33M1N9k8J06j76m4l0k8p5L13j80JO3J02K87m43k84M62K27l24q0R9
7204H6O0j92k4j66M92l79kj48K33j35K46N4j5O7j81k04j46N53l30J66R5k92J53
7227iN9k24K39K7l12K49qK13k24K94j98J9j95L7m1pJ3j51J45K0J43j77j16L14
$$ plain form
7251 110 -72 -127 74 -292 -96 12 -112 136 -144 -86 -16 -17 11 61 117 115 6 -231 -110 -23 -54 35 -1 -25 -15
7276 -15 -189 82 118 -104 335 176 101 1 -338 -60 -171 56 9 104 -268 98 -21 31 -11 3 56 -70 -162
7299 -162 107 182 -159 -8 -27 -111 40 -297 -51 144 -332 188 17 336 107 -25 141 -102 327 74 74 -180
7321 -180 -129 -66 58 -57 21 135 -123 -9 47 -141 107 67 -120 51 -55 -15 150 253 -155 151 200 32
7343 32 -52 29 11 2 235 42 65 44 183 -41 138 -33 130 -262 304 12 -81 -182 178 100 -196 -122 -39 -21
7367 -21 146 102 -15 -19 -394 286 -384 304 360 204 11 -169 199 -25 -80 134 -23 -42 -189 -68 -148 -142 -224 -85
7391 -85 410 88 -75 250 -72 -81 -187 24 111 134 -161 -107 -16 -203 -31 190 -33 -105 -197 62 -312 50 229
7414 229 -71 2 7 41 18 143 34 -49 -92 -130 252 -167 -146 79 131 -131 -219 -140 77 164 -243 -17 123 -51
$$ packed form
7251A10j82n5K01l66J96J08j24K48k80N8P0jK8N0N6kj09k37J21Q7l1Q9l6k4J0
7276a5j74K71L6k22M39j59p5j00l39K78j11K27m7R5l72L66j19N2m2J4N3j26r2
7299a62K69P5l41J51j9q4J51l37K46J95m76N20j71L19k29j32J66k43M29k53%k54
7321a80N1O3J24j15P8J14k58J14N6j88K48m0j87J71j06M0J65J03m08L06M9j68
7343C2q4Q1j8rK33j93K3k1J39k24J79j71J63l92N66k92r3j01L60p8k96P4Q3J8
7367b1J67m4j17ml75O80o70O88N6j56j93j80L68k24n5K14j57j9j47J21q0Oq2J39
7391h5M95l22j63L25l22rj06K11Q7K3k95N4R1j87J72K21k23p2r2K59l74L62J79
7414B29l00P3NL4k3J25j09q3m3l8L82m19K1K25N2k62q8P9K17Q7m07K26J40j74
$$ plain form
7438 -51 -250 5 -18 154 -75 -111 -96 51 -29 218 -122 62 124 -143 -159 -98 -7 145 121 -20 21 134 271 -46
7462 -46 151 -116 75 95 37 -135 65 -205 -45 -169 86 137 -146 -79 93 154 -168 -73 -72 172 -104 50 6
7485 6 254 -75 -9 -227 2 330 -52 -62 117 -307 1 331 0 50 -164 86 -9 113 -205 189 184 53 121
7508 121 -122 65 -3 11 -183 -290 -245 153 -46 -50 -21 233 124 34 152 -27 -228 227 216 78 247 100 159
7531 159 58 -153 -134 193 -37 48 -109 -330 -73 -296 141 256 -161 68 -71 100 263 11 214 -160 -14
7552 -14 -49 49 -4 60 -130 -113 -27 -270 -111 44 -299 169 -26 -114 -49 -153 92 147 -132 -59 65 184 -78 -128
7576 -128 204 91 -127 -46 218 47 153 -129 -140 -194 -91 -25 -247 -138 92 -85 -46 -91 29 159 47 -61
7598 -61 -21 -137 178 202 35 51 141 -115 243 26 102 -354 -53 74 59 20 -200 -77 194 -105 3 244 45
$$ packed form
7438e1j99K55k3J72k29l6J5J47q0K47l40J84O2k67j6O1R1J52k4j41M1J13J37l17
7462d6J97k67J91K0n8j72K00k70J60j24K55N1k83O7J72O1l22R5JK44k76J54m4
7485FK48l29O6k18K29L28l82j0J79m24L08L30l31N0k14K50r5J22l18L94nj31O8
7508A21k43J87o8J4j94j07M5L98j99mK9K54j09r0J18j79k01M55j1j38J69j47N9
7531A59j01k11J9L27k30Q5j57k21K57k23M37J15m17K29j39J71J63k52K03l74J46
7552a4l5R8n3O4j90J7Q6k43J59J55l43M68j95q8O5j04K45N5k79P3J24J19k62n0
7576a28L32j13k18Q1K64j71J06k82j1n4J03O6k22J09K30j77L9m5J20J30j12j08
7598f1M0j16L15K4j67J6R0k56L58k17P6m56L01J27j5l9k20J23K71k99J08K41j99
$$ plain form
7621 45 140 138 35 -58 -147 -78 -117 -43 -102 280 -102 -62 -65 -19 178 -20 -194 211 1 -124 92 -236 192 -169 17
7646 17 -284 85 -157 -192 68 139 -70 -2 -164 66 22 -336 -217 44 223 -298 227 61 167 -130 -333 -10
7668 -10 219 152 -220 -54 121 -205 -22 -68 58 -8 -23 -370 -67 -37 -2 362 256 61 -49 -82 360 -16 36
7691 36 -51 -140 56 -265 -74 -13 1 -30 -182 -30 -10 -226 -103 50 -72 -26 -1 41 -69 -9 -86 126 -113 -312
7715 -312 23 -112 166 203 -111 83 -78 109 176 61 -173 166 -93 194 -235 -99 -2 7 -376 -22 145 281
7737 281 -41 266 185 -68 263 -327 330 -267 -177 -98 -41 -115 273 -63 16 217 -89 8 -138 173 250 337 -138
7760 -138 160 -172 299 -115 100 163 27 -121 29 -3 98 -14 -114 140 203 61 -1 5 -43 301 -165 65
7782 65 -181 67 -147 144 -184 -173 62 -99 173 -249 -45 285 -214 -113 -52 174 326 -70 -121 -173 -141 -178
$$ packed form
7621D5R5kj03r3q9O9l9P4n9L82l82M0lM6J97j98j74M05k10j25K16l28M28l61J86
7646A7l01L69k42l5K60P1k09O8j62K30m4l58J19K61J79n21N25j66J06k97k03L23
7668a0K29o7l72J66J75l26J83m6J26o6j5l47L03L0L5L64j06j95j10l3M42l76N2
7691C6q7q9J96l21J91O1J4l1j52J52K0k16J23J53j22M6K5M2j10O0p7K12k39j99
7715c12L35j35K78L7l14J94j61J87O7j15k34L39k59K87m29J36R7Rl83L54J67J36
7737B81l22L07q1k53L31n90O57n97R0P9N7p4L88l36P9K01l06R7j46L11P7Q7m75
7760a38K98l32M71m14K15O3j36j48J50l2J01j12j00K54O3j42o2Om8L44m66K30
7782F5k46K48k14K91l28J1K35j61K72m22K04L30m99J01O1K26J52l96n1n2L2l7
$$ plain form
7804 -178 -110 27 54 145 -86 -191 32 -129 -135 134 -56 -121 -27 -89 83 262 120 130 -139 166 34 -87 4
7827 4 -64 -19 12 84 -239 -152 -112 168 10 -138 -194 -92 214 142 60 125 80 -56 90 -107 4 205 180 145 107
7852 107 228 -21 367 137 -163 -7 67 -9 21 106 244 -65 -83 -196 54 45 -77 25 142 -154 -101 -210 -18
7875 -18 -113 25 -106 -295 -54 10 -232 -109 -23 173 108 29 -85 308 -10 -230 223 111 -9 -172 -51 -20
7897 -20 -146 -310 198 -94 110 -29 313 -39 -121 144 -9 107 17 146 -84 137 -47 -32 208 -231 -156 67
7919 67 -135 89 -63 -8 -125 88 -104 -32 187 261 72 -237 68 14 11 134 -11 294 276 -63 98 -112 -91
7942 -91 -138 -179 -25 10 76 85 -12 -401 -121 -162 83 167 63 126 33 -138 248 55 -87 112 -155 -213 31 -54 -60
7967 -60 -208 -159 -94 55 43 -53 -307 100 -10 -8 -203 106 114 60 153 -82 189 75 29 120 -98 299 -36 -117 -82
$$ packed form
7804a78O8J37K7R1k31j05K23j61oK69j90o5R4o2J72J79j42J0k69L05j32j21R1
7827Do8M5L1P2l23Q7M0K80j58j48n6J02L06p2q2O5m5j36J46j97J11K01k5l5l8
7852A07J21k49L88k30l00J56P4p6L0Q5J38l09j8j13K50rj22J02J17k96N3j09J92
7875a8r5J38j31j89K41O4k42J23Q6J96o5p9j14L93l18k20M53j12j20j63J21L1
7897b0j26j64N08k92K04j39L42l52q2K65j53J16r0J29k30K21j84J5K40m39P5K23
7919F7k02K24j52N5j17K13j92P2K19P4j89l09L05n4lJ23j45L05j8l39J61k10K1
7942i1m7m1J54L5O6Rr7l89K80m1K45Q4j04O3r3j71L86j93j42J99k67n8K44q5o
7967f0j48M9O5J49j2r6k54M07j10Kj95L09Qn4R3k35K71j14m6R1k18L97l35q1L5
$$ plain form
7992 -82 306 -260 -118 -21 220 -177 38 41 -1 -261 -72 234 1 81 81 141 6 98 -189 3 119 206 -11 -74
8016 -74 -76 -54 164 -127 -97 -2 -192 -27 -2 162 -64 41 302 294 16 -80 116 100 -66 4 -51 -8 234 57 268
8041 268 64 36 122 -11 149 101 -345 -65 -38 118 -172 58 -68 -5 -73 -45 -82 20 -184 65 -72 -66 -19 -39
8065 -39 154 -160 -77 -23 28 -174 -98 23 140 -32 -33 49 198 -21 64 154 166 70 -70 -85 -23 94 272 74 41
8090 41 9 -311 -69 -40 61 -65 -3 67 111 -139 -41 6 34 66 -169 120 140 195 -237 -183 -338 -249 -108 176 -110
8115 -110 -107 219 -85 21 -38 2 273 57 -23 -4 -67 209 91 101 -34 -72 393 71 -66 -15 -42 -27 251 79
8139 79 -121 149 -118 -47 30 206 -122 -249 -297 62 240 -81 13 -237 37 -106 180 304 133 45 168 -155
8161 -155 307 -322 -26 361 94 116 -87 393 -262 63 164 -89 169 32 -122 -210 -215 12 -51 -106 -330 -120
$$ packed form
7992h2L88n66J42R7K41l97K15Lm2k60J89L06k33Q0%O0j35R2k87J92J16Q7k17o3
8016g4kK2K18k91L0R5j90J65K5J64k26J05K61qk78r6J96j6j66P0n5M3K42j77K11
8041B68k04k8Q6j33J60m8m46K80K7J56k90K30j26O3o8K8l7J02k04K49j37OM7k0
8065c9J93l14Q3N4N1k02P6J21J17j72jQ2J49k19Q5R0J2r6j40j5O2J17J78j98l3
8090D1l2l20K42K9J01j26O2P0M4k50R8M7K8L2k35K89K0N5m32N4j55Q9J41K84k86
8115a10LL26l04J06n9M0K71k16q0J9o3K76j18J0j35l8M65l22j37N1k7J5K78j72
8139G9k00K70k67P1P7J76l28j27m8L59J78l21R4k50K74j43K86J24j71q8J23l23
8161a55M62o29K96L87k67K2k03M80o55L25J01k53K58j37j54q8nK27o3n5k24K10
$$ plain form
8183 -120 -105 115 -31 138 -183 -23 109 140
$$ packed form
8183a20J5K20j46J69l21J60J32L1
8191A40
$$ Imaginary data points
##PAGE= N=2
##DATA TABLE= (X++(I..I)), XYDATA
$$ plain form
0 0 0 0 0 0 0 0 0 0 0 0 0 0 -8 8 -8 8 -8 14 -16 16 -18 24 -24 32 -34 40 -47 50 -58 66 -74 82 -91 104 -114
35 -114 129 -144 158 -177 194 -215 238 -264 291 -322 359 -400 446 -499 560 -634 722 -835 974
54 974 -1162 1423 -1816 2465 -3740 7163 -32469 -99871 4464 69631 25741 -19139 -147
67 -147 -20681 -72342 -62176 -6106 -20 -7999 20910 28787 -22994 -45175 -12508 -13046 -59381 -55815
81 -55815 -7555 -417 -18247 11670 40617 -4178 -65034 -61869 -32885 -28894 -24166 -7762 -11739
94 -11739 -18253 3774 10752 -31678 -59979 -35833 -18174 -37214 -31687 13519 27744 -6141 -29783
107 -29783 -32167 -44570 -49839 -22351 -2124 -16198 -21182 1727 8203 -11467 -18238 -19514 -47611
120 -47611 -67495 -34160 10299 10561 -6185 1724 3441 -25391 -44464 -29853 -15772 -19712 -14703
$$ packed form
0@%%%%%%%%%%%%qJ6j6J6j6K2l0L2l4M2m8N6o6P4q7R7j08J24j40J56j73J95k18
35a14K43k73L02l35L71m09M53n02N55o13O81p59Q46r45J059j194J356j557J809
54I74k136K585l239M281o205J0903l9632o7402J04335O5167m3890m4880J8992
67a47k0534n1661J0166N6070O086p979K8909P877n1781k2181L2667n38m6335L566
81e5815M8260P138j7830K9917K8947m4795o0856L165K8984L991M728J6404l977
94a1739o514K2027O978m2430k8301K4146J7659j9040N527M5206J4225l3885k3642
107b9783k384j2403n269K7488K0227j4074m984K2909O476j9670o771j276k8097
120d7611j9884L3335M4459K62j6746P909J717k8832j9073J4611J4081l940N009
$$ plain form
133 -14703 -63 -376 -4971 4064 4345 -25098 -51126 -41783 -15559 -459 8212 14719 8498 -6696
147 -6696 -17447 -20793 -24515 -27162 -23185 -14820 -2641 11227 19980 14820 118 -16898 -30416 -35017
161 -35017 -24184 -3923 11552 15510 9782 761 -5210 -6798 -11636 -21978 -27280 -17221 852
174 852 14004 21209 20197 6502 -12958 -24832 -26544 -21217 -8039 8485 14966 11975 12640 14643
188 14643 4415 -12438 -20267 -20515 -19919 -9315 14089 28307 22379 9916 830 -10677 -20513 -15229
202 -15229 -3942 -2208 39 15012 24989 16843 6982 3574 -8476 -25852 -21879 1113 15222
215 15222 17129 23220 24331 8545 -6092 -5565 -5249 -12925 -10813 6137 15994 16778 23560 28063 11663
230 11663 -11056 -14941 -6811 -4588 2302 18797 25977 17810 14018 15952 7648 -6795 -8368 -1982
$$ packed form
133a4703J4640l13m595R035K81k9443k6028R343K6224J5100Q671O507o221j5194
147f696j0751l346l722k647L977Q365J2179J3868Q753n160j4702j7016j3518m601
161c5017J0833K0261J5475L958n728r021n971j588m838j0342n302J0059J8073
174H52J3152P205j012j3695j9460j1874j712N327J3178J6524O481k991O65K003
188A4643j0228j6853p829k48N96J0604K3404J4218n928j2463r086j1507r836N284
202a5229J1287J734K247J4973R977q146r861l408j2050j7376L973K2992J4109
215A5222J907O091J111j5786j4637N27L16p676K112J6950R857P84O782M503j6400
230A1663k2719l885Q130K223O890J6495P180q167l792J934q304j4443j573O386
$$ plain form
244 -1982 54 6433 23091 32087 22302 10831 6268 -1048 -10595 -5055 9158 13548 12342 19531
258 19531 26002 19061 9667 5739 -738 -10148 -5567 11855 20998 19698 20982 21209 10515 -437
272 -437 287 2873 207 1899 12241 19184 17909 17797 18693 9361 -4174 -6181 345 4572 9308 17223
288 17223 19308 13037 8004 8967 5867 -2097 -3682 1239 4926 8341 15277 18485 12475 3922 -177
303 -177 -2226 -3996 -1022 6068 9186 7355 8068 9932 7367 2260 -1341 -3816 -5885 -2917 5089 10454
319 10454 9239 5885 2872 -1260 -3771 -2992 -1247 -759 -802 1898 4391 4776 3249 792 -3172 -7299
335 -7299 -7371 -3174 1557 3512 4069 1776 -1849 -4261 -3375 -2909 -3985 -5156 -3844 -1498 659 2617
351 2617 1696 -2198 -6553 -8145 -6447 -3261 -368 593 -134 -2482 -4035 -3915 -2912 -3764 -5061 -5640 -4725
$$ packed form
244a982K036O379J6658Q996r785j1471m563p316r547N540J4213M390j206P189
258A9531O471o941r394l928o477r410M581J7422R143j300J284K27j0694j0952
272d37P24K586k666J692J0342O943j275j12Q96r332j3535k007O526M227M736P915
288A7223K085o271n033R63l100p964j585M921L687L415O936L208o010q553m099
303a77k049j770K974P090L118j831P13J864k565n107l601k475k069K968Q006N365
319A0454j215l354l013m132k511P79J745M88m3K700K493L85j527k457l964m127
335g299p2M197M731J955N57k293l625k412Q86M66j076j171J312K346K157J958
351B617r21l894m355j592J698L186K893R61p27k348j553J20J003q52j297n79R15
$$ plain form
368 -4725 -2639 529 1837 -358 -4802 -8094 -8585 -6560 -2904 34 262 -1592 -3199 -3453 -3168 -3126 -4755
385 -4755 -6261 -6577 -4896 -1279 1751 1626 -1474 -5377 -8270 -8002 -5527 -2162 -278 -678 -1831 -2278
401 -2278 -2099 -2415 -4240 -6456 -8193 -7761 -4107 539 3463 2342 -1169 -5452 -8228 -8113 -5948 -3423
417 -3423 -2533 -2995 -2232 -630 374 -508 -3279 -6959 -9844 -9245 -4778 237 2956 2104 -1038 -4945 -7069
434 -7069 -6626 -5333 -4970 -4763 -3693 -1953 476 2371 1728 -2199 -7979 -10632 -9673 -5446 -826 2305
450 2305 1890 -138 -2265 -3102 -3712 -5075 -6391 -7154 -6067 -2970 1862 4587 3312 -851 -5622 -8356
466 -8356 -8255 -4531 -783 717 417 677 824 113 -392 -2024 -5285 -8132 -6770 -1660 3015 5685 5348
483 5348 1999 -2840 -5116 -4404 -2845 -1920 -711 296 752 2933 5152 4520 733 -3521 -5389 -4806
$$ packed form
368d725K086L168J308k195m444l292m91K025L656K938K28j854j607k54K85M2j629
385d755j506l16J681L617L030j25l100l903k893K68K475L365J884m00j153m47
401b278J79l16j825k216j737M32L654M646K924j121l511m283k776J15K165K525
417c423Q90m62P63J602J004q82k771l680k885N99M467N015K719q52l142l907k124
434g069M43J293L63K07J070J740K429J895o43l927n780k653R59M227M620L131
450B305m15k028k127q37o10j363j316p63J087L097M832K725j275m163m771k734
466h356J01L724L748J500l00K60J47p11n05j632l261k847J362N110M675K670l37
483E348l349m839k276P12J559R25J209J007M56K181K219o32l787m254j868N83
$$ plain form
499 -4806 -1668 2906 6309 6023 2717 815 -146 -454 -517 -212 -796 -819 1583 5605 7765 6545 3321
516 3321 -510 -3615 -3736 -156 3613 4926 5269 4967 3840 3167 3710 2853 558 -1863 -761 2068 4989
533 4989 7149 8288 5268 682 -984 -86 1323 2311 3951 3902 3083 3481 5639 5509 2892 462 -712
550 -712 -1115 696 4678 7259 5781 3695 2521 1214 633 1588 2342 1276 586 1798 3762 4700 5045
567 5045 4237 1323 -2230 -1698 1349 3391 3266 3577 2665 873 923 2612 2840 605 -508 355 458 1503
585 1503 4160 4894 2420 -865 -942 -719 -353 1449 2802 1479 -598 287 1992 2079 1299 958 -377 -2042
603 -2042 -711 2346 2216 1101 1007 640 -766 -1114 1126 2341 258 -732 450 -199 -614 1537 2363
620 2363 -144 -2300 -816 1103 481 912 1820 329 -2310 -1315 2036 1723 -279 356 587 -1105 -1645
$$ packed form
499d806L138M574L403k86l306j902r61l08o3L05n84k3K402M022K160j220l224
516C321l831l105j21L580L769J313L43l02j127o73N43q57k295k421J102K829K921
533D989K160J139l020m586j666Q98J409R88J640m9q19L98K158j30k617k430j174
550g12m03J811L982K581j478k086j174j307n81R55P54j066o90J212J964R38L45
567E045q08k914l553N32L047K042j25L11r12j792N0J689K28k235j113Q63J03J045
585A503K657P34k474l285p7K23L66J802J353j323k077Q85J705Q7p80l41j335j665
603b042J331L057j30j115r4l67j406l48K240J215k083r90J182o49m15K151Q26
620B363k507k156J484J919o22M31R08j491k639R95L351l13k002O35K31j692n40
$$ plain form
637 -1645 1275 1891 -352 -880 286 -142 -802 954 2529 -74 -2937 -2091 290 -124 188 1695 655
654 655 -1499 -967 1381 515 -1312 -764 -432 -1832 -1241 1254 1873 -169 -821 -709 -1781 -2973 -360
671 -360 1464 -569 -1771 -119 364 -703 -562 90 -2128 -4305 -1756 762 116 -636 405 274 -2619
688 -2619 -3303 -902 -814 -2486 -1981 -36 -722 -1528 389 999 -1977 -3962 -2956 -1843 -2176 -830 894
705 894 -131 -2059 -1471 -436 -1600 -3305 -2453 -1532 -2596 -1389 596 675 -853 -1811 -1722 -3088 -3454 -1408
723 -1408 -562 -1178 -1365 -81 -235 -1054 -1094 -1226 -2774 -3395 -2014 -487 -186 -23 835 -372 -1982 -1803
741 -1803 -920 -1523 -2074 -1118 -158 -473 -260 1147 705 -1609 -2402 -1786 -1477 -1038 96 1258 231 17
759 17 216 287 -737 -1475 -1312 -1219 -1011 183 1215 1313 488 148 -435 -1347 -925 -216 193 277 892 1207 853
$$ packed form
637a645K920O16k243n28J166m28o60J756J575k603k863Q46K381m14L12J507j040
654F55k154N32K348q66j827N48L32j400N91K495O19k042o52J12j072j192K613
671c60J824k033j202J652M83j067J41O52k218k177K549K518o46p52J041j31k893
688b619o84K401Q8j672N05J945o86q06J917O10k976j985J006J113l33J346J724
705H94j025j928N88J035j164j705Q52R21j064J207J985P9j528r58Q9j366l66K046
723a408Q46o16j87J284j54q19m0j32j548o21J381J527L01J63Q58j207j610J79
741a803Q83o03n51R56R60l15K13J407m42k314p93O16L09M39J134J162j027k14
759A7J99P1j024p38J63R3K08J194J032R8q25l40n83r12M22P09M09Q4O15L15l54
$$ plain form
780 853 953 994 -262 -1444 -567 -243 190 882 1497 1963 603 26 475 160 -321 -370 463 331 572 2058
800 2058 1980 932 140 45 -130 -535 570 1290 1207 609 903 1540 482 138 430 -225 -766 -163 1232 962
820 962 1074 981 754 -330 -565 194 610 -226 -253 559 728 656 1370 1544 -122 -856 -377 230 -10 449 1408
841 1408 943 -144 261 757 358 -268 0 154 -429 -342 1430 1613 441 -153 189 -305 -606 484 1270
860 1270 394 -124 588 1140 657 765 803 -112 -552 108 787 368 793 1037 712 -129 105 669 804 217
880 217 252 422 -65 273 860 1294 141 -156 68 160 28 460 917 581 58 470 1034 659 619 202 413
901 413 -446 -335 488 807 658 229 569 -9 129 805 535 163 -464 26 326 173 752 875 200 -397
921 -397 -249 277 280 217 531 235 -228 -102 606 593 273 -111 -155 -503 -300 473 624 167 77 -104 -22 -151 20
$$ packed form
780H53J00M1j256j182Q77L24M33O92O15M66j360n77M49l15m81m9Q33j32K41J486
800B058p8j048p92r5j75m05J105P20q3n98K94O37j058l44K92o55n41O03J395k70
820I62J12r3k27j084k35P59M16q36k7Q12J69p2P14J74j666p34M79O07k40M59R59
841A408m65j087M05M96l99o26K68J54n83Q7J772J83j172n94L42m94l01J090P86
860A270q76n18P12N52m83J08L8r15m40O60O79m19M25K44l25q41K34N64J35n87
880B17L5J70m87L38N87M34j153k97K24R2j32M32M57l36n23M12N64l75m0m17K11
901D13q59J11Q23L19j49m29L40n78J38O76k70l72o27M90L00j53N79J23o75n97
921c97J48N26Lo3L14k96m63J26P08j3l20l84m4l48K03P73J51m57r0j81Q2j29J71
$$ plain form
944 20 -83 -375 -707 -588 223 478 167 104 -551 -836 -904 -184 120 -306 -298 -361 -700 -155 -36 -270 -519 -934
966 -934 -1116 -849 -52 235 272 42 -697 -1104 -928 -704 -396 -516 -702 -838 -285 -156 272 49 -465 -1050 -1075
987 -1075 -640 -865 -114 279 11 -369 -394 -398 -186 -513 -860 -885 -619 -438 -139 277 271 -593 -764 -731 -364 -554
1009 -554 -344 15 -330 -419 -464 385 7 -498 -512 -754 -426 -227 322 301 152 -227 -255 -281 -227 -1 -68 -403 -420
1032 -420 -182 347 353 405 199 -318 -627 -510 -316 174 288 68 -41 114 -10 134 -94 -510 -460 -22 -221
1053 -221 305 465 161 66 -125 -244 -239 -150 380 505 235 25 94 66 509 356 -317 -88 -493 -86 323 555
1075 555 568 115 -186 -296 -71 248 -164 -85 -108 -10 251 291 517 299 -266 -47 -250 -321 118 392 520 170
1097 170 167 -131 217 26 -264 -119 -210 -121 281 414 246 97 -95 -193 149 -84 -109 335 362 -206 -9 500
$$ packed form
944B0j03k92l32J19Q11K55l11o3o55k85o8P20L04m26Qo3l39N45J19k34k49m15
966i34j82K67P97K87L7k30p39m07J76K24L08j20j86j36N53J29M28k23n14n85k5
987a075M35k25P51L93k68l80k5mK12l27l47k5K66J81K99M16oq64j71L3L67j90
1009e54K10L59l45q9m5Q49l78n05j4k42L28J99N49k1j49l79k8k6N4K26o7l35j7
1032d20K38N29ON2k06n17l09J17J94M90J14k20j09J55j24J44k28m16N0M38j99
1053b21N26J60l04r5j91j19NQ9N30J25k70k10O9k8M43j53o73K29m05M07M09K32
1075E55J3m53l01j10K25L19m12P9k3R8K61M0K26k18n65K19k03p1M39K74J28l50
1097A70lk98L48j91k90J45r1Q9M02J33j68j49j92r8L42k33k5M44K7n68J97N09
$$ plain form
1119 500 503 353 69 25 -328 -252 40 201 333 56 176 272 42 225 44 59 35 257 -30 591 649 257 78
1142 78 159 62 -25 98 414 147 125 189 371 333 306 179 47 -308 -157 -69 582 337 401 107 144 273 225 279
1166 279 183 164 132 334 -25 519 433 251 26 23 -143 157 -19 231 170 217 30 200 254 1 2 -284 -129 -39
1190 -39 293 48 -72 73 40 -71 -65 72 21 -32 -94 -33 -233 147 106 -9 -169 -17 -183 97 -30 -46 149
1213 149 180 -7 187 -61 -173 -166 -359 -24 -149 0 -302 119 52 -87 -92 22 -190 -231 39 -204 -318 27
1235 27 4 81 80 -173 -359 -140 -138 7 39 99 -50 -137 -149 43 -223 -206 -303 -405 -233 -379 -213 151 77 -115 -389
1260 -389 -322 -391 -161 -140 7 -21 -131 -37 10 -43 -315 -316 -326 -17 -84 169 -39 -237 -84 -125 -1 -185 181 84
1284 84 -297 53 -70 118 278 -13 25 -300 -55 165 61 -1 40 -54 38 -24 -168 150 -100 -181 -254 78 45
$$ packed form
1119E00Lj50k84m4l53P6K92J61J32k77J20R6k30J83j81J5k4K22k87O21N8l92j79
1142G8Q1r7q7J23L16k67k2O4J82l8k7j27j32l55J51Q8O51k45O4k94L7J29m8N4
1166B79r6j9l2K02l59N44q6j82k25lj66L00j76K50o1M7j87J70N4k53Jk86J55R0
1190c9L32k45j20J45l3j11OJ37n1n3o2O1k00L80m1j15j60J52j66K80j27j6J95
1213A49L1j87J94k48j12Pj93L35j25J49l02M21o7j39nJ14k12m1K70k43j14L45
1235B7k3P7jk53j86K19KJ45L2O0j49q7j2J92k66J7r7j02J72j46J66L64p4j92k74
1260c89O7o9K30K1J47k8j10R4M7n3k72jj0L09o7K53k08j98J53m1J24j84L66r7
1284H4l81L50j23J88J60k91L8l25K45K20j04o2M1r4R2o2j44L18k50q1p3L32l3
$$ plain form
1307 45 77 38 132 -385 33 -168 -360 24 224 -229 -170 197 -47 403 48 26 148 34 -310 23 276 -28
1329 -28 74 -30 42 -96 -135 -41 117 -83 85 -37 160 -48 17 -63 -113 -104 35 11 22 80 -422 -211 -269 -18
1353 -18 124 47 104 -95 -20 -325 44 77 -106 -87 -1 -60 -148 -80 263 13 -138 -147 41 544 -23 70 -149 -314
1377 -314 -255 113 179 118 -19 128 -186 242 2 315 -53 -339 -31 -39 240 -174 126 126 -59 72 4 66 70 68
1401 68 -38 -156 -42 188 173 85 -95 -156 163 176 171 271 277 370 208 172 -4 200 122 -2 -226 318 -45 -18
1425 -18 357 129 282 -212 122 18 -19 -219 129 26 -149 26 420 -15 190 -119 64 11 -288 13 82
1446 82 101 71 90 39 -129 -113 110 -88 138 -282 -23 180 273 -79 63 106 1 -39 150 126 77 117 71 -383
1470 -383 -275 -67 193 -137 -132 -58 -39 26 15 -62 -28 -76 -147 -84 -104 -228 73 -4 -103 -14 321 -85 -97 -272 41
$$ packed form
1307D5L2l9R4n17M18k01j92L84K00m53N9L67k44M50l55k2J22j14l44L33K53l04
1329b8J02j04P2j38l9R4J58k00J68j22J97k08O5q0n0RJ39k4J1N8n02K11n8K51
1353a8J42p7N7j99P5l05L69L3j83J9Q6n9q8O8L43k50j51rJ88N03n67R3k19j65
1377c14N9L68O6o1j37J47l14M28k40L13l68k86L08qK79m14L00%j85J31o8O2Mk
1401F8j06j18J14K30j5q8j80o1L19J3nJ00OR3j62l6j76K04p8j24k24N44l63K7
1425a8L75k28J53m94L34j04l7k00L48j03j75J75L94m35K05l09J83n3k99L01O9
1446H2J9l0J9n1j68J6K23j98K26m20K59K03R3l52J42M3j05m0J89k4m9M0m6m54
1470c83J08K08K60l30NP4J9O5j1p7L4m8p1O3k0j24L01p7r9Q9L35m06j2j75L13
$$ plain form
1495 41 -221 163 78 149 -171 199 -101 117 -183 -235 -86 -146 -53 -67 8 -118 79 38 -316 -55 219 50 7
1518 7 -94 -286 -33 92 -9 288 -126 -56 185 26 -55 196 89 246 -97 106 100 -174 83 -83 -201 4
1540 4 162 156 -144 44 200 56 130 -105 -254 -24 -185 127 56 44 32 15 -160 -286 -141 -63 150 24 85 32
1564 32 148 -187 42 -57 -112 -47 17 167 87 -23 28 -160 33 40 -206 28 -35 234 44 -76 -148 -33 48 31
1588 31 -108 -20 57 -215 -237 -184 259 -128 -38 -15 224 -106 138 69 -309 -91 -138 -219 23 -88 -48 139 -104 -243
1612 -243 128 -17 -142 -3 -56 145 58 21 -26 -173 233 -241 42 -347 -139 -171 100 -113 42 -200 -131 119
1634 119 200 -116 2 219 -115 127 -129 -93 99 -36 171 -72 227 125 112 408 54 96 93 43 216 -25
1656 -25 -446 20 -76 349 156 -222 164 -33 13 -2 -122 -85 -59 -74 328 104 -321 13 -86 -198 137 147 186
$$ packed form
1495D1k62L84q5P1l20L70l00K18l00n2J49o0R3j4P5j26J97m1l54K61K74j69m3
1518Gj01j92K53J25j01K97m14P0K41j59q1K51j07J57l43K03ok74K57j66j18K05
1540DJ58ol00J88J56j44P4k35j49K30j61L12p1j2j2j7j75j26J45P8K13j26O1n3
1564C2J16l35K29r9n5O5O4J50q0j10N1j88J93Pk46K34o3K69j90j20p2J15Q1j7
1588C1j39Q8P7k72k2N3M43l87R0K3K39l30K44o9l78K18m7q1K42j11M0J87k43j39
1612b43L71j45j25J39n3K01q7l7m7j47M06m74K83l89K08l2K71k13J55k42O9K50
1634A19Q1l16J18K17l34K42k56L6J92j35K07k43K99j02j3K96l54M2ln0J73k41
1656b5m21M66r6M25j93l78L86j97M6j5j20L7K6j5M02k24m25L34r9j12L35J0L9
$$ plain form
1679 186 59 324 42 -49 86 -6 156 -239 78 35 35 -112 78 -84 -184 9 -182 -53 -201 64 186 58
1701 58 32 -192 232 261 -147 -32 32 -226 85 -316 -4 164 -105 -53 -141 -262 -141 -152 258 17 -88 45
1723 45 156 142 115 -53 0 -257 86 -49 -78 -177 -53 -22 -54 -61 333 -108 33 -24 -216 232 88 -26 -251 -11
1747 -11 -199 -26 143 -392 115 107 -6 337 -91 125 226 -36 45 -26 4 -105 -66 -200 59 -258 45 -59
1769 -59 455 7 -8 262 67 143 -91 313 169 9 -141 60 -206 181 47 36 -102 78 0 82 -159 -142
1791 -142 182 -360 191 55 -195 314 84 -183 134 -12 258 -151 70 172 -176 197 21 -322 11 57
1811 57 -149 -167 132 -169 -48 56 277 90 -93 304 225 -262 36 -24 -162 415 106 17 -65 -242 -160 -175 32
1834 32 -154 -232 -237 -126 -69 -132 -63 138 -121 -115 -3 174 -50 1 262 77 212 -210 -129 36 -77 61 -62 -75
$$ packed form
1679A86j27K65k82r1J35r2J62l95L17m3%j47J90j62j00J93j91J29j48K65J22j28
1701E8k6k24M24K9m08J15O4k58L11m01L12J68k69N2q8j21J21j1M10k41j05J33
1723D5J11j4k7j68N3k57L43j35k9r9J24L1l2pL94m41J41n7j92M48j44j14k25K40
1747a1j88J73J69n35N07qj13L43m28K16J01k62Q1p1L0j09L9j34K59l17L03j04
1769e9N14m48j5K70j95P6k34M04j44j60j50K01k66L87j34j1j38J80p8Q2k41J7
1791a42L24n42N51j36k50N09k30k67L17j46K70m09K21J02l48L73j76l43L33M6
1811E7k06j8K99l01J21J04K21j87j83L97p9m87K98o0j38N77l09q9q2j77Q2j5K07
1834C2j86p8nJ11N7o3O9K01k59OJ12J77k24N1K61j85J35m22Q1J65j13J38j23j3
$$ plain form
1858 -75 38 -202 -141 82 35 134 161 -84 -179 -90 -112 -8 -240 33 309 -143 20 75 -207 123 236 -237 -15
1881 -15 176 -32 -130 -25 -141 -108 277 -14 -543 -201 18 -142 -324 -86 94 125 -189 -265 -124 -101 142 -284
1903 -284 89 -25 -136 -97 34 -181 -35 78 -59 -108 289 262 129 -148 231 -47 -54 126 -31 -262 29 93
1925 93 -239 -32 187 268 15 -143 -120 -161 -81 -146 -174 0 -355 -77 -83 7 24 -235 -21 249 -126 -80 82 232
1949 232 88 -223 13 -69 123 -114 -70 106 249 -68 -301 -368 -178 -98 -33 -104 -335 207 -91 72 -112 -78
1971 -78 -29 -84 -161 -68 249 106 -33 -143 78 -154 -68 160 -181 -152 -217 -227 155 98 101 -101 -149 -128 64 103 193
1996 193 177 33 -193 -204 -189 -199 -36 -139 21 -215 80 -207 74 166 -122 -145 153 -78 316 -75 -136 -192 -23
2019 -23 -23 -103 95 37 -10 -53 -517 84 42 114 150 -36 -184 -65 -39 15 65 -78 323 -62 -15 218 -107 68 -18
$$ packed form
1858g5J13k40O1K23m7R9K7k45r5Q9k2J04k32K73K76m52J63N5k82L30J13m73K22
1881a5J91k08r8J05j16L3L85k91n29L42K19j60j82K38J80L1l14p6J41K3K43m26
1903b84L73j14j11L9J31k15J46J13j37m9L97k7j33k77L79k78pJ80j57k31K91O4
1925I3l32K07K19Q1k53j58K3m1Q0o5k8J74l55K78oR0J7k59K14K70l75M6J62J50
1949B32j44l11K36q2J92k37M4J76J43l17k33o7J90Q0O5p1k31N42k98J63j84L4
1971g8M9n5p7R3L17j43j39j10K21k32Q6K28l41K9o5j0L82n7Lk02m8K1J92L9R0
1996A93j6j44k26j1J5j0J63j03J60k36K95k87K81R2k88k3K98k31L94l91o1n6J69
2019b3%q0J98n8m7m3m64O01m2P2L6j86j48J19K6N4N0j43M01l85M7K33l25J75q6
$$ plain form
2044 -18 25 116 -314 218 51 120 -1 199 -57 -118 110 205 -131 -38 156 50 -128 -26 49 -275 92 205 126
2067 126 25 -45 -202 207 275 -141 -281 -94 -183 116 78 -236 78 313 191 -66 -21 -57 187 -115 36 12
2089 12 284 32 122 -26 -94 78 -173 -26 114 39 13 143 89 -143 -182 103 44 93 -51 -70 225 -44 65
2112 65 -42 146 -7 -120 54 149 -207 83 180 254 117 136 30 130 -108 -115 -107 138 159 -185 60 -2 -269 -10
2136 -10 -109 -252 -30 89 -48 -165 188 -29 37 -186 228 -184 46 179 -132 -10 124 187 78 202 -158
2157 -158 259 109 42 -62 205 37 222 255 124 -199 163 123 -218 -5 179 52 -117 -80 27 208 33
2178 33 -202 -24 47 -131 24 219 -124 3 -124 -118 170 -197 -70 147 115 13 40 -35 94 305 -21 187
2200 187 49 -202 -1 -34 31 21 -81 -214 284 58 -84 228 134 42 115 163 -109 -154 -233 214 -90 210 -209
$$ packed form
2044a8M3R1m30N32j67O9j21K00k56o1K28R5l36R3J94j06j78J02P5l24L67J13p9
2067A26j01p0j57M09O8m16j40J87q9K99l8l14L14K35j22k57M5l6K44l02J51k4
2089A2K72k52R0j48o8J72k51J47J40p5k6J30n4k32l9K85n9M9j44j9K95k69J09
2112F5j07J88j53j13J74R5l56K90R7P4j37J9j06J00k38pQK45K1l44K45o2k67K59
2136a0r9j43K22J19j37j17L53k17O6k23M14m12K30J33l11J22J34O3j09J24l60
2157a58M17j50o7j04K67j68J85L3j31l23L62m0l41K13J84j27j69L7J07J81j75
2178C3k35J78P1j78J55J95l43J27j27OK88l67J27K17l2j02K7p5J29K11l26K08
2200A87j38k51K01l3O5j0j02j33M98k26j42L12r4r2P3M8k72m5p9M47l04L00m19
$$ plain form
2223 -209 -196 261 -347 -85 -174 329 -216 -126 -141 136 -115 -35 223 292 -72 -34 -207 -255 20 -69 -135 -48 -19 49
2247 49 79 -129 220 197 -83 285 72 119 43 228 16 -279 143 -100 -108 54 165 -39 -57 -146 -38 -133 175
2270 175 -108 183 -442 -272 64 -29 246 276 320 80 -109 119 2 -14 161 -157 -217 159 -72 -212 128 -26
2292 -26 29 50 187 -43 -1 -152 61 -82 -36 111 22 17 -140 111 137 -121 180 -74 -133 129 148 47 21 -46
2316 -46 -114 -80 80 -35 -96 188 -407 -65 -77 -102 -152 80 177 2 24 -20 -89 254 3 274 -131 -124 -75 242 180
2341 180 -89 55 125 51 -215 71 105 1 60 -22 -383 32 -64 -305 -29 52 -302 116 122 -105 -97 -83 112 133
2365 133 109 149 18 2 -190 137 -150 -32 111 12 30 70 -105 126 -56 -112 215 -335 196 -53 328 236 -398
2388 -398 -46 22 157 151 -11 -82 9 64 222 53 -65 -69 -67 -382 -8 -37 307 -280 94 -216 -122 -45 50 66 17
$$ packed form
2223b09J3M57o08K62q9N03n45R0j5K77k51Q0K58O9l64L8j73m8K75q9o6Q7K9O8
2247D9L0k08L49k3k80L68k13M7p6J85k12k95M22k43qJ62J11k04j8q9J08r5L08
2270A75k83K91o25J70L36r3K75L0M4k40j89K28j17j6J75l18o0L76k31j40L40j54
2292b6N5K1J37k30M2j51K13j43M6J47q9nj57K51K6k58L01k54n9K62J9j01k6o7
2316d6o8L4J60j15o1K84n95L42j2k5n0K32R7j75K2m4o9L43k51K71m05PM9L17o2
2341A80k69J44P0p4k66K86L4j04N9q2l61M15r6k41K76Q1l54M18Ok27QJ4J95K1
2365A33k4M0j31j6j92L27k87J18J43r9J8M0j75K31j82n6L27n50N31k49L81r2o34
2388c98L52O8J35oj62p1R1N5J58j69j18mKl15L74k9L44n87L74l10R4P7R5J6m9
$$ plain form
2413 17 25 -70 23 -26 -288 -90 -117 -141 -6 -141 -226 -9 71 39 69 -126 169 31 -44 -160 23 107 -86 123 -117
2438 -117 23 -63 78 66 -88 7 -30 -46 -47 13 -91 219 195 331 107 68 -39 -137 90 93 -25 137 -202 -165 23
2463 23 -67 59 105 -180 100 263 -67 197 99 82 272 -113 -293 166 49 -213 -221 -68 311 308 -19 -151 373
2486 373 263 -292 -265 163 48 266 6 15 -3 74 77 100 -149 -205 9 -145 -227 116 -168 27 273 -44 155
2509 155 54 -102 1 130 -212 28 173 136 -182 -264 -20 -257 115 108 112 25 282 -162 297 -97 181 -310
2531 -310 91 -6 34 537 59 -216 -112 -340 1 56 -107 176 -6 2 228 -15 77 240 62 65 -64 284 -175
2554 -175 121 209 31 227 -28 88 -67 54 184 15 184 92 -31 -276 -64 161 -353 -352 1 -203 319
2575 319 -11 -74 -89 41 -12 79 3 -98 -42 -50 -13 -208 116 -64 225 25 -34 -240 -7 265 -60 -36 -16 174
$$ packed form
2413A7Qr5R3m9k62J98k7k4J35j35q5K17Q0l2L0j95K95j38p5j16J83Q4j93K09k40
2438a17J40q6J41j2j54R5l7j6jO0j04L10k4J36k24l9j07r8K27Lj18J62l39L7J88
2463B3r0J26M6k85K80J63l30K64r8j7J90l85j80M59j17k62qJ53L79ll27j32N24
2486C73j10n55K7M28j15K18k60Rj8P7LK3k49n6K14j54q2L43k84J95K46l17J99
2509A55j01j56J03J29l42K40J45l7l18q2K44k37L72pMq7K57m44M59l94K78m91
2531c10M01r7M0N03m78k75J04k28L41N5j63K83j82QK26k43R2J63j78Lj29L48m59
2554a75K96Q8j78J96k55J16j55J21J30j69J69r2j23k45K12K25n14JL53k04N22
2575C19l30o3j5J30n3R1p6j01N6qL7j95L24j80K89k00n9k06K33K72l25K4K0J90
$$ plain form
2599 174 -152 32 -228 174 -400 48 -167 154 245 -7 -226 55 -185 109 -62 194 -75 43 -235 120
2619 120 65 95 -129 7 145 93 -96 82 -63 -312 -20 111 120 -186 117 -103 -16 445 -204 191 -29 -15
2641 -15 139 -16 17 34 -72 -186 -255 -89 49 33 131 81 -61 111 79 -4 170 -98 106 -57 -29 -78 -37 192
2665 192 -91 80 88 72 -195 -134 37 -45 -141 -4 193 60 -68 -323 -6 36 59 78 151 168 31 -4 -241 -17
2689 -17 120 141 72 62 49 353 26 38 -44 -243 44 -174 -167 -18 -156 106 72 -301 88 104 10 92 32 -64 -109
2714 -109 -126 25 -244 35 -63 -39 6 -228 -107 333 76 39 -49 77 69 126 -128 317 7 143 52 -57 233
2737 233 -48 -101 -11 137 -244 -202 178 -101 -137 178 133 -188 48 -167 192 -82 10 133 -337 -173 228 239
2759 239 138 23 270 -430 53 21 -146 -120 131 114 -37 -346 -77 -22 -116 -141 -211 -340 51 76 -238 -260 29
$$ packed form
2599A74l26J84k60M02n74M48k15L21R1k52k19K81k40K94j71K56k69J18k78L55
2619A20n5L0k24J36J38n2j89J78j45k49K92J31Rl06L03k20Q7M61o49L95k20J4
2641a5J54j55L3J7j06j14o9J66J38j6R8n0j42J72l2q3J74k68K04j63K8m9M1K29
2665A92k83J71Qj6k67O1J71q2r6J37J97j33j28k55L17M2K3J9P3J7j37l5k37K24
2689a7J37K1o9j0j3L04l27J2q2j99K87k18PJ49j38K62l4l73L89J6r4Q2o0r6m5
2714a09j7J51k69K79r8K4M5k34J21M40k57l7q8J26qN7k54M45l10J36r1j09K90
2737B33k81n3R0J48l81M2L80k79l6L15m5l21K36k15L59k74R2J23m70J64M01J1
2759B39j01j15K47p00M83l2j67K6K51j7j51l09K69N5r4k5p0j29L91K5l14k2K89
$$ plain form
2782 29 -126 -336 -63 142 61 -35 -2 168 85 104 -189 -29 54 -152 77 -63 263 -224 -150 -73 216 148 7
2805 7 177 38 -205 114 -209 125 91 -135 -311 290 -109 -122 -22 -307 47 2 68 231 148 -179 -107 299 75
2828 75 129 195 -25 -54 65 -42 69 -48 -49 379 -6 72 -166 -7 233 -305 -167 89 438 93 -178 8
2850 8 51 310 -59 -121 -169 -46 -33 -12 160 36 -364 -265 -284 -7 -129 -24 53 139 16 1 67 51 -94 -116 66
2875 66 -118 -173 9 -28 96 66 -160 -34 -12 -10 -14 3 -147 104 1 -105 -28 92 -127 -19 49 -2 191 280 71
2900 71 179 26 -76 116 -17 27 -171 178 501 191 -2 -79 -177 118 -142 103 168 238 -291 48 -216 172
2922 172 -266 -254 21 23 -46 -8 95 56 83 165 354 5 18 -42 -179 142 138 4 101 -89 -81 1 -255 19 211
2947 211 -62 -85 -175 -71 -170 -66 -129 183 -222 -126 -13 -140 150 -165 -152 69 -177 -134 -207 -295 88 -131 15
$$ packed form
2782B9j55k10K73K05q1r6L3J70q3J9k93J60Q3k06K29j40L26m87P4P7K89o8j41
2805GJ70j39k43L19l23L34l4k26j76O01l99j3J00k85L54m5O6J63q3l27P2M06k24
2828G5N4O6k20k9J19j07J11j17jM28l85P8k38J59K40n38J38K56L49l45k71J86
2850HM3K59l69o2m8J23J3K1J72j24m00R9j9K77j22J05P7Q6j23j5O6j6j45k2J82
2875F6j84n5J82l7J24l0k26J26K2KmJ7j50K51j03j06P7J20k19J08O8n1J93Q9k09
2900G1J08j53j02J92j33M4j98L49L23l10j93p7r8K95k60K45O5P0n29L39k64L88
2922A72m38J2K75Ko9L8J03l9K7Q2J89l49J3o0j37L21mj34R7j90QQ2k56K74J92
2947B11k73k3r0J04r9J04o3L12m05R6J13j27K90l15J3K21k46M3p3q8L83k19J46
$$ plain form
2970 15 90 86 104 3 -53 -147 -16 -188 -82 -114 122 199 -52 132 97 -1 -94 206 -109 260 -59 154 133 -70
2994 -70 165 33 -444 -8 142 392 218 215 33 9 38 88 36 -51 -62 -253 -49 -88 51 223 -128 128 -321
3017 -321 92 197 -192 -296 -130 200 162 208 36 19 55 206 -114 215 -4 -207 261 172 -304 -140 -202 182
3039 182 110 234 212 -178 -13 -37 -34 -149 143 268 68 -127 216 -104 -242 -194 -33 73 149 140 203 -43 -138 -240
3063 -240 77 40 182 -33 92 6 64 -78 -80 -37 -33 31 -28 53 27 -143 215 51 98 -15 -25 -33 -314 -144 -41
3088 -41 53 185 59 -185 -295 92 -104 -231 -143 51 62 67 -76 -90 117 123 -239 -121 -150 239 -134 -172 -344 79
3112 79 -194 111 -18 -235 118 -30 -69 161 -133 325 129 304 184 -90 -134 -224 25 10 116 14 252 24
3134 24 -1 7 27 -82 -43 -167 -164 -122 54 66 226 363 199 146 -114 -229 -91 -86 276 18 116 169 -40 95 -212
$$ packed form
2970A5P5mJ8j01n6r4J31j72J06l2K36P7k51J84l5r8r3L00l15L69l19K13k1k03
2994g0K35j32m77M36J50K50j74lj82k4K9N0n2q7j1j91K04l9J39J72l51K56m49
3017c21M13J05l89j04J66L30l8M6j72j7L6J51l20L29k19k03M68q9m76J64o2L84
3039A82p2J24k2l90J65k4Lj15K92J25k00j95L43l20j38M8J61J06P6rO3k46r5j02
3063b40L17l7J42k15J25q6N8j42kM3MO4n9Q1k6j70L58j64M7j13j0qk81J70J03
3088d1R4J32j26k44j10L87j96j27Q8J94J1Nj43j4K07Ol62J18k9L89l73l8j72M23
3112G9k73L05j29k17L53j48l9K30k94M58j96J75j20k74m4r0K49j5J06j02K38k28
3134B4k5QK0j09L9j24LM2J76J2J60J37j64n3k60j15J38NL62k58R8N3k09J35l07
$$ plain form
3159 -212 -50 117 -40 278 -258 -79 370 97 -239 -272 436 -92 -59 -187 87 120 -182 -163 -145 154 -86 138
3181 138 188 -39 -208 81 30 14 148 94 86 -138 2 122 89 279 120 -33 -140 206 -31 3 199 -187 -89
3204 -89 88 92 -23 142 26 -181 46 -15 140 -113 145 -158 117 112 36 47 -8 6 -153 319 145 153 -129 -233
3228 -233 274 116 -132 306 -56 -21 -31 -69 -169 -104 -350 122 -10 64 -7 14 -86 -20 -46 60 -131 -48 157
3251 157 145 245 26 30 -21 95 14 69 -12 116 139 102 1 51 -20 161 -64 31 171 13 -167 -16 70 101 14
3276 14 -231 -178 -260 -250 -8 28 158 244 19 274 42 195 106 -158 136 79 89 -42 26 144 -1 -105 -63 -113
3300 -113 220 -13 324 -27 -30 71 105 -74 -155 -103 -39 162 -356 16 147 -86 244 -225 -202 7 -68 -41 -236
3323 -236 86 139 136 -51 -7 -39 -100 -130 135 44 -18 -94 98 -3 222 -65 344 50 -278 50 167 119 -35 239
$$ packed form
3159b12J62J67j57L18n36J79M49k73l36l3P08n28L3j28K74L3l02J9J8K99k40K24
3181A38N0k27j69K89n1j6J34n4qk24J40J20l3J90j59j53j07L46k37L4J96l86R8
3204h9J77Mj15J65j16k07K27o1J55k53K58l03K75np6J1n5J4j59M72j74Qk82j04
3228b33N07j58k48M38l62L5j0l8j00O5k46M72j32P4p1K1j00O6k6J06j91Q3K05
3251A57j2J00k19Mn1J16q1N5q1J28K3l7j01N0p1J81k25R5J40j58j80J51Q6L1q7
3276A4k45N3q2J0K42L6J30Q6k25K55k32J53q9k64K94n7J0j31O8J18j45j04M2n0
3300a13L33k33L37l51lJ01L4j79q1N2O4K01n18L72J31k33L30m69K3K09p5K7j95
3323b36L22N3lj87M4l2o1l0K65r1o2p6J92j01K25k87M09k94l28L28J17m8j54K74
$$ plain form
3347 239 14 195 -69 -9 51 -64 -154 110 129 -415 -124 -23 35 29 -2 -168 99 -113 -99 -155 -195 -95 -65 168
3371 168 -45 37 -213 145 291 98 -137 59 167 -2 225 -53 27 -58 -17 17 126 203 309 70 101 -8
3393 -8 254 -64 37 90 219 4 -124 13 46 11 -31 -136 89 41 -101 -42 281 126 104 275 22 170 131
3416 131 -63 -64 81 -15 9 -27 150 120 65 -30 -220 116 -196 -78 43 -209 -192 -54 -12 -167 -63 -180 -96 77
3440 77 -57 -208 15 -124 142 -57 120 94 163 91 54 -200 75 -69 -46 227 221 -203 15 19 102 -32 193 -165
3464 -165 -29 -250 23 -2 -111 -271 -131 448 -174 -88 -102 12 1 133 -138 -179 -245 51 212 -58 334 84
3486 84 12 -186 141 230 -199 61 128 -99 99 66 5 149 50 62 20 -83 -264 -278 88 -121 33 66 68 20 -180
3511 -180 -154 -202 4 83 -238 37 -57 -14 150 136 271 234 -41 -4 -35 36 130 163 19 177 92 248 -31 -77 125
$$ packed form
3347B39k25J81k64O0O0j15r0K64J9n44K91J01N8ol1j66K67k12J4n6m0J00L0K33
3371A68k13Q2k50L58J46j93k35J96J08j69K27k78Q0q5M1L4J09P7J06k39L1j09
3393hK62l18J01N3J29k15j28J37L3l5m2j05K25m8j42N9L23j55k2J71k53J48l9
3416A31j94jJ45r6K4l6J77l0n5r5j90L36l12J18J21k52J7J38M2j55J04j17Q4J73
3440G7j34j51K23j39K66j99J77k6O9p2l7k54K75j44K3K73om24K18MQ3j34K25l58
3464a65J36k21K73k5j09j60J40N79o22Q6j4J14j1J32k71m1o6K96J61k70L92k50
3486H4p2j98L27Q9m29K60O7k27J98l3o1J44r9J2m2j03j81j4L66k09J54L3Km8k00
3511a80K6m8K06P9l21K75r4M3J64j4J35l7k75L7l1P1R4L3j44J58q5J56k79m6K02
$$ plain form
3536 125 80 18 212 179 48 172 163 5 -143 207 137 138 -149 -12 -165 -247 -83 -64 61 48 118 164 183 -136 210
3561 210 1 42 48 150 -56 8 -85 -9 -127 92 -82 -113 90 -183 1 200 -178 -296 -324 -333 -52 -46 -134 10
3585 10 -118 46 140 -96 94 -4 200 72 -159 -146 14 171 -344 105 118 -238 47 -98 -61 6 -21 178 35
3608 35 92 178 -52 93 20 161 -251 -176 158 59 -29 311 229 10 61 92 39 -199 -59 -86 -13 111 -195 -152 239
3633 239 115 -23 35 -326 -200 -75 -146 20 146 97 -86 -22 154 -190 71 -54 -72 89 -136 307 22 -142
3655 -142 -76 228 14 92 -44 -61 -102 207 179 268 -45 -1 -61 -104 -115 -11 5 -156 -108 -443 -58 5 -18 5 68
3680 68 13 -219 -17 138 276 -128 346 82 -119 -166 -169 -123 -104 119 -45 -130 40 134 -216 13 -63 268 353 -178
3704 -178 -94 26 -98 37 -80 -69 -140 -5 26 -89 -221 174 -47 -76 -3 66 -197 -121 149 -21 -106 -98 182 10
$$ packed form
3536A25m5o2J94l3j31J24rj58j48L50p0Jk87J37j53q2J64J9J25j3P0M6J9l19L46
3561B10k09M1OJ02k06O4r3P6j18K19j74l1K03k73J84J99l78j18k8rK81Oq8J44
3585A0j28J64R4k36J90r8K04j28k31J3J60J57n15M49J3l56K85j45L7O7k7J99j43
3608C5N7Q6k30J45p3J41m12P5L34r9q8L40q2k19N1L1n3k38J40k7P3J24l06M3L91
3633B39j24j38N8l61J26J25p1J66J26m9j83O4J76l44K61j25j8J61k25M43k85j64
3655a42O6L04k14P8j36j7m1L09k8Q9l13M4o0m3j1J04J6j61M8l35L85O3k3K3O3
3680F8n5k32K02J55J38m04M74k64k01m7lM6J9K23j64q5J70R4l50K29p6L31Q5n31
3704a78Q4J20j24J35j17J1p1J35L1j15j32L95k21k9P3O9k63P6K70j70q5QK80j72
$$ plain form
3728 10 -17 -49 125 -8 -109 -103 201 2 82 -120 -95 226 -264 311 88 -75 181 100 5 -243 123 101 -13
3751 -13 132 145 61 9 -9 -98 -116 58 189 336 -147 -59 131 143 -225 288 -118 -87 329 -60 174 92 0 243
3775 243 -81 -56 121 3 -141 132 -9 316 64 10 -98 34 31 53 199 303 -132 -49 260 -152 -18 117
3797 117 244 -101 -312 -59 -229 -109 39 -16 127 -84 231 -23 20 73 -148 24 -67 150 -379 74 79 -198
3819 -198 55 5 135 156 41 17 33 270 7 -189 76 56 136 -148 43 -129 -133 155 -226 30 -74 -246 93
3842 93 92 432 -79 -13 177 219 -47 -203 158 -34 -118 117 90 -535 236 156 -212 -69 56 -54 -74 25 175
3865 175 240 -96 115 -77 21 83 -12 188 -92 82 249 -193 -254 90 -262 11 183 20 -156 -170 -88 -188
3887 -188 -42 -113 53 -84 179 193 74 16 -258 -26 142 255 199 28 -84 -10 -70 -21 190 10 41 -119 -45
$$ packed form
3728A0k7l2J74j33j01OL04j99Q0k02K5L21m90N75k23j63K56q1r5k48L66k2j14
3751a3J45J3q4n2j8q9j8J74J31J47m83Q8J90J2l68N13m06L1M16l89K34q2r2K43
3775B43l24K5J77j18j44K73j41L25k52n4j08J32lK2J46J04m35Q3L09m12J34J35
3797A17J27l45k11K53j70J20J48n5J43k11L15k54M3N3k21J72r1K17n29M53Nk77
3819a98K53n0J30K1j15k4J6K37k63j96K65k0Q0k84J91j72mK88l81K56j04j72L39
3842I3jL40n11O6J90M2k66j56L61j92q4K35k7o25P71q0l68J43J25j10k0R9J50
3865A75O5l36K11j92R8O2r5K00k80J74J67m42o1L44l52K73J72j63j76j4Q2j00
3887a88J46p1J66j37K63J4j19n8k74K32J68J13n6j71j12P4o0M9K11j80L1j60P4
$$ plain form
3910 -45 257 162 37 -28 -87 114 -292 -29 30 -248 -153 -125 164 94 62 113 -214 -307 -123 54 145 42 -42 263
3934 263 254 164 -122 75 131 50 44 -141 -64 313 -70 -70 -117 157 -98 92 -120 341 136 232 195 87 117 289 -321
3959 -321 -15 1 42 217 -141 -59 -12 110 -28 353 131 167 -4 -28 67 52 82 -78 -159 133 440 -76 -295
3982 -295 -47 -172 180 -235 -113 47 5 -276 2 19 328 -72 -109 -25 -195 -102 285 -266 43 184 -79 -199
4004 -199 143 182 98 -101 -176 171 -78 22 70 -52 -117 -26 -105 -221 -42 65 76 -125 -156 82 73 -75 -290 -192
$$ packed form
3910d5L02r5j25o5n9K01m06K63N9k78R5K8K89p0l2N1l27r3J84J77R1j03q4L05
3934B63rr0k86J97N6q1oj85P7L77l83%m7K74k55J90k12M61k05R6l7j08L0J72o10
3959c21L06J6M1J75l58Q2M7J22j38L81k22L6j71k4R5j5L0j60q1K92L07n16k19
3982b95K48j25L52m15J22J60m2k81K78J7L09m00l7Q4j70R3L87n51L09J41k63j20
4004a99L42L9q4j99p5L47k49J00M8j22o5R1p9j16J79J07J1k01l1K38rj48k15R8
$$ [...]
8191F5
##END NTUPLES=NMR FID
##END=
