##TITLE=1H_SR29_Kr
 CDCl3,8 sc, 
 3.02.2021
##JCAMPDX= 6.0         $$ Bruker NMR JCAMP-DX V2.0
##DATA TYPE= NMR FID
##DATA CLASS= NTUPLES
##ORIGIN= UXNMR, Bruker Analytische Messtechnik GmbH
##OWNER= root
$$ XWIN-NMR		Version 3.5
$$ Wed Feb  3 09:59:56 2021 Russian Standard Time (UT+4h)  she@DPX200
##.OBSERVE FREQUENCY= 200.1315066352
##.OBSERVE NUCLEUS= ^1H
##.DELAY= (6, 6)
##.ACQUISITION MODE= SIMULTANEOUS
##.ACQUISITION SCHEME= undefined
##.AVERAGES= 8
##.DIGITISER RES= 18
##SPECTROMETER/DATA SYSTEM= spect
##.PULSE SEQUENCE= zg30
##.SOLVENT NAME= CDCl3
##.SHIFT REFERENCE= (INTERNAL, CDCl3, 0, 15.7039)
##AUDIT TRAIL= $$ (NUMBER, WHEN, WHO, WHERE, WHAT)
$$ ##TITLE= Audit trail, XWIN-NMR		Version 3.5
$$ ##JCAMPDX= 5.01
$$ ##ORIGIN= Bruker BioSpin GmbH
$$ ##OWNER= she
$$ F:/spectra/data/she/nmr/H-F/1/audita.txt
$$ ##AUDIT TRAIL=  $$ (NUMBER, WHEN, WHO, WHERE, WHAT)
(   1,<2021-02-03 09:58:54.78 +0400>,<she>,<DPX200>,
      <created by zg, POWCHK disabled, PULCHK disabled
       configuration hash MD5:
       00 E9 B6 7A A2 85 ED C7 34 08 36 98 17 FE 4E 26
       data hash MD5: 16K
       2D 8E B0 41 46 C8 56 01 40 DA 35 25 97 DC D0 74>)
$$ ##END=
$$ 
$$ hash MD5
$$ 7B 7A 6D 95 1E D5 E7 86 08 0C 2A 8B 3A 69 CB 43
##$RELAX= 
##$RELAX= 
##$RELAX= 
##$RELAX= 
##$RELAX= 
##$RELAX= 
$$ Bruker specific parameters
$$ --------------------------
##$DU= <F:/spectra>
##$EXPNO= 1
##$NAME= <H-F>
##$PROCNO= 1
##$TYPE= <nmr>
##$USER= <she>
##$AMP= (0..31)
100 100 100 100 100 100 100 100 100 100 100 100 100 100 100 100 100 100 
100 100 100 100 100 100 100 100 100 100 100 100 100 100 
##$AQSEQ= 0
##$AQ_mod= 1
##$AUNM= <au_zg>
##$AUTOPOS= <>
##$BF1= 200.13
##$BF2= 200.13
##$BF3= 200.13
##$BF4= 200.13
##$BF5= 200.13
##$BF6= 200.13
##$BF7= 200.13
##$BF8= 200.13
##$BYTORDA= 1
##$CFDGTYP= 0
##$CFRGTYP= 5
##$CHEMSTR= <none>
##$CNST= (0..31)
1 1 145 1 1 1 1 1 1 1 1 1 1 1 1 1 1 1 1 1 1 1 1 1 1 1 1 1 1 1 1 1 
##$CPDPRG= <>
##$CPDPRG1= <>
##$CPDPRG2= <>
##$CPDPRG3= <>
##$CPDPRG4= <mlev>
##$CPDPRG5= <mlev>
##$CPDPRG6= <mlev>
##$CPDPRG7= <mlev>
##$CPDPRG8= <mlev>
##$CPDPRGB= <>
##$CPDPRGT= <>
##$D= (0..31)
0 1.2 0 0 0 0 0 0 0 0.06 0 0.03 0 0 0 0 0.0002 0 0 0 0 0 0 0 0 0 0 0 0 
0 0 0 
##$DATE= 1612331934
##$DBL= (0..7)
120 120 120 120 120 120 120 120 
##$DBP= (0..7)
150 150 150 150 150 150 150 150 
##$DBP07= 0
##$DBPNAM0= <>
##$DBPNAM1= <>
##$DBPNAM2= <>
##$DBPNAM3= <>
##$DBPNAM4= <>
##$DBPNAM5= <>
##$DBPNAM6= <>
##$DBPNAM7= <>
##$DBPOAL= (0..7)
0.5 0.5 0.5 0.5 0.5 0.5 0.5 0.5 
##$DBPOFFS= (0..7)
0 0 0 0 0 0 0 0 
##$DE= 6
##$DECBNUC= <off>
##$DECIM= 32
##$DECNUC= <off>
##$DECSTAT= 4
##$DIGMOD= 1
##$DIGTYP= 9
##$DL= (0..7)
0 120 120 120 120 120 120 120 
##$DP= (0..7)
150 150 150 150 150 150 150 150 
##$DP07= 0
##$DPNAME0= <>
##$DPNAME1= <>
##$DPNAME2= <>
##$DPNAME3= <>
##$DPNAME4= <>
##$DPNAME5= <>
##$DPNAME6= <>
##$DPNAME7= <>
##$DPOAL= (0..7)
0.5 0.5 0.5 0.5 0.5 0.5 0.5 0.5 
##$DPOFFS= (0..7)
0 0 0 0 0 0 0 0 
##$DQDMODE= 0
##$DR= 18
##$DS= 0
##$DSLIST= <SSSSSSSSSSSSSSS>
$$ [...]
##$SUBNAM2= <"">
##$SUBNAM3= <"">
##$SUBNAM4= <"">
##$SUBNAM5= <"">
##$SUBNAM6= <"">
##$SUBNAM7= <"">
##$SUBNAM8= <"">
##$SUBNAM9= <"">
##$SW= 16.9725356469052
##$SWIBOX= (0..15)
0 0 2 0 0 0 0 0 0 0 0 0 0 0 0 0 
##$SW_h= 3396.73913043478
##$TD= 16384
##$TD0= 1
##$TE= 0
##$TE2= 300
##$TE3= 300
##$TEG= 300
##$TL= (0..7)
0 120 120 120 120 120 120 120 
##$TP= (0..7)
150 150 150 150 150 150 150 150 
##$TP07= 0
##$TPNAME0= <>
##$TPNAME1= <>
##$TPNAME2= <>
##$TPNAME3= <>
##$TPNAME4= <>
##$TPNAME5= <>
##$TPNAME6= <>
##$TPNAME7= <>
##$TPOAL= (0..7)
0.5 0.5 0.5 0.5 0.5 0.5 0.5 0.5 
##$TPOFFS= (0..7)
0 0 0 0 0 0 0 0 
##$TUNHIN= 0
##$TUNHOUT= 0
##$TUNXOUT= 0
##$USERA1= <user>
##$USERA2= <user>
##$USERA3= <user>
##$USERA4= <user>
##$USERA5= <user>
##$V9= 5
##$VALIST= <valist>
##$VCLIST= <CCCCCCCCCCCCCCC>
##$VD= 0
##$VDLIST= <DDDDDDDDDDDDDDD>
##$VPLIST= <PPPPPPPPPPPPPPP>
##$VTLIST= <TTTTTTTTTTTTTTT>
##$WBST= 1024
##$WBSW= 4
##$XGAIN= (0..3)
0 0 0 0 
##$XL= 0
##$YL= 0
##$YMAX_a= 90398
##$YMIN_a= -83844
##$ZGOPTNS= <>
##$ZL1= 120
##$ZL2= 120
##$ZL3= 120
##$ZL4= 120
##$ABSF1= 10
##$ABSF2= 0
##$ABSG= 5
##$ABSL= 3
##$ALPHA= 0
##$AQORDER= 0
##$ASSFAC= 0
##$ASSFACI= 0
##$ASSFACX= 0
##$ASSWID= 0
##$AUNMP= <proc_1d>
##$AZFE= 0.1
##$AZFW= 0.1
##$BCFW= 1
##$BC_mod= 2
##$BYTORDP= 1
##$COROFFS= 0
##$CY= 11.3945322036743
##$DATMOD= 1
##$DC= 2
##$DFILT= <>
##$DTYPP= 0
##$F1P= 15.9154993809931
##$F2P= -4.1035820241983
##$FCOR= 0.5
##$FTSIZE= 0
##$FT_mod= 4
##$GAMMA= 1
##$GB= 0.15
##$INTBC= 1
##$INTSCL= 1
##$ISEN= 128
##$LB= 0.24
##$LEV0= 0
##$LPBIN= 0
##$MAXI= 10000
##$MC2= 0
##$MEAN= 0
##$ME_mod= 0
##$MI= 1.114404
##$NCOEF= 0
##$NC_proc= 0
##$NLEV= 6
##$NOISF1= 3.799351
##$NOISF2= 2.8
##$NSP= 1
##$NTH_PI= 0
##$NZP= 0
##$OFFSET= 15.70392
##$PC= 1
##$PHC0= -10755.98
##$PHC1= 10.40095
##$PH_mod= 1
##$PKNL= yes
##$PPARMOD= 0
##$PSCAL= 0
##$PSIGN= 0
##$REVERSE= no
##$SF= 200.130013532006
##$SI= 16384
##$SIGF1= 3
##$SIGF2= 2
##$SINO= 400
##$SIOLD= 16384
##$SREGLST= <1H.CDCl3>
##$SSB= 0
##$STSI= 0
##$STSR= 0
##$SW_p= 3612.71676300578
##$SYMM= 0
##$S_DEV= 0
##$TDeff= 0
##$TDoff= 0
##$TI= <>
##$TILT= no
##$TM1= 0
##$TM2= 0
##$TOPLEV= 0
##$USERP1= <user>
##$USERP2= <user>
##$USERP3= <user>
##$USERP4= <user>
##$USERP5= <user>
##$WDW= 1
##$XDIM= 8192
##$YMAX_p= 0
##$YMIN_p= 0
$$ End of Bruker specific parameters
$$ ---------------------------------
##NTUPLES= NMR FID
##VAR_NAME=  TIME,          FID/REAL,        FID/IMAG
##SYMBOL=    X,             R,               I
##VAR_TYPE=  INDEPENDENT,   DEPENDENT,       DEPENDENT
##VAR_FORM=  AFFN,          ASDF,            ASDF
##VAR_DIM=   8192,          8192,            8192
##UNITS=     SECONDS,       ARBITRARY UNITS, ARBITRARY UNITS
##FACTOR=    0.0002944,     1,               1
##FIRST=     0,             0,               0
##LAST=      2.4114304,     0,               0
##MIN=       0,             -83844,          0
##MAX=       2.4114304,     90398,           0
$$ Real data points
##PAGE= N=1
##DATA TABLE= (X++(R..R)), XYDATA
0@%%%%%%%%%%%%%%pJ5j6J6j6K2k9L1l8M5n3O1p0Q1q9J01j16J33j54J76j97K21
$$ 0 0 0 0 0 0 0 0 0 0 0 0 0 0 0 -7 8 -8 8 -8 14 -15 16 -22 23 -30 31 -39 42 -47 54 -62 71 -83 93 -104 117
36A17k49K78l10L47l85M27m73N24n80O40p06P78q56R42j040J145j260J391j539
$$ 117 -132 146 -164 183 -202 225 -248 276 -304 336 -370 408 -448 494 -546 599 -661 730 -809
55h09J706j893K108k363K663l021L462m020M749n739P167r408J3417k2607P7092
$$ -809 897 -996 1112 -1251 1412 -1609 1853 -2167 2582 -3157 4010 -5398 8019 -14588 62504
70F2504K7894j46877P3098n9948N8396L5206j15685P1074K8590j3333j3913p7635
$$ 62504 90398 -56479 16619 -43329 15067 50273 -65412 5662 34252 20919 7006 -70629
82g0629R9642R532m6717M671n0718J07352l108j03617O7247l2556M1824J7685
$$ -70629 29013 38545 -8172 -3501 -54219 53133 50025 -53592 13655 -18901 22923 40608
94D0608j24452R4397L7592n1796J5972o2514N7289L4455o6183J2377q846O1317
$$ 40608 -83844 10553 48145 -3651 12321 -50193 7096 41551 -24632 -12255 -21101 40216
106D0216o250r3289N5862L435J5474R426q7898P5761K6300n7646J9992m2666N5769
$$ 40216 33966 -59323 -3461 -26 15448 24874 -63024 12737 39037 -18609 1383 -41283 14486
119A4486L3686q8619K4013J4775K0892M662p0182M0427K0084m644k627n5783O8191
$$ 14486 48172 -40447 -16434 -1659 19233 23895 -46287 -5860 14224 9580 6953 -48830 19361
132A9361J8047o0212J8738k0728M1495K3468p8390K8394K0302J135M054n6106
$$ 19361 37408 -22804 -4066 -24794 16701 40169 -38221 -9827 10475 11610 15664 -40442
144d0442L9573L1680k9162n817k4480M6103J5217n1219J2699n651L1656O973o6319
$$ -40442 -869 30811 1649 -4168 -28648 17455 32672 -18547 -5848 -11499 20157 27130 -39189
157c9189L7953K2127j2640P59m4195L7721K9356l7203M54j2456L3574J1259n4325
$$ -39189 -1236 20891 8251 9010 -35185 2536 31892 -5311 -4857 -17313 16261 27520 -26805
170b6805J7648J2420J2771L4n0757L3558K1373k0066R82k9261L5981K2845m8030
$$ -26805 -9157 3263 16034 16068 -34689 -1131 20242 176 1158 -28103 7878 30723 -17307
183a7307N299M955J8790P082m4981J5911J9360J760o956l5107L2967K0291k7535
$$ -17307 -12008 -7053 11737 18819 -26162 -10251 9109 10869 3913 -31194 1773 22064 -5471
196e471j820j1502K9422J1948m2928Q882J1305J2862j59m0246K1609K3118j1367
$$ -5471 -7291 -18793 10629 22577 -20351 -11469 -164 12698 12539 -27707 -6098 17020 5653
209E653q701j8755K8968J4051k8130k344k169K7149K833m0231J5728J4101K912
$$ 5653 -3048 -21803 7165 21216 -6914 -9258 -11427 15722 18555 -21676 -5948 8153 11065
222A1065m258l0435K5215J8878j8228o046j2231K6833J0429l3555M688P596J4795
$$ 11065 6807 -23628 1587 20465 2237 -3809 -16040 10793 21222 -12333 -7645 -49 14746
235A4746k402l3375J7685J5531l093p352k2834K7239J4211k6252j537k109K1217
$$ 14746 12344 -21031 -3346 12185 9092 1740 -21094 6145 20356 -5896 -7433 -9542 11675
248A1675N187l3156P768J2324P209n497k7769K1355J6001j3685o695j2121K3814
$$ 11675 16862 -16294 -8526 3798 11007 5510 -22259 -904 15097 1412 -5283 -17404 6410
261F410J0484k7571J298M503J5234L19l1462J3633J6365l263n483j9441J9102
$$ 6410 16894 -10677 -9379 -4876 10358 10677 -20785 -7152 9213 5950 467 -18974 128
274A28J5655j8973n158k327J8841O497k8273M011J2009O607k436k4034J3639J7347
$$ 128 15783 -3190 -8348 -10675 8166 14663 -13610 -9599 2410 9017 6581 -17453 -3814 13533
288A3533r921p149j0532J8732J3126k2846l731O259J2328J798k3881N090J6131
$$ 13533 3612 -3537 -14069 4663 17789 -5057 -8788 -2529 9799 11597 -12284 -7194 8937
301H937R62p845j6532J4684J5313j3939p350j801J5390O749k1873j802J1097Q514
$$ 8937 9899 2054 -14478 206 15519 1580 -5770 -7571 7819 14568 -7305 -9107 1990 10504
315A0504l191k0077P748J5915n229q558q351J3410J1891j5362p854M332J2413
$$ 10504 7313 -12764 -5016 10899 5670 -2888 -11239 2171 14062 -1300 -9154 -4822 7591
328G591J816j9046R77J3715K632p229j3376Q222J5635p725j0848j291J2212P260
$$ 7591 9407 -9639 -8662 5053 7685 456 -12920 -4698 10937 3212 -7636 -8927 3285 10545
342A0545j5540o224J0744Q047l154j3922J077J4408Q43j1131n965J0139J0766
$$ 10545 -4995 -11219 -475 7572 4418 -9504 -8427 5981 6824 -4307 -10272 -133 10633
355A0633r592j0320M139J1241J630j2304m727J1711O648q537r187M968J1894j792
$$ 10633 1041 -9279 -5140 6101 7731 -4573 -9300 2411 9059 522 -8665 -3697 8197 6405
369F405j1769j327J0210N655p602r748O816J1075m620j0276r60J0868M424j0349
$$ 6405 -5364 -6691 3519 9174 1572 -8176 -1360 9715 5095 -5181 -6141 4727 9151 -1198
383a198n227O424P878k410j2536K418J1592m29p777o071P248R299q360p152K663
$$ -1198 -6425 -1 7877 5467 -7069 -4651 6941 6512 -1265 -7336 -88 9211 851 -6301 -3638
398c638Q056L564j2649k816J0379K496l713q417K440J1252m236p087k325O767
$$ -3638 4418 7982 -4667 -7483 2896 5392 1679 -6738 -4298 6954 2718 -4369 -6694 73
412G3Q089j0443n572O850L914R72r495j203J1207n21n040n882L768J0105o165
$$ 73 8162 -2281 -7853 -1003 2911 3883 -5612 -6815 4392 3871 -1169 -7051 -3283 6822 657
427F57o551K731N031M105r050l693Q255K638j047q196P79J0578l619n116j440
$$ 657 -5894 -3163 1868 5973 -3077 -6770 1485 4123 3076 -5120 -4341 6237 2618 -2498 -3938
442c938L749P874p288n668M669L971K362q589j603R143r88k564m768J791Q798
$$ -3938 -189 7685 397 -5271 -602 3369 5731 -2858 -4461 4682 3694 1130 -3638 -1847 6951
457F951n179m542J029K695O178q444l454P077R66p3o109q14Q165k037l225k811
$$ 6951 1772 -2770 -1741 954 7132 -1312 -4766 2311 3277 3204 -2905 -3719 4446 2409 -816 -3627
473c627K525P400o981l701L942J412L167o686k122P347j059j552m657J168P973
$$ -3627 -1102 6298 -683 -4384 -442 970 4137 -2549 -4671 2676 1617 65 -4592 -3424 4549
488D549m206l994N28K699L755n578j798L456K018J088p470J180P357l439j018
$$ 4549 343 -3651 -3123 -424 3331 -2247 -4045 -589 1429 2517 -4953 -3773 3584 145 -873
503h73k385J453O012m926k618J890K638K753o828K15M775n78q7m639K175N268
$$ -873 -3258 -1805 4207 -719 -3337 -1447 1191 3944 -2884 -2669 2106 1528 1441 -3198 -1023 4245
519D245m125l5k601L523M792q222J362K504l88L371p166J415M842k153L64m625
$$ 4245 120 85 -2516 1007 5799 -2423 -1061 1443 1055 4426 -2740 -1325 3517 1364 1728 -2897
535b897L159N045o961J826o14J025M673q688K809K357k158M274q149K907O644
$$ -2897 262 5307 -1654 172 -442 583 5256 -3432 -623 1734 -424 3850 -4299 -1392 5252
550E252p789L403l002M90P330r407K479J645k042N931r351K880N880o796N201
$$ 5252 -2537 866 -2136 -1646 5684 -3723 -1244 401 -1641 4290 -5061 -2181 3699 -3097 2104
565B104n881R47Q108r689L868J83k744Q836j0479J602O535o478O173o152k26Q479
$$ 2104 -3777 -2830 5278 -4411 -543 -360 -3104 5732 -4747 -3145 3390 -3088 3085 -3067 -3293 5186
581E186q620L839j323j988R176r996K198M106n288P387p624M65Q021q336N393
$$ 5186 -3434 405 -918 -2906 6270 -3726 -1528 2578 -2710 4677 -2947 -2482 5539 -2797 2596
596B596l198l018J1020j0031K067L353n159P928p539k36O709o394N530m602j933
$$ 2596 -602 -3620 7400 -2631 -564 2789 -2370 5558 -1981 -2217 4492 -1902 3628 -974 -2907
611b907R386q940K923N95l931Q915q473J133M520o288P457n790k069Q897q216
$$ -2907 6479 -2461 462 1057 -2874 6041 -2432 -1299 3221 -3067 4390 -1400 -3469 5428 -2788
626b788L643k99m049Q385p154O55L121n061P278n803j248O673o611M702k415k742
$$ -2788 855 556 -3493 4892 -2262 -1607 1514 -3547 3731 -2072 -3320 3353 -3258 1444 -971 -3713
642c713P875p390K637J333m909Q230o711j56N816o574N599l025k488P254o394
$$ -3713 4162 -3228 -591 742 -4167 4063 -2648 -2804 3012 -3562 2037 -988 -3476 3778 -2616
657b616L315m88l692Q057p110J365M169o005O632m426j532O525o399L945j013
$$ -2616 699 211 -3481 4576 -2534 -1169 3000 -3005 3627 -799 -2331 4194 -2205 1740 727
672G27l292P522o522J185L176n105O057m422r47N251n450M143k240k051O616o553
$$ 727 -2565 4957 -1565 -380 2796 -2309 3748 -674 -1621 3630 -1820 2323 83 -1968 4648 -1905
688a905K077J992m366N888m965l10M494m916M051k774j395N977n684J389Q62k709
$$ -1905 172 2164 -2202 3686 -1279 -1589 2905 -2011 2040 -734 -2129 3848 -1836 -447 415 -2294
704b294N204m667K89L004l819L986l294o21N004m817K008m37k003N116m616J64
$$ -2294 2910 -1757 -1468 1536 -2283 1703 -1591 -2212 2792 -2025 -17 -454 -2457 2659 -1957 -1793
720a793K818k996L748l651k39M203l500J723j619m37M494m197K57J292j272L841
$$ -1793 1025 -1971 1777 -1874 -2113 2090 -1410 313 -1306 -1743 2751 -1446 -1189 103 -1169 2672
736B672m031m87L661k275J896k604l4M110k936J45m75L22L245l585m40K082o52
$$ 2672 -1359 -1846 1815 -460 1436 -1168 -1202 2908 -28 117 -358 -36 3209 -376 -816 1266 614
753F14J742l120j83L554j718Mj880O21L528l102r60R80N01K177l314j005K748
$$ 614 2356 -764 -947 2607 889 893 -987 -366 3162 60 -900 80 581 2758 -556 -1561 1187
770A187m36L27k560N2L768k326p38q25J163K887l266j159J671R00N22k974p32
$$ 1187 751 1078 -1482 -1430 2338 12 -726 -1551 -388 2499 -767 -1926 -255 645 1167 -1807 -2539
787b539L719n00j297j872J330L024k098j827M61J986J420l193j262K562J372n02
$$ -2539 1180 680 -617 -2489 -1159 1865 -233 -2060 -1599 387 1807 -1386 -2648 -86 1286 784
803G84k947N55K950l37j943j113K131K360k321k031R19K520L75l162m98K947P71
$$ 784 -2163 -1608 1342 1005 -938 -2051 80 2440 119 -1912 -993 1527 1902 -1260 -1758 1189 1960
820A960j515k617J817K973j341k177m03K265K161l026j699J682K182m61l539M45
$$ 1960 445 -2172 -355 2618 1277 -900 -1303 962 3123 97 -1602 80 2262 1801 -1738 -1293
836a293L395M2k213j619J667K691j736k515M68K810L39l167j000K516J637j728
$$ -1293 2102 2144 -69 -1688 -21 2670 934 -1581 -1113 1697 2036 -1131 -2131 385 2022 294
852B94k682R56L290n18l035r26K699K014k477k499J808K704p99l025m00L174J415
$$ 294 -2388 -1432 1858 1340 -1695 -2621 78 2092 -385 -2884 -1076 1628 829 -2196 -2596 578 1993
869A993l086j784K157K384n03l440o5L383M72k213k194K358L074k340k194M45
$$ 1993 -1093 -2877 -720 1664 1161 -2279 -2344 1039 1511 -702 -2896 -538 2536 196 -1998 -1553
885a553K715J532l967j033K926J554j174l076R52L863j224k335j041K233L300
$$ -1553 1162 2694 -1273 -2306 620 2174 1000 -2076 -1124 2739 1515 -820 -1861 372 3672
900C672l608k033K257J426J032m312m27M422m52j547k535J368M233k632k444P36
$$ 3672 64 -1969 288 1714 2746 -1566 -1993 2429 1977 430 -2105 -737 3496 864 -1580 -844
916h44J591K541m147j798L650Q38m11l448l18M810j151k522q29J316L819l411
$$ -844 747 3288 -859 -2657 993 1831 1420 -2028 -2346 2464 1313 -1209 -2038 -722 3097 -314
932c14k604K439J153J397l710j488M696m14j216k247J06N048k426k615O91R72
$$ -314 -2918 -479 674 2071 -1639 -3127 1569 1155 -61 -2308 -2202 2846 420 -2195 -1504 -532
948e32L287l954k317L983M27L39l026j208N428j249k235n56L84M606k780l144
$$ -532 2755 -1199 -3516 467 894 1233 -1793 -3001 2427 1178 -1057 -1613 -1229 3377 597 -2547
964b547K343R23J912l294k469N149N5j049k465o25N562j847l002P33L66L879l112
$$ -2547 -204 719 2631 -663 -3132 2017 2072 1023 -1442 -2067 3495 1648 -1354 -621 -255 3624 512
981E12l555M145M10M50k679k161N686o26k508o99m17M937k486l738K545N77K407
$$ 512 -3043 1102 1512 1962 -717 -2878 2808 2182 -326 -1025 -1442 3495 1009 -2729 -184 393 2800
998B800k663l762N093mj213j761j150N439j349l771R52M03L754k346m347L693
$$ 2800 137 -3625 1468 1464 251 -1510 -2660 2779 1430 -2341 -1389 -986 2768 422 -3925 -232
1014b32J011N27k602k587N439Q0k579p70n61M946j558m136J952J048K162k303
$$ -232 779 1306 -1296 -3883 1556 1636 -943 -1713 -2274 2672 1114 -3022 -1070 -22 2140 -163
1030a63l624M135J281p49k362j387N481n38l461R3N68M094k184m030K639J508
$$ -163 -3787 348 1629 880 -1482 -2869 2612 2074 -1387 -1294 -726 3368 1184 -2846 -207 1301
1046A301J459l395k613N491Ok160j251o83N183j183m054R85J089L150k636l773
$$ 1301 2760 -635 -3248 2243 2249 89 -1162 -1845 3338 2155 -1899 -914 175 3325 689 -3084
1062c084L967N73M27k795k173N508l28k764r16qM806k068m148K394R79K034k755
$$ -3084 883 1456 1883 -912 -3085 2423 2095 -669 -1585 -1593 3213 1145 -3003 -609 370 2404 -351
1079c51l740N249Q51j903j673j500N654q09m072Q73N57L405k190m260L839J116
$$ -351 -4091 1158 2009 106 -1567 -3067 2587 1778 -2294 -1421 -864 2541 351 -3909 -70 1046
1095A046M08k605k851N577K66k733r02k90M796j108m494J724J124K604k394l913
$$ 1046 1454 -1151 -4002 1575 1841 -892 -1794 -2084 2712 1604 -2890 -1166 -42 2562 168 -3745
1111c745M522J217r28k090j795N234j55l248J58k02M211j646m418K875J066J379
$$ -3745 777 1994 1066 -1024 -2819 2415 2260 -988 -830 -1032 3179 1533 -2885 -10 1056 2435
1127B435k497l160M534J208k171j557q60M986q11m121J232Q96L054k327m111L690
$$ 2435 -62 -3222 1312 2520 349 -1208 -2068 2918 2107 -2014 -782 114 3168 841 -3270 420
1143D20J114Jk380k425N490J8k959m60n29M618j431m405K278P65K467k776l546
$$ 420 1534 1535 -845 -3270 2220 2238 -721 -1181 -1710 2908 1477 -2928 -650 115 2582 -194 -3740
1160c740M462P02j229j400j936N459o02l643O09j72M129j789m543L438Q36Q74
$$ -3740 722 1424 195 -1205 -3141 2318 1716 -1927 -1318 -1490 2639 850 -3693 -255 581 1455
1176A455j886l484N159P27k243j000j173N136p21m844K402J73K457j005m770M160
$$ 1455 -431 -3915 1244 1971 -272 -1272 -2445 2691 1970 -2874 -472 -299 2158 1153 -3617 543
1192E43J224o18j248l030N280K42l834J132q62L562k62n202K867J147J115j226
$$ 543 1767 1149 -99 -3129 2151 2393 -1441 -309 -1171 2391 2129 -3073 -206 941 2056 830
1208H30l979M416J065k296j83j928M083P47m888J681J96K259n49n087L725J478
$$ 830 -3149 1267 2332 36 -147 -2075 2008 2755 -2133 -452 -256 2003 1454 -3633 92 1570
1224A570r53o61l397M475J578l757L1m62L223R4m891K288J424O48n73m439L676
$$ 1570 617 -44 -3441 1034 2612 -1145 -1114 -1576 1647 1741 -3150 -862 562 1210 637 -3802 -126
1241a26J900k276l18j673L578J258m414P68M86K136M90m900K536J861n68o05k940
$$ -126 1774 -502 -820 -2493 1085 2343 -2071 -1303 -817 1319 1809 -3091 -555 1306 738 133 -2807
1258b807L185K118l135j17p87K743J243m485J026J694R37k9m471K766K339j816
$$ -2807 378 2496 -639 -756 -1543 1200 2443 -2042 -1016 678 1615 1586 -2885 -119 2220 404
1274D04m09j738K680J934l714RN27K007K89l907J046K541l78o95k814K260K490
$$ 404 -5 -1743 937 2871 -843 -834 -307 1700 1989 -1918 -872 1669 1291 596 -2218 42 2532
1291B532k313p65p36K330J149l541p2J689R02Ql242J161K618j139j169j370K169
$$ 2532 219 -546 -1282 1048 2197 -1344 -1416 273 1175 1183 -2059 -898 1720 581 -588 -1958 211
1308B11J726k635r00Q26J677O23l219K28K279J46j011j935J514K325j439k016
$$ 211 1937 -698 -1598 -772 905 1528 -1691 -1463 816 962 -49 -1984 -470 1855 416 -1600
1324a600l6J782J784k696r81J620J425m06k731O91K479l46j335j302J393K413
$$ -1600 -1636 146 1930 -766 -1747 -127 1298 892 -1839 -1148 1331 985 -350 -1652 -259 2154
1340B154j878j527P28J938O0k639K51J707P09p80k125P66K496p17j829n37K184
$$ 2154 276 -1251 -523 1415 1475 -1164 -913 794 1503 723 -1402 -636 1860 1143 -686 -1223 961
1357I61J016j787j503R23J954l59k145j77K196M39j715j301J353K032j191k000
$$ 961 1977 190 -1313 -390 1564 1205 -940 -1117 1079 1518 -197 -1498 -145 1887 696 -1304
1373a304K98J713Q80k109j108J681J492j098j803J61K112M2j723p57J385J716
$$ -1304 -1006 707 1587 -522 -1630 51 1543 445 -1358 -1197 915 957 -766 -1523 -138 1578
1389A578j572j781Q03J719q9j587o03J845J093j725j348Q53J722k4k276J98J680
$$ 1578 6 -1775 -972 747 658 -929 -1532 313 1406 -319 -1667 -814 908 884 -1392 -1194 486
1406D86N51j173j591J409J656r97j130m59K040O04k191j63R95J249l81k029N56
$$ 486 1037 -136 -1727 -318 1338 341 -789 -1248 792 1396 -795 -958 37 1286 905 -1124 -568
1423e68J509K11j052j478J622J590j444j250M59J545N23k338m34J685N11n32j863
$$ -568 941 1152 100 -1378 244 1834 390 -860 -401 1144 1667 -671 -1105 580 1091 559 -1304
1440a304J099J694p02j357q11J757J425k453l74O94J180J7k441N78K033l3j287
$$ -1304 -205 1489 787 -570 -1381 376 1801 -652 -1026 -332 848 865 -1576 -998 1035 1002 -285
1457b85j338J323J568j267q68l35J589R67k278m09J214Q46j45k113R97J317n55
$$ -285 -1623 -300 1268 1 -867 -1202 387 1354 -924 -1333 -119 727 582 -1531 -534 783 228
1474B28m81j148Q29K271k100l37k19J348R02k402Q4J785j56J60k385R68K041j120
$$ 228 -253 -1401 -572 1699 -401 -738 -957 391 1293 -1109 -1025 760 604 764 -1621 -653 1388 268
1492B68j83r96J050J811k172k97N76O94O63k274L41J677n83Q4j657O75K229j872
$$ 268 85 -911 139 1950 -222 -519 57 751 1414 -860 -519 1158 575 659 -998 -323 1906 34
1510C4k24k77Q97J379k325j85J241O8O54k574K95K425j331J00j088M34K255k116
$$ 34 -190 -467 430 1809 -516 -701 540 608 1262 -1312 -1017 1408 77 177 -911 -477 1778 -338
1528c38l60K27N84J580k825l24J948p68R43j674k57K651j832l8m01M70J986k205
$$ -338 -698 -471 113 1693 -1132 -1456 492 -276 667 -1007 -1264 1387 -445 -483 -884 -414 1572 -633
1546f33n95J080k41J435k316m8K486j356O17j465MK686k284K50K22j27J809k190
$$ -633 -1228 -148 -389 1046 -1270 -1318 1168 -188 429 -1036 -1032 1654 -630 -380 -158 -285 1524 -666
1564f66n76K062p29R08j522l95K479j383m4n48j59K250j750o13J059n71J576j736
$$ -666 -1242 820 91 999 -523 -918 1561 178 134 -414 -573 1677 -73 -686 373 -198 1378 -358
1582c58n34K443j093K13r52p07K606j550l93L40m50J825j623q60J711o72Q19j222
$$ -358 -892 1551 458 671 -281 -988 1618 68 -325 15 -435 1390 -233 -1093 618 -54 765 -457
1600d57q21K253r83k66K33q47K313j535j104J150n72J687j307j466K651q55k56
$$ -457 -1278 975 -8 -274 -41 -888 1425 -110 -1214 -64 -636 1051 -256 -1722 929 74 -182
1617a82l83r18K096l34p72K53j68O13l17j013J179n19J081l22j335L96M14N26
$$ -182 -565 -1483 613 279 -493 -240 -408 205 -112 -1125 54 -465 616 294 -1041 -645 -231 295
1635B95l18k76J050n78q53k03J039M43p79o84J315j18Q4l44o75J653n28j69k54
$$ 295 -23 -299 751 173 -680 -883 156 599 -180 -864 451 333 417 73 -602 1051 523 354 100
1654A00m83J175l03p58L70J82N55q34q19J415j13K56q61k76J181k77o66l04K61
$$ 100 -383 792 489 -269 101 283 838 4 -815 600 487 743 -118 -394 787 510 -156 -460 -199
1673a99J058n78q84K50N04M77r15n96Q85J68k66n11n7J299n01n05j3J67O50n45
$$ -199 859 281 -603 -353 151 628 -287 -883 2 170 -96 -607 -664 635 134 -371 -384 -217 433 -112
1693a12o85P83J9J56n77o12J320j17l79k87l2J120o15n35J34L66Q51j043l97J029
$$ -112 -797 -14 5 161 -416 -1028 292 175 -204 -491 -523 597 -18 -553 -419 -53 798 -245 -642 387
1713C87j30J09o56k71J566m15m74l08k29J446j033k28N19j49N54o92n90J199r0
$$ 387 257 366 -290 -561 1005 590 116 -192 -421 1025 -8 -236 283 134 688 -4 -594 605 515
1732E15p0m33n12J453p43n43L2O0J580j308o17P66K2K89o42m66J182l49l61k5
$$ 515 445 12 -500 953 210 -333 -301 -241 1339 31 -586 180 202 491 -151 -617 565 216 -145 -170
1752a70o76J631n91o83N80o36J032n38j052J090J16L12p40n59J340n86l38K02
$$ -170 -846 785 194 -489 91 -545 487 -51 -1103 -13 103 415 -325 -884 456 -130 -468 -266
1770b66m37J170m24p44N87k60J096q39j057J628j62l43k13n40J233rn25J67n27
$$ -266 -703 467 43 -701 -114 -374 722 -117 -1174 454 292 -51 -264 -804 429 420 -105 62 -465
1789d65Q29j3j109Q96N2J92k17q30J085K28l87l04k73J087k1j160M02j22Q46k13
$$ -465 364 351 -758 138 190 382 165 -665 420 648 261 -43 -316 771 750 -410 -8 -130 716 503
1809E03j061O83L34k44k25p72J558N7r80j9k27P10L25j077L40J28M40m13j170
$$ 503 -558 125 459 215 -10 -782 776 833 -147 -166 -393 317 642 -435 -95 33 473 60 -1110
1828a110Q53O70l73l35r0K80O78j079mJ11P73j06j179N68L18Q2k28m77M89P30
$$ -1110 -257 413 40 -295 -385 -105 573 -506 -510 -399 374 268 -911 -343 -25 57 -171 -648 -159 571
1848E71p60l92m8R17L63j096R4N55O6k79n62J31J052l00m67m48N96O55p18m69
$$ 571 -189 -581 -629 288 651 -445 -351 204 270 -9 -571 -440 612 312 -155 -603 -7 648 -70 -539
1868e39M04N67M48j305o5J084n4l30p58O32O33n60l32k5N46L98p70n98O19O49
$$ -539 -135 432 880 -425 -490 594 540 210 -548 84 717 157 -175 -200 346 744 -26 -624 -5 644
1888F44N5p79n07J355m4p82m89M28P01k97r49M98L69j06k61l27N71N38p01n09
$$ 644 699 -80 -587 768 724 -58 -547 -119 582 285 -664 -166 203 97 -164 -491 80 618 -83 -592
1908e92L4O25M01r74j32O45L59k06q02K04N90L6l58o31R13M00j024k20M41N97
$$ -592 -558 67 468 -506 -638 7 366 160 -642 -438 152 188 -170 -801 112 512 -512 -732 -291 306
1928C06K28r82K8M65K55r2q54L57Q24k50n99r0M59O44r24k8K05P49k05q61J39
$$ 306 534 -448 -420 45 300 208 -646 -289 535 285 -314 -404 55 699 -225 -253 -48 701 496 -365 -226
1949b26J027j87n09m47O27N33m69m01j91O25L67q57l53R45Ok75p51L98P24k95
$$ -226 801 614 105 -342 285 818 349 -52 -243 382 749 -108 -461 484 490 215 -536 -138 586 291
1969B91l08m95O23P57j017n79N13O55Q1j254m2Q35K99o18o46O94O09k09m84m40
$$ 291 -17 -512 111 868 -149 -728 -215 440 521 -733 -775 60 359 -259 -905 -211 398 189 -295 -735
1989g35P56M38o67l44J99P25J6r02K6P25O5m33o23Q01M68p24m52K15Q72K55j127
$$ -735 21 459 -208 -552 -353 372 388 -514 -488 237 302 -131 -754 47 515 -209 -661 -446 426 681 -446
2010d46J46M83N7J94j084L09R09l22m07m87Q15P86j135j08J59O27L11j015K29
$$ -446 -300 183 240 434 -650 -341 568 246 -161 -648 167 953 -182 -290 -131 496 807 -208 21
2029B1L64O6J03r89K37R45p75j22j73L78R88j272o8K52O11k50j304R55O67o14
$$ 21 385 451 554 -435 -198 747 -28 -150 -323 55 1043 -229 -297 -45 566 316 -988 -33 634 20
2049B0R7p37P75O61j029N2K4R1R63j723L82L66N2M60j482M94J342o75n74k45M75
$$ 20 117 -620 155 816 -213 -161 -137 -46 917 -806 -424 -58 -6 454 -1028 -534 808 133 -441 -686 -211
2070b11J281j610L2K03N89J97j110j08J318l70j21n67Q1J629j812N05pL64L69
$$ -211 1070 -540 -508 -305 284 481 -629 -737 581 211 90 -477 -396 1233 -579 -74 -81 283 652
2089F52n04l75N82l52M78p19J03J102j323L41j76K35J013q04p21Q92j71L73j069
$$ 652 148 -227 355 3 481 -238 -135 967 -356 -15 -191 44 1057 253 -468 424 253 626 -443
2108d43Q8M92L91M0r37k27J842r82n96l53M12J717j964k14J163n90J201j274k82
$$ -443 -355 137 528 568 -369 -596 1246 264 -332 -685 -273 1444 -520 -734 429 -161 1040 -234 -516
2127e16J440m33m79k65o96J761j190n49N65n3J106j043j063K229m72n36m21k15
$$ -516 924 491 12 -253 -949 812 -378 -927 -362 -415 691 -352 -1415 814 342 -194 -615 -830
2145h30J729o73j247M91l1J283k61j188L36M39o2k10j001J840m79n34L11p70J584
$$ -830 899 226 -1021 -530 -561 722 461 -727 -391 48 -14 -224 -1225 615 136 -398 -87 -857 727
2164G27j70j012k01P87O09j96j154N42O02J29n27j037J914n47q19q1l87J554j93
$$ 727 557 -455 -656 131 740 544 -610 -68 534 663 136 -901 1013 466 -353 -434 -821 733 540
2183E40j573O81Q24J11n33q65J183K78J47q02j337J367J461j612l92n4J596o15
$$ 540 -1033 -352 472 583 50 -815 368 646 793 -9 -1346 21 1482 -130 -522 -576 1020 405
2201D05j160Q07M09k73n60o47J510M65r39M7j004K151q41j891P42O32K42j212
$$ 405 -755 52 461 188 -372 -1019 491 956 17 64 -940 1211 370 -1521 -779 -147 95 -1117
2219a117J49J229J87o10k76p6J046l93o9p31O08M60p20l01K95M67K95k35r31J143
$$ -1117 -968 261 448 -162 -438 -514 532 139 70 -661 -53 407 -313 -614 -319 148 443 208 -723 420
2239D20R7q01j9R0R52L3q57k2L42M39n12m97J36M78R3l76p07J337J02n55l59j57
$$ 420 517 -284 -303 -213 739 772 -85 -107 235 674 162 -335 -199 279 372 -4 -711 626 728 173 -186 -343
2261c43J082J24j095l30R58K57n02q41N66P51o86k30k64P09M33j040L4L87L80
$$ -343 739 863 -232 -562 396 653 151 -690 -124 627 -59 -289 -553 156 589 -451 -417 -30 350
2280C50m71o27K70Q26O4q36k98O17O21l93n83J08P38J07r23j83L25R74p98p63
$$ 350 -121 -748 -478 348 412 -424 -722 -105 516 123 -460 -352 386 493 -430 -613 -288 686 -112 -875
2300h75M95P01Q3o93k85O40M15n47n63N52P40j61q75n1P00L98n59p54P32M53j53
$$ -875 -380 321 404 -289 -574 66 481 -66 -629 -77 663 502 -373 -424 276 674 115 -639 93 546 393
2321C93p23l5P04J13o60k13N43O87m31q33N47L15K66o77k35P13J0n12l52Q9J027
$$ 393 -330 -365 339 452 -208 -421 122 809 378 -455 92 407 673 -4 -239 474 484 -28 -380 -291 736
2342G36m67n25j04L86L96k60q29N51L66J90q02k58Q24J81o69k62M27M65j58o33
$$ 736 269 -256 -360 26 422 162 -667 -116 250 440 -362 -620 204 385 -284 -546 -119 346 188 -445
2362d45j09P20K89p28n18P18M37k75o70K36Q59j67o76k96Q69O5l50p37O50L48
$$ -445 -554 166 455 -273 -791 -73 364 89 -581 -345 514 347 -329 -625 244 309 -41 -778 -128 220
2382B20Q0k86l70M68M79n69m95N24K34J99p61m6P81L19p26l54J54Q55l04o64Q1
$$ 220 300 14 -356 112 591 22 -473 51 285 484 -277 -323 458 777 51 -303 -149 706 402 -262 -181
2403a81L03N12m40o88N73L62l07l74J17N64J32q34q9J99O93m81o69M07O02K6o88
$$ -181 122 634 194 -494 79 441 134 -240 -123 441 573 -261 -350 -151 542 61 -608 -201 401 427 -261
2424b61j89L80L72m15k60J17N16N7p49J16R0P53n80o17L71N01N0k44o76O89L88
$$ -261 -450 -70 302 -113 -373 -256 260 317 -432 -316 -226 527 -53 -670 -299 202 252 8 -668 21 409
2445D09q51p4K38P73r4r05p9Q22K3l70m49L97M95m96j33J79M08L22o21m52N26
$$ 409 -442 -516 -278 495 401 -504 -583 239 262 -108 -557 -160 335 -161 -294 -115 293 615 -6 -458 68
2466F8N66p2j053K86Q06k65l40j13L52M00m85j64NL72J7n90R8M67j9j51q57P55
$$ 68 634 562 -491 -205 601 336 -4 -117 235 635 150 -14 -9 363 380 -210 -112 355 336 185 -672 83
2488H3M39k22l87l85M16M89n05k89J94L51L80j307L83Q06l93k21m84L61O34n58
$$ 83 522 300 -87 -472 -56 433 -72 -361 -167 184 564 -743 -360 446 53 -168 -652 -291 343 -215
2508b15k41K37L88J4n39k44O44R6N3p32K55O59R3n43m58M11O33o43k75K11L86
$$ -215 -456 -219 169 183 -356 -600 44 140 193 -539 -284 375 468 -75 -533 -122 511 -132 -407 -196 190
2529A90J94p99p8N41K49k04m15L24O22l72m99l8N91j7m41k36N78L70l43o43J67
$$ 190 384 -415 -493 48 297 93 -322 2 624 252 -247 -285 306 289 -152 -388 190 560 217 -426 -259
2550b59O80j67k80l44M90L25k39l80r2M56M26q15O9K77J29j6o55m0O81n5n03k29
$$ -259 421 254 -26 -370 120 445 206 -174 -266 190 616 -199 -130 147 276 260 -395 -435 246 191 -312 -541
2572e41N30M22k74m40l59R15J3q63K31M31K32k82m37K59M43j63k34j82M05Q0m15
$$ -541 -11 411 137 -303 -662 253 266 -597 -366 65 297 15 -422 -163 280 117 -117 -299 106 186 -229
2593b29l90L74M77K8p10L03L22L5k70j57K74J83q1m22j11N41K85p86j85O50K01
$$ -229 -619 -245 232 260 -450 -147 175 210 -60 -217 57 240 159 -263 -374 167 452 -334 -519 131 332
2614C32J70r48M86L61L0m00n64O76N2n9J4n7L10Q1j006L46L37J63q5o26J47P65
$$ 332 502 -446 40 401 431 31 -533 143 195 136 150 93 403 484 -522 -176 161 324 239 -387 -240 525
2636E25o76K21l89N59K61n64k44j25P13q4l90N3M39k28O3n35K00N22o21j40K45
$$ 525 -151 70 -319 240 501 -63 -307 -432 281 197 -193 -140 299 71 134 -401 -201 321 -300 -440 -195
2657a95J55M62r31K75M44k50J84q78N16O25n00j72k1L51L36l11m9M6L0M59q55
$$ -195 -40 422 -509 -234 210 -40 144 -734 -218 407 -93 -265 -286 65 401 90 41 87 117 576 -279
2678b79j4L58J39J14o30o5Q98o66r3R0J63K64m06J1K33j25L40o79L7P00l24K70
$$ -279 -293 65 204 318 -312 -377 521 -145 -238 -148 15 279 -127 -116 117 -8 332 -347 -310 390 66 336
2700C36q64M36R57n81o01O62l43O77p52k04O51k34K24j104K20R76o75L00l80r
$$ 336 -528 -92 865 284 -317 345 2 679 -73 -277 374 140 364 -740 -520 456 -219 81 -299 -308
2720c08Q68r40j8R86o53L77q81P9M22l86L68p7L42M20n60m54L59p2N64j49r66
$$ -308 560 -380 -398 588 -65 312 -569 -490 -68 -454 -86 -163 179 599 39 -415 -56 -128 436 287 -679
2741f79M78N90R1j301R77L86p42R6n64P98j17Q1l93N46m20R46p83j96P70Kq80
$$ -679 -201 389 480 -821 156 542 -200 -104 -668 130 13 94 -299 247 -173 773 -10 -206 564 566 -314
2762c14j77L77M63L51j241L03Q10om03j22j04J81O30r57Q7O08j38j61j91n86R86
$$ -314 -491 -114 349 700 -541 -238 572 566 163 41 -63 118 748 -209 -122 486 348 187 -4 -590 396
2783C96p81J46K12n4Q6m53Q1l3N64K6m23m9P05n15m41J77M41K30J57r94M59j73
$$ 396 -385 -239 -27 -81 5 -448 -367 -400 164 190 -233 -282 423 -92 -533 -356 85 315 472 -522 -63 -236
2805b36K26J46k36L37L4n48j29j35Q23j10m91kK48J63k21k96L10K62K88p48R4
$$ -236 -10 136 -100 237 271 -277 -406 -541 282 172 -319 -321 -73 90 -131 -427 -117 145 433 -315 -221
2826b21N18q6j48k75K40K65l26k1j69L73J44m03k8L65j05L83o13q3N07J24m86
$$ -221 297 211 63 -212 28 293 -33 -54 -223 150 294 -109 -137 228 123 506 -107 -190 317 441 -45
2847d5j4J01J78j51k42M00m8J60m08k41K88L84j25n49J80K55J67k08l25L42L94
$$ -45 -59 42 220 69 -173 227 179 339 -69 -310 -22 362 237 -312 -132 123 290 82 -243 99 493
2868D93m31l45L00j11K44l40n4L62M8n23J09J29M89m67j55J31L87R7m71j39K13
$$ 493 62 -283 17 -94 150 -190 -244 118 166 -357 -248 -119 370 -97 -252 -121 266 363 -108 -247 -34
2889c4J34l42j64K73K02Ql62j73L06K75j34k66L3L31J33m01q9L60j0j44j18j41
$$ -34 100 -242 -406 -133 69 77 -285 -458 -152 123 -11 -277 -244 87 220 -181 -270 90 80 -64 -182 -323
2911c23O61J5m11j61M37k5r1l89J16M12j27k12k6K68K69j94j54L8K09j67k79J57
$$ -323 338 353 -58 -219 218 193 102 -287 -171 241 114 -98 -124 144 413 219 65 103 312 145 -134 23
2933B3J56P3j08l48K70J79j05j69n2RL60k59m04L74K65n6o24K93L78Ll79j13M2
$$ 23 179 252 144 -204 66 245 140 -29 -81 -72 288 29 -375 -1 264 208 -416 -123 255 258 -121 -234 -192
2956a92K63p0m06L04LQ0r7k19K76K40l22j71j17O10j10p3k5j18L01l83M9J91R6
$$ -192 71 1 -405 -101 -98 -18 -115 -334 -58 182 -140 -311 -428 182 72 -1 -26 -144 157 -226 -177 14 110
2979A10p0p7l50N94J61m78N5j12N82l26k09J59j2L76k02l76P3M30l50j1n6K61
$$ 110 40 -37 -387 207 368 -110 -55 -167 415 89 -120 39 27 403 201 -175 -102 328 -22 -33 -89 172
3001A72K27n15Q0n4K03j35j20J90J45j73k34k28M53M42n55Q5k06M30j07l84J75
$$ 172 399 -116 -36 -90 113 -22 -142 48 193 20 -214 -442 11 453 -102 -17 -223 207 100 -284 -109
3022a09K44m3J65n31J79M1J76j65k25J28L78l47n7K63L9O2r30O87M37k50k95j22
$$ -109 135 92 257 -274 -95 -54 122 -43 -268 -140 238 -109 -166 97 136 198 -732 -45 392 142 -153 -275
3044b75N6O56n48J40k70K74P31o15r9k6l27R85r74l86Q15q61L55p98J356M25j68
$$ -275 -219 437 -111 29 -241 33 764 149 50 24 -303 682 -292 -678 137 -724 -369 -1167 189 614 446
3065D46n78J12L68l48l99q1J129l99q8j44k10O31K36j084R2K95J82J32k65Q7L53
$$ 446 -132 -20 348 0 -399 -480 649 250 162 18 -192 439 675 -409 -317 -22 160 292 27 114 467
3086D67j40k82j96O12m95J41k10p4K22L3r1j92L87k0k22j51k2L80m5k69J5j14
$$ 467 327 45 -151 461 -34 107 -103 -177 45 78 -13 -205 182 162 -60 -211 -233 147 102 -167 -152 -266
3108b66L85m08p9L85K28j58j65J17J57j22l9k62L61J36n34J20k7L66k80mj63K43
$$ -266 119 -289 -368 17 245 87 -78 39 196 74 35 -227 134 270 -264 -144 -171 195 -85 -89 -252 -9
3130iJ80l04k8L78j05j09l41K79K43M5k28k83L26L14J26q60L07K85J4l51J31j36
$$ -9 171 -133 -161 217 112 3 -338 -59 184 229 1 -282 44 358 484 -376 -69 216 230 -121 10 -126
3152a26Q21m70n42J95M05O7k87l69M78l6J13k29k38M86n1o13L1L61j8P8n46N04
$$ -126 695 225 -317 -122 283 350 63 -306 172 136 249 20 -218 268 217 -396 -365 -4 -22 56 -490 14
3174A4k2p3L01p92M42M39o60K48o7j27N03n46k04P15j88J87l33M23l97L21m22
$$ 14 -8 -81 220 -572 -130 309 -351 -103 -170 -297 206 -340 -544 171 -17 170 -163 260 -137 184 -238
3195b38j20Q02k32k01j70J85O27j56m59N8J31J75p50M03J0K74l92J51l56N21n2
$$ -238 -358 444 212 11 -159 26 653 497 38 96 227 402 -348 55 65 339 -53 98 -258 263 211
3216B11O0l10m03J33N76m70M95%r7k92j19J90N31q45N74lJ88N9o28j67M18M04
$$ 211 271 -39 -442 -309 267 -203 292 292 195 -97 -216 -26 505 -340 234 231 419 478 -150 -317 101 505
3238E05n66m43Q83q3n87K77J8k6J49n6K3M05j74j34j58m30N95K87j80l77j37P21
$$ 505 -61 -504 379 296 -291 -14 4 -22 127 71 94 499 325 191 33 -397 198 485 305 -72 -209 512
3260E12q75O0N4J60J81L2o26M38M34l87J15j89O05l16j47P0l24L49k94j11O3L58
$$ 512 -363 -303 -249 -89 92 124 -502 -64 370 -17 98 -91 514 198 51 121 -203 146 -148 -259 -196 162
3282A62j62j10K8M33m7m37n0R0P53r62O0L48lJ14rk87K93Rr3l9l04L46j30k35
$$ 162 0 -110 -82 351 304 -133 -183 -93 660 -302 -242 106 103 217 208 -79 214 223 130 91 -213 133 3 -232
3306b32L89o3K06j72l32L12j58J83k31j27K52J39J35k19m31P42l80k84K02N6K24
$$ -232 157 94 300 128 -204 108 -50 133 -98 -225 27 166 301 82 -349 393 13 -271 -69 -13 211
3327B11k47l52L61J29j62M5k10L29j50J12p0k20N18q1k92k7p1L71j43m45P51k89
$$ 211 -36 -388 -27 102 -60 -15 -225 104 -46 66 -4 -224 294 213 -79 -106 -177 194 51 -394 357 68
3349F8J32m56J33K60M9l02r7L67N3j41l44Q6L46Lk78j42M37O4l43M1KQL01l67
$$ 68 200 -256 -123 137 186 -116 -213 154 207 66 -278 -192 154 157 -121 -263 174 238 -105 -64 -62 -54 247 -120
3373a20K15L6K08l36l93K58L86k14k70M42o8J27m21m6K18J65j51r6j95L19K54
$$ -120 95 131 339 3 -390 -132 254 40 -230 212 144 271 -150 -196 22 187 36 -60 -255 64 318
3394C18l03M1J22K64l04k78P9P7J08k88J76R1k85N7M1q0oK74k68N0R4J85j64k31
$$ 318 15 56 178 442 138 -140 -61 16 124 -164 12 103 -182 -125 -84 -164 -170 104 -164 -114 -20 165 1 -230
3418b30j15M05J38n00o2J86M68l55j29J38K42j26m43K84J08O9k6L5q3J07J45q2
$$ -230 -345 60 198 -302 -364 -178 290 -65 -194 -56 186 60 -383 -99 9 78 52 87 4 111 256 174
3440A74l77L35PJ06k91R5K47k62j89J49M0K34l18NR8j6k5l6k12N46p0j76k23K98
$$ 174 -203 132 139 245 -46 49 296 34 -155 -6 34 268 -50 -45 53 37 12 -24 -236 310 240 64 -159 139
3464A39OJ12l76K64p9N5m99K26K51K42j47n36L52J07M2l58J28J01J35k03j66J05
$$ 139 145 257 -119 145 66 121 -378 -152 99 341 194 -342 10 117 159 -199 -71 30 165 -38 -204 -99
3486i9K51j47k14oK89m8j82p6N2L30j84k14M1K56K88o49K05K31J45k37k65K14
$$ -99 152 5 -209 -215 74 26 -156 -232 -180 150 -34 -248 -207 49 337 -312 -107 124 269 32 -233 -19
3508a9L02l61l3j54M22K34m66q6M76m4J0l32%K47L7j55k82L84O3m6k25j32L32
$$ -19 283 -78 -111 -265 157 391 -75 -161 315 271 281 -51 -51 196 233 78 -204 180 243 197 -28 -160 172
3531A72Rl25K2J45N8j82J02M4J7n7k98J04J67J84L0l75K94J78l37l7l71K57K17
$$ 172 181 -144 -122 23 81 -101 1 45 62 5 -293 -189 -22 162 192 -183 111 289 -48 -85 -456 -199 18
3554A8k50P0K3M40k82j19J4n6J51k59k26M59J37n8J73m33L51K3m79K78J28J64
$$ 18 -232 -162 -139 301 19 -100 -86 -142 9 -250 -476 -17 120 62 235 -198 153 176 -303 -25 103 267
3576B67k26l07J94K13M7k81k32L46M04l15k78J69k24K46N9j29Q4K16k57r2q6K46
$$ 267 41 -266 -72 141 188 -93 -325 21 425 110 -168 1 -223 23 82 -47 37 253 -4 -96 -182 64
3598F4R4m3j31M24j60l38K00JK9K43j32K10m26n9M46m78K95K22n83M21m77M41
$$ 64 158 115 -16 408 248 -90 110 111 140 383 251 461 35 -24 422 -56 239 461 -122 299 -178 263
3620B63J43o93K40K10j58J63k51j76L39K73m5l62L04j88k28j03k77P73m0m85K44
$$ 263 406 -287 -47 163 5 168 -83 -259 80 353 308 -54 250 62 -166 -269 -546 227 187 -298 -54
3641e4J0L98j05l62K62L08j69J62q08N01l15%j33J99M03j09n20K17M2J15k5k19
$$ -54 -44 354 249 -113 149 457 288 450 -358 143 -172 -172 -305 -106 297 188 -332 -115 -73 42 17 -202
3663b02N47l54J2J98k7j72J52k06k78K06M12j13k46K03K78m10j81J16j43Q2N6
$$ -202 345 -9 3 201 174 2 154 -52 -330 -124 288 175 -71 132 410 0 -181 -65 -208 -126 -70
3684g0lO6J60k3j10l96J74J24N2l56J96O07o28K14J27m51M05j81J02p61O78O51
$$ -70 -73 -7 153 130 20 -376 -202 -78 -26 -382 -186 421 -207 7 134 -317 88 -93 9 -752 -74 577
3706E77l52J56J30n69n8J15K76l67N01p72N42j24Q4r0m4J1K14n01O1L47p1P2M7
$$ 577 225 381 511 -58 -116 -1 275 -92 409 -363 179 55 139 49 5 16 230 -271 -210 137 66 138 185
3729A85l79J51K74j93j06m1N25k88m85P4M65K86l75j56K7P2J35k78k43M36K81
$$ 185 -194 -43 231 38 -68 -109 416 128 -357 -283 182 468 93 -63 -36 36 171 -107 -350 86 367
3750C67m61J05j03L87k1k59J8O2R8O1k91J31o1Q8k59o6J78K69k69mM2P1q3k61
$$ 367 -94 11 -92 295 274 15 33 95 193 254 -37 94 33 121 -138 -204 -26 243 -26 -30 12 83 0 -261
3774b61k4L55N2k09j94J79J32j72j50O2M59O2n19p3M27k21K68l08K58r5L1j39
$$ -261 -285 70 122 -87 -281 -102 30 -142 -292 -230 229 291 -228 -301 126 -95 173 -135 123 28 59 -80
3796h0L0J90j5r9k53%L32k9j40N2K66p6k04j7J34J21k46J36j37J75r7k8r1K20
$$ -80 -50 140 125 26 -227 -227 105 76 -64 -12 254 178 -26 -43 91 212 -34 102 -35 140 43 15 -76 144
3820A44j18K17l66P0J99j89Kp0L17J30k83k51J23J25P1n8l72M05k4J8k16K4M25
$$ 144 26 243 -123 -53 146 -43 -41 -111 206 336 53 -198 -75 50 121 63 -309 96 72 90 -126 -102 323
3843C23L7m84J7P2K71k39j87K22J8K9k69J75J07Lk33j01O3J90l1k1O5o9J84k64
$$ 323 360 -124 -107 -35 236 -3 -190 32 50 79 -190 -15 92 95 -138 -239 -176 14 -17 -38 27 -42 142 -122
3867a22J63k19K22Np9j18K64n5j30O0J30l06M33l06k1K64k70l7p2J72m5p9L54
$$ -122 41 -178 44 49 -30 -148 116 61 -69 -9 121 -185 248 -58 -79 185 -85 -122 -194 -22 -67 -146 208
3890B08j79j5P4l43K34N3j50L17l26j8M64q9j30j73L65l06o5o3O5J00L7q2j14
$$ 208 29 14 88 -255 -21 32 -118 199 -127 -145 319 230 100 -73 292 -14 -79 -142 -77 23 60 -22 -136
3913a36m3J64kj53K3L70j2j81j78K16J73j35k19L44j74k60j11K46J23L86p35J57
$$ -136 -179 -15 -17 -170 -147 223 211 30 -148 68 241 106 -113 231 57 -203 -314 -68 55 441 -294 -137
3935a37J31R6l1j52J23m7L85n85J22J68j79j2j96L28K14l9k44k08M85k36r8Q9
$$ -137 -6 90 59 -93 30 -17 368 -217 -95 73 -106 -118 -314 14 228 189 -55 -263 222 -14 -112 -23
3957b3N2J36j32j00J71J36k4n09J37L3K91k8k81J79P5L2k65j51L24K20r6j93K02
$$ -23 29 165 33 -67 104 240 216 -293 -156 -123 168 140 -141 38 113 145 -120 -271 53 273 177 -16 186
3980A86k32K35j27j97L99j11j22k70J96L73l23R2l32K28j3L6r7k2K49l8r2k66
$$ 186 -46 189 62 -135 264 153 31 -239 -43 330 7 99 -233 -5 -18 18 -79 -101 148 110 18 -248
4002b48M9J61J25o7j3j69L70k81j26J34L22k41j47N6J86n2l45K9K77J86l2k22
$$ -248 -199 -38 87 20 7 -162 208 -73 -199 -65 257 16 -131 -75 111 59 -286 -257 20 206 174 -48
4024d8K52M7l88K04j38O0O3n6k35K17K73l22j1L78j85k75K39j28L16j86N9j22
$$ -48 204 251 -137 67 -71 -11 52 -4 -239 -22 251 -71 -82 296 111 -164 75 -53 263 77 136 14
4046A4K01N8j01k07k84L47K27k26k62K10M4N2k73J95Q1k70J47L7k7K44N0k57J43
$$ 14 215 273 172 -35 -319 28 255 29 -233 -23 21 73 -200 -5 76 -194 -47 -10 -37 207 257 0 143
4069A43K3m5j95j82K45K24k50M5j39L4J51L54l22j78Q1R0m34J26L41J1k62J41
$$ 143 166 121 -74 -256 -11 213 -37 8 -131 -97 54 408 86 -92 -11 79 -355 -229 112 123 -139 2
4091BJ05k3Nl66L64P1j82N6k32M26j73M6l71L31J19j48P5j52J12K33l76N5j8K74
$$ 2 107 84 89 -277 87 158 -24 32 -200 226 53 99 -272 59 178 30 105 -47 65 298 -78 -23 -41 233
4115B33j58j42J49k87J9L34l77L19j93K99m68P3M54k48K2k49K90j62l4J00N5L93
$$ 233 75 -67 82 -205 -186 148 -229 90 -103 196 -272 -199 255 7 29 -220 70 -92 -126 -26 29 422
4137D22j14m75R7Q3P6Oj42p4L96r6o8j54Q1K8k06K10j52K10l08K28k28L60K38
$$ 422 308 -167 -70 13 89 95 -47 -121 275 179 111 -43 38 66 -140 70 -82 128 -180 48 -180 180 418
4160D18l46k14J33J50j85K03m15K91K62J78q70K32om99M69R8J69N1k65J3j55O23
$$ 418 72 -142 -9 141 -44 159 -256 35 297 475 -395 -163 -169 -668 -199 -101 68 119 -146 -133 -288 335
4182C35k7k78P9K15m50K53j19R0J03J36l53J17n6l57N38k67L60m76J60O0l04M73
$$ 335 308 30 109 324 -126 127 8 98 201 337 -16 101 45 -312 226 -41 319 -157 3 63 -241 232
4204B32l49Q00q01L73j81j15k21Qk6K53j79NK01L82l37k09Q28n42J47o80L15k5
$$ 232 -117 683 -118 255 74 -41 -262 -254 -280 -27 -206 -201 0 382 45 -164 664 122 269 -411 -96 -121
4226a21O84o54j72k68K87J16o71Q33O87o37RK44j29k32O21j235P55M96l53N2n07
$$ -121 563 -91 -263 -531 -244 -128 -799 34 721 84 93 337 208 -24 597 -638 117 613 260 312 -195
4247a95Q35j314J012n21J6P4o71Q89j7L45J10l49l75L59o84j47K61P03p14P28
$$ -195 640 -674 338 -183 -167 -93 -764 125 108 453 563 214 -161 198 -486 -633 -372 331 -383 345
4267C45j0k57N98l91M1r26K83L57J50M01m28J29k17M0l4j77N10l72n06M91r3k9
$$ 345 335 78 676 285 326 -600 -317 40 190 591 163 292 75 115 81 -96 414 42 -464 27 -66 -95
4289i5J11l24L84n95M78J8l85R80m43j89p0L44K19n71nM29k26K15L5k25Lr3k26
$$ -95 16 -308 76 -519 -41 -23 -408 572 129 -60 -130 214 433 -138 -143 286 60 275 310 85 88 -5 -231
4312b31K56l3j58L65J6n06J04oO79o65J45J24J74k99n7K83J66m14R7j56JM5j40
$$ -231 25 -8 -166 199 215 -291 -187 -193 486 -179 -34 90 264 -35 -92 191 357 -57 40 -116 -115 -70 -210
4335b10J78pJ12J81J55n28K22q1mk38J04J13M9r5L7J59k4ml18J14N1K3j37K34
$$ -210 -32 -39 73 254 409 -119 103 22 18 -220 -116 -3 46 -49 -12 147 123 119 -199 -85 -34 -11 -148 86
4359H6m7J1p7j89J00r6L67j12j27J46j52j21J77k7P7r3j14K68k8j35m7k0K12o6
$$ 86 39 50 -27 -216 -116 -212 155 43 -84 62 -90 -211 -34 -61 16 -77 -191 77 49 -86 -133 -153 59 -7
4383gK4j2j40L71k43p4n3J95m3l5R6k55K28l05K96N2L0O9m46J01K82j38q1M2M8
$$ -7 17 5 -135 236 -7 -81 -134 61 18 -17 79 -176 52 -253 43 95 125 194 -252 -151 131 -7 -88 -46 2
4408BJ93j52k40M72j94j53K6L3q6K55m03L29k09L60l3j93j40O8J40o1j8k00M97
$$ 2 195 43 -197 275 81 -72 -46 -13 -99 156 -247 82 -127 233 200 7 -133 -65 75 14 -4 -204 293
4431B93l52J60j42R8J27l25L3M5L93l89r1rK04P0j32K55j23k54J75l49M04o3K6
$$ 293 -59 101 -41 57 184 -141 -108 -63 330 -59 -150 -159 45 115 -17 238 115 -139 36 -313 91 28 54
4454E4l8r7o1J58L3j25j54K55k3j96P8Q8L6j19L5K81J6j35J33k41M2j53J59j51
$$ 54 16 -81 -142 16 49 -76 -230 25 2 -194 -116 -28 8 -111 -76 205 221 86 219 -22 20 -133 26 -125
4478a25j46J56M1r7J51J66k4J27j72j90K52j72J61l28J74j42J08O2J24Q6k40j3
$$ -125 -271 -115 -74 -171 -20 146 122 249 77 -113 139 -33 128 -200 -26 -168 -60 2 126 212 -28 -41
4500d1J62o1j0O5k0j05J58n5k78J48K13j68j13K66l60J43j74K56N7K7j50j09L5
$$ -41 121 60 50 115 95 -10 148 93 -185 -37 176 8 -105 161 -199 -56 -230 26 83 110 -40 -149 -114
4523a14K04M2L3l65J92J86m38K26r3J23J66l60J44K67j52k0j14J72k1l8j30J65
$$ -114 90 132 165 -200 -8 178 -260 -34 -127 -4 162 -198 -54 213 61 41 -73 99 78 40 -90 75
4545G5J76l62J70n7O2p2jk23M34j77J72k73J58j81K22j69J30k48R9J38l17L77
$$ 75 251 -111 59 2 64 -8 -9 -232 202 25 197 -76 82 -99 123 -46 84 -164 -65 73 -244 133
4567A33k19J51j33P6m1J07J82j48k95K25j03R6p8J82p6K05J1k74lQ0OJ8j9j28
$$ 133 -86 65 -68 8 -33 74 256 108 -187 38 -65 31 -47 135 59 264 275 1 -2 78 84 102 83 -45
4591d5k4N5j56K42j69O8R0j02K7K04j27k34J24m7K9K83j08j88L15m06J03n2L12
$$ -45 -69 -14 -170 72 -97 -29 61 -41 -14 190 63 -171 -47 -94 -65 218 110 -78 237 -169 -66 -118 194
4614A94L4m27J73m2M9j8n1K86k36j93J25q6L63n8k89pK32j42j62K34j52Q3N7L4
$$ 194 228 -199 -26 -68 -19 -37 -88 198 -38 -231 -106 -192 171 113 -176 -183 49 -93 -255 -21 -173 -90 -33 1
4638AN6J2k4o5J86j01K4j35K4l5J78l5j48m5R8K75k53l6K34k03j1qJ31r7P4J0
$$ 1 57 69 45 -20 166 65 89 -46 -22 -57 121 86 -62 -107 -9 266 13 -23 211 8 -3 -11 120 23 97 107
4664A07j82q0N37k55l70L74r4J71m24K45J39j89Q9n8j26J81N7j59J54L8j27j84
$$ 107 -75 -155 382 127 -243 131 37 208 -216 29 168 -21 68 10 -116 65 122 -37 117 155 28 -156
4686a56M34k22j69k5P1j30KK84Q6l8l47Q5K49k9q6m5m5k03J73L09r1j00J0M1J25
$$ -156 278 56 -113 -138 -67 -197 -195 89 175 137 -210 -125 124 95 9 -36 -81 -284 -111 198 107 7 17 58 183
4711A83j50O8n3Q2K2j76N5R4J53k80K0J3N0j19R6r0J6P0o2P9j73M4O0J68j94L03
$$ 183 33 101 48 130 152 -24 31 125 278 -2 18 31 81 -38 58 -32 -16 54 -8 71 -102 -58 2 170 -24 279
4737B79k95j09M9j39K02P9q6J68k40P4K62j79k14J63J11q2k46L07L7k28K06l23
$$ 279 -16 -125 -76 -215 -13 66 -20 148 -92 -18 244 65 -149 14 125 43 -203 104 141 -87 119 -204
4759b04M84j33Q5m27L00q0q8qJ31j63K42k56P7j00K19j18J86L7J2p6k90M46j70
$$ -204 280 147 232 -195 105 25 -63 -71 60 -103 139 -117 -40 -140 79 -39 147 184 196 120 -170 276 106
4782A06j48J22k79O6K16p5m1oM9J40j24j14K64m2j80L29l68R8n1j35L67m56K78
$$ 106 -42 80 -199 -133 83 8 -33 -39 10 150 26 -88 176 134 -46 283 -85 13 -38 -173 194 -262 16
4805A6j97J79j27L34m09L2J76l27J72K18o9%J25k95K29j22J82j27K08k85r3J48
$$ 16 -181 -2 -129 205 -204 -172 4 -323 -151 67 -2 -2 123 -172 57 -65 117 -10 198 -87 -180 -32
4827c2M9P6k7RL3r5P5k23K69j68j67L61J00k73J94l52L7J85J23l12J45p1O3K17
$$ -32 17 93 66 75 108 13 88 -135 134 -34 -201 160 260 -13 181 -171 -134 51 174 -138 7 -64 -1 216
4851B16j33j05j24J20n7P9L5N2j52n8R7J81R9m99K17K40n6n0m7j69j04K91k68
$$ 216 83 -22 -146 -26 -83 -4 31 83 -69 -127 -30 151 250 -249 -32 208 152 102 55 -114 -218 73 -195
4874a95L31Jl0k57J56j49M07l40m7K05L1J24m01L5J49M9r8k7K4j38L94n29K17
$$ -195 136 137 107 -150 6 -143 264 -76 -123 82 113 237 -164 -129 20 69 -29 -56 -32 -170 224 -305 -88
4897h8J58k53l9L4J45J43j63N5J11j10LL6M2J5j09j17J94r1PO8j71J20k02J70
$$ -88 70 -183 -222 -188 -43 100 -63 -8 103 -7 -4 32 74 89 -20 -137 57 -34 -27 41 -130 -10 -212 -42
4921d2K64l40K01j63P6j9L1Q4N0J73l18j14K66O5m16J02J43P8j54Q6j8J05p9J38
$$ -42 222 -118 83 -80 -4 -23 8 92 142 315 -3 -117 149 214 -202 -100 43 121 -33 53 35 140 61 199
4945A99l51J01J14J22m10J32Lq4J31P7J02M1n5Or9K69J3l95O9O3J98l13q8m0K47
$$ 199 -152 -51 63 185 -225 -93 -90 -174 -43 34 136 177 122 128 29 298 311 -84 -15 48 246 -67 -155 -195 52
4970E2Rn1j96M10j26k9n7N9o0km2r6J41j38PJ4K81j91rJ3j67P0k7K41j58j5P8
$$ 52 61 10 -186 224 98 69 12 71 11 9 -33 -129 12 -126 -119 -105 176 -15 -24 -11 -178 -108 -135 106 -52 -67 11
4997A1J37k88K26j6j14J48j80N7Rp7R6l2P5J65l72R3j26k4M07m24K73JJ31j26
$$ 11 148 -140 86 70 -44 104 -76 -19 -10 -87 9 -23 52 217 -155 -62 -188 -212 195 -229 44 45 176 50
5021E0j54J35m17L49n8K79o8j14j09k1O9K40j71p5o8K17J15p6j95K18m29N74J33
$$ 50 -104 31 -386 -37 -95 184 116 2 -107 -128 -59 181 10 -65 -133 84 199 123 -72 146 -283 291 424
5044D24j13n40J5L48l68j2M44j5R6q13M76n3p82L42L99M64q91P47j50J73k93L09
$$ 424 311 -229 -214 134 -234 -246 198 183 279 -534 -58 -111 -893 -551 -152 312 -579 168 18 191 -102 207
5066B07l04K52l03J22j28J71J05l30Q7P4m1p5K28k35L82j02p8j8J4J89l42j2K25
$$ 207 -97 155 -148 -26 -154 17 122 -208 -121 -47 -88 -163 65 -170 212 110 32 14 28 217 -125 -137 88
5089H8n4j76L38k92K03o3L0k05R6J54j85J77k85O0K06k16J70n2J57k86K78n9%
$$ 88 34 -142 196 -96 107 44 74 -131 -35 119 -66 111 -174 -114 92 -124 46 -6 151 -135 143 84 84
5112H4J0j75K06j27j79K09o1m7j1N9J01o3L2P6l4J24j71J6r2Qj79K23J29k6j40
$$ 84 94 -81 125 -2 -181 28 -33 -80 -91 -32 69 6 38 114 80 204 33 49 -43 -35 -214 9 138 112 -28
5137b8K13j81k65K00MM6J24p8j95J90p6P5j58J18J1j18j14J85J37J14j03n8j23
$$ -28 185 4 -261 -61 -57 -11 113 35 -160 30 -46 29 -129 -11 0 -118 -232 -47 90 204 101 43 -80
5160h0K51OJ31o98M10j83J15J84n3j44k3K47k24j73K55j8R4k89J97m7J8J13q6
$$ -80 171 177 308 -390 20 -163 -48 136 83 -61 -84 163 -61 -234 21 3 97 -192 5 -42 -24 89 3
5183CK75j36k39J8K62k31l8j13J49J04p4J23k51j22N57l73K6N4R5j36n1J63r6
$$ 3 278 142 -97 -79 183 -48 -86 -199 -50 54 -20 103 -148 -270 287 -86 -60 -6 89 -47 -98 65 -31
5206c1K0K1j5J53k15j13n9L05L7J28k28M5j01K15m36L78QQq6k03P6J96m09P22
$$ -31 -11 10 -5 148 -67 -180 -239 66 103 231 3 48 -53 162 -274 104 112 120 34 -169 -93 103 -306 416
5230D16m87L82k14j68N4P7j72j23j94k0j0k10J021o22N21j66J00j55j34K20j69
$$ 416 -71 311 97 -71 -17 60 -112 -235 -429 -449 -459 -669 352 -270 251 85 185 30 -104 116 -53
5251e3j7J2J9j18J08nk8K4k2K22p8J9N4j22m4J08j07j07K15k28K19j08nj03J16
$$ -53 -70 -58 -39 -157 -49 -54 -82 -58 -80 142 64 83 137 15 -29 79 -28 -135 80 -148 71 -37 -42 -145 -29
5276b9M7j18q7K72k61K94j14J32j86L2J09L4k36P2P5j87K83j55J36k41M77m27
$$ -29 18 -100 -187 85 -176 118 4 136 -50 -18 91 125 -111 -39 36 -151 132 -23 113 -128 349 -78
5298g8K53k3k78Q8J30P5k44J48j53J38J81k49m0m6K22k99K09k06M2J68r9M3j30
$$ -78 175 152 -126 -38 92 167 -77 71 -82 56 237 -12 -52 -98 124 -175 34 -172 -130 38 -61 -18 -148
5321a48K01K2q1j27Kn1K7n0K58p7O9n5J25q1K3p2j78K03l7j71J33J59R5k60N2
$$ -148 53 75 -6 -133 -131 -182 -155 -205 53 -24 45 -10 115 34 57 -15 -193 10 -27 -198 -65 94 189 -71 -19
5346a9j48K22l11L19r9j1k26K17L8r0P2K27j99m4J66k34L54l36M5J21K10k89J6
$$ -19 -167 55 -256 63 -36 -47 -273 -56 -18 -108 -36 191 -8 -52 114 -120 234 -102 -57 64 274 -15 1
5369AK5J42j68L6M5K08l76K73j89j14J74j52K35r9q8j24K89Q5j83j87J34j50j57
$$ 1 26 168 0 36 81 289 -87 186 -3 -117 57 -95 140 41 -47 -171 118 203 20 -167 -33 -183 -340
5392c40J53J28K18j78n5J33j19P5M8m3N8k95K73M5j93nK77j00j8k40J99k2j20
$$ -340 -187 -59 159 -19 -74 59 -60 15 63 20 78 -217 56 101 -92 -97 180 80 62 -178 21 -1 -121
5415a21R2qk5m6K12L3Pl0j42RL88o04L29m3J69j25n0n1J52p5LJ3k18j99J64j43
$$ -121 -29 -37 -62 -108 104 137 144 114 -28 -19 369 -235 94 51 220 95 45 -6 146 71 74 87 -131 -330 -166 -309
5441c09K47J56j45j24K00j50K12m0OJ01r8j53m0O1J13R4j96J31j1r9j01J83q1
$$ -309 -62 94 -51 -175 25 -125 87 47 53 154 56 -97 -137 -76 37 131 -65 66 55 -44 -145 38 -43
5464d3L07j83l5J79j85M4j03P9N7j1p2n6L6m5j75L7j1K32m4P7m04M99l15J2L16
$$ -43 264 81 46 225 40 84 -19 60 117 106 34 -22 14 -31 -206 -169 -180 52 8 85 -319 180 -135 -123 193
5489A93j24m5k1j12n5J38p3j44K55m0M4j68L48k00Q7k43J25K61k08j52p1K15M7
$$ 193 69 24 3 -109 -164 -26 -99 -243 12 -28 16 -152 196 -4 83 -160 -35 226 18 -134 -205 10 57
5512E7j08R0j61l4K21j82LL02k51J00q1j08K21p8M68k85K0l10J20J03k39J52O4
$$ 57 -51 39 -122 -156 65 -117 -114 188 -63 37 -44 -152 69 -9 459 174 194 -116 4 107 -132 20 84
5535H4k39m2M24j45J62m47O9J21K4n2J81l00M66m40M4J05J13j01O2J06k64j64
$$ 84 -155 -197 227 82 244 -203 -134 -13 11 -41 140 -160 306 -134 -90 15 128 27 89 195 -69 -233
5557b33JL35j08J80k96P1n4l3J28J51j62K8P1Q1l21K57j90p4M4o0L33j9m7k52
$$ -233 -232 103 -5 175 -121 -50 -104 -137 -9 142 -20 8 79 160 -161 96 -94 -168 -124 -184 149 130 83 -169
5581a69J46j29K53k10N5J65K18k81j20n8n2J68p6P1k9q4K17RQ2k56J8j05K05j15
$$ -169 -23 -152 101 -109 -54 111 329 48 -72 -130 -182 -14 -90 -19 -48 -132 85 94 176 -80 -62 -167 38 -77
5605g7p8k4K87k44L50k0k38P0Nk02l9M80k77K13j14p9n98R84n45M26o8j11k18
$$ -77 -155 -179 108 -136 214 194 -44 26 31 -171 -210 270 -7 206 92 13 -585 399 -146 280 212 101 -117
5628a17K87m91k25O69k0K90j07k96R39j126j2j17k67L15m13J266j375P83p0K2
$$ -117 170 -321 -546 123 103 393 286 -10 929 -197 -209 -326 -593 -278 -691 575 -800 -17 -87 -65
5648f5K25k10kj4J49l66L32l6J85j29L0J5j44J15j39J78j3k19p7J00J26K18k01
$$ -65 160 -50 -52 -66 83 -283 49 13 198 69 99 114 -30 85 -54 124 111 -108 -185 -85 41 259 58
5671E8j61J56j33N4J51k70K40k8k21K49r4J36j16QN7j27k06L11kp2J74j69m3K68
$$ 58 -103 53 -80 -26 125 -145 95 67 -154 95 1 137 21 29 86 -41 -247 64 62 -10 164 -5 -48 220
5695B20k20j20K14j61r8K03j84K0J84j89qO5o0J17R0j78K00P3k99K36J46j68j00
$$ 220 0 -120 94 -67 -165 38 -146 -126 58 -131 -139 -74 -134 -17 73 -105 95 168 -131 105 251 83 -17
5718a7J91j84J91l64K94k63J58k86J96j32J74J89j12Qj1p1q6K65j91k9N9R1J2
$$ -17 174 -10 181 -183 111 -152 6 -280 -84 -216 -42 147 35 43 32 -39 -125 140 -51 -80 -21 70 82
5741H2k38J71p9J32L5l2J01M2K3m15L52j65R8j85K65j4l59L12K4j20j27K1k09
$$ 82 -156 15 -64 68 103 71 172 214 237 -178 174 9 107 -78 187 173 -186 126 150 30 -97 -76 -285
5764b85L26l7r9O5J13J10O3l29J12J24j74J36j72J86k86J86k36K21jJ0j43r2L12
$$ -285 41 4 -95 -30 83 193 256 -73 39 163 -11 125 -47 139 -147 39 -197 24 23 33 -110 -202 110
5787A10j13J11j83j41q5M68k72L6J93L5j14O2k32Jr0N3J53K02j44k13J11K92l93
$$ 110 -3 108 -75 -216 -301 167 -105 -69 124 159 45 107 -125 -124 -214 -161 -8 194 50 -163 -52 240 -153
5810a53P1j7L8m8oJ52M0N2K9Ok31j94K40j37O1L01j61j45Q7j08J55j74L23k61
$$ -153 -82 -99 -61 -109 -115 37 77 129 158 164 -67 -261 -21 -158 -97 204 43 -102 -15 -123 32 -142 181 -80
5834h0J0Q4j32J54o5Q6j13j12K03J60m26L98r2J00k36k4J06J52k57O2J0L8j44
$$ -80 -70 14 -118 36 -29 57 -56 -168 35 195 -231 167 75 175 -61 -85 21 173 -84 -22 -12 26 -118
5857a18K93l6k60J18q0J17LM3j74L5M0qJ18k5k64K8K63M6q6m6j62q4L07j51J04
$$ -118 175 139 -121 -3 -83 34 37 80 -94 -59 -19 -27 91 66 -198 -170 93 139 53 7 -155 -239 68 -83 21
5882B1N1j16L7P5Q0j64O6n3q2P8j1q5k32M05p8k6K26l35J05p7K86j98J1J18q4
$$ 21 72 -44 -7 68 148 -16 50 -3 -85 -7 -18 -103 -335 70 -8 -34 192 -143 -38 -115 171 -27 -16 102 18
5907A8J17o4l8j29J68k81J46K87Pk95P8J14k83J74n6L8Q4j26K23j28l2m9J71j40
$$ 18 135 71 33 -96 72 -209 -63 224 231 -64 14 128 -155 19 -37 1 85 -41 182 54 22 -27 144 4
5931Dk51K23Q6N2j92j45J53N1Q5j40Q8m34L95J93l52J34M5K60l63KL02j63r0p2
$$ 4 -247 -24 62 114 -78 -223 -70 -19 66 -74 14 -420 -25 168 -184 -50 -5 255 -108 -106 196 33 -57 -129
5955a29j72J26k7J8J14J08n0l5K1Rj55M0N3J21q6o6M3j8J72nk02J47m8j31K78
$$ -129 -301 -175 -202 -184 -70 38 -12 -47 -26 -17 -172 -132 -79 42 -44 -110 -67 -85 87 82 -120 27 -21 -152 126
5980A26l23L31q4l1J31q3q7j75O8K47j64J03j65K81k5q7m6J75k75J70j8j78J69
$$ 126 -197 134 50 19 150 67 -20 -195 -127 120 -44 59 -106 175 150 63 17 192 -83 87 69 -109 60
6003F0k2J85m37M14m9r9J50j76K11n24L83k69O0J44j39j39J1K70J48k65J19r9
$$ 60 38 223 -214 200 151 52 202 26 237 -287 96 -173 -113 31 -108 -247 -236 34 182 -83 36 -63
6025f3M65m09l2K17k28L44l49N4N4M5j7j05j23J76l69M95k66j5J38jq8j31N17
$$ -63 402 -7 -39 178 -50 294 -55 -1 53 98 81 -24 -147 29 -340 155 -111 -126 12 11 -77 -208 309
6048C09l60j05K52n9P9n5l9lMl1o9O8M0J5L1nK4k0j9p3m4q2j21K72k3p8J41j01
$$ 309 -51 -156 96 37 116 61 22 19 23 -8 -77 -9 31 46 77 72 96 76 57 -16 -60 -142 -263 9 -14 -92 49 -52
6076e2J78j19R3l4j10j31K8K50k2j44K2j29K29L8j26m2J12j00K01n6J09j68j37
$$ -52 126 7 100 66 -44 -175 -147 103 81 -63 -41 -170 59 97 -29 -71 41 -59 142 86 195 27 -110
6099a10O2N5J76k91K03r5m2J27k99K80J21j89n8J31j32K19k59P5k0k2R2O6lp4
$$ -110 -48 7 183 -108 95 0 -42 85 -214 66 187 -2 -60 71 -61 158 -101 -26 -46 -68 24 90 87 13
6123A3K4j96J87O1l9P7j0p9n6J68k0j05r1J95k11JJ78Ok2k79K32j43J31O2J5j71
$$ 13 37 -159 28 89 50 127 117 38 -18 150 130 25 -66 129 -82 -81 97 103 81 -198 34 -109 22 84 99 -72
6149g2J21j96N3J83k33J19L1N2J4j33K0J23J15J10l33K59k12k79L02L6l26K89
$$ -72 49 -147 -94 89 -144 -25 6 58 72 -61 -41 82 197 307 -26 233 21 -258 44 80 -246 43
6171D3k16J31o1K54k83j2J96lJ13j63M1k38L91r3k9k38k5K37k03K13p9o9K79j52
$$ 43 -173 -42 -103 151 -132 -144 52 49 162 -1 40 -198 193 100 71 -167 -192 45 -158 55 -24 -93 186 34
6195C4p2p3K21k07k1K01j78K8J27j50K5o6pP8j78K10J6k20P8L87l97m17M55N1
$$ 34 -38 -111 110 -97 -118 83 -95 -67 60 -90 -65 -131 -138 -60 -238 -28 -12 -232 -154 233 -164 -581 -126 -75
6219g5K41q9j54L6j20J17j80J94r2l53J59M25r5n64Q84p29N55o3J96K9l44K13
$$ -75 166 77 -77 -41 -161 -44 -224 -30 -122 -475 -316 109 14 -550 334 -395 160 97 293 322 -22 191
6241A91n05N20P7k31K24O1m52L09j04j77r95P71O44n72L79K4j3j46mj1K2j00M7
$$ 191 -314 206 283 52 276 337 -115 194 90 -87 -1082 -311 333 -239 140 164 151 5 1 -10 12 -88 -41
6264d1j07o2k0k9N5K32j01K30q5L3J5k10OK52k68R4j51L85j73j1j82K28j15j11
$$ -41 -148 -210 -230 -259 -204 28 -73 157 72 105 120 -90 -84 168 -100 -6 -157 228 55 44 -138 90 -25 -136
6288a36J46R1j67J17Q1l16L61j99k9lp8K33n1j79J76M8l5o3q4L2j80J26l5J32
$$ -136 10 101 -66 51 132 -184 177 -22 -51 -54 -132 101 50 -129 47 95 60 -3 -87 -55 -235 -109 -144 -12
6312a2Q7j42k0qP9j63K41k15L60j19j54J79k35r4K75m1N6k03J54J21j87J26l2
$$ -12 75 -67 -87 -95 -16 -179 62 -153 207 88 -66 113 -122 -216 59 18 74 -129 25 146 -41 85 53
6335E3K10l68J61q4q9K3L9J68o2n5k0j18L15m47K84P7m8r1L25r8l30J58n1J82
$$ 53 263 -105 56 -28 -117 -94 -55 113 51 -4 -24 -142 173 -274 10 87 39 -52 273 175 -155 3 -48 134
6359A34m14K22K17k17l7K99k09m0L65J37j132N19K69J52j06k3n79j99J043o01
$$ 134 -280 -58 159 -58 -95 204 -5 -45 320 457 -675 -156 113 265 159 136 -443 -642 401 -200
6379b00k47M14N81o82M65n70p7L57J48L8l0k65o1J1J69Ro1k40K64j9j99K64N9
$$ -200 -447 -33 548 -134 331 -239 -316 41 189 227 197 -68 -129 -118 51 60 -1 -241 23 4 -195 69 128
6402A28m5Mj94k9O0M4O3J47j42j50P1O4J10K7M8j27Q1m26J02K04lmOm3j77J81
$$ 128 83 87 -107 -136 -76 -32 31 178 36 -114 -43 21 131 158 206 79 160 -266 -164 40 37 33 39 -4 -181 0
6428@J39k98K03L0P8q9j7j62n0L14j22j08J07j21K0p6J30j56J97k2j72j84L69
$$ 0 139 -159 44 74 152 63 46 -116 -166 148 26 -82 25 -96 -76 -152 -22 -178 19 -3 -175 -359 10
6451A0o6j04J02p3K56o6n3J2j21J6j37N7k0K16m5P3j34Q8N6j93M1l2Q8L4o9N2
$$ 10 -56 -160 -58 -131 125 59 6 18 -103 -87 -224 -167 -187 29 -16 57 -77 11 67 -126 -85 -117 -29 5 -64 -12
6477a2K7P9j42j33P0M6n9Q4J13j16j06J83l8l5j38L34l16J51l1J46J11k37J44
$$ -12 15 94 -48 -181 -111 -65 -124 -40 73 -43 -149 34 -4 -39 -177 157 -159 -8 -39 107 218 -19 125
6500A25j16J06k22J53k23j1Qj27L58m9q4K13m39J60J36NJ94k36MJ96j31k74J94
$$ 125 9 115 -107 46 -177 -188 -180 -307 51 2 -82 131 -308 -148 -12 -7 187 -49 -45 151 20 -254 -60
6523f0o7J85J8j34J63M1q6O8n3J57m06L44k22q8N8Q8R2j26j13J07k5j20K16j25
$$ -60 -127 58 76 -58 105 146 60 128 75 232 -174 170 -52 -140 -82 6 98 -28 -141 -34 -59 -179 37 -88
6547h8K1r6J14j04K03P3j99m2J9J24J31m0l6n6K9J21k77R4K9O7j53j8K85k31L79
$$ -88 -67 -163 -49 -153 50 123 -76 -118 -99 25 156 116 80 24 53 174 -103 -9 20 87 -66 -84 201 -30 349
6572C49l08j68K84j10j11J7j51l0M47k57p1M6J49j03q3k8oJ00J74J32k2l79J42
$$ 349 41 -127 157 47 -64 -47 -198 -228 219 -38 -109 -63 86 -17 -100 -128 -134 -34 140 272 250 -129 13
6595A3O71p15M02L9j26k54K7n3o9M4J38j06q8J98j59j08K65m45l4k44M86J2L06
$$ 13 684 -31 371 410 284 30 57 4 -65 -21 117 11 -77 121 -38 -146 119 -326 -360 -604 -118 -106 200
6618B00k31K92k01k07L13j67j51m3K69j03k09J94J36j8r5J60k63K08j10m8J25
$$ 200 -31 261 60 -147 166 -1 -152 -195 74 -29 -238 -44 92 74 -21 139 -124 84 -26 -74 51
6639E1j83J43J20j16kJ21j07J7n1J27n90O07K3j24k63P09k76m40M66k2m44m97
$$ 51 -132 11 131 15 13 134 27 44 -7 120 -470 137 160 36 -227 482 206 -234 232 210 -234 -731
6661g31J248n69q8m6J91j13K02o54K22M72l18K01l38K91k3J25j35m8R8j15J27
$$ -731 517 -52 -140 -186 5 -108 94 -560 -338 134 -184 17 -321 -30 -53 72 -63 -111 -13 -128 -1
6682aj77K80p5Jn5K39k53j47K03Pj78M3R7J16j08J00j66J20k85J12K55j56N6J16
$$ -1 -178 102 27 28 -27 212 -41 -188 15 22 -156 -113 -16 100 -8 92 -74 46 -239 -127 128 -28 28 144
6706A44j62j30r7J36Q8j11p2K37j90K58K7j05L9k73J79J30j22n5L91l95l2L79
$$ 144 -18 -148 -245 -109 -21 -132 -204 33 -157 101 128 23 62 -211 -32 98 -24 -79 312 -83 -115 264
6728B64l68J63K4k5j16j4J8k52K78K29j93l8j7R0n6O4j37J47j32N4k75K98j1n3
$$ 264 -104 59 83 58 -58 -72 -54 -306 -28 201 8 -30 -47 43 -13 51 -86 61 -71 -17 -292 6 -5 -58
6752e8J61j98P4P6k84J83L5q0J14J37k84J96J14j07k08J15j8n2J85j18M8n8J64
$$ -58 103 -95 -21 55 -229 -46 -11 -91 23 160 -124 72 186 79 -129 -14 -32 -84 101 -17 31 -27 137
6775A37j0r1L46o4l78R6l0p7J86Q2j09j45J89l52J95R2n8J30O9j31k56K99p6J05
$$ 137 127 36 382 318 -60 36 6 -71 115 197 88 -57 132 -220 -25 67 9 139 208 77 -179 120 44 149
6799A49k16K9j14j22N26k75oK9j27qk2Q5Q9j88k7J67J5o4J62j34J59j97Q4J62
$$ 149 -67 -38 -152 -274 252 -23 -29 0 -127 -135 -157 -72 17 -171 -198 -31 -16 -80 82 -52 107 -90 -6 156
6823A56j16j55R2J50k27J2j3J92M1k04M5N5K2j02J37r7K09l23J17r7J32p5K02
$$ 156 40 -115 -23 127 -100 -88 -101 91 132 -72 -27 28 50 -52 85 -12 197 -126 -9 -106 26 -49 153
6846A53j45p7k3N6k23K21J18k15K74j48lQ2M0j87n6J06K03j65j61K18J55n30K66
$$ 153 8 -69 -92 -36 -259 -38 80 -135 139 -9 -12 70 110 -77 -133 -27 176 11 -150 68 223 -307 -41
6869d1o6J22j70J23l9j31J74l40K80R4r5r8P5N9j72M77j25o0j83J37OP7k45J48
$$ -41 -107 15 -155 -32 -71 -202 -28 -368 -88 6 -89 -187 -112 -53 -225 252 127 67 -116 21 27 104 -141 7
6893Gm7K11k07K20R8l04J57j35J06j79M9j04J83N1P3k70p7K8K13P9j73K75l33
$$ 7 -40 171 -36 184 282 -22 135 0 106 -73 -24 -128 55 106 179 -91 -168 -140 73 152 -21 254 -79
6916g9K23l03J01J40m3j5n6n2J33K1J8J08j21O7k16R4N6j25N3Q7jM2j90K07l7
$$ -79 144 -159 -58 82 39 24 -32 -84 49 70 88 196 75 142 -74 20 76 -49 4 91 90 132 -58 149 112
6941A12k22K54r0j47J51J04k96L8N1J15j31J13j40M6k30K13J12p0j22J75jN9o6
$$ 112 -110 144 54 -93 58 162 -134 -96 -45 70 -61 52 -88 -42 -272 -59 53 -17 -139 36 35 94 28
6964B8j11J18o0j47J24J09r5K19j63j02MM9n9q2J11j76L53j67J19j4J61j35j52
$$ 28 -83 35 -25 -172 -48 61 -34 185 22 -80 -76 -27 -86 -168 -57 -233 120 -47 72 58 219 84 -68
6987f8J57j74N7J27l62J52J00P5N2j61J15M9q6r2l1J09M6k86M66l45j5l0J42K2
$$ -68 89 -85 -28 99 -263 -111 -11 64 116 -45 70 119 33 -59 -90 19 65 -221 245 -100 -115 -145 -3 19
7011A9Q9j72J71j28j9O0j66O3Rm6p3M03l08P4n2N3J41k86J90j88R5N1j54Pj32
$$ 19 108 -64 107 -21 -40 20 -146 -83 -74 -120 -193 210 -98 -24 -76 -23 118 -168 22 -166 -71 -20 -174 -167 -299
7036b99J99j99K37k7J86j25J12j59MJ35j35J94j94q8K08J68k83l5J50j60J4J32
$$ -299 -100 -299 -62 -89 97 -28 84 -75 -71 64 -71 123 -71 -159 49 217 -66 -101 49 -111 -97 35
7058C5j0k6j1ok40M02p5j79K57k58R7j4j51j45K96L8M7J39k34J13Kj26j11J0J09
$$ 35 25 -1 -12 -18 -258 144 69 -110 147 -111 -14 -28 -179 -324 -28 10 57 196 -38 75 77 -49 -160 -150 -41
7083d1R1n1j65K09N0J05r0j1j30k7O8l13L39Q3j75MlJ10k95R8Q2K62j94J70P3
$$ -41 50 -1 -166 43 93 198 108 97 -33 -60 8 -305 34 117 -58 -54 -57 53 -242 -144 -62 200 6 176 249
7108B49j17N3k65J7O3J81m0j72k2k47L46j09l1Pp3K51m5j40J49j3k43Q9p8K51
$$ 249 132 185 -80 -63 0 181 141 -31 -53 -300 46 -63 -94 -87 -160 91 46 -94 55 42 -201 -112 -190 61
7132F1R3j84j63L31l78J74Q1N6o6n2j12L3Lr9rQ5J53n7P1j03J24R6n4l3l9k10
$$ 61 154 -30 -193 138 -240 -66 15 71 5 -47 -159 -126 -123 -222 -231 -146 7 -50 21 -82 42 138 84 51 12 -198
7158a98J54m4J03P9k14L30k19O4L7O3k12J41K7j03j15j50L09r6rM0O2J2q4O7n7
$$ -198 -44 -88 15 94 -120 210 -9 55 92 155 -57 84 111 8 -107 -257 52 -44 -53 -13 49 61 -23 44 -13
7183a3K89j34k47j7K31j67J78k16P1j5j88J65K54k39LJ49j09Lj67r7J87J56R8
$$ -13 276 142 -105 -122 109 -58 120 -96 -25 -40 -228 -63 191 -48 -45 104 -5 -2 -169 -266 -79 77 175
7206A75p7k11R0j00n3K01n9r3m1j3K02j62Q4J0LJ21n6j8J2J06j39j52J53%P0j22
$$ 175 98 -113 -23 -123 -176 25 -34 -127 -168 -181 21 -141 -57 -47 -44 77 21 3 15 121 -18 -170 -17 -17 53 -69
7232f9j61K78J31p7q9j08J08J64q2L1ll32J49m3N5N9J62m36J55L51l26J90l10
$$ -69 -230 48 179 102 13 -95 13 177 95 126 123 -209 -60 -103 -48 11 173 -263 -108 243 -83 107 -203
7255b03J99L3J54j90k41K20L7L41o1k32j77N7R8n1p8j38M15l29J23l0L3j59K16
$$ -203 -4 29 183 -7 -248 -28 9 350 289 57 -120 -63 35 -16 -94 -232 183 -146 -23 -53 -20 -179 37
7278C7P5j59K36j42n6N3%M8j88J25j48L84r0j55l7k2J18j17Q4j82O1k1L6J74p2
$$ 37 112 -47 189 47 -9 44 44 92 -96 29 -119 265 175 20 -17 -39 79 -38 46 -136 -75 -96 -60 114 42
7303D2j47J11Ko7L89j87o1j1p4k15L72k62M45m87J43k57L17J63l27J31L36k89
$$ 42 -105 6 8 -59 330 143 82 71 -3 -218 154 -108 337 -150 -7 -264 53 216 -111 20 356 67
7325F7m7O1o3LQ5j22j28J08J04j85j5K51j61L72l34j18k9J19j85J57L65n56N06
$$ 67 20 81 18 21 106 -16 -144 -36 68 -117 -132 119 -42 330 -4 -122 -151 -32 -217 -60 305 -251 255
7348B55k62K6L00k27j20l37L81J4J22l54J66j12O9P5j82O4j12K35Q6J29l28Q6
$$ 255 -7 19 319 92 -28 -365 16 30 152 -202 -36 -148 -79 -4 -186 -122 -234 1 87 216 -112 -26
7370b6Q1k4k25J7L18j34O5J85m83K94k51K10K07m30K10p4K70k28j18K72j61J63
$$ -26 55 31 -194 -177 141 7 72 257 -226 68 -183 27 234 -196 14 -60 210 -18 -136 136 -25 138
7392A38l85L64Jj57J86k19l7K12j47q0R5k8J99j51j95m7L59j68J13N5n7j95l9
$$ 138 -247 117 118 -39 147 -72 -109 103 -44 -124 -29 -57 142 -9 -204 -251 108 -60 53 108 51 -144 -183
7415a83MJ44Ll89N50j56kK29j68k08Q7o7J31P5m8J9M6k9N1k53M66k18q5J04p4
$$ -183 -179 -35 -32 -421 129 -27 -29 200 32 -176 -89 -156 -25 50 2 21 67 38 89 -164 302 84 -1 103 29
7440B9k6M6j71oj4K70N4k96J02k37R8K17L51k98j28m4l1K83j43M3j12j50q8K20
$$ 29 3 49 -122 -128 -142 128 182 -114 -12 -249 -151 66 417 119 -9 -53 -84 199 56 99 -13 -163 -251 -31
7464c1J08k53J46M43m48M73m27j09M3J40n8J16mj21o9N0k25J50L3j66K69O3j3
$$ -31 77 -176 -30 413 -35 438 11 -98 -55 85 27 143 139 18 -51 -1 -226 -76 -43 -209 60 123 110
7487A10j66K2n0K30J3j69j28K02j06J2J33k24J41%J15lj77M8m5N8l9k5Q4r8K8
$$ 110 -56 -34 -84 146 159 -10 -138 64 -42 -30 103 -121 20 20 135 132 -45 3 -42 16 -23 -48 36 -62 -34
7512c4n7K47l64R4K62m2j59K84j08j37k1P1r9m5j20K73k1j52m3J16L04m44o5L25
$$ -34 -91 156 -208 -114 148 106 -53 231 123 -14 -35 36 -63 -108 -228 45 24 -128 -171 -55 249 -195 -260 65
7536F5P4n5p5J55l26K74j37p8N4J11j01J4J55k0j61j10j5K00N5k37j33M03R2n07
$$ 65 139 84 9 164 -162 112 -25 -103 -49 62 -39 -25 130 110 -51 -161 -176 24 79 -158 -291 112 204 -303
7560c03L58K35n62K25J53j58J29j35j43J99n9K2J32J11j17P0j19pL3k21L18j64
$$ -303 55 290 -272 -47 106 -52 77 -58 -201 -2 -61 -39 93 204 87 157 38 31 64 -157 161 -3
7582cL1q9J33P0j06lkk61M4J12n6J89j56PN2J04q2l2N6l6L17l43J11K9R4j62j03
$$ -3 28 -61 72 142 36 33 31 -230 -186 -74 -130 59 -97 -90 -38 66 -16 -48 8 -28 289 -54 57 86 180 18 -85
7609h5J13j63K60M3j10j59J18k02M14k94J11j76R0J70k09J14j4j3P0N3m5j28j39
$$ -85 28 -135 125 168 58 -101 17 -185 229 -65 46 -130 -40 130 -79 35 21 8 78 131 86 -42 -181
7632a81K42ok8j03J70k73p2K94Q6k13K1J02m1K72l43K18L4j76P0j14L5j04RK73
$$ -181 61 55 27 -76 94 -179 -251 43 129 -84 -63 39 -2 270 -73 145 179 3 73 -41 -6 -110 -101 172
7656A72l67K17N8j27j37L00kj45j83K78l82K99o9Q3o8K3L6J73j9k63K18j72R0
$$ 172 -195 22 80 -47 -184 116 114 -31 -214 64 -318 -19 -88 -5 -73 -50 -14 159 140 -123 95 -77 13
7679A3j76K34N4J66l69m2K63k9j11Q7j46J00k29l68O51p5j38L46l91L98j90k78
$$ 13 -163 71 125 291 -78 -120 143 114 3 90 -56 44 -185 -553 98 23 -115 231 -160 238 48 -230
7701b30Q78n11Rl19j58P37J97k26k97J29P0M39n42j15l28J70R0j34J39N9j6qK5
$$ -230 648 137 146 -173 -331 406 603 377 80 209 279 718 176 61 -267 -97 -7 -141 -2 57 41 33 58
7724E8j13K19l43J28J64k3m28J09L21N0j66J41k10l1J10j17N5J93l59J91j6j04
$$ 58 -55 164 -179 -51 113 90 -338 -229 92 142 -24 117 -93 -124 -14 -131 -76 117 -242 -51 -67 -171
7746a71m4J25o9qO5n2K51J33k26j17j0M2J55k39L17K05l02r3J88l64J43J1jJ40
$$ -171 -215 -90 -159 -167 -102 -154 97 230 4 -113 -123 -81 74 -165 152 357 55 -38 150 -214 -71 -60 -61 79
7770G9j01J65j62J42j87J51l96M46k89L07n4j67J7J09j35m1N1m4j41K85Q9j60
$$ 79 -22 143 -19 123 -64 87 -309 137 -152 155 101 -66 -49 60 -75 -116 -65 -109 -250 35 124 -36
7792c6J43j03OK22k39K34j78j10K0K4J28n7M0L3l13J55k15L46q6KPr8O6r4j3K20
$$ -36 107 4 10 232 -7 227 49 -61 -41 -17 111 54 94 127 -186 -31 -246 100 14 16 23 -75 -9 -103 -116 104
7818A04k3P4k64J25J57L4j07M8m01M25l13m4K05l6ok79J24n1J98J06k85K94po3
$$ 104 81 155 -109 16 173 207 100 148 -253 172 -141 -185 20 -16 -22 -301 -177 -228 -30 76 -209 85 78 15
7842A5mj78K61k45J13j16J87k23M01r5l07N4m3J2J19l1P5J56l05K76n8o5rjj58
$$ 15 11 -167 94 -151 -38 -154 33 -190 211 116 -191 -137 -180 -168 -49 -80 -5 151 -154 122 64 -1 -10 -11 -169
7867a69J71j02j01M02k53J0k2P9MNj43K45j73n0P9M15m41J37J04k85pJ15j44P1
$$ -169 2 -100 -201 201 -52 -42 -64 15 19 24 -119 126 -47 -97 -18 397 -44 93 197 -88 -95 20 -124 -53
7891e3j91L98j30m5j01K28K1m5l26J84J95n2k35j24L80J7j1l82M06j00j10O4J0
$$ -53 -244 154 24 -21 -122 106 127 82 -244 -60 135 83 -152 -276 104 121 110 -272 134 34 -76 -12 -2
7914bQ4j84j06J02p4L37mk17J32R9l08L16k18j21J86Q5k77J71j29J83k14J36j82
$$ -2 82 -102 -208 -106 -180 157 153 -64 68 167 -141 175 -43 -164 22 107 -170 1 -128 55 -159 -23 -205
7937b05J69J50R4k87J97m9o3L8j58O9K6L25k39j34K78j70k41L46j96N9J0k5q3
$$ -205 -36 114 208 -79 118 69 6 44 -114 -45 -19 306 67 -67 211 41 -200 146 -50 9 19 -6 -89
7960h9J81J67n54J32J08k5N4K4j29PN6K01j51K4N6l12K33O5p5j26k24K42m0kk7
$$ -89 92 259 -295 -163 -55 -80 -26 -2 -131 -124 -68 133 -18 6 62 -250 -17 48 -27 -153 -377 -135 -175 -177 -204
7985b04K66k7k68J59j6L9L1j0j24J3K00J06m13J74J55k23K6l32K63K80l12p1L05
$$ -204 62 35 -233 -74 -90 -51 -20 -30 -154 -141 59 165 -248 -74 81 -142 -116 -448 -185 95 -217 -288 17
8008A7j79J97N3j99J89j37J99l33K31j21K79k42K40k45K7j18l0K15k32J54j84
$$ 17 -162 35 88 -111 78 -59 140 -193 38 -83 196 -46 194 -51 -24 -142 -172 43 -189 -35 -219
8029b19J59p6J22L0o8p3J23K45j30j16K4r6k2J5J38p7j97R0J69k13L94j86k38
$$ -219 -60 -136 -14 16 -52 -125 -2 243 113 -3 21 -75 -97 -82 56 -21 -218 -128 41 -172 222 36 -202
8052b02J6J03R6Q5k74pL24k01J2l0L23j72MM2j73j4J39j28j60R7L74l5l53J28
$$ -202 -186 -83 13 98 -176 -183 141 -60 -48 -78 245 73 77 119 -54 -68 71 -57 -217 -120 254 219 -134 -6
8076fN4j52J37N3J47k44k56K47K34k06j4k1J17j57M60n24Q7K82k76l5O9J36n1
$$ -6 48 -104 33 86 233 -11 -267 -20 214 8 -6 -27 90 -67 393 -131 -44 238 -38 -73 -4 132 81
8099H1p6j04N4P0N1qq6Q9J24j60m9P7j16K8L18k47K2Q3l15L7K38o9r7J92L3j97
$$ 81 5 -99 -45 25 76 68 -18 71 195 35 -14 63 -53 -25 293 46 68 151 -164 -127 111 42 -55 137 170 -27
8125b7J34j39J64l01J66J0J11j34j06R5n9J94r5j01L9J94l11L14q0Oj79J14R4
$$ -27 107 -32 132 -169 -3 7 118 -16 -122 -27 -86 108 13 -88 -49 145 -166 148 68 74 -105 9 103
8148A03j62K02j29O0j01j8L8R1j54J4nl1J00K8j71r0N4L67m60J30J22j37J09J42
$$ 103 -59 143 14 74 -27 -45 -7 84 -70 -56 -61 -92 8 36 -135 -225 -171 196 -264 -134 -12 -149 -40 102
8172A02j88K05J60l34J55k02j7J89J9l3J05l3k63K06j09J01k17P1R
$$ 102 -86 119 279 -55 100 -102 -119 70 89 56 161 128 -135 71 -38 63 -154 -83 -74
8191g4
$$ Imaginary data points
##PAGE= N=2
##DATA TABLE= (X++(I..I)), XYDATA
0@%%%%%%%%%%%%%%pJ5j6J6j6K3l1L4m1M9n7P0q5R7j10J28j47J66j90K16k44K76
$$ 0 0 0 0 0 0 0 0 0 0 0 0 0 0 0 -7 8 -8 8 -8 15 -16 18 -23 26 -31 39 -46 51 -59 69 -78 88 -102 114 -130 146
36A46l10L48l91M38m88N42o02O69p40Q17r03R97j100J213j336J470j620J786j970
$$ 146 -164 184 -207 231 -257 285 -317 352 -388 429 -474 523 -577 636 -700 770 -850 936 -1034
55a034K176k406K671k973L321l733M226m830N585o564P895r823J2917j9000N4641
$$ -1034 1142 -1264 1407 -1566 1755 -1978 2248 -2582 3003 -3561 4334 -5489 7428 -11572 43069
70D3069j04204K4522M9222l4438Q8769j18573L7055P4160o0785l942m7355N6834
$$ 43069 -61135 -36613 12609 -21829 66940 -51633 -14578 59582 -1203 -5145 -52500 4334
82D334N9808r6776K3065j5442M9159M0054j33190N1260L6026k8352N3982j05645
$$ 4334 64142 -32634 -9569 -25011 24148 64202 -68988 -17728 18298 -10054 43928 -61717
94f1717M4926R2976r8242Q620j3239J4962O6654q0549J666K5085J5270J7429r4593
$$ -61717 -16791 76185 -22057 -13437 -26676 -11714 54940 -25609 -23943 1142 16412 33841 -60752
107f0752M0817N5008l6037K1898o6158L4804P1395q6908J3053K739Q988N5339
$$ -60752 -19935 35073 -964 20934 -45224 -10420 60975 -25933 -12880 -10141 -1153 54186
119E4186q9433L781N6579j3140R339n7840J8823N2806l3886L084l2637L3642M7476
$$ 54186 -35247 -31466 25113 11973 21312 -36528 -17705 35101 1215 4299 -28338 5304 52780
132E2780q1165J0507J8846M028L9051p2578O036N2635k5749L557l4724J6719N3847
$$ 52780 -28385 -17878 968 4996 44047 -28531 -22495 30140 4391 7948 -26776 -10057 43790
145D3790m5620j0503j892K0637L0289n8871N076K5267N75J6372n8719J7410N1177
$$ 43790 -1830 -12333 -14225 6412 36701 -22170 -17094 8173 8748 25120 -33599 -16189 34988
158C4988l6027j062j9633J5518M4729m8342q871J2859J1695K1160n2793O447L5860
$$ 34988 -1039 -2101 -21734 -6216 38513 -9829 -18700 -5841 5854 27014 -25779 -19332 16528
171A6528j1194K794l7190J7815M3302l6494l605q380J3405L5902n0156l700K8200
$$ 16528 5334 8128 -29062 -11247 32055 -4439 -8044 -16424 -3019 32883 -17273 -20973 7227
184G227q1P773l7859O071L7292j3421o299k2321J8302L3127l7745n301P958J2553
$$ 7227 7146 14919 -22940 -16869 20423 7002 703 -21618 -3316 29811 -7934 -13235 -5277 7276
198G276J8479m3337M28K9592l101J256l0421J1170L5807k3369j1556n472J7352
$$ 7276 25755 -17582 -17154 12438 9337 10593 -19828 -8658 27149 3780 -7776 -13248 4104
211D104K2217l4172m567J2154J1004Q073l9308R049L0341j1888l719k0942J3665
$$ 4104 26321 -7851 -12418 -264 10740 18813 -20495 -11446 18895 7007 3288 -17654 -3989
224c989K9296k7437p920K395J3700J5836l6158q64K1968J667O01k8217J0374K6682
$$ -3989 25307 -2130 -10050 -7655 6045 21881 -14277 -15141 6827 8494 9095 -19122 -8748 17934
238A7934j5904o386j2246J6555K3446l2510n057J1644P951R105l1473L360K4700
$$ 17934 2030 -4356 -16602 -47 23399 -9111 -14168 -2524 5427 14532 -16941 -13581 11119
251A1119m343n214k0839J3418K5981k2059p284n39J3195J5340l0508k171J7385
$$ 11119 6776 1562 -19277 -5859 20122 -1937 -9221 -9760 3435 18775 -11733 -13904 3481
264C481M386K674k7114O455K6657j2617o986r240J1838K0861k3079q293Q211R813
$$ 3481 7867 10541 -16573 -10118 16539 3922 -3064 -12304 -466 20395 -2684 -10977 -2766 7047
278G047Q762k6850m2K1940k875m106j7224Q237K3891j4977j0231q88J0734J4571
$$ 7047 15809 -11041 -11083 10857 7982 3876 -13348 -5111 18780 3803 -6428 -7316 3418 17989
292A7989k3197p278J6011N863k34k0408J340K1881m325r540r637J0052J8088j7019
$$ 17989 -5208 -12486 3525 9388 9154 -11254 -9914 11967 7642 -1898 -11535 -1483 16605 -414
306d14j0537O180J0637O862k0633m521J7319K637n306j4692M856K0434q684j2017
$$ -414 -10951 -4771 5866 12728 -7905 -12426 4893 7530 2224 -12468 -7612 12822 4138 -7879
320g879j646J0022J1846j4980r794J0603Q588j0j7186r36J8757o68r112q033O342
$$ -7879 -9525 497 12343 -2637 -12431 -1828 6760 6750 -10436 -11372 7385 6717 -2395 -10428 -4086
335d086J5600r076j2689M328J0687N760j5001o928J3437O599o068j0689J821J5490
$$ -4086 11514 2438 -10251 -5923 4764 10524 -4477 -11405 2032 8631 2563 -8126 -6305 9185
349I185j009j3303l200J0357R392r631j0830O960J0397j272j1683l583J2765N979
$$ 9185 8176 -5127 -8327 2030 11422 1791 -9039 -2079 8318 7046 -4637 -8220 4545 10524
363A0524j0385q158O481J0450l061j1704L34J1082K938q864q300P294J0774o230
$$ 10524 139 -8019 -1538 8912 5851 -5853 -5519 5563 8501 -363 -8663 -1369 9405 3175
377C175j0318K360R591K836j0841n440R521O425m306j0797J525J3267k694r307
$$ 3175 -7143 -4783 4808 7644 -3197 -8637 884 7309 3003 -7794 -6269 6998 4304 -5003
391e003k154O845Q595q468q965O398O540J356j0138l748J2355J646o656n594K609
$$ -5003 -7157 -312 8283 -185 -9150 -2752 3788 5144 -4994 -8742 3613 5259 -1397 -6991 -4382
406d382J1257l704r369J479N560O203q734p250J0724L315k831o112k701J1746
$$ -4382 6875 3171 -6198 -4719 841 7044 -1690 -8940 1784 5099 2268 -3844 -6545 5201
420E201K65q173j866L266Q862n403q842N849M796J617o612n118R835K132m545
$$ 5201 5466 -2707 -4573 -1307 7555 2152 -6690 -841 3955 5572 -1040 -6158 3677 5809 1264
435A264m659K5J0686k802q900K431K997N610n356p501P313L395q03o164k912R972
$$ 1264 -3395 -3370 7316 4514 -4386 -1955 1042 6652 1296 -6205 1108 4503 3700 -2464 -5376 4596
451D596l03o148q70M93P760m046p089M107K805L410n806o157R208J020l298k843
$$ 4596 4293 -1855 -2725 -2232 5528 1482 -5607 -1500 1305 4715 -1091 -7248 1960 2980 -318 -3161
467c161j240Q147j522o230L80K252O085n012o065O522J196J76l911l327Q428K3
$$ -3161 -4401 3746 2224 -4006 -3626 -1374 4711 -301 -6366 156 1352 1528 -2383 -5710 2718 2741
483B741m922q96J90O966k748o150L565K452K018m064l221N283J002q8m488r67
$$ 2741 -2181 -3077 -2887 4079 1331 -4819 -1254 1198 3216 -848 -4069 1214 2216 2128 -2360 -3327
499c327Q397l253l951J360O1N469l946m256M583P81J550m546k100P303j655j733
$$ -3327 5070 1817 -2134 -774 -713 4756 810 -3446 1137 1918 3468 -1078 -3178 4125 2470 737
515G37k558M04O027l907j966J048M81N318p196k086O625k182J327l787j635P539
$$ 737 -1821 -1417 4610 703 -1263 -215 266 5584 -1612 -3698 2927 745 2072 -1715 -3350 4189
531D189l914j312n40m95P200o682j835M244k163M597n828j350P257m952K061k931
$$ 4189 275 -1037 -1577 -2072 5128 -1554 -3389 855 -1308 3289 -2539 -3889 3368 -1584 477 -2454
547b454j690R701p527q94L339l671P311o314k253P521n075M213m345k812J0474
$$ -2454 -4144 5557 -1970 -2864 475 -3196 4115 -2199 -4452 3069 -2006 2207 -2138 -4950 5524
562E524p352Q35J299m320J0028p635k253P181o001O944m544n105J1437o985J154
$$ 5524 -1828 -993 306 -4014 6014 -1621 -3874 3307 -2694 4250 -294 -5399 6038 -947 207
577B07J072n760J0487n606k856N297n550P650m484m628R653o496L095q82n966
$$ 207 1279 -4481 6006 400 -2456 2841 -2709 4941 457 -4171 5482 -1014 2081 1199 -4767
592d767J1206o688q52M002p089R527m600n604R064n988M011r93o526R857n597
$$ -4767 6439 -249 -1101 2901 -4188 5339 739 -4865 4199 -1789 2222 1229 -5297 4560 -1037
607a037L64K465o569R555m894m043O908o264N918k119n497Q893o108K465J265
$$ -1037 -673 1792 -4777 4778 -116 -4159 2749 -3515 2403 284 -5213 3680 -2428 37 1302
622A302p378J0484m905l278N962o316O401k088m883P581n344L577k22o278R280
$$ 1302 -6076 4408 -497 -3775 2187 -4129 2272 184 -4699 2882 -2462 1115 893 -5385 3895
637C895m680q82L749o138P590l161l371O140n984N093p88o022Q930n010N78K271
$$ 3895 -785 -1667 2082 -4056 3534 373 -2998 3142 -2842 2251 1463 -4559 4371 -639 -61 2210
653B210n609P505l526k109M823n978N976j867m999Q007n776K531J267o192Q066
$$ 2210 -3399 4106 580 -1529 3294 -2684 3292 1425 -3574 4433 -1343 1188 2455 -3737 4329
668D329m377j403M661o400O552k439m586P416n403K200J186n541P264m090n73
$$ 4329 -48 -1451 3210 -3190 3362 923 -3663 3753 -1650 550 1736 -3805 3459 -631 -1204
683a204K991n461O649k955l349N767m977L358O1m872O443l804L09K034m700N961
$$ -1204 1787 -3674 2975 20 -3329 2438 -2539 819 880 -3992 2451 -1353 -1044 990 -3710 2251
699B251k627k681M720m073L319r73l655N932l560Q74R12l932O313l224j713L577
$$ 2251 -376 -3057 1663 -2410 909 -64 -3719 2213 -1347 -473 439 -3493 2820 -404 -2117 1460
715A460l573L945j808k815M562k552J647l22l209N622k432j414J702k117M308
$$ 1460 -2113 1832 24 -2791 1771 -781 866 544 -2665 2957 525 -889 813 -1304 3004
730C004k012k940L702j829J965j301k828N104k145n85L38j838M157j718k442K154
$$ 3004 992 -1948 1754 -75 1890 589 -2239 2865 720 135 473 -1365 2792 1074 -1368 786
746G86j058K554j828k430L397p28J42j574j203M013j578j482M80n14K911k096
$$ 786 -272 2282 454 -1976 1421 693 835 -739 -1942 2071 493 -989 -509 -1023 1888 -208
762b08k327K548j12J191k262j643L852m84j042j097m39L794j684k427J121N89
$$ -208 -2535 13 -99 1092 -1170 -2813 1039 555 -487 -1584 -2023 1771 87 -2340 -1219 -630
778f30J965k003k283L011N21L4j957j019L871o28j886o24J149K715j761k435J358
$$ -630 1335 -668 -2951 60 581 615 -1342 -2361 1510 882 -1004 -1628 -479 2236 475 -1960 -602
795f02J689R46k747j370L215P89j317j657K16L465p47k601l06J866K040k344k160
$$ -602 1087 2033 -714 -2084 1131 1920 603 -1054 -838 2627 1880 -721 -1027 839 2879 535 -1625
812a625J809J677n0k732m12L314J42j843k121J592K952j714k556O78K020J321
$$ -1625 184 1861 1811 -921 -1333 1981 2123 280 -1841 -249 2703 989 -1567 -889 1131 2452
828B452l035j727K501J822j301k891N31L310k50k763q18K113K263k190k642J207
$$ 2452 -583 -2310 191 2013 712 -2179 -1648 1662 1412 -1351 -2169 -56 2207 17 -2625 -1418
844a418K548L08l135p73K746J486k291k270J311L544j188k958j05L012J125k577
$$ -1418 1130 1438 -1697 -2470 276 1762 -529 -2799 -1488 2056 868 -2090 -2195 817 1942 -635
860f35k139K342K449j260k778K2K922J606l200j476K515K087j339k921M12L584
$$ -635 -2774 -432 2017 757 -2021 -1999 923 2529 -671 -2147 368 2455 1116 -1805 -1393 2191
876B191J06l115j074K154K743k272k645J605K262P43l337j660L817R68j844k465
$$ 2191 2297 -818 -1892 262 3005 733 -1912 -307 1955 2698 -639 -2299 1518 2486 642 -1823
892a823R33L883j297l216R4K323K239l198k758L289J473m66l025q69M339l7l022
$$ -1823 -890 2993 1696 -1520 -1426 897 3136 -62 -2820 469 1942 1476 -1549 -2418 1921 1884 -1138
909a138n99P63L600j770m033K282J654J157k770k917M408R41j818j822o50M847
$$ -1138 -1737 -974 2626 856 -3177 -895 759 1916 -854 -3771 637 1578 -240 -2062 -2712 2135
925B135r49l777Q63J060K963k251l593L118J690j78k133k036M717L99l113k67
$$ 2135 1186 -2591 -1728 -668 2295 44 -3549 -431 1259 1081 -1052 -3088 1629 2028 -1085 -1352
941a352k53M088r01m354K134J606J560k295l519M749R08j681j501j670N198k93
$$ -1352 -1605 2483 1582 -2772 -638 968 2528 233 -3286 1463 2371 690 -811 -2481 2717 2424
957B424m218J244K75L026j298m563L603J334L6j528l450M976J027l380m60r05
$$ 2424 -1794 -550 -275 2751 1453 -3110 493 1827 1863 335 -3115 1861 2888 -492 -952 -1857
973a857M618m90m991K067J175J605j465m568M431J802k068j150k286M879O82m426
$$ -1857 2761 2271 -2720 -653 522 2127 662 -3906 525 2327 259 -891 -3177 1702 2384 -2042
989b042P64N52K667o04n219L283J576l15j000l444M437J877l722k60q26M137M53
$$ -2042 -1278 -726 1941 1337 -3882 -599 977 662 -338 -3782 655 2532 -1190 -1450 -2276 1861 2314
1006B314n657J973J519J252m06n048L759K408j717j008k392M273J590m524M89
$$ 2314 -3343 -1370 149 1401 995 -4053 -294 2114 397 -611 -3003 1270 2860 -1664 -1175
1021a175M52K980q3n051K210K393r6j187l760M126K565l445o71r08L935P45n002
$$ -1175 -723 2257 2174 -2877 -667 1726 1630 443 -3317 809 3374 -71 -742 -1650 2285 3030 -1972
1038a972O56J767K186j115m444K717K444p34j551k864M294J548l931l65J39L467
$$ -1972 -1316 451 2637 1522 -2922 -205 2239 1505 -46 -2910 1384 2932 -999 -1364 -1225 2242
1054B242l2n288K051K063R36j652l706L451K349k575j254j459M466R57n066Q53
$$ 2242 2210 -3078 -1027 1036 1972 320 -3386 65 2414 -161 -1415 -2874 1592 2549 -2517 -1664
1070a664P73K729n12n356L268K117n24r33l870M369K139l601m94l37L437J121
$$ -1664 -891 1838 1326 -4030 -762 1355 831 -102 -3972 397 2536 -1065 -1559 -1896 1541 2662
1086B662n665J575J975J369r96m759L741K665k195r66k394M798J286m690M41N8
$$ 2662 -3003 -1428 547 1916 920 -3839 -98 2567 372 -594 -2988 1810 3096 -1594 -1153 -1095
1102a095L660J50n842K317K538J61j237l975M092K733l238m40j766M225R43n311
$$ -1095 2565 2715 -3127 -810 1728 1889 652 -3323 769 3502 264 -176 -1942 2283 3226 -2085
1118b085R86J493J912n13n135K887K990j419j348k739L694K280l890q39K23L148
$$ -2085 -1099 394 2306 1793 -3342 -455 2535 1116 -232 -2971 723 3003 -887 -1726 -1503 1645
1134A645Q28n586J704J901J054j089m397L943K204k065j324j832M149J584m943
$$ 1645 2473 -3113 -1409 492 1546 457 -3940 3 2207 142 -1182 -3014 1135 2719 -2224
1149b224P23O71K555J5n597K870K187l69p11m012M313K399l693j86j119L588J242
$$ -2224 -1501 -830 1725 1740 -3857 -987 1200 831 120 -3892 421 2820 -873 -1059 -2178 1410 2652
1166B652n075J550R84J693k60n085L234K844k124k06l152M052K153m402L25N1
$$ 2652 -2423 -873 111 1804 1544 -3541 -307 2537 413 207 -2945 1107 3260 -1142 -817 -766
1182g66K907M92n650K299K413l02J2m379L088L166l237k85j738L277K191n566
$$ -766 2141 2633 -3017 -718 1695 1393 1405 -2974 114 3280 43 -242 -1980 1297 3488 -2078
1198b078J068J109J244J019n417K468L024j713n75l282L377L048m632L58n79K068
$$ -2078 -1010 99 1343 2362 -3055 -587 2437 724 149 -3133 244 3292 -1340 -982 -1561 507
1214E07K128n412J348J996J38N59m457K226L365l103K55j969K517K769m803J27
$$ 507 2635 -2777 -1429 567 705 1264 -3193 -967 2398 -705 -450 -2419 98 2867 -1936 -1809
1230a809J142J265J510m933J544L073j450N22l459J843M044l853m43j28J669K269
$$ -1809 -667 598 2108 -2825 -1281 1792 342 864 -2595 -752 3292 -561 -1004 -1132 537 2806
1246B806m721M26K300N5J096m245J331L759j974o39j877J681L276m058m32J422
$$ 2806 -1915 -1489 811 866 1962 -2283 -952 2807 833 194 -1683 -2 3274 -784 -1216 206
1262B06Q30J679m435K85L349q50j93l005J668L583k826j191k72J348K560l826
$$ 206 1036 2715 -1720 -1435 1914 1064 871 -2134 -466 3117 291 -900 -1172 176 2736 -1090
1278a090n37K244J45N35l254J98L935j921n62j552Q75L303k736j382J082J126
$$ -1090 -1627 617 762 1297 -1957 -1759 2176 255 -307 -1859 -984 2319 -417 -1799 -717 409
1294D09J476l334n21K879l17l90k246O82L068j385j779j37J529K157k904j207
$$ 409 1885 -1449 -1970 909 592 202 -2044 -1362 1706 321 -1458 -1595 -66 2091 -813 -2020
1310b020J685J060M75k621k92L070j49j423j488J298K639j929j650Q06J547P57
$$ -2020 -335 725 1200 -1421 -1713 1357 1208 -215 -1703 -405 2234 305 -1345 -539 1008 1765
1326A765k221j233K439J039j048j961M35K661q01j765k39J282J937j797k070J254
$$ 1765 -456 -1689 750 1789 741 -1220 -785 1876 1075 -690 -929 353 2290 493 -1577 -323
1342c23J678K21k327k82K150L09j650j166P37K316q45k014K48J793M87j805r12
$$ -323 1355 1576 -751 -1033 1117 1426 -224 -1390 -653 1663 818 -1196 -948 845 1332 -473 -1385
1359a385J489J117o34j981P3K215K68k151p33J652J486j382j871P36J854K33j807
$$ -1385 104 1221 587 -1394 -1321 894 1162 -989 -1722 -70 1416 34 -1837 -1101 753 986 -821
1376h21j025J848J442j494j390M16K135j92k118k49J916Q13j156j735J259J784
$$ -821 -1846 2 1444 -50 -1440 -1024 1111 919 -1199 -1448 468 1281 125 -1610 -351 1433
1392A433q25j378k87J541J185j828j012J272J272l65k176J92K301J85j511j277
$$ 1433 608 -770 -1057 484 1669 -159 -1171 101 1373 1008 -1168 -976 1325 1510 -1 -1278
1408a278J339J732j220j407J89J920L10k138p19J835P66m03j722K25K165p13j156
$$ -1278 61 1793 573 -834 -645 1275 1585 -553 -1272 563 1329 926 -796 -571 1594 881 -275
1425b75q60J330J440j415j318P73J224K41k502R3J984J43p78j436M79K397j219
$$ -275 -1135 195 1635 220 -1098 -325 899 1140 -1362 -1269 715 858 80 -1356 -877 1520 301
1442C01j436J65R68J443k107j260J816R06p4j976O1K327p69p27j363R86K080j336
$$ 301 -1135 -970 -2 1441 -666 -1926 -110 796 722 -1254 -1193 1134 365 -362 -1725 -739 1341 5
1460Ej853J000J286Q58j989q07J832K70j00j704O48K115r45r91p49J479J843k007
$$ 5 -1848 -848 438 1296 -693 -1500 332 602 502 -1202 -554 1561 616 -375 -1124 355 2198 191
1478A91j239J608k8P99j819m19K148m53j12j301o5K777j665j451Q97P2J800k046
$$ 191 -1048 560 532 1331 -488 -907 1241 788 676 -625 -690 2087 422 -1029 -132 -60 1740 -306
1496c06p49J476K25M37j913l02K621r60q87l56o7K368j643j292J216M6J217j861
$$ -306 -1055 421 646 1083 -830 -1132 1489 529 -358 -714 -781 1587 -56 -1348 -132 -86 1131 -730
1514g30q96K348o90J79j159l37K607j449q25K05J10K121j872r99J493j68J082
$$ -730 -1626 722 32 211 -948 -1285 1322 -127 -952 -747 -637 1484 -388 -1387 106 -62 1020
1531A020j748o93K481p29p44l82n89K848j339j012J076m11J448j201j417K259
$$ 1020 -728 -1421 1060 331 -413 -795 -1384 1464 125 -887 189 -222 1226 25 -1392 867
1547H67n36M92q75j170K507p54r25O69q82K063r77j867J940n16J126q30j743K355
$$ 867 331 823 -52 -1222 1285 531 -394 275 -607 1456 479 -1388 552 36 1162 332 -1411 944
1565I44l93m13j91j182K760p76j267O42r06J857o41k006K198m85J62l53j507K397
$$ 944 551 138 -53 -1235 1525 749 -518 124 -782 1075 434 -1572 626 141 303 -50 -1557 840
1583H40k13j099N19j195K134n83j916J489l91J142k76k258K257j73n90K06j275
$$ 840 627 -472 47 -1148 986 403 -1513 -24 -415 727 451 -1807 450 277 -313 -107 -1382
1600a382K098j20j417Q22r27J475n6k130J954n52K03n3j448K021K58j022M39j150
$$ -1382 716 596 -821 1 -926 549 493 -1637 317 -235 -32 -85 -1533 488 746 -276 163 -987
1618i87J808j94j603J189m20P08N94k515K096J1m23L80j575J496J44j216O14j028
$$ -987 821 627 -976 213 -207 501 1095 -1420 676 687 264 644 -931 565 709 -507 107 -921
1636i21K087o73j496J419r25P59O22j793J458J57j067Jl08J314R4j357M15L6N69
$$ -921 1166 493 -1003 416 -509 250 872 -921 537 694 -373 -372 -680 634 728 -629 -214 -178 391
1655C91J42j367P58M62m2k68j136J085M56o74k58l88J105K52j146J25L24M50k33
$$ 391 533 -834 -76 386 344 76 -1060 25 481 -193 -451 -839 266 518 -628 -503 -179 271 38
1674C8q27O39K09%l26o50J164J26n73j75j92J016l40n74M30k33P73j00j439J061
$$ 38 -789 -150 59 59 -267 -917 247 373 -200 -375 -567 449 109 -465 -35 -268 505 405 -1034 27
1694B7K78j06l09k47Q69J05o06k50j60J281l52j189Q55J97Q6k94q03J356j08m31
$$ 27 305 199 -110 -357 512 617 11 -239 -399 882 530 -659 196 393 479 185 -618 738 630 199
1714A99J30j067J435k05q27L37J00P38m57j173P91K22K13k70p98J082J29q69J47
$$ 199 329 -738 697 492 -335 2 102 840 383 -790 1 223 436 166 -632 450 579 -290 -143
1733a43n53J329j99j032K55N7P34k05j389J136K69n22Pq81J345J49r29L92p16
$$ -143 -696 633 434 -598 -343 -286 448 243 -1146 -10 259 -263 -256 -1137 208 357 -572 -180 -896
1752h96J042J63j385O50N25K65k70r81J129k2m47P3o36J327L8j194L62J62L73
$$ -896 146 309 -1076 -426 99 364 94 -887 242 220 -227 -154 -790 537 575 -619 -257 -95 278
1771B78K94j213R25q8Q0p1r53J072O03j104O1j70O52M46j207O46j67O56r3j205
$$ 278 572 -641 284 196 276 205 -748 324 927 -177 -116 -286 366 812 -395 251 84 740 647 -558
1791e58N02Q63o88Q7p37N33Q11j246K63o9P15O28j766M28O20l68K49j105N28Q26
$$ -558 -56 807 119 206 -531 2 813 -433 -170 -239 476 1104 -662 -234 386 18 267 -838 -310 516
1811E16q09J08o03R03O47j481M1O27J45J65j024L06R40l51q1j060P64J035j044
$$ 516 -293 -185 -788 115 762 -719 -678 -51 94 259 -765 -459 481 130 49 -1011 -247 788 -256
1830b56j44J7J3R50j153q9O43J23K39j045K86J157l98l37o13M51J042q36m04N5
$$ -256 -400 -383 -370 580 -573 -662 -19 104 343 -702 -416 741 343 6 -607 -156 886 50 -354 -299
1850b99O07K54p89n8P24j48R6q46O0J112r6p79j86L64R68r92m18M58M12K0n09
$$ -299 308 562 -227 -285 439 291 387 -459 -399 713 617 -162 -348 16 984 -8 -426 32 444 464 -45
1871d5m36R84r1n18k11K10R86m37r98o3Q05J86l17p25N96N24l47n99P0P12K43
$$ -45 -481 503 412 -106 -317 -107 879 442 -556 -619 186 372 55 -670 -74 450 103 -496 -426 286 529
1892E29j043Q3K32N54m24p43R2P10N8l58k76M86N41n86l47J99N86J9p56q5O02
$$ 529 -514 -431 -199 355 -69 -812 -720 -10 48 -310 -586 -100 441 -145 -492 -293 293 312 -444 -529 73
1913G3L06l23o77N20P49m92o84N3P68M47p89m01M74N82k52p84J44Q81j21m01l42
$$ 73 379 56 -621 -101 648 156 -528 -475 293 740 -49 -450 24 606 354 -430 -286 595 474 73 -269
1934b69J68J022n14p22K8P71Q4o17l71P43L31j65r67nJ136k10p69j71M85O78n59
$$ -269 -101 921 407 -315 -287 484 568 -49 -420 323 654 489 -478 -483 653 443 -326 -497 -12 666 107
1955A07n92K24O09J69q17m76J055J28n53n76J06R72j71p68j31P76M35n46n71P03
$$ 107 -485 -261 348 517 -300 -776 279 407 -146 -722 -616 356 185 -583 -714 62 497 -49 -620 83
1975H3Q9j2o31j2Q13J26m59o41N33P20m83m61PM54N95r93l94Q72N8K09r62q2J030
$$ 83 172 160 -471 -483 330 456 -3 -644 -111 609 126 -335 -328 126 721 -272 -666 206 264 473 -489 -571 459
1998D59r6n34l19O23P06l73j089Q51l9O08j101j19J098j24m92l64O6R39k63p75
$$ 459 363 -171 -490 133 839 466 -623 228 189 797 -304 -423 675 551 59 -305 -239 700 437 -338
2018c38K27J44R48j124p30R36P9M14r79o7J131o24J07o44J68J304r80m41L73R6
$$ -338 -111 33 981 -143 -873 63 142 556 -423 -490 641 17 124 -520 -352 952 -28 -469 -96 0
2038@N91r58m72R73k43K78q02r1J440n90n02j66K51J129j060n94R08n3N81j038
$$ 0 591 -367 -839 134 -109 169 -633 -724 716 126 -376 -542 -291 838 -222 -816 92 39 620 -418
2058d18l52J334o31K8n47p0J591q44l45k54N29Q71j001q04J423l48K57q74k04
$$ -418 -770 564 -67 -39 -586 -656 935 91 -254 -508 21 892 -109 -913 510 162 419 -455 -659
2077f59J225n09O7o45J54J438q07m24O89k00M11n02j004J467j32j15p75j81J467
$$ -659 566 57 124 -521 -367 1071 264 -160 529 329 740 238 -766 701 569 454 -321 -502 965
2096I65q49j01l70J68J033o59q51P62O46n48l64p42J832o76k53n76j50J821p48
$$ 965 116 15 -355 -187 846 187 -664 98 744 196 -168 -910 922 246 -7 -583 -733 1088 340
2115C40j011L22L01P03l91j317J346M3n41M63j732K352m01r52N32l18J369p78
$$ 340 -671 -349 -48 655 264 -1053 293 336 -205 258 -1474 878 477 -475 57 -261 1108 330
2133C30j005N73N5J61m88o80J304J42l85l83n43J591K10j389P79o25J368j117
$$ 330 -675 -102 -47 114 -374 -1054 250 392 7 -376 -919 672 882 -507 272 -353 1015 -102
2151a02n56R18L83p23J6m75J140P37j747O76p03J375k46j493O42Q6L30n10l14
$$ -102 -658 260 643 -80 -64 -539 601 1338 -409 267 -436 939 693 -800 -158 -72 258 -252 -566
2170e66J129k04l48l31l82J295J3j726P96r5R69k80p29N66J92K59m85j018J041
$$ -566 563 359 11 -320 -702 593 606 -1120 -324 -419 550 270 -459 107 299 558 73 -945 96
2189I6k90M20m77j04P8O72q13m28M32J80Q77k064J437L06k3p76nP13L36n33j84
$$ 96 -194 226 -251 -355 -277 395 -418 -846 -414 -234 643 -1421 16 322 299 -477 -482 231 567 34 -150
2210a50n9K54P39j580J442o79L35j9r82R44M90r10lJ82J89L44j035K1M47N69o30
$$ -150 -209 45 784 -796 646 -33 302 283 -699 245 735 -175 -178 4 193 537 -498 -477 -30 539 -91
2231i1q92J72J528j72r15j53O65P21j022R2J33N45J81j390K84O75R1k06q83P54
$$ -91 -983 -811 717 545 -370 -523 142 863 -159 -67 66 611 792 -598 -314 361 452 246 -637 117
2251A17M76k38q82K34L89M65p30n09N31N37j84q78J08P09K66q83M2K23O75m69
$$ 117 593 355 -527 -293 96 561 -169 -678 -147 390 206 -672 -564 145 411 -472 -430 -207 468 -1
2271aq11L27R59k89m87k34M34L85j81q19M31N62K13o66n12R08P3l79k26P7P93
$$ -1 -812 -485 474 185 -302 -536 -102 283 102 -717 -286 276 489 -177 -689 219 292 -87 -313 -236 557
2292E57k89p66J35P52K08o93l01L42N77j51o99j93R04K16p91j98M48P54p07n49
$$ 557 268 -498 -363 389 597 -96 -397 -55 522 371 -328 -521 383 599 -192 -390 58 812 105 -444
2312d44L18P35M0n17o62P05M80n59k71j63R62k31p78M0M49M62m49r31O69N96k36
$$ -444 -126 609 649 132 -530 175 655 96 -175 -338 624 393 -385 -345 104 566 117 -814 -145 451 215
2333B15o88K5L91N14o92o21O67N36p2r01j07P86K56l34m33J11Q61n76m77RR41
$$ 215 -473 -448 -57 457 -235 -856 -189 347 275 -626 -733 53 309 -25 -458 -347 514 -62 -539 -530 411
2354D11Q8j053L6L38L00K0o08J56N22K67o27k70L77O62m95l42J30M95M28j010
$$ 411 499 -554 -518 -180 120 140 -468 -312 210 477 -150 -420 -43 619 124 -218 -88 407 835 -175
2374a75l33O38L41l34n69L85N84J3q01P0O01K00p39k03K50P51m29m29p4P76q8
$$ -175 -508 130 471 137 -432 -47 537 550 -251 -181 420 620 -119 -322 -72 679 250 -179 -253 523 435
2395D35n38k79M93K13j11m10k8K68J58l18m83M88M72l96o69J67O07J94o93j31
$$ 435 -103 -382 111 324 213 -197 -225 43 201 -117 -600 -112 360 -36 -705 -538 69 263 -430 -561
2415e61Q19J51l65p92J97Q41j84j99n94P73K58l81l76J37Q01k42p68L41N18m0
$$ -561 258 409 44 -748 -551 290 106 -93 -687 86 344 -37 -413 -276 525 283 -485 -144 374 334
2435C34l76m36N35M96l22m33l61P35L69p11RJ74M02j80o09J71O35r2l29l11M76
$$ 334 -42 -478 57 553 231 -202 -563 172 541 -170 -161 13 415 235 -374 -203 432 340 11 -300 176
2456A76L99l55p13L71M04n2p48K52K50M80l43n32M99M44j88o65M9K50N60p23k10
$$ 176 575 220 -493 -122 282 230 -518 -266 -16 464 121 -411 88 532 344 -321 -272 -22 538 -185 -395
2477c95K64O78j97q25P0M40K24l10o24M61N90k75k93n4K25L73p63j71O53K58j31
$$ -395 -131 547 350 -475 -405 35 259 -51 -675 -214 376 101 -192 -246 -21 352 -411 -582 71 329 198
2498A98q01oR19m8n63l99P52L55p01p9K32L13N04j009k09P02L02m27l97O5O18
$$ 198 -603 -609 310 262 -301 -700 52 407 -294 -373 -141 172 676 -333 -542 160 462 35 -362 -297 321
2519C21q7l43KJ94M44o75j91M26M71n0p91m7P33M3n17k82J46P48j71r10N59k4
$$ 321 234 -109 -107 87 531 -144 -335 91 562 512 -279 -326 407 450 -67 -349 -203 545 374 -536 23 -1
2541aK41k13m87P90K73m82o29L85O23l78k65m44Q48K4k68l99P0O44m3n04k08K61
$$ -1 240 27 -460 330 603 121 -508 -123 500 122 -143 -587 261 285 17 -382 -312 332 289 -215 -423 -162
2563a62M94k53r42L46R54l30n19Q7M02L25q16q3L90L96j58m90l11Q71q1k54k33
$$ -162 332 79 -863 -517 437 107 -412 -325 77 402 -414 -497 -107 289 131 -359 -670 201 120 -134 -367
2584c67K97O38m41l61Q4M52k6n68p5M17L10J04p79l8Q93k56k63m53M84M49n93
$$ -367 -70 568 127 -234 -150 302 276 -292 -367 50 360 464 -315 -353 540 284 21 -432 52 501 -92
2605i2m2J71M66J03p21j27N97Q8k34n37L15M80k91j56k23M22M39o25j83L02J74
$$ -92 -134 37 503 606 -115 -242 355 443 209 -328 -13 467 176 20 -203 219 658 33 -150 152 326
2626C26j3q30J10O70l06O8m05J82Q03q46j08Q7J84N63r89n4M91J37J48l98o4N93
$$ 326 313 -517 -407 263 -43 25 -380 -198 605 -241 -349 -262 -78 485 -504 -558 -67 70 218 -180 -244 349
2648C49l74j36m15L23M53k81l62M18O3M16q00p6P25j11j41j76q9N70l11k77J07
$$ 349 -25 -161 -576 -253 200 -81 -443 -25 38 454 -346 -422 303 192 51 -125 -214 356 45 -232 -125
2669a25J4M80n94m0K09j58P37p01J6O76l13J83l00J70N83n96n04K25j01P08n23
$$ -125 -111 369 -225 -265 -56 -214 523 -178 -162 514 201 384 84 254 837 241 -263 -38 -139 569 46
2690D6k93N02j17No6j98L93l4l45k26j01M83J33o35O85J82r8m30o97J398l26K17
$$ 46 -247 255 138 143 77 -121 272 238 -107 -333 -434 49 182 -453 232 414 316 -114 -811 587 261 478
2712D78l89o22J096q20L80m83O81k87J21k69J27J31k07j1r44J174m23K39O9k40
$$ 478 89 -533 563 -257 123 -360 321 34 155 -114 13 144 -63 -74 -1018 156 -267 -28 41 -199
2732a99P16r05n45P15M79K27p01n00O14N04m19O9p62R89n41M57l65J72O99n49
$$ -199 517 -388 -933 -218 261 488 -213 -713 -99 405 -14 55 -707 282 -259 198 -167 5 704 155
2752A55j204J038M76k58j65j82R36n39K24m16m43P98n59r1j82O57j83J26l76M27
$$ 155 -1049 -11 465 207 42 -140 796 257 481 65 -378 420 -139 -230 -412 245 62 188 -188 239
2772B39K36m21q86M30J145q4j096J78m31K01J016j285O17M04n41M75k8N79n12
$$ 239 475 54 -832 -402 743 659 -437 -259 -690 -489 527 -758 -141 263 -278 197 169 748 236
2791B36m91j52j71R15J0o05K25M7L0L65m62J81j33N21o68L9N06L42j089J67n3
$$ 236 -255 -407 -578 337 347 -258 -33 14 44 409 -53 128 -5 516 -152 -113 393 735 -354 -187 -240
2812b40K20L92m16j21K46K99o18j41L54M63l84j58j13N06K66p50K64j11M25j30
$$ -240 -20 372 -44 -165 81 380 -238 -379 -25 438 54 -104 -217 289 555 -195 69 -42 383 253
2832B53l59L2J61K11l37k68K91M38m1o22o1M66Q3l22j39K04M37k25n67J28M22
$$ 253 -106 -74 87 298 -39 -307 -16 422 381 -241 -302 164 247 -75 -214 -10 427 202 -365 -237 185
2853A85l3n09N5L13J97k60m17J21M21J7m01O2L38K76n78qJ70M8n0r6r5J77J67
$$ 185 152 -357 -302 11 208 -52 -469 -348 73 90 -311 -249 89 365 -213 -221 -51 -3 -53 -149 -244 -67 100
2876A00l09k7K91j1Q4l33j48O23q2k54l15M94J11l32j39K15L38N1l45p5rJ27k20
$$ 100 -209 -236 55 44 128 -205 -353 270 188 -66 -381 113 224 -108 -247 -32 306 357 12 -63 -72 55 -165
2899a65L5P0K96j20km21L05K62j62r5K3J59K58l94k80M44J30n50r0K34L09q5k83
$$ -165 -130 -60 236 116 114 -307 -2 260 98 3 26 185 443 49 -231 213 343 -207 -297 -63 246 161 -122
2922a22r1N9N88l24n04L97L14j37l77QL91O0m26l5JM88j51l72P1J64ql26J92L27
$$ -122 -213 -154 434 110 -394 3 317 180 -197 -189 202 262 -164 -199 -198 290 139 -233 -162 2 -6 -332 -140 187
2946A87j11O9k09j89O94q0q20P6L33J72l76K9J19P0L32n32kM10O0k01j42J88O9
$$ 187 76 145 -64 -253 441 361 -459 -383 -50 122 -254 -225 -106 -36 296 -236 -238 172 232 31 -111 77 146
2969A46N7m67J27L26J6n3k33J9L46j45j04j99J39M01l77j22ML00R4l16KK50j39
$$ 146 203 -264 -137 189 205 152 -81 -62 284 139 35 -164 -25 376 -1 -123 -119 181 275 -41 -39 211 72
2992G2k77N6k40P07k58j25j32L07K35o53N7M48M0j38l97P0M38j51k03Q2O6N6l09
$$ 72 -205 -149 -389 318 60 -65 -197 110 345 -308 -251 197 237 99 -298 -228 210 59 -144 -62 4 60 -249
3015b49p1M6J58J90j84k17L44K85j88m77L42N06n62Q5n16L75N06q01J10L74P5
$$ -249 -320 -274 -116 74 -110 -327 17 302 114 -363 -21 485 -77 8 -508 -133 373 -428 -318 56 131
3036A31q2r5l62O40J2R5m52k95J027o56l10N09L4P1m63l12N28N62n31J06o57j64
$$ 131 49 -46 -408 232 244 339 -113 -408 619 -37 -347 162 196 267 -196 -508 20 582 51 157 -500 -664
3058f64M35k50P01j92k3j30M44J24m93k90M86o99J48L53N03p00J6N51k60l27L95
$$ -664 -229 -479 222 30 7 -123 321 445 -48 -338 148 -551 -403 -50 453 -247 -231 320 60 -267 128
3079A28k27J39J07m23j5L70l14J80j15M1P1K8k6j54K10K4l70N0K71K75j77n08
$$ 128 -99 40 147 -276 -291 79 -235 -55 -170 -129 -58 -30 -56 -210 0 24 -346 -296 -25 250 73 -435
$$ [...]
8191D7
##END NTUPLES=NMR FID
##END=
