##TITLE=1H_SR29-kr2
 d6,8 sc, 
 11.02.2021
##JCAMPDX= 6.0         $$ Bruker NMR JCAMP-DX V2.0
##DATA TYPE= NMR FID
##DATA CLASS= NTUPLES
##ORIGIN= UXNMR, Bruker Analytische Messtechnik GmbH
##OWNER= root
$$ XWIN-NMR		Version 3.5
$$ Thu Feb 11 10:04:46 2021 Russian Standard Time (UT+4h)  she@DPX200
##.OBSERVE FREQUENCY= 200.1315066352
##.OBSERVE NUCLEUS= ^1H
##.DELAY= (6, 6)
##.ACQUISITION MODE= SIMULTANEOUS
##.ACQUISITION SCHEME= undefined
##.AVERAGES= 8
##.DIGITISER RES= 18
##SPECTROMETER/DATA SYSTEM= spect
##.PULSE SEQUENCE= zg30
##.SOLVENT NAME= CD3CN
##.SHIFT REFERENCE= (INTERNAL, CD3CN, 0, 15.7039)
##AUDIT TRAIL= $$ (NUMBER, WHEN, WHO, WHERE, WHAT)
$$ ##TITLE= Audit trail, XWIN-NMR		Version 3.5
$$ ##JCAMPDX= 5.01
$$ ##ORIGIN= Bruker BioSpin GmbH
$$ ##OWNER= she
$$ F:/spectra/data/she/nmr/H-F/1/audita.txt
$$ ##AUDIT TRAIL=  $$ (NUMBER, WHEN, WHO, WHERE, WHAT)
(   1,<2021-02-11 10:03:40.25 +0400>,<she>,<DPX200>,
      <created by zg, POWCHK disabled, PULCHK disabled
       configuration hash MD5:
       00 E9 B6 7A A2 85 ED C7 34 08 36 98 17 FE 4E 26
       data hash MD5: 16K
       D2 37 FF D5 E3 AD 72 7E 63 90 DA 68 1E 87 36 E1>)
$$ ##END=
$$ 
$$ hash MD5
$$ C3 0B AD 28 03 DA 2E EC 91 F6 7A F9 46 05 D5 00
##$RELAX= 
##$RELAX= 
##$RELAX= 
##$RELAX= 
##$RELAX= 
##$RELAX= 
$$ Bruker specific parameters
$$ --------------------------
##$DU= <F:/spectra>
##$EXPNO= 1
##$NAME= <H-F>
##$PROCNO= 1
##$TYPE= <nmr>
##$USER= <she>
##$AMP= (0..31)
100 100 100 100 100 100 100 100 100 100 100 100 100 100 100 100 100 100 
100 100 100 100 100 100 100 100 100 100 100 100 100 100 
##$AQSEQ= 0
##$AQ_mod= 1
##$AUNM= <au_zg>
##$AUTOPOS= <>
##$BF1= 200.13
##$BF2= 200.13
##$BF3= 200.13
##$BF4= 200.13
##$BF5= 200.13
##$BF6= 200.13
##$BF7= 200.13
##$BF8= 200.13
##$BYTORDA= 1
##$CFDGTYP= 0
##$CFRGTYP= 5
##$CHEMSTR= <none>
##$CNST= (0..31)
1 1 145 1 1 1 1 1 1 1 1 1 1 1 1 1 1 1 1 1 1 1 1 1 1 1 1 1 1 1 1 1 
##$CPDPRG= <>
##$CPDPRG1= <>
##$CPDPRG2= <>
##$CPDPRG3= <>
##$CPDPRG4= <mlev>
##$CPDPRG5= <mlev>
##$CPDPRG6= <mlev>
##$CPDPRG7= <mlev>
##$CPDPRG8= <mlev>
##$CPDPRGB= <>
##$CPDPRGT= <>
##$D= (0..31)
0 1.2 0 0 0 0 0 0 0 0.06 0 0.03 0 0 0 0 0.0002 0 0 0 0 0 0 0 0 0 0 0 0 
0 0 0 
##$DATE= 1613023419
##$DBL= (0..7)
120 120 120 120 120 120 120 120 
##$DBP= (0..7)
150 150 150 150 150 150 150 150 
##$DBP07= 0
##$DBPNAM0= <>
##$DBPNAM1= <>
##$DBPNAM2= <>
##$DBPNAM3= <>
##$DBPNAM4= <>
##$DBPNAM5= <>
##$DBPNAM6= <>
##$DBPNAM7= <>
##$DBPOAL= (0..7)
0.5 0.5 0.5 0.5 0.5 0.5 0.5 0.5 
##$DBPOFFS= (0..7)
0 0 0 0 0 0 0 0 
##$DE= 6
##$DECBNUC= <off>
##$DECIM= 32
##$DECNUC= <off>
##$DECSTAT= 4
##$DIGMOD= 1
##$DIGTYP= 9
##$DL= (0..7)
0 120 120 120 120 120 120 120 
##$DP= (0..7)
150 150 150 150 150 150 150 150 
##$DP07= 0
##$DPNAME0= <>
##$DPNAME1= <>
##$DPNAME2= <>
##$DPNAME3= <>
##$DPNAME4= <>
##$DPNAME5= <>
##$DPNAME6= <>
##$DPNAME7= <>
##$DPOAL= (0..7)
0.5 0.5 0.5 0.5 0.5 0.5 0.5 0.5 
##$DPOFFS= (0..7)
0 0 0 0 0 0 0 0 
##$DQDMODE= 0
##$DR= 18
##$DS= 0
##$DSLIST= <SSSSSSSSSSSSSSS>
$$ [...]
##$SUBNAM2= <"">
##$SUBNAM3= <"">
##$SUBNAM4= <"">
##$SUBNAM5= <"">
##$SUBNAM6= <"">
##$SUBNAM7= <"">
##$SUBNAM8= <"">
##$SUBNAM9= <"">
##$SW= 16.9725356469052
##$SWIBOX= (0..15)
0 0 2 0 0 0 0 0 0 0 0 0 0 0 0 0 
##$SW_h= 3396.73913043478
##$TD= 16384
##$TD0= 1
##$TE= 0
##$TE2= 300
##$TE3= 300
##$TEG= 300
##$TL= (0..7)
0 120 120 120 120 120 120 120 
##$TP= (0..7)
150 150 150 150 150 150 150 150 
##$TP07= 0
##$TPNAME0= <>
##$TPNAME1= <>
##$TPNAME2= <>
##$TPNAME3= <>
##$TPNAME4= <>
##$TPNAME5= <>
##$TPNAME6= <>
##$TPNAME7= <>
##$TPOAL= (0..7)
0.5 0.5 0.5 0.5 0.5 0.5 0.5 0.5 
##$TPOFFS= (0..7)
0 0 0 0 0 0 0 0 
##$TUNHIN= 0
##$TUNHOUT= 0
##$TUNXOUT= 0
##$USERA1= <user>
##$USERA2= <user>
##$USERA3= <user>
##$USERA4= <user>
##$USERA5= <user>
##$V9= 5
##$VALIST= <valist>
##$VCLIST= <CCCCCCCCCCCCCCC>
##$VD= 0
##$VDLIST= <DDDDDDDDDDDDDDD>
##$VPLIST= <PPPPPPPPPPPPPPP>
##$VTLIST= <TTTTTTTTTTTTTTT>
##$WBST= 1024
##$WBSW= 4
##$XGAIN= (0..3)
0 0 0 0 
##$XL= 0
##$YL= 0
##$YMAX_a= 36934
##$YMIN_a= -35478
##$ZGOPTNS= <>
##$ZL1= 120
##$ZL2= 120
##$ZL3= 120
##$ZL4= 120
##$ABSF1= 10
##$ABSF2= 0
##$ABSG= 5
##$ABSL= 3
##$ALPHA= 0
##$AQORDER= 0
##$ASSFAC= 0
##$ASSFACI= 0
##$ASSFACX= 0
##$ASSWID= 0
##$AUNMP= <proc_1d>
##$AZFE= 0.1
##$AZFW= 0.1
##$BCFW= 1
##$BC_mod= 2
##$BYTORDP= 1
##$COROFFS= 0
##$CY= 11.3945322036743
##$DATMOD= 1
##$DC= 2
##$DFILT= <>
##$DTYPP= 0
##$F1P= 15.9154993809931
##$F2P= -4.1035820241983
##$FCOR= 0.5
##$FTSIZE= 0
##$FT_mod= 4
##$GAMMA= 1
##$GB= 0.15
##$INTBC= 1
##$INTSCL= 1
##$ISEN= 128
##$LB= 0.24
##$LEV0= 0
##$LPBIN= 0
##$MAXI= 10000
##$MC2= 0
##$MEAN= 0
##$ME_mod= 0
##$MI= 1.114404
##$NCOEF= 0
##$NC_proc= 0
##$NLEV= 6
##$NOISF1= 3.799351
##$NOISF2= 2.8
##$NSP= 1
##$NTH_PI= 0
##$NZP= 0
##$OFFSET= 15.70392
##$PC= 1
##$PHC0= -10769.53
##$PHC1= 25.60095
##$PH_mod= 1
##$PKNL= yes
##$PPARMOD= 0
##$PSCAL= 0
##$PSIGN= 0
##$REVERSE= no
##$SF= 200.130013532006
##$SI= 16384
##$SIGF1= 3
##$SIGF2= 2
##$SINO= 400
##$SIOLD= 16384
##$SREGLST= <1H.CDCl3>
##$SSB= 0
##$STSI= 0
##$STSR= 0
##$SW_p= 3612.71676300578
##$SYMM= 0
##$S_DEV= 0
##$TDeff= 0
##$TDoff= 0
##$TI= <>
##$TILT= no
##$TM1= 0
##$TM2= 0
##$TOPLEV= 0
##$USERP1= <user>
##$USERP2= <user>
##$USERP3= <user>
##$USERP4= <user>
##$USERP5= <user>
##$WDW= 1
##$XDIM= 8192
##$YMAX_p= 0
##$YMIN_p= 0
$$ End of Bruker specific parameters
$$ ---------------------------------
##NTUPLES= NMR FID
##VAR_NAME=  TIME,          FID/REAL,        FID/IMAG
##SYMBOL=    X,             R,               I
##VAR_TYPE=  INDEPENDENT,   DEPENDENT,       DEPENDENT
##VAR_FORM=  AFFN,          ASDF,            ASDF
##VAR_DIM=   8192,          8192,            8192
##UNITS=     SECONDS,       ARBITRARY UNITS, ARBITRARY UNITS
##FACTOR=    0.0002944,     1,               1
##FIRST=     0,             0,               0
##LAST=      2.4114304,     0,               0
##MIN=       0,             -35478,          0
##MAX=       2.4114304,     36934,           0
$$ Real data points
##PAGE= N=1
##DATA TABLE= (X++(R..R)), XYDATA
0@%%%%%%%%%%%%%%%%%%pJ5j6J6j6J6j9K7l2L2l9M7n2O0o8P6q6R7j08J21j36J52
$$ 0 0 0 0 0 0 0 0 0 0 0 0 0 0 0 0 0 0 0 -7 8 -8 8 -8 8 -11 16 -16 16 -23 24 -28 32 -36 40 -46 51 -57 64 -72 80
40H0j68J87k07K28k52K80l12L43l75M14m57N02n53O12o75P46q30R23j032J161
$$ 80 -88 99 -108 120 -132 148 -164 179 -196 218 -239 263 -290 322 -353 393 -437 486 -546 615
60F15j315J506j748K060k485L098m054N770r735L5002Q220p2412L5759J5168p168
$$ 615 -700 806 -942 1118 -1367 1731 -2323 3447 -6288 28714 36934 -35478 281 15449 8281
75H281j6266L092K2753k0100O452M892k9517L2041J1354l2210p611L4852O969
$$ 8281 -7985 -4893 17860 -2240 4212 9104 -20413 11628 22982 -9228 -16839 18013 24982
88B4982n4263K2617M0178l9388j237J1457K81j612r551J9367j7969n68L2362m2392
$$ 24982 -29281 -6664 33514 -5874 -7111 4346 4627 3015 -6536 12831 -5138 -5706 26656 -15736
102a5736O24L9528k0010j7012R581K1053j8993j7949L4833j1012j6139J9248l980
$$ -15736 -15112 24416 4406 -12606 -3025 18028 -965 -18914 15919 4907 -11232 8016 4036
115D036j0887J031K0568j3779k1901L8243j0496k6449K5539J29p871l495Q964
$$ 4036 -6851 -5820 14748 969 -20932 17311 6815 -19634 5905 6034 -1837 -5332 3632
128C632K613k3800K5582M454l3828K3878J1781k1469o022J6782J0271k6881O890
$$ 3632 6245 -17555 8027 12481 -21347 2531 14312 -7157 -13179 3603 13874 -13007 -6117
141f117J7649j9194N515N814q844K083P823J242k4360J6061K5218l6519p54K7111
$$ -6117 11532 -7662 -2147 3667 -5177 -3094 4729 5971 -18389 -2328 22890 -13629 -14383 12728
155A2728o474j5218k458K2413p457j4491J7069j1024O61J5575j7357m645J6103
$$ 12728 6254 -8964 -11422 10991 3534 -10957 6112 -4912 -4251 11324 -6033 -10678 5425
168E425P422k2070q088L4619r138k5692J6468J0803p703j1183R117N749j0883
$$ 5425 12847 -9223 -17311 17308 8170 -17522 -1054 9749 2046 -9137 -20 5729 -5154
181e154J1234p719j0260K3599n811j7314O612J6280l889k4958J6930J6855k3501
$$ -5154 6080 -1639 -11899 11700 5889 -11425 -4813 11467 7578 -17380 -450 16405 -7096
194g096J565J0207l045k346L5K709p284Q930M607j9852R820J3707j3326p245R754
$$ -7096 -5531 4676 1631 -715 -680 2029 -5255 3675 8282 -11570 -1750 11957 -1369 -8614 1140
209A140J0331j7189j881J8307j2480k920J0611o482k371M056M373r049k651J6627
$$ 1140 11471 -5718 -7599 10708 -1772 -4692 5919 -563 -2934 1122 5495 -3554 -6205 10422
223A0422j0559q468J4159k214p159K488O224n581n812J4344o329j1058J4541Q00
$$ 10422 -137 -8605 5554 3340 -3819 -1331 4893 -688 -6500 7844 1515 -9543 4998 5798
237E798j0506k39R966l59j2565R024M162r988O912o20o102N376M234o138q002
$$ 5798 -4708 -4947 5019 4660 -7905 1119 5281 -4707 2205 1585 -4517 859 5093 -1045 -9047
252i047J3479N058j9232M820J3832o584q731L917Q259n881k639M400n128N974
$$ -9047 4432 9490 -9742 -4922 8910 2326 -6405 -2488 5771 -110 -2749 1651 -3477 2497
266B497K982j2111K268J1659k092j4603M504J6958j1360j0457J1763L316n369
$$ 2497 5479 -6632 -4364 7295 5203 -9400 -4896 12062 702 -9755 2008 5324 -45
279d5l601L463J653o60J543p373K079J1714q214r486R197Q644r977q336J3100
$$ -45 -3646 -183 1470 810 2353 -5020 -2941 8773 559 -8927 270 8914 -1063 -9399 3701
294C701L193j1436J995M690j347j00j035j625J365N548m686p764J0257L871j0963
$$ 3701 6894 -4542 -2547 2143 796 696 -339 -1964 -599 4949 263 -7501 2756 6627 -4336
309d336p67R428o12q776L575N930o069L29L393l620K34L903k335m338M840L792
$$ -4336 -5103 4325 3713 -5063 -1488 4442 -1627 -1298 2095 -1525 -1291 2612 277 -4061 779 4571
325D571p814K61P008l923l588M987N30m967K310M392n850j433P194j942n731L455
$$ 4571 -3243 -2982 4026 103 -3485 1502 2032 -2935 -625 3767 -2083 -3516 3678 1736 -3995 -540
341e40L746l744j724L517j043j449K880k020k929N597J025p679J151Q648l305
$$ -540 3206 -538 -2262 1255 212 -1237 1643 -377 -3306 2291 3316 -4363 -3212 5436 2131
356B131q344N176O420n632l479M214J291j511k69k126R76N244k559p029M339Q239
$$ 2131 -6213 -1037 5383 -249 -3728 486 1777 266 -3 -2129 -1153 4091 1532 -5497 -1158 7081
372G081p281o786P975M923p237l868O679K204m550m42R4J974K660m684k751N854
$$ 7081 -200 -6986 989 5912 -1325 -5193 1486 3690 -860 -1302 -1208 766 3426 -1258 -4009 1845
388A845L494p184m541R968K223j0062N80O823j13n287M41L168n62L72j924k380
$$ 1845 5339 -1845 -6386 3582 5805 -4257 -3677 3146 3033 -2254 -1813 1355 793 1165 -759 -3139
404c139N991L66o200J33O125K43p992K308P421n253k711L242N13r53r64J564j297
$$ -3139 2852 3218 -2982 -2849 3276 3519 -4473 -2165 5256 3 -2708 534 1047 94 -870 694 -603
421f03Q46K171m385K36M786k450k630J611L217l207k526N494k481k270M077j575
$$ -603 243 2414 -1971 -1735 3051 601 -2029 -418 2799 -408 -2934 2560 79 -2191 1886 311
437C11j428K12K375n94m103M762N43m422K619j40q58J315k55j249j322M625r57
$$ 311 -1117 -905 1470 876 -3227 1535 2078 -2344 275 135 -723 592 337 -912 -2234 2391 1434
454A434n696M392L051l250l272K944M222n064r99L381j586J979k182k253M714
$$ 1434 -4262 130 3181 -69 -3341 -397 3825 -1239 -2238 1143 -443 1536 -646 -2899 1815
469A815L01k315l589L418N908q095j836P463n62l592k650M845J925m257J71j58
$$ 1815 2116 -199 -3788 -370 5538 -2557 -4393 3070 2508 -1084 -3734 1111 3036 -1221 -1050 -1208
485a208K998M68n813J903L877Q30n323k782R549j977o949L822K568L03l985j195
$$ -1208 1790 2258 -3555 -1652 2225 3055 -2268 -5050 4499 2522 -4427 -605 1963 2266 -1719 -2914
501b914N409j496p46j222j208N703k927m005L344K824r78n640L118M584m869l01
$$ -2914 2495 999 253 -969 -2177 3526 599 -3406 -62 2762 1784 -3856 -738 3846 -1023 -1324
517a324Q84J486J1l448L110p23K91J812n016L413J774l755J407l06J968j259k910
$$ -1324 -440 1046 1057 -2391 719 -4 287 2099 -2917 496 2270 -1485 -78 -384 1584 325 -2585
534b585M426j565j406K318j353K81o81J064J28k590L613j464j097J685j970K354
$$ -2585 1841 276 -1130 1188 -165 116 -565 499 627 -1963 1650 186 -911 774 -1196 1158
550A158q52q87J500k701L677j223m317N446n19j700r63M69M035m042j104L115
$$ 1158 306 -581 919 -1782 1895 672 -3645 1801 1282 -418 -1381 -912 3123 -919 -2023 1092
566A092q37R38l022N60L674j919j003j671K956K637o117J022L574j08k194l005
$$ 1092 255 1193 -1829 -1269 2405 486 -517 -2188 768 3405 -2712 -1690 1884 1776 -418 -3423
582c423N182P89m649J310N65K489j422m706M537J364j460k175r15N969k374m458
$$ -3423 1759 2548 -2101 -791 -226 2263 841 -3865 672 2036 576 -1599 -2514 3455 1081 -3377
598c377K830J851R73m686J89N262k586j242p79J584K889m786K72K327K83N73n101
$$ -3377 -547 1304 2277 -2409 -2220 3042 456 -786 -1565 19 2908 -1878 -1606 721 1004 1577 -3524
615c524L635L022m567P34K7K269l48m231L416O49j346L44j359K419l78j930J354
$$ -3524 111 3133 -1434 -700 -673 1596 1248 -2983 433 1082 -264 80 -1279 1140 762 -1168 186
632A86o49K052j845j530L598k151K60J05k31J582k988J783J025k695K591j165
$$ 186 -463 1589 -256 -1786 1812 -339 -79 26 -205 1377 -1611 172 1197 -1498 1093 -72
648g2j83P60j949K601j139j104K008j824J869j098j345K394o36L19j999Q68K973
$$ -72 -255 505 -1444 1157 18 -1086 922 -902 967 -131 -1476 918 282 601 -1398 -530 2443
665B443l578j16K001j07M57l432K434K324l420J94j20J935R99m237J774J581K31
$$ 2443 -1135 -1251 750 643 1100 -2332 102 2426 -994 -800 -920 1015 2014 -2223 -449 1132 1363
682A363j897k136M764J02l843M91J944J487l396j308L982l79j054j745P53M001
$$ 1363 -534 -2670 2094 2196 -1647 -1156 788 2275 -1121 -2429 1553 1174 120 -1625 -872 3129
698C129k966k543K156J376N69m350J357M110k971j541M71K622L67l756J130J941
$$ 3129 163 -2380 -224 1152 1721 -2629 -1272 2838 -133 -1674 -1203 1419 1786 -1970 -840 1101
714A101m31p06k170K963J077k671L4M25K360j766k871L699K87j294r07Q0K784
$$ 1101 670 -36 -2206 757 1834 -837 -803 -378 1982 216 -2655 1044 1331 37 -870 -790 1994
731A994k240o76J134m09J216j558m92K008j304K36l16K16J487k209Q81N26j010
$$ 1994 -246 -922 212 -197 1019 -539 -1031 977 -327 -91 -407 -191 1296 -913 -32 494 -516
748e16P31o93J274o20j296K115j034m36Q43m48O77j174R4J347j182L65p96P53
$$ -516 215 -478 796 176 -1120 995 -39 -475 368 -80 597 -577 -483 864 -318 47 -749 4
766DJ260j949j22J058R11q79k090K337J146k411k18O58J686j146j953J908R37
$$ 4 1264 -685 -807 251 1162 283 -1807 530 1676 -735 -953 -295 1391 245 -1708 200 1137
783A137m81j388q55L295q78k263M69J721J138l313m83L423l64k094r34K267J478
$$ 1137 656 -732 -1587 1708 830 -1433 -964 757 1895 -1418 -1901 1522 1158 -936 -1870 397 1875
800A875k665o71J669J117n28k922J752K318j478k401J340K592o51k761L26K912
$$ 1875 -790 -1461 208 1325 797 -2125 -373 1945 467 -1934 -594 1998 1347 -1414 -1088 1824
816A824j055j751O5J917n42j476N3J235J358j897j106J972n0p41j383J900J455
$$ 1824 769 -982 -917 1000 458 -1018 -965 270 1628 -269 -1375 597 547 -194 -1577 323 1778
833A778k106l61J066L2k25q00K87J046j084K91M3K07k7q07O75m17J181l31p30
$$ 1778 -328 -689 377 409 184 -616 -329 717 -367 -76 -33 174 147 -660 15 -402 779 448 -282
852b82J369j299q03J478Ro88J0N23K23j100L78J40n96J97K75L92Q9l14n65Q56
$$ -282 1087 -212 -1015 463 472 -216 -206 317 540 -560 -182 -42 -638 -441 -166 226 315 1 -564 292
872B92J233j295m88Q17P31j577J17Q17R50j525j416J612R20q88k271J715J698
$$ 292 1525 230 -258 559 1290 -287 -170 647 1597 72 -1344 268 1188 300 -1971 -256 1442
889A442j199j489N52K118l58k748L1K685n9j956j080L593n08k361P9J955R39j898
$$ 1442 243 -1246 -694 1424 1066 -1682 -1651 1034 975 -981 -2061 1532 1024 -1337 -1258 697 1636 -262
907b62n09J621L67j490j086P32J918o81k410J073K590j420j585Q31J526m39j458
$$ -262 -771 850 1217 -273 -1359 -627 1291 610 -1800 -727 1863 443 -1142 -311 1215 776 -682
924f82K57J112l46q83k0J103O06j458q90J594R27j659r88J649P16j953J46J219
$$ -682 -425 687 341 -542 -562 541 1147 -311 -1201 393 1320 -339 -1327 322 1038 -915 -769 450
942D50L13j015k84N57P2N1l5p15J188k58r59N95J68J52p17K61J178j524M2J131
$$ 450 763 -252 -536 21 93 144 109 -606 582 324 -635 -40 128 280 -437 -176 1002 -522 -480 651
962F51p22p0j21P83l17q29J031o6m27m8l48P94M3n03k52J33J333j459r00K080
$$ 651 -71 -141 -262 521 204 -625 406 340 -87 -135 -483 311 354 -149 -401 -268 1065 -394 -1294 786
982G86N8j097p79J267R85j921k40J446K6l20j412Q12J428r87o89J79J598l12k451
$$ 786 844 -253 -1032 235 1220 -701 -941 505 531 211 -1201 -389 1039 52 -637 -458 1140 828 -1623
1001a623R36J956o95j578k34K545q43j625Q51N93P29j097j383K056O16j209j014
$$ -1623 -687 1269 574 -1004 -1238 1307 464 -1161 -310 283 1012 -85 -1468 588 1204 -5 -1019
1018a019O83K191k002j238J565Q17o81j509Q54J450j376l83M02O88N14j815K98
$$ -1019 -336 1855 -147 -1385 180 997 316 -1193 -339 1111 -265 -648 -246 442 956 -859 -561
1035e61R44J23q03r96J993K29j934N57P25L68q87p42J493m08k32K48o96J265r03
$$ -561 383 506 -297 -1293 700 929 -1005 -448 277 645 -242 -984 509 101 -131 117 -579 686 -217
1054b17j78P77l05K91q49K32Q14j275P01J00k65J97q00J463m21r08R57k72j14
$$ -217 -395 382 77 368 -481 -249 565 -710 -9 91 -174 23 -777 686 265 -643 314 42 -72
1073g2J28p68J329o03n22M31j80Q92j026n83J482m19j82o37P83J133k144M73J058
$$ -72 56 -712 617 14 -508 -77 -257 635 -391 -974 508 89 -93 -730 53 1186 -958 -485 573
1092E73n4o72r59J356O66j032l09P6J212k33j979J417Q26n27j183l58K715q84
$$ 573 519 -153 -1112 244 910 -122 -431 -355 857 624 -1355 62 888 361 -822 -1180 1535 651
1110F51j768P61Q02M78j683k17K006n23q53o01J063J133j939j10J056M95l72j553
$$ 651 -1117 -356 446 924 -759 -976 1030 507 -346 -947 116 1249 -690 -800 256 751 379 -1174
1128a174J287J401j818m23O15J096o54j521J380L63n22k93m23J457j98j276L75
$$ -1174 113 1514 -304 -727 -112 984 330 -1191 189 552 30 -263 -686 771 573 -703 -328
1145c28M48P73j258o35J830m98q43J70J91P30j100L64Q46q86M66n28J95O40r27
$$ -328 120 893 -365 -1000 830 332 -511 -341 -150 580 -520 -156 690 -196 270 -258 -63 577 -350
1164c50K94q5L06K00j260J103K82r25L76p5M38p57J55J011r40j63N19p1M68j028
$$ -350 -56 -141 165 365 -895 208 490 -435 -59 -134 304 -453 -298 713 -227 -390 129 58 526 -502
1184e02M58O96j011M41q57J060P69j667j18J239K15r05o59J658j97j534N45L24
$$ -502 -44 652 -359 82 -775 285 1054 -613 -731 508 723 -182 -841 817 620 -914 -369 -45
1202d5R08r27p92J119K64k79r62K28J734j011j076Q66O10L31j961M26J636j027
$$ -45 863 -64 -856 263 527 248 -714 -486 1248 237 -839 27 637 968 -993 -567 1069 42
1220D2q10J41J098N08j681L61Q68N7n89j218J616P29j763l1N76J128j041j095
$$ 42 -768 -627 471 979 -702 -341 527 584 -5 -1223 393 1122 -641 -672 -96 1032 -9 -1104
1238a104J534L36j006j82kJ303o54o54M52K55K88j183J87J022n07k65k10P61K39
$$ -1104 430 766 -240 -422 -424 879 225 -429 23 278 566 -617 -430 592 85 -180 -390 371 610
1257F10j055J87R61p90L5k65M20K51p89O43j29J38k48m88P36j64l79L49j03N42
$$ 610 -445 -258 703 -87 -52 -317 103 354 -435 208 79 217 -31 -519 217 53 -326 23 -80 462
1277D62o90k10J137j006j3K27K97q1p22O76J69k03n5k37M65K83n70m6J74L20o38
$$ 462 -228 -438 699 -307 -320 -93 204 123 -599 77 246 43 -12 -249 216 499 -71 -117 57 377 -261
1298b61n39J297k0j150J98P36K71j021P4P24r5m04n11P09P89j090l01N30O66j16
$$ -261 -800 497 477 -673 -475 261 532 -489 -415 309 214 -190 -701 8 797 -293 -594 -64 602 486
1318D86j452R00R07p91m90K23J154p20j218R58M81r4p26q7J020k15o59k66R31
$$ 486 -966 -66 841 50 -440 -217 937 217 -1001 -43 438 344 -382 -469 551 336 -323 -589 342
1337C42P97j326n99Q41N96r26l94Q10N68j042l51Q58L3k97l14K27P39n03k74k91
$$ 342 1139 -187 -786 55 651 -275 -669 141 709 -333 -684 174 207 -90 -404 -177 562 59 -215 -506
1357e06P75J48p96M5Q11n25p26M04Q22j41n29L10j18Q5j9k31L95l5r4l41L36K10
$$ -506 269 417 -379 -334 477 -48 -774 -370 452 311 -218 92 -26 59 40 -191 204 169 75 -266 70 280
1379B80m98l2O94l53n11J34N05k13n13M58L96k11m63M56K97o91k07L23M06l18
$$ 280 -218 -250 444 91 -420 -286 219 6 -507 -49 347 136 -327 129 426 -265 -472 -149 257 -61
1399f1n59N38K71K61j099K21R91k92o26L8J388o96q61N9O60k47p2N7O7K01K49
$$ -61 -620 -82 189 450 -649 -428 563 271 -355 -317 1071 375 -486 -427 233 -14 -86 -29 38 239 488
1420D88j158N02Q85p16n13N77Q95j127o40J390L63m57j143J11P81Q4n19m51O30
$$ 488 -670 -168 717 1 -512 65 960 -167 -807 583 946 489 -654 -543 238 322 -197 -648 -18
1439a8O98j065n25J152P36j407l95J719r5j320L53Q27l70j19n12N34J55j57o46
$$ -18 680 -385 -910 242 978 -429 -824 895 800 -520 -167 660 290 171 -341 193 348 191 -455
1458d55M68O32r08l0M5Q03n76n71N84L87p05j02K70O08l32J40J99p07R8K52n08
$$ -455 13 645 -263 -293 -248 555 -21 -592 -8 379 -326 -428 -158 450 118 258 457 -250 -152 100 -408
1479d08O30k10l79M92j9L61j224R74Q7J85r79Q28L66o08l18L91l1j73n37M97L12
$$ -408 222 12 -367 125 106 467 -757 217 304 489 -490 338 704 96 -222 169 138 -35 -572 -75 237
1500B37j008L34P5M34k14l37m0N47L34q39K38M05l65Q5l29N63K05r78l1J394j92
$$ 237 -771 -437 -362 72 -142 -479 -519 28 362 -477 -239 166 -199 -114 -443 120 325 -653 -684 710 518
1521E18j052o7J120l3n26o20P01M96p25j75O60K26n51o66O34N93m57o55M41R62
$$ 518 -534 -601 519 486 -40 -660 41 537 -188 -363 297 523 -28 -694 -60 533 76 -579 -138 824
1541H24q43m27j02P67N98j081L10L0j38k77L20M49j14r66P50J5k8q9q71J159K16
$$ 824 -19 -446 -548 219 817 -264 46 76 -62 -339 -19 430 316 -650 100 115 87 -2 -873 286 502
1562E02m78o94O03P03n32o46O42k90ok18J6N23k71l80K85M11L06p37k61R08l01
$$ 502 24 -670 -67 636 104 -542 100 -190 -196 -414 -398 125 -146 -526 -241 170 476 -261 -522 386 85
1583H5q3l05P34O1l49J36j34n13L95l85M24K77l45j58k4J12J89k16J62Q2k72q5
$$ 85 2 -303 431 492 143 279 145 -368 27 -358 66 343 -2 -160 -184 -72 117 -99 63 145 -127 -212
1605b12P74j122J84P79M09q65k63J0M04J94q66P77l2k61j0o07J119%j341M10J029
$$ -212 562 -560 -376 403 812 -53 -316 -306 98 292 -574 203 171 -90 -100 -707 412 412 -929 -519 510
1626E10k2j187M02P16q30J1N31R1o1l88l1J67L18j7r58N96Q95o37p69N35Q89o41
$$ 510 488 -699 -297 419 -411 -400 131 222 161 -227 -258 -91 227 210 -748 -152 743 106 -663 -128 761 120
1648A20q87Q80J23m41J69l56M78L99o44m60N73P36q40n74J157J33j256K48O45
$$ 120 -767 113 236 -205 -36 -392 86 485 -159 -619 -46 690 -150 -724 433 566 -690 -442 203
1667B03J53j164R18L44n19O3J12j02J01J8k58n03J101o7r66O03O24q73k23O90
$$ 203 356 -808 110 454 -65 -2 110 8 109 127 -131 -634 467 400 -566 37 661 -212 -435 255
1687B55no80L5J080j073J7Q01p70L27K35l20k07M35L03q21O1J062p50o16N37O96
$$ 255 250 -430 -395 685 -388 -371 430 -340 -13 222 -98 -305 130 433 -388 -327 735 -15 -631 -94 602
1708F02r09k93J016J59j005N24J66l86J89p8j56J46O02n36o63J402k01j178M10
$$ 602 -307 -600 416 575 -430 94 260 -126 63 -15 -171 -25 577 41 -622 780 579 -599 -189
1727a89R31m30j151Q26Q71j082l29O33p8K3J13l03J2Q84l56j220P16J194j075
$$ -189 742 312 -839 -13 858 -224 -553 80 2 25 138 -165 -153 731 375 -845 -129 1065 -10
1746a0q73J066O02j138N2Q23n21m15M14j14k2N23l51l73M32N88j053n00J700n20
$$ -10 -883 183 785 -353 -301 522 1 -414 0 -114 -136 387 36 -337 95 683 -370 -870 830 310
1766C10q94M95P08l29q76O79K95r98O94j55m6K55J93n79K02N76m85q52J056L62
$$ 310 -584 -89 619 290 -586 93 388 -610 84 -71 -117 138 331 -248 -46 530 45 -807 249 611
1786F11r21j75Q39j15p45N67N71q60N9K83l27O6N51k78o68P61K03q72L5J187r21
$$ 611 -310 -485 354 239 -506 61 632 -228 -169 114 -213 -147 404 126 -542 219 422 -450 -415 772 -149
1807a49k30N20M47j281K00J072q30k93P26j06j74R1J55l79J63O35q90k9Q90k19
$$ -149 -379 141 588 -693 -493 579 -251 -544 182 76 -98 -7 148 -231 -68 567 -323 -352 538 319
1827C19j107M36J229r04p24J064M8q12M82L47n51J77O0l7n41J063q69p16J917
$$ 319 -788 -352 877 -27 -751 313 361 -451 31 378 -173 4 64 27 -514 549 -320 -1036 881
1846H81j006n42j15J341q4o66m79J062r0j75N4l47K34j8j15k77N88K43j044L00
$$ 881 -125 -667 -782 559 475 -191 -670 392 302 127 181 -166 68 50 -65 -342 246 489 -555 -255
1866b55R81o63p59N88P17q14n59J168k61k63J64L55k59k53Q3k89K35M05m46o20
$$ -255 726 63 -696 -108 609 -205 -764 404 143 -120 44 399 140 -113 -30 -319 -84 321 -125 -745
1886g45R68L07j426L16J077R9j026Q34k48q29N41O37j182J62Q22m03n35P50L89
$$ -745 223 530 -896 -580 497 596 -430 404 156 -673 -132 505 -677 -515 307 -96 -631 119 508
1905E08j157P28N60j125R5O31j08o30K27Q49p63j02M20q3j02M0M1l75K87L50o00
$$ 508 -649 79 639 -486 -391 240 132 -498 -271 578 -185 -287 133 50 -52 -12 29 -346 -59 291 -309
1926c09K71O10m91n44P49L60q07k57P43j13l74l1L55k24Q0K3j18J65L02o93KO38
$$ -309 -38 572 81 -463 286 646 -161 -418 325 212 -162 -193 162 -62 18 41 -77 88 390 -303 -301 337
1948C37P5q81Q9R55n83l89K81M43l75q5J03M9l67L59m62M11M86m98n74N86M83
$$ 337 412 -469 -380 575 -8 -397 -116 327 -48 -133 -30 19 -348 11 -451 -40 446 -52 -626 -40 443
1969D43n90n36R25o4l82k0L92l54pO5K08J40R5m01k94M65M7m53L02M07pp60L90
$$ 443 -147 -683 242 178 -204 -224 168 -186 -193 -128 80 220 315 -86 -380 85 132 -321 -19 388 381 -379 11
1992A1M05l99k43L63n8k66J95j50k86M44K34n83J15N47n29p2N88k20n22N86L82
$$ 11 416 17 -226 137 79 -187 8 -142 -428 16 250 -333 -218 329 -200 -272 316 96 -426 160 542
2013E42m70l46L53j17n1J29R2l69o9K75l68N84J38n60M7L3J48k0K55r2k92N94
$$ 542 72 -274 79 -38 -89 40 132 -237 -306 -31 -399 185 323 -237 -190 -157 -9 -29 226 134 -158 436
2035D36p01N91r86P17p20K28N9K33K59r74L39L63n0o7R73r13k94K39P46q68l50
$$ 436 -265 326 -660 57 -663 -435 -376 -143 116 -858 -519 -156 -206 -273 700 -213 -507 -268 478 -390 -740
2056g40Q36n5jo6p9J51L23k27l89N81n1m70k82R54k86p62L71O00j64m17J89qJ84
$$ -740 96 41 40 -26 -105 46 369 142 -247 334 283 -187 -469 485 199 -563 -192 408 244 -173 16 8 192
2079A92j05l51N5L97m1o35J91P23l51n59M37O30o39j10K82L5m55L98K24n05J04
$$ 192 87 -264 -209 188 147 -488 -297 426 75 -484 -47 583 -56 -166 116 151 -304 94 318 -187 -83
2100h3R1q2k3M45n04k30O27p4l18K35K71l18l88M53L37m66R7K08l16K27J3m07
$$ -83 8 -74 -97 348 -156 -386 241 167 -151 84 355 37 -351 102 439 -27 70 278 -38 189 202 -205
2122b05L68K5r6n79O97Q6o92L37L60Rn79Q4N22l83K1K58j72k96k6K08N1p3K09
$$ -205 163 188 92 -487 210 296 -396 -59 301 310 -269 -185 337 -46 -25 233 61 -235 -261 -53 -2 -75 134
2145A34m12K21M43m79m41R07J00o37j31N05Q5n22PM66k3k81j39J60j74N25m35
$$ 134 -278 -57 386 -93 -534 373 473 -164 -295 210 295 -227 -220 246 223 -58 -197 -37 -211 314 -121
2166a21m34J040l40o44K78N83j88m74O7N30j34k17K6m5K29j60j40L35J02n7n77
$$ -121 -555 485 145 -499 -221 362 174 -300 -233 297 163 -54 -28 -73 156 -4 -144 191 293 236 -341
2187c41K43N69m55k41M16j00j33K6J24j46m7J12o2n5J81j04j03J34L59o79R6N45
$$ -341 -98 471 16 -225 191 91 -42 -16 108 -38 -85 27 -35 -90 91 -13 -116 18 377 -302 -206 339
2209C39k38o24N84J46p4l44K57j03k91K32K65k58K3L7k64K67J50j35j57K54J9
$$ 339 101 -523 61 207 133 -211 46 -57 -348 -116 149 -109 -86 -49 -313 -46 104 -31 -188 66 85
2230H5j75r8N14k60k54O1O60n76k75J11J81N5%q5Q9P7j40j94J15N62o35l09O41
$$ 85 -90 -188 326 66 -188 -127 533 -43 -318 -207 -26 29 29 -56 33 110 -30 -224 -109 453 -182 -491 150
2253A50O6k50k82M91k16m2J45k54K42q3j32%L02L5l51L5M72j09n41L15M80n09
$$ 150 216 -34 -316 175 -41 -83 62 -192 50 -33 -165 -165 137 172 -179 -144 328 219 -322 -7 473 -36
2275c6j79J76M20n32j0kL30j06k91M06P6j34k58j51M17L19n60j91M81J38n68o6
$$ -36 -215 -39 381 -151 -161 -163 167 61 -230 176 252 118 -140 -291 126 445 -115 -306 175 313 -255 -321
2297c21R01n21j11o7K78M1n25k6M16J65j29k67OM60m25J24J7J18M3k29N3J45j51
$$ -321 580 59 -52 -119 159 200 -325 -351 65 230 101 -166 -160 300 -125 -1 16 134 177 -52 1 146 -5
2320e%R8j65Mj22K31k11J9R2N5K02j35l06J62L60p1l44L06jj07n62N34J47j65
$$ -5 -5 93 -72 -68 -190 41 -170 -151 -59 -4 198 63 -243 -81 279 208 -136 170 169 62 -500 34 181 16
2344A6r8K05l4Q3r1j20K70k34l8J3J51j50r7j11O08k72j27k20M27k04j3p4K81
$$ 16 -82 123 89 172 81 -39 231 -3 -41 -28 123 -27 -124 -235 373 101 -26 -246 181 -23 -36 -110 171
2367A71p4j03OLK61k71k65J80K92j51j93n1M91j89k42J47K99m47O4k15N53p7l58
$$ 171 97 -6 0 3 264 -7 -272 -92 200 49 -144 -195 296 107 -135 12 311 -136 -72 -287 266 189 -169
2390a69J06p4M52m43N3J21r9k65P6M84k43j67J36PK90l59LN43m04n5oN3k4k44
$$ -169 -63 -137 315 -128 -75 46 -53 -318 -242 242 -1 -168 -32 -25 265 -94 -91 452 48 -7 -13 40 16 -228
2414b28K24j09K73j35k53N23k24r4k42K58K76j59k70K70Ol6k39L80kp9k66J01
$$ -228 -4 -113 160 25 -228 295 71 -23 -265 -7 269 110 -160 110 116 80 -159 221 219 140 -126 -25
2436b5K85k71j19J20Mk2j16R2J82j74q0JJ17j13K03j20p8J89k96J67M14l61j97
$$ -25 260 -11 -130 -10 -6 -28 -144 -52 130 -44 -124 -123 -6 -119 84 -36 -114 75 -221 -54 360 -1 -198
2459a98k1M89L0j60l67L77R8o01J11K18L83o12J25K88m03J66j79L1M84k62j05
$$ -198 -219 270 300 140 -227 150 248 -353 -242 -24 359 -253 -128 160 -243 -77 -256 -225 259 -3 -108
2480a08K08L33m95k24J96K34k78k08K73K82l67q3K12R7j23o0%P7J55k70J72r9
$$ -108 100 433 -62 -286 -90 144 -134 -342 -69 213 -154 -237 -25 72 -51 -111 -111 -34 121 -149 23 -76
2502g6J17m30L18J82R3k60l57O91j83k54N1N4K05j37o8J52O6k09J18oP3r9kr7
$$ -76 41 -389 -71 111 204 -56 -413 278 95 -159 -108 -54 151 14 -54 98 164 -45 73 67 140 41 39 -58
2526e8J70j68q4K55R4k89K00j2j80l8L7R1K5K44k89o1J41K2q1r7M45n55Q0K01
$$ -58 112 -56 -140 115 209 -80 120 108 -72 -110 -73 18 43 287 -2 -63 78 100 19 -78 367 -188 -108 93
2550I3J86n19J23N1J01p2K64j98r5j50K43j56K62j79m4o1M83j28m00rL26j58k2
$$ 93 279 -240 -117 -66 35 -37 227 29 -66 -216 27 -129 133 -46 -90 -151 332 204 -196 -205 121 -37 -59
2573e9j34M33k9m05K16%J82j76J87k93J93j55j35K75Qj17L2j97L70k72k50N08
$$ -59 -193 240 211 -194 22 22 204 28 215 -78 115 -40 -175 100 108 -9 23 -174 196 -76 -326 182
2595A82k5j78j47K44O6j11k29K23J19K2k79p9M89l82r0l8M29j63j89J52J89j68
$$ 182 157 -21 -168 76 142 31 -198 25 144 166 -113 -192 297 -85 -175 -213 216 53 -136 16 205 37
2617C7k66J07K40j28j50K09J26j05l3j31J69j37j50J34K18j57j28j8M50k22j69
$$ 37 -229 -122 118 -10 -160 49 175 70 37 -94 75 -62 -212 -78 140 -17 -145 -163 287 65 -104
2638a04n0J64J64m58J85K3L16k09P7n3j27J94k57K82l8k61j47K88J69k79n0L01
$$ -104 -154 10 174 -284 -99 -76 240 31 108 55 -72 122 -135 147 109 -152 -299 -11 158 -121 -171 130
2660A30J84m89M6R2K6M0p1o9M4K07k89r5K58J08m77L21J77k63k12K88J4J9k26
$$ 130 314 -175 -129 -37 -11 29 -42 -111 -67 140 -149 -244 14 122 -355 -34 143 -120 -332 -44 -30 -11 -237
2683b37L99j67o3N2K4O5p7J02k15J11J63rl08L56N5l08J0O8n5o9J90j27J53J03
$$ -237 162 -5 -68 -16 8 73 -4 98 -117 -6 157 148 -160 196 251 -57 -47 21 -34 -103 87 -40 113 216
2707B16k02K77k44J48l86J36K19k5l82K33O6J29l42J45J83k71L5k2K02p8j41J5
$$ 216 14 291 47 195 -191 -55 164 139 -243 -10 56 185 -157 -12 171 -100 -65 -87 115 37 -104 -89
2729h9J5N2k25K26j37l0o6J51K10j33j80K9L17m2j7k26M6J72p7O1J24l17J37r3
$$ -89 -74 -22 -247 -21 -158 -188 -254 -103 107 -26 -206 -177 140 98 81 -145 -99 73 -4 57 181 -136 1 -92
2753i2J28Q8l18M3NK16J43k47L57j48l29J96O8l1o5j63J84P1l28L19k79L22k13
$$ -92 36 124 -194 -151 -146 70 213 -34 323 175 -154 42 110 79 14 -149 35 106 -222 97 -182 140 -73
2776g3n2J3M56l20o0P7J17k79q5K11M0j79J28k06N00l61J27j21j32L72k69p2L03
$$ -73 -125 -112 344 24 -36 41 158 -121 -206 5 45 -134 -6 -212 288 -73 54 -67 -199 173 -96 -168 135
2799A35j30j54M4R5K93m68J73J86M4l65j7K84j06k14J22M7K27k80j08J54J68k96
$$ 135 5 -149 -105 -10 283 -185 -12 174 218 -147 -164 120 14 -200 -78 -31 196 -84 -192 -38 130 -166
2821a66R7m2L36l22m3K77j4o3j2r6J38p0j70K09J30j93K07n25M09k22O5J28MK65
$$ -166 -69 -111 225 -97 -140 137 123 60 48 -48 90 20 -150 59 189 -4 203 -322 87 -135 -70 58 62 327
2845C27m45P1K36l6k52P0l0N5N3j90L06k76J72p6L1J77m21J92j81K15j0m9J76
$$ 327 -118 -47 189 153 -99 -29 -59 -4 49 -141 165 -111 61 -15 16 193 -228 -36 -217 -2 -12 -61 115
2868A15qj49j93K89Q8l9k70J83K68q7j25n5J83j84k21l3M64l09j42J16J02n8k06
$$ 115 107 -42 -235 54 142 103 -167 16 284 197 72 17 200 16 -205 -238 226 -83 -225 -109 -7 -65 -271
2891b71L30M7r8k54Q6J22k9O6j98K72R4k16K1J18n1j54J36KK68l41k08N93j03
$$ -271 59 106 8 -246 -160 -38 -67 -1 -199 73 167 -49 -28 90 39 -115 21 23 291 -50 -258 335 232
2914B32l98l7J63J44M5L6L1k64M4j19J40m6K19j16L3J65k46K4j70j31K09n3J19
$$ 232 -166 -203 -40 104 149 185 216 -48 -4 -123 17 -29 190 74 107 272 26 50 -120 -251 -42 -95 24
2937B4J82l84OM31k06l00K64j70J92q8QK67r8K5k82j11N23l96L7J46k32J71j35
$$ 24 206 -178 -172 259 53 -247 17 -153 39 -49 -41 226 128 153 -129 -240 283 -113 -76 70 -162 9 -126
2960a26K26k9K62k59l55J67K79o38N67k23J07J39m46N38l3r1l16J47M06m14l2
$$ -126 100 71 333 74 -281 -114 165 -473 94 -129 -22 117 -329 209 176 85 -231 -84 322 -92 -124
2981a24O3O5P3N4j79mJ92k02lP7L5k80L49L0q3l28N29K07j81o35k1O37n11L7k42
$$ -124 -61 4 77 131 -48 -52 140 -62 -65 12 47 -233 116 146 63 -265 264 471 290 -345 -366 271 -240 -203 -445
3006d45N72M6m55p8K58M51k91j26J98j51K3l06N19k7n94L48q1J45O1n56M80l30
$$ -445 127 173 -282 -360 -102 349 58 -68 130 -21 2 -304 215 188 -406 -58 -139 6 67 -489 -9 -339
3028c39N17o43L66k48K90k69k47N64l13rM96l56J97o81O31l31M35N08o78N5M20
$$ -339 178 -465 -99 -347 -57 -326 -573 -9 -322 -331 165 -191 6 -675 -44 -375 60 568 -110 -55 365
3049C65n14n44P88M92r01n4M43m12j49L20N69j075P27l57j50O25k63p9N09k43
$$ 365 -149 -693 95 587 -314 -368 75 -337 -486 -166 403 -672 55 -302 -452 173 -90 -169 340 97
3069I7l20J44J07l22J86j12K67O50N30j430O63L35l61j48J47l73p04J018q81N60
$$ 97 -223 -79 28 -294 -108 -220 47 697 1227 -203 460 795 434 286 433 60 -644 374 -507 53
3089E3n70M59L29m12l47R74l65n59K9K82r2J2m40J0N80l08N04L65o27N57q72o3
$$ 53 -517 -58 271 -141 -488 486 121 -438 -409 -127 -219 -207 -647 -637 -57 -365 139 504 -123 434 -438 -501
3111e01M06k73N00j17K9m78M67m7J24m78K20j79K88J56J21m63o8Q28n20j41q9
$$ -501 -95 -368 132 15 44 -434 33 -14 110 -368 -148 -327 -39 117 238 -225 -293 535 15 -126 -215
3132b15L90m19M11r8J45j47j42n1K21K36j21n07L33k4l1n4J14Q1m5j46O1l9K19
$$ -215 175 -244 167 69 214 67 -75 -126 95 331 210 -297 36 12 -19 -73 41 122 77 -69 -8 -47 172
3155A72l59P9K00j14jL0J80k59j12J73K8O1m46M92J9l36L34k84K01k02rOp0J36
$$ 172 -187 -108 92 -22 -23 7 187 -72 -184 -11 17 78 -368 124 143 -193 141 -143 58 -144 -153 -147 -217 -81
3179h1K3j03K50j1j16m8L32j9k78K18M0k22r1P4Q0n5J74k59J86r6O3j72J55j05
$$ -81 -58 -161 89 78 -38 -86 246 227 -51 167 207 -15 -106 -32 48 -7 167 -92 94 -2 61 -111 44 -61
3203f1p6M9J60J59j73l68K98K70l98J65j6j59K76p1k7M2q3j41nL45J36k13m3J77
$$ -61 -137 -88 72 231 58 -310 -12 258 -140 25 9 -150 126 55 28 70 -13 -154 -159 186 322 109 66 243
3227B43k64lj55L59k72j67L80J10m14J54o4O6k6j77o4J86j16K21q8j5N1J23%N4
$$ 243 -21 -24 -179 180 -92 -259 121 231 -183 -29 -93 -27 -53 -230 -294 -108 -224 -3 -91 -106 -55 68 68 122
3251A22K02l83l43N41Mj78j46R3O5J6P7j30J41ko1n5J11j51J08Q3J8n4j16k23
$$ 122 324 -59 -402 139 143 -35 -181 -88 -23 -7 70 -60 81 79 18 -37 74 -77 31 114 132 78 -38 -261
3275b61J87Q6k70N88k64n5N3M3o97O88J64k69L67l78l76R81q56N17k36o9J48R1
$$ -261 -74 12 -258 330 66 11 64 107 -590 98 262 -7 360 -18 -394 587 -269 248 12 -57 91 182
3297A82k65K58m1M7l37q6L24Jj80L8K2k05J39J79j96L15l84J40K16k03m9l1K43
$$ 182 -83 175 134 181 -156 -242 82 83 -97 -59 -37 -242 -103 76 -120 195 -189 -49 167 -36 -85 -116 127
3320A27k3j27j61P4O5k6k02K63L3N3l51L64j67r2j13L22jJ16k62P5K74k31Q3k84
$$ 127 104 -23 -184 -110 -45 -71 -273 -10 23 76 -275 89 -78 -170 -283 39 38 154 -108 -33 241 10 93 -191
3344a91M60k28M8j77L94k68j51rK91j58J90k29L6L5j04J55j73L09l21J15j04K62
$$ -191 269 41 89 -88 306 38 -113 -122 169 11 201 -28 8 43 -61 94 -79 230 -91 24 -80 182
3366A82k84K09j22J20k18R0J28J49q1k71R1J60l32Q4K65j80Pj25m4J95J8j72J75
$$ 182 -102 107 -15 105 -113 -23 105 254 173 -98 -7 153 -179 -95 170 -10 -3 -128 -172 23 41 -131 44
3389D4K16k34q8M9l17K65M9K19M14o19k32n57L78Q57k15q69J10L48L42O3m6%m37
$$ 44 260 26 -62 -13 -330 -65 -16 203 617 -2 -234 -791 -413 444 229 -640 -530 -182 160 223 177 177 -260
3412b60K84J96l14l59O77k6J77m29k9N8l1K99l08J19J66j13Q1p4j04m43Q4N56
$$ -260 24 220 -94 -453 224 198 375 -54 -83 -25 -56 243 -65 54 220 107 188 114 10 -433 -349 207
3434B07j3j44k44P4L16j36r7J14q8k38J99L6J15j98J22J88n9j21J03j98M52l76
$$ 207 194 50 -194 -120 196 60 -37 77 -11 -249 -50 -14 101 -97 25 213 154 33 136 -62 390 14
3456A4q4q8M13r2m02M18J3k97j06k0M20j09j25K45l63K0K18k24M5J03j98O0J96
$$ 14 -70 -158 255 163 -239 179 192 -105 -211 -231 189 80 -45 200 -163 -143 75 -149 -104 -1 -199 -139 57
3479E7m8j24l32N30j75r8L75j78L7j9n0P8j34j82K32R5o3K7L8L7j09Jj60L4L04
$$ 57 9 -115 -447 83 -92 -190 185 7 44 25 -25 53 -81 -263 -31 64 1 28 66 103 -6 -5 -165 -131 173
3504A73k88m5k2L03j69J58m7j89N9J06K3O5j8o2j97J07K84l91n5L0M67j92k65
$$ 173 -115 -160 -182 121 -48 110 63 -126 -67 39 62 127 109 47 -150 -43 241 -150 -205 -175 292 100 -165
3527a65J09J52l24L39rj84K1r3L4J91k00j3j99K29n2l1K75j1k44r2M70p9j94r4
$$ -165 -56 96 -228 111 102 -82 -61 -154 -120 71 -129 -142 -341 -112 -164 -195 80 69 -175 -267 203 124 -70 -164
3551a64J26K35k37J47j17M7J23j82j11K79Nk82R8kJ14l9p0K32j77P2M6j44j78
$$ -164 -38 197 -40 107 -10 37 160 -22 -133 146 151 -131 -33 -35 79 40 -30 202 25 97 143 -1 -179
3574a79J14J99l63M79k11J05j2j23o7J82k04J08p2L9o5j07J58M0L1L7k46K02j10
$$ -179 -65 134 -229 250 39 144 132 9 -58 124 -80 28 -44 -5 -70 -177 -19 21 52 89 -157 45 -65
3597f5j83M22m85K26J92K5l01L0K5M2j48K44k87J92J44j34P9o0m0J53m6J00j4
$$ -65 -248 174 -311 -85 107 132 -169 -139 -114 -72 -220 24 -263 -71 73 -61 18 -42 -82 71 25 125 111
3620A11j03J57j58J62j14Q1j28J21q3L11m14j31L81k73J10n8l7K84k32o2j63K3
$$ 111 8 165 7 169 55 136 8 129 46 357 -57 -188 193 -80 30 -28 -65 219 -13 -75 -238 -215
3642b15R6J4K05m1L3j07P6J43j61M0j6R4l10o0Q4R3K1J21l43K71K0P5j80O2K2
$$ -215 -119 -105 100 59 92 -15 61 204 43 83 67 161 -149 -209 -125 -32 -11 110 -233 38 58 133 -47 15 37
3667C7k66R2J35K63m17K11K25j82k08O6J4j31K33p9M4R1J47m09J74l0J01j41j7
$$ 37 -229 -137 -2 261 -156 55 280 98 -110 -44 -30 -161 72 -7 37 128 275 -134 40 10 111 -30 -47
3690d7N3L21k64j55O8p0J42j16R7K37k5m69K43J72o5K1j32J25m02M9M54p2k87
$$ -47 6 327 63 -92 -24 -94 48 -68 29 266 241 -228 15 187 122 143 11 136 -266 -217 237 165 -122
3713a22N2L19M20l97l45k90P6N30k31l16J89j06N2M36L91n22k86P60o50k74M30
$$ -122 -70 249 669 272 -73 -363 -287 243 12 -304 -115 -221 -169 267 658 136 -150 610 -40 -314 116
3734A16M8n66N34j5m3l98M44J09K7r8m81M20J31J67m57l11K19m7L41K49p88M22
$$ 116 164 -402 132 117 74 -324 120 229 256 158 -323 97 228 395 -62 -373 -154 -201 140 389 -399 23
3756B3J90J84n12j47J85l2O7O23n74K30q04L07O30o49L28nP6m2m48%J49L79K53
$$ 23 213 397 -115 -262 -77 -109 -42 581 7 237 -567 -260 370 -279 49 44 120 78 -370 -370 -221 158 411
3779D11p55K69q20J548j43p77N97O50j446Q82m28N15n28k53Q03L6r55O19l93K44
$$ 411 -344 -75 -895 653 510 -267 330 980 -466 416 -12 503 -25 -278 525 561 -394 225 -168 76
3799G6r0L4K59o2l53K75l8k6j27J29K17n47N76j73J03k62j28L1n2l0N70o97L16
$$ 76 -14 20 279 217 -136 139 101 75 -52 77 294 -253 323 150 253 -9 -137 -106 -158 -188 382 -315 1
3822AJ61o05M88L41o2m87N88j40j71j98M57Nn42JM28Nj05k46J96q01R91J28k87
$$ 1 162 -443 45 386 324 -163 425 285 114 -84 373 378 -164 -163 265 270 165 -81 115 -686 305 433 146
3845A46p3k90k5o4P7m2k02L8P76j13k26l21L32J25j95J08J08J03j80n12R01n92
$$ 146 73 -217 -242 -306 -229 -271 -473 -435 341 228 2 -319 13 138 -57 51 159 262 82 -430 471 -121
3867a21J179j442L42L84o27M46Nn07Q46p55N97p80O02J50j295J004J50q61Q0O11
$$ -121 1058 -384 -42 342 -285 161 166 -341 505 -250 347 -433 169 319 -976 28 178 -683 -603 8
3887Hj70K28M4r6k12j64R6j29L35j45J02j02K91K07j04j35Pl4k54L68j48l7J69
$$ 8 -162 66 110 14 -198 -362 -266 -395 -60 -205 -103 -205 86 293 189 54 61 27 -227 141 -7 -44 125
3910A25j08j29K74Ml60K8OK1K92k31L11k44j9J36k05n7J12p6j51J51L11k00j55
$$ 125 17 -112 162 166 -194 -166 -160 -139 153 -78 233 -11 -30 106 -99 -156 -44 -120 -271 -120 191 -9 -164
3933a64M0k6J68r7k81M46n29L58K3RM9J6Q9P0k19p5j45L82j84lL29l3l83j59N83
$$ -164 -124 -150 18 -79 -360 86 -443 -85 -62 -53 -4 12 101 171 -48 -123 -268 114 -70 -73 256 223 -160 -319 264
3958B64k9l48J59L44k02l63r5K31j20J17n8J66l16L11k29L41l24L13k68j24P09
$$ 264 235 -113 46 390 188 -175 -270 -39 -159 -42 -100 66 -250 61 -168 173 -151 162 -106 -230 479
3979D79n95J33R1K96m92K75m29j68J25N57o01M58k91J69J94l56j44N8N25n66P57
$$ 479 -116 17 108 404 -88 187 -242 -410 -285 272 -329 129 -162 7 201 -155 -299 -241 284 -282 475
4000D75n76N43m99M52J34r2n99M30J74r04M00L79q44K43N14m00O71r85N68j52
$$ 475 -101 442 -57 395 529 437 -162 268 442 -462 -62 317 -527 -284 230 -170 501 -484 84 -68
4020f8M6L21j01K6o03P56r17O66L55o58J98J77J43k35j59L97j75m29N19J18l57
$$ -68 -22 299 198 224 -379 377 -540 126 481 -177 21 198 341 106 -53 344 169 -260 259 377 20
4041B0L84N5m69M35k32p10P30r1K39q3l87q0M42m36K27j6m3J01j9m07k6P28n69
$$ 20 404 459 -10 425 193 -517 213 122 361 278 -109 -189 253 -183 44 28 -15 86 67 -340 -366 362 -207
4064b07K73m3J25j3k36O5j43K89NM25o06j22R9j99J050o39N47o05k40M6J55O2
$$ -207 66 23 148 135 -101 -36 -179 110 115 540 -66 -188 -89 -288 762 123 670 65 -175 -129 26 88
4086H8m36M34J55o43K57O0K59k61l88j2N80K75p39R0O82j02O3L0k36k75K62p72
$$ 88 -348 86 241 -402 -145 -85 174 -87 -475 -487 93 368 -371 -281 401 299 362 392 156 -119 143 -629
4108f29j81JP29k40P31P40j397l88R93PJ08j25p20L40j2L91m00m16Q45l42m57
$$ -629 -810 -809 -80 -320 411 1151 -246 -634 359 366 474 349 -371 -31 -43 348 -52 -468 377 35 -422
4129d22p6N00L9J24j34k35j25M11l17M48j77k50J3L27J76k96L07q9p24L72K77
$$ -422 -498 2 41 165 31 -204 -329 82 -235 213 36 -214 -201 126 302 6 313 224 -500 -128 149
4150A49k14K43j59k98L04k37j15Q15j070O90j93j59l7K27N30j396Q88M98o93L24
$$ 149 -65 178 19 -279 25 -212 -327 488 -582 108 -85 -244 -281 -54 476 -920 -32 466 -227 97
4170I7l90k49N52K6K35k41l69K74j88L77j24J54l53K12m47M99O4J60r1m74K47
$$ 97 -293 -542 10 36 271 30 -339 -65 -253 124 0 154 -199 13 -434 65 129 289 198 -276 -29
4191b9j41k73M07K6l52K23K79J27o86k36M46K52j14K29n3j00j58O12n74j65J22
$$ -29 -170 -443 -36 -10 -362 -139 140 267 -419 -655 -209 43 -71 158 105 5 -153 459 -115 -280 -158
4212a58p56N58N09l60J62J11l31K30k22P0M15o86R01j79j59j0L6o67L78j2O3N4
$$ -158 -914 -356 153 -207 -45 66 -265 -35 -257 -187 228 -458 443 264 105 95 131 -536 -158 -170 -107 -53
4234e3lr5j67K26j46L60M6K15p53L88M77m51L85j31j18K23k0l93J47n28N36K7
$$ -53 -56 -151 -318 -92 -238 122 168 383 -370 18 495 44 429 298 180 403 383 -10 137 -391 145 172
4256A72oO5k16Q3m27N85k95k66J43J75j8L00m31J40j19k41L67k06J51j12K12J10
$$ 172 166 231 15 98 -329 256 -39 -305 -162 13 -5 295 -136 4 -115 -356 11 -195 -44 -156 56 166
4278A66l23J78j99J18J32k53K08M78m83L83n58j89P4K77Q6k40L15n62M18l92O14
$$ 166 -157 21 -178 -60 72 -181 27 505 22 405 -153 -342 -268 9 95 -145 170 -392 26 -366 248
4299B48k83J18k36L49J3m01Q8l91j00M01qo2l48N32j13l44L39M50j40o10O68M7
$$ 248 -35 83 -153 196 209 -192 -104 -495 -595 -194 -202 -264 -612 -80 -193 -537 -198 252 112 -498 170 217
4321B17n05J98K39q8K3L98l08l4k93K16J73j00k35M14o90Q11m05K8k74K24K65
$$ 217 -288 -90 149 61 84 482 174 140 -153 63 236 136 -99 315 -375 436 31 59 -215 9 274
4342B74n71j08N06k83K96l18j99M57M7O32j05n68m59P10l17q4l11N57n23N06q8
$$ 274 -297 -405 101 -182 114 -204 -403 54 101 733 628 60 -399 311 -6 -90 -401 156 -367 139 51
4363E1m86L95L02k98K4l28K4Q6M16m55J96J95n5l76l48J06M32J0J02j14k53O21
$$ 51 -435 -40 262 -36 -12 -340 -316 -230 186 -269 -73 122 67 -309 -657 -551 -119 -109 -7 -121 -374 247
4385B47m62L80j45j00j87J34M45q0J3j74l10M39l5J75j22l12L72j50n35Q73p6
$$ 247 -215 165 20 -80 -267 -133 312 232 245 71 -239 200 165 340 218 -94 278 128 -407 466 390
4406C90n27K51p1k15j15k5N66q92P5J49O51l53K86l34J50Q9K01j58n68J4N40l24
$$ 390 -137 114 43 -172 -287 -312 254 -638 -563 -414 237 -116 170 -164 -14 75 276 118 -450 -436 104 -220
4428b20p1M45q67J129n24N2l93M50L12k28m03N68o45K63O04k56K34j015M81l17
$$ -220 -291 154 -713 416 -108 -56 -449 1 313 85 -318 250 -395 -132 472 216 450 -565 -84 -401
4448d01M45o87M01M66m94N57o29N44k42J04K17N1k74j64m28O43N0l08j0J2J40
$$ -401 44 -643 -242 224 -270 287 -342 202 -40 64 281 332 58 -106 -534 109 159 -149 -159 -147 -7
4469gr4M28k34p04J055p87k51Q32j68K92p86P68l90o0L07m98K27O80l48m29k51
$$ -7 -101 327 93 -611 444 -343 -594 238 70 362 -424 344 -46 -106 201 -297 -70 610 262 -167 -418
4490d18M96k15j69O09p62N73n31K03K29l21L4L62k69J41q1j14p1j84N30N81J60
$$ -418 78 -137 -306 303 -459 114 -417 -214 15 -306 -272 90 -179 -38 -119 -233 -304 -488 42 623 783
4511G83r68j19L86n9q49L69N17P6J67q50R07k60m84N24M78p52O5L6j23k08j34
$$ 783 -185 -304 82 23 -826 -457 60 136 303 -547 360 100 -384 140 618 -134 -69 -33 -156 -364 -498
4532d98J038m28L40j024J055m15N08m52O8o08J154o23oj07L62p63N12P78j255
$$ -498 540 112 452 -572 483 68 576 124 192 -416 738 115 109 2 364 -399 113 891 -364
4551c64J65M30K17m82N45j67o12K54j19l6N65p62J66J37J396j041L57q24q36J54
$$ -364 -199 231 448 -34 511 344 -268 -14 -133 -169 396 -366 -200 -63 1333 292 649 -175 -1011 -857
4571h57L56j96K01L86m56J020m34M27j135L63p93J476k04N22k57o43l90m63R34
$$ -857 -501 -697 -496 -110 -566 454 20 447 -688 -325 -1118 358 154 676 419 -224 -614 -1077 -143
4590a43M06p38p4o6P78K83n11l01N22L17m78p54J11O77PR81p93n34o66J7N26j82
$$ -143 263 -475 -549 -615 163 446 -65 -366 156 473 -5 -759 -648 29 36 1017 224 -310 -976 -959 -433 -615
4612f15R81p89J56l04J66Q16j29k44M59j187O11O82o25m61j02M49l71N60l69Q98
$$ -615 366 -423 -267 -571 -405 411 282 38 497 -690 -79 603 -22 -483 -585 -136 -507 53 -316 582
4632E82k53n98R09p61K53J47j82n30j66L70M80m05J85m18l29J422q70p48J247
$$ 582 329 -269 640 -121 132 279 97 -433 -599 -229 251 -154 31 -387 -716 706 -164 -912 335
4651C35k71l68j03P9j05R27q1m53n49M81K31m2m54L83j60l58P23k53m24j97Q30
$$ 335 64 -304 -407 -328 -433 494 413 -40 -589 -108 123 81 -373 10 -150 -508 215 -38 -462 -659 171
4672A71j23j15M63m08L23l28n08N01N0L70q99N26j97K18q7J53k08m5Q11r17J36
$$ 171 48 -67 396 -12 311 -17 -525 -24 26 396 -503 23 -174 44 -43 110 -98 -143 668 -249 -113
4693a13j66M69j29l95K60j68K91l95P58p09M39j32lk75J87L05m22K37j76K36L71
$$ -113 -279 190 61 -334 -74 -242 49 -346 412 -297 142 10 7 -268 -81 224 -198 39 -137 99 470
4714D70o93J64l34K91m8Q5j22J5M0k5L9J02M60m46K90m58L42k26m6k6J48N2j11
$$ 470 -223 -59 -393 -102 -150 -65 -187 -172 -132 -157 -118 -16 444 -2 288 -170 172 -54 -100 -126 22 74 -37
4737c7kJ46j43RM9mq6Q7N2R3k44j35L42K3L6l43L19k15O9j15J92m9p5Pj65K58
$$ -37 -39 107 -36 -27 22 18 -68 19 71 164 -80 -215 127 150 186 -157 162 -53 16 -99 93 44 -31 -24 -189 69
4763F9j86N9k1k9M53j88k39L5K9l1J73j76j33M32l2Jk55M6q9L09m75K18L6J25
$$ 69 -117 -58 -79 -108 345 157 -82 -47 -18 -49 124 -52 -185 247 215 216 -39 7 -82 227 -248 -30 6 131
4787A31o7j3J21j55kn6L86l54J95Jl34k3L68j48j57J25P8p6k8J5L7j76L0K92p0
$$ 131 64 51 172 17 15 -41 345 -9 186 187 -147 -170 198 50 -107 18 96 20 -8 7 44 -132 -102 190 120
4812A20k36J93j35J88j26J9j79J05J21m02K90N2J37l63P9K45l8m4L22l84J56q1
$$ 120 -116 77 -58 130 4 23 -156 -51 70 -332 -42 10 147 -216 -137 108 70 26 348 -36 120 39
4834C9j11J61j59rj05J00oJ22J97j60j65L13q1q0j57l7R5J32j18O6P1k64K07q3
$$ 39 -72 89 -70 -79 -184 -84 -90 32 229 69 -96 217 136 56 -101 -138 -43 89 -29 37 108 -156 51 -32
4858c2K61j17j27p3J81k50J94k39Q5J50m0r2j04M82p9J57n42J97Q5l8J75n23L33
$$ -32 229 112 -15 -88 93 -157 37 -202 -117 33 -7 -99 -203 279 200 357 -185 12 97 59 234 -289 44
4881D4K12m45M19K4m48M52l41l6K18l61N8K83k84L9j01p7Q8O01j64l91N04j08
$$ 44 256 -189 230 254 -194 258 -83 -119 99 -262 -204 79 -205 -166 -267 -344 -256 345 181 -210 294 186
4903A86L70n21k02J51o2m00O88K65m1p66J23L57n24K85k22Q8J34j15l0O02m7n78
$$ 186 556 35 -167 -16 -78 -478 210 475 434 -332 -209 148 -376 -91 -313 -225 -91 -206 -236 366 319 -259
4925b59O76n16M69k37k74J58J79J44o50K99l9n9J48j2K59L55o95j81O02j31N54
$$ -259 417 -99 370 133 -141 17 196 340 -310 -11 -50 -109 39 27 286 641 -54 -235 367 236 790
4946G90q47K40j03J84l91K71o02O15n2k21j5L35n56J3P02n61M31K25n09k49K83
$$ 790 -57 183 80 264 -127 144 -458 157 105 -116 -131 204 -352 -339 363 -198 233 458 -51 -300 -17
4967a7O67o93l84j17O0N43J23K07m87k4l32P88n97O01n6L63n53m56p7L80L81o3
$$ -17 650 -43 -427 -544 -484 59 182 389 -98 -122 -454 334 -263 338 282 645 92 -364 -441 -61 320 257
4989B57J39K58m23l58K10J453j417k35K53K31M30o38k14p72Q06k78J092o04L18
$$ 257 396 654 231 -127 83 1536 119 -116 137 368 798 160 -54 -826 -20 -298 794 190 508
5008E08l23m25K60J21L17R7o9m86k92P12p29K45M50L8K32l14j058N34O37k05J17
$$ 508 185 -240 20 141 458 555 486 0 -292 420 -309 -64 386 424 656 342 -716 -182 455 250 367
5029C67o43J91R68k41j446P96J96o12J10R94k87q91L94J09M91q64N42J27m24J49
$$ 367 -276 -85 883 642 -804 -8 188 -424 -314 680 393 -498 -104 5 496 -368 174 301 -123 26
5049B6R8K88k17l03k46J65K33k37M56L10o88K01L92m53o11L40J5L4N68l70K58
$$ 26 124 412 195 -108 -354 -189 44 -193 263 573 -115 86 478 25 -586 -246 -231 -197 371 1 259
5070B59r2Q0n66L67L70l49L5j74J40j46J2k41Q25j58n19N7N08nn89K49l57L05
$$ 259 167 247 -319 48 418 69 104 -70 70 -76 -64 -305 520 362 -157 -100 408 403 -186 63 -294 11
5092A1N20l94J95m81l5L4P6PK21J33l26K79k28j02J24J49n35O30k8k37j32j16
$$ 11 531 137 332 -149 -184 -150 -74 -67 154 287 -39 240 12 -90 34 183 -352 278 250 13 -119 -235
5114b35N75k68j58j49L91j4L3j90j55K47k0ok04K89l41J71k54R0K17J41j42j83
$$ -235 340 72 -86 -235 156 142 175 -15 -170 77 57 51 -153 136 -205 -34 -288 -198 19 160 18 -165
5136a65J17Q8j91J50N8J60n54M19J3m29J76J98J55N9k12j37J43k06N0K61k8J70
$$ -165 -48 40 -151 -1 57 217 -337 82 95 -334 -158 40 195 254 42 -95 48 -158 -108 153 125 295
5158B95k59j9K01j08j91J39m1J98m60L60L3k59Q6L18m65K38K4p5J06j7J01l75
$$ 295 36 17 218 110 -81 58 17 215 -245 115 148 -111 -25 293 -172 66 90 15 121 104 205 -170
5180a70M74k20nj48K81k33q7J47J01O9j5M9l48K91j08J65l87K64j01O1j48l7Q5
$$ -170 304 84 79 -69 212 -21 -108 39 140 209 194 243 -105 186 78 243 -144 120 19 80 -68 -105 -20
5203b0k73L16J08j83M5k72L59rj4K48m96J73j29J54km0k31q5L64J96J21q10P64
$$ -20 -293 23 131 -52 -7 -279 80 71 57 305 -191 -18 -147 7 5 -35 -266 -351 13 209 330 -480 284
5226B84k28o5J02J01j16k44N7K18j33L13l30J28ok18J19M2J5J2J03o8M1j31R0
$$ 284 56 -9 93 194 78 -166 -109 109 -24 289 -41 87 81 -137 -18 24 39 51 154 86 127 -4 86
5249H6J71l93L44j87Q4Rj70j33N52k72k20J3Q6J51k81L07k74L93k34%J7k02J46
$$ 86 257 -136 208 21 105 114 -56 -189 363 91 -129 -116 -30 121 -160 147 -127 266 32 32 49 -153 -7
5272gpRj57J79j20L15j51k02K39l08m1J94L3K47j11q6kp8n8L16l7k96K77j99R2
$$ -7 -14 -5 -162 17 -103 212 61 -141 98 -210 -251 -57 -24 223 112 26 24 -54 -112 204 167 -129 148 -51 41
5297D1o3J20P5k99N2J53L7j9l7j77J82j18P0oK19m79J13K96k38nj8J1L0J35r5
$$ 41 -22 98 173 -126 -74 79 116 97 60 -117 65 -53 17 11 230 -249 -136 160 -78 -83 -101 -90 -60 75 -20
5322b0r2J18J24J98j35k83Pj5Q2J31j77j07J57p0J20q5j51L13j78K4j5K7K6O7
$$ -20 -112 6 130 328 193 -90 -83 -98 -16 115 -62 -169 -12 -82 38 -47 -198 115 -63 -39 -54 -27 -1 66
5346F6j47O5p8m6K01k18J83K38l55J18L33o03J74R4J02j89L68n60K76p00N87m45
$$ 66 -81 -16 -94 -140 61 -157 26 264 -91 27 360 -243 -69 25 127 -62 306 -254 22 -678 -91 -536
5368e36R01p2k75L14m84K72j3l69L27O5j35k86K57m1J0J88N02o59j55o1J74K22
$$ -536 365 293 18 332 -152 120 107 -262 65 130 -5 -291 -34 -75 -65 123 625 -34 -189 -250 -76 146
5390A46l22K55J14j88J31l48L45k4j0n0j67J74J55k27j37L65j96K9k58Q2O7l4
$$ 146 -176 79 193 5 136 -212 133 109 99 49 -118 56 211 -16 -153 212 16 45 -213 -131 -64 -98
5412i8K60K4k01L5J18k92j85L92j09L14m2J5j43l22L94l71K00RK48k28n9j4O6
$$ -98 162 186 -15 20 138 -154 -339 53 -56 258 216 231 88 -234 160 -211 -11 -2 246 18 -41 -55 11
5435A1j62n07R03l31J55N7o12L28L79m82L47K39n89L48km50J66K60L35j04k22
$$ 11 -151 -658 245 -86 69 126 -486 -158 221 -261 86 325 -264 84 82 -368 -202 58 393 289 67
5456F7L30l74J32p3O20j294M68K09o29Q98o72O79j81J0L52J26o72j32k80k35M85
$$ 67 397 23 155 82 702 -592 -124 85 -544 354 -318 361 180 190 542 668 -4 -136 -416 -651 -166
5477a66m12K97O25j069J043n9M9l39j86K10L76k6m81N99l48K21K3p57J98P23J17
$$ -166 -578 -281 344 -725 318 259 308 -31 -217 -7 369 343 -138 461 113 334 357 -400 -202 521 638
5498F38j096l4R27n87j26M88o26K91L89l31K18J95m54O20r39K38J026q85K32k43
$$ 638 -458 -492 435 -152 -278 210 -416 -125 264 -67 151 346 -108 512 -427 -189 837 -48 184 -59
5518e9L44J96j97j58K92n46M97m37L84o0m3o21O04N5k79M38n45M96m59N85o70
$$ -59 285 481 284 126 418 -128 369 -68 316 256 213 -408 196 251 -28 410 -135 361 -98 487 -183
5539a83Q63l77k74n7N19j40o55M77j84M11o78J049q59J1n6M15K36p29M55o06K32
$$ -183 680 303 29 -28 491 351 -304 173 -11 400 -278 771 -88 -77 -133 282 518 -211 244 -362 -130
5560a30j2k41L44j57j0L27O2J86l22P7m27P80l2m85L99m11L63k08o18J73P10o94
$$ -130 -142 -383 -39 -196 -206 121 183 369 47 124 -303 477 445 -40 359 -52 311 103 -515 -342 368 -326
5582c26K53K11K11j86J99n63K6l98Q97n23r0O72k73K48P9k2k67O43j041K45k03
$$ -326 -73 138 349 163 362 -201 -175 -573 324 -199 -289 383 110 358 437 415 148 791 -250 -5 -208
5603b08N52m52Q52n32K09r80R32q88K05O81j224R42J53L83o7j105k7L35o01P63
$$ -208 344 -108 744 212 421 -559 373 -515 -310 371 -853 89 242 625 558 -547 -574 -239 -840 -77
5623g7M55l07M1n87O57k96k57M74L26l47l18P83j122N68J68o14M79K47n25M29
$$ -77 378 71 112 -475 182 -114 -371 103 429 82 -236 547 -575 -7 161 -453 26 273 -252 177
5643A77n7J69m00L5K00nJ05l72j25M15l1j40k09J62J29k83K60J40n45jM24NOQ
$$ 177 120 289 -111 -76 124 119 224 -148 -273 142 111 -29 -238 -76 53 -230 30 170 -375 -376 48 53 59 67
5667F7q7o2K65j3l17L54m38J95m8M3k64M03j08jk06j0K07l7j19J41RJ14k60l1
$$ 67 -20 -82 183 170 -147 207 -231 -36 -84 -41 -305 98 -10 -11 -217 -227 -20 -57 -176 -35 -26 88 -172 -203
5691b03N48m44j27J86L1J05j02p6K06m22L93Q7J07o1k43j02J80n5j55J00R7j57
$$ -203 345 -99 -226 -40 -9 96 -6 -82 124 -298 95 182 289 228 -15 -117 63 8 -147 -47 50 -107
5713a07j50J70P3L9Kn3K9j19j20P45l07p01Q0K90oP4j18Q7M44k81p7K09l96K24
$$ -107 -257 -87 -14 25 27 -26 3 -116 -236 509 202 -499 -419 -129 -135 -61 -179 -92 352 71 -6 203 -193 31
5737C1l07J46Q47p00J50k49J49O10j441J92M63L9RO56j211J202j10p35l1l73P36
$$ 31 -276 -130 717 17 167 -82 67 677 -764 -572 -109 -70 -61 595 -616 586 476 -259 -290 -663 73
5758G3L55l59P39o09P99n96N3m43L31k90j0l23K76n42L76L96l08k86j06R72l53
$$ 73 428 69 808 199 998 402 455 12 343 53 43 -280 -4 -546 -170 226 -82 -368 -474 498 145
5779A45m90N42q1o99O94J7K67k12O89j6m09q03P52J28m8q38j6j96L99N72n71o6
$$ 145 -345 197 116 -583 111 128 395 183 872 856 447 -356 396 524 476 -362 -378 -574 -175 397 -174 -240
5801b40R7q7L82p19K17M09k10R03r61j3o38J417l28L2L27o83M66q51Q97j16k80
$$ -240 -143 -230 152 -567 -350 59 -151 752 -209 -222 -860 557 229 261 588 -95 371 -480 417 301 21
5822B1o28P83k51J41l55J315j115J70k98o75J491m22j93j353P95N26K82N9l3n93
$$ 21 -607 176 -75 66 -289 1026 -89 81 -217 -892 599 177 -16 -1369 -574 -48 234 293 260 -333
5842c33M05m26n19O05J73K85K38l51p66J247M20j280m0L01L76o34O70J18p68J437
$$ -333 72 -354 -873 -268 -95 190 428 77 -689 558 978 -302 -342 -41 335 -299 371 489 -279 1158
5862A158j018k63N09q6k73L11N1l29M0N82r64P27n13Q30n97K01m79J70L00K76
$$ 1158 140 -123 386 300 27 338 389 60 100 682 -282 445 -68 762 165 366 -113 57 357 633
5882F33J44r21O27L78j83j121J90L96l12J24M79q70P18j31l82L57r1K1k0K54l41
$$ 633 777 -144 483 861 678 -443 -253 143 -169 -45 434 -436 282 151 -231 126 35 56 36 290 -51
5903e1m22J57J02J72K95j06r6p5K17j27P7l01J68k1R4l52M87p7q8k13j17K8Q78
$$ -51 -473 -316 -214 -42 253 147 51 -24 193 66 143 -158 10 -11 83 -269 218 141 53 -160 -277 -249 629
5926F29n46j37k53O86j47l41N9L40k79J74l78K93j56O6K17k97O8M8jJ6P3k35J76
$$ 629 83 -54 -307 379 232 -109 -50 290 11 185 -193 100 -56 10 227 -70 -2 46 45 61 134 -101 75
5949G5j87m9P5jJ81q4L0k00J16m9K03l27O8n6J75O2MLRL6k04K30P9r7O3j3m11
$$ 75 -112 -161 -86 -87 94 10 40 -160 -44 -93 110 -217 -149 -205 -30 32 36 39 48 84 -120 110 189 92 155 142 -269
5976b69J66J44j88L09j68j04L26j85k28K56o1j28pJ35q3m0Q2k9J60j5J61k67r6
$$ -269 -103 41 -147 162 -6 -110 216 31 -197 59 -2 -130 -137 -2 -85 -125 -43 -72 88 73 234 -33 -129
5999a29K58k74L5L05R7j72k16K90j53q9k01L55j85J63M7O0k43K61j65mr6J89j52
$$ -129 129 -145 -110 195 292 120 -96 194 41 -48 -249 106 -79 84 131 191 -52 209 44 40 -56 133 -19
6022a9R6J78j69J53l21J51R3j02j64J59k5l6K00m8P4l02O8N7j27Q8K27l44R8l2
$$ -19 77 255 86 239 -82 69 162 60 -104 55 30 -6 194 146 220 -82 -14 43 -84 4 231 -113 -15 -47
6046d7N8%K7P9l75L96j6m02K32L26q7n9k16K80Qk38m1N4nJ0J10j43OJ9J97l22
$$ -47 11 11 38 117 -258 138 122 -280 -48 278 191 132 -84 196 204 -34 -75 -21 -26 -16 94 -49 -43 -24 173 -149
6072a49K78l29K13jlN5p7k95L82P0j69r8J05k98J90O2P0M07k95j95K71m7j88J52
$$ -149 129 -200 13 12 9 64 -13 -308 74 144 -25 -123 -18 -316 -126 -64 6 413 118 -77 194 147 -41 111
6096A11n7k17j26J35Q1j07J52P1J6K11k69K7oj25R2j48Q3R4p6o8P2K9r9L64l73
$$ 111 54 -163 -289 -154 -73 -180 -28 43 59 270 1 28 22 -103 -11 -159 -76 18 -58 -126 -54 -25 -124 240 -133
6121a33J49L8j06J58oP2p1k96Q2K59k51M08j55j15R2p5K13n6j53K35j35L5J06
$$ -133 16 54 -52 106 100 172 101 -195 -113 146 -105 303 148 33 125 50 263 207 54 289 154 189 295
6144B95k17r8M5R2j05r1j16L14N8j45j53J87J65k07O9k97L5K26j12J65p2J36k13
$$ 295 78 -20 25 117 12 -79 -195 119 177 32 -121 66 231 24 93 -204 -169 57 -55 110 38 174 -39
6167c9Q7%nk4L0%J13M0j39m8q1K71j48K0M24o00J22j23k51M41n1j79l23N1O08
$$ -39 48 48 43 19 49 49 162 202 63 15 -66 205 57 77 501 -99 23 -100 -351 90 39 -140 -463 -412 196
6192A96n86Q41m09p0L58n67J88R4r2N50n84O31p31N71j73m43J93L4O0R3k12M84
$$ 196 -390 451 42 -28 330 -237 -49 45 -47 503 -81 550 -181 390 217 -226 -33 1 61 154 -58 426
6214D26r46R62M0q82N05J54j028J106N31r70J83j30M51K12q4r3l18l95j81M65
$$ 426 -520 442 482 -400 105 259 -769 337 868 -102 81 -49 402 614 530 437 119 -276 -457 8
6234HP5OL3l6L03n1q42J254r56j15M70o96N60K16k93M44j36m78N71n11M74m69
$$ 8 83 89 122 86 389 338 -504 750 -206 -321 149 -547 13 229 -64 380 244 -234 337 -174 300 -169
6256a69M68p8M60K1p44L1L13N8o81O35l45k81j09J26K68j47K51k28L01j79m0N56
$$ -169 299 221 681 702 -42 -11 302 360 -321 314 -31 -312 -421 -295 -27 -174 77 -151 150 -29 -69 487
6278D87j16n82K83M81j44m63Q7k65L86j57R2K95l88k56j37L75K87k33K67p46N45
$$ 487 371 -211 72 553 409 -54 33 -232 154 -3 89 384 -4 -260 -397 -22 265 32 299 -447 98
6299I8RN6m52P83k51q24J014j096R48l32K25j33l28N7r6J75K34J86Nn5m2m42K24
$$ 98 107 163 -289 494 243 -581 433 -663 285 -47 178 45 -283 -226 -322 -147 87 273 278 223 181 -261 -37
6322c7j44K03J53r5j45j50L6N51j79j36K67l83J37k59m82O23p4L41l67J99K08
$$ -37 -181 22 175 80 -65 -215 -179 372 193 57 324 -59 78 -181 -663 -40 -114 227 -140 59 267
6343B67K49j096J024p22M38k36L0k09L89l15l95O59l55N33n60J02q6P29K71q92
$$ 267 516 -580 444 -278 160 -76 -46 -255 134 -181 -576 83 -272 261 -299 -197 -283 446 717 -175
6363a75M68p88J89P23n53K13J39k87m15M01L67l42N14J19n21j6J17m96M37J53
$$ -175 293 -495 -306 417 -136 77 216 -71 -486 -85 282 -60 454 573 52 36 153 -343 94 247
6383B47N16q66j67J02l63Q44m35k51m82J122M99q51n01Q09k50K76rN29j326R63
$$ 247 763 -103 -270 -168 -531 313 -122 -373 -855 267 766 -85 -586 223 -27 249 240 769 -557 406
6403D06m30n32Q2j73P74r54P78j16M22j24o37M00q60J173o50N82k26j02M20o78
$$ 406 -24 -556 -474 -647 127 -827 -49 -165 257 133 -504 -104 -964 209 -441 141 -85 -187 233 -445
6423d45L17j49J85m69O91m80N57k83Q0o76n0Q29q0l79Q84q92L59J71k45j33L08
$$ -445 -128 -277 -92 -561 130 -350 207 -76 4 -672 -722 107 27 -352 532 -360 -1 170 -75 -208 100
6444A00n02J058p0q56M46p1J40m26K06Q5k63k23J76L21J07l15L78r9k95K19l81
$$ 100 -402 656 586 -270 176 105 245 -181 25 110 -153 -376 -200 121 228 -87 291 192 -103 116 -265
6465b65J08K30m0K32n69K54K14j72o9L9r6P6l51K49l3K52R0j32j69m4L57j68J87
$$ -265 -157 73 33 265 -304 -50 164 -8 -77 -38 -134 -58 -409 -160 -193 59 149 17 -152 -196 161 -7 180
6488A80j97K73j46j38Q9J4o2o8k1r8J02m2Q3J25l08J92P4%Or3J8N2m3j13J48k47
$$ 180 -17 256 110 -28 61 75 13 -55 -76 -174 -72 -114 -31 94 -214 -22 52 52 58 -35 -17 35 -8 -121 27 -220
6514b20K02o0L04k54j02L2J09K03pl79L06l4J23k53j68M77l47j8J25J15r4P5L00
$$ -220 -18 -78 226 -28 -130 -98 11 214 207 -172 134 100 223 -30 -198 279 -68 -86 39 154 60 135 435
6537D35l97%n9K4J72o1Q1k50n2K6J26j57L22q3J52j95l21Q2K09m6R3ok09K47q0
$$ 435 38 38 -21 3 175 114 195 -55 -107 -81 45 -112 210 127 279 84 -237 -155 54 8 101 95 -114 133 53
6562E3l4Q8m6J14l28O9L6Pj52J90nM7q2q5m6L69j30k46K70M7r2k93J57Q8j10J
$$ 53 19 107 61 175 -153 -84 -48 -41 -193 -3 -8 39 -43 -128 -174 195 65 -181 89 136 44 -249 -92 -4 -114 -113
6588a13MJ58j23M8k7P5M1j41J99J0l48K69OQ6o7o4J17j50O8p5K52l47J36l3p0
$$ -113 -109 49 -74 -26 -53 22 63 -78 121 131 -217 52 58 144 77 13 130 -20 48 -27 225 -122 14 -19 -89
6613h9J38pRj58J59n2P9j32j83P7L03Ok00J23J6r0q6j1j05J31J05j1J59J21l12
$$ -89 49 42 51 -107 52 0 79 -53 -236 -159 144 150 -50 73 89 -1 -87 -98 -203 -72 33 22 181 302 -10
6638a0J06j24lj20J43K51j06j58P1J40k89J66j56J38j72K04j73J62j25M1K13l09
$$ -10 96 -28 -31 -151 -8 243 137 -21 50 190 -99 67 -89 49 -123 81 -92 70 -55 -14 199 -110
6660a10K2J82L5j21rk53L41j22Ko5K02k86K20p9J78p8r8O6k60P4L89k16j31J72
$$ -110 -88 94 129 8 -1 -254 87 -35 -33 -98 104 -182 38 -41 137 59 -39 27 -233 -159 230 14 -117 55
6684E5j88L26o2J13k23Q1k6j14J59j70q6J3L6J11k11J11L68j52k20J31n1k45J79
$$ 55 -133 193 131 244 21 102 76 -38 121 -49 -135 -122 -86 25 -186 -75 293 141 -79 52 1 -244 -65
6707f5N1n4K7J27mq8K1r1J40M0k23J47jm1K24j30J51j57o4p7j7J41j62J11l2J24
$$ -65 -14 -68 -41 86 82 -6 15 -76 64 104 -119 28 27 -14 210 80 231 74 10 -67 -84 57 -105 6 -26 98
6733I8m7lJ01j82Q9M0P0O3m88K51m9M1R0n3k0K9pQ6j53j21Q5J26j31O4k5p0J45
$$ 98 51 48 149 -33 56 96 166 229 -259 -8 -57 -16 74 21 1 30 23 109 -44 -165 -80 46 -85 -21 -46 -116 29
6760B9r6J33q0j38J46QJ00j28N1P6K88k41j37J7l23K10LK2j24J03L3K86j68J82
$$ 29 -67 66 -14 -152 -6 2 102 -26 25 101 389 148 11 28 -295 -85 -82 -60 -184 -81 -48 238 70 252
6784B52l72J4J43l21L61K3N7l31k8J50L9j9jJ25j21K9j00K0Q5OL3l5k64m5L06
$$ 252 -120 -106 37 -284 77 100 157 -174 -202 -52 -13 -32 -33 92 -29 0 -100 -80 5 11 44 9 -255 -300 6
6809FP9j26Q6J11l42K72j20K11k90J05K7r9J91k25M00m24n2J85L8l7J3P2N9j64
$$ 6 85 -41 45 156 -186 86 -34 177 -113 -8 19 -80 111 -114 286 -138 -190 -5 33 -4 9 81 140 -24
6833b4K26l18jJ63J53q4k85k0L66j41q9M14k92p9O9p7N4l2L0j00J79l4k6lr5P4
$$ -24 202 -116 -117 46 199 115 -170 -190 176 35 -54 360 68 -11 58 -19 35 3 33 -67 112 78 52 49 -46 28
6859B8j44K69k85J90j35J79j15L5J3j67J36q3M3K4j05M45m08k1K09j97mn4K79
$$ 28 -116 153 -132 58 -77 102 -13 22 35 -132 4 -79 -36 -12 -117 328 -80 -101 108 -89 -93 -147 132
6882A32q8r0j15M59l49M3J29j10P2m1M2j17L7k20R3K50K06k09m40L75j51L39j96
$$ 132 44 -46 -161 298 -51 -8 121 11 83 42 84 -33 4 -216 -123 127 333 124 -316 59 -92 247 51
6905E1j66J27J14q3P4j52J54j20m2L7M9o6J37j92L60o5l31j19L69J6j17l1j1M9
$$ 51 -115 12 126 43 117 -35 119 -1 -43 -6 43 -23 114 -78 282 217 -114 -233 136 152 35 4 -7 42
6929D2j43L27j78Q8j47o5p9L58l37K66q6k80Q5J24j60K87k62J62N9r6k13J78J75
$$ 42 -101 226 48 136 -11 -76 -155 203 -134 132 46 -234 -149 -25 -185 102 -160 2 61 -35 -248 -70 105
6952A05lj89K81j05j57q5J79J24j15L14l30J58l3j83O7Q8P6l55J05K99k20j15
$$ 105 102 -87 194 89 -68 -153 26 150 35 349 19 177 144 -39 28 116 192 -163 -58 241 21 -94
6974i4P3K1j07O4j03K48r1J09o1j44J18j15Q5J43j31j25j38L20J37N6k37j08j31
$$ -94 -21 0 -107 -43 -146 102 11 120 59 -85 33 -82 3 146 15 -110 -248 72 209 265 28 -80 -211
6997b11L24l15K26p3O8O4k86J91J23oj47j20j72L25Nk00Q7J91P6o3k38J30q4J7
$$ -211 113 -202 24 -49 19 83 -203 -12 111 105 -42 -162 -334 -9 -4 -204 -117 74 150 87 -151 -21 -105 -88
7021h8K85j59l85K18pJ4L71j56P0k02o2j41K19K31l49J58J2J95j59l18L15j40
$$ -88 197 38 -347 -129 -136 -122 249 93 163 -39 -101 -242 -23 208 -141 17 29 224 65 -253 62 -78
7043g8J19P8j49n3p7O3J56j87L60K4o03L03J64k17j3J13l68M26j04K83k07j31
$$ -78 41 119 -30 -83 -160 -97 59 -128 232 256 -347 -44 120 -97 -110 3 -365 61 -43 240 33 -98
7065i8l0k12J96K62l6j56K3P3m16L70J66k67J20q2J65j05M02p5j58j16n3J65j33
$$ -98 -128 -340 -144 118 82 -74 -51 22 -394 -24 142 -125 -5 -87 78 -27 375 300 142 26 -27 138 5
7088En1J20k6no9r1l2J10N4ql06O63m96J20J1rj04J90p3k0l16K74k65N22l93L24
$$ 5 -46 74 48 43 -26 -117 -149 -39 15 7 -299 364 -132 -12 -1 -10 -114 76 3 -17 -333 -59 -324 198 -195 129
7114A29j222O39K32o88O52P1M12j64jk27K62q0J55j62P9jK50k69L55l53K33l91
$$ 129 -1093 -454 -222 -910 -258 -187 225 61 60 -167 95 15 170 8 87 86 336 67 422 69 302 -89
7136h9J85k79K78o6o2j42M55o6j33q45J136n11Q3j4L68k01J35M9q02N71j39Q8
$$ -89 96 -183 95 29 -33 -175 280 214 81 -764 372 -139 -56 -70 298 97 232 281 -521 50 -89 -1
7158aK10M64l85o14K89q6J79O6j85L72J16j10o71Q07j87L9k42j29pL42r5j04m12
$$ -1 209 673 288 -326 -37 -123 56 122 -63 309 425 315 -356 451 264 303 61 -68 -75 267 172 68 -344
7181c44L15m10m1M03kj04L19M21o83L02n72rL97O74n12K43m37j90l39O08l47K32
$$ -344 -29 -439 -480 -77 -79 -183 136 557 -126 176 -396 -405 -8 666 154 397 -40 -230 -569 39 -308 -76
7203g6J79k4N06n50j27M25n37M84n66j09N48L10n36J072q78o40P27L00m39K07
$$ -76 103 79 585 35 -92 333 -204 280 -286 -395 153 463 -73 999 121 -519 208 508 69 276
7223B76m09k42Q14j101N91J76k58j17L51o50N01N83p27P13r01N68M32l31m10K22
$$ 276 -133 -375 439 -662 -71 105 -153 -270 81 -569 -68 515 -212 501 -400 168 600 269 -141 81
7243H1J7k67Q01m39N86o94L45l19n35L53j353J778M23m72K67p37p5K05l16N82
$$ 81 98 -169 632 193 779 85 430 111 -424 -71 -1424 354 777 305 572 -165 -240 -35 -351 231
7263B31j05j71J50L51k23n58J88k40Q13n14l39l5O02j77L93l52m63N7O77n99j8
$$ 231 126 -45 105 456 233 -325 -137 -377 436 -78 -417 -452 150 -27 366 14 -449 -392 285 -314 -332
7284c32M54l4O8k17l04N45O82p12j64%L92m13P29j047N70K1j00k40m40J128p74
$$ -332 122 88 156 -61 -365 180 862 150 -14 -14 378 -35 694 -353 217 238 138 -102 -542 586 -188
7305a88R8R2m10N39m43J61P6n4N88k38l84J34j55J81K66l34K56r8k43J79j14K35
$$ -188 -90 2 -408 131 -312 -151 -75 -129 459 221 -163 -29 -184 -3 263 -71 185 87 -156 23 -91 144
7327A44j33J52j9p3j61L5J19j26J85l66K0K93k07J20j37J74M4J64k10k7J52m28
$$ 144 11 163 144 71 -90 -55 64 -62 123 -243 -223 70 -137 -17 -154 20 64 228 18 -9 143 -285
7349b85J30O2L33m01N88p34k68M97k34K30J27J97o93N57l7K34l0J43j37j79q5
$$ -285 -155 -93 240 -161 427 -307 -575 -78 -312 -82 45 242 -451 106 69 303 273 416 279 100 15
7370A5L72l52j85j62M73k87J84j09p5Q0J68j88K16j98O6r8J90j54KJ70j76N3R
$$ 15 387 35 -150 -312 161 -126 58 -51 -126 -46 122 -66 150 -48 18 -80 110 -44 -42 128 -48 5 14
7393A4k1n2K73L0m35J96O9M7j56N5J9P4L03n45l9K95l46L54k2k69K79k5j78J39
$$ 14 -7 -59 214 244 -191 5 74 121 -35 20 39 113 416 -129 -168 127 -219 135 113 -156 123 98 -80 59
7417E9M0oJ16j00j57l6m3J64K75m09N0J27o6m4j16j70K89J47J21j9j67k43J48
$$ 59 99 93 209 109 -48 -84 -127 37 312 -97 -47 80 14 -30 -146 -316 -27 120 241 222 55 -188 -40
7440d0m4J03O1K16n83J30Q7j73J14m9M2nK11k09M2K50l16P0J45k0m5j05J49n4
$$ -40 -84 19 80 296 -287 -157 -70 -243 -129 -178 -136 -141 70 -139 -97 153 -163 -93 52 32 -13 -118 31 -23
7464b3o8j15P2L6K45k82K88J21k89J9J61J2j22j40K97k80l8K33l01L2J06j32M61
$$ -23 -91 -206 -134 -98 147 -135 153 274 -15 4 165 177 55 -85 212 -68 -106 127 -174 -142 -36 -168 293
7487B93o2l59l1K90m6l21L07p2m0m5R1j36r4K75N1j26J81j28m0J51n8j57K5n8
$$ 293 231 -128 -159 131 85 -236 71 -1 -41 -86 5 -131 -225 50 101 -25 156 28 -12 139 81 -76 -51 -109
7511a09k09M72N5j8%j13j13k10K21K27j28k03LJ83OM7j61j14L4M20l71J20k80
$$ -109 -318 154 209 191 191 78 -35 -245 -24 203 75 -128 -125 58 64 111 -50 -164 -130 290 -81 39 -241
7534b41R6O9r8K4J02K02q6J6j87K70l3j07j73J82m2n0k6J87j20K7j41J49J98k75
$$ -241 -145 -76 -174 -150 -48 154 68 84 -103 167 134 27 -146 36 -6 -56 -82 105 -15 12 -129 20 218 -57
7558e7J4Q0j19J14j03M3Q7k34J05qLm6K0K16l48K98k11J84p8j57L49j18K08k17
$$ -57 -43 37 -82 32 -71 -28 59 -175 -70 -78 -75 -121 -101 115 -233 65 -146 38 -40 -197 152 34 242 25
7582B5k78K5J46J00k39L01k9J30k29j17L6K10l8L6o5r8R9k1J37k20P9Qm8K6O3
$$ 25 -253 -228 -82 18 -221 80 51 181 -48 -165 -129 81 43 79 14 -84 15 -6 131 -89 -10 -2 -50 -24 39
7607C9pm6J15k20O1P6n5J41k9q0J95k52J93j67j32K32j50p2RK33j37M19o9n64
$$ 39 32 -14 101 -119 -58 18 -37 104 75 -5 190 -62 131 -36 -168 64 -86 -158 -149 84 -53 366 297 -267
7631b67J72P5M18o03R84p28L32J79l63m99K19J41q2J48k49j07nL89l70L60j22
$$ -267 -95 -20 398 -205 779 51 383 562 199 -300 -81 60 -22 126 -123 -230 -235 154 -216 144 22
7652B2j31Q5JJ3K4k86K79o4J16L7J6Lj71J39rL8N1m2j42n6J8Q7N1j7j23J53J81
$$ 22 -109 -24 -23 -10 14 -272 7 -57 59 96 112 115 -56 83 74 112 163 121 -21 -77 -59 28 79 62 -61 92 273
7679B73l30l4J93p6K8k0k90L92k9jk01j26K7J66k0K32k09Q9Nr9J85l69K82J16
$$ 273 -57 -91 102 26 54 34 -256 136 107 106 -95 -221 -194 -28 -48 184 -25 64 69 -30 155 -214 68 184
7703A84j67j11J00j65K92j41k6j18L36j86J67j08k78J58m7J21MK7j91J57k19P3
$$ 184 17 -94 6 -159 133 -8 -34 -152 184 -2 165 57 -221 -63 -110 11 15 42 -149 8 -211 -138
7725a38L89k86J39k15j11P8K08l24L76Q7o6m3l8j55R7J2l3K22k88K00j01ok08
$$ -138 251 -35 104 -111 -222 -144 64 -260 116 203 137 94 56 -99 -2 10 -23 199 -89 111 10 4 -204
7748b04L42K3j76j07J49P3q1o2j64K71k0j67N1J12j91J84k38L27m08L38r8K2p4
$$ -204 138 161 -15 -122 27 100 19 -43 -207 64 44 -123 -72 40 -151 33 -205 122 -286 52 -46 -24 -98
7771i8k5O8N1N4j72M4j7n2rJ66J49O6k62j68n8M14k07j75L98j47O6N4j04j43j5
$$ -98 -123 -55 -4 50 -122 -78 -95 -147 -156 10 159 225 -37 -205 -263 151 -56 -231 167 20 86 140 36 -107 -122
7796a22K60l27J79l22L41MN3k3J2k08O8j81L15j05k1L5Po9Q6o5lJ60J29r7k07
$$ -122 138 -189 -10 -332 9 13 66 43 55 -153 -85 -266 49 -56 -77 -42 -35 -104 -18 -83 -86 74 203 106 -101
7821a01Q7q6J96P9LO7j86k14P4L13k91R7o7m6J85l09J95j30M0J13K22j62j08K21
$$ -101 -14 -100 96 175 178 245 59 -155 -81 232 -59 38 -29 -75 110 -199 -4 -134 -94 19 241 79 -29 192
7845A92o5m4O0J2O3k72j08P8R6p9J09K90l23J86k82K05k9n2k62J43K58k29p2J74
$$ 192 127 83 143 155 218 -54 -162 -84 12 -67 42 332 9 195 -87 118 89 37 -225 -82 176 -53 -125 49
7869D9l02N6K63m4k38K55l5j5L9l1J92l18K52j33J28m2j16K05q7K9M4j88O0J7
$$ 49 -253 -197 66 22 -216 39 4 -11 28 -3 189 -129 123 -10 118 76 -40 165 78 107 151 -37 23 40
7893D0m3J35k13O6LlJ45j12R6p2n8k27J62R9Q3J5j87J91r4J3O0r7K22M7p7j10
$$ 40 -3 132 -81 -15 -12 -15 130 18 114 42 -16 -243 -81 18 101 116 -71 120 26 39 99 2 224 271 194 84
7919H4j60J27qQ4j27K2J2J51k42L04k46J92j49J8n8J19j68L7K25l6K07J16p48
$$ 84 -76 51 43 127 0 22 34 185 -57 247 1 193 44 62 4 123 -45 -8 217 181 388 504 -244
7942b44j82J74q1N67m79NK54n0L2J12q9k8L80l63P5O7p0N4M3M3l48q4QK83J7Q3
$$ -244 -426 -252 -333 234 -245 -240 14 -36 -4 108 19 -9 371 8 83 150 80 134 177 220 -128 -212 -204 79 96 179
7968A79l15J54l39M43j35j3K83j66l12M88l00J76n3k0n97M43L73n37n70M63Jk5
$$ 179 -136 18 -321 122 -13 -26 257 91 -221 267 -33 143 90 70 -527 -84 289 -248 -818 -355 -354 -379
7990c79P93k83J55K46j15n79j77N6K41L77k56J65k06l40J14R8K2o2p4J77J47q4
$$ -379 414 131 286 532 417 -162 -339 -283 -42 335 79 244 38 -302 -188 -90 -68 -130 -204 -27 120 36
8012C6j25p8J49N2l15M60j52j85K16J07j78J65L2k11J90o0j89L15k94l1J82k6
$$ 36 -89 -167 -18 34 -281 179 27 -158 58 165 -13 152 184 -27 163 103 -86 229 -65 -96 86 60
8034F0n5p6M4J05k74K7J20r4N0K28k07R9O1q9J85k95J25K05j78J01r0q3O7o4j
$$ 60 5 -71 -27 78 -196 -169 -49 -143 -93 135 -72 27 88 -1 184 -111 14 219 41 142 52 -31 36 -28 -29
8059b9r3J80J73j82J78j63j65Q9J19j50J34J24k48K45j02k42j14P1K48j64r9K62
$$ -29 -122 58 231 49 227 64 -101 -12 107 -43 91 215 -33 212 110 -132 -246 -175 73 -91 -190 72
8081G2r6k50J5J42J71O7n7J7j88K00k48L9J63j60J19nJ36j12l9N5J31k27J00J9
$$ 72 -24 -274 -259 -117 54 121 64 81 -107 93 -155 -116 47 -113 6 1 137 25 -14 41 172 -55 45 64
8105F4R3k49l11N54j03n2P6k2l17L13k72K46Q6j58N6j20K74j94J46l74q2M74p3
$$ 64 157 -92 -403 151 48 -4 72 50 -267 46 -226 20 106 -52 4 -116 158 -36 110 -264 -346 128 55
8128E5k85L78n7j8j87J18n1J16k33K33j03k59L88J70l15P7r0q7KO8J6J48J29l43
$$ 55 -230 148 91 73 -114 4 -47 69 -164 69 -34 -293 95 265 -50 27 -63 -150 -148 -80 -64 84 213 -130
8152a30M6O3j6N1K96j68p37M64O74p79K11R9M8J1l58K18k5j09J9K43O1k5j16j06
$$ -130 -84 -21 -37 14 310 142 -595 -131 543 -236 -25 74 122 133 -225 -7 -32 -141 -122 121 182 157 41 -65
8176f5R1k06R8Q9J19k87J76J85k57l8j6j69K78k64R4
$$ -65 26 -180 -82 7 126 -161 15 200 -57 -95 -111 -280 -2 -266 -172
8191a72
$$ Imaginary data points
##PAGE= N=2
##DATA TABLE= (X++(I..I)), XYDATA
0@%%%%%%%%%%%%%%%%%JrJ6j6J6j6J7k5L2l2L9m7N1n9P0p9Q8j01J15j28J44j64
$$ 0 0 0 0 0 0 0 0 0 0 0 0 0 0 0 0 0 0 1 -8 8 -8 8 -8 9 -16 16 -16 23 -24 27 -32 38 -41 47 -54 61 -67 77 -87
39h7J83k00K23k49K75l05L38l76M13m53N00n50O06o68P38q16Q98r93J104j230
$$ -87 96 -104 119 -130 145 -160 178 -198 215 -238 262 -288 318 -350 388 -428 470 -523 581 -649
59f49J377j547J752k005K322k736L302m128N472q179K7057m9651J0531M7615k9799
$$ -649 728 -819 933 -1072 1250 -1486 1816 -2312 3160 -5019 22038 -27613 -17082 30533 734
74G34n675l931K5997j5153r856J7192k2543J4613K3171l7021m881K8723J0557
$$ 734 -4941 -8872 17125 1972 -7884 9308 -13235 1378 24549 -12472 -17353 11370 21927
87B1927m5471N364N3015l7022j9272K8647n350n02q566J1027j324j6649L1573
$$ 21927 -23544 -18180 34835 -2187 -21459 7188 1838 1336 -7230 3797 2473 -14176 17397
100A7397k3075j9272M7705j5777k6528J5372J6362j0107k3791K9489M298k9580
$$ 17397 -5678 -24950 22755 6978 -19550 -4178 12184 2077 -21714 7775 12073 -17507
112a7507J9689K437j3531L553J3324l372k5843K7974P528l7304K3563J0773j7457
$$ -17507 2182 4619 -8912 -5359 7965 4593 -21250 6724 14252 -23052 511 11284 -6173
125f173J120M183P057j8084J0049J9048l5346J2665K3538k5917n194J6834R376
$$ -6173 -5053 -870 6187 -11897 -1848 17200 -18146 -5481 18057 -7860 -13054 3780 13156
138A3156k1625m137K6562j6641n093J4503r990J101O254J45j5368M773K9020k8812
$$ 13156 -8469 -12606 13956 -2685 -7778 6725 -3265 -2164 4090 4235 -11133 -6360 22660 -6152
152f152j3624L4849o278j8775J364J7717K18k2159J5252J858j1218J7325j1809
$$ -6152 -19776 15073 8795 -9980 -8616 9101 9319 -12840 2412 4270 -6948 10377 -1432
165a432r486J7951M060j6737j0049K9549Q92l3283J5570J7150j2908r161O564
$$ -1432 -10918 7033 11093 -5644 -15693 13856 14748 -18535 -2965 14185 1277 -7884 -1320
178a320J0446j1813L187L366j4316J8183K158k2113Q515J4519l548k1163R267
$$ -1320 9126 -2687 500 3866 -10450 7733 9891 -12222 -3707 10812 7264 -13899 -4632
191d632K3696k3080o554J7913m617m215K43K784k964J502Q145j6339K642J8548
$$ -4632 19064 -4016 -10570 7343 2726 -1489 -1246 1538 -1426 76 8221 -8118 -5476 13072
205A3072j3699r146J1150Q838j2703q319K0156o090j1989J3818l908n608N620
$$ 13072 -627 -9773 1377 10215 -2488 -10807 9349 3259 -8730 5088 1180 -4428 1192
218A192K200m611n307J3643l382j4527J4710J673j0885L463N515k685p360J0473
$$ 1192 3392 -1219 -6526 7117 3735 -10792 3918 5591 -5294 -1831 3684 999 -6361 4112
232D112M58j4758J2581N503j3295O09Q750J386j2142M108J0178j1129K194N120
$$ 4112 4570 -10188 2393 7896 -5399 -4790 3960 5346 -6796 -2688 7490 -3639 -1445 3675
246C675p942M417M398n369o287R121P952j7813J13J7530o618j0706N199Q295m704
$$ 3675 -4267 150 4548 -821 -7108 2013 9965 -7848 -7735 9795 3177 -7529 -2330 5965 1261
261A261o233O388k040N91N284j0477M90J1843k284j2621K153J6922q291j4716
$$ 1261 -4972 1416 -624 -33 5251 -5226 -4736 7107 4823 -7798 -5645 11277 2986 -11730
275a1730J3060O083q677l156L850L492k577R1k998p90J0701n630j0858R553Q310
$$ -11730 1330 7413 -1264 -4420 -570 2922 345 436 -2562 -3352 7349 1719 -9139 414 8724
290H724r423q664J1423O816j3672J78Q101k027k067k72m60J149L566k326p525
$$ 8724 -699 -9363 2060 8876 -4796 -4618 3483 1456 -611 -883 -1343 -194 3372 1046 -6479
305f479P534O230j1149j753J0007l5r002J674P893n076l004N337k578j379L945
$$ -6479 1055 7285 -3864 -5617 4390 4355 -4647 -2973 4920 -156 -3160 2177 -401 -1780 2165
320B165j349m004L265M418o465k191Q167k562n574M879J863m918J164M633m188
$$ 2165 816 -3188 77 4495 -1970 -4161 4006 1444 -4130 749 2612 -2306 -1142 3491 -697
335f97l268P053l11o612K744N042m179k679M019J95k394J798m66k759M010K176
$$ -697 -3965 3088 2777 -3835 -1091 3951 -228 -2907 1112 1307 -1087 711 245 -2514 1496 3672
351C672p242J34Q558k209q674M011P768n973m912N550J953k679p34o64Q96L263
$$ 3672 -3570 -3436 5122 2913 -5761 -1750 6018 45 -4867 683 2636 -43 -777 -1441 -545 2718
367B718j226o146L203Q044o041p834Q172N541p679m206O940L099n992j118K890
$$ 2718 1492 -4654 -1451 6593 552 -7282 890 6431 -1248 -5454 1486 4585 -1407 -2525 365
382C65L57J932l590l130N486L345o318m373Q825L490j0297o43Q232p14n667K75
$$ 365 722 2654 -936 -4066 1420 4765 -1553 -5926 2899 6389 -3908 -4551 3681 2967 -2700 -2425
398b425M625o65j801l75j589M076J535o548M74N819J42p216P01Q395m087n187
$$ -2425 2200 1535 -266 -641 -2230 1846 3381 -3167 -2693 3126 3268 -3948 -3247 5148 1061 -4126
414d126M844Q28j793l90P65j5o86K372l045j298N388j755l828K217K855k274l119
$$ -4126 718 1546 -247 -637 128 113 -573 1799 -1246 -2544 2844 1089 -2739 -522 2333 59 -3060
431c060M611K42m458L811m2k788J315J165K78l615K258L121n270J725J894j960
$$ -3060 1551 1793 -2665 1146 1104 -1684 -369 796 1074 -2541 -283 2838 -2432 -707 1187 -773
447g73J428l32j020o04K466J098n886L042M712m954k354K800M123m145l006M965
$$ -773 655 323 -697 -1301 1165 2263 -3623 -581 4131 -823 -3177 -377 3746 -399 -3405 1560
463A560q80p80J43k646M181O52l417j591K186N808o323m281Q611L8n382q83M123
$$ 1560 680 -100 43 -2603 1578 2230 -1187 -2778 -592 5216 -1107 -5388 3223 3261 -2121 -3004 1119
480A119K620n213n70K303P49J161m791R55M867j183l812k432P635O51q758L534
$$ 1119 3739 -1474 -2044 259 1008 2169 -2622 -1667 3200 2017 -1795 -4227 3408 4059 -4699 -1165
496a165M146j914k187k031N865m23l740J028j251L933p40n357M160K588j833m255
$$ -1165 2981 1067 -1120 -3151 2714 2291 -1449 -421 -1672 2261 1521 -3836 324 2912 1079 -3176
512c176J632N905m580k224L078K38J74l043J640K345k424J928l347P00M365m460
$$ -3176 -1544 4361 -219 -2443 635 873 1047 -1996 -356 1989 -435 1493 -1854 -1154 3211 -1249
528a249K79J590N2K5l153L484M63l396L180j500l94O67m07J549k657J928R78l073
$$ -1249 -970 620 672 697 -2456 1028 1491 -1905 1275 -225 -619 48 -359 1190 -1467 461 1439 -1634
546a634K170q82M19J232k838K034j026R40J353n020M108J673l897M56NL184k361
$$ -1634 536 -346 73 1305 -1533 501 -525 415 1768 -3252 856 2529 -1368 -912 -907 2277 -84
563h4k692M418o29q48r96q44M211j883k024M27J037L232n672l90N511j662j932
$$ -84 -2776 1642 1013 165 -831 -1675 2536 653 -1371 -944 93 3325 -2347 -2737 2774 1112 -820
580h20k113M048K454o101J157K225M60j57m713L546L133l525r32q01M830k76o326
$$ -820 -2933 1115 3569 -2532 -1375 850 1310 1153 -3560 -14 3119 -406 -1338 -2139 2691 2415 -3911
597c911L433K886r40k892j023N423j829l107J487L87K864l601j747M186o10m51
$$ -3911 -478 2408 1468 -1424 -2447 2976 1147 -1960 -473 -86 2778 -823 -2570 1616 1006 555
613E55k718J223M557m749o25K363K19Q37m271K429K765l229M26p74J467J005l052
$$ 555 -2163 -940 3617 -1132 -1757 606 825 1662 -2609 -180 2585 -644 -218 -992 475 1480 -1572
630a572J591M5P34k66k454L320o38j589J384j317J877j376p44K423k606J271R20
$$ -1572 19 64 798 532 -1922 1398 760 -829 555 -762 1115 -261 -1005 1418 -1188 83 1003
647A003j963J644j296Q78Q82k613K177p93j47Q30k109K214J56j230r5m89L202
$$ 1003 -960 684 -612 266 1148 -1465 712 -81 -228 602 -1507 707 863 -367 -462 -951 2251
664B251k532j956L518o07l90j818Q39L656l817l05J213O26J124l704P29L296j665
$$ 2251 -281 -2237 1281 674 284 -1534 -695 2961 -856 -1161 52 678 1802 -1902 -1173 2123 458
681D58j026j492L066J821m861P37K411O59k102k468M069M14k562l47M75L337k137
$$ 458 -568 -2060 1006 2827 -2034 -1297 1114 1773 -329 -2797 1272 1686 -876 -1223 -748 2589 452
698D52l147L044J032j51l017j56N040k550k713J657J664P41l720L11L661j717
$$ 452 -2695 349 1381 1230 -1787 -1943 3097 547 -2166 -509 1155 1896 -1824 -1513 2148 431
714D31q52j115J614K397l523m18J475J244o51l202K874J418k461J20o7K284j087
$$ 431 -421 -1536 78 2475 -1048 -1466 9 1253 602 -2600 274 1692 -769 -649 -716 1568 481
731D81k020K227o30k0Rj328K287n23r78M40n1J188j563j84J680j289J51L5k35
$$ 481 -1539 688 58 38 47 -1281 1006 483 -495 -55 -106 1082 -481 -665 1015 -274 -123 -88 -323
750c23N67j141J579k80j408J394m64N08k65o68J423q77l79N2n9J600j647q04J747
$$ -323 244 -897 682 402 -1006 388 -76 432 167 -501 922 45 -334 -282 -341 1259 -388 -1192 555
769E55L15o29j799J660K111k980l18J491O09p8k589J412J587j349r43m04K690
$$ 555 870 241 -1558 102 2213 -767 -1085 406 1015 937 -1652 -240 1347 -2 -945 -1349 1341
786A341O1l146O23K290M09k829r49L757J23k908k26J639J583k315j277K315Q21
$$ 1341 1402 -1744 -1121 1169 1578 -1251 -2200 1557 1680 -1228 -1454 185 1768 -547 -1824 491 1312
803A312j069j793R85K769k158j621R24K302J09l863J644K611j196k151j92K022
$$ 1312 243 -1550 -565 2204 46 -1575 -651 1651 1760 -2103 -459 2152 956 -1195 -1387 635
819F35N69k407K87J317N47j014j528J902J472k032p42J360J149j816j125K155
$$ 635 1204 -1203 -916 401 948 -66 -1594 308 1780 -252 -994 366 1515 -301 -1426 729
835G29l33p46j10R06M2n01n44Q18j78l06O7k96J102N0j024l66J098j12p88M62
$$ 729 396 -350 -460 446 488 -13 -557 261 83 -223 -156 -452 650 700 -324 -690 408 296 -492 -30
855c0M27m52p33R37M16j101M02P36j352K10J1Q86p17N7L81P5K86n80q26O85Q55
$$ -30 397 -55 -788 149 565 -536 -134 602 -750 -540 -529 357 -360 -303 78 153 439 -141 -967 -282 573
876E73j414n08J255J934k629j186K203Q13r88l20k90N40l3j512J370J270J19k411
$$ 573 -841 -1349 -94 1840 -789 -1975 228 1041 53 -267 -557 -17 -50 -1562 -192 1078 1197 -1214
894a214m62K752j52k451N83K542k03k467k37K275l10j607n53J945J086j267k281
$$ -1214 -1676 1076 924 -1527 -944 1598 1395 -1072 -1309 966 656 -951 -1504 441 1527 260 -2021
911b021J311K591j379k346J160K236j056k513J447J866j035j305M96J805q26j065
$$ -2021 -710 1881 502 -1844 -684 1552 496 -2017 -570 1296 261 -1044 -548 1257 431 -634
927f34oQ81P79j123j212J865N50j485o57J410R30j882j72J396R0r44m32R62l8
$$ -634 -640 241 1020 -103 -1315 550 1100 -385 -1042 368 1298 -584 -756 640 730 -214 -646 316 278
946B78l87J08m46O49M11j253P12L39r7p40J60Q26m84p68J053j34q80M48N02r4
$$ 278 -109 -1 -447 202 613 -640 72 411 314 -426 -266 560 76 -692 361 227 -653 -205 297 203
966B03q26O95M68r61J47j40O62J40m44oJ01M67o24j463K061L87j723J71J004J057
$$ 203 -623 72 540 -421 -274 -414 248 388 -56 -62 39 506 -118 -1581 480 867 -856 -685 319 1376
986A376j914o52J889p8q15m98K74J597r24j113M71J330k5k067K87K449r58j727
$$ 1376 -538 -1190 699 621 -194 -692 -418 1179 255 -858 -387 943 918 -1149 -862 1587 629 -1098
1004a098K5K048N9k428J156J104j87r44j000J728N99j421m16N48J725j224j914
$$ -1098 -1073 975 1034 -1394 -238 866 679 -265 -1265 463 1062 -359 -775 -227 1498 274 -1640
1021a640K116O94j149j135P40J810j729o49O48N66M81j552Q8J709o45n00q53J431
$$ -1640 476 1170 21 -1114 -374 1436 -293 -942 -294 272 753 -799 -711 998 353 -147 -1000 431
1039D31J007k509N05R64ln09o29J236K04j172M00j87L55P4r71J158j61j23l13
$$ 431 1438 -1071 -566 398 395 -114 -743 493 697 -475 -75 -262 93 167 -804 354 193 70 -243
1058b43n68J314n66o02J105k66J55r30Q71K36j317R79K93n11J94l42N76J35j208
$$ -243 -811 503 -63 -665 440 174 329 -601 270 506 -811 168 461 -50 144 -198 378 513 -695
1077f95P90j15K72k02j108J688n3j139J71K08J441j705o20J990p75m93n53J088
$$ -695 95 -20 252 50 -1058 630 577 -562 -391 -183 1258 -447 -1067 923 148 -345 -898 190
1095A90J008j781J3O04O09o8j891J116J446j167p83J2J741k21k354J242R68k98
$$ 190 1198 -583 -570 34 643 575 -1316 -200 1246 79 -704 -692 1049 828 -1526 -284 684 386
1113C86j100j36J846m49j432N04M26R99j434r32J930K79j003j004R46J760k068
$$ 386 -714 -850 996 547 -885 -381 45 1044 -390 -1322 608 887 -116 -1120 -174 1586 -482
1130d82l30J057M36k83j420O99J361j167rj08Q14J29j571N40Q72j30n67o89J721
$$ -482 -812 245 681 398 -1022 -323 1038 -129 -138 -246 568 697 -874 -334 538 408 -159 -848 873
1149H73l97j317O02K03O50p31m70J557r63j72Jj95J052r30j88Q60m89N72q69P15
$$ 873 476 -841 -239 -36 614 -117 -587 970 7 -165 -164 -359 693 -237 -425 435 -54 518 -351 364
1169C64J47j202O84J30o7k25l75J153m15r19J176m66K95o88K9J032p55q2j10L52
$$ 364 511 -691 -7 123 56 -169 -544 609 194 -725 451 -15 280 -408 -379 653 -102 -184 -294 58
1189E8P23j191l08J286o77Q6p13J168N69j748K67Q41J88m56j049J136P34j250
$$ 58 781 -410 -718 568 -109 -23 -736 432 1001 -747 -480 361 549 93 -956 180 914 -336
1207c36L1l01J614n63j479J205Q16l40j564K28J868r33j001O08P35J43j229j69
$$ -336 -305 -606 1008 445 -1034 171 987 647 -917 -689 1179 246 -755 -147 588 731 -498 -667
1225f67J283j09o81o31R40J148j967j79J198N43n71j535J528O56j341%L16O43
$$ -667 616 507 -174 -805 135 1283 -684 -863 335 878 307 -1228 300 956 -385 -385 -69 574
1243E74m40q15P02K66Jm78m67J357j32j105K55M08M72j283J43J228r44J79j03
$$ 574 134 -681 21 287 288 -190 -657 700 568 -537 -282 126 598 -685 -542 686 -258 -79 -182
1262a82P3M52q32M05K58k90L20p92N33N65o83L16J35j21p2p03J229o13m20M36
$$ -182 -109 343 -489 -84 174 -116 204 -588 -55 510 -173 143 278 157 85 -618 611 -2 -422 14
1282A4J52M2o25L47P70q16j42K68N8M15q06Q4M12M6o08k47J136K9j280K26J077
$$ 14 166 208 -417 -70 700 -116 -258 10 68 483 -323 -239 173 219 -389 -636 500 529 -751 -525 552
1303E52Lq53m30J233j62m24m69L76Q01q60p34R08P70m25j160P01J154q35q36N80
$$ 552 555 -298 -728 505 343 -81 -550 -174 627 -233 -967 -59 711 286 -874 -173 981 146 -690 -110
1323a10P16k08j493N77J349p66l86J8O89J93j127J78N37O29p23j048J315M24j099
$$ -110 606 398 -1095 -518 831 65 -321 -303 386 579 -548 -370 167 796 73 -975 340 764 -335
1342c35k34R84L21r91l21P04K90m25j89J19O13k30p68M15K51K27p71O2Q25m26
$$ -335 -569 415 736 -255 -576 128 418 -7 -196 -77 536 306 -462 -47 204 431 -340 -278 547 121
1362A21l79K7O41j91p02Q71j49l91J86k63J57K89j07l29Q3K81J2p91P15J2k86
$$ 121 -258 -231 410 219 -483 388 239 -152 34 -229 -72 217 110 -219 -136 145 157 -634 81 93 -193
1383a93Q4L04j95m14M04P50r24j95O22p9p11J40M09L3J68n82j48Q94k96o04M45
$$ -193 -109 195 0 -414 -10 740 -184 -379 243 164 -547 -407 2 35 203 -379 -527 367 71 -533 -88
1404h8P33j58j170n0J498k67q51M17M50l00m09n43Q54k93J87l69L13R40q77p03
$$ -88 645 487 -683 -733 765 498 -353 64 514 214 -195 -738 116 -177 10 -359 -46 894 17 -686
1424f86Q50P13r20p83P15N96j87r97L53O76k65m52M3N70J08p08o4J111p1r96l39
$$ -686 164 877 -43 -826 -111 485 298 -699 -346 330 65 -387 -344 226 334 -374 -438 673 602 -394 -733
1445g33J222K34r39j88R09K13j048J12K02O89l11q23L94L60o09l9L07N35m98o37
$$ -733 489 723 -216 -404 505 718 -330 -218 -16 673 362 -461 -67 293 -316 -355 -48 487 -11 -648
1465f48J98J088j57o90K71N00m60k1j74P3nr5j69L71k08M52l82j0K74n19L19O20
$$ -648 -450 638 481 -209 62 562 102 81 -93 -20 -25 -120 -289 82 -126 326 -56 -66 208 -311 8 628
1487F28p11J61K7J29j76q37J150m14J62r0j87K06n08j62O51k15N94l48j052J927
$$ 628 -83 78 105 234 58 -779 371 -43 119 29 -158 48 -460 -622 29 -186 408 60 -992 935
1507I35o17r09l20J426P76j036p66Q44k62j56m57Q50J15j176O99R33n47j57j638
$$ 935 318 -591 -911 515 1291 255 -511 333 71 -85 -542 308 423 -753 -54 879 332 175 -1463
1526a463J730N13j091l11Q51O13j007l72J77J123n29m01n6J042j148m87O52Q56
$$ -1463 267 780 -311 -622 229 842 -165 -537 -360 763 234 -167 -223 819 -329 -816 -164 692
1544F92k91j241O60N83l71n02L41M56q9q63K70L81M14j5q82P13O16p45r12J128
$$ 692 401 -840 -180 403 32 -470 -129 327 238 -625 -355 26 440 425 -457 256 872 127 -785 343
1564C43J075j145j86N60mj130O69R3o1k23K0p0M03o7r67L65R83o33q91J422l00
$$ 343 1418 273 87 647 643 -487 182 275 214 -9 11 -59 344 277 -690 -325 658 25 -866 556 256
1585B56M89j158P34J48q60J119k44k95j23n17J91N57l8n09m96J109o10o91R41
$$ 256 745 -413 321 469 -391 728 484 189 66 -451 -260 297 259 -250 -746 363 -247 -938 3
1604CM40k40q27Q69J62p91O02j5l00K25j77J12o5Q2j86o71P80P76j247J24J218
$$ 3 443 203 -624 245 407 -384 218 203 -97 128 -49 63 -2 80 -106 -777 3 779 -468 -344 874
1625H74q92n27j36J188l41p02L02N73j77j35o85N63L94k59p95M80J020n82q98
$$ 874 -18 -545 -681 507 166 -536 -234 339 162 27 -658 -95 299 40 -755 -275 745 163 -735
1644g35O94O85m88q90Q05N48q89K16L3K52K06o80q7L19O94o35o86J226j10j137
$$ -735 -41 644 156 -734 71 619 -270 -54 -21 231 437 -243 -330 -11 683 48 -638 588 478 -659
1664f59J8Q21L79o36k24O38l07Q6j06j86K92J75n50R0J94L8m59Q6J081j000m16
$$ -659 -641 180 559 -77 -301 337 30 116 10 -176 116 291 -259 -169 25 63 -396 -310 771 -229 -645
1685f45O63L45n22r7Q47n40l17O61m06j38J97q4j54k8N49n56M1P15m24p36Q53
$$ -645 18 363 -159 -256 591 51 -266 395 -11 -149 48 -36 -190 -218 331 -225 -184 531 107 -629 224
1706B24K51n96k94P66N9j011P58P5k22M2k34K46j84L04O5p54R56L06j447M25J102
$$ 224 475 -121 -415 351 410 -601 157 232 10 52 -182 64 -120 184 249 -505 451 757 -690 -265 837
1727H37l61j169O09Q17q99l57J011l49J74l04k97K58K47K41j176O60Q92j049n38
$$ 837 476 -693 -84 733 -166 -523 488 139 313 9 -288 -30 217 458 -718 -58 834 -215 -753
1746g53J127L68j212l68J290j0q64N85p2n7J38n5n01N58K66o62n11J311Jj277
$$ -753 374 742 -470 -838 452 442 -422 163 91 34 172 117 -384 174 440 -222 -733 578 579 -698
1766f98M04J198o52q54Q99J17p17J15L87m71K53K12k21k18P83m10p90N35R50j015
$$ -698 -294 904 252 -602 297 414 -303 -188 199 -272 -19 193 -28 -246 537 127 -663 -128 822 -193
1786a93k31R28j52p64M31M90q10M9N79l17k99N04q4j82P8O46r01l28J405r66n40
$$ -193 -424 504 352 -412 19 509 -301 -252 327 10 -289 215 131 -51 27 673 -228 -556 849 -117 -657
1807f57J120rr08o6J220m54j106R97J73o61J77L49k55J15K37n65j12J041l33j019
$$ -657 463 454 -454 -520 700 246 -860 137 310 -351 -174 175 -80 35 272 -293 -405 636 303 -716
1827g16O67M71l36q97R46P36j394m4J143p19l4J45j03L7L96j38o93P19P35r42
$$ -716 -49 422 86 -811 135 871 -523 -567 576 -143 -177 -32 -135 -98 298 160 -533 186 921 -21
1847b1l75Q82J38j068N4J205o34l55J03M82n65N16m20j61N70N4q50J72J250r58
$$ -21 -396 486 624 -444 -390 815 181 -174 -71 411 -154 362 -58 -219 351 405 -445 -273 977 19
1867A9p04N74Q85r25l16O78p3m97M56L3j98J89j7M22j063J257k95j166R21K75
$$ 19 -685 -111 774 -151 -467 211 138 -359 97 130 -68 121 104 526 -537 720 425 -741 180 455
1887D55n41M78l25J37q66J242K18j117N10M3j56L8K48o45o3O92j93m77M3Q81n40
$$ 455 -86 392 67 204 -662 580 798 -319 191 234 78 116 364 -281 -344 348 155 -322 -279 602 62
1908F2n61R57m5r17M37M28l25k51L42j44j20L49o3m71M15O5l27r3P32l35m64M39
$$ 62 -499 458 413 -504 -67 361 36 -215 127 -17 -137 212 149 -322 93 158 -169 -262 470 135 -329 110
1930A10M02q51RP73n7p57L1N26k68N0J26j80K07K20m56j64P54j32q18K46R50o88
$$ 110 512 -339 -330 443 386 -371 -340 186 -82 -32 94 -86 121 341 -115 -279 475 343 -475 -229 721 33
1952C3m37J11Q34o75j02M6K94o0P07o21q50J095k94l16K27O49o97l41P58q8o41
$$ 33 -404 -293 541 -134 -236 -190 104 44 751 130 -720 375 81 -235 -8 641 -56 -397 361 273 -368
1973c68K08L13n8m88K03J20K18j4j59n13N00N94j036J17O73J83p93J05L40K9m09
$$ -368 -160 153 95 -393 -190 -70 148 134 -25 -538 -38 556 -480 -363 310 493 -300 -195 145 174 -235
1994b35K24J49l64L65M9l91J65P5l50J56L71o5o33P47J4o41J92N03k70l47L02
$$ -235 -11 138 -226 139 188 -203 -38 37 -313 -157 214 149 -484 263 277 -364 -172 331 61 -286 16
2015A6N9k34K5J97k7P1k9m6j10P11j049M26K85j17m9q84J485J79j401j00R13k63
$$ 16 75 -159 -134 63 36 107 78 32 -78 633 -416 10 295 178 129 -755 730 909 -492 -592 321 58
2037E8k60O79J54o12m46J493j350L15K86m84J65J67r8n61L74L97l34k29O08j70
$$ 58 -202 477 631 19 -427 1066 -284 31 317 -167 -2 165 67 -494 -120 277 -57 -286 322 152
2057A52p9k43n8K44o7J56l40L62M13r32J22P04No34o1M72j01l61M44j78l7M4m2
$$ 152 73 -170 -228 16 -51 105 -235 127 540 -392 -270 434 439 -195 -256 216 115 -246 198 20 -17 27 -15
2080a5L6J69J15l16l22N72k16l91O88J27m60m71N12K02m60K45L57k56j6r6k12
$$ -15 21 190 305 -11 -333 239 23 -368 320 447 -13 -484 28 230 -230 15 372 116 100 4 -208
2101b08M29J6j71n92N98N4n64M13K63k6m58L76K5k75J21P6m2l03M78j73J74j88
$$ -208 221 237 66 -526 72 126 -438 -25 238 212 -246 130 155 -120 1 77 35 -268 210 37 211 23
2123B3J62m06K84M44p05j06M32k5k75j96P58k92k81J33M53m96r4j7K39n0Qj03
$$ 23 185 -221 63 507 -198 -304 128 103 -172 -368 390 98 -183 -50 403 -93 -187 -204 35 -15 -7 -110
2145a10K4M30m07j95M85R5k85n07O74J97m56k4P3J26l02j15R2N8J97j02k42N76
$$ -110 -86 344 -63 -258 227 322 37 -470 204 401 -55 -79 -6 120 -182 -297 -205 -147 50 -52 -294 282
2167B82k8o99J44N40l6l10k3O01m74j99J85j05L09j00m1j48K59o9m56J61N43l37
$$ 282 254 -445 -301 239 203 -107 -130 471 -3 -202 -17 -122 187 87 46 -102 157 88 -368 -207 336 -1
2189al65M76m6j80r7L45J01k31J99Q3m06N1J0p3L11J93m58k50O88Ko38M20J55
$$ -1 -366 110 64 -116 -213 132 233 2 201 284 -122 -71 -61 -134 177 370 -88 -338 350 352 -286 134 289
2212B89k93k3K83L5n97K23J06J59k12J19l3Mk17M04m08J68J88n30J95L53q1l52
$$ 289 -4 -27 256 291 -306 -83 23 182 -30 89 56 60 -157 247 -161 7 195 -335 -140 213 132 -220
2234b20J13M99n80Q7K14J7m92J43J69K67k51J61k26O8L55k44n52L71K59l79j56
$$ -220 -107 392 -188 -101 113 130 -362 -219 -50 217 -34 127 -99 -31 324 80 -472 -101 158 -221 -377
2255c77N43n4m04O8K16J10j05k6M8J26r1L8j98N14k70n14N71m8j9l18j37P56j93
$$ -377 166 112 -292 -224 -8 102 -3 -29 19 145 54 92 -106 408 138 -376 195 147 128 -190 -327 429 236
2278B36o46M50K29Om39K5L80j57j87l22K92L59k99r0Q1L64k02k01J62N3k49K22
$$ 236 -410 40 269 275 -164 -139 241 84 -103 -425 -133 226 -73 -163 -82 282 80 -121 41 94 -155 67
2300F7j65K36p6j60k9p6J48J59j67J25K8j61K82N9m91p9K34Kj85o8M51p2j75K08
$$ 67 -98 138 62 -98 -127 -203 -55 104 -63 62 90 -71 211 270 -221 -300 -66 -64 -249 -317 134 62 -113 95
2324I5l6Jm18K44j09J71J47j87q2L50k85p3J24M68n39j3K25k03L83l67N4J42l12
$$ 95 59 60 -358 -114 -223 -52 95 -92 -174 176 -109 -182 -58 410 -129 -142 83 -120 263 -104 -50 92 -220
2347b20M40p6J16Pm79P6K40Q5j30m06L38J51k70j48N93J78n41l42N63j52j16j18
$$ -220 220 144 260 267 -212 -136 104 189 59 -347 -9 142 -128 -276 317 495 -46 -388 175 23 -93 -211
2369b11J55K54l06l3r6M76Pm56j23P77l85l54K68K15l02L7J79j5kk16K29K10K7
$$ -211 -56 198 -108 -141 -237 239 246 -210 -333 444 59 -295 -27 188 -114 -77 102 87 85 -131 98 308 335
2392C35l61q4K60j88r2J31M8n5n2j96N14J51p45L24J71k2k94J17j1P0Q9k69J45
$$ 335 -26 -110 150 -38 -130 1 49 -6 -58 -254 260 411 -334 -10 161 139 -155 -38 -49 21 110 -159 -14
2415a4J39j03k38L55N3l3k58L27j7j4n94L82O3j95O5K11o9k33J98O3p2Qk3k2L95
$$ -14 125 22 -216 139 192 159 -99 228 211 197 -397 -15 48 -147 -82 129 60 -173 25 88 16 24 1 -21 374
2440C74l04j36o9K45O9n08M00J29j73l37K45J43j57J81p9N7k7k24R3J61m1k01
$$ 374 70 -66 -135 110 179 -329 71 200 27 -310 -65 78 -79 102 23 80 53 -171 -78 83 42 -159
2462a59N2K13q8p4l97N41L21p25K65K04k8q5k35J89J52k84qJ76J72r5j46J0J15
$$ -159 -107 106 18 -56 -453 88 409 -316 -51 153 125 40 -195 -6 146 -138 -146 30 202 107 -39 -29 86
2485H6j3j85p4M70n09P7L23Rk75rK54j30m5J15m43M15K56l60j69J32k7j70R3L11
$$ 86 73 -112 -186 284 -225 -148 175 184 -91 -100 154 24 -21 94 -349 66 322 -38 -207 -75 -102 -272 -179 132
2509A32j4l14J06M44p2l22K26k7Q9k33k4m8M5O2l27L74K32k42l85M49k43L5N5
$$ 132 118 -196 -90 354 282 -40 186 159 248 15 -9 -57 -12 50 -277 97 329 87 -298 151 -92 -57 -2
2532bP3L5k9l28L27j40n3J52Pk7p9o8k4J54L0j29JK36l8k83N4J05j42Q7P4l9O6
$$ -2 71 106 77 -251 76 -64 -117 35 42 15 -64 -132 -156 -2 28 -101 -100 136 98 -185 -131 -26 -168 -81 -7 -46 20
2559B0r2Q9J31l3k67K16n4p3j42J63L87l14j62NL95j24L0j49K44j31l92K25L2
$$ 20 -72 17 148 115 -152 64 10 -63 -205 -42 345 31 -131 -126 269 145 175 26 270 139 -253 -28 4
2582DK08j98L9K5J66j79m24N09Mk30K10j23K13k51j51N9K82l88j01L70K11k78
$$ 4 212 14 53 78 244 65 -359 150 154 -76 134 11 224 -27 -178 -119 163 -225 -326 44 255 -23
2604b3o7K29P2j35K8k96J12mr5J86P4n7m6m1O5J54l75K23J63k48J36k84J89J29
$$ -23 -90 139 211 76 104 -192 -80 -84 -179 7 81 24 -22 -63 2 156 -219 4 167 -81 55 -229 -40 89
2628H9K14m35J01K43l31P4J66R7j83j31K91k56j46k2L82j97j4K79k26j7Q2l3m9
$$ 89 303 -132 -31 212 -119 -45 121 218 35 -96 195 -61 -207 -229 153 -44 -58 221 -5 -22 60 27 -22
2651b2m2l6j28R4K37r5p5J12K06k14p2J13M2k72J45J3j31J98j77M5J86l0j53O5
$$ -22 -64 -100 -228 -134 103 8 -67 45 251 37 -35 78 120 -152 -7 6 -125 73 -104 -59 127 97 -56 9
2675IO0mk31L14N5r6n2j41K88l0l69L75q6l58k5K44K8K23k91k16M53K00n18j49
$$ 9 69 65 -166 148 203 107 55 -86 202 172 -197 178 92 -266 -291 -47 -19 204 -87 -303 150 350 -168 -317
2699c17L57J80k13j87Q6K78m61K82J6Pq9J74p7J47j11l14r6N16K1l60K15K30j70
$$ -317 40 220 7 -180 -94 184 -277 5 21 28 -61 113 36 183 72 -242 -338 178 199 -161 54 284 114
2722A14K0j12k0r0J59k65M18m64J62N7k1L20j82k3j38J81k40n1L77j85k95J15
$$ 114 134 22 2 -88 71 -194 224 -240 -78 -21 -42 278 96 73 -65 116 -124 -175 202 17 -278 -163
2744a63J26P7N6r2R9q1J4M6q9j80L02j34J72j59r6k72L18L69j70k70J76J68m25
$$ -163 -37 40 96 4 103 22 36 82 -7 -187 115 -19 153 -6 -102 -374 -56 313 143 -127 49 217 -208
2767b08K54j56K82j29j16Q3j47J36mkO8j23l6j46J75j3j79K64L28m72o7P2L79
$$ -208 46 -110 172 43 -73 10 -137 -1 -5 -7 61 -62 -98 -244 -69 -82 -261 3 331 -141 -208 -136 243
2790B43kl68j73M62J16l54k44L34M3k85J01M6J69l45J65K81n0k19j25L08o8p9
$$ 243 241 -127 -300 162 278 -76 -320 14 57 -228 -127 -81 88 -257 -92 189 139 -80 -205 103 35 -44
2812d4q9J59J44N0k52P9j78K40k55J09K61k13j83QM75l21j35J79j52J18j67L24
$$ -44 -133 26 170 220 -32 47 -131 109 -146 -37 224 11 -172 -164 311 -10 -145 34 -118 0 -167 157
2834A57j94J1j28j77N91q8K5l73L99k13NN5L4N3j85j96J25J79l6O8K37n76J32
$$ 157 -37 -26 -154 -331 260 172 197 -176 223 10 15 70 104 157 -28 -224 -99 80 44 112 349 -227 -95
2857i5J43J19q9l8J75J21j88l54N2J52J98n33L34P8j81k1k05J82K85k26j2O9J54
$$ -95 48 167 78 40 215 336 148 -206 -154 -2 196 -337 -3 75 -106 -127 -332 -150 135 -91 -103 -34 120
2880A20j85j3J04J25ll43K20k7J02l13J54L18n30J54J46m1L5k20L81J25m11Q8
$$ 120 -65 -78 26 151 148 -195 25 -2 100 -213 -59 259 -271 -117 29 -12 23 -197 184 309 -102 -14
2902a4j29J69r6K01l34L75j09k05J77J62k17J29j3M5j48k82M57j72j11J16J7M
$$ -14 -143 26 -70 131 -203 172 63 -142 35 197 -20 109 96 141 -7 -289 168 -4 -115 1 18 22
2924B2J5l19K84r1L12j15j88J71Jj55J06K18k2m94R7K88M4P1l22r6L61k03k90
$$ 22 37 -282 2 -89 223 108 -80 91 92 -63 43 261 239 -255 -158 130 174 245 -77 -173 188 -15 -305
2947c05J44N7J58j40L8L43k27J3m9J98l91j17M95j13k06J25m5l8J62j94J02N63
$$ -305 -161 -104 54 -86 -48 295 68 81 32 230 -161 -278 217 104 -102 23 -22 -60 102 -92 10 573
2969E73m89k19K22k11R5k03M04Q8r6l38K74J10q6l02O4K31l32M61k09M1J70j60
$$ 573 84 -135 87 -124 -29 -232 172 260 164 -174 100 210 124 -178 -114 117 -215 246 37 78 248 88
2991H8k30m1l4P4J38PJ02P9k01l8l84N5M65o0J46o12L89J27Pj59l17M31jL38m23
$$ 88 -142 -183 -217 -143 -5 2 104 183 -18 -56 -440 -385 80 20 166 -446 -57 70 77 -82 -399 32 31 369 -54
3016e4M86k76j04l44P10q63M36p7j53N56n61o0O5M64m14N16l06L7k37K06K08m3
$$ -54 432 156 52 -292 418 -445 -9 -86 -239 317 -244 -304 -239 225 -189 327 21 58 -179 27 235 192
3038A92Jl08j54M76k15J55k79p0L65o0N5R0k30L49m72N0j87L89l40J48J75m76
$$ 192 193 -115 -269 207 -8 147 -132 -202 163 103 158 248 18 367 -105 -55 -242 147 -193 -45 130 -346
3060c46l50J693p04l68k00K70K11j47n07O21K83n6p77M14L27m69Jp50J119q66
$$ -346 -696 997 293 -75 -275 -5 206 59 -448 173 456 400 -377 37 364 -105 -104 -854 265 -601
3080f01N08j006M80N18q12m42J396k14o98J240p54M03L34q36L16Q69n08j140J080
$$ -601 -93 -1099 -619 -101 -913 -1355 41 -173 -871 369 -385 18 352 -484 -168 701 193 -947 133
3099A33K95o64p5J71O55r29L85l1O85j081K28J3M29m74M83m77m19Q28k87L81J30
$$ 133 428 -236 -311 -140 515 -414 -29 -60 625 -456 -228 -215 214 -260 223 -254 -673 155 -132 249 379
3120C79k2j195R34N9m40K26J57n36P58k65op9k0J9l15M04k12M36l75K56k06M2
$$ 379 357 -838 96 155 -285 -59 98 -438 320 55 49 -30 -50 -31 -346 58 -154 282 -93 163 -43 -1
3142aP6l15L97k22q3K34J47k99j83K50j27J28J44j80r3Q5j12Q1p0n9k6J31J59
$$ -1 75 -240 157 -65 -148 86 233 -66 -249 1 -126 2 146 -34 -127 -42 -154 -73 -143 -202 -228 -97 62
3165F2k88J10K24J6j72J27k08K48j95j2R5J2J09K1l75J54l3M6L28k59j4j95K55
$$ 62 -226 -116 108 124 -48 79 -129 119 -76 -88 7 19 128 149 -226 -72 -105 -59 269 10 -4 -199 56
3188E6J30q1j43j67J43R8j74J10q1R0k06N9K84q4J32k81J63P8l23K16J18j98k5
$$ 56 186 105 -38 -205 -62 36 -138 -28 -109 -19 -225 -166 118 34 166 -115 48 126 -197 19 137 -61 -86
3211h6P9J22k50n0K20r2J22o0j32J40P4j12j24k55O45l11L0l8K01k14j88L58J0
$$ -86 -7 115 -135 -185 35 -57 65 5 -127 13 87 -25 -149 -404 241 -70 -40 -78 123 -91 -279 79 89
3234H9qk3J15j80j1P8j20R0j22L59l18M9M1R3k27j19L20k1j14R5k7k77L44N5k8
$$ 89 81 58 173 -7 -18 60 -60 30 -92 267 -51 -2 39 132 -95 -214 106 85 -29 66 39 -238 106 161 133
3259A33k6k87J16J49r0K9p6J79q1o9q6J7J60j31J31J34k9K26l37j12k17K72k02
$$ 133 107 -180 -64 85 -5 24 -52 127 46 -23 -109 -92 68 -63 68 202 173 399 62 -50 -267 5 -197
3282a97R47p82m70N9N34m0K21j72Q3j09j44j36L65k18j13%K45R5k60lM8R6j90
$$ -197 750 -32 -502 -443 91 51 272 100 183 74 -70 -206 159 -59 -172 -172 73 168 -92 -95 -47 49 -141
3305a41J54n8J9R9j70L75j97l65K84J6K8k55K30N9m3j07o9J25l3NJ98m6J21k66
$$ -141 13 -45 -26 73 -97 278 81 -284 0 16 44 -211 19 78 35 -72 -141 -16 -49 -44 154 108 229 -37
3329c7P8J68k07k4R3r4K50k86L17j64j61nOJ48p1J39J7j24o0l3J89k29j00L72
$$ -37 41 209 2 -22 71 -23 227 -59 258 94 -67 -72 -66 82 11 150 167 43 -17 -50 139 -90 -190 182
3353A82P9m99L19j84j7M7J27l9N4J4k52J16j14J98j20Q7J62m27K93pK67j66k04
$$ 182 261 -238 81 -103 -120 -73 54 15 69 83 -169 -53 -167 31 -89 -2 160 -267 26 19 286 120 -84
3376h4K79o7j48J5J19m5j09J90j62p7L17q2l1M4m20M3K20j21L49k42j01N99p69
$$ -84 195 128 -20 -5 114 69 -40 150 -12 -89 228 146 115 159 -261 -218 2 -119 230 -12 -113 486 -283
3399b83R0J40R3k09n99j23J213K0q65N12K94o5k36J20J82j20m14L17k7m51J99
$$ -283 -193 -53 40 -169 -768 -891 322 342 -523 -11 283 218 -18 102 284 164 -250 67 40 -411 -212
3420b12Q15p40K71j34K63k48p7J77k86J91l35L12K60k70L13j36l61J63K01l39
$$ -212 603 -137 134 0 263 15 -62 115 -171 20 -315 -3 257 -13 300 164 -197 -34 167 -172
3440a72J24o7K8N7J67O2k04R8k66L3J15j10K6n2K09r1k6m5J04K6m36O69k98J08
$$ -172 -48 -115 -87 -30 137 199 -5 93 -173 -140 -25 -135 -109 -161 48 -43 -69 -114 -10 16 -420 249 -49 59
3464E9j62M17%k72o1n0m7L1K79r6J68k12K05p5j15k5j44n6J57P2l52K63M3j20
$$ 59 -103 314 314 42 -19 -69 -116 -85 194 98 266 54 259 184 69 44 -100 -156 1 73 -279 -16 27 -93
3488i3J60J27l48j9J93N1K6k47Q2K18Q0n1n12L14K11k17j70q7L46j73N6j4J76
$$ -93 67 194 -154 -173 20 71 97 -150 -68 150 230 179 -333 -19 192 -25 -195 -282 64 -109 -53 -67 109
3511A09k79P1J95p8J8P7k97J98K95l23q5Q9K12n03J20L23m15M1J84j24m7n6J57
$$ 109 -170 -99 96 18 36 113 -184 14 309 -14 -99 -10 202 -301 -181 142 -273 -232 -48 -172 -219 -275 -118
3534a18rK81O2m17K24j03p3K38j34K97m37Q3J18j01j92Q2K25M7k95J84N7q0JK47
$$ -118 -127 154 216 -201 23 -80 -153 85 -49 248 -189 -106 12 -89 -281 -199 26 73 -222 -38 19 -61 -60 187
3558A87k51J32k4j27M7J95n8k61K52Ml71K51J84j19p7m0J33k49n0J70n0j39M24
$$ 187 -64 68 44 -83 -36 159 101 -160 92 96 -275 -24 160 41 -36 -76 57 -192 -242 -72 -122 -261 163
$$ [...]
8191b0
##END NTUPLES=NMR FID
##END=
