##TITLE=1H_SR28_4
 CDCl3, 8 sc, 
 24.12.2020
##JCAMPDX= 6.0         $$ Bruker NMR JCAMP-DX V2.0
##DATA TYPE= NMR FID
##DATA CLASS= NTUPLES
##ORIGIN= UXNMR, Bruker Analytische Messtechnik GmbH
##OWNER= root
$$ XWIN-NMR		Version 3.5
$$ Thu Dec 24 12:19:37 2020 Russian Standard Time (UT+4h)  she@DPX200
##.OBSERVE FREQUENCY= 200.1315066352
##.OBSERVE NUCLEUS= ^1H
##.DELAY= (6, 6)
##.ACQUISITION MODE= SIMULTANEOUS
##.ACQUISITION SCHEME= undefined
##.AVERAGES= 8
##.DIGITISER RES= 18
##SPECTROMETER/DATA SYSTEM= spect
##.PULSE SEQUENCE= zg30
##.SOLVENT NAME= CDCl3
##.SHIFT REFERENCE= (INTERNAL, CDCl3, 0, 15.7039)
##AUDIT TRAIL= $$ (NUMBER, WHEN, WHO, WHERE, WHAT)
$$ ##TITLE= Audit trail, XWIN-NMR		Version 3.5
$$ ##JCAMPDX= 5.01
$$ ##ORIGIN= Bruker BioSpin GmbH
$$ ##OWNER= she
$$ F:/spectra/data/she/nmr/H-F/1/audita.txt
$$ ##AUDIT TRAIL=  $$ (NUMBER, WHEN, WHO, WHERE, WHAT)
(   1,<2020-12-24 12:18:25.85 +0400>,<she>,<DPX200>,
      <created by zg, POWCHK disabled, PULCHK disabled
       configuration hash MD5:
       00 E9 B6 7A A2 85 ED C7 34 08 36 98 17 FE 4E 26
       data hash MD5: 16K
       42 A7 0D A0 55 49 1E FE B7 27 78 06 D9 09 0C 83>)
$$ ##END=
$$ 
$$ hash MD5
$$ 4A CB 12 A0 59 55 F7 A7 CC FB 6F AA 26 4D 02 2E
##$RELAX= 
##$RELAX= 
##$RELAX= 
##$RELAX= 
##$RELAX= 
##$RELAX= 
$$ Bruker specific parameters
$$ --------------------------
##$DU= <F:/spectra>
##$EXPNO= 1
##$NAME= <H-F>
##$PROCNO= 1
##$TYPE= <nmr>
##$USER= <she>
##$AMP= (0..31)
100 100 100 100 100 100 100 100 100 100 100 100 100 100 100 100 100 100 
100 100 100 100 100 100 100 100 100 100 100 100 100 100 
##$AQSEQ= 0
##$AQ_mod= 1
##$AUNM= <au_zg>
##$AUTOPOS= <>
##$BF1= 200.13
##$BF2= 200.13
##$BF3= 200.13
##$BF4= 200.13
##$BF5= 200.13
##$BF6= 200.13
##$BF7= 200.13
##$BF8= 200.13
##$BYTORDA= 1
##$CFDGTYP= 0
##$CFRGTYP= 5
##$CHEMSTR= <none>
##$CNST= (0..31)
1 1 145 1 1 1 1 1 1 1 1 1 1 1 1 1 1 1 1 1 1 1 1 1 1 1 1 1 1 1 1 1 
##$CPDPRG= <>
##$CPDPRG1= <>
##$CPDPRG2= <>
##$CPDPRG3= <>
##$CPDPRG4= <mlev>
##$CPDPRG5= <mlev>
##$CPDPRG6= <mlev>
##$CPDPRG7= <mlev>
##$CPDPRG8= <mlev>
##$CPDPRGB= <>
##$CPDPRGT= <>
##$D= (0..31)
0 1.2 0 0 0 0 0 0 0 0.06 0 0.03 0 0 0 0 0.0002 0 0 0 0 0 0 0 0 0 0 0 0 
0 0 0 
##$DATE= 1608797905
##$DBL= (0..7)
120 120 120 120 120 120 120 120 
##$DBP= (0..7)
150 150 150 150 150 150 150 150 
##$DBP07= 0
##$DBPNAM0= <>
##$DBPNAM1= <>
##$DBPNAM2= <>
##$DBPNAM3= <>
##$DBPNAM4= <>
##$DBPNAM5= <>
##$DBPNAM6= <>
##$DBPNAM7= <>
##$DBPOAL= (0..7)
0.5 0.5 0.5 0.5 0.5 0.5 0.5 0.5 
##$DBPOFFS= (0..7)
0 0 0 0 0 0 0 0 
##$DE= 6
##$DECBNUC= <off>
##$DECIM= 32
##$DECNUC= <off>
##$DECSTAT= 4
##$DIGMOD= 1
##$DIGTYP= 9
##$DL= (0..7)
0 120 120 120 120 120 120 120 
##$DP= (0..7)
150 150 150 150 150 150 150 150 
##$DP07= 0
##$DPNAME0= <>
##$DPNAME1= <>
##$DPNAME2= <>
##$DPNAME3= <>
##$DPNAME4= <>
##$DPNAME5= <>
##$DPNAME6= <>
##$DPNAME7= <>
##$DPOAL= (0..7)
0.5 0.5 0.5 0.5 0.5 0.5 0.5 0.5 
##$DPOFFS= (0..7)
0 0 0 0 0 0 0 0 
##$DQDMODE= 0
##$DR= 18
##$DS= 0
##$DSLIST= <SSSSSSSSSSSSSSS>
$$ [...]
##$SUBNAM2= <"">
##$SUBNAM3= <"">
##$SUBNAM4= <"">
##$SUBNAM5= <"">
##$SUBNAM6= <"">
##$SUBNAM7= <"">
##$SUBNAM8= <"">
##$SUBNAM9= <"">
##$SW= 16.9725356469052
##$SWIBOX= (0..15)
0 0 2 0 0 0 0 0 0 0 0 0 0 0 0 0 
##$SW_h= 3396.73913043478
##$TD= 16384
##$TD0= 1
##$TE= 0
##$TE2= 300
##$TE3= 300
##$TEG= 300
##$TL= (0..7)
0 120 120 120 120 120 120 120 
##$TP= (0..7)
150 150 150 150 150 150 150 150 
##$TP07= 0
##$TPNAME0= <>
##$TPNAME1= <>
##$TPNAME2= <>
##$TPNAME3= <>
##$TPNAME4= <>
##$TPNAME5= <>
##$TPNAME6= <>
##$TPNAME7= <>
##$TPOAL= (0..7)
0.5 0.5 0.5 0.5 0.5 0.5 0.5 0.5 
##$TPOFFS= (0..7)
0 0 0 0 0 0 0 0 
##$TUNHIN= 0
##$TUNHOUT= 0
##$TUNXOUT= 0
##$USERA1= <user>
##$USERA2= <user>
##$USERA3= <user>
##$USERA4= <user>
##$USERA5= <user>
##$V9= 5
##$VALIST= <valist>
##$VCLIST= <CCCCCCCCCCCCCCC>
##$VD= 0
##$VDLIST= <DDDDDDDDDDDDDDD>
##$VPLIST= <PPPPPPPPPPPPPPP>
##$VTLIST= <TTTTTTTTTTTTTTT>
##$WBST= 1024
##$WBSW= 4
##$XGAIN= (0..3)
0 0 0 0 
##$XL= 0
##$YL= 0
##$YMAX_a= 144145
##$YMIN_a= -183315
##$ZGOPTNS= <>
##$ZL1= 120
##$ZL2= 120
##$ZL3= 120
##$ZL4= 120
##$ABSF1= 10
##$ABSF2= 0
##$ABSG= 5
##$ABSL= 3
##$ALPHA= 0
##$AQORDER= 0
##$ASSFAC= 0
##$ASSFACI= 0
##$ASSFACX= 0
##$ASSWID= 0
##$AUNMP= <proc_1d>
##$AZFE= 0.1
##$AZFW= 0.1
##$BCFW= 1
##$BC_mod= 2
##$BYTORDP= 1
##$COROFFS= 0
##$CY= 11.3945322036743
##$DATMOD= 1
##$DC= 2
##$DFILT= <>
##$DTYPP= 0
##$F1P= 15.9154993809931
##$F2P= -4.1035820241983
##$FCOR= 0.5
##$FTSIZE= 0
##$FT_mod= 4
##$GAMMA= 1
##$GB= 0.15
##$INTBC= 1
##$INTSCL= 1
##$ISEN= 128
##$LB= 0.24
##$LEV0= 0
##$LPBIN= 0
##$MAXI= 10000
##$MC2= 0
##$MEAN= 0
##$ME_mod= 0
##$MI= 1.114404
##$NCOEF= 0
##$NC_proc= 0
##$NLEV= 6
##$NOISF1= 3.799351
##$NOISF2= 2.8
##$NSP= 1
##$NTH_PI= 0
##$NZP= 0
##$OFFSET= 15.70392
##$PC= 1
##$PHC0= -10761.14
##$PHC1= 10.60095
##$PH_mod= 1
##$PKNL= yes
##$PPARMOD= 0
##$PSCAL= 0
##$PSIGN= 0
##$REVERSE= no
##$SF= 200.130013532006
##$SI= 16384
##$SIGF1= 3
##$SIGF2= 2
##$SINO= 400
##$SIOLD= 16384
##$SREGLST= <1H.CDCl3>
##$SSB= 0
##$STSI= 0
##$STSR= 0
##$SW_p= 3612.71676300578
##$SYMM= 0
##$S_DEV= 0
##$TDeff= 0
##$TDoff= 0
##$TI= <>
##$TILT= no
##$TM1= 0
##$TM2= 0
##$TOPLEV= 0
##$USERP1= <user>
##$USERP2= <user>
##$USERP3= <user>
##$USERP4= <user>
##$USERP5= <user>
##$WDW= 1
##$XDIM= 8192
##$YMAX_p= 0
##$YMIN_p= 0
$$ End of Bruker specific parameters
$$ ---------------------------------
##NTUPLES= NMR FID
##VAR_NAME=  TIME,          FID/REAL,        FID/IMAG
##SYMBOL=    X,             R,               I
##VAR_TYPE=  INDEPENDENT,   DEPENDENT,       DEPENDENT
##VAR_FORM=  AFFN,          ASDF,            ASDF
##VAR_DIM=   8192,          8192,            8192
##UNITS=     SECONDS,       ARBITRARY UNITS, ARBITRARY UNITS
##FACTOR=    0.0002944,     1,               1
##FIRST=     0,             0,               0
##LAST=      2.4114304,     0,               0
##MIN=       0,             -183315,         0
##MAX=       2.4114304,     144145,          0
$$ Real data points
##PAGE= N=1
##DATA TABLE= (X++(R..R)), XYDATA
0 0 0 0 0 0 0 0 0 0 0 0 0 8 -8 8 -8 15 -16 16 -24 24 -32 40 -45 52 -64 72 -80 96 -109 124 -142 160 -184 206
34 206 -232 260 -292 325 -364 404 -451 500 -553 612 -675 744 -823 904 -997 1098 -1207 1332
52 1332 -1468 1621 -1792 1987 -2209 2465 -2766 3126 -3559 4097 -4781 5687 -6940 8782 -11743
67 -11743 17239 -30588 124078 89952 -183315 129649 -69686 -23503 127980 -103438 7467
78 7467 -2950 -40458 118118 -16931 -7433 -11890 -22179 78667 -21007 -6068 2434 -44076
90 -44076 48517 -2438 14046 -11084 -49783 61272 -25382 -13500 36943 -29142 55205 -18042
102 -18042 -15064 30407 -67099 57797 -10580 -69302 54418 -65684 51807 54531 -108356
113 -108356 62016 -29206 -27011 99746 -82481 8578 7631 -57054 100254 -49210 -43524 43436
125 43436 -68759 41350 13936 -39825 35906 -25742 25953 17995 -29964 17272 -28939 13343
137 13343 815 -36737 39921 -16593 4179 24852 -39797 18794 -109 9032 26178 -35977
149 -35977 22675 3091 2246 32763 -48675 9080 -2390 -20303 58695 -36502 -170 32170
161 32170 -34584 58416 -11212 -30945 43019 -47669 23639 22585 -47063 40463 -19661 -9246
173 -9246 31286 -42471 20738 4585 -18321 32334 -20142 10014 14052 -21567 11148 -26286
185 -26286 -8487 11625 -13324 12994 -14182 -4432 13975 -9151 15396 -14801 -11635 11808
197 11808 -14296 18000 -7107 -18079 14894 -21774 8796 2371 -25128 20330 -12574 5299
209 5299 23529 -21061 21347 -4198 -17653 20765 -25060 5467 13549 -20962 21229 -5280
221 -5280 -4047 21010 -13854 7826 2349 -4762 19933 -3278 7248 1306 -12349 12624 -7273
234 -7273 -1281 6569 -12196 10698 6320 2436 10839 -3485 4076 -1381 -1126 3775 -9376 5210
248 5210 -2614 -5282 10627 -9064 563 2009 -12343 7495 -568 816 9354 -7066 2839 -4283
262 -4283 -8181 2163 -13145 -1780 -949 -8912 11060 -3068 -4192 6999 -10178 554 3718
275 3718 -6912 1085 -2233 -2763 -806 -1359 -24 -7246 -1166 -168 -4824 7832 3197 -358 7404
290 7404 -75 -340 1247 -2875 -2568 -2725 1782 2037 2226 5800 -88 722 3090 476 3717 3764 2513
307 2513 3001 1573 3148 -76 -2197 -239 -2991 -673 3230 2302 2465 3315 3932 1433 900 2517 -3556
324 -3556 -3487 1097 -3337 -579 3543 -3524 -2105 1167 -4436 -1592 2562 -1902 58 3040 -218 -1601
340 -1601 -1821 -4115 -6001 -4238 -991 -2684 -1197 2738 -1659 -681 2371 -2351 -906 1132 -3540 -647
356 -647 709 -1386 293 -1316 -1954 -1157 -1463 1726 262 -555 5232 2390 1990 5978 -1927 -2534 2248
373 2248 -2920 -115 3168 -1695 3223 4651 -390 3167 826 -981 4801 976 1513 4316 -1278
388 -1278 3047 1609 -5736 1898 -1280 -1760 6091 -3064 528 5350 -1844 5603 -518 -6226 2937
403 2937 -4161 -614 1685 -8332 2554 598 -3555 3782 -8104 -2922 4834 -4200 3742 -535
417 -535 -5999 4850 -2164 -5246 -1598 -7370 -1021 3877 -3333 -1505 818 -1898 3831 1791 -7328
432 -7328 889 1072 -1938 6673 -6159 -4782 7345 -4560 4640 22 -10624 10326 500 1151
446 1151 9100 -11389 7793 7149 -7844 9456 -9616 -2863 14423 -7257 6547 680 -8149
459 -8149 16023 -2998 -2632 6751 -10225 10170 7865 -8784 3638 -3482 -1000 8205 -3670 -5721
473 -5721 673 3199 2943 3224 -4126 -4890 6334 -450 -230 -2459 -11874 8507 635 -5200 6952
488 6952 -16088 3376 11068 -15156 7710 -7196 -7662 19773 -12082 77 820 -16373 17884
501 17884 -6712 -9918 10720 -16657 12347 9191 -17824 10017 -5775 -906 14891 -12141 -719
514 -719 1434 -1501 10854 -5251 -4343 1348 535 6828 -91 -3614 -1935 7042 7186 -3531 3250
529 3250 -8138 2684 13601 -11065 4074 -389 -6701 21232 -7307 -3876 8059 -14548 19580
542 19580 490 -15129 16003 -13628 7150 13922 -23702 9676 -2869 -5424 18787 -16737
554 -16737 -590 5950 -7549 14605 -9763 -7937 6738 -7409 9469 -3816 -11642 5127 -2198
567 -2198 5250 -1885 -9141 1058 -1532 6975 -2728 -7211 2172 -3945 9225 -3390 -10450 5969
581 5969 -7437 9829 3407 -16125 11870 -6337 2372 14104 -20880 7974 3735 -7479 19054
594 19054 -15161 -2290 13220 -10956 15222 -5325 -10807 15897 -7386 8659 2564 -13205
606 -13205 13853 -2316 2425 5564 -14056 9192 2338 -837 7140 -10754 4415 4865 -1713 4536
620 4536 -8089 2173 3878 -180 3439 -9435 2731 1884 -2740 6660 -11569 1714 5386 -7754
634 -7754 10647 -10486 -4261 11885 -12351 7985 -3139 -13038 15402 -10193 651 6700 -17720
647 -17720 12124 -957 -8319 10115 -13377 4143 6683 -10090 7620 -6547 -2242 8288 -6643
660 -6643 3567 -2320 -2087 6564 -3565 2550 -1949 -908 6003 -3861 4409 -1944 -2354 8423 -4715
675 -4715 4044 581 -4721 10007 -4576 1879 4645 -8172 9983 -1437 -2867 8431 -9198
688 -9198 6683 3341 -8502 9687 -6226 -83 8140 -9052 6000 -915 -4729 8063 -5960
701 -5960 1179 1831 -4983 5227 -3628 -759 1586 -4636 3642 -2898 -1326 1117 -5009 3838 -3103
716 -3103 -2339 3369 -6606 3405 -733 -5502 4596 -5145 483 2071 -5376 3563 -3499 -664 3178
731 3178 -5607 4035 -998 -2733 5074 -4717 1586 2083 -3765 4497 -2144 279 2720 -3116 4324
746 4324 -893 -784 4503 -2851 2761 1662 -1703 3720 -1325 2046 1583 -1505 4225 -2061 1278 3176
762 3176 -3442 3388 239 -1189 3490 -1524 1438 670 -1472 2567 -2204 806 1326 -3339 2269 -1071
778 -1071 -1666 1907 -2356 196 -736 -1341 362 -1901 755 -864 -2441 1469 -2961 -1357 1022 -2564
794 -2564 169 -955 -1335 535 -1798 488 -942 -1421 1212 -2056 29 512 -2072 573 -107 -447
810 -447 -45 -319 591 -887 883 965 -1012 1650 274 192 1497 -813 867 799 -80 1523 223 968
828 968 1287 -73 2196 -62 -30 2145 -245 1270 1449 -706 1625 383 -241 1351 -913 238 1205
845 1205 -339 385 450 -242 866 -153 -989 138 -1341 -376 821 -2005 -478 399 -1753 435 -874
862 -874 -2055 701 -1071 -356 498 -2776 -463 39 -1690 153 -1949 -1409 939 -1548 741 -230 -2331
879 -2331 1631 -116 -1089 735 -2116 856 1852 -2044 856 -575 -1356 3137 -500 -1159 1828 -1214
895 -1214 2318 2436 -2120 1498 1013 -557 3486 -1121 -1226 2643 47 2218 1267 -2767 2986 1411
911 1411 -319 2919 -2460 -283 3684 -1462 1142 -478 -3238 4155 58 -1982 1920 -3223 1874
926 1874 3402 -3781 1152 -1662 -2241 5274 -3276 -2713 1631 -3269 2954 695 -5628 1454 -1053 -375
942 -375 3066 -5251 -1948 2244 -1507 2006 -2088 -5005 2489 529 -718 564 -4133 497 3960
957 3960 -1751 329 -1392 -2707 5467 -104 -2853 1717 -3148 3462 4378 -4966 1207 -134 -125 6913
973 6913 -3424 -1447 3377 -2028 5966 -443 -5616 4663 -942 2131 4324 -7069 2810 3436 -1346
988 -1346 4886 -4104 -2306 5811 -852 1404 -290 -4591 3865 2450 -2078 -193 -3318 -89 4512
1003 4512 -1064 -2457 64 -1794 3279 1446 -5721 202 -1293 -779 5036 -6312 -2639 3553 -4219
1018 -4219 4992 -1776 -7853 6068 -2290 27 3596 -9208 3054 3042 -4151 4734 -6326 -1971
1032 -1971 7221 -4074 2542 -1050 -5131 7140 -258 -1742 1791 -4364 3026 3808 -2389 408 -833
1047 -833 284 3952 494 -2532 876 1273 1153 3729 -3313 -1075 4600 -1559 3059 -46 -5382 6128
1063 6128 55 -777 4221 -7055 3307 3910 -4624 5258 -4885 -1648 7442 -5697 2023 -578
1077 -578 -5656 7338 -2706 -2252 2705 -6202 4261 1624 -4871 2223 -3914 -7 3215 -4275 -305
1092 -305 -749 -1267 2297 -1063 -2183 -856 801 -164 157 -762 -3464 3077 241 -2044 2562 -4960
1108 -4960 1374 4132 -4927 3630 -2188 -2467 7150 -4522 946 2378 -5340 6945 -1151 -3026 5243
1123 5243 -4533 3499 3192 -4825 4508 -1771 329 4845 -3824 2293 1002 -1226 4117 -2113 71
1138 71 1365 -868 2633 -691 -363 500 -369 1812 -1402 196 -470 -896 2538 -2774 760 403 -2824
1155 -2824 4002 -2792 -1599 2712 -4434 3119 59 -4378 4118 -3908 212 2435 -5592 2449 -1087
1170 -1087 -2239 3429 -4037 499 953 -3351 2945 -2330 -339 1354 -2604 2097 -1379 -794 1739
1185 1739 -2261 2089 -375 -1274 2338 -1881 1715 485 -1481 2951 -1519 668 1481 -2017 1895
1200 1895 -638 245 2069 -1569 2991 -509 -440 2832 -2745 1789 753 -1926 3805 -1646 -32 2304
1216 2304 -2068 2540 -188 -515 2391 -1471 1207 -310 -1879 2394 -2807 825 776 -2720 1394 -1820
1232 -1820 -1235 1212 -2594 1071 -284 -1585 1424 -2333 -239 266 -1688 1233 -1741 408 583 -1647
1248 -1647 913 -1493 -517 672 -1780 1058 -947 -1211 1827 -1960 564 30 -438 2396 -2412 65
1264 65 962 -1922 2245 -374 -763 1787 -1787 1433 481 -649 1883 -746 1058 1115 -873 1290 -360
1281 -360 93 1184 -354 1088 411 71 1484 -877 928 278 -130 976 -1287 514 366 -1226 1260
1298 1260 -916 -201 399 -1423 1226 -618 -204 912 -1631 212 -27 -900 1012 -1281 -487 396 -1956
1315 -1956 787 -1202 -1145 484 -1979 -433 367 -1290 400 -545 -620 -1 -959 -74 16 -50 -560 119 -582
1334 -582 -249 145 207 -271 413 -563 825 559 -81 767 -418 575 1254 -438 597 -131 -287 2245 -586
1353 -586 410 1322 -756 1759 -19 -1148 1397 -192 112 1827 -805 194 1123 -644 1111 -147
1369 -147 -562 1011 86 757 336 -1076 -237 -659 -933 1113 -1844 -959 466 -1878 -676 -151 -2158
1386 -2158 1295 760 -1950 745 -1107 -1016 1307 -1351 -1022 898 -1301 1243 -1614 -1343 1182 -735
1402 -735 391 1367 -2586 970 284 -227 1628 -2790 -666 2228 -1193 1164 647 -3095 1675 441
1418 441 -1442 925 -1209 -755 2256 -969 410 139 -865 2448 431 -1366 1198 -1661 778 2442
1434 2442 -2466 -18 910 -1221 3331 -727 -1815 2029 -1024 1663 1902 -3894 1047 945 -989 2405
1450 2405 -2837 -1117 2676 -1492 902 -422 -2850 2632 111 -1201 852 -3397 512 2332 -2828
1465 -2828 961 -983 -2297 3135 -1122 -1854 903 -1625 1546 1453 -3560 486 -145 -1000 2614 -2173
1481 -2173 -1617 1673 -1317 1730 558 -3387 2066 1066 -853 2036 -2832 -443 3624 -1331 1349
1496 1349 -264 -2911 4226 316 -1221 2090 -2736 2228 3091 -2668 1628 -628 -863 4401 -1664
1511 -1664 -808 1680 -1643 2934 650 -2844 1432 -250 347 2376 -2540 -591 1728 -728 1326
1526 1326 -875 -2866 1854 467 -969 960 -2763 -579 2782 -1098 -457 -838 -2470 2356 -513
1541 -513 -2301 1218 -2081 1403 2243 -2800 759 -1036 -1383 3208 -3317 -555 1915 -2024 2957 -680
1557 -680 -2748 1937 -877 831 1483 -2853 801 1007 -266 1693 -1178 -435 1573 382 240 12
1573 12 -771 955 1554 56 -388 125 -4 1787 663 -1151 1095 -588 1117 1663 -2256 722 479
1590 479 -919 2735 -1978 -772 2189 -1991 1724 -115 -2355 2087 -1172 366 815 -3060 1181
1605 1181 -318 -803 1453 -2254 134 1068 -1417 818 -900 -1060 1287 -1120 62 -631 -1117 335
1621 335 -176 -50 -1072 -143 310 -496 765 -1058 -307 1065 -1034 928 -435 -1355 1540 -1131 456
1638 456 579 -1548 1951 -390 -420 1592 -1848 1402 828 -835 2147 -989 281 1642 -1251 1707
1654 1707 -382 -398 1791 -1005 943 119 -520 1560 -966 325 -203 -617 689 -22 -314 134 -590
1671 -590 820 103 -381 427 -1076 1674 -419 27 622 -1039 498 14 -885 977 -1161 -218 729
1688 729 -1973 818 -810 -822 1217 -1714 477 60 -1427 833 -1555 -197 635 -1415 1033 -689
1704 -689 -623 771 -1215 921 181 -564 985 -1029 417 601 -1009 1249 -548 274 1049 -925 1021
1721 1021 -90 85 1307 -609 1208 547 -410 1048 -511 824 614 -446 1322 -624 189 1031
1737 1031 -929 1279 -69 -314 1173 -764 472 328 -1070 804 -709 -140 682 -1079 664 -475
1753 -475 -726 486 -1074 425 -173 -800 348 -1128 -94 -80 -1120 364 -842 -186 259 -1136 306
1770 306 -632 -447 263 -797 278 -327 -560 492 -740 309 319 -829 992 -495 -124 334 -793
1787 -793 1007 48 -302 884 -782 501 592 -593 1223 -38 209 957 -554 467 533 -53 910 -304
1805 -304 447 368 -106 788 -54 104 294 194 28 279 156 31 201 581 -662 328 -44 -229 435 -660
1825 -660 337 77 -774 892 -527 -849 863 -966 130 373 -1465 576 -233 -794 627 -1266 -2
1842 -2 294 -1028 333 -550 -782 761 -726 -147 158 -1070 454 791 -899 234 -233 -261 1081 -313
1860 -313 -572 191 -128 747 488 -1054 667 259 114 1364 -876 -332 1547 -283 768 377 -1102
1877 -1102 1580 123 -448 1055 -1425 837 1417 -648 757 -114 -469 1899 -325 7 300 -1104
1893 -1104 880 466 -1321 284 -516 0 1310 -849 -654 660 -632 898 -22 -1762 1000 42
1909 42 144 1342 -2172 -258 596 -550 1296 -525 -1573 1552 -583 -295 117 -1896 294 1055 -1068
1926 -1068 461 -855 -267 2582 -1022 -291 1355 -453 2018 513 -1706 1464 -90 469 1846 -1571
1942 -1571 -213 1193 -983 1337 -291 -1274 1677 891 129 585 -992 421 609 -392 1754 -913
1958 -913 -410 2370 -447 265 931 -2101 1773 1113 -1763 25 -1039 -430 2115 -1240 -391 406 -1409
1975 -1409 1653 -228 -838 660 -366 608 1004 -1977 -48 434 -452 1499 -1944 -979 1454 -682
1991 -682 -18 -109 -1931 657 508 -673 234 -1555 -441 1415 -567 -219 -399 -1162 1226 185 -1095
2008 -1095 429 -792 191 1295 -616 15 953 -530 1689 -225 -980 972 -450 838 1235 -1475
2024 -1475 806 874 -412 901 -1210 -68 1578 -400 985 211 -728 1148 -124 -247 504 -683
2040 -683 778 985 -1167 300 -820 -411 1018 -934 -361 239 -1063 406 94 -892 264 355 -405
2057 -405 162 -749 -503 507 -465 -50 44 -2019 353 516 -1164 312 -941 175 1214 -1585 296
2074 296 -211 -862 1596 -79 -876 619 -1463 513 1033 -925 573 -350 -175 1353 -693 361 427
2091 427 -380 968 70 -183 481 255 171 182 -469 -176 206 361 196 18 -573 221 503 -438 564 38
2111 38 -473 977 -410 56 459 -1042 308 -340 -90 1246 -310 493 837 -1360 606 -328 -464 650
2129 650 -755 19 -169 -911 759 -516 -439 218 -370 45 -528 -481 491 -801 318 -283 -465 246 -412
2148 -412 162 233 -118 321 -90 183 343 -154 251 -343 209 536 -639 -41 -555 107 267 -807 472
2167 472 436 3 717 -186 -462 795 -419 974 -21 513 937 -602 539 336 -447 848 52 -178
2185 -178 584 -173 509 172 170 996 -613 464 -202 -280 232 -962 564 -296 -209 634 -233 207 393 -1247
2205 -1247 -614 -781 87 123 -794 430 -517 -240 -64 -741 -162 126 -163 969 -438 -432 -117 -850 89 -20
2225 -20 -878 324 -691 -93 910 -495 355 -251 446 794 -160 744 -179 388 751 -504 -20 272 -17
2244 -17 267 256 362 235 346 198 479 378 -106 247 627 56 275 625 -688 830 179 -503 804 -305
2264 -305 358 164 -220 629 -307 163 809 -799 382 -213 -639 181 -556 -142 313 -583 238 -285 -489
2283 -489 283 -267 -252 -101 -600 123 -184 -277 -14 -388 -152 -261 -8 -259 312 206 -346 -35 -484 -423 458
2304 458 -558 115 -13 -456 741 -297 -17 753 -507 777 595 -727 764 -116 -82 598 -416 560
2322 560 335 -311 839 31 -122 341 -159 644 378 -397 311 -17 36 648 -575 -156 408 -176 317 218
2342 218 -226 392 394 -83 352 -306 -235 714 -387 -303 -113 -704 424 -51 -730 298 -336 32 474 -1027
2362 -1027 218 -212 -533 712 -537 -530 561 -591 229 227 -1198 890 75 -62 572 -942 213 391
2380 391 -388 707 -458 -397 809 212 82 441 -703 705 1023 -511 278 -220 -397 1241 123 -311
2398 -311 -1 -123 1012 948 -1055 648 152 -134 1056 -832 150 1657 -284 208 669 -1179 835
2415 835 843 118 1183 -762 185 865 249 859 -1267 -367 1183 368 -779 671 -668 630 731 -1132
2433 -1132 -380 -242 -720 839 -1044 -41 -108 150 1309 500 -713 123 -11 -505 1024 -1715 607
2450 607 1941 -284 1038 86 -1053 1252 -409 -327 849 -271 370 86 -412 266 -1507 -198 931
2467 931 501 241 848 -802 581 59 -1105 -235 -345 -100 1184 -1410 -360 -58 143 1726 1
2484 1 -1264 38 1257 589 53 -508 639 1034 -603 296 -382 -969 978 -392 -432 568 -850 366
2502 366 463 -639 802 -652 -374 965 138 669 176 -542 606 -225 -986 255 94 407 564 -1290
2520 -1290 -395 363 -3 822 -343 -904 -40 368 -248 -403 -1038 75 49 -549 746 -766 -165 1085
2538 1085 652 99 181 76 476 -195 -756 925 -190 167 490 -794 -38 248 -641 1113 -551 -558 474
2557 474 301 341 102 -587 -18 225 -150 586 -349 438 934 382 -352 274 176 780 405 133 324 -500 319
2578 319 225 87 165 365 -558 -93 -170 -430 49 125 -638 219 -305 6 677 -558 163 -437 -210 99 -166
2599 -166 9 149 -801 225 247 -270 308 121 -527 -49 -55 624 8 -673 73 26 330 347 68 135 669 94
2621 94 256 236 274 311 352 210 170 543 160 -20 215 -406 235 309 -95 409 -251 98 -10 -253 741 140
2643 140 565 -31 -324 210 716 109 459 -639 257 -565 -435 289 -642 -337 310 -418 375 -75 107 315
2663 315 -214 84 -286 -349 34 -908 -309 -246 -388 -49 -386 -134 -134 -288 210 -254 64 -12 -182 189 -327 -96
2685 -96 215 -552 220 -24 -249 152 -782 483 250 -161 752 443 -34 552 54 -22 270 -85 645 -89
2705 -89 22 461 -200 349 307 64 52 -131 215 52 14 210 -309 -3 9 -272 226 -68 -35 -26 -14 -182 -122
2728 -122 -117 -212 -387 189 -404 -472 -204 -180 -137 -198 -474 225 -296 6 177 -459 33 34 -290 95 -409 20 121
2751 121 -313 266 -133 -185 188 -224 51 26 41 610 -122 82 82 -43 316 -18 181 299 4 326 -61 255
2773 255 -93 190 185 140 206 -27 285 721 -453 -75 191 -236 308 45 -185 429 -356 247 148 -253 280
2794 280 73 56 428 -682 -76 502 -240 122 -177 -253 291 -338 -132 -165 -645 18 48 188 -37 -724 -181
2815 -181 61 38 -290 413 48 86 391 213 235 -934 -221 -306 -724 -137 379 161 387 -231 -509 -427 -140
2836 -140 215 840 -943 -57 497 -709 563 -706 -4 881 24 303 -123 -950 1038 674 -261 -165 -692
2855 -692 -329 193 286 -89 -277 -158 746 306 -206 378 -202 -89 783 -316 -69 337 -314 308 -282 -750
2875 -750 263 -301 -208 273 -1296 155 127 -326 329 -517 -585 153 -410 -283 -50 -981 344 -41 -994 331
2895 331 -95 -163 661 -363 -420 166 -344 354 -170 -381 207 -131 501 -51 -506 -190 352 -341 534 -200
2915 -200 -298 481 -372 393 321 -279 559 -123 -216 677 -431 -317 794 -271 -366 46 -350 289 692 -165
2935 -165 505 -54 134 476 -503 -400 243 -161 205 -360 -379 145 -819 336 290 -643 -595 -61 200 516 -5
2956 -5 -516 416 253 445 -405 -834 555 178 -250 -39 -165 -94 654 -73 -261 258 -379 616 -10 -887 302
2977 302 -553 -46 161 -488 -19 406 -304 834 -626 62 258 -56 55 183 -294 472 124 392 546
2996 546 163 -42 299 -290 337 74 221 495 239 24 549 -587 519 475 -288 297 124 -254 446 -3
3016 -3 -302 135 -308 306 270 -125 149 -212 -5 389 -551 -380 181 -92 145 -106 -315 161 -199 -85 295
3037 295 -258 -218 316 -496 70 -415 -357 279 18 -82 122 -134 -139 168 -531 -330 -201 -88 262 164 16 111
3059 111 8 425 243 -43 666 -166 -149 473 -390 470 -18 -79 558 162 -229 -146 303 82 403 25 79
3080 79 673 -122 -435 -534 138 -240 -27 -668 199 -652 -484 189 25 348 -340 -504 -147 -489 37 -300 410
3101 410 395 -11 204 -185 -158 161 394 -198 -177 -100 87 144 3 -222 -32 134 -392 293 -779 -294 -575
3122 -575 -92 37 -354 -397 71 56 -541 -154 -492 -480 -793 -157 149 -382 -125 -239 -295 138 -397 203 -658
3143 -658 126 -436 39 541 180 -297 -511 -278 383 477 -197 139 -593 599 -142 181 -27 -55 -86 259 -152
3164 -152 242 -130 179 234 -174 -269 -253 -120 34 -153 -403 127 -338 177 167 -311 66 -162 95 133 -173 134
3186 134 14 -147 -258 -351 -147 -267 -127 -175 -227 5 44 130 47 -427 -67 -65 -148 88 -206 -97 -136 -213 104 49
3210 49 37 138 -49 64 275 122 289 -42 13 233 -56 362 27 -23 270 -188 350 74 -36 82 -1 347
3232 347 153 -194 189 285 -177 -106 53 66 14 -32 -105 103 -114 66 6 -199 -233 2 -197 291 -54 -98 -170
3255 -170 -24 -7 290 -262 -392 285 -729 669 426 -300 -101 -561 137 -31 -343 -293 328 -166 666 -175
3275 -175 -753 983 -683 340 -980 -46 26 -161 -285 766 -588 -391 185 -89 565 191 224 400 3
3294 3 -227 342 284 566 119 475 64 -382 400 31 -502 -373 -106 151 -537 107 -52 362 -288 -850 262
3315 262 -695 -753 -93 31 337 28 -128 351 321 -709 114 -529 -64 940 -581 -495 -572 -138 -185 158 235
3336 235 116 -245 156 -462 82 -321 63 -8 280 -366 -371 604 -619 180 30 -267 -453 544 34 -183 39
3357 39 85 2 -473 62 -160 -373 212 -163 -143 313 -255 -166 256 -334 278 -163 103 592 -498 -126 480
3378 480 -200 334 -263 -289 670 60 71 34 -253 33 390 66 76 -20 -76 373 -139 -558 -1 -337 -6 128
3400 128 -334 221 -188 -227 -159 -419 63 -136 -305 157 -47 -505 111 -301 -327 107 -499 15 109 -330 165
3421 165 -178 -251 498 -267 183 38 -319 412 251 -8 255 34 113 405 -273 -61 242 -17 471 -8 7
3442 7 358 -196 59 320 -44 130 52 24 349 -152 -356 571 221 264 199 -195 -157 115 -12 287 -134 133
3464 133 -120 255 338 428 -427 273 -350 -262 576 339 -205 -692 71 32 538 -998 360 -250 -102 503 -457
3485 -457 617 -38 849 -402 48 -556 -181 -87 -245 221 -479 575 -790 -372 90 813 -98 -148 183
3504 183 56 437 -77 -552 380 -82 1068 -545 428 -392 -693 313 -259 -360 726 196 -380 719
3522 719 294 -67 -119 117 70 260 -100 608 421 -268 688 339 -658 10 -327 -226 138 -206 377 47 270
3543 270 152 -201 99 586 -554 141 532 -411 -349 128 -309 232 -207 394 47 -303 -102 -164 -290 247
3563 247 -292 113 -208 -114 154 44 11 53 -469 22 -62 -18 98 88 -87 -80 -91 -74 196 290 30 179 226 -187
3587 -187 95 111 22 146 -102 -16 182 150 222 -142 3 206 194 154 54 56 130 169 213 94 -194 113 214 96
3611 96 -68 121 -129 -126 -6 10 -70 24 -25 -156 96 81 -56 -39 37 -95 264 110 -377 36 -51 -278 -92 -247
3635 -247 -415 -71 -55 -42 -212 30 -112 -59 99 -42 16 -66 74 -87 77 -12 -3 5 -177 -98 -75 61 144 32
3659 32 11 193 274 34 68 -35 -189 136 169 20 254 -43 193 233 285 -172 279 -14 66 172 89 -9 136
3682 136 -239 181 191 228 199 -80 7 -74 -39 -168 -82 150 142 -252 81 38 122 -6 288 -77 277 -167 -475 -564
3706 -564 -420 61 202 2 -98 19 -407 -94 -142 124 -196 -41 -65 -77 -50 -113 93 163 -193 -100 28 -45 35
3729 35 73 -158 32 138 15 235 78 -96 154 -250 25 -99 144 205 102 51 8 -223 148 345 -115 92
3751 92 -62 256 66 -245 -17 -40 -9 125 344 -85 141 -67 4 87 -69 72 -124 -122 63 -107 -58 22 1
3774 1 196 -85 -34 75 188 -190 164 -11 114 61 -66 -76 -6 -331 -47 83 -51 -153 -324 -120 237 49
3796 49 -220 -11 -102 -17 38 -304 188 -113 99 54 -325 134 166 -119 456 -105 -9 260 52 184 132 -176 68
3819 68 41 8 266 -93 201 250 -128 -66 92 -225 242 -82 -73 165 307 -74 184 -281 248 69 -93 130
3841 130 -221 60 198 -122 -225 162 -317 203 95 -216 98 -363 -90 -31 -261 -83 38 -417 26 1 -288
3862 -288 279 -151 103 204 -141 -3 61 -197 257 -178 -136 -104 178 77 113 -173 -5 38 -220 253 -244 -91
3884 -91 -66 26 -14 49 -331 146 -90 -21 226 -161 569 267 -122 77 -79 -12 256 61 167 329 -77 73
3906 73 202 69 208 85 -207 224 -10 -23 -42 -198 239 131 -111 88 135 -120 99 -325 -150 220 -133
3927 -133 57 -44 -287 163 -242 66 324 -132 -51 87 -173 131 -88 -196 180 50 139 59 -118 139 44
3948 44 -348 -36 -90 -23 81 -187 -107 28 -181 225 -176 -236 32 -206 -46 169 -162 9 95 50 256 244 70
3971 70 47 -237 -48 231 -30 210 114 -286 -62 -54 194 87 -265 -106 65 -111 107 -188 -4 74 132 -103
3993 -103 -242 17 217 -34 -60 387 77 -121 425 -32 310 348 -21 314 -999 -30 -497 26 269 -96
4013 -96 -352 18 116 -786 270 -20 -829 -206 397 63 -280 -854 -18 66 24 192 94 -98 82 -243 39
4034 39 146 55 -35 184 140 128 -107 -24 107 -16 88 16 181 -180 -181 59 245 160 -110 90 -2 303 -74 -35
4058 -35 -79 -72 116 363 27 -92 335 -63 -29 -120 -65 39 -52 141 -102 -105 -219 -24 -108 1 -94 -121 -20 101
4082 101 -49 -4 -99 -60 -63 71 -147 -271 51 -157 -191 32 -208 -177 36 180 61 33 -100 -87 -109 83 23 190
4106 190 87 181 207 -297 248 -117 72 50 -139 23 -29 173 160 329 120 1 -157 -144 481 -319 -127 -48
4128 -48 -114 -9 177 95 33 -13 209 87 -236 159 114 -49 -72 -162 -92 -18 -26 121 -148 48 41 2 158 -10 164
4153 164 39 18 40 85 -74 -228 -123 -166 -98 -53 -222 -129 69 -225 -1 187 -218 -134 54 -98 -148 15 111
4176 111 19 -175 131 -16 128 -88 -162 -37 202 20 364 -230 -300 247 136 39 -47 154 42 107 107 -52 -38
4199 -38 25 120 63 225 148 92 167 -58 -74 43 149 -197 195 -17 -150 64 -101 1 60 -112 -10 -135 -203
4222 -203 -25 -67 2 57 -73 179 -18 210 -29 -121 193 -214 88 -17 -43 -236 214 -144 -97 97 -42 -46 135
4245 135 -84 -42 -133 92 110 90 58 152 79 -113 171 105 -85 -111 62 160 -118 -174 6 -139 -8 169 152 181
4269 181 -130 -123 120 150 130 136 -197 172 53 -177 112 -241 88 56 -89 40 81 109 184 -170 -248 112 -260 -65
4293 -65 158 -256 -14 -80 -8 69 -109 16 -102 82 25 44 -172 -170 -255 -262 -57 -137 -384 -48 -43 -109 -37 -291 -176
4318 -176 -37 -40 155 -283 -94 -81 -43 48 -20 -70 75 50 173 244 31 -25 -37 164 103 100 -20 57 -22 78 74 -66
4344 -66 -48 -48 -46 36 -88 -20 65 -122 130 -48 -92 -52 -3 -113 -81 -103 -156 29 -139 -147 102 97 280 146 -218 -4
4370 -4 -169 -12 106 -71 -233 14 -85 299 -19 -88 135 -368 -83 379 -244 164 -135 -191 195 -377 305 -132
4392 -132 -174 402 -404 -42 -26 137 -181 446 199 143 50 -407 567 361 -605 17 -438 435 -165 244 -299
4413 -299 -912 52 -481 -528 254 327 -294 -562 594 161 -261 -22 198 -26 133 141 -84 92 156 -151 85
4434 85 -57 40 69 -58 -63 60 18 30 19 390 158 44 447 134 46 -168 90 308 240 285 98 2 -145 -102
4458 -102 -295 56 113 39 -252 -111 109 92 -2 130 42 -163 80 145 102 226 -219 -120 54 200 62 432 -392
4481 -392 265 180 421 -94 -129 -7 153 232 109 -215 199 492 307 -4 -364 -639 168 255 -1227 -118 229
4502 229 268 -106 -355 621 -343 -165 307 -143 -878 -156 -174 160 -285 -172 -401 -596 700 -356 -33 402
4522 402 617 171 258 493 -533 569 -307 485 -149 44 418 -109 65 120 373 222 516 162 171 103 107 -110
4544 -110 67 -357 344 233 -196 20 -163 51 188 -93 124 -213 8 20 283 30 77 285 -48 -134 -25
4565 -25 17 151 179 54 97 80 46 -8 189 86 -43 -127 42 30 235 -151 -30 -173 231 124 120 40 137 -26
4589 -26 3 -60 -182 -8 44 -219 221 -129 -90 -410 36 58 167 -130 -75 105 -308 -208 -109 57 2 -16 113
4612 113 -274 -103 -68 5 31 -136 17 19 131 27 -25 -29 -177 -144 21 -238 -51 34 -79 -12 -122 -167 210 361
4636 361 145 -43 -82 275 -169 80 91 -151 -162 43 6 23 -218 170 55 -27 157 -257 -57 132 150 134 74
4659 74 15 122 -28 -105 -10 28 280 90 -143 80 -233 105 -398 -263 -230 147 -82 -279 209 -199 -112 38
4681 38 -239 -100 -504 537 -53 -43 188 -231 233 -4 32 -64 -28 -177 -49 32 84 -162 -127 109 158 -130 2
4704 2 120 60 -91 -65 114 -304 -93 -100 122 -3 139 102 -282 -6 -147 -26 121 102 -58 338 -37 -75 -42
4727 -42 4 -114 -66 191 -208 -99 12 28 -177 -105 -83 67 -172 60 39 52 -32 48 83 -31 3 12 -234 167 170
4752 170 18 -48 -261 -178 -127 -104 -199 -101 -85 -293 -65 -236 -116 -42 -72 8 -47 -260 -42 -25 118 150 -23 168
4776 168 -51 -270 320 52 -89 392 131 -611 -157 294 -7 132 -161 -148 -231 -82 -377 28 -58 252 -836
4797 -836 -8 -314 303 172 113 -235 -302 -1140 29 -127 -632 -134 -783 136 -222 -139 106 45 118 213 345 -43
4819 -43 80 114 230 -174 -345 213 38 18 -121 78 -218 517 20 -359 -623 29 105 -613 6 -439 70
4840 70 -396 631 483 80 172 -176 167 -108 255 -102 -51 74 52 33 99 127 -44 43 -96 108 140 67 49
4863 49 -70 -155 43 -142 -58 115 146 234 114 75 -30 -122 -261 -22 -193 -200 -56 -183 104 223 93 40 -97
4886 -97 -114 157 -100 -58 38 -225 -156 31 24 11 -104 -113 -20 -636 -115 30 23 -46 64 -268 3 9 183 -446 130
4911 130 9 -288 44 6 -275 105 -100 590 419 -174 579 496 -27 -147 376 424 300 -287 -242 326 119
4932 119 -178 400 -12 342 372 -624 -28 88 -158 243 137 -490 157 -220 -186 129 405 -419 -309 118 495
4953 495 630 90 35 -57 872 664 -402 -376 833 150 -398 200 74 -336 -269 -63 -66 32 -34 290 97 6
4975 6 -442 45 79 330 -157 -399 -581 87 38 -212 -248 156 -577 -473 824 -263 -143 576 -295 -40 8
4996 8 358 218 255 -574 163 -238 -166 -230 -205 -215 -63 11 225 308 -627 276 237 577 207 -105 -194 -65 220 -64
5020 -64 -152 232 38 7 -146 178 -12 -15 18 175 -55 -27 -61 -109 10 -272 -222 65 -20 60 -59 5 -100 35
5044 35 67 42 -164 7 -68 -210 -41 -73 -1 -48 74 -250 -126 68 -37 -235 -84 75 138 -243 113 -132 128
5067 128 14 -41 32 -36 77 -14 -59 -14 100 92 193 -21 -21 157 6 -98 278 -15 21 16 120 -96 68 222
5091 222 157 -106 45 -33 42 74 -51 68 -175 74 -46 134 124 -61 14 153 93 95 -39 -41 136 -52 -319 198
5115 198 -165 22 5 -21 26 -110 -51 -14 166 -10 -150 -204 -82 140 264 15 113 52 208 -47 -123 5 61
5138 61 92 31 46 96 -235 -35 -87 64 127 -139 -12 -22 2 -45 -131 -32 -103 -113 17 -78 -11 157 -81 -148 340 153
5164 153 132 -35 -21 58 49 -129 12 40 -85 -5 139 -100 -67 37 108 170 -123 18 48 51 -69 -278 -90 -155 -151
5189 -151 40 176 23 50 -99 -75 42 -195 -39 203 -179 -75 -171 13 -127 -35 147 -67 -393 -207 153
5210 153 -97 0 -157 95 -6 232 113 104 -11 81 71 -119 -166 55 -87 -8 -207 -16 162 -56 36 50 111
5233 111 -56 -223 105 -25 -210 84 8 22 -75 -121 -148 53 -32 -3 150 -117 -67 -15 -174 257 -289 -156 -45
5256 -45 -29 69 66 -153 73 -24 -138 -130 -37 -90 36 226 -166 -24 3 63 -292 10 -170 60 45 86 131 -1 -41
5281 -41 -164 81 122 -89 -132 244 -43 83 -80 -109 -73 17 -43 7 -161 95 76 20 176 -120 -16 -142 136
5304 136 136 -106 88 58 124 -7 27 -46 -65 51 -250 106 -163 75 -57 84 140 34 -95 -185 43 141 -178
5327 -178 10 70 15 38 -45 -106 146 4 153 -182 183 157 289 -335 -224 38 -39 91 27 38 -174 116 -84
5350 -84 126 123 -41 -91 -12 47 124 -71 40 131 -177 63 -82 -139 -34 64 -73 71 -109 -288 74 156 111 51
5374 51 287 124 -173 178 -16 -117 412 -30 124 26 -195 86 -66 -177 110 -183 -269 -70 -91 170 39
5395 39 6 -285 -38 -127 10 -18 -44 -82 134 -252 4 -343 45 101 -24 113 -62 240 241 51 -34 192 -103
5418 -103 102 128 -7 -5 148 -171 -46 -12 50 77 -83 76 49 -12 -27 -111 -100 24 -141 -132 158 30 -35 -87 64
5443 64 -55 88 -105 -100 2 55 -83 121 61 -28 245 -10 132 159 -52 -75 80 -42 -130 15 -3 94 -7 -204
5467 -204 101 -14 70 -1 99 -154 -82 -12 30 -61 -44 -50 107 59 -120 -73 -271 1 -327 -17 200 76 -174 -9
5491 -9 1 201 300 -129 -98 80 -151 -80 25 318 -27 176 -20 -229 244 551 -194 -76 6 -324 -389 -408 -54
5514 -54 -71 150 -276 -414 590 -53 -707 -93 108 270 290 18 -164 37 -164 -57 -106 -90 -83 174 46 -87
5536 -87 124 -37 -191 40 356 31 -50 -95 14 30 -1 -186 -91 -152 -126 -34 -309 -25 -97 163 -152 -79 -48 -165
5560 -165 66 -301 17 -114 -191 -62 -131 118 -97 -318 -32 67 -159 -37 123 -15 -390 -225 -21 -186 130
5581 130 -15 -310 321 -153 -242 -84 218 -57 -75 180 -254 43 112 259 -485 38 -414 137 -195 0 -17
5602 -17 112 254 -490 164 54 -418 -417 -268 315 -136 -45 697 -382 146 -65 174 -144 212 -88 -338 -168
5623 -168 393 176 2 -83 -361 -273 -440 231 -379 -115 45 -148 386 239 -215 28 522 -114 -334 -263 -515
5644 -515 -168 36 -386 113 457 131 -11 198 -346 -384 -143 43 8 -502 35 -53 264 294 26 -89 128
5665 128 -315 -748 -9 143 -82 261 358 -104 -23 -171 58 8 246 0 95 -73 128 216 217 65 131 -474 150
5688 150 -500 -28 -43 -385 184 449 -171 -1 -98 -226 64 -53 150 -71 -156 -166 -44 -29 16 -252 230 -148
5710 -148 111 -83 -82 -85 -258 102 -153 194 -208 -163 -213 165 254 -58 128 -41 -19 169 -196 198 -148 -286 -92
5733 -92 5 -319 -32 232 -118 22 296 -31 8 130 89 96 -45 -45 -100 112 8 -81 -107 -204 -132 22 -197 110
5757 110 155 170 84 155 194 13 -159 -98 -1 -145 26 230 23 -20 -103 18 239 -11 86 126 -108 46 -210 352
5781 352 -23 -51 -129 -31 -73 38 19 -94 -218 -192 194 19 9 111 -11 -246 -6 -133 52 44 52 -169 -7 -112
5805 -112 -10 -9 -99 210 30 -81 -158 35 -90 258 80 41 211 -79 168 -130 114 31 -20 -88 -184 68 -77
5828 -77 -207 58 -12 30 -109 38 81 -98 147 -1 116 37 -108 99 198 71 -54 84 -42 125 -83 354
5850 354 -32 45 112 -180 -61 -57 -45 -23 77 -94 4 204 0 131 -198 -9 77 -262 -39 260 -64 97 -211
5873 -211 -81 -173 -96 14 -111 -12 109 -135 -77 105 -192 -20 -125 -146 -153 -142 -69 -74 -45 166 -88 -150 -10 4 244
5898 244 11 121 79 320 -28 -271 -366 33 -128 -197 325 130 -74 -47 -125 -55 369 82 61 -151 12 -106
5920 -106 -124 -32 83 -83 333 -70 -372 -80 166 150 -511 125 135 288 509 -477 153 -179 -126 -85 550 -106
5942 -106 -513 12 -927 -359 22 -41 -50 -270 -534 156 167 311 1 -46 76 281 -101 -35 230 4 -146 272
5964 272 -99 -238 -103 164 270 270 198 224 330 -493 -36 466 -10 248 304 -97 -195 456 106 687 13 -449
5986 -449 -44 -188 -283 -302 187 -362 89 -33 -136 472 -161 8 530 148 932 -362 -46 -132 -218 -152 -145 104
6008 104 -21 -7 -432 -555 129 27 -99 -187 294 -249 -230 -114 -15 -2 -285 61 173 -36 -87 105 -163 24
6030 24 55 -201 -201 -230 -311 166 -701 508 391 355 671 110 -23 -567 93 -394 -525 327 226 -48 1 -113
6052 -113 -146 -200 242 -218 -263 308 -4 -85 240 -238 471 29 281 -202 212 -248 -310 -88 -187 -168 -176 101 -18
6075 -18 40 41 -241 -73 -63 -64 -122 -133 -48 -222 42 -86 -81 -117 123 -211 -32 -92 33 -67 100 57 -35 346 71
6100 71 -36 98 43 -64 64 -60 34 20 -67 -29 215 187 -216 -90 -106 109 16 169 109 42 -23 -67 125 53 144
6125 144 -35 -71 36 -32 62 96 192 89 150 65 198 101 -18 -36 -86 -3 244 61 129 384 -215 79 27 126 130
6150 130 118 90 21 44 135 305 -58 235 22 123 64 81 226 -306 -441 63 104 69 184 -612 85 -225 -62
6173 -62 -11 99 -459 204 518 -472 462 -160 -491 175 -443 113 -369 179 168 -121 163 17 41 -18 -222 5
6195 5 -156 134 -18 116 146 -74 -104 -94 -57 130 -95 130 -64 73 222 -198 22 69 17 0 -35 127 -62
6218 -62 -14 -79 84 311 162 105 -63 -87 -10 -73 -162 3 -21 207 190 -168 37 -121 -172 -34 -82 37 58 198
6242 198 -98 101 -50 199 67 -15 63 18 137 13 -142 -32 -92 144 -210 91 -2 156 -258 48 -25 -201
6264 -201 271 49 -295 -7 104 -30 252 -261 80 59 -144 -219 -102 -43 50 271 87 390 341 51 17 -252
6286 -252 -150 -63 -248 52 297 -499 76 92 424 -85 -44 379 92 -123 -127 -92 -388 41 290 -602 -600 -236 9
6309 9 13 -114 -187 71 -153 -153 133 -208 165 -286 -17 -68 158 -214 -83 993 -682 149 114 212 216 280 -500 -167
6333 -167 332 -231 40 653 -786 380 -231 -319 631 643 -186 -156 -44 -661 201 -400 29 748 443 184
6353 184 266 137 463 958 156 -465 290 -409 -232 298 -95 302 -396 -20 197 -454 196 -177 102 -118
6373 -118 -269 -100 238 118 345 -76 -65 -142 -69 212 -450 132 105 221 -651 37 -153 158 129 164 142 -57
6395 -57 29 -444 43 -49 -268 -289 403 -82 110 60 121 -46 38 -48 -119 -174 -140 81 135 -102 -85 146 29 161
6419 161 -23 -217 -185 -124 -151 -126 217 -210 -112 -313 -235 -341 -195 203 -183 142 155 -127 114 -140 243 -209
6441 -209 -182 -205 -34 -131 64 126 -142 161 -282 -107 -68 228 160 -80 -47 -24 451 86 -243 -153 129 66 304
6464 304 -220 -89 -243 -263 338 -127 341 120 -247 41 -93 -238 -105 167 -27 -165 -176 -126 -369 -122 127
6485 127 -212 152 76 178 120 -106 83 52 -99 -122 108 -138 169 143 311 32 -26 -18 66 -363 -10 -373 221
6508 221 -259 -199 47 472 133 23 -149 102 -466 152 342 -56 -483 400 -64 400 -196 -504 -368 -545
6528 -545 165 532 -28 -12 151 -297 120 -543 -214 -196 -119 104 119 305 -219 -330 378 -436 162 108 645 -122
6550 -122 110 -410 -254 -38 500 -118 5 -238 194 -126 -15 -37 41 -188 -172 -341 -177 -252 -202 -120 44 6
6572 6 -161 311 -422 9 184 234 -590 -2 154 -594 -163 -83 -149 790 -349 -117 -207 -142 -233 488 212 180 -358
6595 -358 -22 -74 -438 269 -188 -64 196 -287 -271 169 -172 707 157 159 -342 240 -339 -103 -38 -165 212 182
6617 182 -263 -253 -616 -31 10 -261 -747 -21 691 -186 -470 -244 -418 -461 268 664 -664 166 -181 -305 6
6638 6 223 -67 -679 -387 53 517 369 -347 404 -374 409 -439 805 220 -1504 -89 -820 334 204
6657 204 -50 730 354 -446 7 7 16 88 115 48 29 -332 194 -96 -243 -118 -142 -95 -314 393 65 -400 -301 360
6681 360 307 -247 -123 -102 -137 8 -516 137 -142 78 184 -159 -197 -152 231 -463 292 319 -371 -501 -186 -589
6703 -589 -142 413 90 -343 -30 20 468 -227 -59 -404 223 356 -560 181 571 124 186 24 -316 126 46
6724 46 -378 25 -482 15 -128 44 110 -252 242 -31 411 -488 -107 191 -381 211 47 -120 -308 103 -360
6745 -360 41 148 40 -112 -337 16 116 -30 -562 -220 392 -137 71 349 -494 155 536 -272 -214 -52
6765 -52 -138 299 -4 140 -323 -53 446 -154 -501 -103 -204 -345 208 -255 273 -54 -228 199 -209 -611 502
6786 502 86 346 215 -289 -280 425 -147 -182 15 -332 3 16 598 -149 348 425 335 -143 -74 -150 -210 -159 -155 96
6810 96 143 -12 -106 -196 51 -535 -313 6 -742 -87 -386 490 238 743 452 67 221 -464 415 189 372
6831 372 -345 -62 -106 52 201 -68 132 -449 118 116 -44 -574 -450 -274 -54 105 -66 -22 207 -91 -198
6852 -198 -602 -79 99 131 -187 -181 96 -419 148 -149 -584 169 54 -587 309 209 88 -556 202 349 -551
6873 -551 -117 46 -685 -958 -53 12 -296 71 -302 1057 688 -623 119 -152 78 -119 -100 -612 -112 -930
6893 -930 564 520 -476 440 355 -28 89 8 93 -151 320 303 -247 -495 237 -410 -797 169 -39 98 202
6914 202 130 -312 454 -75 -185 -413 405 -1129 823 -545 -122 149 196 1121 -913 -227 -31 675 -183
6933 -183 1151 558 -17 -46 -575 -83 -555 353 -20 -135 -229 201 -113 196 -36 122 -25 -197 -370 -492
6953 -492 -283 152 -248 -464 -411 -87 -132 -144 -118 699 21 532 -72 212 -326 389 143 98 -463 46 338 -242
6975 -242 255 200 160 -73 258 25 -706 -189 -52 -227 -172 189 -124 -108 120 -459 628 307 -648 70 -237
6996 -237 -379 295 -417 272 112 -768 -243 -112 160 -77 109 948 -790 85 -339 207 504 -367 694
7015 694 -480 75 251 683 -205 -677 212 78 710 11 -133 -462 274 -914 228 -453 -861 -680 -255
7034 -255 -40 -135 471 140 -34 302 -72 -139 561 -170 -608 -705 -30 436 -41 -112 -373 -44 -106 570 -726
7055 -726 409 -363 -506 155 253 134 -272 -159 -179 624 213 -1 133 -219 -441 79 -295 -237 -378 -221 -39
7076 -39 371 -8 195 395 -186 -241 -173 92 -148 -179 107 -45 -173 92 -566 -559 -103 -205 403 108 217 -255
7098 -255 197 -134 99 98 -370 114 296 235 514 75 -148 -425 -229 -30 88 224 200 70 182 -16 -532
7119 -532 -490 -526 -9 39 -46 -97 166 -17 -122 254 -434 -187 -15 -232 368 -36 352 -215 177 -152 79 63
7141 63 51 -5 76 3 -139 -259 -370 155 79 -114 127 -386 -386 -248 591 143 -37 11 -39 -611 61 13 316 -410
7165 -410 59 5 105 -335 -120 -463 430 -301 -531 -630 -274 397 17 433 174 227 -139 444 -111 -282 -317
7186 -317 182 120 -1039 365 -494 -154 282 -55 161 356 -98 516 -157 501 -674 224 -116 -348 311
7205 311 387 38 -95 15 356 287 344 -374 -35 130 203 -24 76 425 104 194 -330 217 184 167 -50 154
7227 154 -99 260 324 -14 -315 -318 88 145 194 465 -154 479 29 -176 482 -184 -454 64 -563 -536 624 -120
7249 -120 -236 -615 235 -450 380 283 341 14 -187 -214 -455 -302 139 27 -299 -115 68 -214 21 9 -22 92
7271 92 -89 141 -146 -263 0 -156 -48 207 128 -214 93 -350 -437 -52 23 146 171 -48 211 -301 -93 -99
7293 -99 -10 -52 157 47 -108 127 -207 -40 -68 -51 70 253 90 351 331 297 366 -79 -143 -178 -128 -130 6 159
7317 159 -150 -54 74 -178 -149 145 290 -249 104 147 -117 272 81 142 279 -353 -266 177 -204 -13 28 -107
7339 -107 206 86 101 137 31 -261 191 -191 -125 70 27 62 -39 -144 103 341 -233 -123 380 -271 50 14
7361 14 66 -80 -55 -90 74 -18 25 180 143 -112 -13 -73 -61 -84 81 -156 -81 98 -33 75 -5 161 44 -12 148
7386 148 -109 71 -244 -180 -99 -75 -109 50 71 -203 42 181 72 -186 112 -15 118 -11 -2 -41 -97 125 165
7409 165 50 -23 -74 26 81 -10 52 -115 -116 77 -31 4 -300 177 -103 24 132 0 241 -31 171 86 96
7432 96 119 98 45 37 50 135 257 -109 -199 -15 -142 91 182 62 93 -51 -4 73 209 27 -178 -47 31 -21 159
7457 159 39 34 -132 74 104 106 -56 -20 106 -302 -223 -35 -236 -13 -359 -118 -141 -57 122 78 -202 -62 -16 9
7481 9 22 -54 -16 -271 103 118 103 -4 214 -26 -26 -23 -99 42 112 17 -15 18 74 21 207 -190 -13 -50 16 180 135
7508 135 -74 -94 51 70 -25 247 26 -79 -208 161 -27 2 -57 -141 39 -63 -59 -182 82 -73 -99 -14 135
7531 135 -27 39 267 -38 -138 96 38 -65 152 261 184 40 21 -131 32 80 45 -19 157 136 198 -58 -190
7554 -190 191 117 116 -192 -24 -29 -25 224 -84 -191 -39 -12 32 78 -42 -164 25 -198 85 -150 49 -129 -49 -20
7578 -20 -91 26 -40 152 103 172 -330 78 -80 -132 -23 -215 34 175 -130 -33 39 -174 7 61 -30 -183 102
7601 102 131 128 36 149 -20 -177 -51 -225 15 21 -148 1 7 20 143 -57 -12 43 188 -132 -48 23 5 223 31
7626 31 66 -285 145 91 -71 -15 -153 -93 -91 -68 -148 -131 -71 56 -80 -69 -156 7 21 93 52 101 33 189 -4 2 -175
7653 -175 -158 -62 -22 -145 45 149 -55 37 -10 49 44 -56 -54 210 -35 -112 182 -57 299 49 75 -8 3 -187 -34
7678 -34 -217 21 -22 25 34 -165 218 86 64 -69 -49 -151 -170 -141 -243 -58 -45 -226 99 -19 -60 71 -377 -128
7702 -128 8 -52 275 -18 -122 -68 32 -88 149 110 -148 -142 3 -56 21 -181 147 79 -56 149 -46 9 -68
7725 -68 13 -13 -150 12 -24 158 -38 -240 21 228 -9 44 -109 69 117 238 216 115 -157 -29 41 42 -132
7748 -132 104 0 26 -133 -99 141 -296 32 10 66 -363 -103 -95 -168 -34 -11 77 11 84 -145 -112 -104 106 -26 -156
7773 -156 31 201 -75 -64 -118 -51 137 -4 -166 74 91 -26 -151 -24 -3 -25 -199 177 -196 -55 -255 -40
7795 -40 154 17 -131 -51 114 113 5 52 -101 -49 -53 71 1 -33 206 -152 -32 -146 240 17 -144 -113 -57 -99
7819 -99 -85 301 -16 -125 33 138 -18 77 44 -301 -75 123 -88 188 -134 -40 76 -158 -173 65 -13 -23 -121
7842 -121 -229 134 19 -153 -143 -189 63 358 -33 48 249 90 119 -112 51 -91 54 24 -111 -8 27 137
7864 137 -27 -118 146 -107 -17 -16 -92 -81 -7 268 -288 48 -189 -36 221 128 -134 86 128 86 -387 -2 37 -90
7888 -90 -33 175 116 69 81 122 173 -224 -77 136 -199 -48 -29 -374 65 123 -172 -63 66 87 78 68 -8 -43 -35 -24
7914 -24 -102 -118 -60 115 43 178 5 163 12 -259 78 -1 -318 -108 55 -48 128 -107 -248 -44 -45 -34 93
7937 93 -86 58 265 15 -85 8 -42 22 117 19 -42 118 -85 55 144 -13 62 -111 -130 28 250 113 62 35
7961 35 -19 15 54 -100 -132 -175 83 157 -28 -168 -46 3 96 278 -200 -120 7 103 170 108 -18 202 -154 -82 -210
7986 -210 2 178 -87 26 -6 -7 -5 213 -225 21 111 22 211 -28 -104 42 -162 155 35 148 -46 60 13
8009 13 -106 -108 -91 30 -303 32 -24 3 185 -156 -101 26 -100 120 -42 -106 -96 14 238 91 -147 -24 177
8032 177 -139 79 -97 -185 -89 94 -208 -36 125 79 192 -136 130 36 179 -85 -50 2 -94 186 131 -381 164
8055 164 -59 97 31 85 -36 -185 184 29 162 108 62 59 -31 -11 57 -44 -77 76 -183 36 98 -169 -336 98
8079 98 160 -10 -28 -3 -123 198 -164 -21 -51 -42 -40 44 -68 -2 43 -49 115 57 -5 -20 -10 -352 264 86 -58 33
8105 33 -129 -129 91 179 45 65 15 43 -162 -218 55 -125 90 14 127 40 -92 -1 62 46 -11 -222 163 -200 98
8130 98 120 63 39 134 -16 321 -244 83 -152 9 101 -185 87 -111 -39 -161 -63 7 10 18 -68 -172 -56 32 149
8155 149 52 -119 116 -20 36 -65 14 55 -81 -74 -61 -3 -185 212 -144 52 216 3 96 -189 72 41 6 -270
8179 -270 78 -23 41 187 -270 -36 54 -18 -152 117 -20 -36
8191c6
$$ Imaginary data points
##PAGE= N=2
##DATA TABLE= (X++(I..I)), XYDATA
0 0 0 0 0 0 0 0 0 0 0 0 0 0 -8 8 -8 8 -16 16 -22 24 -32 35 -40 48 -59 71 -80 95 -111 127 -145 166 -187 214
34 214 -242 273 -306 346 -387 433 -482 537 -595 661 -732 809 -894 984 -1087 1197 -1319
51 -1319 1452 -1600 1762 -1944 2148 -2378 2640 -2937 3286 -3699 4190 -4792 5550 -6534 7877
66 7877 -9820 12945 -19119 62737 -139256 45646 59618 -145192 144145 -47204 -33990
77 -33990 69125 -74811 49252 2935 -61026 40550 -32128 37902 -17396 -41651 56641
88 56641 -7033 28977 -1255 -53306 8870 -33541 51559 892 -81555 26999 -16579 31646
100 31646 29442 -59956 25369 -46035 21390 64337 -80342 37007 -23057 -29568 91146 -94748
112 -94748 8624 35467 -90996 86238 -22446 -32210 82240 -62392 49178 6020 -82968
123 -82968 80094 -28213 -15060 40088 -62540 35795 15278 -9102 25114 -46735 16550
134 16550 19930 9891 30589 -44281 18267 14099 -16586 38339 -38364 -15408 15222 -11798
146 -11798 37805 -17205 746 23256 -21652 34332 -18840 -11686 28165 -39949 32969 -5289
158 -5289 -34785 49745 -39585 3491 14671 -54826 53477 -6063 -17292 44434 -52200 19646
170 19646 20612 -41007 26773 -38811 -12698 33173 -27409 21102 -9717 -20330 28347 -15329
182 -15329 10699 -1812 -21872 19586 -9239 6415 3465 -18716 10380 -15272 -74 4522
194 4522 -13387 22390 -3972 5791 15483 -16580 20659 -6711 -13180 14951 -22872 17774 10103
207 10103 -16425 22191 -19277 5009 23118 -20499 22072 -4865 -9281 32417 -14933 7307
219 7307 6073 -24750 16092 -7339 -5323 12289 -12703 13080 4090 -321 13328 -12472 4836
232 4836 -1954 -12339 11288 -8165 -241 5035 -13238 2027 -4580 -3261 2001 -6401 5323 -2348
246 -2348 4559 6845 -11776 2273 -8921 -10746 6813 -11814 -789 1600 -8561 9492 -1782
259 -1782 -1034 3639 -9161 4716 -2100 -2311 8316 -9191 3010 1518 -10590 7556 -5422 -5633
273 -5633 8442 -1787 6467 9531 1367 2555 -1497 357 -2455 -381 4573 -4460 3322 5761 -2597
288 -2597 6175 2109 -2910 4250 2852 3795 3720 2944 1801 -1996 1751 -1222 -3889 16 -3040 -914
304 -914 3293 2772 4030 1829 870 -506 -2940 -310 -2455 -3746 97 -1377 -1820 -1060 -1896 -4089 -4429
321 -4429 191 -294 -946 4420 -306 -3048 1922 -3977 -5874 -663 -5356 -5228 1759 -888 -1094 3090
337 3090 38 -1345 1270 713 -723 -677 992 -698 -825 3311 -341 -3062 670 -1942 -989 4864
353 4864 2264 2687 5774 2173 2454 1516 -1182 -893 -1127 1210 2216 -150 3569 2445 -1544 3759
369 3759 1012 -1511 5412 1681 -700 4023 -934 -378 2541 -4046 -2731 -423 -3348 2178 1353 -1820
385 -1820 3146 -44 580 2572 -6723 -2243 166 -5055 3223 -2126 -5818 3161 -4320 -2037 594
400 594 -7687 3053 1592 -2375 4856 -5257 -1344 3219 -7452 635 -4205 -5986 7130 -2663
414 -2663 -1023 3781 -4700 5328 3863 -5111 1357 -1838 174 6593 -1710 -2967 2332 -75 1828
429 1828 2935 -5601 659 7490 877 6671 1322 -5952 9194 -726 -2338 4405 -9593 6835
443 6835 7046 -6502 7820 -6833 -464 14150 -9621 4017 1161 -8193 16018 -4534 -6202
456 -6202 5439 -11805 9094 2051 -13409 6634 -6232 1875 12044 -11724 -556 2197 -5122
469 -5122 5561 -3902 -9200 572 3025 12 -1915 -4591 -6181 4582 2306 -4729 866 -6836 5446
484 5446 7690 -11039 3838 -7210 -5084 17042 -13288 -1759 6354 -11843 18375 -2141 -11389
497 -11389 12390 -11463 11023 7602 -18576 13342 -5173 209 18230 -19340 2815 7659 -7871
510 -7871 15993 -5782 -6231 11493 -1377 8151 -1792 -8720 5427 1305 3997 -331 -5533 278
524 278 5142 6162 -6422 -1025 -284 -1639 14349 -7726 -6885 7025 -10654 12111 -53 -17731
538 -17731 11414 -9386 4966 10261 -23822 11346 -11 -8169 19326 -21463 -3065 11767
550 11767 -14398 14112 -8516 -13365 15123 -8485 5700 -992 -15510 12342 -2287 1839 3534
563 3534 -14566 6694 3426 -779 1275 -9932 3698 3581 2808 1313 -8988 5515 2308 4466
577 4466 3361 -12216 7424 1567 892 10143 -15960 6559 7511 -7882 15827 -13991 -2998 17881
591 17881 -11249 12629 -2569 -13731 20115 -8215 1710 5835 -17376 15523 554 -5129 8579
604 8579 -15335 8259 6269 -8707 7975 -11625 2015 9687 -9105 4335 -7350 -2757 9269
617 9269 -6903 878 -4912 -2917 7378 -4224 906 -6067 -2492 7007 -6823 2910 -5865 -5442
631 -5442 11219 -8386 3270 -565 -11865 14845 -6456 -2741 7935 -15167 12512 1703 -10663
644 -10663 13041 -12652 3801 11596 -14387 10094 -3276 -4246 14525 -9858 3290 3533 -6686
657 -6686 11556 -3321 -1493 4292 -3849 7694 -1175 -1510 3077 -3018 6898 -1710 -391 3337 -4874
672 -4874 7846 -1376 -3020 5084 -7013 6587 343 -6040 7176 -7623 3319 4320 -9652
685 -9652 7336 -5231 -2154 8861 -11454 4277 523 -8123 9645 -7665 -1995 4946 -9037
698 -9037 5709 -2329 -5495 4951 -5929 2364 -33 -4943 3910 -3884 1090 979 -4043 3269 -3358
713 -3358 1275 1407 -4923 4684 -3111 129 4804 -6004 4479 174 -2941 5880 -3774 2220 2255
728 2255 -2783 5505 -2986 1169 3989 -4178 5845 -223 -1922 5829 -3630 2896 1973 -2314 4593
743 4593 -2126 1757 2247 -3427 4470 -1386 -737 3477 -3281 1982 132 -1326 2471 -2751 1789 -186
759 -186 -2884 3153 -3583 -354 1858 -4310 1962 -1106 -1894 1152 -2980 830 -1277 -2112 2090 -3436
775 -3436 7 694 -3624 1579 -1542 -1831 675 -2133 640 -1012 -490 1316 -2868 1309 -111 -2041
791 -2041 2094 -172 1000 1590 -1159 1198 -520 587 923 -859 1936 268 -194 2221 -301 650
807 650 1654 -174 1070 462 876 802 379 1934 -222 1318 1546 -680 1679 -9 32 1939 -434
824 -434 689 91 -671 699 -1126 318 323 -1476 1375 -583 -912 978 -1477 -158 69 -1886 -62
841 -62 -1247 -1169 134 -1272 -1310 -285 -1268 -433 -404 -1609 -121 -743 -919 873 -1513 -1634 751 -1625
859 -1625 -593 301 -2253 735 420 -798 1298 -1214 -301 2060 -801 649 102 -858 2312 50
875 50 -258 1435 -1495 1330 2045 -1078 1542 126 648 3273 -1025 356 1679 -1144 2676 911
891 911 -2315 2311 339 464 2873 -2076 131 2491 -1221 1724 -140 -2629 2494 100 -618 849
907 849 -3892 595 2198 -2724 1106 -1394 -2165 3608 -1430 -1956 445 -3426 2049 1230 -4585 800
923 800 -1699 -1002 3662 -4243 -1680 1199 -2922 3798 -872 -5261 3354 -1177 -74 2418 -5725 341
939 341 2412 -1755 2827 -2676 -2782 4857 -320 406 554 -3807 3173 3191 -2006 906 -1717 85 5522
956 5522 -1223 -1491 1308 -1476 4845 2583 -4290 2252 118 820 5181 -4695 -1319 3236 -1611 4677
972 4677 -1513 -4983 5135 -522 1737 2013 -7221 3323 2377 -2327 3661 -5978 -1441 6146 -3718
987 -3718 886 -2074 -5285 6050 61 -2774 581 -4445 2098 3335 -4408 -1625 -1194 -928 3797
1002 3797 -1397 -4671 310 -221 978 1939 -5454 -985 3045 -1761 3541 -2926 -5146 6419 -1783
1017 -1783 302 2485 -7952 5286 3498 -3896 5203 -5457 -28 8196 -4970 2428 -490 -4380
1031 -4380 8993 -1873 -2139 3406 -5063 5706 3219 -4926 2852 -1501 1371 5484 -3443 -1004
1045 -1004 1164 -179 2873 79 -3673 227 2600 -135 1654 -1889 -3623 4451 -344 -1322 1537
1060 1537 -6011 3248 3068 -5499 3146 -4506 -1946 6628 -6280 704 89 -5244 7767 -3179 -3700
1075 -3700 3280 -6519 4419 1507 -6577 3921 -3034 546 4757 -6481 1152 357 -1753 4827
1089 4827 -3048 -1536 2054 -866 2521 32 -2381 460 1560 915 -354 389 -1345 2433 3243 -2881
1105 -2881 2552 -892 -1126 6210 -3798 505 2808 -4258 6425 -954 -3635 5760 -4281 3277
1119 3277 3643 -6296 5153 -925 -1204 5808 -5661 1457 2029 -3535 4679 -3257 -1466 3227 -2878
1134 -2878 2749 -1006 -2821 2237 -1831 508 -595 -2087 759 -850 545 -1103 -1563 552 -1757
1149 -1757 1751 -1487 -2349 2101 -3363 1709 75 -4434 3790 -2669 -377 3241 -5473 2492 332
1164 332 -3064 4530 -3519 223 2913 -3572 3509 -1158 -1825 4218 -2297 1790 755 -2277 3520
1179 3520 -945 715 1123 -2504 2893 -560 195 1579 -2033 2213 -64 -435 2480 -2374 2029 430
1195 430 -826 2598 -1572 1066 1240 -2458 1850 -1784 216 1132 -2370 2440 -1620 -202 1624 -3269
1211 -3269 1611 -439 -2211 2214 -2642 -218 656 -2851 1546 -1751 -1374 1067 -2939 1121 -338
1226 -338 -1853 1721 -2017 331 410 -1949 1807 -1354 -440 595 -2328 1104 -254 -364 2861 -1449
1242 -1449 1039 261 -1031 1491 -1208 1261 772 -1597 3025 -568 206 1502 -1384 2292 -895 -679
1258 -679 2796 -1687 1352 576 -1172 2516 -1352 1090 1861 -1807 2509 -877 -39 1337 -1772 987
1274 987 -105 -613 2030 -892 735 590 -1123 768 -1251 -251 494 -1182 147 -789 -1023 713
1290 713 -1138 455 -670 -656 928 -1421 581 -493 -656 325 -1486 -259 229 -1453 1085 -969
1306 -969 -1189 1039 -1949 849 -725 -1152 1017 -1302 531 691 -1593 525 -279 -604 942 -1397
1322 -1397 277 673 7 1296 -160 -511 772 -14 533 602 569 194 763 714 513 656 33 510 1061
1341 1061 -544 728 -32 180 1400 -180 298 455 -373 1474 -625 -1518 1316 -1326 50 916 -2733
1358 -2733 286 -629 -1261 1090 -1482 -771 1438 -745 -37 -43 -2062 299 -447 237 -153 -1688 256
1375 256 239 -1700 392 -86 -2361 447 -752 -1214 -416 -2051 -198 1367 -2279 1075 170 -570 1206
1392 1206 -394 -2018 2266 200 558 442 -2038 1246 1011 313 1884 -1294 -11 2185 -1548 1283
1408 1283 -1000 -1738 2805 -439 -302 2259 -2603 -242 2741 -1584 22 -94 -1126 2855 -720 -1605
1424 -1605 726 -731 691 705 -2085 1117 37 -472 2298 -2517 -1589 1711 -1315 2167 -133 -3180
1440 -3180 2266 -169 -1194 1873 -3419 -251 2565 -2511 567 -1267 -2251 3470 -719 -1438 763
1455 763 -3124 1609 2018 -2898 728 -1302 -424 3247 -2276 -944 1105 -2499 2493 827 -3209 1501
1471 1501 -82 637 2565 -2948 -73 2248 -808 1904 -477 -2790 3040 458 -268 1934 -3225
1486 -3225 1072 3025 -1456 1376 -651 -1899 4339 -807 -1134 1731 -2816 2637 2125 -3275 1572
1501 1572 -1002 -300 3703 -3169 -656 1331 -1971 3349 -766 -3748 2325 -777 369 1664 -4100
1516 -4100 340 1115 -1333 1187 -2057 -2115 2426 -502 -639 -234 -2839 1668 1761 -2026 125 -977 -1078
1533 -1078 2699 -951 -1921 1119 -1625 1441 1108 -2733 941 -339 -609 3231 -2430 -285 2428 -1545
1549 -1545 2780 -1039 -2482 2644 -741 549 1999 -3429 1904 1295 -704 2064 -1765 45 2424
1564 2424 -1002 884 -222 -1069 2127 599 -364 10 -517 457 1184 -372 -992 430 -103 698 318
1581 318 -1727 423 235 -633 1420 -1975 -653 1561 -1857 1066 -770 -2514 2214 -1241 -598 973
1597 973 -3162 1601 452 -1537 1353 -2495 -101 1480 -2392 1194 -949 -1116 2286 -1457 171
1612 171 -59 -1893 1610 -185 -533 439 -788 775 565 -195 -297 -296 963 -234 324 -12 -680 1747
1630 1747 -270 392 1140 -1292 1789 202 -375 1423 -1115 1090 1540 -1291 1724 -927 -430 2120
1646 2120 -1713 1075 -56 -738 2178 -1269 18 505 -1635 1900 -468 -854 784 -1430 793 247
1662 247 -1025 863 -1121 242 317 -1275 710 -1206 -172 208 -1463 406 -1138 200 1187 -1681
1678 -1681 233 -844 -802 914 -1353 584 47 -1238 1512 -982 183 770 -1397 1247 -580 -323
1694 -323 1426 -1035 1057 105 -933 1694 -1005 595 933 -906 1454 -198 210 1233 -1016 1167
1710 1167 188 -282 1341 -793 652 415 -589 1111 -778 444 646 -754 1275 -490 -152 797
1726 797 -996 822 -262 -535 836 -1277 650 24 -894 1222 -1078 -82 431 -1226 826 -560
1742 -560 -548 740 -959 -14 -245 -1048 633 -1205 37 505 -1251 406 -724 -164 610 -934 656
1759 656 -420 -401 537 -788 225 285 -598 726 -552 8 184 -546 657 -344 206 788 -405 1056
1777 1056 -139 -30 1112 -445 711 221 -71 1562 -275 408 738 -830 1113 -166 -26 1092
1793 1092 -626 598 486 -361 897 -177 -169 418 -417 533 -325 -244 416 -429 9 131 -660 36 -63 -420
1813 -420 -366 -148 -267 -141 2 -748 -611 77 -766 312 -609 -627 376 -556 54 -252 -1097 706 -141 -638
1833 -638 603 -1207 134 575 -851 858 -119 -309 1278 -594 42 417 -796 833 348 -662 689
1850 689 -192 413 1098 -667 -38 512 -156 1144 86 -800 719 99 370 1059 -937 246 983 -361
1868 -361 927 178 -838 1526 -44 -180 606 -1237 985 644 -1227 727 -661 -789 1588 -936
1884 -936 -340 209 -920 1035 132 -1666 492 -1148 26 830 -1411 -294 159 -646 663 -940 -877
1901 -877 1105 -253 147 269 -1776 235 1121 -1029 579 -680 -935 1479 -615 -577 692 -1493 970
1918 970 871 -1162 768 -438 -8 2104 -1114 365 470 292 2303 -834 -1575 1490 -19 665 884
1935 884 -1476 941 702 -227 708 -262 -813 1207 -12 582 588 -2101 892 740 -858 679 -514 -177
1953 -177 2344 -845 -780 561 -784 1914 81 -684 -248 -714 80 1460 -2142 111 386 -983 1706
1970 1706 -540 -1707 1115 -793 241 43 -3333 295 365 -1383 497 -2282 -708 672 -766 157
1986 157 -941 -1842 1751 11 -507 589 -1630 -157 1427 -928 63 -305 -750 1893 -11 -747 789
2003 789 -278 938 884 -1069 552 397 20 1806 -551 -706 1277 -108 1160 421 -1580 1182 412
2020 412 -279 980 -2008 -757 1732 -780 950 -568 -1495 1951 -262 -465 767 -1266 698 577
2036 577 -855 398 -667 -447 586 -941 -862 234 -766 1542 -686 -691 734 -244 -83 781 -1154
2053 -1154 -278 412 -668 209 -566 -674 710 -116 -592 125 -1442 -374 942 -378 337 -138 -1025 2281
2071 2281 -776 -499 984 -1242 1272 473 -911 1103 -367 96 1241 -997 444 226 -447 1503
2087 1503 -527 -378 880 -514 773 623 -662 575 392 -215 739 -658 -519 597 -206 -128 88
2104 88 -549 -342 693 -720 -115 187 -308 287 127 -785 734 -800 -255 630 -1185 119 -659 -677 925
2123 925 -923 -214 44 -782 648 -887 -651 82 -897 394 153 -1037 396 -492 -429 406 -429 395
2141 395 -434 5 635 -214 -3 103 48 276 -443 215 96 -87 181 -439 933 -52 -265 881 -352
2160 -352 560 382 -1073 712 -495 -125 502 -427 733 -326 -552 528 -358 233 -261 -416 1087 -770
2178 -770 -803 560 -1010 201 178 -742 549 -373 -170 164 14 457 246 -578 25 -704 2 -727 -525
2197 -525 119 -304 342 -783 -427 -146 -435 201 -216 -118 319 -690 30 -101 -370 419 188 -570 -230 -513
2217 -513 194 296 -328 364 -154 514 464 -428 205 -128 -62 647 -347 173 661 52 728 355 405 427 -141
2238 -141 439 45 -201 494 -334 592 232 -208 572 -265 224 -3 -197 354 -1003 29 -634 -891 526
2257 526 -138 387 77 -1087 178 -338 -38 308 -621 733 209 -381 133 -856 -122 227 -750 -38 -480
2276 -480 -637 158 -930 -187 -236 -312 60 -269 -4 -59 -275 84 -77 -417 -6 252 -133 -17 329 -92 -282
2297 -282 325 224 123 184 -126 532 -81 94 284 -243 477 344 -530 342 -278 167 657 -324 587 383
2317 383 -231 905 -334 -124 508 -239 549 -16 -408 333 -203 55 236 -672 -90 34 -237 120 -192
2336 -192 -492 240 -74 -396 -12 -603 -170 124 -450 37 -165 -585 611 -301 -748 86 -720 105 334 -819
2356 -819 257 -459 -393 775 -804 -343 717 -574 518 -118 -671 1094 -120 -657 432 -667 99
2373 99 667 -187 727 -91 99 629 353 31 158 -142 738 621 -369 172 -344 -156 551 -297 -679 349
2393 349 -737 1314 649 -113 677 269 -428 417 -1126 -339 1725 -498 1186 -487 -899 803 -563
2410 -563 -558 768 -632 213 807 -1157 -615 -200 -396 1373 -794 -402 -44 -1438 835 -485 -654 -139
2428 -139 -619 -342 622 -1052 -752 -355 -969 573 -268 -706 560 359 211 993 -1035 525 -179 509
2446 509 208 -907 -597 534 -821 189 383 -921 434 941 -281 1272 -499 -1049 1287 -209
2462 -209 -681 -497 64 73 542 -209 1676 -491 -55 516 -1590 140 455 -831 1365 234 -923 1051
2480 1051 564 -428 748 -216 -193 492 -645 625 56 55 -43 -809 -241 -252 -588 723 846 -1297 436
2499 436 -1550 -664 1033 -942 -792 73 -652 539 -253 -1082 670 -381 419 750 -845 309 53
2516 53 -144 642 -54 -949 622 181 -106 -243 -1197 174 302 309 474 -183 -68 1778 -128 -21 55 -748
2536 -748 377 -46 -251 363 74 207 628 18 627 439 -428 129 200 -568 26 -64 -417 537 -916 571
2556 571 85 -793 838 -973 -270 83 194 -227 262 -536 -224 -15 -382 117 -233 490 340 -116 346
2575 346 -372 -13 228 -194 -315 -1366 -321 578 274 29 -61 -232 -448 56 90 -287 422 -62 178 62
2595 62 -146 -188 401 -812 544 -300 284 466 -39 984 58 223 741 -316 251 59 -13 320 -189 -320
2615 -320 -363 438 75 99 218 276 129 187 57 -88 -228 -54 -27 4 298 -227 -500 -14 -524 -454 -633 21
2637 21 -213 202 -358 -172 -593 -395 639 -888 -78 59 -304 840 202 -327 -209 -68 -257 -253 58 -172
2657 -172 -490 169 -123 -237 293 -80 117 227 -285 218 -128 108 31 -423 257 290 125 399 22 10 197
2678 197 -118 555 -30 268 477 -135 444 238 160 514 -158 521 52 -87 547 -72 199 521 93 178 208
2699 208 -348 311 -276 182 -288 -381 214 -256 -185 60 -197 -105 -108 -229 17 -210 49 -58 -234 19 -343 144
2721 144 -122 -254 -75 -127 -18 -182 -292 70 -281 -37 -50 -458 6 -392 -206 331 -53 480 -146 -291 253
2742 253 -273 226 171 -178 441 -93 -16 467 -399 145 186 -174 465 -110 343 445 -136 536 -138 5 279
2763 279 -31 197 117 34 282 154 158 211 -3 126 303 238 -203 -118 10 97 51 -53 -156 16 -424 68 47
2786 47 -473 170 87 -168 254 -395 108 17 -285 175 -294 -494 270 -255 39 -23 -243 280 -39 -412 162
2807 162 -414 50 202 -622 -276 152 -369 0 -168 -99 -14 -259 -40 275 -113 735 163 -1076 -332 -159
2827 -159 -575 295 440 -675 448 -578 612 427 -24 661 -421 157 818 -237 -720 -300 -498 36
2845 36 -555 -227 237 -78 -520 704 -140 -46 -182 -147 838 -430 -139 170 -388 173 183 -838 -15 -32 -259
2866 -259 450 -565 -499 521 -285 -170 303 -992 403 97 -618 -9 -452 -425 684 -230 22 -42 -942
2885 -942 305 -179 -215 363 -187 295 686 -895 324 336 -295 628 -321 -171 353 103 180 127 -585 235
2905 235 58 -76 334 -184 -24 617 -313 -11 389 -420 691 463 -370 651 -454 160 766 -361 492
2924 492 -208 -468 611 -214 -348 698 -461 679 135 -652 272 -316 -578 1170 -1180 -250 25 -565
2942 -565 372 -512 -592 446 -523 -365 85 -833 -423 337 -13 59 -503 -1005 193 44 -176 691 -976 327
2962 327 461 -762 824 61 -23 477 -203 -254 662 -471 -13 328 -201 244 -83 -419 548 -529 243
2981 243 276 -271 628 -105 4 289 322 -255 1020 -305 184 373 306 319 -137 -84 481 -23 -125 577 -79
3002 -79 -59 224 -554 36 -134 -43 214 -476 -212 68 -189 205 -13 -549 130 85 -31 115 -703 -55 74
3023 74 -339 -135 -448 -406 198 -403 -116 73 -312 269 -145 -476 256 -94 -94 350 -697 -28 -127 -5 520
3044 520 -13 -28 683 -503 -285 536 16 491 17 435 -109 -109 -482 749 -91 -53 327 -208 583 162 -267
3065 -267 234 -305 -217 -75 -290 -239 176 73 704 -382 402 556 -487 69 -64 109 251 92 -63 -146
3085 -146 250 -531 -132 529 -33 116 -246 547 -50 -367 -159 -138 50 -23 118 -301 -48 -188 155 -264 279
3106 279 327 90 -135 45 98 -102 142 -62 -51 540 -249 0 -15 -295 -139 -446 470 276 -269 813 -587
3127 -587 -129 -494 235 208 94 -26 70 -20 342 243 91 476 233 147 -194 -556 -339 -146 443 -285 31 530
3149 530 166 -106 -224 11 730 218 -209 -316 6 267 195 -529 -195 -557 163 -23 264 115 116 69 186
3170 186 171 -193 -262 -197 -140 150 -503 -91 -208 210 62 -374 415 -51 -337 111 131 -165 -162 25 62 -122 9
3193 9 209 -64 -115 -24 53 -94 95 -127 -40 292 59 37 165 67 -170 94 -128 114 -161 -50 11 8 49 -210
3217 -210 -122 281 -205 8 259 31 -89 -131 77 222 -191 -129 -58 -182 211 52 -150 45 -82 -45 133 -73
3239 -73 6 -198 -94 -237 -175 181 -65 -125 229 -208 -261 -123 -59 103 -464 -35 368 -150 48 -356 -60 -304
3261 -304 -258 186 403 -329 -135 -230 -288 408 270 169 156 844 123 39 779 49 -53 606 -261 422 206 -120
3283 -120 -229 -637 -300 475 -542 410 232 -981 15 271 -279 327 619 173 306 -220 67 558 -13
3302 -13 -251 -7 -752 407 -197 372 231 -894 -86 386 -474 22 -55 -451 246 -829 -429 -114 -881 874
3322 874 -78 -818 -396 -522 -174 -361 -775 -364 265 -243 549 506 506 237 -28 -24 -304 -509 -360 -179 -444 1091
3344 1091 531 -278 898 -63 218 336 -154 185 79 -633 571 -297 -359 826 -322 -107 624 71 689
3363 689 229 145 504 353 -72 190 19 -121 6 -197 333 -148 -295 182 -198 116 -40 -587 198 126 -166
3384 -166 157 -480 -204 334 -156 -116 43 -366 14 242 -187 66 -226 -116 -34 -584 -128 295 -287 264 -416
3405 -416 -314 300 -262 115 244 -223 228 351 -174 246 -206 101 340 -206 233 9 -319 490 212 44
3425 44 -8 -280 111 98 -146 312 6 50 251 -15 -110 297 -78 73 296 -269 99 109 32 482 -13 -491
3447 -491 28 29 144 46 -498 223 126 -192 126 10 153 490 -397 36 42 -441 238 -640 -601 100 -299 308
3469 308 183 -820 -40 -360 385 387 -782 -280 418 -307 654 -517 -229 258 -57 -228 421 -314 -219 340
3489 340 -382 -289 40 -64 400 139 -731 -119 -90 -171 373 -701 -646 279 -331 302 451 92 102 161 364 429
3511 429 -377 -861 321 -425 705 -171 -65 448 716 -81 -385 168 283 -1057 -204 434 -445 535 137
3530 137 278 -172 234 12 333 -104 -427 538 257 -187 -168 -582 98 -148 147 54 -497 -27 -231 -282 -299
3551 -299 -89 -114 -67 -458 -306 -227 41 -90 -123 -2 -161 -31 -254 -379 146 -290 249 -138 -528 427 -375
3572 -375 -129 -63 28 597 249 54 223 191 144 209 74 132 -49 -56 227 45 -232 99 329 39 89 -2 124
3595 124 -173 284 221 -141 145 -108 -72 -199 -51 8 -118 -137 -196 6 17 -93 114 -88 -125 -377 191 32
3617 32 14 -52 -115 27 -50 -83 75 -165 -37 -37 106 -19 6 -79 90 49 -221 -103 140 135 188 202 177 169 -6 -58
3643 -58 -73 103 147 173 -253 -67 -131 -58 30 72 -90 126 -176 194 106 -83 20 12 120 -149 118 32 209 277
3667 277 -54 -49 -3 194 -341 -85 113 -71 123 -35 -91 89 103 -98 298 100 -185 -331 -162 -131 -156 -140 -131
3690 -131 -43 -130 87 31 -65 195 -405 -186 -7 -87 -72 157 -44 264 132 -147 173 275 972 279 67 725
3712 725 -207 83 131 -67 -62 77 4 104 93 -204 69 17 -218 77 28 -23 98 -48 212 136 -42 210 -246
3735 -246 -125 26 -13 -14 113 -378 7 207 -263 69 3 -9 -30 -270 -99 90 88 43 58 -201 -39 -160 1
3758 1 287 -134 350 -198 -302 -61 11 -185 282 -55 9 49 -326 144 -139 -78 12 -79 -129 209 -129 125 211
3781 211 -76 312 -68 -133 344 -136 -91 69 -172 15 60 -36 243 -32 27 378 -159 142 84 -107 166 37
3803 37 -139 121 -357 -117 13 -219 92 122 -1 159 -2 9 77 -131 170 235 -136 169 70 -412 228 46
3825 46 -375 69 -40 -65 -269 -112 160 21 93 -72 9 -74 210 -192 222 -137 -87 -93 -116 -144 -60 -497 -99 282
3849 282 -175 181 -191 -358 116 -141 -61 238 36 275 -52 -37 22 -56 109 124 -66 54 -88 -119 245 -60
3871 -60 -297 441 -107 -229 63 -235 -78 70 86 70 44 -77 273 62 101 151 -317 223 93 -341 172 -15
3893 -15 -233 151 -248 -173 261 -137 311 -50 -424 125 -454 -211 108 -315 -85 -275 -198 197 96 -18 104
3914 104 -150 -42 -216 -384 -100 249 -149 -157 181 47 -34 -126 -167 168 -324 -135 59 -386 133 -212 52 161
3936 161 -419 -159 96 4 129 -24 47 192 -236 -176 5 -177 348 259 -322 164 -176 161 338 -47 165
3957 165 41 117 102 91 -30 -162 80 -74 188 -128 29 233 -45 181 210 -76 78 -59 -61 -94 -310 297
3979 297 -116 5 -26 -21 -45 -12 -455 -79 139 -6 144 -4 -94 -148 -394 18 125 142 -164 -524 81 263 -203
4002 -203 42 -224 167 -150 904 -144 -344 364 -41 32 -518 459 -132 161 -205 -184 188 -302 -301 -297 -100
4023 -100 393 -449 256 132 -244 28 -192 11 161 163 268 -19 49 -21 -22 -50 -110 151 -6 17 -78 48 -11 104
4047 104 -89 208 -75 -176 -173 -24 177 103 119 151 -117 45 1 -63 -36 -411 88 54 398 6 -142 -91 -70 -161
4071 -161 144 -22 82 122 -114 -50 112 20 5 -22 -63 -122 2 64 51 -88 -40 -128 -17 -57 -98 -19 17 -124 149
4096 149 76 222 71 39 -46 13 109 195 116 -83 127 48 35 -13 96 132 -8 -49 137 115 -40 129 349 94
4120 94 -149 72 434 -105 97 -27 1701 512 -460 -117 -185 -53 -390 -36 -40 147 72 -86 -214 129 -156
4141 -156 -134 -171 48 -114 60 26 -230 -58 -115 -33 80 38 58 74 -89 290 42 -43 57 32 -188 76 -189
4164 -189 -57 294 -175 167 39 77 59 55 -253 11 66 156 17 31 263 -110 -141 101 4 -57 -6 149 46 -60
4188 -60 142 -91 -188 13 115 -164 21 -76 -46 77 57 -56 -181 49 69 160 159 11 60 -19 -79 155 -148 163
4212 163 -14 -41 31 -22 -70 -117 64 -4 88 38 47 -169 -67 -223 -42 -22 -107 54 -273 -14 77 200 114 -110 95
4237 95 165 -23 -108 128 115 175 -5 235 100 134 75 -3 -27 -121 -46 76 267 46 -97 62 133 -349 -118 -95
4261 -95 -289 146 -216 -79 -134 9 45 54 -130 -17 -28 -79 -142 -174 -188 41 -168 -181 271 -125 -169 -216 243 67
4285 67 -18 -27 46 -297 15 -242 -315 18 -139 -167 249 37 196 73 -228 -61 0 -124 83 38 13 -80 6 161
4309 161 -136 82 77 37 140 440 -84 14 -150 -176 141 -46 72 69 -117 -220 348 -252 77 74 -341 118 12
4332 12 105 115 -80 -59 318 -227 -15 141 -21 194 19 110 229 -80 41 -137 -125 13 -55 -74 -54 -46 287 -52
4356 -52 -65 -12 -57 -26 84 -406 -298 190 30 69 122 -257 -40 10 24 -14 39 82 -52 -91 -13 63 -210 -204 198 222
4382 222 -133 33 -139 -168 -110 280 -27 18 719 -472 139 534 164 -445 87 124 246 258 -539 10 164
4403 164 39 -297 -132 246 210 19 30 -291 270 -949 -341 77 -85 -122 -594 -472 -81 462 198 40 -7
4424 -7 79 -253 14 -196 37 -5 -257 -272 -236 -25 -128 -217 -285 -273 -101 -121 -35 -272 -2 -492 209 376 -538 166
4448 166 -242 5 620 -260 230 51 12 -312 -141 0 -183 50 18 64 -40 -51 62 -9 11 177 17 191
4470 191 -67 -146 204 -86 9 -19 -17 -78 38 -79 -148 84 21 -36 259 -261 149 748 181 -1083 -259 806
4492 806 -204 441 323 268 -397 693 276 162 -14 -266 -50 183 -264 142 -139 118 -154 387 422 -184
4512 -184 -456 554 183 -616 -6 61 -393 139 322 -335 60 -11 -223 -381 -434 -218 8 426 -149 -102 114
4533 114 465 -193 406 99 283 114 27 15 304 -224 -445 413 197 81 -120 40 68 145 -171 -304 241
4554 241 131 -140 97 44 -56 135 34 -36 -73 30 46 158 79 -26 -124 -116 82 131 -55 -145 165 -113 83
4577 83 91 -101 108 -145 10 -95 -89 -174 -8 -87 -44 120 10 -160 45 -143 129 142 -2 -192 103 2 74
4600 74 97 17 104 -189 43 -87 -32 -83 86 7 -30 -110 -194 22 39 -2 -81 67 272 -151 -108 -160 -4 -130 -52
4625 -52 34 51 95 42 36 145 224 89 18 -110 103 74 -124 -96 163 -98 192 -62 -15 159 -84 -105 17 309
4649 309 14 34 -170 112 -257 -146 80 -58 120 -352 -57 98 -105 -95 82 -10 81 -66 167 132 -18 -225
4671 -225 -460 7 -220 440 -217 -153 139 242 -401 36 -35 271 -85 -14 -526 -226 52 276 -42 61 112
4692 112 -48 118 -118 211 -8 135 -66 231 -4 129 41 13 6 -80 12 338 -58 114 -140 164 -3 111
4714 111 104 66 67 -6 131 -173 -52 -81 -94 22 -139 -76 71 74 72 -163 -186 40 68 -120 -11 69 -121 -259 -281 -98
4740 -98 -161 -424 -123 -138 -145 194 222 -127 92 38 29 16 -133 186 -121 -286 3 128 -82 85 30 147 -162 54
4764 54 3 -83 151 -145 48 -92 -113 297 101 -276 -6 -244 -104 -2 -18 47 170 549 393 76 151 215 197
4787 197 -304 -402 -244 443 184 -323 -73 -493 120 -214 426 -138 52 -758 444 477 -574 83 356 741
4807 741 -588 220 119 -255 247 -222 -199 -467 -65 20 -9 110 -492 -42 -413 -21 64 191 451 -13 164
4828 164 -83 -480 -291 15 -493 -239 -405 91 -582 125 621 734 -557 -206 -273 -279 -59 276 -120 60 -154
4849 -154 173 -132 514 -13 134 -237 -202 107 -93 -67 -212 -73 -10 138 55 -98 20 -217 144 -132 -162 86
4871 86 -57 4 61 55 67 -260 -113 220 69 81 -8 -25 19 -66 -117 0 -58 -146 -95 -284 243 -302 -147 -115 250
4896 250 326 270 -93 306 -116 146 -110 14 150 -60 547 530 163 -130 74 90 0 -438 -195 128 307 -315
4918 -315 -771 485 983 -557 444 603 26 -278 -432 297 211 138 63 212 174 103 95 -725 -221 -167 -55 41
4940 41 -358 371 620 121 -261 236 222 -336 -257 257 373 -107 106 -95 80 303 -30 -41 -948 411 24
4961 24 -34 -87 9 552 120 -19 714 78 419 402 -69 -157 -238 -120 313 -91 -57 -203 18 -4 -240 11 289
4984 289 248 116 222 -348 -367 220 481 276 -569 300 162 -769 110 414 772 677 -904 756 221 417
5004 417 -128 -474 -165 -585 429 -551 -66 206 -301 -283 -560 112 277 368 -193 -312 48 -48 77 -110 29
5025 29 91 210 -36 -90 -196 -204 10 -145 13 -86 -275 -48 83 -50 -7 -16 -294 -51 153 -157 134 61 11 -61
5049 -61 2 -369 -87 -149 40 154 63 15 -76 24 180 166 216 -71 -1 10 -221 16 65 -177 94 -188 -146 142
5073 142 -33 107 65 313 58 102 102 -157 -65 274 -5 -79 40 -50 -62 145 -113 -86 -199 -254 -153 -120 108 236
5097 236 -150 -214 -19 204 -100 168 182 103 -18 -257 -10 -275 19 -309 -309 -47 -25 -8 -137 -153 150 -19 -204
5120 -204 52 60 95 -60 3 91 -147 -197 -203 121 -76 -71 206 136 13 -263 172 -33 -70 -18 133 91 -77 -139 -87
5145 -87 77 -66 2 119 -65 158 -36 -188 24 -18 29 -80 -46 140 -22 86 -101 74 -21 135 -147 -29
5167 -29 4 83 28 136 -205 -203 -44 -142 -105 -356 -50 -19 103 -79 70 -140 103 -14 -24 1 96 -131 28 -110
5191 -110 164 -32 -162 -16 -41 250 286 271 -409 35 37 143 -61 -196 -200 -61 49 -42 30 -71 -141 45 -41 42
5215 42 9 -156 -123 4 235 84 -83 187 -309 354 0 -45 124 183 -128 96 43 109 -55 -212 224 -298
5237 -298 105 47 6 54 -176 -63 47 -9 -35 107 33 50 88 -75 139 -237 -46 -110 80 -205 299 -51 -261
5260 -261 -94 -36 -89 -63 -157 -78 -162 -90 239 83 -203 -52 112 43 -8 81 -41 275 51 8 -130 -200 -160 -50
5284 -50 179 81 -3 -117 319 187 44 150 -10 -11 -102 34 189 82 -17 12 208 33 28 -157 201 -99 -92 35
5308 35 -216 161 -233 94 116 -9 -146 73 210 -43 -141 38 28 -9 4 -145 167 21 -65 262 -36 -182
5330 -182 -1 -46 -73 -80 -236 -63 -31 -7 53 285 -70 111 24 131 -43 -20 -70 -77 293 309 81 -47 24 216 -31
5355 -31 65 83 -113 -35 1 88 135 47 -152 85 85 50 -176 -135 274 -167 14 96 35 46 175 -84 -77 -98 88 307
5381 307 214 -9 -27 58 31 105 99 -122 76 14 82 178 75 -147 68 -141 -47 57 -5 -70 159 -37 -273 110
5405 110 -175 -114 218 75 3 85 -72 -101 58 307 98 65 63 217 17 -234 24 6 -46 -145 108 -19 -167
5428 -167 185 -131 -61 -174 -64 -31 -83 142 -8 -96 106 -1 120 73 -2 176 120 351 30 50 139 97 237
5451 237 47 -126 -235 26 -85 14 31 -94 -34 -103 -78 45 94 215 -30 -49 72 206 65 -100 124 63 27
5474 27 -231 215 -44 60 69 220 -27 92 148 32 -76 126 142 -8 88 97 -10 81 82 43 -39 -201 -92 102
5498 102 121 -85 -179 -90 -53 113 612 365 72 -189 110 178 -290 -21 489 94 154 80 -341 -482 174 -246
5520 -246 -198 -793 516 215 -241 389 -306 6 -53 -75 64 19 -77 -28 -15 -271 66 19 -226 -237 -56 -16 59
5543 59 88 26 -303 -103 85 -54 -58 -82 -62 185 355 -39 5 108 -44 -125 -6 -71 146 -116 -123 97 77 -16 -478
5568 -478 3 8 -224 -11 -83 -39 -34 2 31 190 -140 -5 92 -87 -165 -322 -150 -322 -106 -144 -238 354 137 393
5592 393 -290 -1 -132 -8 -247 194 664 -379 222 564 613 190 -292 -35 457 241 -47 -387 694 231
5612 231 40 -135 396 -20 -494 -263 410 -403 -1195 1 -135 -230 -275 212 354 -20 -111 161 670 97 195
5633 195 10 319 -291 398 58 340 -10 -647 273 211 139 -417 -298 218 -119 332 359 491 8 -196 -158
5654 -158 -7 10 -275 -461 -544 18 -157 -166 -216 63 -97 179 -265 84 676 317 -84 151 65 275 462 76
5676 76 -3 -16 354 347 324 131 -13 -121 225 97 -202 76 189 259 -261 -245 36 0 275 267 -64 -190 61 42
5700 42 -161 345 20 -56 -133 -50 -116 49 -135 264 61 94 172 64 82 -41 -32 -191 -117 127 92 37 -28 -75 233
5725 233 -151 242 32 115 -217 82 108 395 -90 -115 139 -125 71 -109 -26 -4 -183 -30 183 43 168 -287
5747 -287 64 -263 -283 -51 138 83 -31 -288 -90 -133 17 19 105 -44 107 82 41 81 -15 -56 -181 8 -212 191
5771 191 -166 -48 54 -31 149 -191 25 46 -252 23 -169 93 80 -68 34 81 -248 148 -3 11 49 346
5793 346 -62 -104 284 -21 142 -21 255 -209 -129 -46 148 -90 24 -30 -47 315 -18 212 -31 45 74 191
5815 191 -38 203 125 -5 -102 33 83 216 -76 223 276 30 -37 71 -20 22 -97 -44 -81 -109 174 -54 225
5838 225 -52 61 -164 40 -30 -20 -118 121 159 -91 -222 155 15 -124 -64 -9 261 -101 82 -229 36 141
5860 141 -70 8 -40 -62 117 35 -97 73 5 79 -126 -7 -124 81 149 -36 94 -223 175 154 -123 141 52
5883 52 143 47 -92 0 -69 70 -90 -24 89 324 371 202 121 -114 75 8 -308 -130 -70 -159 -102 -6 -96 -128 -21
5908 -21 42 121 -91 -94 111 -93 10 325 -155 -281 16 255 131 -41 -111 380 65 -70 -28 -75 36 -330 274
5931 274 -308 -158 -397 217 319 87 -237 132 590 445 95 -980 -174 -409 153 -260 341 255 720 358
5951 358 -114 34 -164 183 128 157 62 -148 -72 -10 -17 57 427 277 135 -121 -142 -42 -54 298 208 -62 -233 -166
5975 -166 -328 -133 -137 -148 -131 -272 -97 -248 -32 108 -150 -37 432 62 -366 294 -420 43 16 142 -329 -12
5997 -12 -374 -106 -32 -161 -1032 -94 -767 -616 -642 -815 -130 29 -265 78 365 -229 -139 -147 3 64 -43 -287
6019 -287 135 271 -153 170 -95 107 115 -55 -30 -10 -2 98 238 34 175 128 -551 -195 -17 435 -449 -588
6041 -588 -317 -74 -591 -9 -255 -705 -13 -371 -98 -347 38 -113 -175 -341 -91 -176 -94 -223 -157 -52 -326
6062 -326 373 -6 116 33 -100 -65 -96 333 -208 3 -201 -11 149 19 227 118 168 -56 -30 220 -100 -187
6084 -187 -74 -108 188 -44 136 320 120 -259 -77 36 222 36 -65 -67 41 -223 -135 -121 76 -17 -2 72 47
6107 47 50 12 -19 -87 95 129 94 -5 44 -117 -8 -152 41 -220 -14 93 -37 178 -27 0 9 83 74 22 -51 51
6133 51 -16 61 -100 -337 63 -294 -203 -40 -133 50 -123 111 201 6 -19 1 138 237 125 -169 -138 87 -244
6156 -244 183 -61 -52 -9 -49 -126 -503 -88 -5 136 -212 -420 -66 223 346 -294 -265 506 171 103 -937 299
6178 299 125 -486 -456 -423 -145 -2 133 12 188 308 271 -81 -184 165 -293 -161 -186 -56 121 97 171 42
6200 42 -34 -103 128 -154 82 -94 -7 55 -50 100 -119 -151 -85 -15 189 64 -179 -147 -142 236 56 -44 26 6
6224 6 -195 -49 -145 119 -133 -62 43 -15 155 30 -12 -193 -260 -4 112 29 -241 175 -23 -49 121 -237 22
6247 22 157 131 -156 -4 -99 -332 -126 116 -10 33 68 227 -13 -199 291 26 251 -58 120 -205 47 362
6269 362 -295 -128 91 -6 -23 -130 -255 -119 -100 -223 61 -1 45 46 -57 135 -30 -11 116 -263 247 -139 41
6292 41 561 168 234 -433 504 437 120 -194 -38 -27 -58 -404 27 59 -48 -276 -31 39 -322 383 -55 -51 -174
6315 -174 -2 -116 24 325 -25 414 -504 -128 111 285 -100 377 320 159 -253 196 450 572 -106 -228
6335 -228 -142 -534 -135 277 297 -546 -102 651 -52 423 96 317 -101 -719 -571 392 -932 638 -6 -758
6355 -758 57 -603 -146 489 98 386 51 115 646 602 293 3 -273 -396 -256 -244 -32 -20 -79 -621 -651 -135
6377 -135 369 -521 -155 -357 464 115 265 -6 -146 30 -86 186 176 -117 -3 111 -310 169 -20 -72 74
6398 74 -389 3 192 333 -323 49 -4 -318 94 -317 175 16 172 173 -91 88 -105 -263 86 -178 133
6419 133 -89 -179 356 -331 -284 157 225 331 -193 -158 160 72 -50 -80 -38 -36 -21 68 -155 2 163 234 -201 -99
6443 -99 -10 -123 -305 56 355 96 -91 -246 200 -215 -185 122 34 -67 108 90 -156 -135 -278 -47 -222 -84
6465 -84 14 -43 11 189 -120 9 -331 277 165 -40 -233 82 266 183 -58 164 -86 169 -70 -119 325 -66
6487 -66 -156 94 -225 45 41 -166 197 -38 241 97 127 58 -82 -74 -105 210 -524 -99 -314 242 107 208 -217
6510 -217 -485 224 35 26 -261 271 -436 30 -141 286 -40 -122 -2 -309 -563 538 211 321 -231 -7 -353
6531 -353 -219 -142 -83 -90 -14 156 -232 -259 394 -213 79 -107 281 255 89 -117 570 -460 210 283 87 -680
6553 -680 -557 161 -38 77 -334 -250 -53 -184 -15 175 -263 -58 -338 -589 -151 207 -64 62 -246 295
6573 295 576 -456 -236 429 -336 -690 -659 460 -377 143 81 -144 -72 -429 -142 -173 -434 148 -362 -360 321
6594 321 -330 29 304 -206 -242 304 387 -197 -773 -4 273 394 -119 -79 -234 11 259 372 701 -3 -97
6615 -97 235 -188 36 251 -143 -206 309 94 555 -52 91 586 538 123 -159 -374 179 -72 -399 417 267
6636 267 176 -228 294 -14 -452 -602 -560 348 -276 -227 536 232 -894 -25 -168 -1323 234 254 -4 -371
6656 -371 -147 -726 -907 -93 250 -103 -256 -512 755 237 19 164 -386 486 -333 -23 82 -479 669
6675 669 -29 -443 -370 -31 108 -116 -66 -12 106 -3 141 -58 145 79 -168 -484 365 -272 -111 -114 204 -152
6697 -152 74 -91 -797 -150 236 -127 331 -210 -84 107 -199 -148 -291 -447 197 -146 412 82 811 189
6717 189 -436 317 489 -801 115 8 298 -383 -283 408 -166 -221 -125 195 390 -25 -360 440 -628 126
6737 126 288 -3 -379 62 17 -168 -332 590 -92 -75 -1 -302 -214 -46 -26 102 151 -28 80 -141 276 -345
6759 -345 -184 -143 -227 -406 -279 -176 273 572 324 179 -311 24 -151 -88 -109 310 -30 -328 -187 210 -372
6780 -372 -514 67 360 -260 31 -179 -537 347 73 -328 -66 227 317 -238 -542 168 287 -93 -180 -199 15
6801 15 159 -301 -84 -38 -180 -142 341 -345 334 -66 231 83 -74 622 203 -110 -257 -58 16 724 -394
6822 -394 6 465 318 558 -284 20 167 602 -294 511 32 -230 -198 335 -182 95 326 -109 160 -448
6842 -448 187 67 -148 17 -315 -486 -311 -3 -110 58 345 57 484 187 -183 -167 7 88 154 23 538
6863 538 -247 -102 -534 -344 483 506 -122 118 409 368 70 67 -193 643 -734 650 32 -712 266 -395 -360
6884 -360 -100 327 153 -934 -434 -630 -655 -407 -231 -592 -437 -837 645 1306 -760 276 -63 -170 526
6903 526 -130 -437 148 -176 270 788 -96 394 486 -140 -428 219 137 -410 -29 -625 -37 156 65 742 336
6924 336 525 148 -613 -421 -544 454 365 -33 234 65 189 117 339 -654 290 -277 -1130 -724 -612 -51 59
6945 59 188 346 180 -1267 381 244 48 -228 277 224 -504 13 -285 143 372 -462 -196 725 24 -296
6965 -296 -449 853 491 -17 729 170 583 615 154 748 -134 485 238 72 333 -440 -39 62 549 -233
6985 -233 -108 515 495 542 -556 -1085 12 -214 -319 443 113 288 -215 249 33 299 996 -389 119 248
7005 248 208 178 656 -370 -64 -94 271 297 255 -797 327 59 -386 200 -286 111 -657 106 284 -608 224
7026 224 169 23 -268 267 -705 -305 59 -732 -523 -208 -446 453 -193 115 200 200 -284 -109 494 -55 56
7047 56 681 -513 337 372 -135 -33 -87 868 388 -316 65 162 -280 443 180 200 -325 -84 424 -188 267
7068 267 152 -72 -437 92 327 -139 227 -488 -398 -446 87 347 233 209 172 -499 -438 -232 105 -362 -217 -49
7090 -49 519 139 -34 -280 332 207 -121 186 75 -118 -165 266 174 -78 126 477 -184 -21 -19 -305 196 147
7112 147 -484 -471 33 -293 38 76 50 149 -49 -115 -159 59 67 -194 -58 354 -312 131 253 -210 -118 -133 -10
7135 -10 -171 -136 -153 -61 93 -144 38 238 93 90 16 -196 54 -97 42 15 -409 -61 309 662 104 239 191
7158 191 -245 -102 -211 -687 144 374 -23 80 115 -225 -224 101 -171 -91 -91 436 163 307 3 92 -106 292
7180 292 246 265 -546 -189 348 -563 -532 76 -4 129 294 -139 45 -324 -32 -116 149 -267 -1 -88 48 188
7202 188 -177 -161 -80 -78 -287 139 819 168 81 70 -35 -53 -145 24 -165 -142 -49 -614 -356 -162 52 -86 -195
7225 -195 192 67 97 452 241 -168 107 -182 724 -61 -135 -28 60 245 -201 512 339 -112 94 4 -411
7246 -411 -414 294 110 463 525 235 -90 62 70 273 -12 -429 -74 0 -322 8 56 329 -72 -168 -183 151 258
7269 258 -261 -15 -197 9 232 167 -54 -354 -225 153 -215 189 -66 546 274 -152 272 29 -99 -148 14
7290 14 -100 -262 -282 -96 439 -130 -155 -45 -293 278 -81 354 -142 181 74 101 -167 28 418 153 276
7311 276 -171 158 149 64 17 28 -192 303 -240 97 381 93 58 141 100 524 66 -147 337 -600 -18 -150 -102
7334 -102 61 250 -247 52 88 326 -199 315 150 -125 -155 173 79 110 126 -179 56 437 10 342 48 -397
7356 -397 -83 81 -76 -275 149 118 -37 -150 78 -38 -93 -124 79 -40 -258 95 -108 25 -7 163 -28
7377 -28 23 -40 295 233 84 61 -2 67 -85 86 -27 235 -65 -69 -145 143 -110 39 119 -121 1 -175 -48 39
7401 39 121 125 129 298 -46 -50 108 70 -138 -49 114 92 -164 -162 -13 -60 166 178 154 223 -208 -168 -182 -40 192 9
7427 9 -222 158 18 45 -279 -137 75 52 -53 40 66 143 -162 -230 173 201 -109 -31 -39 2 203 -89 -118 -127 54
7452 54 -120 -127 245 -220 13 -15 -35 -22 -57 -119 247 47 38 -42 -28 -22 17 119 36 -91 -19 23 102 -63 -88 -180 131
7479 131 63 173 -38 -186 -147 37 61 196 -268 138 212 -147 -99 75 -242 -43 -10 -40 -54 -264 205 -147 55
7502 55 -57 -126 -189 227 123 80 27 10 192 -21 -187 -61 -5 -34 -154 193 129 -63 -13 139 78 -178 339 -121
7526 -121 4 -105 -57 -178 37 -15 69 -21 -68 198 121 -11 190 142 -188 160 -59 -129 -323 -38 66 199 -223
7549 -223 98 180 104 -17 60 80 -31 46 140 136 23 59 -275 233 238 -203 85 155 79 126 11 -172 40 12 41
7574 41 158 -71 227 154 -15 -13 -8 -171 166 -20 -228 -176 158 -70 158 -104 -8 154 -29 -43 -48 -17 -3 180
7598 180 141 -16 188 -59 -101 11 -276 -34 74 28 -37 -13 17 -86 -86 26 43 -22 -29 -51 83 24 118 133 117 94
7624 94 57 -82 -161 61 -30 52 97 57 126 311 40 -206 -95 198 -91 -232 -29 132 -24 81 98 46 -15 -75
7648 -75 293 134 -59 136 -256 96 -51 -63 69 -21 -174 -77 88 134 79 56 129 77 109 -40 171 164 -107 147
7672 147 238 76 -46 41 140 -229 -118 -20 105 -46 -154 -24 -164 -48 102 33 53 -3 -299 -78 113 -41
7694 -41 -115 -89 65 -284 -53 35 -28 -65 226 111 -22 -21 117 -170 -2 24 32 -146 -18 14 247 -184 -106 117
7718 117 -36 -30 12 204 172 -76 -143 121 -119 255 41 -31 260 53 -20 78 -63 150 43 37 -59 139 137 131 -103
7743 -103 89 -87 86 25 67 161 -30 -194 -78 -17 -214 9 -142 104 8 -19 155 -20 -54 -155 109 -21
7765 -21 81 -15 92 109 -82 100 67 -86 -142 11 52 46 55 -211 180 196 123 -45 -196 21 169 6 -27 4 -16
7790 -16 88 44 31 58 68 -37 133 -22 111 317 74 -141 -27 86 -14 -127 -26 -29 6 -141 11 131 -219
7813 -219 54 229 -47 30 121 60 15 -59 86 232 -20 3 -58 -109 200 69 -143 -68 -108 -77 129 -204 202 74
7837 74 -9 44 42 106 -184 4 -19 -156 114 176 93 -87 5 -11 -65 -22 -15 133 -200 58 -59 242 -212 160 18
7862 18 39 -47 -128 -209 271 -45 -154 -97 21 -167 -220 -47 -126 6 -7 -35 -146 38 30 77 -23 71 6 175 146
7887 146 152 1 124 -40 -213 -144 51 -18 7 46 -106 -97 -101 67 -215 -190 83 174 64 -98 186 136 146 42 -15
7912 -15 -31 -29 -24 -10 18 -175 -149 200 56 150 -134 -43 60 -68 -12 138 122 -147 49 -21 39 -162 -82 -141 -72 -74 250
7939 250 -157 -276 42 77 124 41 -63 -59 147 -91 -72 -46 -206 -42 -24 -61 -64 -121 148 6 45 44 165 205 81
7964 81 -7 7 17 199 -239 25 67 27 -152 -166 28 46 66 -139 -72 -59 1 -84 266 108 -95 -206 -11 -115
7988 -115 282 183 -58 -38 -231 -172 -21 -178 1 165 -60 93 0 -201 14 -36 74 -309 -14 -166 -155 -79
8010 -79 16 44 118 -60 58 -40 -250 -279 -97 -57 195 53 -503 -14 0 -43 -227 216 159 33 -158 -100 -12 -61
8034 -61 96 219 62 -129 137 -47 204 134 -72 18 -146 -302 -40 -76 -259 -80 -88 -51 -157 176 104 -43 48
8057 48 72 99 -175 -72 90 50 125 164 -159 15 377 124 -2 -122 -70 -17 -192 -20 -51 213 -116 28 107
8080 107 -115 47 27 -53 -38 191 35 53 -31 -200 56 -60 -146 -99 59 -214 104 -151 -52 -99 165 88 35 -51
8104 -51 90 80 -206 51 -80 -154 95 174 27 29 -73 -47 167 -191 -52 -117 62 -74 109 71 103 44 15 -115
8128 -115 72 -189 -85 -111 94 96 92 76 145 221 73 -145 168 -66 -58 135 5 -36 154 -52 -32 78 -77 -125
8152 -125 -266 32 -179 -106 65 -30 -123 32 -65 97 -114 -18 -111 280 -48 73 -299 -186 -9 127 -114 107
8174 107 299 -187 -168 4 -284 -34 159 101 -84 -238 191 -165 -25 -104 16 146 57
8191E7
##END NTUPLES=NMR FID
##END=
