##TITLE=1H_SR28_2
 CDCl3, 8 sc, 
 23.12.2020
##JCAMPDX= 6.0         $$ Bruker NMR JCAMP-DX V2.0
##DATA TYPE= NMR FID
##DATA CLASS= NTUPLES
##ORIGIN= UXNMR, Bruker Analytische Messtechnik GmbH
##OWNER= root
$$ XWIN-NMR		Version 3.5
$$ Wed Dec 23 12:42:24 2020 Russian Standard Time (UT+4h)  she@DPX200
##.OBSERVE FREQUENCY= 200.1315066352
##.OBSERVE NUCLEUS= ^1H
##.DELAY= (6, 6)
##.ACQUISITION MODE= SIMULTANEOUS
##.ACQUISITION SCHEME= undefined
##.AVERAGES= 8
##.DIGITISER RES= 18
##SPECTROMETER/DATA SYSTEM= spect
##.PULSE SEQUENCE= zg30
##.SOLVENT NAME= CDCl3
##.SHIFT REFERENCE= (INTERNAL, CDCl3, 0, 15.7039)
##AUDIT TRAIL= $$ (NUMBER, WHEN, WHO, WHERE, WHAT)
$$ ##TITLE= Audit trail, XWIN-NMR		Version 3.5
$$ ##JCAMPDX= 5.01
$$ ##ORIGIN= Bruker BioSpin GmbH
$$ ##OWNER= she
$$ F:/spectra/data/she/nmr/H-F/1/audita.txt
$$ ##AUDIT TRAIL=  $$ (NUMBER, WHEN, WHO, WHERE, WHAT)
(   1,<2020-12-23 12:41:12.75 +0400>,<she>,<DPX200>,
      <created by zg, POWCHK disabled, PULCHK disabled
       configuration hash MD5:
       00 E9 B6 7A A2 85 ED C7 34 08 36 98 17 FE 4E 26
       data hash MD5: 16K
       9A 5C 2B 09 BF AA C9 F9 BE 8D C5 F7 13 5F B4 32>)
$$ ##END=
$$ 
$$ hash MD5
$$ 27 23 6D 64 63 B7 CA 82 A8 62 19 67 10 2B 6E 2C
##$RELAX= 
##$RELAX= 
##$RELAX= 
##$RELAX= 
##$RELAX= 
##$RELAX= 
$$ Bruker specific parameters
$$ --------------------------
##$DU= <F:/spectra>
##$EXPNO= 1
##$NAME= <H-F>
##$PROCNO= 1
##$TYPE= <nmr>
##$USER= <she>
##$AMP= (0..31)
100 100 100 100 100 100 100 100 100 100 100 100 100 100 100 100 100 100 
100 100 100 100 100 100 100 100 100 100 100 100 100 100 
##$AQSEQ= 0
##$AQ_mod= 1
##$AUNM= <au_zg>
##$AUTOPOS= <>
##$BF1= 200.13
##$BF2= 200.13
##$BF3= 200.13
##$BF4= 200.13
##$BF5= 200.13
##$BF6= 200.13
##$BF7= 200.13
##$BF8= 200.13
##$BYTORDA= 1
##$CFDGTYP= 0
##$CFRGTYP= 5
##$CHEMSTR= <none>
##$CNST= (0..31)
1 1 145 1 1 1 1 1 1 1 1 1 1 1 1 1 1 1 1 1 1 1 1 1 1 1 1 1 1 1 1 1 
##$CPDPRG= <>
##$CPDPRG1= <>
##$CPDPRG2= <>
##$CPDPRG3= <>
##$CPDPRG4= <mlev>
##$CPDPRG5= <mlev>
##$CPDPRG6= <mlev>
##$CPDPRG7= <mlev>
##$CPDPRG8= <mlev>
##$CPDPRGB= <>
##$CPDPRGT= <>
##$D= (0..31)
0 1.2 0 0 0 0 0 0 0 0.06 0 0.03 0 0 0 0 0.0002 0 0 0 0 0 0 0 0 0 0 0 0 
0 0 0 
##$DATE= 1608712872
##$DBL= (0..7)
120 120 120 120 120 120 120 120 
##$DBP= (0..7)
150 150 150 150 150 150 150 150 
##$DBP07= 0
##$DBPNAM0= <>
##$DBPNAM1= <>
##$DBPNAM2= <>
##$DBPNAM3= <>
##$DBPNAM4= <>
##$DBPNAM5= <>
##$DBPNAM6= <>
##$DBPNAM7= <>
##$DBPOAL= (0..7)
0.5 0.5 0.5 0.5 0.5 0.5 0.5 0.5 
##$DBPOFFS= (0..7)
0 0 0 0 0 0 0 0 
##$DE= 6
##$DECBNUC= <off>
##$DECIM= 32
##$DECNUC= <off>
##$DECSTAT= 4
##$DIGMOD= 1
##$DIGTYP= 9
##$DL= (0..7)
0 120 120 120 120 120 120 120 
##$DP= (0..7)
150 150 150 150 150 150 150 150 
##$DP07= 0
##$DPNAME0= <>
##$DPNAME1= <>
##$DPNAME2= <>
##$DPNAME3= <>
##$DPNAME4= <>
##$DPNAME5= <>
##$DPNAME6= <>
##$DPNAME7= <>
##$DPOAL= (0..7)
0.5 0.5 0.5 0.5 0.5 0.5 0.5 0.5 
##$DPOFFS= (0..7)
0 0 0 0 0 0 0 0 
##$DQDMODE= 0
##$DR= 18
##$DS= 0
##$DSLIST= <SSSSSSSSSSSSSSS>
$$ [...]
##$SUBNAM2= <"">
##$SUBNAM3= <"">
##$SUBNAM4= <"">
##$SUBNAM5= <"">
##$SUBNAM6= <"">
##$SUBNAM7= <"">
##$SUBNAM8= <"">
##$SUBNAM9= <"">
##$SW= 16.9725356469052
##$SWIBOX= (0..15)
0 0 2 0 0 0 0 0 0 0 0 0 0 0 0 0 
##$SW_h= 3396.73913043478
##$TD= 16384
##$TD0= 1
##$TE= 0
##$TE2= 300
##$TE3= 300
##$TEG= 300
##$TL= (0..7)
0 120 120 120 120 120 120 120 
##$TP= (0..7)
150 150 150 150 150 150 150 150 
##$TP07= 0
##$TPNAME0= <>
##$TPNAME1= <>
##$TPNAME2= <>
##$TPNAME3= <>
##$TPNAME4= <>
##$TPNAME5= <>
##$TPNAME6= <>
##$TPNAME7= <>
##$TPOAL= (0..7)
0.5 0.5 0.5 0.5 0.5 0.5 0.5 0.5 
##$TPOFFS= (0..7)
0 0 0 0 0 0 0 0 
##$TUNHIN= 0
##$TUNHOUT= 0
##$TUNXOUT= 0
##$USERA1= <user>
##$USERA2= <user>
##$USERA3= <user>
##$USERA4= <user>
##$USERA5= <user>
##$V9= 5
##$VALIST= <valist>
##$VCLIST= <CCCCCCCCCCCCCCC>
##$VD= 0
##$VDLIST= <DDDDDDDDDDDDDDD>
##$VPLIST= <PPPPPPPPPPPPPPP>
##$VTLIST= <TTTTTTTTTTTTTTT>
##$WBST= 1024
##$WBSW= 4
##$XGAIN= (0..3)
0 0 0 0 
##$XL= 0
##$YL= 0
##$YMAX_a= 324141
##$YMIN_a= -365969
##$ZGOPTNS= <>
##$ZL1= 120
##$ZL2= 120
##$ZL3= 120
##$ZL4= 120
##$ABSF1= 10
##$ABSF2= 0
##$ABSG= 5
##$ABSL= 3
##$ALPHA= 0
##$AQORDER= 0
##$ASSFAC= 0
##$ASSFACI= 0
##$ASSFACX= 0
##$ASSWID= 0
##$AUNMP= <proc_1d>
##$AZFE= 0.1
##$AZFW= 0.1
##$BCFW= 1
##$BC_mod= 2
##$BYTORDP= 1
##$COROFFS= 0
##$CY= 11.3945322036743
##$DATMOD= 1
##$DC= 2
##$DFILT= <>
##$DTYPP= 0
##$F1P= 15.9154993809931
##$F2P= -4.1035820241983
##$FCOR= 0.5
##$FTSIZE= 0
##$FT_mod= 4
##$GAMMA= 1
##$GB= 0.15
##$INTBC= 1
##$INTSCL= 1
##$ISEN= 128
##$LB= 0.24
##$LEV0= 0
##$LPBIN= 0
##$MAXI= 10000
##$MC2= 0
##$MEAN= 0
##$ME_mod= 0
##$MI= 1.114404
##$NCOEF= 0
##$NC_proc= 0
##$NLEV= 6
##$NOISF1= 3.799351
##$NOISF2= 2.8
##$NSP= 1
##$NTH_PI= 0
##$NZP= 0
##$OFFSET= 15.70392
##$PC= 1
##$PHC0= -10761.93
##$PHC1= 13.20095
##$PH_mod= 1
##$PKNL= yes
##$PPARMOD= 0
##$PSCAL= 0
##$PSIGN= 0
##$REVERSE= no
##$SF= 200.130013532006
##$SI= 16384
##$SIGF1= 3
##$SIGF2= 2
##$SINO= 400
##$SIOLD= 16384
##$SREGLST= <1H.CDCl3>
##$SSB= 0
##$STSI= 0
##$STSR= 0
##$SW_p= 3612.71676300578
##$SYMM= 0
##$S_DEV= 0
##$TDeff= 0
##$TDoff= 0
##$TI= <>
##$TILT= no
##$TM1= 0
##$TM2= 0
##$TOPLEV= 0
##$USERP1= <user>
##$USERP2= <user>
##$USERP3= <user>
##$USERP4= <user>
##$USERP5= <user>
##$WDW= 1
##$XDIM= 8192
##$YMAX_p= 0
##$YMIN_p= 0
$$ End of Bruker specific parameters
$$ ---------------------------------
##NTUPLES= NMR FID
##VAR_NAME=  TIME,          FID/REAL,        FID/IMAG
##SYMBOL=    X,             R,               I
##VAR_TYPE=  INDEPENDENT,   DEPENDENT,       DEPENDENT
##VAR_FORM=  AFFN,          ASDF,            ASDF
##VAR_DIM=   8192,          8192,            8192
##UNITS=     SECONDS,       ARBITRARY UNITS, ARBITRARY UNITS
##FACTOR=    0.0002944,     1,               1
##FIRST=     0,             0,               0
##LAST=      2.4114304,     0,               0
##MIN=       0,             -365969,         0
##MAX=       2.4114304,     324141,          0
$$ Real data points
##PAGE= N=1
##DATA TABLE= (X++(R..R)), XYDATA
0 0 0 0 0 0 0 0 0 0 -8 8 -8 8 -8 16 -16 24 -32 32 -40 49 -64 72 -88 103 -120 136 -160 184 -212 242 -276
31 -276 312 -356 401 -452 507 -569 634 -707 787 -875 970 -1076 1189 -1314 1449 -1597 1760
48 1760 -1936 2133 -2349 2589 -2855 3151 -3485 3863 -4297 4798 -5383 6082 -6924 7972
62 7972 -9310 11076 -13515 17110 -22893 33612 -59615 238380 169326 -365969 281050 -121389
74 -121389 -76490 199105 -220525 64313 30386 -105981 176848 -53492 26711 11751 -54550
85 -54550 116826 -59949 6650 12424 -86962 101530 -6995 14676 -54363 -103880 152842
96 152842 -31665 -38940 30453 -67059 154139 -6516 -35540 23187 -149546 144440 -6175
107 -6175 -135635 98655 -133272 114080 87825 -216889 144185 -54100 -42896 169824 -174868
118 -174868 64438 37500 -105422 166228 -132872 -48834 104064 -139493 73157 2039
128 2039 -61052 81623 -51987 60868 24160 -56254 29895 -60840 53115 8712 -67825
139 -67825 59799 -57418 32294 51693 -89488 24812 -20911 37789 61659 -69475 52582
150 52582 -6896 10811 54335 -107148 34708 -7649 -32874 96009 -96393 24746 61977
161 61977 -68930 97995 -55231 -28029 98257 -88966 59834 16127 -79135 87611 -59072
172 -59072 -6742 42588 -86179 48307 -9633 -14364 68759 -44929 24847 7707 -26230 38506
184 38506 -53136 -6837 11986 -18119 34325 -37805 -5984 12295 -21098 32098 -36390 573
196 573 33291 -19697 39579 -28440 -20575 34920 -47066 17949 -16911 -36830 50799 -33284 16399
209 16399 23901 -40515 54503 -20181 -15600 40487 -48830 28870 8731 -33261 43846 -30855
221 -30855 -6995 18030 -31729 28321 -3177 -1361 33166 -8346 26730 -6556 -19294 21839
233 21839 -22889 8065 3066 -22813 26307 -2079 -973 6459 -11771 16871 -2087 5662 6478
246 6478 -11541 24757 -8664 -8570 10619 -26999 7620 -4448 -21946 17589 -6845 7286 13613
259 13613 -11375 14814 -8928 -6989 4096 -20720 12686 -3900 -14609 15098 -19712 -2527
271 -2527 6189 -22659 9543 6736 -2876 11563 -1300 1284 -2020 -3239 -6111 -14756 5709 -4046
285 -4046 -9157 12526 -4383 2505 12961 -5899 1948 4640 903 1701 63 6634 254 701 2060
300 2060 -10622 -1243 1632 -3756 6766 7581 9062 9660 3369 2641 -3118 -1580 1067 -5239 1054
315 1054 4715 -149 -93 -267 -315 -2055 1836 4095 -2818 6302 8342 -4624 2185 1368 -9747 -2279
331 -2279 -3518 -12082 -628 2930 -4185 3511 5963 -2091 -492 -636 -5817 -5141 611 294 -5321 447
347 447 1157 -8863 -4327 -3258 -8418 3130 4889 -1062 6487 4316 -720 277 -4934 -4976 -2933 -1237
363 -1237 1671 -3172 655 6656 -2452 2058 5751 -5745 4074 7946 -3121 6802 4667 -3768 6676
378 6676 -769 -6926 1673 -4970 646 10139 594 6538 5928 -1714 9274 -3627 -7787 6438 -5784
393 -5784 5367 8730 -12055 4335 548 -6998 8563 -10318 -2135 12561 -4086 9520 -2039
406 -2039 -11748 9952 -8294 -4313 782 -18051 7596 4283 -8622 8063 -8993 -2627 11272
419 11272 -9030 -2818 -618 -7500 9888 3582 -10195 -1321 -4758 -5103 6164 -7892 -10567 12843
433 12843 1263 5060 9074 -20136 5857 7796 -11764 12280 -15144 -5007 23460 -12283 9408
446 9408 -2558 -19292 29141 -5799 -3604 15466 -23114 22365 13154 -19184 15254 -18049 1194
459 1194 23702 -23854 8169 472 -8484 30920 -8416 -11652 10081 -9652 9690 7096 -14455
472 -14455 -2073 8609 2328 -262 -3595 -16361 3682 12868 -6751 5515 -10754 -3738 24059
485 24059 -17304 367 -2520 -26841 33284 -8347 -20272 20185 -30121 18979 17178 -35173
497 -35173 19090 -16590 -87 33283 -36905 10674 2809 -21223 39361 -25275 -17524 21723
509 21723 -22301 22428 5288 -25527 15989 -2366 7154 7698 -19788 2284 4584 8312 5932
522 5932 -9482 -6176 2951 16981 -5824 -5049 3579 -11805 30588 1669 -22234 20545 -19666
535 -19666 14941 22675 -39127 18453 -5685 -5465 39726 -39500 5597 17149 -27042 43508 -21332
548 -21332 -24958 34744 -24544 22026 4712 -39007 25984 -9094 2550 12823 -34557 14641
560 14641 4604 -2117 14897 -28188 794 9921 -2428 6396 -19144 -1650 5377 4178 5897
573 5897 -22561 2453 2791 3525 14104 -27848 5488 7310 -7433 25323 -30164 -4134 21970
586 21970 -22474 28765 -15886 -24936 39307 -19865 14194 8758 -38510 35021 -4124 -5730 21479
599 21479 -36235 19887 12978 -15674 20529 -26811 6123 21930 -15526 17142 -16153 -3039
611 -3039 25364 -13710 9069 -8319 -9519 22658 -7874 2760 -5591 -9171 17904 -4266 3695
624 3695 -7215 -8104 18251 -9687 6310 -5078 -16783 24553 -12379 1425 5227 -28909 26698
637 26698 -5286 -12944 20536 -31046 16336 11855 -27386 23746 -21863 -3450 27360 -29601
649 -29601 12166 -3312 -16898 27779 -17886 -626 8521 -17699 20236 -5160 -8358 8526
661 8526 -11095 12661 -1025 -6664 5630 -8850 10733 -1371 -3913 7813 -10466 13969 562
674 562 -7622 11478 -13044 11514 5349 -12874 16823 -12508 4395 14227 -19222 15901 -5105
687 -5105 -6273 22227 -19943 8098 6833 -16475 21659 -10472 -5022 14065 -16480 12102 -192
700 -192 -11268 12733 -9339 4509 3270 -10595 8497 -7101 1017 3531 -9263 6717 -6166
713 -6166 745 3111 -11103 8308 -6779 -2365 9283 -13364 6520 -464 -8985 10439 -9524
726 -9524 1068 3301 -8329 9278 -7909 -523 6719 -11316 9597 -2413 -6412 10723 -8760
739 -8760 3402 3752 -6572 8379 -4364 1947 4367 -7426 8778 -2759 -1305 8250 -6212
752 -6212 4847 1565 -2978 6212 -4521 4470 1510 -3678 8730 -5337 1488 5661 -6826 6308
766 6308 -331 -2724 5272 -4151 3102 -747 -2272 5513 -5697 2219 1901 -5942 4972 -2468 -1739
781 -1739 2800 -3993 1832 -2300 -1377 1709 -5659 2695 -1070 -4073 3758 -3990 -692 848 -3883
796 -3883 1613 -2676 -640 641 -3995 2421 -1670 -2116 2781 -3378 288 1466 -2163 1081 -219
811 -219 594 -124 -200 2305 -2569 1268 1355 -2010 2880 -380 493 3162 -960 2154 483 -409 2776
828 2776 -813 2141 1067 -1200 3995 -614 -395 3276 -1908 1516 2321 -977 2137 131 -252 2897
844 2897 -1373 -372 848 -1187 983 131 -1703 892 -490 -632 1880 -2865 -1704 2759 -2699 322
860 322 455 -4021 1642 -503 -3044 1238 -4508 -1392 2933 -3158 546 -1006 -2702 2986 -2081 -1356
876 -1356 529 -4757 2900 1395 -4046 1831 -2154 -343 4247 -4404 -33 2069 -2644 5516 716
891 716 -4777 4036 -355 863 3715 -5880 1074 4501 -1933 4870 -1265 -3676 7100 158 284
906 284 2681 -5521 5471 4953 -4311 3827 -3376 -2010 9043 -3668 -1672 2417 -4393 8194 1706
921 1706 -7325 4207 -3010 1401 6911 -9703 -85 2773 -3869 8532 -5873 -8545 7457 -3495
935 -3495 1809 2499 -11521 4708 4071 -3911 3709 -9058 -3282 8824 -4529 -936 -1775 -7118 8315
950 8315 2616 -6274 569 -5097 1806 8638 -7195 -3084 1693 -2681 9099 -1726 -10524 5189
964 5189 -1483 3419 7103 -12155 2264 7384 -2670 8341 -8071 -5889 11787 -3280 5081
977 5081 -833 -11475 13453 1486 -2883 6046 -12648 6185 11295 -7319 5003 -4767 -3521
990 -3521 14093 -4172 -4413 641 -5387 8803 4097 -8199 201 -243 2359 7252 -6320 -7005 4140
1005 4140 166 3322 462 -11874 3224 4073 -3850 5384 -11263 -3532 13180 -7546 3438 -1353
1019 -1353 -13715 15202 -1938 -7173 6607 -14994 7681 9129 -13321 6959 -7780 -1900 16142
1032 16142 -11855 426 1845 -7473 15039 -2727 -8996 5770 -5211 6155 4867 -10131 1155
1045 1155 2812 1863 5782 -2975 -5390 4934 4337 -700 2278 -6030 -641 11129 -4349 1244 421
1060 421 -9174 13844 -423 -6773 8486 -10519 7890 9494 -14048 7732 -5363 -2598 15360
1073 15360 -13935 747 3536 -8812 15058 -7017 -8050 8852 -8717 8155 1507 -12588
1085 -12588 7225 -3038 492 5468 -11013 686 1926 -1670 3297 -4669 -3258 2509 2568 -1648
1099 -1648 -2322 -1540 -3517 6658 -747 -6686 5082 -6768 3658 6558 -12828 6931 -1112 -3891
1113 -3891 13603 -11822 841 7630 -9753 12644 -4695 -7890 12549 -8397 6044 3994 -11638
1126 -11638 10963 -1985 -765 8069 -10080 5346 2928 -3906 6750 -6006 902 4628 -2914
1139 -2914 3682 -2877 -425 3344 56 2002 -3335 1386 508 -811 4277 -6471 1812 1989 -5031
1154 -5031 7417 -6944 -1993 7963 -9168 5948 -673 -8260 9869 -7236 55 5048 -10922
1167 -10922 7326 -1998 -5111 7191 -8852 2398 3221 -6833 5972 -4687 -554 4570 -5806
1180 -5806 4146 -2760 -1444 3664 -4579 3504 -1881 -1875 4782 -4473 2791 461 -3527 6290 -3981
1195 -3981 1667 2361 -4381 6280 -1845 73 3597 -4715 5490 -1686 -1063 5521 -5918 5294
1209 5294 271 -4497 7255 -4726 2033 4362 -5049 5636 -1958 -1061 4402 -5194 3834 -770
1223 -770 -2669 5492 -5453 1861 1063 -4514 5471 -3366 -702 2636 -5170 2423 -1495 -1856 3492
1238 3492 -4789 2514 -822 -3087 2542 -4489 277 404 -4091 3606 -2526 -229 1145 -4732 3912
1253 3912 -1621 -536 2936 -4301 3040 -1279 -3412 4097 -3934 2393 2113 -3223 5006 -2161 -1272
1268 -1272 2918 -3960 2579 116 -1007 2569 -2699 2602 1535 -1604 3292 -1471 818 2610 -2054
1283 -2054 2689 -29 -112 2695 -1814 2374 -18 -671 2116 -2303 2348 28 -1817 2864 -2539 1219
1299 1219 865 -2930 1683 -1525 473 1119 -3002 1245 -945 -1836 2420 -3444 1584 459 -3715 2711
1315 2711 -2321 -583 993 -2413 1251 -509 -2528 1680 -695 110 451 -1904 162 28 -1165 40
1331 40 -295 -609 -388 1888 -931 -231 444 -378 1634 225 -487 1499 -768 1915 922 -2199 2937
1348 2937 -35 450 3301 -4086 1711 1730 -2135 3596 -1060 -1180 4079 -1251 656 1577 -2817 2800
1364 2800 1046 -619 1657 -2361 965 2015 -1698 644 -438 -899 3287 -1061 -1474 1826 -2844
1379 -2844 1758 1983 -4070 1108 344 -2630 2867 -2840 -4014 3301 -2016 688 1286 -4746 2140 1401
1395 1401 -1902 2130 -4122 -417 3373 -3748 1280 -1760 -4208 6095 -1283 -1122 2028 -5018 2679
1410 2679 3634 -4567 2344 -833 -2227 6475 -2124 -2531 3016 -1795 3925 2389 -5240 2793 651
1425 651 592 4926 -4236 -1303 4213 -2018 3887 -992 -5404 6487 -328 -621 4438 -6634 2297
1440 2297 5662 -3867 2202 -1959 -3774 8126 -1896 -2720 2009 -5369 4317 2572 -5948 1562 -2851
1455 -2851 148 7034 -6031 -1917 2262 -3499 6521 -2076 -7578 3941 -2112 685 3786 -8864
1469 -8864 601 4085 -3215 3477 -4263 -4419 6672 -1371 -1302 687 -7321 3866 4754 -4942 2461
1484 2461 -3627 -792 7952 -4894 -2146 2369 -4540 7060 1745 -7167 4553 -1604 672 6941
1498 6941 -7957 515 4166 -2988 6995 -3621 -5574 7660 -2404 2716 2716 -8608 5883 2779
1512 2779 -2965 4364 -5719 -1107 7491 -3245 935 -137 -4942 6462 1256 -4373 1964 -2788
1526 -2788 1010 5249 -5080 -1383 1674 -2862 5257 -110 -7226 3822 -1265 -498 4195 -8042
1540 -8042 1075 4416 -3904 4234 -4761 -5081 7105 -3973 1029 1230 -8010 6048 799 -4077 4493
1555 4493 -6180 1248 5961 -5443 1993 -1176 -2611 6479 -1883 -1866 1329 -2631 3340 2127 -3098
1570 -3098 951 485 896 2633 -1189 -2348 2012 1200 603 2251 -3309 1161 4020 -2256 2615 -2034
1586 -2034 -2706 6628 -2440 582 2136 -5652 5466 648 -4082 4177 -4208 1601 3961 -5135 2625
1601 2625 -1714 -1427 5110 -4701 93 512 -3666 4721 -2223 -2607 2371 -3055 1600 544 -3202 518
1617 518 -634 565 368 -1447 -718 -591 1117 -1433 -598 -254 -2137 3030 -865 -2004 2057 -3037
1633 -3037 2300 1539 -3818 3552 -1884 64 3549 -4595 2601 294 -2298 4837 -3026 352 2617
1648 2617 -2868 4140 -1345 -1177 3623 -2717 2499 142 -2340 3586 -1630 1428 1523 -2839 2865 -950
1664 -950 51 1931 -1977 2045 -109 -375 1299 -2198 1570 -491 -462 2350 -2850 1419 -79 -2064
1680 -2064 2747 -2878 589 1163 -3578 2540 -2106 -1324 2363 -3748 1948 -312 -2456 2501 -3124
1695 -3124 409 621 -2983 2742 -1908 -433 1754 -3293 2030 -995 -1476 2536 -2929 1544 532
1710 532 -2058 2460 -1855 732 1661 -2216 2282 -990 -283 2017 -2118 2432 -13 -586 2562 -2106
1726 -2106 2001 379 -1016 2926 -1631 1301 1818 -2052 2886 -910 -178 2557 -2162 2304 194
1741 194 -1536 2575 -2177 1011 1057 -2055 2244 -1292 -288 1024 -2384 1784 -565 -990 1560 -2172
1757 -2172 680 -291 -1181 1228 -2008 406 329 -2072 1373 -1798 -451 678 -2257 1235 -1070 -813
1773 -813 1013 -1910 1095 -699 -1059 1812 -2002 799 223 -1900 2204 -1330 -348 1366 -2040 1823
1789 1823 -146 -894 2176 -1704 1357 1301 -1473 2048 -722 -265 1681 -1027 1044 430 -353 1613
1805 1613 -397 477 615 -255 1222 197 -52 431 226 455 89 131 -621 191 1314 -1213 820 -325
1823 -325 -971 2037 -1282 -339 583 -2103 1997 -679 -1806 1500 -2440 755 1273 -3262 1140 -885
1839 -885 -1369 2303 -2471 -641 1023 -1749 1388 -806 -2004 1398 -728 73 616 -2746 307 1123
1855 1123 -1372 930 -881 -1511 2283 -380 -1095 1047 -1845 1287 2338 -1753 888 19 -1072 3716
1871 3716 -1596 -1076 2440 -1823 2643 1144 -3333 2638 31 -76 3699 -3143 269 2518 -1683
1886 -1683 2698 -932 -2522 3475 -663 225 1293 -3622 1674 1988 -2132 1560 -1748 -1183 3777 -1802
1902 -1802 -904 977 -3084 2694 1048 -3684 1688 -1623 -629 3597 -3762 -1173 1669 -2983 2769
1917 2769 -1101 -4171 3006 -1185 325 2250 -4908 793 2027 -2188 2712 -2751 -2283 4491 -1461
1932 -1461 95 523 -4128 3338 1349 -2336 1980 -2701 243 4689 -2871 -161 938 -2172 4719
1947 4719 238 -3555 2528 -1284 1541 3700 -4170 554 2062 -1397 4095 -1807 -2739 4356 -969
1962 -969 1484 1382 -5322 2594 1970 -2008 2880 -3641 -930 4841 -2682 146 138 -3862 4684 403
1978 403 -2782 1697 -3245 1149 3351 -4487 64 -177 -1669 4150 -2449 -2812 2172 -1831 1850 1120
1994 1120 -5012 1041 639 -932 2382 -3423 -1752 3057 -1248 803 -438 -3716 3182 1438 -1514
2009 -1514 1640 -3044 559 3864 -2690 513 -12 -1844 4752 -562 -2077 2277 -2271 2329 2558
2024 2558 -3533 2168 467 -377 3801 -2585 -729 2379 -1305 2627 -71 -2822 2608 -61 646
2039 646 1626 -2614 1071 1451 -591 1236 -1708 -1005 2565 -672 -199 -95 -2021 1161 1143 -1717 217
2056 217 -375 -516 2095 -1327 -1850 771 -1619 1057 447 -3416 1395 -327 -888 2256 -3109 -179
2072 -179 1952 -2161 1982 -887 -2326 2610 -1935 104 681 -3066 1900 306 -1119 1948 -1640
2087 -1640 1077 1909 -1487 895 -828 -650 2316 -207 -6 799 -746 763 887 -252 44 789 603
2104 603 1243 730 -972 1033 855 -952 1657 -830 -326 1716 -1049 1501 135 -1664 2775 -1288
2120 -1288 534 1298 -2249 2243 -570 -1699 2393 -2280 547 820 -2410 1096 -444 -373 1552 -1861
2136 -1861 395 252 -1136 996 -1658 -849 306 -526 39 -359 -765 396 -425 594 -976 486 131
2153 131 -666 1748 -1153 -175 1077 -1217 1458 -282 -1109 2017 -1360 1050 718 -1564 1479 -727
2169 -727 -75 1537 -1351 1072 25 24 2173 -1020 1375 633 -1296 1613 -887 529 2047 -925
2185 -925 1644 7 -1162 1675 -1392 440 457 -602 1325 -877 466 -1 -902 786 -1233 -343
2201 -343 732 -686 1378 -489 -618 659 -2005 659 -441 -1422 1246 -813 392 -225 -1091 997
2217 997 -1308 -270 1352 -1491 983 -43 -753 913 -1878 565 10 -1504 1540 -644 -117 1213
2233 1213 -1172 985 59 -527 700 -255 463 23 -336 1155 -501 1155 546 -424 1702 -717 622
2250 622 872 -794 794 -680 198 456 -1166 1511 -125 -163 1426 -1198 1072 622 -858 1666 -986
2267 -986 111 936 -1101 1092 -668 -857 1505 -1296 200 606 -1423 641 -328 -559 440 -822 6
2284 6 -165 -829 58 -1172 44 -58 -663 104 -581 -238 -100 364 -546 -1161 678 -811 -248 837 -1887
2303 -1887 584 69 -1295 1270 -1276 28 1562 -1183 1284 178 -1140 2098 -717 -28 814 -1675
2319 -1675 1427 940 -853 1471 -893 662 1566 -1207 780 199 -483 2185 -333 -753 781 -507
2335 -507 683 718 -1100 31 959 -151 910 -43 -1061 1007 69 -154 631 -1757 597 1248 -1509
2352 -1509 781 -1364 -1225 2257 -1401 -232 461 -2315 2242 239 -2124 1032 -2089 125 1426
2367 1426 -2415 323 -84 -1186 2069 -1369 -1456 900 -1383 918 474 -2506 808 568 -492 1444
2383 1444 -1850 -965 2036 -686 703 654 -1770 2483 930 -1241 1299 -1762 318 2540 -2031 674
2399 674 305 -1167 3088 -445 -1730 1573 -1279 1530 1555 -2423 1317 168 -219 2762 -1934 -962
2415 -962 1724 -1142 1668 446 -2503 1943 -22 -717 1319 -2567 90 2258 -1550 737 -422
2430 -422 -1581 2514 -626 -1590 880 -2524 1322 1454 -2626 910 -719 -890 2384 -1795 -1669 1625
2446 1625 -1693 1980 475 -3616 1219 -402 425 1636 -3157 -382 2118 -1585 2054 -1351 -2677
2461 -2677 2624 -771 -848 534 -2178 1468 1650 -1145 1355 -611 -716 3011 -925 -262 878 -1417
2477 -1417 2695 762 -2008 1344 -517 391 2700 -2173 -150 1713 -814 2106 -467 -2411 1923
2492 1923 -358 94 1158 -2851 1086 1461 -1520 1632 -1730 -1217 2555 -1508 50 335 -2371 1713
2508 1713 425 -1694 692 -1540 -6 1306 -2210 -194 -139 -1213 2167 -789 -1768 923 -929 464
2524 464 957 -2424 86 699 -1279 1423 -1152 -1268 1791 -687 595 334 -2472 1190 1371 -1015
2540 -1015 1027 -1391 -796 2689 -1266 811 786 -782 2302 -37 -1184 1479 -842 852 1375 -2054
2556 -2054 919 181 -644 2014 -761 -869 1043 -920 620 336 -860 1069 -15 -324 633 -909
2572 -909 -522 595 -561 60 -581 -999 386 48 -852 701 -810 -136 1487 -738 -462 4 -964 539
2590 539 -103 -1193 636 -1316 -62 471 -1242 941 282 -792 1067 -1321 -153 959 -830 476
2606 476 134 -775 868 -206 -167 662 -702 591 352 -15 550 354 196 48 116 144 -23 255 -185 597
2626 597 569 -17 624 116 227 674 -736 395 438 -274 736 -201 143 638 -691 601 -457 -90 1107
2645 1107 -562 432 160 -481 632 -447 -51 189 -637 807 -142 -426 400 -993 106 -81 -526 555
2663 555 -688 250 146 -949 386 -641 -394 267 -614 223 -476 -319 353 -589 88 -74 -291 702 -591
2682 -591 277 -17 -353 754 -363 -324 235 -510 692 -254 -57 1009 -577 813 326 -408 1009 -436
2700 -436 240 756 -583 855 -12 -88 643 -382 669 244 -216 920 -131 324 370 -397 502 -316 -175
2719 -175 173 -425 287 -189 102 189 -346 436 -382 -532 143 -918 298 -315 -781 754 -962 -136 31
2738 31 -1131 414 -903 -234 457 -899 589 312 -820 882 -723 -9 329 -969 441 -174 -376
2755 -376 1058 -522 108 299 -383 623 -13 -251 417 -162 503 23 -460 66 284 585 -10 478 198
2774 198 215 766 58 425 111 -338 1065 -231 -12 1107 -1037 763 345 -732 1023 -450 219 1345
2792 1345 -1301 386 -56 -708 1214 -1122 -460 952 -1079 881 -111 -1102 1043 -557 -158 609 -1017
2809 -1017 161 453 -521 131 -370 -928 694 -349 -818 -194 -765 -58 1231 -737 -189 171 -770 1222
2827 1222 -330 -1149 1005 -704 253 744 -1940 1121 434 -685 1537 -1224 37 1409 -905 1434
2843 1434 -196 -1398 1872 -279 49 979 -1648 1049 1270 -874 1290 -998 -296 1623 -728 -100
2859 -100 404 -570 1322 347 -884 584 472 547 1474 -1250 -418 991 -1746 1939 343 -1775 1449
2876 1449 -643 -271 1511 -2764 -504 1335 -1913 222 -1054 -1990 1652 -1711 -216 906 -2610
2891 -2610 1430 111 -1500 1179 -1460 -433 1622 -1818 -792 79 -1551 1743 31 -1797 1384
2906 1384 -415 160 1454 -1714 508 1600 -1225 912 -415 -1315 2504 -45 114 237 -1822 708
2922 708 1457 -1468 723 -343 -84 2497 -971 381 420 -1680 2094 436 -1122 1328 -740 720
2938 720 1927 -1727 359 182 -1135 1632 -642 -1250 1361 -1257 602 790 -1944 893 422 -196
2954 -196 851 -1032 -613 1837 -960 36 -394 -1902 900 333 -1128 1208 -1212 -31 988 -1205
2970 -1205 -36 251 -1112 1498 -335 -1285 1088 -1153 502 1333 -2173 367 545 -354 1415 -891
2986 -891 -598 1338 -656 571 32 -1700 1360 514 -600 1173 -957 271 1102 -1139 305 142
3002 142 -567 1040 -348 -780 104 -596 687 974 -1017 763 302 -548 1632 -565 -772 1133 -816
3019 -816 281 -44 -1198 608 -677 -899 1063 -824 -435 834 -846 383 -581 -744 1375 -152
3035 -152 -1001 325 -1083 73 148 -917 109 -388 -649 691 -1048 -356 330 -451 401 90 -1300 535
3053 535 80 62 533 -627 -161 347 -396 543 213 -593 1010 277 284 422 -495 25 750 -452 269 519
3073 519 -79 787 -249 8 864 -180 685 313 -568 -37 -251 -65 686 -238 63 79 95 -1 236 -233
3093 -233 360 7 -269 366 -162 -53 274 -298 164 159 -269 493 -71 -159 299 -87 -749 500 -504 -165
3113 -165 -968 -437 -273 -224 212 208 -472 -147 -332 -279 -432 -944 -534 555 -114 -672 72 -33 -145 -324 186
3134 186 -34 -339 29 285 -433 364 -21 42 -39 163 220 316 127 502 451 375 314 81 111 127 349 438 138
3157 138 651 -795 390 -96 651 -58 -542 247 -603 -624 457 -259 634 164 -426 342 -750 -494 -449
3176 -449 340 -410 -294 -623 241 -901 -223 13 -1309 727 -355 -89 285 -509 -133 -526 243 -47 -2
3195 -2 -56 109 -244 40 -184 208 -460 488 -133 -453 -323 -126 -164 391 -602 159 417 -42 158 -322 44
3216 44 61 -472 214 569 -1 309 -440 301 921 -835 322 696 -553 794 -268 -541 193 -663 347
3235 347 500 280 728 -382 -615 154 -225 369 192 62 478 63 -355 -50 210 -187 7 0 -809 134
3255 134 -975 -134 85 -979 592 -119 -562 671 -708 43 909 -751 291 -469 -1017 855 -554
3272 -554 -433 319 -1299 460 223 -755 855 -523 -272 939 -523 215 244 -544 753 256 -507 635
3290 635 -147 -50 468 -604 63 669 -480 598 396 -652 784 14 -258 791 -602 215 896 -865
3308 -865 844 -178 -513 1496 -468 -416 576 -1085 820 518 -989 908 -573 -248 1177 -1107 72
3325 72 299 -961 1022 -420 -736 808 -671 60 520 -1278 228 93 -493 507 -599 -543 772
3342 772 -533 -602 200 -1304 536 354 -1082 507 -491 -231 1411 -782 -120 687 -1084 1155 210
3359 210 -1231 1143 -517 391 1174 -1504 635 460 -603 1467 -622 -529 1659 -646 845 618 -1043
3376 -1043 1192 331 -383 1031 -987 24 1311 -759 278 62 -808 978 117 -900 706 -796
3392 -796 326 968 -1137 166 401 -499 989 -903 -1111 811 -922 218 630 -1755 721 30 -681
3409 -681 1014 -1169 -584 1256 -1055 518 -407 -1190 1389 -354 -808 427 -862 249 996 -1190
3425 -1190 517 -171 -399 1006 -530 -536 837 -732 504 656 -1006 441 188 -336 1157 -707 -214
3442 -214 874 -553 826 100 -898 1122 97 -157 942 -888 315 918 -755 748 181 -885
3458 -885 1402 -288 -137 747 -859 655 625 -879 603 -173 -272 991 -504 -147 315 -802 633
3475 633 3 -711 491 -421 -232 557 -1052 -23 296 -619 543 -333 -834 402 -454 -228 103 -852
3493 -852 259 524 -859 464 -353 -335 867 -850 106 152 -544 695 -20 -535 525 -586 62 548
3511 548 -562 168 260 -171 927 -213 -680 703 -386 352 346 -462 417 150 -196 530 -78 -30 636 -265
3531 -265 196 292 -323 470 360 -253 436 -34 34 779 -410 -56 316 -392 656 -226 -508 341 -321 -114
3551 -114 263 -654 121 170 -389 285 -475 -386 204 -257 -13 70 -231 148 -246 -43 2 -226 -201 154 -172 -178
3573 -178 -84 -147 213 115 -199 131 77 103 7 -330 290 241 128 446 -63 -130 400 -73 -71 386 -205 21 241
3596 241 -31 548 0 299 274 -95 243 -13 -44 510 -97 202 95 -34 30 86 169 254 52 55 168 -144 -122
3619 -122 64 -285 137 214 -396 -43 17 -167 167 72 -80 -5 -367 -145 -24 -166 -117 -232 -226 -25 -418 47
3641 47 9 -448 23 9 -180 80 -464 -238 -90 -193 87 -110 -153 177 -108 144 115 146 169 -13 -51 96 208
3664 208 84 168 -55 122 207 122 231 296 13 211 122 166 237 534 73 287 -50 265 223 -188 91 100 -228
3687 -228 312 -165 -88 329 -284 281 28 -156 141 -265 72 262 -424 -72 121 -325 337 -121 -146 235 -293
3708 -293 -11 81 -414 184 -22 -396 -46 -151 -66 91 -264 -148 -293 -433 1 120 -74 153 -289 -157 113
3729 113 -380 -69 283 -186 216 -159 -169 603 -342 -80 287 -557 218 427 -398 534 -19 39 666 -432
3749 -432 384 431 -404 731 -258 -55 535 -278 309 290 -642 610 -1 -250 552 64 84 738 -146 154
3769 154 109 -469 513 201 -465 337 66 -117 612 -650 -155 129 -483 568 -114 -642 553 -396 -116
3788 -116 463 -854 148 70 -783 644 -598 -602 710 -680 446 -123 -628 478 -34 -367 508 -701
3806 -701 -37 555 -663 232 -45 -543 865 -80 -114 501 -305 93 307 -639 386 357 -329 956 -259
3825 -259 -350 1031 -400 192 425 -873 755 389 -546 835 -288 -107 806 -756 153 242 -759 1026
3843 1026 -87 -399 562 -861 419 540 -1006 368 -222 -402 668 -686 -547 297 -455 420 11
3860 11 -946 466 -198 -306 517 -850 -64 272 -732 412 -46 -629 619 -146 -663 491 -947 316
3878 316 540 -893 520 79 -609 846 -368 -274 827 -510 522 330 -879 731 -116 -17 836 -842
3896 -842 170 369 -533 962 86 -465 930 -326 -86 546 -566 312 537 -492 442 -222 -334 935
3914 935 -240 -240 573 -471 579 454 -689 280 -306 -160 795 -763 -358 204 -670 503 -413 -904 475
3933 475 -434 -153 458 -817 168 329 -697 438 -736 -518 690 -521 -57 255 -776 297 46
3950 46 -517 419 -553 69 679 -643 9 441 -413 466 365 -575 647 -275 -74 802 -600 196 372
3969 372 -271 222 -146 -311 635 -242 139 361 -268 750 474 -132 712 -111 111 582 -364 212 288 -236
3989 -236 339 -34 -303 243 -316 152 229 -462 70 31 -281 364 -16 -62 518 -232 31 178 -542 -35 -6
4010 -6 -398 -49 -472 -225 44 -360 -31 -69 -341 178 -8 -239 134 -441 112 277 -472 161 85 -112 304
4031 304 -129 -197 54 -121 90 143 -114 -33 186 -54 436 -6 -28 250 -18 269 376 -57 382 204 354
4052 354 46 17 -62 285 -308 3 78 -342 304 128 22 200 49 184 212 -257 -30 214 -215 -168 -218 -34
4074 -34 243 -271 79 -26 -144 -68 -21 -193 27 -85 -245 -221 -192 -124 -31 -133 -58 -308 -297 -67 -318 53 12
4097 12 -302 -59 4 114 -289 -228 -155 -52 -16 134 134 -339 189 28 147 246 -92 -79 259 80 136 125 -67 40
4121 40 47 167 138 -19 3 59 11 -103 143 25 387 188 -12 -43 -79 274 160 -61 123 -62 249 168 87 -145
4145 -145 -45 -357 -20 -38 -65 222 -51 16 186 -54 -36 -180 -40 -47 -56 -238 -28 -90 -318 -122 -373 -7 -18
4168 -18 -70 -24 -136 -116 34 -179 -16 -27 -419 -168 -222 103 176 -140 65 44 -289 311 116 -70 150 -178 261
4191 261 243 -90 -20 270 -155 217 -76 115 262 -123 -34 252 -447 286 175 -56 219 242 190 283 -193 -78
4213 -78 345 -625 403 -112 -206 337 -457 -223 295 -379 11 241 -522 469 -165 191 283 -611 121 407 -566
4234 -566 -160 171 -148 310 -317 -275 174 -475 -49 134 -160 181 57 -66 277 -263 -485 14 -260 -53
4254 -53 330 -343 438 230 161 244 -592 -56 264 -222 458 124 -248 578 330 59 217 -470 550 403 -266
4275 -266 602 365 -282 659 -333 39 258 -24 719 225 68 702 -95 -57 276 -322 -64 502 -288 -8
4295 -8 -29 -435 494 -634 -382 -42 -315 16 -193 -484 472 -311 -396 816 -189 308 101 -166 -24 74 -717
4316 -717 173 -177 -524 85 -558 -261 259 -179 -82 -527 -9 490 -241 -507 -117 -660 -163 -532 78 434
4336 434 -356 40 548 -364 -552 -203 -701 726 -621 -65 457 -174 913 -160 -723 331 -329 -118
4354 -118 -122 -237 -159 969 -370 305 116 -653 260 281 -269 -101 -436 -148 523 -299 224 -129 -377 444 44
4375 44 -530 348 -242 -235 248 -244 456 29 -469 534 -191 -353 174 -685 -1 191 -785 36 -62 -179 372
4396 372 -374 -394 320 -528 80 94 -566 404 40 -536 346 -369 -144 421 -487 -136 258 -259 464 -82 -359
4417 -359 405 -200 40 300 -432 479 296 73 272 -270 79 398 -159 379 -58 -566 420 299 -259 236
4437 236 -310 19 401 -185 47 159 -293 517 -126 -474 286 -366 273 283 -334 31 -88 -39 169 -427 -306
4458 -306 315 -142 28 81 -390 -130 5 -305 200 -153 -345 144 -301 216 -92 -342 390 -39 -2 124 -153
4479 -153 133 60 -468 277 -16 -126 317 -11 -135 283 -43 252 112 -67 274 5 -99 413 -107 54
4499 54 294 -268 25 -8 134 252 -98 85 148 -226 40 37 -39 51 97 39 162 39 125 34 -1 265 -91 -201
4523 -201 70 -238 22 125 -67 -1 255 -83 146 312 -215 -16 18 -172 37 -316 38 146 -35 97 60
4544 60 -84 24 -234 -70 60 -141 -224 -185 -170 -110 -44 -133 64 -190 -116 52 -55 -137 71 -44 203 -12 -43
4567 -43 256 -32 -17 248 -162 225 130 -16 80 7 -30 81 -187 18 159 13 80 187 -167 -84 -56 65 84
4590 84 127 350 130 14 155 47 -126 85 -109 142 138 -217 276 33 -181 -3 -141 -2 16 -75 134 -62
4612 -62 -422 -331 -102 -211 130 -211 -206 -31 57 -5 70 12 -87 -265 70 55 -25 84 24 -49 227 196 -44 -36 7 216
4638 216 -242 -475 77 95 67 84 137 21 169 -1 269 -28 129 51 208 -158 247 62 150 138 -185 41
4660 41 1 -188 260 -237 158 419 -75 5 -76 -186 28 -100 -153 246 -269 178 243 -39 -27 -52 -167 12 -105
4683 -105 15 181 -222 -161 16 -103 57 110 -134 176 -229 -79 26 -355 -258 5 59 -162 6 -186 398
4704 398 -241 -18 255 -232 54 -97 -204 336 -20 -104 481 -377 178 94 -149 390 1 -18 -118 -409 1
4725 1 232 -531 33 144 135 120 634 -558 312 30 -8 231 -679 139 -435 -72 571 -171 204 314 -300 568
4747 568 132 273 668 -326 -313 -10 -106 -143 209 -648 -92 -81 -297 365 -79 -515 566 -837 -33 -334 -637
4768 -637 -115 -249 -59 -196 -58 167 461 -591 -110 240 667 622 -336 -730 109 217 322 541 -386 493
4788 493 -261 -759 816 81 386 -74 461 -526 512 368 -424 -54 -135 828 -855 748 226 -797 377
4807 377 161 -618 517 -137 -26 75 -966 200 -216 -694 302 329 -292 255 -171 -183 11 -610 1288
4826 1288 361 42 52 42 -329 465 79 -691 292 -47 -248 228 -524 226 -359 -520 558 -233 -367 6
4846 6 -520 -53 -66 -320 -236 -770 -604 207 -62 -109 684 23 316 676 -207 484 -569 474 152 -993 225
4867 225 166 -191 1098 136 -1064 436 -967 128 39 -74 479 212 -175 255 -372 -270 -408 -144 74
4886 74 210 -768 330 -636 -148 630 -548 268 576 -641 93 -466 -519 759 -27 105 33 -59 12 485
4906 485 70 -168 -547 0 306 295 -73 -377 -951 588 22 -35 -408 111 -109 506 -57 -430 -227 -129 -254
4927 -254 -112 -347 366 -154 -149 289 2 624 55 -43 400 89 -605 170 -726 167 396 314 -44 619 -367
4948 -367 294 -168 -262 94 98 72 325 -82 652 223 -369 464 -170 -142 170 -2 608 72 304 -337 223 33
4970 33 259 -185 -331 293 -197 287 22 -117 -83 -250 -255 -5 -155 35 -32 -253 -43 -128 -227 201 20 -178
4992 -178 317 -130 -93 115 -102 281 49 -130 233 170 -279 -14 144 35 -11 -92 -179 -435 -287 175 -91 -139
5014 -139 133 -213 -257 276 -136 218 127 240 176 35 -139 531 -77 317 105 231 181 65 380 -19 22 -138
5036 -138 104 -131 377 -19 107 -77 -263 61 35 -73 -105 -296 -83 269 -170 92 -168 -81 -11 252 -113
5057 -113 244 -188 -66 87 -90 -50 -305 48 -134 -204 245 188 -245 -61 0 -167 -224 -105 312 19 84 46
5079 46 -48 -112 -16 -197 26 14 51 -130 81 254 -288 251 -34 49 -234 -269 250 -109 246 372 -2 137 -11
5102 -11 39 -45 30 70 37 -193 77 138 -70 98 388 -227 35 115 -128 269 -94 104 41 101 6 -81 -236 -129
5126 -129 176 -8 -139 -38 -207 102 -89 177 -266 -113 -264 -52 -179 -302 -155 -112 -172 -160 -14 121 -77
5147 -77 239 -69 -78 296 -220 55 319 -114 283 65 20 257 -285 -142 -125 -79 -140 152 -119 57 -208 23
5169 23 80 209 -134 108 118 62 206 -333 54 -170 163 -16 20 99 315 -77 304 -168 -256 359 -250 3
5191 3 -29 0 195 224 90 27 -31 -13 188 108 216 14 -204 174 -138 -161 182 -259 -188 -145 -238 33 -7 -238 -43
5216 -43 -229 -119 -156 -309 72 49 -472 136 -126 -2 300 45 -105 217 -334 -98 194 -202 321 68 49
5237 49 -177 -143 -7 78 -73 171 43 -128 520 -118 -225 61 -323 55 125 -7 -30 13 104 214 -405 -306 536
5260 536 -88 493 127 -105 104 -195 -533 215 -637 -167 154 -11 -106 -178 54 106 -271 -267 259 -344 441 186
5282 186 -273 -87 -234 415 42 -108 -68 111 -440 -41 254 -312 140 -267 -193 188 -192 110 -110 -527 351
5303 351 14 60 777 -254 250 -73 -333 -26 179 -236 423 411 399 259 -441 219 140 -225 201 228 177 88
5325 88 466 -59 16 -238 190 -695 -155 50 297 -294 -221 -165 538 8 69 13 178 -136 -43 471 -68 -9 -384
5348 -384 -182 24 -129 -157 -249 -244 -42 -306 -892 -164 -15 105 -179 -497 -147 -576 133 424 -120 -487 -253
5369 -253 -155 117 -238 -513 56 430 197 -306 -421 -24 474 -113 -348 742 561 533 4 -73 1 -206 103
5390 103 -58 -399 397 339 412 306 -65 -343 501 452 346 -57 461 283 -338 53 -153 -390 47 -26 -328
5411 -328 -95 -201 -502 214 -367 -438 577 335 -304 -315 -392 -191 199 -103 -454 -367 -35 153 -70 1105 -21
5432 -21 -235 -465 -20 638 230 -126 -91 -102 40 443 290 -197 103 115 179 -196 -219 -27 -139 -73 -453 -103
5454 -103 -734 580 -206 125 22 -13 -261 345 109 430 -245 429 45 -19 839 -85 -52 89 -249 -34 -735
5475 -735 -62 -382 334 -146 -241 -661 -412 -116 -259 11 696 -1 -138 -454 -57 -70 49 -11 582 555 -439
5496 -439 735 -454 -111 -36 -4 472 -8 -190 215 -81 81 77 210 116 53 825 -212 20 24 329 -254 -93
5518 -93 -405 286 447 583 -112 -681 381 331 -486 -222 -249 -137 112 648 384 -381 -325 89 -191 207 5
5539 5 -12 -19 143 -485 -489 451 782 -185 186 98 -92 376 -12 22 18 41 -11 50 349 -55 118 -43 308 6 72
5564 72 368 86 -43 -342 86 -493 656 410 -199 202 148 537 -422 475 -38 -176 568 427 -165 -22
5584 -22 168 -88 96 -345 -152 -110 -158 62 -148 224 -422 67 -117 86 162 -49 -93 -408 186 -219 330 -261
5606 -261 222 -183 -129 -377 483 231 46 100 -88 145 483 35 -160 311 166 139 227 290 396 425 220 55
5628 55 -42 292 -36 206 -414 244 -249 -56 -580 -658 -293 -278 -47 -214 -67 611 200 -440 339 -126 179
5649 179 -74 48 463 -207 -94 360 -377 794 121 -1020 -227 -42 31 47 223 59 -55 97 -54 -94
5669 -94 82 146 -435 49 350 -501 71 659 -96 12 211 -680 218 131 -318 -340 -884 606 -396 112 765
5690 765 -259 -248 -229 -148 58 327 51 495 -216 -464 123 -550 177 -358 -437 -335 -352 -124 518 566 -370 -64
5712 -64 -45 -243 -137 2 -283 -745 76 405 -239 174 607 -135 -699 663 138 -604 168 -612 -183 -280 -463
5733 -463 -643 -226 -416 -960 99 313 -478 100 -25 524 111 99 -912 677 -400 -190 338 -251 331
5752 331 649 -621 -191 286 -290 451 -746 -158 43 -135 929 -250 271 51 420 -793 309 671
5770 671 142 -222 -216 -205 -416 -478 -203 -10 -667 -350 287 109 -559 -412 280 205 -207 287 -139 -53 531 -847
5792 -847 34 355 -250 -142 -887 -716 -289 489 413 154 -423 471 321 -336 -574 86 -689 951 157 71
5812 71 -189 -526 233 -71 -107 218 271 -668 157 -391 -275 417 -233 -744 -672 -912 65 10 130 129 -393 -39
5834 -39 103 -361 -276 77 -209 486 143 636 -28 -242 -1 78 459 411 -78 -327 756 386 501 -375 -598
5855 -598 126 -232 -367 58 -403 72 217 -347 48 189 -249 58 119 -797 367 1 89 -429 -317 575
5875 575 -253 -417 641 233 -218 217 -265 -172 85 -335 -47 327 -157 -317 -400 -255 119 -155 -102 -62 -149
5896 -149 135 -227 -9 61 -185 -236 18 50 44 -157 94 61 68 65 -16 -111 14 -61 -69 54 98 -19 -24 -84 202 186 9
5923 9 40 58 -349 13 -18 -70 -162 -14 18 115 -60 30 203 123 166 41 -216 36 -77 118 -33 -177 169 40
5947 40 -97 36 113 -74 95 12 141 -73 -129 9 -334 -146 166 -251 78 -140 -121 -155 43 71 -99 12
5969 12 99 184 -85 274 -227 -19 67 47 -53 -38 -123 -204 81 151 145 -66 187 78 166 132 -115 -196 -187 111 61 68
5995 68 -46 -39 90 193 117 36 12 117 92 -164 55 -15 76 82 31 -71 -138 28 -9 142 2 256 -3 123 133
6020 133 -35 476 161 220 -2 6 76 167 -68 38 112 -68 90 -286 -174 -66 9 -18 -288 -90 -275 -75 110
6043 110 247 -60 -64 235 154 -3 4 -47 -116 -157 -97 116 108 -97 -27 63 -47 31 38 -64 35 11 100 42 123 -85 48
6070 48 111 153 145 59 -110 -6 389 177 11 151 23 50 -30 68 -17 -111 54 9 59 63 -103 -92 227 -46 26 278
6096 278 -164 -44 180 202 -325 -129 51 -16 15 -173 12 5 -41 60 -174 -10 -196 -174 49 -9 -148 147 286
6119 286 13 -157 -161 59 201 -31 56 -98 71 -146 -240 -180 30 180 32 27 -76 120 -204 -63 83 -146
6141 -146 223 78 -28 159 -53 177 40 -165 439 -88 -324 -61 -86 -134 378 27 -247 260 520 -165 347
6162 347 -131 206 -146 -382 293 -292 297 67 -174 367 -178 -552 -242 466 285 -892 -244 -587 -505 -739
6182 -739 102 303 -325 -91 -3 -238 250 414 452 306 8 -242 285 -437 -338 -582 56 -502 -59 219 -60
6203 -60 332 -212 230 -219 30 -154 201 -257 -55 7 -148 -423 -196 75 396 435 -365 266 26 -396 235
6224 235 19 119 402 -444 334 398 -382 39 156 -579 238 100 89 81 327 -496 79 161 586 -336 -174 -191
6246 -191 67 23 -524 -134 256 -198 -101 92 -416 9 -22 -430 188 119 -252 84 435 -430 146 -340 281
6267 281 107 -420 84 -349 -523 536 -368 -287 480 -106 -88 -274 -810 300 -130 -60 293 -776 118 321
6287 321 -338 -226 75 195 -153 -269 -94 167 -293 273 -73 -164 183 -85 -478 -79 -488 196 14 -307
6307 -307 -68 122 -128 -329 683 -90 105 -116 624 248 -633 48 -173 29 -150 263 -71 434 -189 297
6327 297 48 110 273 -121 -228 -423 -49 -333 260 67 99 -203 263 316 126 -248 265 -88 -290 -187 -332
6348 -332 -51 -229 -419 204 -216 -96 -116 -722 -4 -535 -150 -95 -135 23 353 54 116 615 45 68 287 -210
6370 -210 87 318 246 185 105 -16 95 -71 34 46 -166 -49 -48 226 30 6 141 142 68 80 241 -108 -153 -64
6394 -64 217 -14 -11 29 43 26 353 59 142 95 -152 -88 57 55 -487 -317 -150 -127 30 -43 -144 -38 81 -1 -26
6419 -26 84 -48 -64 -83 100 -21 -56 -324 -27 -158 168 158 14 -70 -53 -109 56 -124 2 -86 69 26 58 0
6443 0 -43 -3 -186 89 165 -76 11 62 -250 157 -111 57 174 63 137 347 79 104 -160 341 -94 -16 72 -223
6467 -223 -56 -179 -6 -219 -13 28 181 104 -11 -81 -247 -184 203 60 -156 -145 -6 -181 29 -68 -69 72 96
6490 96 -48 50 -166 100 -205 212 -169 96 10 -46 -31 100 -20 121 76 -65 13 -18 301 -53 -66 78 -72
6513 -72 18 -69 31 68 -48 -130 -49 46 -20 -9 -99 111 183 -110 41 60 141 -75 76 -332 -53 50 -65 -69 -45
6538 -45 -150 -44 73 -31 212 50 -63 -204 -168 -16 5 -28 205 -49 -97 -122 125 -57 -146 -104 142 13 -58
6561 -58 113 102 -12 78 -168 -39 -47 -33 143 -212 -26 -203 -103 75 -146 -11 -45 -22 218 -167 -363 53 117
6584 117 14 1 138 -224 -63 98 111 -236 -186 61 -174 65 -278 44 34 -26 26 149 103 -275 23 147
6606 147 90 151 -192 33 61 -294 -167 9 -101 -184 -135 -121 292 -187 107 -91 -331 -123 -146 -115 -1 -121 -251
6629 -251 -31 -198 25 158 -187 130 -73 -137 108 65 -72 -73 -83 16 93 -86 105 4 -26 182 -232 15 -49
6652 -49 -89 -16 63 -64 7 -212 195 101 57 -197 343 -102 171 5 -58 10 -25 -162 58 -175 -119 -9 -63 -18
6676 -18 -61 -209 167 -68 -81 273 0 -46 -14 125 -9 -32 -37 241 2 109 152 -185 105 50 -430 58 -9 -31
6700 -31 -31 -279 288 308 -168 43 -239 -36 3 105 59 272 114 69 -37 -176 2 -88 -111 -58 -188 189 194 153
6724 153 8 -167 -245 103 135 8 -36 258 -216 52 -26 -81 -123 -163 307 -225 202 37 -196 270 193 -26 157
6747 157 133 -19 198 -40 241 26 -141 148 13 -180 62 -89 139 -88 -171 102 -41 -144 66 49 -97
6768 -97 223 9 -55 94 -113 275 112 -106 5 -212 -198 -32 -274 46 -71 94 -12 77 -79 161 -141
6789 -141 -178 223 31 -52 -269 76 -303 -106 -348 33 -72 -94 62 -284 -54 19 -146 -168 -221 46 72 -391
6811 -391 -144 44 -191 191 -189 -195 153 -445 -21 186 -26 -26 28 -232 193 -196 39 -5 -53 132 92 -78 -37
6834 -37 200 56 40 55 41 89 -241 230 95 -201 -55 -108 83 30 219 -23 16 19 221 68 -229 -32 -26 182
6858 182 -129 -119 69 -376 -283 33 190 29 -35 -99 39 278 -257 -101 50 13 -185 -9 -211 -8 238 -198
6880 -198 36 131 251 10 -106 121 -74 60 -139 -144 35 -164 165 254 4 -388 382 -315 204 -200 361
6901 361 161 192 -217 87 -286 -385 -346 5 -99 -63 -48 -57 273 -187 177 -170 30 -108 -258 -114 228 -5
6923 -5 -96 -286 -197 -30 -49 110 105 60 -129 -258 -182 43 -19 -139 258 -268 83 359 -186 244 0 -88 170 65
6947 65 -97 -66 46 -143 -31 184 -94 37 -131 343 92 -131 -106 -18 178 18 -67 -179 -165 166 30 -188
6969 -188 84 203 -163 -216 -18 -321 -118 -158 139 104 93 126 -85 109 103 -62 -21 208 -11 85 41 32 -77 57
6993 57 167 -176 122 -6 189 65 208 -129 -34 373 -3 -109 -243 119 130 289 198 -5 112 -58 24 180
7015 180 28 51 -172 -146 122 -136 -116 -302 -42 -17 131 37 -147 -220 210 237 -67 216 251 -151 238 70 -133
7038 -133 262 165 184 49 -245 -195 335 -35 77 320 -58 -162 -249 291 185 -207 44 207 -68 -103 -336 149
7060 149 233 542 -150 86 259 -77 -28 32 38 116 372 59 -97 40 65 185 -405 -289 -231 40 -464 128 59
7083 59 -127 38 67 -81 -69 -108 51 345 101 49 -115 98 206 273 -218 193 -383 180 -283 -81 83 -61
7105 -61 82 245 -150 -215 -8 -396 -38 111 33 432 -497 74 -43 -282 544 -379 51 -32 184 155 -157 376
7127 376 809 -12 -118 265 403 293 -125 63 173 52 339 218 170 158 -582 -140 141 106 -293 171 97
7148 97 -188 -316 591 148 338 -90 -46 -324 -297 141 20 -264 -200 -307 -383 523 -293 280 373 500 -144 48
7170 48 88 61 -18 -756 5 -377 39 -159 68 -333 87 -182 -82 -2 -351 -20 -585 590 517 -90 -17 -67
7192 -67 -494 637 574 -345 699 -191 262 890 264 -160 603 303 -44 -462 -56 125 -139 485 135 -792
7212 -792 434 -88 -298 884 -13 395 -331 60 155 257 -508 447 -199 -82 700 -25 -73 -271 -76 -215
7232 -215 -224 136 868 434 179 390 143 289 464 -349 74 -165 298 365 -165 74 127 -467 211 223 -97 7
7254 7 211 -271 -99 -299 -513 83 200 -19 -152 141 -98 74 424 130 76 -955 -153 504 -100 405 42
7275 42 -275 35 6 546 -387 131 208 352 -71 217 148 702 -212 243 -160 -388 652 -374 215 -30 -163
7296 -163 113 3 67 -41 -188 503 469 -168 -304 372 -83 -257 -221 183 -179 -202 391 -59 -50 -225 393 250
7318 250 -14 343 -50 377 -106 -58 237 -30 93 254 132 -214 197 -13 -35 -154 209 -138 -175 -154 -221 54
7340 54 -168 148 64 -20 -3 386 -305 -96 161 -305 -7 156 180 228 49 -246 183 -292 -80 -227 -217 166
7362 166 18 294 26 70 215 -32 42 202 -281 -24 -251 205 -42 -206 -4 250 -268 -9 -109 211 -65
7383 -65 -201 40 -137 -114 199 -159 -55 299 62 -307 -175 116 64 -220 150 -102 36 340 132 -331 455
7404 455 -436 215 148 372 38 73 177 54 -103 -76 189 -441 65 155 71 -380 -170 249 -5 406 256 86
7426 86 348 146 -274 -243 48 219 394 18 -111 315 189 -309 -122 -92 234 217 160 -459 198 -118 215 275
7448 275 515 72 -35 138 -495 176 166 109 -363 54 269 -121 -181 -197 338 17 338 -617 -391 142 -307
7469 -307 -109 438 717 451 -66 701 76 -63 529 -528 180 117 80 611 -566 -251 -33 196 76 15
7489 15 4 58 -239 550 -365 500 342 -315 406 567 91 5 260 -477 573 202 -144 -192 -105 190 -81 -329
7511 -329 -214 81 -550 340 112 79 316 -755 388 221 189 -23 106 -194 122 -106 24 195 -271 -129
7531 -129 21 219 -269 -135 67 345 -20 187 662 108 96 -198 16 460 25 21 247 30 -163 91 -220
7552 -220 -29 -149 -240 324 -74 92 -292 -375 -145 216 124 333 -96 304 62 -425 -501 175 -603 289 -2
7573 -2 50 -322 77 892 329 447 -6 41 392 73 -225 338 -424 173 -170 374 -289 339 112 -372 864
7594 864 659 -237 -349 185 104 -439 -398 -14 -416 189 312 52 -26 -21 -186 233 -378 154 317 181 189 -128
7616 -128 -45 231 -123 88 -5 -95 -353 255 33 -211 -365 143 -471 126 -17 348 5 465 20 -244 18
7637 18 -240 207 76 575 770 -171 400 -104 -40 -140 -164 -127 189 591 158 -103 226 -458 674 143 121
7658 121 232 35 91 -93 -454 -50 -3 104 93 305 107 72 -46 -384 -205 59 -131 49 -127 -497 214
7679 214 662 -345 222 -79 80 565 -214 5 -127 -151 106 204 378 253 -371 -157 -119 -640 -28 -88 40
7700 40 -116 -77 -98 -254 9 -57 -147 -82 288 -68 858 104 -167 32 259 -73 288 -649 34 202 -109 -107 367
7723 367 78 19 -345 28 207 266 377 -82 -142 106 -636 -33 507 -241 480 -34 -405 -325 -11 -115 264
7744 264 -99 48 -27 279 559 66 -98 -29 391 -341 53 -66 127 104 -447 87 -567 -628 126 -255 294
7765 294 134 146 243 -98 17 237 -351 -227 -194 -161 -97 2 107 448 -159 215 935 -23 78 103 -217 9
7787 9 257 -29 23 14 169 172 -117 192 -205 33 -122 218 25 -377 176 -65 -26 110 76 174 482 168 -331
7810 -331 -81 -225 147 -108 168 4 276 37 -334 -96 -179 -182 139 -155 -579 309 -1 280 -221 -76 -44
7831 -44 114 -154 -80 -209 75 -54 52 -106 11 -16 -298 -9 -300 -314 -336 -137 61 54 52 -266 -162 104 -49
7854 -49 299 172 -330 172 -26 -382 -36 394 178 32 150 -481 109 198 414 61 122 317 -325 36 -4
7875 -4 398 345 -234 -161 -70 62 298 -81 341 312 571 542 229 -433 68 180 539 -164 -185 201 421 310 -661
7898 -661 111 38 -56 124 11 265 122 -194 176 -192 -35 -178 -691 -267 -352 202 1050 308 -89 -865 -46
7919 -46 414 112 194 676 -120 -939 -913 513 290 617 -452 313 -39 -895 -78 -76 116 -239 140 704 -337
7940 -337 632 162 18 657 -184 677 -209 106 159 -208 -223 -110 47 235 279 -36 324 180 109 -21 -340
7961 -340 436 610 -303 -161 765 -296 456 -258 617 -680 -65 495 -426 428 566 620 -121 -391 271 994
7981 994 -92 -32 292 -140 705 -597 62 328 191 -710 17 253 -800 -227 304 297 156 271 -62 51
8001 51 9 120 -310 -786 -37 24 -471 -330 306 -502 661 153 -238 68 21 -269 44 -79 273 -122 4
8022 4 50 -102 -34 70 -63 104 -6 83 -452 237 131 176 -217 11 -213 -31 104 -7 -19 120 108 100 -98
8045 -98 -147 -24 -107 -211 13 -276 28 131 -280 -57 150 -29 -104 21 -77 -65 -194 -45 99 -385 83 216
8067 216 -152 -121 -31 301 -25 -223 55 -239 -93 -5 -292 -340 52 13 -304 -16 -152 -103 -36 -313 147 58 -502
8090 -502 -241 -134 216 -152 848 -66 691 -318 -261 576 -785 861 -786 263 640 158 605 -6
8108 -6 208 -980 218 164 -88 615 -485 -148 -551 -95 -302 -361 -696 -618 -473 -616 658 -768 185 -118
8128 -118 -294 -515 -545 -289 -226 -330 204 -76 -89 -18 183 78 -223 -246 1 -314 183 -135 -286 129 -188 -386
8150 -386 -101 23 128 82 64 -250 522 54 120 -206 205 -117 110 17 -153 71 32 -15 0 103 -325 480
8172 480 89 54 -173 330 739 -5 17 -339 -96 732 290 353 -118 -172 207 98 261 -337 -98
8191i8
$$ Imaginary data points
##PAGE= N=2
##DATA TABLE= (X++(I..I)), XYDATA
0 0 0 0 0 0 0 0 0 0 0 8 -8 8 -8 16 -16 24 -24 32 -40 48 -59 72 -84 100 -120 139 -163 188 -219 252 -290 331
32 331 -374 426 -483 544 -614 689 -772 863 -960 1068 -1188 1317 -1457 1611 -1780 1963
48 1963 -2166 2386 -2627 2891 -3186 3511 -3875 4279 -4738 5258 -5855 6551 -7368 8351
62 8351 -9554 11066 -13032 15708 -19598 25838 -38138 118893 -279441 67724 109570 -259206
74 -259206 324141 -110170 -122210 112324 -106923 155919 -5508 -180477 48149 -36238
84 -36238 118098 -34788 -100931 104086 -5017 70530 -7931 -96619 36734 -70003 80090
95 80090 -18704 -130980 99020 -39040 26265 26216 -96499 98589 -87344 25011 109381
106 109381 -148331 105352 -41835 -56116 172987 -198138 21576 53386 -162115 198317
116 198317 -62347 -75794 139641 -110311 138715 -5252 -177149 149064 -56580 9091
126 9091 75002 -138259 66917 14226 -15503 35428 -96818 52929 31397 11669 46261
137 46261 -78117 71882 17193 -50705 55176 -81273 7691 31009 -40381 57919 -48185
148 -48185 21039 41832 -50520 70634 -47953 -8539 54678 -69594 88796 -26626 -69049
159 -69049 80966 -87310 33899 14890 -110924 102254 -26632 407 82631 -111658 54526
170 54526 22642 -64038 59295 -80520 6947 54833 -63080 37510 -37033 -17622 51644
181 51644 -44448 22914 -6347 -11725 51695 -28606 13244 -4057 -25517 24248 -40226 6350
193 6350 -1489 -24646 43398 -20190 22826 20701 -38096 41988 -20138 413 33545 -48160 38134
206 38134 1665 -21814 37514 -58151 14465 25211 -37033 51303 -20986 3440 56552 -39154
218 -39154 22659 -3168 -30957 40613 -30111 -4986 14105 -21084 29189 -13535 -5235 15990
230 15990 -19678 25723 -7746 -9032 27708 -18780 10158 455 -24178 6505 -19775 -6792
242 -6792 -920 -5518 18319 -9780 11146 7097 -16575 17001 -19099 -8437 17283 -20580 6739
255 6739 -4492 -17134 12736 -17757 -1659 1470 -9536 21622 -5655 3881 14447 -13831 16318
268 16318 -7746 -19341 13360 -17074 -2054 10812 -10997 13137 8509 -1519 3405 539 6848
281 6848 -2657 5873 8949 -5536 13491 -1035 -14670 5671 -6540 -4214 7243 1911 8808
294 8808 9144 8072 1245 -3362 6069 -4586 -4600 3413 -5383 1738 1946 -4938 -520 -1067 689 -1534
310 -1534 -2765 4914 2048 1580 4438 -2717 -3113 -3125 -7831 -11129 -6912 827 -2644 302 7711 -2900
326 -2900 118 3698 -9655 -3735 4842 -4574 -505 3959 -6177 -3656 -387 -9394 -5991 2438 1263
341 1263 1209 5326 6683 1105 2177 3306 -5799 -3277 2829 -5708 -912 5384 -1493 3580 5655 -1457
357 -1457 2725 2339 -235 3603 4252 7340 3337 -693 3615 -4358 -5162 2545 -6770 -23 13149 1091
373 1091 3666 7487 -4886 3149 2722 -8658 1549 1418 -2368 6126 -5056 -5915 2625 -6250 1557
388 1557 383 -8994 8779 1961 -2394 9480 -10524 -3754 4997 -13744 237 -5486 -11024 12410
402 12410 -3551 -204 5131 -13345 7179 1014 -9401 7401 -9072 3555 13708 -12662 371
415 371 -5042 -11146 12607 -4079 -7053 8875 -279 9368 8246 -10707 -920 5870 -259 5009
429 5009 -1628 -10591 11239 6151 -4855 8212 -12204 224 19691 -11622 6852 2795 -10790
442 -10790 26455 -4742 -8961 8582 -22672 17013 7430 -21962 19735 -10473 3914 25250
454 25250 -27341 5029 1180 -11452 28438 -16355 -9586 14108 -16809 15179 -3198 -28045
466 -28045 13087 -1358 247 10401 -16055 -5227 12055 2677 -6850 -5421 -10041 -214 14465
479 14465 -9871 -5778 -182 -8015 22277 -8454 -16604 13290 -19799 21292 14246 -34626 22264
492 22264 -8892 -7036 30981 -38276 4396 13457 -15965 37199 -21507 -11596 29780 -24621 26300
505 26300 527 -35316 33943 -6843 896 18983 -32221 10583 13065 -5277 11461 -16109
517 -16109 778 15650 2921 3835 -9452 -3441 5674 10881 -4443 -15475 8227 -5832 13763
530 13763 12867 -33250 14422 1581 -9572 30080 -34907 -1274 23077 -22509 30247 -23038
542 -23038 -25800 37263 -28201 16785 6987 -45508 39010 -5207 -10118 22636 -42576 15532 15678
555 15678 -19579 17974 -27557 16 22778 -15880 10940 -16305 -8268 24456 -6602 1835
567 1835 -9719 -4995 17188 -312 3524 -16131 -3527 16148 -4572 10798 -16293 -5430 25901
580 25901 -11697 14651 -9706 -20160 37282 -14078 5611 10201 -37110 36843 454 -17338
592 -17338 25389 -35430 19096 23003 -28632 23783 -20575 -1385 33465 -26473 10372 -7047
604 -7047 -13063 31965 -18999 -577 1121 -16234 28785 -9870 -8931 5701 -16113 20465 -1896
617 -1896 -12384 4132 -12637 14208 -1142 -11131 964 -11771 16601 -1978 -9207 6577 -18598
630 -18598 17948 2221 -17429 15879 -21966 11195 15133 -29688 19769 -13128 -5380 30892
642 30892 -30492 11030 4817 -20894 34877 -18612 -7402 20320 -21942 22629 -1746 -18421
654 -18421 20630 -13842 10068 9822 -18191 13773 -3664 3622 8660 -13036 8674 -2192 3772
667 3772 6830 -11410 8543 -4963 3448 9588 -14680 10265 -3537 -1811 13996 -17657 9401
680 9401 934 -10341 19546 -17653 699 9677 -18531 19071 -9668 -10285 19163 -19324 9573
693 9573 3114 -19450 17574 -10216 -1795 10888 -18323 9370 -1829 -7492 9416 -12079 4278
706 4278 1180 -6543 8082 -8846 2492 1997 -5610 8291 -8861 3068 3710 -9113 11534 -7153
720 -7153 -1238 10246 -10945 8747 -627 -6327 10775 -7096 5567 2199 -6659 11525 -7485
733 -7485 2455 7577 -10281 10945 -970 -3824 9847 -7574 4871 1975 -4254 8074 -6220
746 -6220 3566 3787 -6975 8396 -3585 -1447 6316 -6061 4170 -1626 -1991 4603 -6982 4795
760 4795 -785 -5512 7384 -6933 -23 3613 -7283 4102 -2215 -2046 1976 -5717 3430 -3334
774 -3334 -3422 4655 -6456 1743 1167 -5481 3523 -2894 -629 1063 -3417 2739 -3597 -173 2586 -5053
790 -5053 3344 -190 -3007 3879 -2327 831 1200 -1478 3474 -1863 1760 2194 -2828 3862 -277 -1094
806 -1094 4074 -833 1121 2195 393 1454 40 2833 -289 180 3781 -2033 1478 1552 -1565 2770
822 2770 -966 126 1884 -1492 2003 -152 -233 2119 -2536 1958 498 -3345 2046 -2098 -2027 1979
838 1979 -2825 -310 203 -2316 1180 -1456 -2532 801 -1403 -597 90 -2629 -699 -316 -2374 503
854 503 -1804 -3016 2537 -1209 -1929 1790 -3131 416 2115 -3290 1337 -996 -1819 4586 -1629 -1261
870 -1261 2119 -2206 2809 635 -2266 2896 -1173 2160 4882 -3562 1350 1920 -1169 4654 -2150
885 -2150 -2132 5040 -1169 2877 3242 -5405 3521 3365 -1682 3745 -2828 -1167 6770 -2358 479 858
901 858 -5800 5042 1968 -4607 2503 -3419 1231 6750 -6235 -538 769 -4953 6714 -2010 -7599
916 -7599 4046 -3300 2029 3303 -10871 1424 2138 -3362 6093 -7023 -4721 7587 -4341 2767
930 2767 -1103 -11518 7731 1433 -4829 4218 -8545 1391 9656 -5836 1221 -2677 -4674 10911
944 10911 -1206 -5013 2839 -4384 5894 6249 -8783 104 1523 533 9481 -4221 -5522 7071
958 7071 -100 4428 2344 -11617 5356 5646 -2135 6752 -8588 -2855 12926 -4128 2152 -1313
972 -1313 -8762 13222 1094 -4204 3879 -10850 8277 7419 -11249 4029 -6682 -1341 14752
985 14752 -9573 -2781 2396 -6832 11466 -1332 -11437 3524 -2585 3639 4930 -11497 -2697
998 -2697 3354 -333 3462 -4882 -8381 5949 3468 -1060 771 -9256 707 9449 -6175 810
1012 810 -3772 -7501 14667 -3389 -6140 5841 -11387 10279 7820 -14397 8191 -4419 -108
1025 -108 16238 -13876 346 4148 -7574 15759 -6217 -8729 11077 -5862 9518 4454 -14025
1038 -14025 7548 1529 333 7809 -9524 -1282 7559 -94 2345 -2466 -5793 4542 6013 -2856
1052 -2856 -572 -2049 -2466 10492 -2365 -7092 4037 -7583 6936 5517 -14040 6335 -2855
1065 -2855 -2370 13329 -14971 -483 5828 -9553 13634 -7497 -9589 11870 -9673 6443 1124
1078 1124 -16224 10552 -2795 -1323 7454 -14028 4690 5260 -5351 6812 -7969 -2305 8031
1091 8031 -2875 1536 -2212 -3918 4318 3108 -1155 -2551 1212 -399 4625 3191 -8074 5062
1105 5062 1000 -1955 9832 -10097 416 8491 -7940 10974 -3770 -7814 14137 -7826 4184
1118 4184 5020 -13700 12973 -1093 -4595 10047 -12608 5011 5695 -8739 8169 -6623 -1213
1131 -1213 8940 -7223 3419 -1496 -4507 7094 -4032 -322 -651 -3524 3716 -1815 -362 -2480
1145 -2480 -1317 2911 -3391 2276 -3569 -2532 5945 -6217 3575 -387 -7886 9453 -5791 -1550
1159 -1550 5778 -11096 7785 593 -7335 9148 -8298 1899 6306 -9589 7323 -2885 -2699
1172 -2699 7498 -7293 3135 1626 -4540 7929 -3333 1069 2402 -4169 6112 -2483 1020
1185 1020 3315 -4284 5363 -1416 -1239 4296 -4643 5279 21 -2593 5321 -4377 3045 1919 -4002
1200 -4002 5294 -3358 1095 2301 -4814 5359 -3637 -762 4697 -5932 4168 -889 -4347 6177
1214 6177 -6072 585 2168 -5387 5198 -3808 -1409 3000 -6258 4015 -2606 -2944 4946 -5973
1228 -5973 1856 234 -3707 4952 -3654 130 1624 -5334 3591 -1961 -333 3089 -3962 3957 -556
1243 -556 -2195 5429 -4267 2222 879 -2291 4700 -2752 1020 2048 -3214 3909 -1417 271 3300
1258 3300 -3974 4630 -1363 -1785 4521 -3305 1818 1944 -3290 5577 -1725 294 2967 -2679 3360
1273 3360 -749 -1457 3236 -3351 1614 421 -2365 3369 -2975 664 472 -2570 1843 -2035 49
1288 49 1036 -2484 1921 -2408 -736 1511 -3109 1386 -1552 -1669 2571 -3322 686 -367 -2934 2870
1304 2870 -2850 469 1599 -3295 2512 -1565 -1394 3471 -3618 925 588 -3044 3418 -1572 -15
1319 -15 1780 -1454 2217 -208 -1303 1801 -284 641 1768 -696 1038 195 1260 54 883 138
1335 138 -9 1329 193 552 877 -373 1690 917 477 1259 -1993 1813 1112 -2416 2664 -1274 -572
1352 -572 3918 -2761 471 148 -3842 3064 -740 -2083 2126 -2741 299 1382 -3242 266 -905
1367 -905 -979 2069 -2473 -1349 -156 -2043 1545 -985 -3226 1264 -1616 -355 2687 -4249 -559 2958
1383 2958 -2688 2037 -25 -4617 2381 249 -2280 2728 -3123 540 3667 -3058 1449 -920 -1709
1398 -1709 4525 -1173 -381 1153 -3847 3764 1493 -4439 3069 -1863 186 6040 -4548 415 3295
1413 3295 -2844 5110 506 -4814 3574 -1076 -110 2974 -4446 833 3938 -1599 2648 -2176 -3414
1428 -3414 5779 -955 -166 1469 -6101 4035 2810 -5217 1840 -4104 -1991 6976 -4573 -1923 1129
1443 1129 -4802 6048 917 -7110 3250 -2475 781 4603 -6613 -220 1986 -2433 5869 -4365
1457 -4365 -5809 5549 -2432 2094 1622 -7735 4292 2692 -3324 4161 -5800 -1624 8609 -2699
1471 -2699 358 -72 -5016 7164 2334 -3913 3123 -3531 2220 6889 -6000 -601 1348 -2082 7653
1486 7653 -1493 -5500 5027 -1811 2940 5052 -8420 2109 3892 -2422 6662 -5641 -3898 8024
1500 8024 -3455 2148 845 -7795 6797 1350 -3509 4059 -7256 1541 7501 -5985 1340 -1781
1514 -1781 -4337 7571 -2463 -4018 2117 -4412 3249 3262 -7456 248 372 -1022 5079 -4042 -4321
1529 -4321 4007 -1786 1785 1721 -7670 2961 3467 -3887 3684 -4076 -2415 7840 -3632 843 691
1544 691 -6253 7439 225 -3997 4550 -5661 3252 5812 -6821 3538 -1242 -1890 8488 -3973
1558 -3973 -1406 3611 -3669 5112 574 -4630 3004 -596 1519 3213 -3945 -16 2314 397 1860
1573 1860 -384 -2642 2137 2331 -1510 616 -2252 -1074 4561 -2291 -726 400 -4143 4911 -147
1588 -147 -4293 3934 -4235 1369 3819 -7095 2299 -642 -2571 5635 -5144 -1390 2145 -4258 4374
1603 4374 -2400 -3502 3909 -3213 2537 909 -5089 2893 -956 -583 2280 -3663 633 1285 -337
1618 -337 928 -1200 -135 336 1601 42 -1451 1334 -925 1801 1297 -2887 2659 -510 -100 3491
1634 3491 -3741 2272 1809 -2262 4562 -2775 -355 3562 -3700 3749 -177 -2673 4555 -2680 1240
1649 1240 1480 -3958 3656 -1043 -497 2797 -3764 2347 -21 -1928 2513 -3222 750 854 -2606 1637
1665 1637 -2361 -257 1053 -1929 1548 -1686 -435 879 -2541 1659 -1588 -1007 2013 -3409 1656
1680 1656 -1100 -2263 2798 -2834 1006 1101 -2931 3164 -1847 -753 2512 -3151 2743 -123 -1651
1695 -1651 2980 -2833 1508 1062 -2021 3315 -1715 666 2040 -2374 3006 -537 -468 2972 -2337 2288
1711 2288 517 -1223 2987 -1656 1277 1446 -1539 2722 -1375 152 1800 -1932 2386 -686 -485
1726 -485 1886 -2328 1744 -288 -1596 2477 -2402 781 658 -2506 2376 -1942 -435 1601 -2752
1741 -2752 1829 -1144 -1751 1718 -3160 547 299 -2311 1824 -1849 -275 606 -2240 1472 -1047 -588
1757 -588 1355 -2012 1031 -912 -1039 1632 -1553 973 233 -1127 1939 -1423 571 973 -1254 2054
1773 2054 -710 -46 1268 -1277 2083 -217 -509 2076 -1472 1517 777 -1499 2358 -1284 526 1721
1789 1721 -1726 2052 -515 -596 2517 -1836 912 1022 -1689 2080 -629 -607 1215 -772 1021 79
1805 79 -519 420 -812 241 -224 -990 105 -89 -45 -662 -285 -488 -387 880 -1272 -501 346 -1624 1270
1824 1270 -717 -1938 1039 -1598 524 624 -3028 1378 -911 -1143 2697 -2803 58 1617 -2039
1839 -2039 1998 -727 -1692 2621 -779 450 939 -2235 1971 715 -621 1532 -1238 80 2637
1854 2637 -976 239 781 -1375 2362 1332 -1384 1259 -138 -174 2705 -1680 -297 1769 -1072 2526
1870 2526 -191 -2617 2696 -689 -73 2493 -3758 1088 1876 -2039 2412 -1687 -2047 3845 -1483 -154
1886 -154 657 -3910 2527 867 -2257 1502 -2604 -487 2816 -2872 -254 172 -2427 3184 -702 -3154
1902 -3154 1693 -1944 754 2425 -4053 360 1131 -2068 2987 -2219 -2992 3700 -1247 1148 1705 -4594
1918 -4594 2602 1484 -1904 2994 -3050 -697 4821 -2311 945 283 -3079 5108 578 -2259 2447
1933 2447 -2823 1927 4048 -3563 1217 305 -1058 4667 -2011 -2515 2576 -1372 2524 1869 -4699 1752
1949 1752 1042 -972 3189 -3163 -1917 3859 -1847 1204 -177 -4608 3603 668 -2035 2000 -4240
1964 -4240 333 4063 -3910 468 -1273 -3212 4934 -1897 -2891 1521 -3468 2289 2469 -4953 1246
1979 1246 -286 -1049 3988 -3696 -1893 2308 -1787 2973 -120 -4555 2685 149 -454 2093 -3768
1994 -3768 531 3562 -1600 1379 -927 -2590 4038 121 -1232 1268 -2855 2101 3375 -2908 950
2009 950 -320 -707 4639 -1506 -1695 2380 -1717 2785 1407 -4448 2402 90 -88 3151 -3729 -37
2025 -37 2494 -1796 2736 -1196 -2921 3120 -799 266 927 -3622 1794 1114 -1903 892 -3031 -452
2041 -452 2284 -1411 297 -620 -1765 2379 -217 -1850 358 -1250 152 1592 -2057 -833 687
2056 687 -592 1507 -413 -2418 1463 -73 161 1788 -2972 397 1654 -2011 1890 -1415 -1673 3422
2072 3422 -1396 669 1315 -2518 3180 448 -1334 2339 -2716 1315 2297 -2116 2136 -135 -502 2776
2088 2776 -1254 -139 764 -978 2232 44 -1491 493 -505 890 823 -768 -126 965 138 202 733
2105 733 -1242 -219 1283 -1271 949 -349 -907 1879 -1358 -1073 811 -3002 1039 -384 -2165 1867
2121 1867 -1500 805 1403 -2789 1177 -1178 -1098 2269 -2004 -309 616 -1754 1945 -740 -1063 1279
2137 1279 -1293 793 44 -949 1164 -295 536 48 -947 931 -137 1007 -93 -82 1196 -793 1935
2154 1935 1068 -834 1567 -843 648 1831 -1402 1536 106 -625 1583 -1087 668 400 -915 1987
2170 1987 -970 23 1194 -1487 1538 -240 -1019 1138 -1646 1133 565 -1457 1838 -1041 121 242
2186 242 -1735 1166 -1013 -280 1010 -1408 445 -1037 -594 385 -1949 634 -643 -1345 984 -1388
2202 -1388 197 379 -2162 953 -712 -515 434 -1734 1221 -228 -830 1359 -1496 900 172 -1036
2218 -1036 1860 -1195 284 1072 -1010 1182 -154 -538 1062 -1498 1451 424 -675 1976 -417
2233 -417 377 746 -912 1298 -168 82 1539 -677 693 -7 -57 1013 -1075 740 560 -672 1453
2250 1453 -665 690 78 -722 857 -1266 149 454 -1447 1221 -1115 -1078 1276 -1826 501 307
2266 307 -1444 1070 -1136 9 335 -1724 1107 -770 -1409 1132 -1499 -82 727 -989 665 -469
2282 -469 -219 499 -756 517 -320 23 738 -769 -35 -439 -230 448 317 95 -629 951 435 -218 1226
2301 1226 -803 50 1671 -991 824 -18 -683 2041 -581 99 1337 -1508 1808 605 -1233 1932
2317 1932 -976 436 1563 -1762 817 -326 -945 1664 -939 -289 890 -972 1072 307 -1822 675
2333 675 -333 -296 689 -1333 -968 769 -548 -281 -14 -1688 822 635 -934 380 -968 -284 1794
2350 1794 -1374 -395 -36 -1961 2007 -604 -1918 1352 -1584 897 1529 -2627 768 214 -693 2440
2366 2440 -1587 -596 1753 -1087 1393 45 -2298 1783 80 34 1636 -1763 548 2147 -716 884
2382 884 -703 -1306 2481 156 -612 901 -1583 1076 1973 -1918 823 -47 -620 3175 -1092 -1148 1622
2399 1622 -1494 1558 410 -2904 1219 -145 -413 1766 -2949 81 1546 -1397 1264 -903 -2186
2414 -2186 1748 -787 -421 666 -2978 1008 1067 -1772 919 -1631 -1103 2893 -1241 -1325 448 -1551
2430 -1551 1554 128 -2254 764 -674 -488 1957 -2245 -341 1578 -1217 1692 -904 -2666 2547
2445 2547 -777 728 1792 -3300 838 1754 -761 1087 -1819 -190 3127 113 306 1106 -2213 2794
2461 2794 102 -1406 1337 -1617 452 3019 -1598 11 397 -1093 2240 -572 -1805 1273 -539
2476 -539 1077 1544 -2778 255 584 -1101 1740 -1554 -1981 2384 -830 64 619 -3131 1399 913 -1341
2493 -1341 1090 -1770 -603 2310 -2095 -190 -439 -2299 2269 -183 -1764 1460 -1617 844 1538
2508 1538 -2529 83 237 -681 2051 -1512 -1310 1008 -596 1200 416 -2436 1384 311 -583 1612
2524 1612 -1301 -77 2034 -1118 285 -239 -1569 2045 264 -682 1073 -1692 298 1514 -1656
2539 -1656 598 174 -845 2065 -127 -1190 991 -1572 833 758 -2334 1260 79 -198 1815 -2099
2555 -2099 160 1665 -1306 600 -490 -1554 2071 -328 -204 505 -1667 -152 573 -794 815 -587
2571 -587 -713 1262 -620 -778 396 -1137 -54 337 -1262 539 -126 -440 1394 -578 -487 1332 -673
2588 -673 152 302 -1482 400 93 -437 1424 -436 -107 880 -1088 867 233 -799 1476 -190 -151
2605 -151 923 -1371 477 406 -664 937 -320 408 629 -143 302 224 -149 683 -11 320 12 324 261
2624 261 567 268 -620 86 284 -474 324 -505 311 191 -869 381 -334 -819 478 -664 -235 95 -882
2643 -882 531 -591 -448 172 -890 7 -184 -573 576 -826 -23 23 -668 572 -390 -342 480 -466 269
2662 269 -52 -167 465 -507 194 189 -406 530 -211 306 352 -377 592 -185 122 333 -163 771 151 24 1066
2683 1066 -3 479 323 -397 887 -246 281 526 -424 816 -359 -5 790 -780 655 459 -235
2700 -235 1009 -488 27 455 -802 530 -525 -543 413 -955 265 -166 -587 433 -677 -8 -187
2717 -187 -688 505 -654 -283 -101 -511 -73 -702 -263 -115 -570 495 -295 -376 447 -1015 621 -207 -517
2736 -517 585 -723 238 13 -574 902 -183 93 911 -956 545 309 -340 1271 -393 -8 672
2753 672 -720 902 -32 -287 802 -256 454 368 -321 600 121 91 310 -192 335 105 265 237 20 91
2773 91 -239 597 2 -424 677 -582 406 246 -754 395 -591 -7 591 -1800 316 15 -855 1102
2791 1102 -1171 -378 734 -1112 829 -327 -1138 978 -908 -450 671 -1739 281 277 -1042 631
2807 631 -424 54 850 -506 71 172 -517 585 116 -525 285 94 -29 1050 -496 -466 997 -343
2825 -343 662 559 -1317 1125 418 -612 1269 -1320 372 1498 -1139 1137 -248 -1081 1887 -650
2841 -650 -37 1075 -1625 1362 833 -951 998 -823 -256 1790 -1242 160 22 -979 1316 -164
2857 -164 -804 515 -140 368 978 -1713 -117 499 -780 646 -448 -1301 1396 48 -521 581 -2486
2874 -2486 1191 -161 -1732 91 -1606 -202 1499 -1215 -321 675 -1602 2347 440 -1918 1976
2889 1976 -1088 540 2565 -1934 -501 405 -978 1801 -836 -1546 1956 -483 1290 984 -2452 850
2905 850 1013 -366 1186 -681 -321 2653 169 -456 383 -1692 1697 443 -1144 1136 -1374 427
2921 427 2113 -1304 82 -337 -1232 2374 -770 -1756 1129 -1104 -100 1014 -2368 346 394 -681
2937 -681 1752 -1555 -508 1651 -1035 846 169 -2144 1340 2 -492 1627 -1995 -186 1587 -1368
2953 -1368 172 -236 -1620 2208 -275 -1215 681 -917 293 1521 -1164 687 17 -391 1740 -845
2969 -845 -398 1352 -225 1399 821 -1531 1493 -27 -172 1806 -1497 -258 1637 -963 1273 245
2985 245 -1082 1371 -457 -244 831 -1019 774 1217 -1018 997 -487 -756 1939 -791 -1086 911
3001 911 -920 838 512 -1435 814 -335 -421 696 -1405 -571 775 -919 1045 -240 -1430 685
3017 685 -531 -185 333 -1034 66 778 -1070 445 -345 -1016 1051 -603 -550 355 -1199 852 71
3034 71 -1083 150 -438 -98 947 -569 -356 210 -236 719 373 -1326 684 178 164 252 -366 143 672
3053 672 -602 242 -41 -801 939 28 -200 632 -253 193 628 -691 857 -47 -19 1066 -337 95
3071 95 414 -130 255 -457 -431 332 -94 113 690 -531 418 224 -297 327 -271 -618 371 -716 -616 251
3091 251 -553 -8 -82 -475 135 -59 -26 -240 -447 -335 -46 -1024 -343 63 -674 143 177 -15 110 -434 -67
3112 -67 2 -153 -205 284 -593 475 441 -129 812 -148 474 455 -157 459 330 570 107 -115 90 115 8 302
3134 302 -430 -95 42 155 533 -63 -540 58 177 81 -159 43 447 -94 1150 115 249 -335 -710 369
3154 369 -205 -547 28 -23 149 -200 -715 -73 263 239 15 -563 -30 -336 -472 268 -473 67 -498 -519 -116
3175 -116 -757 -83 223 -31 413 -216 -559 336 -222 44 509 -88 626 135 -58 867 -169 385 -55 -612
3195 -612 -259 177 410 156 456 326 244 116 65 390 707 29 484 637 275 422 -326 366 500 -419 397
3216 397 119 163 484 223 358 26 -204 562 -245 256 429 -722 153 52 -131 540 -384 -51 159 -434
3236 -434 44 -104 -131 438 -213 -213 329 -428 34 -251 -517 -273 -108 -462 94 205 -323 96 -259 -397 353
3257 353 -376 -84 691 -435 345 102 -68 1091 -456 -8 559 -887 927 560 -624 965 -524
3274 -524 200 888 -900 370 131 -293 953 -19 -375 1018 -104 394 567 -312 465 408 -227 623 -155
3293 -155 -212 783 -319 240 265 -557 148 671 -662 586 -278 -344 1063 -949 -253 635 -1208 916 9
3312 9 -1063 773 -787 68 770 -1497 216 59 -912 905 -984 -700 944 -1173 491 122 -1360
3329 -1360 868 -303 -771 534 -894 -64 998 -493 189 -29 -750 799 134 -545 673 -490 138
3346 138 1181 -1015 316 655 -564 1146 -272 -823 1217 -262 603 1081 -1254 772 374 -683
3362 -683 1076 -1048 -77 1590 -803 736 280 -1207 1273 28 -460 889 -1056 277 825 -888
3378 -888 439 -298 -670 1362 -691 -603 606 -860 618 383 -1369 288 -63 -596 770 -811 -424
3395 -424 695 -898 419 -41 -1459 1028 161 -501 757 -1382 38 1121 -1119 743 -221 -1021
3411 -1021 1647 -556 -506 796 -1306 782 694 -1333 831 -138 -67 1531 -817 19 953 -402 750
3428 750 250 -902 1151 -37 -224 1025 -1036 129 788 -524 515 -148 -666 1260 -264 -16 872
3445 872 -787 532 948 -798 509 -253 -306 1004 -688 -126 496 -908 874 13 -1128 618 -535
3462 -535 -254 846 -1199 129 185 -786 782 -520 -630 527 -553 -76 521 -1050 261 109 -474
3479 -474 628 -390 -530 717 -524 -149 348 -765 829 76 -633 700 -460 -62 946 -523 163
3496 163 339 -539 987 -75 -98 571 -327 407 565 -746 522 73 -230 871 -447 -106 703 -207
3514 -207 417 160 -369 763 254 -110 403 -204 27 531 -453 296 168 -392 433 -20 -599 123 -402 26
3534 26 235 -747 263 98 -329 177 -240 -514 426 -526 -211 1 -555 79 -29 -346 170 -564 58 264
3554 264 -413 52 -104 -369 279 -80 -367 183 -314 219 222 -513 124 69 26 432 80 -18 142 -108 193 285
3576 285 -285 89 288 60 213 -53 16 186 -48 89 172 -264 425 136 18 356 -79 62 255 -237 354
3597 354 187 5 245 -5 98 131 -210 302 157 -136 152 -283 -188 142 -331 -134 -40 -154 88 -151 -45
3618 -45 81 -247 -178 140 -261 -145 -31 -111 -162 -101 -187 13 109 -53 -56 -376 -27 -154 -318 -26 -109 -181 120 -154
3642 -154 36 215 -3 188 168 -170 446 -12 -85 381 -75 334 392 -53 31 56 -147 81 -202 221 171 18
3664 18 139 132 -170 170 139 224 78 -161 151 37 -44 68 -49 -301 309 -7 -150 164 -372 -182 229 -360
3686 -360 374 -118 -115 364 -139 -105 91 -487 233 133 -315 203 -473 18 264 -547 28 -188 -289 378 -271
3707 -271 -29 140 -469 55 180 -510 113 108 -17 201 -140 11 284 -8 65 75 -23 29 243 -334 245 111
3729 111 -84 811 -273 256 535 -61 179 411 -189 628 -226 21 395 -507 352 146 -253 664 -111 -275
3749 -275 646 -694 263 -130 -558 315 -134 -301 503 -399 -209 443 -508 138 -328 -553 350 -290 -481 228
3769 228 -424 -102 198 -506 -128 186 -448 585 -202 -497 523 -426 152 72 -771 251 271 -601 388 -523
3789 -523 -175 819 -624 174 71 -505 1043 -180 -309 653 -495 196 548 -680 408 -25 -251 935
3807 935 -399 -169 461 -241 429 569 -412 649 82 118 858 -416 -234 470 -482 342 199 -712 830
3826 830 -149 -365 344 -667 -84 747 -724 384 -27 -837 1019 -501 -430 343 -977 182 324 -1009
3844 -1009 258 -630 -596 727 -799 59 307 -763 556 -365 -590 600 -274 -244 540 -873 167 426
3862 426 -299 524 -285 -519 724 -136 -149 281 -607 380 355 -617 467 -231 -92 1053 -406 170 539
3881 539 -536 898 204 -747 752 -106 477 925 -910 286 714 -414 885 -466 -583 1029 -443
3898 -443 283 298 -972 782 242 -640 279 -510 -244 827 -607 -101 325 -765 580 -96 -702 455
3916 455 -657 -69 543 -991 -21 191 -616 688 -101 -501 819 -561 -18 604 -862 288 86 -464
3934 -464 379 -568 -74 776 -596 241 165 -536 901 338 -510 710 -183 -77 852 -422 241 381 -521
3953 -521 707 -75 -335 614 -345 90 226 -412 506 84 -214 504 -411 79 602 -394 76 83 -298 647
3973 647 13 -484 282 -325 67 355 -300 119 78 -461 763 -407 -507 280 -360 132 177 -577 212 -14
3993 -14 -202 137 -102 -339 345 -412 -95 -375 -728 177 -169 -255 -75 -437 48 252 -276 -14 36 -222 509
4014 509 26 -226 267 -408 311 377 -390 415 223 107 258 -225 105 426 -128 403 182 -182 395 -189
4034 -189 -34 378 18 150 113 -4 197 -109 -113 201 52 72 238 97 -40 137 -261 123 13 -221 137
4055 137 -66 -237 147 -158 -12 -216 -287 128 -106 -115 40 -106 -378 35 -310 -97 35 -316 -63 -241 -411
4076 -411 -97 -149 -113 91 -219 58 -208 -142 195 -190 -77 202 22 91 -7 -135 197 -59 -60 70 -74 -109 513
4099 513 175 8 73 31 73 2 135 196 -127 189 292 -70 144 35 32 150 12 -52 -43 -108 -5 95 -98 150
4123 150 76 -61 92 -138 100 -240 -241 5 13 -191 -16 -48 28 -92 -429 -59 62 -140 82 -52 -238 -59
4145 -59 -438 -182 3 -100 -166 -53 -213 -130 -200 -105 152 -237 63 -50 -427 144 -157 -223 20 -175 -51 200
4167 200 -41 114 -245 -102 259 24 325 7 34 222 -31 -70 426 -26 206 381 -115 179 211 -18 208
4188 208 80 -163 151 -154 -17 234 97 98 -10 -104 156 59 34 134 -168 -250 10 -180 75 183 -270 61
4210 61 88 50 88 -438 -302 249 -459 7 -115 -320 57 -367 -449 402 -392 -287 241 -336 13 63 -486 393
4232 393 24 -177 323 -268 -21 88 -446 255 -213 317 16 -496 -124 265 -46 331 137 -20 383 -93
4252 -93 174 527 -517 219 272 -279 325 252 44 457 41 -561 143 -433 336 347 -661 160 349 -105 574
4273 574 -299 -119 152 -491 230 -100 -645 462 -271 -220 524 -529 -119 172 -560 285 124 6 638 47
4293 47 216 41 -564 237 323 -460 299 -669 -216 515 -573 -75 371 -528 251 330 -218 398 -442 -483 701
4314 701 -527 276 289 -108 1011 -316 -187 689 -318 298 514 90 642 591 -209 796 -167 178 671
4333 671 -176 443 510 -248 102 -208 -376 -31 -1137 125 573 -716 360 112 13 470 -156 -830 546
4352 546 -209 -255 484 -837 19 -307 102 268 -794 -688 894 -589 367 431 -485 730 107 -550 186
4371 186 -727 -162 325 -800 352 41 -295 333 -93 -267 578 -347 208 416 -183 406 -171 -197 138 -125
4391 -125 -247 225 -442 261 -162 -391 467 120 -111 518 -247 87 533 -585 240 58 -225 507 10 -196
4411 -196 365 -182 336 206 -234 265 50 -91 576 -203 17 361 -463 16 -38 -278 465 -175 -43 105
4431 105 -384 -67 220 -587 122 -53 -332 265 -276 4 140 -316 72 -54 -597 154 -122 -353 395 -246
4451 -246 -128 320 -294 45 -283 -414 484 -129 -105 492 -507 214 200 -314 255 -36 -287 412 -85 165 112
4472 112 -377 443 -52 -150 180 100 111 338 -178 70 308 -270 117 184 -315 257 118 -49 266 -264 65
4493 65 83 -80 137 -197 -57 462 80 -200 -72 -378 81 41 -107 203 13 -208 123 -306 -43 48 -178
4514 -178 17 -267 -188 178 -97 -62 -136 -310 99 66 -134 -103 -120 -230 222 -45 -21 325 9 27 55 -17 -1 -186
4538 -186 -11 8 72 300 28 -284 36 234 -41 141 325 33 92 -187 227 116 127 197 -3 44 -18 -18 151
4561 151 286 -125 -94 65 179 -85 35 -133 181 -24 106 58 -117 68 215 -35 259 174 -51 87 -239
4582 -239 -100 143 -169 -67 -8 -177 22 -186 -59 24 13 -357 -287 -276 3 8 18 -45 -63 -88 -38 -185 -254 -310 -42
4607 -42 131 20 -16 28 -12 309 -157 -82 -13 223 -18 176 -125 -91 20 15 61 172 -23 209 -123 -13 128
4630 128 37 65 147 157 118 90 -201 147 -139 226 96 78 174 139 -51 105 25 -93 73 -137 151 64 -41 -72
4654 -72 -169 -74 144 -61 154 -166 -233 52 -7 -245 41 -141 64 66 -380 132 191 -27 110 -271 -358 10 -48
4677 -48 -44 162 -228 12 103 -49 123 -220 -344 364 -137 -271 194 -44 -21 336 -187 130 135 -6 173 -34
4699 -34 -156 134 87 117 -2 62 288 -70 217 212 -128 214 97 -93 336 -176 -13 289 -299 73 -227 -194
4721 -194 216 -79 -150 150 7 -145 74 -642 -69 -167 -233 69 -72 -474 -125 -263 161 -148 263 288 -688
4742 -688 -545 60 -172 12 765 -31 -115 552 -365 37 -235 -239 -332 -360 -154 -533 97 -61 25 -607 -199 60
4764 60 -633 568 -232 -426 69 117 523 -29 -429 -302 -314 -218 950 -403 217 -458 264 -15 23 -111 -239
4785 -239 -330 -463 -103 16 703 415 -411 297 -458 -142 -131 -172 566 213 -493 103 -3 -87 272 -230 -785
4806 -785 -483 -250 -781 -255 -682 -533 104 118 -114 -204 -83 303 -1026 -2 229 -186 312 -544 -134 22
4826 22 -345 -658 -119 237 -47 134 -251 564 183 -102 -35 -173 -363 698 -1013 186 787 -111 502 -793
4846 -793 -199 374 168 182 21 -145 511 -128 45 44 -189 1126 13 -80 922 -358 349 131 84 877
4866 877 262 137 287 -231 -226 70 -20 -54 272 -953 -184 201 -220 168 -220 475 543 -290 96 559 103
4887 103 429 -45 -416 755 358 -754 76 -984 -162 -236 -252 -138 0 -56 277 130 199 262 -370 -404 -125
4908 -125 -310 360 -383 -323 3 -754 -11 -3 17 28 291 -148 255 -168 463 567 -822 320 505 -290 278
4929 278 60 -314 179 42 93 -67 -229 -175 85 -426 427 266 174 592 -353 59 297 1 102 304 102
4950 102 160 93 -86 -335 -255 292 44 303 229 12 -236 -126 -161 -312 319 -397 -523 124 -277 -34 3 -621
4972 -621 -1 -450 -149 407 -298 -192 -103 -68 -151 76 85 78 7 135 -50 -311 -198 42 -365 -9 -258 -359 87
4995 87 301 365 155 -27 441 -173 78 38 -27 -91 19 -35 -478 41 -311 33 133 21 -202 -181 -205 66 232
5018 232 328 -39 4 81 -352 -266 281 -102 -133 90 -78 279 66 -207 47 1 -247 95 -204 92 240 -358
5040 -358 115 143 -215 54 -254 -11 -206 99 -92 228 102 97 125 195 -136 -580 -68 -254 -64 242 370 -26
5062 -26 98 35 -245 180 555 -32 315 -195 34 222 148 438 -5 -63 334 -63 225 197 -166 -136 -106 19
5084 19 -59 -89 108 -76 -350 154 42 164 -90 203 -109 116 -178 90 -406 -147 57 -101 -437 8 135
5105 135 -281 -71 -34 -26 -73 8 142 82 -29 -122 7 -231 10 -163 31 -105 232 -1 -294 38 36 112 -127
5128 -127 -231 -233 43 141 -304 -160 -73 127 57 -288 190 -8 -108 155 69 -86 106 223 165 417 -97 54
5150 54 100 16 338 -31 116 189 168 261 178 -23 -85 -373 134 282 46 -18 99 192 441 -10 23 253 -98 -55
5174 -55 104 -284 -97 102 -270 201 -243 -51 267 -309 -152 54 -112 -24 -141 -207 -177 -228 128 -55 -10 78
5196 78 169 -264 -172 -36 -103 159 -442 -55 -163 -108 217 170 -139 343 -1 -162 172 -61 255 -94 5 241
5218 241 -362 30 287 -324 69 17 -42 247 351 -41 211 -138 158 103 -110 163 48 -428 91 282 -298
5239 -298 465 -196 -46 78 -174 -44 -13 -131 216 -118 -516 -121 -414 55 337 -456 48 -167 -210 -103 -469
5260 -469 -22 -74 -568 74 -6 5 100 147 -322 129 -286 -182 55 -486 197 53 -522 591 -227 160 312
5281 312 -162 326 -332 -29 91 199 -375 6 -378 65 287 81 302 534 -257 192 -209 162 143 -322
5301 -322 949 81 -132 120 202 -569 227 -458 211 73 244 -57 -157 -387 773 420 -383 216 -592 52
5321 52 772 -117 207 -97 -230 -753 -291 -164 403 -109 -214 198 -242 316 256 -595 261 65 -109 -129 136
5342 136 -152 19 52 433 108 -739 -299 -65 -455 324 -385 -242 55 -77 147 -466 -157 -393 -312 121 -233
5363 -233 -370 -283 226 -155 -83 -3 117 471 -357 21 168 11 549 -29 -254 391 70 566 69 -284 -63
5384 -63 -152 539 132 -239 -439 342 285 -177 770 -417 224 -228 351 354 -232 101 308 -370 -386 78 100 600
5406 600 -117 186 -693 -518 52 181 -313 -94 -30 -236 176 89 -145 182 -658 -123 120 -148 -10 -130 122
5427 122 242 -236 -196 140 -126 -308 260 -77 -544 29 -408 -515 -173 -275 17 -478 208 -321 -467 124
5447 124 -477 24 11 2 57 -456 274 202 -188 -91 737 -65 198 186 -80 -236 -779 -145 -130 68 727 -250 -384
5470 -384 60 -81 -355 -117 322 -394 215 -587 -488 -485 253 727 -608 -334 150 22 -236 689 282 -265 255
5491 255 -209 -68 -679 -141 231 -722 -279 268 -212 182 -393 -201 -51 101 -226 -444 154 -29 158 34
5511 34 -243 -331 -139 -160 12 389 52 -358 -31 270 117 -185 134 -418 -536 63 -46 53 299 200 298 440
5533 440 -16 -388 -129 -663 201 -457 370 292 520 -252 422 -3 444 -205 -74 252 -149 -279 -331 357 646
5554 646 439 -201 88 -282 -116 187 86 -63 96 -424 -19 195 66 -445 -46 -540 79 -308 186 -167
5574 -167 211 -123 -58 25 -126 136 256 -221 -212 257 -47 -220 -288 405 516 138 -157 3 329 70 -199 451
5596 451 229 -445 -228 -203 6 -15 -134 -352 41 491 193 -259 128 448 -220 188 293 72 -162 274 366
5617 366 264 -32 127 -161 -240 -368 475 -46 50 395 -165 683 375 681 494 -21 -381 184 -87 362 -242
5638 -242 321 -445 -79 -584 -495 38 -140 190 -233 196 -170 172 288 107 -282 -331 -234 -20 26 -272 297
5659 297 513 256 79 39 -353 -74 83 -457 343 -293 291 96 177 -293 -332 -49 338 238 -81 340 -490
5680 -490 11 266 -367 636 125 42 -132 -21 232 590 25 166 -1194 205 -457 317 -340 -313 -892 -854
5700 -854 120 -628 -207 -185 200 22 -674 -78 318 -469 327 -543 712 -72 -818 -179 -423 -815 -50 -133
5720 -133 643 286 -207 75 734 -753 364 209 -526 -725 44 -68 -237 360 -211 -970 236 -230 233
5739 233 -244 397 -551 -124 8 20 -1 -282 -935 743 -242 -55 -146 -92 3 -235 29 -125 664 449 937
5760 937 -538 247 680 -522 494 333 373 220 -1140 -494 -137 -373 -498 -414 -395 437 302 -523 58 -58
5780 -58 -482 -778 -595 -102 170 -441 -674 565 -207 319 327 208 -460 -29 356 5 -285 587 -989 -269
5800 -269 -29 -221 750 -414 -524 -341 439 -58 314 4 493 439 -513 -356 124 -279 397 377 390 201 398
5821 398 -128 301 156 -201 -518 -142 -574 585 -16 -631 275 6 181 -131 527 509 158 349 -282 -942
5841 -942 107 -230 -143 301 -227 304 358 -139 -32 49 142 -431 -688 -294 244 335 374 -667 220 769 131
5862 131 -100 -85 544 31 -45 -240 -352 476 -330 76 -138 359 233 114 578 433 226 243 -245 163 506
5883 506 -108 -185 501 334 189 312 -37 -40 -191 -339 49 -205 324 106 -69 223 347 114 -29 -183 -10
5904 -10 140 -139 9 322 -137 -79 205 -24 102 226 149 153 -231 14 48 27 -147 -92 -237 -184 118 38 114 57
5928 57 95 -71 -214 233 -173 36 -99 -201 207 -26 29 117 39 -13 309 -296 68 -91 -21 22 -67 -104 -25 -164
5952 -164 -306 -61 20 -16 25 -142 -81 -90 -257 146 -34 66 36 49 113 -46 158 227 27 -30 -23 -68 94 155 33
5977 33 101 -89 -94 242 52 48 186 187 42 -10 109 100 -123 -8 -62 108 -30 -69 170 153 114 -124 263 -97 285
6002 285 82 -103 206 -10 -70 -59 -193 -155 151 -103 71 6 -287 111 55 -198 -144 -117 -92 -129 -123 -90 218 -201
6026 -201 114 17 -46 9 51 -109 16 140 -2 196 -75 135 33 2 201 9 204 100 -183 -209 62 153
6048 153 56 134 112 52 -78 -144 -10 -135 219 20 -267 118 -25 13 59 226 46 93 212 6 140 33 85
6071 85 33 182 49 -56 133 -59 236 -38 -52 -59 40 -23 41 15 101 -58 23 -307 215 -413 174 35 -35 -148
6095 -148 122 -93 51 -234 -303 -40 -125 3 60 -51 190 69 -38 -142 54 -46 -136 57 -64 -121 -120 105
6117 105 68 -135 115 10 -206 264 -227 -211 -355 -138 117 192 266 122 -289 -180 -4 -129 303 -77 -10 268
6139 268 173 -19 -246 -43 247 -66 104 197 -430 75 326 196 -133 0 -325 -65 -447 -76 -257 389 6
6160 6 -211 -310 -292 -254 -170 168 -351 -586 -241 -534 349 -33 -366 -318 61 -841 -95 92 -367 321 -320 462
6182 462 225 -220 133 472 510 153 -319 -184 197 -390 18 -261 -473 313 185 119 -268 192 -525 294 -65
6203 -65 46 425 252 -286 -187 -213 294 15 75 15 144 695 -405 237 635 184 -455 167 -476 222 -121
6224 -121 -427 429 -131 645 244 33 56 -142 -55 270 56 -490 210 -253 6 108 -427 -83 -8 31 -111
6245 -111 -375 -275 64 272 -432 -258 6 17 -211 -422 94 -488 183 -261 -119 186 55 -370 88 36 143
6266 143 -22 13 -245 -16 227 378 -38 298 -182 -258 -172 161 -212 -126 327 524 173 -389 -537 108 103 -344
6288 -344 -147 -639 -76 -178 107 -309 -100 68 148 68 -57 -68 -362 -115 196 -126 -27 -70 -369 -168 -478 248
6310 248 -79 -42 208 188 -272 225 -421 -43 79 -188 96 266 -576 261 -291 250 -91 -457 54 88 -625
6331 -625 -5 164 367 722 113 -70 -425 -581 146 -56 128 225 -202 -67 -42 174 -45 279 -87 352 -217
6352 -217 52 141 -59 63 43 -72 136 -11 -250 141 14 119 41 -27 172 -58 68 -17 8 18 99 0 40
6375 40 101 38 -383 75 -67 226 -5 -3 190 -25 127 -90 -107 32 -260 -140 -123 48 -6 -90 -158 -9 88 -3
6399 -3 -119 43 -26 79 33 -65 -95 -59 168 -113 -303 -65 116 -156 191 -110 -37 57 -21 52 38 -117 81 -216
6423 -216 -49 -185 209 -23 43 -51 103 100 -119 -52 56 219 -39 15 130 254 27 319 16 -147 -12 -107
6445 -107 -77 43 -92 165 -93 -149 -132 -130 113 65 146 -205 -114 -347 35 22 56 57 4 -20 -70 -19 219 -168 -233 -50
6471 -50 -127 -81 103 161 112 171 84 -87 -48 -49 53 -43 -62 199 -132 -291 -34 -269 160 119 278 17 -194 152
6495 152 148 171 -67 132 -73 137 53 24 -24 -209 -113 130 13 -197 9 58 -66 170 107 -46 -127 -84 -189 -180
6519 -180 3 -2 -1 -212 -70 -38 -71 17 52 -320 -105 -71 -79 -46 -128 -146 127 272 92 -37 4 187 3 3 54 40
6545 40 -82 86 20 174 24 76 65 85 123 -172 -81 -39 174 -103 137 65 -101 79 74 141 180 -62 -115 96 20
6570 20 -120 64 86 -28 -63 -37 322 -71 199 68 379 -174 46 -28 -12 213 -192 -54 30 -79 184 -39
6592 -39 -61 -140 -151 -245 190 -172 -184 111 -109 -43 -119 -166 -71 253 -47 159 20 144 -99 -306 70 56 -60 -280
6616 -280 -75 238 49 -215 20 41 -157 -41 -191 25 55 -38 72 -331 -236 -84 -60 -166 276 136 -94 51
6638 51 37 175 -55 -31 158 -135 -110 53 -75 165 34 247 168 -170 24 102 89 -4 288 198 146 147 33 185
6662 185 -245 9 -23 -46 184 298 264 245 -68 114 -90 -142 124 -29 -78 138 -146 -127 143 -4 15 171 119
6685 119 -7 310 -46 -69 13 40 180 -153 113 86 -310 -141 -14 120 60 -40 -12 349 68 -8 217 -186
6707 -186 77 -67 -92 142 -22 -175 -2 -146 -13 -364 -84 -137 -23 194 -25 -5 48 62 -123 -75 4 8 143
6730 143 65 43 212 22 5 247 -49 199 217 -14 126 -60 -42 65 -72 -153 -102 -97 -31 50 -198 101 -31 243
6754 243 -133 6 246 -36 -252 -141 -47 -49 -224 160 -306 -96 -161 -240 -82 -210 -163 -165 -55 61 79 91 43 75
6778 75 110 -93 27 25 -58 -32 81 -249 175 90 -96 -177 -104 24 -92 -137 -144 251 -70 -114 57 59 -11 27 -138 44
6804 44 -59 91 31 -24 35 -35 -28 157 122 -131 -36 -108 38 -132 132 15 -110 16 -55 219 214 53 -4 102 -148
6829 -148 -235 2 -326 117 -39 -122 -60 26 33 71 -31 -205 -10 -158 -67 -255 -150 126 238 -168 166 82 -7
6852 -7 60 -257 98 -17 122 -74 1 195 -87 -56 140 13 -155 -69 79 27 9 84 -85 103 46 -126 -178 153
6876 153 108 -116 -68 283 112 187 80 -138 36 21 -35 -75 -106 96 183 158 -42 136 110 -146 -18 -235 -29
6899 -29 -215 39 13 -9 -17 -92 87 -127 -125 112 -55 112 29 -159 -260 -54 245 157 25 -152 19 -90 -269
6922 -269 108 -67 15 206 -67 -108 -144 117 -4 -164 -262 30 3 247 27 188 -148 -308 -317 217 28 -125
6944 -125 -11 -168 -109 -87 -51 -79 52 151 77 -7 -35 98 -38 -243 124 -218 -10 124 177 249 -168 62 -79
6967 -79 92 -78 32 197 -356 3 191 1 -98 -41 -478 76 -179 89 324 -27 177 57 61 9 -139 20
6989 20 -20 -260 37 -183 16 -94 -184 -271 -307 -233 -101 55 179 44 -121 91 -104 -52 135 -251 -160 -39 -246
7012 -246 -124 -71 -236 34 308 -82 256 -26 -180 -162 -142 368 -281 -245 187 -15 239 -130 -88 -26 70 -259
7034 -259 -33 -296 72 9 293 72 394 -21 -161 25 123 46 -38 -182 -283 -98 -154 -341 -254 -1 325 -114
7056 -114 152 283 -159 164 90 -378 -150 239 -292 280 -2 391 110 178 -26 -130 40 -68 -144 104 225
7077 225 435 -182 -268 -111 366 -111 34 -113 413 -306 440 -116 -58 -185 -140 29 214 -344 147 404 401 372
7099 372 -22 159 -21 306 -119 110 488 204 -160 230 -33 468 107 -223 206 -160 -334 -364 319 -395
7119 -395 48 -117 190 -488 -987 289 -490 -44 58 -30 8 339 26 519 59 -307 127 55 -171 -130 -216
7140 -216 160 -2 -351 643 -11 -60 80 94 -295 421 559 108 178 -141 -381 297 -58 -453 155 50 -62
7161 -62 -741 -167 -2 -357 587 269 334 -187 484 51 -333 206 -164 -307 697 40 196 -344 -604 -341
7181 -341 419 232 -426 269 265 -605 1038 -366 138 617 -114 -129 19 -118 -402 -275 -466 934 132 74
7201 74 -263 -202 -713 290 241 99 -100 -154 -408 542 -472 268 -248 -286 983 9 68 245 -28 -610 -343
7222 -343 27 -140 294 -74 540 -31 260 56 -581 -704 -220 72 -44 -45 99 -272 144 227 -341 244 -745
7243 -745 4 224 -275 73 109 -149 -55 442 147 508 158 -219 -150 168 -52 -21 203 64 110 -258 323 -211
7265 -211 -193 -111 396 112 -165 375 85 2 53 526 -101 152 153 168 208 -16 -146 238 670 -349 -346 227 178
7288 178 285 -457 143 409 178 236 -388 12 -97 -236 136 -120 -327 477 130 -306 110 -343 191 270 -158
7309 -158 -274 161 16 -171 -24 -114 -84 -297 -449 -618 -354 -186 194 -178 61 -151 -151 -84 201 -151 -59 103
7331 103 16 211 17 -86 -237 -63 610 -73 343 -134 398 179 -62 127 165 204 193 7 -164 -102 -116 -168
7353 -168 -21 -100 9 152 -351 138 -322 339 -148 -339 200 -332 139 90 -121 -70 -163 84 -162 589 -190
7374 -190 65 430 15 -313 -149 7 168 444 -251 195 -255 47 247 136 151 -80 -256 -77 -297 67
7394 67 491 373 -150 48 -250 -72 140 427 348 -489 50 0 -48 197 62 -285 215 222 -498 61 69 -147 -159
7417 -159 -257 -38 -26 -251 200 355 249 40 -24 -155 -7 -333 307 -63 468 370 -262 -92 171 -179 98
7438 98 77 -122 -139 -60 317 -39 -411 -23 290 -58 -349 -188 -153 111 -297 -390 -346 -184 428 -31 -484 -346
7460 -346 19 68 28 -388 98 363 264 -35 444 165 -199 -231 200 479 -168 -188 -121 -513 482 -267 104 -370
7482 -370 41 247 147 -688 -31 400 -54 5 -277 243 -312 -67 239 -210 20 -58 -440 -292 -490 118 -194
7503 -194 -144 -355 245 83 -411 -66 -309 5 26 251 -583 -35 211 -189 124 -51 -394 310 158 116 24
7524 24 191 -10 188 -639 -76 -348 90 14 215 -112 525 -554 -27 -13 -375 494 -192 -422 -119 -28 -69
7545 -69 -263 461 73 23 -38 349 -297 365 35 -483 133 -420 41 -63 99 218 348 -682 33 225 -148
7566 -148 123 419 -278 242 344 59 348 -316 111 581 -28 -89 170 -320 -590 235 -502 74 -139 175
7586 175 -533 -119 107 362 -54 67 -78 162 81 244 384 173 58 -427 -204 342 511 38 297 -153
7606 -153 -415 265 -300 112 174 88 551 -8 -11 385 87 618 90 -108 590 150 364 367 219 -353 382 391 431
7629 431 160 303 -147 -425 249 -27 310 73 -86 -307 422 435 264 4 -124 -279 -108 -119 178 -5 750
7650 750 161 106 538 470 -541 154 -28 45 370 171 -180 17 54 125 91 -34 -355 -184 -142 -30 -273 145
7672 145 -2 -131 237 135 168 -320 88 -54 -54 -292 95 -36 143 60 104 112 40 288 115 346 -300 -210 158
7695 158 105 395 -145 303 231 80 252 267 -449 -149 48 -231 -70 -32 -152 -5 32 189 -379 59 -118 -379
7717 -379 -71 -134 157 -98 -366 155 -246 -110 -183 -19 -193 83 -161 18 64 57 -304 145 170 25 635 -199
7739 -199 53 375 -199 -89 582 126 222 98 -72 235 672 -156 390 227 -322 -51 -216 466 357 -221
7759 -221 -133 -44 151 208 -156 329 -219 91 12 -121 103 394 251 -201 125 -101 -106 33 -459 416 -81 -6
7781 -6 -94 147 82 -54 -230 34 136 253 210 -100 1 86 416 276 39 87 325 96 -37 -122 -114 201 14
7804 14 143 134 -40 196 -197 -50 -32 -36 93 125 539 -147 64 163 64 -2 -332 57 178 -1 165 -12 -6 -14 167
7829 167 -119 -90 -194 -170 46 278 -36 10 108 -216 123 -248 -124 -274 -22 285 356 204 -111 34 -11 -250
7851 -250 -149 305 11 -82 131 167 -122 172 15 1 181 -103 128 251 -318 312 76 6 -122 -396 228
7872 228 -487 -766 -62 -280 213 104 243 -77 -200 31 185 -170 225 -258 192 294 -26 138 323 -319
7892 -319 -501 42 -239 -181 -383 33 -606 -216 -144 -96 351 -576 66 103 -14 436 -46 -886 -241 -5 168
7913 168 -163 -252 51 -102 169 -164 615 654 954 757 -564 475 272 307 -402 -790 -120 84 -789 265
7933 265 597 -276 356 -95 -425 -484 -290 -65 343 28 254 -361 318 -103 -107 -233 -170 174 137 429 60 199
7955 199 229 -53 488 291 622 -209 375 286 -131 -587 -428 83 342 49 171 163 -14 276 -773 -102 35
7976 35 5 297 804 -436 -25 -412 -173 -412 -91 -66 10 -14 121 34 -299 161 154 -266 -579 -1193 -189 -363
7998 -363 444 -571 509 295 532 190 -115 -41 -770 419 -69 -152 551 -173 -222 113 74 351 -359 81
8018 81 130 68 -205 125 -22 93 -39 196 -100 -115 174 62 -89 -90 4 -76 68 -170 22 -91 -134 -178 -49
8041 -49 -99 -63 -60 -109 -136 -3 -41 -80 -93 -129 216 144 147 -136 77 -62 -143 -45 143 45 88 -37 190 284 447 -55
8067 -55 -54 -84 -169 186 -105 48 -26 -509 95 -418 71 24 -40 -56 195 11 -109 -60 84 69 -225 -93 639 911
8091 911 282 59 -252 211 -852 442 -263 -579 703 -572 128 68 146 -544 -126 165 -244 -128 299
8110 299 73 749 -80 -596 -257 -95 -755 -211 -79 -401 -326 -406 -851 -331 -260 541 274 -198 -662 140 320
8131 320 104 -472 -43 21 -19 115 -53 -546 -217 -304 329 -264 155 54 318 272 262 195 -210 -122 162 129 -277
8154 -277 -250 -596 -84 -224 -193 -281 418 -13 -68 14 652 417 -150 513 127 -382 128 -119 -35 -28 -152 335 404
8177 404 -265 -63 -536 -293 -220 92 -508 98 268 -385 -33 -596 -112 119
8191A19
##END NTUPLES=NMR FID
##END=
