##TITLE=1H_SR28
 CDCl3, 8 sc, 
 23.12.2020
##JCAMPDX= 6.0         $$ Bruker NMR JCAMP-DX V2.0
##DATA TYPE= NMR FID
##DATA CLASS= NTUPLES
##ORIGIN= UXNMR, Bruker Analytische Messtechnik GmbH
##OWNER= root
$$ XWIN-NMR		Version 3.5
$$ Wed Dec 23 10:19:24 2020 Russian Standard Time (UT+4h)  she@DPX200
##.OBSERVE FREQUENCY= 200.1315066352
##.OBSERVE NUCLEUS= ^1H
##.DELAY= (6, 6)
##.ACQUISITION MODE= SIMULTANEOUS
##.ACQUISITION SCHEME= undefined
##.AVERAGES= 8
##.DIGITISER RES= 18
##SPECTROMETER/DATA SYSTEM= spect
##.PULSE SEQUENCE= zg30
##.SOLVENT NAME= CDCl3
##.SHIFT REFERENCE= (INTERNAL, CDCl3, 0, 15.7039)
##AUDIT TRAIL= $$ (NUMBER, WHEN, WHO, WHERE, WHAT)
$$ ##TITLE= Audit trail, XWIN-NMR		Version 3.5
$$ ##JCAMPDX= 5.01
$$ ##ORIGIN= Bruker BioSpin GmbH
$$ ##OWNER= she
$$ F:/spectra/data/she/nmr/H-F/1/audita.txt
$$ ##AUDIT TRAIL=  $$ (NUMBER, WHEN, WHO, WHERE, WHAT)
(   1,<2020-12-23 10:18:27.67 +0400>,<she>,<DPX200>,
      <created by zg, POWCHK disabled, PULCHK disabled
       configuration hash MD5:
       00 E9 B6 7A A2 85 ED C7 34 08 36 98 17 FE 4E 26
       data hash MD5: 16K
       B9 B7 5F 2B 42 DF 6E 1A 04 9A FA 61 C8 AB 81 7D>)
$$ ##END=
$$ 
$$ hash MD5
$$ 22 F0 C9 60 45 22 41 75 EE F5 25 32 25 FE AE 38
##$RELAX= 
##$RELAX= 
##$RELAX= 
##$RELAX= 
##$RELAX= 
##$RELAX= 
$$ Bruker specific parameters
$$ --------------------------
##$DU= <F:/spectra>
##$EXPNO= 1
##$NAME= <H-F>
##$PROCNO= 1
##$TYPE= <nmr>
##$USER= <she>
##$AMP= (0..31)
100 100 100 100 100 100 100 100 100 100 100 100 100 100 100 100 100 100 
100 100 100 100 100 100 100 100 100 100 100 100 100 100 
##$AQSEQ= 0
##$AQ_mod= 1
##$AUNM= <au_zg>
##$AUTOPOS= <>
##$BF1= 200.13
##$BF2= 200.13
##$BF3= 200.13
##$BF4= 200.13
##$BF5= 200.13
##$BF6= 200.13
##$BF7= 200.13
##$BF8= 200.13
##$BYTORDA= 1
##$CFDGTYP= 0
##$CFRGTYP= 5
##$CHEMSTR= <none>
##$CNST= (0..31)
1 1 145 1 1 1 1 1 1 1 1 1 1 1 1 1 1 1 1 1 1 1 1 1 1 1 1 1 1 1 1 1 
##$CPDPRG= <>
##$CPDPRG1= <>
##$CPDPRG2= <>
##$CPDPRG3= <>
##$CPDPRG4= <mlev>
##$CPDPRG5= <mlev>
##$CPDPRG6= <mlev>
##$CPDPRG7= <mlev>
##$CPDPRG8= <mlev>
##$CPDPRGB= <>
##$CPDPRGT= <>
##$D= (0..31)
0 1.2 0 0 0 0 0 0 0 0.06 0 0.03 0 0 0 0 0.0002 0 0 0 0 0 0 0 0 0 0 0 0 
0 0 0 
##$DATE= 1608704307
##$DBL= (0..7)
120 120 120 120 120 120 120 120 
##$DBP= (0..7)
150 150 150 150 150 150 150 150 
##$DBP07= 0
##$DBPNAM0= <>
##$DBPNAM1= <>
##$DBPNAM2= <>
##$DBPNAM3= <>
##$DBPNAM4= <>
##$DBPNAM5= <>
##$DBPNAM6= <>
##$DBPNAM7= <>
##$DBPOAL= (0..7)
0.5 0.5 0.5 0.5 0.5 0.5 0.5 0.5 
##$DBPOFFS= (0..7)
0 0 0 0 0 0 0 0 
##$DE= 6
##$DECBNUC= <off>
##$DECIM= 32
##$DECNUC= <off>
##$DECSTAT= 4
##$DIGMOD= 1
##$DIGTYP= 9
##$DL= (0..7)
0 120 120 120 120 120 120 120 
##$DP= (0..7)
150 150 150 150 150 150 150 150 
##$DP07= 0
##$DPNAME0= <>
##$DPNAME1= <>
##$DPNAME2= <>
##$DPNAME3= <>
##$DPNAME4= <>
##$DPNAME5= <>
##$DPNAME6= <>
##$DPNAME7= <>
##$DPOAL= (0..7)
0.5 0.5 0.5 0.5 0.5 0.5 0.5 0.5 
##$DPOFFS= (0..7)
0 0 0 0 0 0 0 0 
##$DQDMODE= 0
##$DR= 18
##$DS= 0
##$DSLIST= <SSSSSSSSSSSSSSS>
$$ [...]
##$SUBNAM2= <"">
##$SUBNAM3= <"">
##$SUBNAM4= <"">
##$SUBNAM5= <"">
##$SUBNAM6= <"">
##$SUBNAM7= <"">
##$SUBNAM8= <"">
##$SUBNAM9= <"">
##$SW= 16.9725356469052
##$SWIBOX= (0..15)
0 0 2 0 0 0 0 0 0 0 0 0 0 0 0 0 
##$SW_h= 3396.73913043478
##$TD= 16384
##$TD0= 1
##$TE= 0
##$TE2= 300
##$TE3= 300
##$TEG= 300
##$TL= (0..7)
0 120 120 120 120 120 120 120 
##$TP= (0..7)
150 150 150 150 150 150 150 150 
##$TP07= 0
##$TPNAME0= <>
##$TPNAME1= <>
##$TPNAME2= <>
##$TPNAME3= <>
##$TPNAME4= <>
##$TPNAME5= <>
##$TPNAME6= <>
##$TPNAME7= <>
##$TPOAL= (0..7)
0.5 0.5 0.5 0.5 0.5 0.5 0.5 0.5 
##$TPOFFS= (0..7)
0 0 0 0 0 0 0 0 
##$TUNHIN= 0
##$TUNHOUT= 0
##$TUNXOUT= 0
##$USERA1= <user>
##$USERA2= <user>
##$USERA3= <user>
##$USERA4= <user>
##$USERA5= <user>
##$V9= 5
##$VALIST= <valist>
##$VCLIST= <CCCCCCCCCCCCCCC>
##$VD= 0
##$VDLIST= <DDDDDDDDDDDDDDD>
##$VPLIST= <PPPPPPPPPPPPPPP>
##$VTLIST= <TTTTTTTTTTTTTTT>
##$WBST= 1024
##$WBSW= 4
##$XGAIN= (0..3)
0 0 0 0 
##$XL= 0
##$YL= 0
##$YMAX_a= 275376
##$YMIN_a= -314426
##$ZGOPTNS= <>
##$ZL1= 120
##$ZL2= 120
##$ZL3= 120
##$ZL4= 120
##$ABSF1= 10
##$ABSF2= 0
##$ABSG= 5
##$ABSL= 3
##$ALPHA= 0
##$AQORDER= 0
##$ASSFAC= 0
##$ASSFACI= 0
##$ASSFACX= 0
##$ASSWID= 0
##$AUNMP= <proc_1d>
##$AZFE= 0.1
##$AZFW= 0.1
##$BCFW= 1
##$BC_mod= 2
##$BYTORDP= 1
##$COROFFS= 0
##$CY= 11.3945322036743
##$DATMOD= 1
##$DC= 2
##$DFILT= <>
##$DTYPP= 0
##$F1P= 15.9154993809931
##$F2P= -4.1035820241983
##$FCOR= 0.5
##$FTSIZE= 0
##$FT_mod= 4
##$GAMMA= 1
##$GB= 0.15
##$INTBC= 1
##$INTSCL= 1
##$ISEN= 128
##$LB= 0.24
##$LEV0= 0
##$LPBIN= 0
##$MAXI= 10000
##$MC2= 0
##$MEAN= 0
##$ME_mod= 0
##$MI= 1.114404
##$NCOEF= 0
##$NC_proc= 0
##$NLEV= 6
##$NOISF1= 3.799351
##$NOISF2= 2.8
##$NSP= 1
##$NTH_PI= 0
##$NZP= 0
##$OFFSET= 15.70392
##$PC= 1
##$PHC0= -10760.61
##$PHC1= 9.60095
##$PH_mod= 1
##$PKNL= yes
##$PPARMOD= 0
##$PSCAL= 0
##$PSIGN= 0
##$REVERSE= no
##$SF= 200.130013532006
##$SI= 16384
##$SIGF1= 3
##$SIGF2= 2
##$SINO= 400
##$SIOLD= 16384
##$SREGLST= <1H.CDCl3>
##$SSB= 0
##$STSI= 0
##$STSR= 0
##$SW_p= 3612.71676300578
##$SYMM= 0
##$S_DEV= 0
##$TDeff= 0
##$TDoff= 0
##$TI= <>
##$TILT= no
##$TM1= 0
##$TM2= 0
##$TOPLEV= 0
##$USERP1= <user>
##$USERP2= <user>
##$USERP3= <user>
##$USERP4= <user>
##$USERP5= <user>
##$WDW= 1
##$XDIM= 8192
##$YMAX_p= 0
##$YMIN_p= 0
$$ End of Bruker specific parameters
$$ ---------------------------------
##NTUPLES= NMR FID
##VAR_NAME=  TIME,          FID/REAL,        FID/IMAG
##SYMBOL=    X,             R,               I
##VAR_TYPE=  INDEPENDENT,   DEPENDENT,       DEPENDENT
##VAR_FORM=  AFFN,          ASDF,            ASDF
##VAR_DIM=   8192,          8192,            8192
##UNITS=     SECONDS,       ARBITRARY UNITS, ARBITRARY UNITS
##FACTOR=    0.0002944,     1,               1
##FIRST=     0,             0,               0
##LAST=      2.4114304,     0,               0
##MIN=       0,             -314426,         0
##MAX=       2.4114304,     275376,          0
$$ Real data points
##PAGE= N=1
##DATA TABLE= (X++(R..R)), XYDATA
$$ [...]
2090b08L15J275k914K087L97j375J100m98m11J074k13n19j48K3j27J179j223k00
2108c86J491j229P96K30j930J804o81m94J869k487J315P56k176K428k028l57K684
2125A605k939J636M21k509L023j582k77J156j997K146l88j442J658j487R37L37
2141B98j155J303p19J99P14r42M84n31K04k64k75O75p07J081M70j819J556j146
2159e74mJ863k767K132j145p87K493j495L9J209k167K352j196j03J688k090J516
2176I64l07j036J738j889M97J235k350J829p96k49J530j884J519m41j287J956
2192A029j484O84r4n48R51j191P15K07j124J324p37p4K82j156J516o5j053J721
2210I03j723O21O30j557J716j605R04L42j569J555p20k43P53q71Q11M12j067J606
$$ plain form
2090 -208 107 1382 -1532 555 952 -423 677 179 -232 842 629 110 -38 -15 -142 1037 -186 -386
2108 -386 1105 -124 672 902 -1028 776 95 -399 1470 -1017 298 1054 -1122 1306 -722 -1079 1605
2125 1605 -1334 302 723 -1786 1237 -345 -622 534 -1463 683 295 -1147 511 -976 -39 298
2141 298 -857 446 -273 -74 640 -302 182 -349 -145 -409 -684 -9 -716 365 835 -984 572 -574
2159 -574 -578 1285 -1482 650 -495 -1282 1211 -284 -245 964 -1203 1149 -47 -150 1538 -552 964
2176 964 657 -379 1359 -530 -33 1202 -1148 681 -115 -364 1166 -718 801 360 -927 1029
2192 1029 -455 229 135 -413 538 -653 62 269 -855 469 -268 -342 -60 -1216 300 235 -818 903
2210 903 -820 -199 431 -1126 590 -1015 -111 231 -1338 217 -503 -746 7 -864 -53 359 -708 898
2228H98j749J048L34j595J530r40K20J282j538Q96mj118J163l03N38l49o30J231
2246I14j029P13N66j719J171j086Q99N56j587J342q62q6J792k072Q32n5r81J688
2264I96j652O60P32j606J505r03o3J256k091J343N64j569J795j446N2P90j137
2281g74Q80l36l18P74o99N63k3o32N34m67K43J68m55L47m0P04r97N9M75o45R45
2302C06l08q57J436j254Q60M83j877J805n92o90J751j922R53P66j441J423n84
2319B58p36J368j149P58pj350K041o69q88J146j596R06J069j531P51O8p04J328
2337A063p07j125Q69k01J26R04j703L19J010j166J338m79j182J444p35p6J228
2354I27k413J742N83j974J686j460l31K495j940O19K73j943K610n89j397J489
$$ plain form
2228 898 -851 197 531 -1064 466 -474 -254 1028 -510 386 382 -736 427 124 662 313 -317 914
2246 914 -115 598 1164 -555 616 -470 429 985 -602 740 -122 -208 1584 -488 344 289 -692 996
2264 996 -656 4 736 -870 635 -268 -331 925 -1166 177 741 -828 967 -479 -427 363 -774
2281 -774 106 -230 -548 226 -473 90 67 -565 -31 -498 -255 -87 -542 -195 -235 469 -528 -469 6 -639 306
2302 306 -2 -859 577 -677 183 666 -1211 594 2 -688 1063 -859 94 860 -581 842 258
2319 258 -478 890 -259 499 492 -858 1183 514 -374 772 -824 82 1151 -380 371 439 -265 1063
2337 1063 356 -769 100 -101 25 929 -774 -455 555 -611 727 248 -934 510 -225 -301 927
2354 927 -1486 256 839 -1135 551 -909 -1240 1255 -685 -66 207 -1736 874 285 -1112 377
2370C77j609J254J116k402J371k16r25K113j509n05J593j137R81L60k087J726
2386E01J18j078J632j686n79K418j532M71N09k271K633k50j278J361k243J239
2402c5K176k637J181n07j360K823j561j190K055j875J896P48k805J499m30m58
2418d80J883k247o9J789j824J545k96k151K460n53m39J536k696O74K270k264J519
2435F57q19j645K872r59r09J569k448J798J317k866J676p48n46K646k373k09J654
2452F67j859J954q2k706K513r19k21K352k900P61J813j942J720j038j573K425
2468I65p82j7Q43k382J793Q96j839J401j151p23K843j587n24J184k019K258o2
2485A097k411J847o95j62K148k472J89J294j814K263p88k240K620r72m2J452l293
$$ plain form
2370 377 -1232 22 1138 -1264 107 -109 -1034 1079 -430 -935 658 -479 502 862 -1225 501
2386 501 619 -459 1173 -513 -1092 1326 -206 265 774 -1497 1136 886 -392 969 -1274 -35
2402 -35 2141 -496 685 178 -1182 1641 80 -1110 945 -930 966 1714 -1091 408 -22 -480
2418 -480 1403 -844 -913 876 -948 597 301 -1850 610 57 -382 1154 -1542 -868 1402 -862 657
2435 657 -162 -1807 1065 106 -803 766 -1682 116 1433 -1433 243 -505 -1051 1595 -778 -987 667
2452 667 -1192 762 680 -2026 487 -432 -653 1699 -1201 -440 1373 -569 1151 113 -1460 965
2468 965 183 166 1009 -1373 420 1316 -523 878 -273 -996 1847 260 -264 920 -1099 1159 1097
2485 1097 -1314 533 -162 -324 1824 -648 -459 835 -979 1284 496 -1744 876 -96 -138 1314 -1979
2502a979J803J081k001J540j153m84K568j646K96K69j926K207m0j454J298j151
2518g72mK093k122J65O16p64J602n99j522J725q70N62J027j946P51N17j186J427
2536G00p97j069J896q85L13Q28k016J258P20j355J301j234j80J927j799L29O95
2553F32j529K025q19j237K184j557N03Q67j687R85J25j068J550j048k97R30j025
2570d66O21L55j161Q38k0l98O32q26K2J057q23j32O41j269P65L47q99R02n03l15
2590f32J173j027K4O12q08O58m9q52J457q27J11N72j173Q45J64o60J083r86K01
2609a14N70q32R38p66j65O03l68J40J67k23J96K58j70M6k21PL3j16P3K92J53n78
2631g7L10Qn76Q51q30N99J04q60P40k42j48N18p80M23J68q05J055n23k45O93q49
$$ plain form
2502 -1979 -176 905 -1096 444 -709 -1193 1375 -271 25 294 -1632 575 535 -919 379 -772
2518 -772 -776 1317 -805 -640 -24 -788 814 215 -1307 418 -452 110 1137 -809 -58 459 -727 700
2536 700 -97 -1166 730 -155 158 986 -1030 228 948 -407 894 -340 -520 1407 -392 -63 632
2553 632 -897 1128 309 -928 1256 -301 202 1069 -618 367 492 -576 974 -74 -371 559 -466
2570 -466 155 510 -651 187 167 -231 401 -425 -403 654 -169 -301 340 -929 -164 183 -716 186 -317 -632
2590 -632 541 -486 -462 150 -658 0 -49 -901 556 -271 -160 412 -761 84 248 -412 671 -315 -114
2609 -114 456 -376 562 -204 -369 234 -134 6 173 -50 146 404 234 280 59 66 99 -17 56 348 501 -77
2631 -77 233 241 -335 516 -314 285 389 -471 269 27 -121 397 -383 40 208 -597 458 -65 -310 383 -466
2652d66N87l1n02P36r31O49k1n71N68l87R4L7j04M66m79J02L24o68M93L49p20
2673d75N01l86K01J27k22L57n77L02K38l69P25m46R5L87o68Q62q25J92L33o65
2693c13M52N8p28J158r17K18N71p81L68j41k03N10k8l59M25r04J004n46k65Q50
2713D29p04N37r6l05K89m99L93j91j20K29j58J59K8k69N00o62N13J45o59O83q15
2734e73J93N48o58O73l47m11R72p82J16M3k51P71l74o7P46j347P39N03j156Q87
2754B25k90L70O9q15M23k90K53J77m48n2P34o46k16Q35k08r1j95K94Ql4k35J77
2776D5M33m71J60l97P8J001j111Q13k42n95J069j104J91P52j239J116j72q87J294
2795G34r13K23P57j585P81J75o87J243q23l65O06p63Q35j06r46J131k78l66M29
$$ plain form
2652 -466 121 90 -412 324 -607 42 21 -550 18 -369 -275 -238 -342 124 -355 -253 71 -597 -104 245 -475
2673 -475 26 -360 -159 -32 -254 103 -474 -172 66 -303 422 -24 71 458 -210 652 -173 19 352 -313
2693 -313 139 197 -531 627 -290 -72 499 -282 86 -55 -258 252 224 -135 290 -614 390 -156 -421 429
2713 429 -275 262 166 -139 150 -349 44 -147 -267 -38 -196 -37 -9 -278 222 -440 73 218 -441 242 -573
2734 -573 -380 168 -490 183 -164 -575 397 -385 -269 -226 -477 294 -80 -147 599 -748 -9 494 -662 225
2754 225 -65 305 374 -441 -18 -308 -55 122 -326 -378 356 -290 -506 329 121 30 -165 129 137 103 -132 45
2776 45 478 7 167 -230 -152 849 -262 551 309 -286 783 -321 -130 622 -617 499 327 -560 734
2795 734 -179 44 801 -784 -3 172 -515 728 -95 -460 146 -617 218 112 -834 297 19 -347 82
2814H2p06L89L87n88M66k55k14N46J43p99O83k96j72J169j145K79L90r92J297
2833F64k55j234J327r83M53R47k009J214K7m88J537j516k92J659j539J104j55
2850D61j483J809m31m38J122j647O24P91j319J176p12p45J695p33l05N46q64K70
2868a83J089j701Q25J91r62J657r13m07Q41j064J010K45k027J777k32p59J446
2885H33j696J95J514j542Q94k43j153K041q17m15J074j481P04J079j703J138r77
2902e55k04J691j109l54R07j253J446O9j613J145nn33J514j619j37J506j365J120
2920F51l5j599J949p46n04J428j820N19J275j701J184o10j019K178j154k94R42
2937F44j431J298K06j428J306q83j66J582j716J02R03j067J358o32j094J248m84
$$ plain form
2814 82 -624 -235 152 -436 30 -225 -439 107 250 -549 134 -162 -334 835 -310 -31 359 -633 664
2833 664 409 -825 502 -481 -28 919 -1090 124 151 -337 1200 -316 -608 1051 -488 616 461
2850 461 -1022 787 356 -82 1040 -607 17 808 -511 665 -47 -792 903 170 -135 411 -453 -183
2868 -183 906 -795 30 221 -741 916 3 -404 437 -627 383 628 -1399 378 146 -613 833
2885 833 -863 -668 846 -696 198 -45 -1198 843 26 -389 685 -796 -92 987 -716 422 -555
2902 -555 -759 932 -177 -531 376 -877 569 638 -975 170 165 -368 1146 -473 -610 896 -469 651
2920 651 616 -983 966 220 -284 1144 -676 -157 1118 -583 601 -9 -1028 1150 -4 -298 644
2937 644 -787 511 717 -711 595 -288 -454 1128 -588 -486 417 -650 708 76 -1018 230 -254
2954b54mJ176j704K10J222j172P79m52q52J882j080m6O34j453J155M75j054R58
2972D20p73k58J560j567M62M30q41J079k83j050J269q52O3J333j654P18J51p81
2990e74J094k97p31J155q23J60O88j303J131J79q57Q00p96k55J137o54J1J88o33
3009c80Q80j01o39Q96r10J96R23j172R3M55r09J192m20m67N34p81P13K54j003
3028f46N87M59q40J027r20j88P55o09N74j32p56P87K7n61M55n76K43M33o76N81
3048B4m0l64P50l00l11L99m42L94J90n99L97J79l79J31j74mM60n65J67K25m80
3069c42M39j4k35O82n26j20O03m73L22j00m88Q08k75j92M15q82L70K84k54K00
3089B22k02j6K93k09m2L5J3j37M23n00K00r3P9k23%j07K86k49J59j2j39Q1J32
$$ plain form
2954 -254 -258 918 -786 -576 646 -526 253 -199 -1051 831 -249 -295 339 -1114 41 516 -538 420
2972 420 -353 -611 949 -618 -156 274 -567 512 229 -821 448 -404 -341 992 -662 56 207 -574
2990 -574 520 223 -508 647 -176 -16 672 -631 500 679 -178 622 -174 -429 708 54 65 253 -380
3009 -380 500 399 -240 656 -254 -58 865 -307 -214 241 -668 524 104 -363 171 -610 103 357 -646
3028 -646 -59 400 -440 587 -333 -521 234 -375 199 67 -689 98 125 -436 19 -557 -314 119 -557 24
3048 24 -16 -380 370 70 -241 158 -284 110 300 -299 98 277 -102 29 -145 -149 311 -254 -87 138 -342
3069 -342 97 83 -152 530 4 -116 487 14 336 236 -252 556 281 89 504 -378 -8 276 22 222
3089 222 20 4 297 88 46 81 94 -43 380 -120 80 -13 66 -157 -157 -264 22 -227 -68 -80 -219 -138 -6
3112fk88K59j80j07L48j45L22j33l77K03J5Q7R3r3k13J09P0L13m29Q9K77k04K24
3135B34k41K11k9j86kK59l06K07j43R3L01n00L43j56r8K71q3K5K93l67Jj17J56
3158A66p7j07K38j54M0k28k09N81l18M5O7o8J60j76j48K34l26K83j31k48M76k72
3180a72J39Rj63Q4Pl02O07n42K98m0m4M6l2O6j65J31J9J20R9j70K5l2k37K98k46
3205a97JO48o50kL57l75K54j06Q9J50l37J77K98l84M43k66r8L09m74K46P3j72
3227a6M30l57j35L89k91p6J08j92K27P6q8k7k01J50K84k13J09m15P3J06L37m56
3249a78K02k39l5L44l61K0K08k24K40J70o06R00m64n6K83p80M82L34o01O32n91
3270c20J83L24o53O14J11o53M98J16p99Q32n38QM89m16O29j06m95N30m02j0K72
$$ plain form
3112 -6 -294 -35 -215 -322 26 -119 203 70 -307 -104 -89 -2 91 -2 -215 -106 -36 277 -152 -63 214 10 234
3135 234 -7 204 175 -11 -13 246 -60 147 4 97 398 -102 241 85 -13 258 175 200 493 126 127 10 166
3158 166 89 -18 220 66 106 -122 -331 250 -68 -23 44 -24 136 -40 -188 46 -280 3 -128 -376 100 -172
3180 -172 -33 -24 -187 -103 -96 -398 209 -333 -35 -75 -119 -73 -105 -39 -204 -73 -54 66 165 -5 20 -12 -249 49 -197
3205 -197 -196 452 -198 -200 157 -218 36 -70 19 169 -168 9 307 -77 366 100 2 311 -163 83 156 -16
3227 -16 414 57 -78 311 20 -56 52 -140 87 163 75 48 -153 -3 281 68 177 -238 -165 -59 278 -178
3249 -178 24 -215 -250 94 -267 -247 -39 -263 -23 147 -459 441 -23 -79 204 -576 -94 240 -361 271 -320
3270 -320 -137 187 -466 148 259 -394 104 220 -579 253 -285 -277 212 -204 425 319 -176 354 -48 -58 214
3291B14j38k5M55o71K15l7l33Q23k90l18O11m63N5M92r38M19J4l35O20k82l96
3312c08R33p60L13J99j106J292l77n48Q77j085M98L81p25O47k27n59R39o84mN14
3332B10o75O29Oq17M93J8k46Q68q38KL28l18K94J40n49O44M7o12Q22p89QR66j028
3355c97L97M03j067J207m31n41P83r34P37N13j483J133k97k65J133q69k39P04
3373D87o27M32L5r03J022m43k09Q91j070K56Q97j028M90j40n37P35l09j24M10
3392B65p44M76N44q79N54m74j79J306j139j16O45j051Q24J35j140J288q15K32
3410b68R94j656P85O64r21P12m41o17J225j107O27Q5q02Q58jo17P52o17j10R56
3430E01o02p2L48n77P75k86n95J018p06j80J053q78L41K19p19P72j98p07J052
$$ plain form
3291 214 76 51 506 -165 50 13 -320 503 213 -105 506 43 98 590 -348 71 85 -250 370 88 -308
3312 -308 625 -135 178 377 -729 563 186 -362 515 -570 -72 309 -416 231 4 -555 384 -300 -304 210
3332 210 -465 164 170 -647 -154 -136 -382 486 -352 -350 -22 -340 -46 94 -455 189 236 -376 446 -343 -335 631 -397
3355 -397 0 403 -664 543 112 -429 354 -580 157 670 -813 320 23 -242 891 22 -217 487
3373 487 -140 292 327 -576 446 3 -206 685 -385 -129 768 -260 230 90 -447 288 -21 -145 265
3392 265 -479 -3 541 -338 216 -258 -437 869 -270 -386 259 -792 32 167 -973 315 -500 -268
3410 -268 726 -930 -145 519 -402 310 -131 -748 477 -630 -3 82 -720 138 137 -480 272 -345 -455 501
3430 501 -101 -173 175 -402 373 87 -508 510 -196 -376 677 -201 140 359 -360 412 214 -493 559
3449E59m41P6M62j191Q92J99q90P13m40j87Q92p21J87O3p40J107j92l88N40q75
3469c75K33N23p60K84K69n81M82m8k79M99o86J49O58r39O10L8l31M62l06l3J95
3490F4m89K52M30r21R13r5n71Q01q91K24N10o01O01m9p32J107m35m52N81n78R2
3511b39N69o40P07m81J74J90k07J3J80p8l5J63o05K14K93k58N03m15k11M04k46
3532eL23m4o39M71pm90P92o61N38K5n59K43L6k46L05j63j16L65n09O12k22j42
3554i3L82m10k37M47k99J04K63l88K88k42q6M17l86L24J88l40N3L47l94j07J40
3575b9j0J69l24M95j88j43k25Q27o52P8j28M60j71k84N23m48J28n52P04k68P62
3596G24o56R3j23j006O88jL52N89l61j73l00L84k0l93K29K36j97j97J98k06QL40
$$ plain form
3449 559 118 194 656 -535 357 556 -334 379 -61 -248 644 -77 110 173 -567 540 348 -40 500 -375
3469 -375 -142 381 -379 -95 174 -407 75 27 -252 247 -439 -290 368 -571 39 77 -254 208 -98 -131 64
3490 64 -425 -173 257 -664 249 154 -417 384 -507 -283 227 -374 227 178 -554 553 118 -334 247 -331 -239
3511 -239 330 -310 397 -84 90 280 73 86 266 188 153 316 -289 -75 218 -40 463 48 -163 241 -5
3532 -5 318 274 -365 106 99 -391 401 -260 278 303 -256 -13 23 -223 82 -81 -197 168 -341 271 49 -93
3554 -93 289 -121 -358 89 -210 -106 157 -231 57 -185 -271 146 -240 84 272 -68 -15 332 -62 -169 -29
3575 -29 -39 130 -194 301 113 -30 -255 572 -80 -2 -130 330 159 -125 398 -50 78 -474 230 -38 724
3596 724 68 161 38 -968 -280 -281 71 660 299 126 -174 210 190 -203 26 262 65 -132 66 -140 -132 208
3618B08k61Nl6L9k8K44m01L53k45kJ45k98P5MQ8j85K36JN9J75j77l11K06j09R8
3643a17N6J28j66r5K68p0L6L3j54K86k86q3K44pj02J06j46RM6j68M68l10P3j24
3667g5L7J28K67k80J38j58j61P9J01l65M00K5k71J77j27M22n29P0K12m0k15N28
3689C63m80J5K81q0mJ44m49M69l50L9M62n16J10q7qL12l04K2M4k30L09P3j90l
3713e8M6j40L43m34J71L09l84J74J87k46N9o9j85L65l06K18J54m72K55L95o09
3734b27M62k35j94L21j02K47J78o37M72j02k37N38m16l4K14j14R6o2j83K14L1
3755B30n12N42n61M83J59n82M22n4k28M77m71J14M7k36K29J2l10K79rk54L53m13
3777b83JN36l14j31K78m66O86l31k31M14n09J05K89n61N04n6l70P78n81Q4M25
$$ plain form
3618 208 -53 -48 -84 -45 -73 171 -230 123 -122 -124 21 -277 -202 -198 -110 -295 -59 -58 1 176 -1 -312 -106 -215 -117
3643 -117 -61 67 -99 -194 74 4 40 73 -81 205 -81 -164 80 73 -29 77 -69 -60 -14 -182 286 -24 49 -75
3667 -75 -38 90 357 77 215 57 -104 -25 76 -289 111 136 -135 42 -85 337 -192 -122 90 50 -165 363
3689 363 -117 -102 179 99 95 239 -210 259 -91 -52 410 -106 4 -83 -91 221 -83 -61 -17 -247 62 135 -55 -58
3713 -58 -12 -152 191 -243 -72 237 -147 27 214 -32 27 -42 -227 138 -168 50 204 -268 -13 382 -227
3734 -227 235 0 -194 127 25 272 450 -187 285 183 -54 484 68 34 248 134 230 168 -15 199 230
3755 230 -282 260 -301 182 341 -241 181 127 -101 376 -95 19 66 -170 59 71 -239 40 31 -223 130 -283
3777 -283 -282 254 -60 -191 87 -379 307 -24 -255 159 -350 -245 44 -517 -13 -69 -439 339 -242 -158 267
3798B67o15N24k11o92J122l27j99L99n71L67J75k95M26k97m49N57k31L5K28k86
3818g3j0N38m45L48m06J2M40j30k96M49m34K17K48p45N88k65k83M82n20J90M84
3839C89o14O43m42m65N04n1j60L60p45P47q9l24O16n72j67P63o79N1N44p01N71
3860A79l49q0P24n35j5M76p55K07L73l97M08o9m84M88M0k89N70o85L00K40o31
3881b84M80k20l66Q12n01J66K08o23J61M90n84O29m06qM74q39L83K83o20Q32n24
3902e7n3L38k90K57J49n23K95P5n24P15n24K6N88l37j69K57m38J45K64q08P78
3923A64k29r9N91q81M73R4l65O86m34m17J083r79K71K22o24J16M51n27Q09m26
3943b1l79Q59n61L22n1m56M99j55j95K51n77K52L92n27M78O7m70M87k00k60N94
$$ plain form
3798 267 -348 176 -35 -727 395 68 -131 268 -303 64 239 -56 370 73 -376 181 -50 -15 213 -73
3818 -73 -83 455 10 358 -48 -36 404 274 -22 427 -7 210 458 -287 301 36 -247 235 -285 -95 389
3839 389 -225 418 -24 -489 15 -36 -196 164 -581 166 77 -247 369 -203 -370 393 -286 -235 309 -392 179
3860 179 -170 -250 474 -61 -76 400 -355 -148 225 -172 236 167 -317 171 211 -78 492 -193 107 347 -284
3881 -284 196 -24 -390 422 -79 87 295 -328 -167 323 -261 368 -38 -46 428 -411 -28 255 -365 467 -57
3902 -57 -110 228 -62 195 344 -179 116 191 -333 382 -142 -116 472 135 -34 223 -215 -70 194 -614 164
3923 164 -65 -164 427 -454 19 113 -252 434 0 -417 666 -313 -42 180 -444 -328 123 -404 405 -21
3943 -21 -400 459 -102 220 169 -287 212 57 -138 113 -464 -212 180 -347 131 198 -272 215 15 -245 349
3964C49o09K58P0l19M32o9l82L81R6l23L87j30j66L77n04K94O6k22L24k13j74
3985g7M43m09J63k72k01N24l64J04K97m27K28Q9k45J57m5k47K94l42L95K9m06
4006c12J55K17l01J94K64n06L04k50O1K05k11P2K48m02N49k22l18L40k69K70J38
4027B26m85L53J29l70L09j95p4K9J22j53K18l39Q06l50l99L68k34L5J16j57J27
4048H2J32l59L12j18J91K10l95l9J21k30K57r3k40K42Ok30J58j06j82L49ML5j75
4071f8j2K29p0k68J63k96L40l2p4J14r8q9O5n1K21j73j19M7K21o1K0rk94L59k77
4096b12K86L1p8J29l55K05O1J07l02K31j88p9M21k63P5p6J41l2j32J50j92P9j05
4119i8K20j08J70J85l89K94l67J36jK22l99J63k70M72j95Kn1k7K22m22K21K85
$$ plain form
3964 349 -260 -2 68 -251 181 112 -270 111 207 -116 271 141 -25 352 -152 142 208 -14 310 97 -77
3985 -77 366 -43 120 -152 -353 171 -193 -89 208 -219 9 98 -147 10 -35 -282 12 -330 65 94 -312
4006 -312 -157 60 -241 -47 217 -289 15 -235 -174 31 -180 -108 140 -262 287 65 -253 87 -182 88 226
4027 226 -259 94 223 -147 162 -33 -107 -78 44 -109 109 -230 576 226 -173 195 -39 -4 112 -45 82
4048 82 214 -145 167 49 240 450 55 16 137 -93 164 71 -169 73 79 -151 7 -99 -281 68 72 107 -68
4071 -68 -80 149 79 -189 -26 -322 18 -14 -88 26 -72 -161 -96 -147 74 -99 -218 -171 50 -11 9 0 -294 65 -212
4096 -212 74 105 27 156 -199 6 67 174 -128 103 -85 -164 257 -6 69 -7 134 102 -30 120 -72 7 -98
4119 -98 122 14 184 369 -20 274 -93 43 42 264 -135 28 -242 230 35 37 -14 -41 181 -241 -20 265
4141B65j29m02%k03M81k68o8L41k87N6R8k56J62J82o14Q92l33l58L71k75M74R
4163A38l84J23l3p48R20J70l75O11q48M86J10k78n8N6P1K28j4k99K57k38J56m
4185D7L6j26J7n7K40o9k81L55m7k89L5RJ47k1M1j03k3m1Q3j39K07K33k03K26k24
4210E3J62k2m13O2j40N80m35J38l91N01j81N2J99l35k75j30M58L59k56p09M55
4231b68l93M65L76l44p99Q31p06N15L39m15K34J06n06O35m91R51q28m52n4L96
4251d08P7K33K91K30K33j103O07l28K87l80j4L27Q0j65L36J18p57M21k0J62L10
4272E37m31j27M08m25L37j18l61M89j50l32M28o01K82K28k69M12k44j73K84k56
4292h2j20N13n55K23j59p4K62L7j17N55p04K16J32l12K10l1j76L29m44L42p8k45
$$ plain form
4141 265 136 -266 -266 -469 12 -256 -324 17 -270 -214 -116 -372 -210 -28 -642 250 -83 -441 -70 -345 129 138
4163 138 -246 -123 -156 -904 16 186 -189 422 -426 60 170 -108 -166 -110 -39 189 175 -124 133 -105 51 47
4185 47 83 -43 -26 -83 157 88 -193 162 115 -174 -139 -130 17 -4 37 -66 -89 -130 -47 -186 21 254 51 277 53
4210 53 215 193 -220 -158 -298 282 -153 -15 -406 95 -86 -34 165 -170 -445 -575 -117 242 -14 -723 -268
4231 -268 -661 -196 180 -164 -963 -132 -838 -323 16 -399 -165 -59 -565 70 -421 530 -298 -750 -804 -408
4251 -408 -331 -98 193 423 656 -447 160 -168 119 -261 -275 52 132 -33 303 421 -336 85 65 227 537
4272 537 106 -21 387 -38 299 181 -180 309 159 -173 255 -346 -64 164 -105 307 63 -110 174 -82
4292 -82 -202 311 -244 -21 -180 -254 8 45 -72 483 -221 -5 127 -185 25 -6 -182 147 -297 45 -33 -278
4314b78K14J76l28L27j75q6K38k66N8L12m96M70k70j17M86l16j82L79l83K89J32
4335A84n3p7N0j43J81k4n0L29p88P29r3l85M55l90LL79l43M0L01m45L18P3k05
4358D6J62k37k68N30j47j41J65l15N52m18l01O55l21r8J93k87K10l4j89M15l72
4379b00j0K37p2O5R1k88M44k81l63O04m52K1L97l78K10n9m02P06l44n39P23j04
4401FK4K2n20M95k01lP30n63j82K96j38N8kj41J26R4l11M63o93M50P7l7J05O0
4425B15l20K44j84m4K17O2k47K59l37K83J97k11l30L93k69J11O1M00j150M70L78
4446A98k58N33j089N64l23J30Q1J59o5J12j2Jj66K03k40K54r1l07L25N9j15M23
4468C76l76J39q5j20J55q4l26K57O3J73J40n77L21M7j53J83k51j61L29K33l13
$$ plain form
4314 -278 -64 112 -216 111 -64 -150 88 -178 -120 192 -304 166 -104 -221 265 -51 -233 146 -237 52 184
4335 184 131 54 104 -39 142 118 68 397 -391 338 245 -140 315 -75 -72 307 -36 4 305 -140 178 251 46
4358 46 208 -29 -297 233 86 -55 110 -205 347 -71 -372 283 -38 -136 57 -230 -20 -54 -243 172 -200
4379 -200 -210 27 -45 20 111 -177 267 -14 -377 227 -225 -204 193 -185 25 -34 -436 270 -74 -613 110 6
4401 6 30 52 -468 27 -174 -177 553 -10 -192 104 -34 24 22 -119 7 101 -210 253 -440 10 87 50 155 215
4425 215 -105 139 -45 -89 128 190 -57 202 -135 148 345 134 -196 197 -72 39 100 500 -650 -180 198
4446 198 -60 473 -616 -52 -375 -245 -164 -5 -70 42 30 31 -135 68 -172 82 -9 -316 9 68 -47 376
4468 376 0 139 54 -66 89 5 -321 -64 -1 172 312 -265 56 103 -50 133 -118 -279 50 283 -30
4489c0m7k53M55k29l1P5o4k1M13k42k43L64j1K1Q1k64J69J03m49L61j49j82R3
4512h0K0pK2o5K13j97J19J86k04k80N70l77J84o3o8R2K3l0RJ01k54J63m7k10K4
4537a56N1j9j71J59J47k6M4J4k88L53J29m29K4m5J56J59j45J56l83K38j55M9q
4560a46N0K83j08O6j08J54j77m1j60N06k96j2KJ77q4j39P7N9l03J85o0O6J28j87
4584f8O6K48j85N2q6q1J87m4p7nk78J5K87j68J04k57K31J06k88M53l04J39N4j71
4608g0J09j27k6J47q8j85K63m5j95J70Q6j79L4p6L40j70j76L19j75Q3j89R2M2
4631a6M5Q4p3k6l7J41j59j26J57Q0J50k92N6M4j86J74j6J81l47K65J6J2j8o4J88
4656B33k94K59Nk66m5L17l08J44k66L14j01j09q1K46j02OM6Q2n3O4j89J08j85
$$ plain form
4489 -30 -77 -330 125 -104 -135 -60 -124 -145 268 26 -217 147 136 157 238 -26 143 246 -203 158 9 -173 -80
4512 -80 -60 -67 -45 -110 103 -94 25 211 7 -273 297 -80 104 41 -27 65 88 58 67 168 -86 77 30 -180 -156
4537 -156 -105 -124 -295 -136 11 -15 29 43 -245 108 237 -192 -168 -213 -57 102 -43 113 -270 -32 -187 -138 -146
4560 -146 -96 187 79 145 37 191 14 -27 -187 319 23 11 13 190 106 -33 44 103 -200 -15 -75 -9 119 -68
4584 -68 -2 246 61 113 27 -54 133 89 12 7 -271 -256 31 -137 -33 -290 -59 47 -241 212 -92 47 101 -70
4608 -70 39 -88 -114 33 -55 -240 23 -22 -217 -47 39 -140 -106 -182 158 -12 -188 131 -44 39 -150 -58 -16
4631 -16 29 113 40 14 -23 118 -41 -167 -10 70 220 -72 -16 28 -158 16 0 181 -166 99 115 127 109 45 233
4656 233 -61 198 203 -63 -108 209 -99 45 -221 93 -8 -117 -198 48 -54 -48 -2 80 27 91 -98 10 -175
4679a75P6Mq1O4L5j38PJ40m7K38l87J53J9J83P6N2k59K65l40J35L1k21J20NL2
4704a3N6r0L16j78l4m5K95k44k77J59q9L12m93L38K22k23k5O7j84J61L8j5L9k21
4728a28L5K95k40L36l15n9K31j61m8J83j06q8J03l06M33k26J78J75k71o5L50m04
4750i8J68j19l27N01k6k21N2l7l7M52m38J92k91K66L28n41P1J33k21K04Q8j62
4772f3J16n0M7L85n31J52K29k48J68r9k60K14n6K39J6j86r1J81k12M24l46k62
4794b33N30r9m20M91n28M20N4l47N15n03J02J93j06M9K05j51J92k75m84O66j97
4815G4LJ34l76K89j60N8J27j54l20N09k28j31J41l02N59L2k88J17o7r9%j98K70
4838a0ok77L38pj08J77j67n2K99n11N52k75k91L66k21l9L19o5o2K20m48L74k2
$$ plain form
4679 -175 -99 -95 -176 -112 -77 -215 -208 -68 -115 123 -264 -111 -92 91 167 219 -40 225 -115 20 51 -170 -50 -45 -13
4704 -13 43 -47 269 91 57 12 307 63 -214 -55 -144 168 -325 13 235 12 -13 54 -130 31 69 54 93 -128
4728 -128 -93 202 -38 298 -17 -76 155 -6 -54 129 23 -65 38 -268 165 -61 117 292 21 -44 306 -98
4750 -98 70 -49 -376 125 99 -122 -70 -107 -144 308 -130 62 -229 37 365 -176 -105 28 -193 11 99 -63
4772 -63 53 3 50 435 -96 56 285 37 205 106 -154 60 4 243 259 73 -18 163 -49 375 29 -233
4794 -233 297 198 -222 269 -259 161 215 -132 383 -120 -18 175 69 118 323 172 364 89 -395 271 74
4815 74 77 211 -165 124 -36 22 149 -5 -325 184 -44 -175 -34 -336 223 255 -33 84 17 -82 -82 -280 -10
4838 -10 -16 -293 45 38 -70 107 -60 -112 187 -324 228 -47 -338 28 -193 -232 87 22 -40 180 -268 106 84
4861H4j39J44j95j42M89j34Q0q3l11L33k80M9J78j28K35j05o6QJ89k40j7k0p2
4884a43K59k2k3P9l69M45k92j12L83l94J01J72l12J96K13k88K23J24m45K63k06
4905a48k0K32J2k20K88j99R8l4R3J4k64M3K71k87J6m4K48K9j39J70j49K2k20K24
4929C6j82K93k99J72j16N1O9m1M8J64mm54L21J3j28K47k81K04Mk72K50n4%K6J06
4954A73m9o2j23O2j9m2m6K65k92J07Rk38J95Q8M8q0j63K28j83J80j79K01k72L19
4978A27k62LJ76p2j74K53oQ6l87L35j87L9K0j16J61Q5r2k1K22k44q4J13J12o4
5002B3Q4J01k08k40K18r9M29k99P8n9n6m5K43j46J68k29R1Q5j1l02L49k31K23
5025A67j30o5J79LL6m2j70n9J67J62j65J3n6Nk05L2j10J24j32J93J93j30Kk03
$$ plain form
4861 84 -55 89 -106 -248 241 107 187 104 -207 126 -154 -105 73 -55 180 75 9 17 206 -34 -51 -71 -143
4884 -143 116 94 71 150 -219 226 -66 -178 205 -189 -88 84 -228 -32 181 -107 116 240 -205 58 -148
4905 -148 -168 64 76 -144 144 -55 43 9 102 116 -148 -105 166 -121 -105 -149 99 128 -11 159 10 32 -188 36
4929 36 -146 147 -152 20 -96 -45 24 -17 31 195 191 -263 58 71 -57 190 -91 113 117 -155 95 41 41 67 173
4954 173 124 62 -61 1 -18 -60 -106 159 -133 -26 -17 -255 -60 28 76 -4 -167 61 -122 58 -121 80 -192 127
4978 127 -135 -132 44 -28 -202 51 45 131 -256 79 -108 -69 -49 -165 -4 81 -11 -32 190 -54 -138 -25 87 23
5002 23 107 208 0 -240 -22 -121 308 9 87 28 -28 -73 170 24 192 -37 54 139 128 -174 175 -56 167
5025 167 37 -28 151 154 190 148 -22 -81 86 248 83 96 40 45 -160 -128 -238 -114 -246 -53 140 10 12 -191
5049a91L33r1r5K13J16l53k07L25k55Q5K61l57K75j62J00J9P6k25J70J2k03J87
5071C3j72Q1J45p7J75nl13J0J82o4N5J20k00K86j42j71P9J94l03J97O5j41J06
5094A40k17j18L65j6j92L17m06J24k8K69k83K41k81K09j65k38L16l6J73R8l57
5115h5Q9P2m4j10p4j7P6K75m88K89J09k04J47k18L8L9LK21q0J08p2n15K06K00
5139c5j69K69j54R4J59j97n9J9n2L45m66Q1K08j63k99M27LJ35j50L9O2J21m03
5162a85J3L34k98KK76r2j90J0J98L99q26N45J80l02J03n33K01P7r0N68m82K43
5184A51K55k85n89J78K25K99j40J0k58L45p93L20J06P27q4o81N00m20j43K57o38
5205f58K50L48P68r74l71O01n97O68p25O32J07k66K05m83O44K07k99k06m72R92
$$ plain form
5049 -191 142 51 -44 169 285 -68 -275 50 -205 -120 141 -216 59 -103 -3 16 92 -133 37 49 -154 33
5071 33 -139 -58 87 10 185 180 -133 -123 59 -5 50 170 -30 256 114 -57 22 216 -87 110 175 34 140
5094 140 -77 -195 170 154 -38 279 -127 -3 -31 238 -45 196 -85 124 -41 -279 37 1 174 272 -85
5115 -85 4 76 32 -78 -152 -169 -93 182 -306 -17 92 -112 35 -183 -145 -106 -103 118 38 146 74 -441 -235 -35
5139 -35 -204 65 -89 5 164 -33 -92 -73 -125 220 -246 -165 43 -120 -419 8 11 146 -4 35 97 218 -185
5162 -185 -172 162 -136 -134 142 50 -140 -130 68 467 -359 186 366 64 167 -366 -165 -88 -178 390 -92 151
5184 151 406 121 -468 -290 -65 234 94 104 -154 191 -602 -282 -176 551 467 -214 286 -134 -277 -20 -658
5205 -658 -408 -60 708 -266 -637 -36 -633 35 -690 -58 49 -217 -12 -495 149 356 57 -149 -621 371
5225C71q79J60M33k34m26L80M45L91j270M64K74j70M76L22p46q10J239m44M17
5244C93q65k60J252j072j4J78O76l66Q68m60j080P17n88R47o57m07J309q57l45
5263f31m64P81K13R08j070P49J61n30n46M01q37J318q26P45n93Q94j05r33L5j92
5283e22N16J2m15j21P77J1j03r60J048j59r04N89P39n77p41R74m33J424r26k83
5303e4P28j319K17O86L8K08L93r21j25k97J186p79L34R40m33m43J25q42R7K31
5323c0J16l65L32k17P92m44n02M67m21L48k33Jj57N55m57l10N98o73L63R7O70
5344E30k12l02L16J29n99j69K89l10M50m07j41L03J35j46r1J98m1J52k74P6K81
5365A67K2l49M39m50j7O4M00l16j38J43o5R5O9J33j79P3j30J22l10R1K05J2j91
$$ plain form
5225 371 -508 -348 85 -149 -575 -195 250 641 -629 -165 109 -61 415 737 -9 -819 420 -24 393
5244 393 -472 -732 520 -552 -566 -388 288 -78 790 330 -750 -33 -621 326 -331 -738 571 -286 -631
5263 -631 -1095 -314 -101 807 -263 486 647 117 -429 -28 -865 453 -373 372 -221 673 568 -365 -330 -522
5283 -522 -6 6 -409 -530 247 258 155 -805 243 84 -820 -231 508 -69 -810 164 -269 1155 229 -54
5303 -54 674 -645 -428 258 296 504 897 -24 -149 -446 740 -39 295 1235 802 359 484 -358 -261 -30
5323 -30 86 -279 53 -164 628 184 -318 149 -272 76 -157 -156 -313 242 -215 -525 73 -600 -237 -140 530
5344 530 318 16 332 461 -138 -307 -18 -328 122 -285 -426 -123 12 -134 -225 -27 -68 84 -190 -114 167
5365 167 189 -160 279 -171 -188 -124 276 -40 -178 -35 -100 -5 64 197 18 91 -39 83 -227 -136 69 81 -110
5388a10K35k10j36J32j21J03Q0n2M7L05l81K47P4j37r3J75n17L62K44l56J54m24
5410c79J84j01N53j30J32j54j01j56N41p04j92J051p81N29j3m87L25l23RM8j62
5431c11K96K73m54N51p95J83N8j09M64L13m23j36K40j36L38r0j8p3l24J22N74
5452E43p96R54p29o2k1r0n2L5P87l58l50M4j58K26L30o3q0L11l05o39M88m79M88
5475B4O63o59J60l0m04L70j21l33K72L77n37l04Q59k86k86J39Q3K24r93O24R2
5496f6Q70n51l62k96K02Q13l85j29j3l17P75n30k90N24o70J54N1j07j15L33M14
5517C05J08l44J17n94M42J18J63m12m25P85J85p61M90J77o8k14O62j791J048K31
5537B22m20N60o04K84N73m46l19M02J88n49k83K97p2M96J81l80l14k8Q2M87m99
$$ plain form
5388 -110 125 -85 -221 -89 -210 -107 -27 -79 -32 273 -108 139 213 76 -17 158 -359 3 247 -109 45 -379
5410 -379 -195 -296 257 127 259 105 4 -152 389 -315 -507 544 -237 292 279 -208 117 -206 -197 -149 -311
5431 -311 -15 258 -196 355 -440 -257 -199 -308 156 469 46 -90 150 14 352 262 244 171 -153 -31 543
5452 543 -253 701 -28 -90 -111 -201 -253 -218 569 211 -139 -95 -253 -27 303 240 160 471 166 -473 15 -464 24
5475 24 687 28 188 158 -246 124 3 -330 -58 319 -218 -522 337 51 -235 -96 -13 211 -782 -158 -66
5496 -66 804 253 -109 -405 -203 610 225 96 83 -234 541 11 -279 245 -425 -271 -220 -327 -442 -109 305
5517 305 413 69 186 -408 34 152 315 -97 -522 263 448 -313 177 354 286 72 734 -1057 -9 222
5537 222 -198 362 -242 42 615 169 -150 252 440 -109 -392 -95 -167 329 510 130 -184 -212 -130 357 -142
5558a42K56p36L69J27j28L07K4r69N74N61k04P41q40p28J530J57j209J291k62
5577G19j038l01N49J5L47k54M30p19m56J426m17R41j665j6M78K79r72K69O78M98
5597G91k283Q77P55r53Q59p46Q72o70Q72r08O57m00N41o52M48J36o47M96O3r2
5617A6M83q03o04M42K32k25L89M25o2K52q28L19j60o06Q96K25p1m45J82j01M28
5638C84k32p3k83q5Q29n08P6j56q7M4K63o07P54J54o78J01L69p19M68K24n45K7
5660b80N83J31p15k63L52ML10J67j65l35l85O88k94L32R1O5l69K13J59j71Q8m9
5682A57K96k43m71K82QL1K3j91J5L12l78J80j45L87j89k05o7J56K5j83N25l38
5704a3k36Q69p47L2J6N40q10L80K40m39L54j73M71r05L82q9j96M17l75N02l64
$$ plain form
5558 -142 114 -622 -253 -126 -254 53 77 -892 -318 243 39 780 -60 -788 742 899 -310 981 719
5577 719 -319 -620 -71 -56 291 37 467 -252 -708 718 301 1242 -423 -439 39 318 -654 -385 293 791
5597 791 -1492 -615 140 -813 46 -700 172 -498 374 -534 123 -277 264 -388 60 196 -451 45 108 16
5617 16 499 -304 -908 -466 -234 -459 -70 355 293 545 -283 36 -124 -730 166 391 320 -125 57 -44 384
5638 384 152 79 -204 -289 540 32 108 -48 -135 -91 172 -435 319 473 -205 -104 265 -454 14 238 -307 -280
5660 -280 303 434 -281 -544 -192 -188 122 289 124 -211 -596 92 -202 130 221 286 -83 130 289 118 206 157
5682 157 453 210 -261 21 29 60 83 -108 -93 219 -159 21 -124 263 74 -131 -198 -42 -17 -200 325 -13
5704 -13 -249 620 -127 -95 -79 461 -349 31 271 -168 186 13 484 -421 -39 -128 -324 93 -282 220 -144
5725a44o6L26o7n89O57j18n2O3R0m79N63J91k75P92r72P29j425J281n8l97j13
5746f3q6R7r4L96ql08j43L00R4j9n30P99m04M78j42n69P18o10M9l17J62N16m90
5769a74L46m17L28L40l37J7r7M54q17N6r9N86l09L53j19k0M17m10p7j13Q9n14
5791e17N51K72m19o5R1L91l24k21K67O6j1l22J08J33k92L96J06j97mj35oJ43m6
5814c5l4p7K27k30M59k21j30j11J95k9K03l4j88K65l84J48k3k06K39jm7Q2j01
5837c3Q9p8k11K00K4m8pJ53P8k28n8j8K61l56L51n5j29K1m8L14j09k19PK41j81
5862c9J00k02K76k76K6J83K9j65j23M1J28J49k06n5N0K05m23K06j12J59J33k25
5884a41K41j98n6O2J90j94L12l13J70k20O8m1j2K59N0j15m9J60k95K82l29J80
$$ plain form
5725 -144 -210 116 49 -540 117 -1 -53 10 100 -379 184 375 100 892 -80 649 -776 505 447 50 -63
5746 -63 -149 -52 -146 250 242 -66 -209 91 185 166 -364 435 31 509 367 -202 516 -94 -45 -362 -200 316 -174
5769 -174 172 -245 83 423 86 103 6 460 -357 -301 -400 186 -123 230 111 91 508 98 21 -92 -3 -517
5791 -517 34 306 -113 -178 -87 304 -20 -241 26 92 81 -241 -133 0 -292 104 210 13 9 -126 -132 11 -35
5814 -35 -69 -146 81 -149 310 89 -41 -152 43 14 217 183 -5 260 -124 24 1 -205 34 33 -14 68 -33
5837 -33 56 -22 -233 -33 -9 -57 -64 89 167 -61 -119 -137 124 -232 119 64 -65 -44 -92 222 113 -106 -99 142 -39
5862 -39 61 -141 135 -141 -115 68 97 -68 -191 -150 -22 127 -79 -134 -84 121 -302 -96 -208 -49 84 -141
5884 -141 100 -98 -154 -92 98 -96 216 -97 73 -147 -79 -120 -132 127 177 62 13 173 -122 160 -169 11
5906A1j0o1P8K12j67j35L9o2K29m2j89lJ81K3j67L07k99j01M0J32p5J63j20M5
5930B9J23k79J2J37K77q5j62P2l44L42l15R2J50l51L00R3j33n6mJ44K89j47j09
5953G5j41K7O1J9n8j07J08P4p9K6M9o5n0J46k13K78j82J82p7j8k9j14M2j30J08
5978f8K79n9o5j09J16l43K25M1j5K0j49r4L33j46j2O8m4k98R9J68M4K9NP3j94
6003i6J9j23J14K85l83L50j67L8j89l4J19o6J29k1mRN2j1O1j18m1J21j87K11j10
6028d2J90k80K17k39J41l1N5NQ5j57R6J2j26L16k94K94j77j55M0N6n6J46k31J86
6052E1k1j1j70N3P2k86L77j09J12KM7K5o5j18RK80k16J8j01P6p0q9RK71j18nm9
6079b6K6j9K69l40J58j40j53L00q2M7k1j61L46k30R4N1M6j09n0o9J79k13k8k0
$$ plain form
5906 11 1 -60 18 230 63 -72 -33 -95 134 92 -97 -100 81 104 -63 244 -55 -156 -116 16 -59 104 -16 29
5930 29 152 -127 -115 22 299 214 52 124 -220 122 -193 -101 49 -302 -2 91 -42 -98 -102 42 331 184 75
5953 75 -66 -39 22 41 -17 -124 -16 58 -21 5 54 -11 -61 85 -128 150 -32 150 73 55 26 -88 -46 -176 -68
5978 -68 211 152 87 -22 94 -249 -24 17 2 22 -127 -221 112 -34 -46 22 -22 -320 -221 -53 -9 20 25 98 -96
6003 -96 -77 -200 -86 199 -184 166 -1 37 -152 -186 -67 -133 -4 -25 -29 -20 32 21 82 -36 -77 44 -143 68 -42
6028 -42 148 -132 85 -154 -13 -44 11 16 101 -56 40 52 -74 242 -52 242 65 -90 -50 6 -50 96 -135 51
6052 51 30 19 -151 -98 -26 -312 65 -44 68 70 117 142 77 -41 -32 248 32 50 -51 25 -45 -134 -125 146 28 23 -26
6079 -26 0 -19 250 -90 68 -72 -225 75 -7 40 19 -142 204 -26 68 119 165 56 6 -63 116 -97 -125 -145
6103a45%K19j74J80J11r2k69L6m4J93lk54M68n32N62l21J42j05o6J55m0J4J45
6126A80k93N2k9L6r5L9K81k59J13r1j6m0K03j51K20q2l20K98j02k7J4m3L28j97
6150A9r5J00j31J25M7k0J97k77N3J17j80L8l5K67k93q1J14K78l12j54K49l5q8
6173i7j77K42P1l66K13j10K42j49Q5k96K28O11m59l51P64k12n93M17k80L51m58
6194c24J82J28l3j35R0k51M79n36N12j28J48k25N34p15L79k66K00J37j04K6r8
6215@j36Q3l4P5r6N0n8J85Q5j38j91N6K86j04P5p6k51p3L42j62P7Q0q7R8k03K6
6241i1O2k55R3K11N2J37j34n2N0r3K3j12k2K80j05J46j48o5K21m62L90l9k81K64
6265G0K91j92l31K30q5kj40K1K3K97k54J23j27q7K49K29m32L5L22p0k79Q2Ql19
$$ plain form
6103 -145 -145 74 -100 80 191 99 -170 -134 -178 15 12 -242 226 -306 256 -65 77 -28 -94 61 21 35 180
6126 180 -113 -61 -90 -54 -149 -110 171 -88 25 -66 -82 -122 81 -70 150 68 -252 46 -56 -83 -69 -112 216 19
6150 19 -76 24 -107 18 65 45 242 -35 18 135 -45 -7 -42 225 -68 -149 -35 243 -69 -223 26 -9 -97
6173 -97 -274 -32 39 -327 -114 -224 18 -131 -46 -342 -114 497 38 -313 451 239 -354 63 -217 134 -324
6194 -324 -142 -14 -47 -182 -92 -343 136 -400 112 -16 132 -93 441 -274 105 -161 39 176 72 98 0
6215 0 -136 -53 -87 -12 -108 -58 -116 69 154 16 -175 -119 167 63 138 62 -189 -262 80 -82 -5 75 -12 86 -117 -91
6241 -91 -29 -284 -191 20 72 209 75 23 73 -20 3 -109 -131 149 44 190 42 -23 198 -264 126 87 -194 70
6265 70 361 169 -162 68 -17 -19 -159 -138 -115 182 -72 51 -76 -163 86 315 -117 -82 240 170 -109 -27 -19 -338
6289c38J90J97J26r4j67J77q8k44J87K42k27KO9j50J92j45n3J05l03J25K81n7
6311B7R8m6k5J24k02K38j52j53K45J65k23m5R8j04J15Lj77j22J03J39J47k70n3
6334g0L2K1P7L7J96l51k39K11K56k22l2J37K12l41jJ58j35j5M63l41k28J69k7
6357c3j16J8M66l59K06k52Q2j80K42M4l3j61Q0p9J02j44P6P0j89J38J8mm2j57
6381b07K07K2m6j42J54k13L16j32k81M76p9n7K78k27M6r2k20N0K23l36J65pj48
6404b50M9K04J45k9l58J51J85j17J09j21P3M6j85pJ65J80k28j97M0O1j2K31Jl30
6428a94L19o0J48nk14M0l08K06Q8m9J66l38K76k7J45r5k57L97k06O1k05J4J21
6451B3m9L12k97J23k44J00M9j00%J66j64Lo2L01k04J17K40l24P2m3Q1j59M4p1
$$ plain form
6289 -338 -148 49 175 81 -86 91 3 -241 -54 188 -39 -37 32 -118 74 -71 -124 -19 -322 -197 84 27
6311 27 125 79 54 178 -24 214 62 -91 154 319 96 51 149 45 160 163 -14 -136 -33 106 253 -17 -70
6334 -70 -38 -17 60 97 293 -58 -297 -86 170 -52 -84 53 265 -76 -77 81 -54 -69 394 53 -175 -6 -33
6357 -33 -149 -131 335 -24 182 -70 12 -168 74 118 85 -76 4 -75 27 -117 -41 29 -160 -22 -4 -8 -50 -207
6381 -207 0 22 -24 -166 -12 -225 91 -41 -322 154 75 18 296 69 115 23 -197 -147 76 -260 -95 -102 -250
6404 -250 -201 3 148 119 -239 -88 97 -20 89 -32 41 87 -98 -105 60 240 12 -185 -145 -84 -96 135 136 -194
6428 -194 125 65 213 208 -6 34 -274 -68 20 -29 137 -201 75 48 193 98 -159 238 32 93 -112 -98 23
6451 23 -26 286 -11 112 -132 -32 17 -83 -83 83 -81 -78 -140 161 -43 74 314 -10 62 19 100 -59 -15 -86
6475h6P3j67J47L5L7l08K38J94k42J10J21l32K94k30J42j62K38K44m24j93M0K24
6497gl08N34j37m9j06J05j12L7r0R3m8J38j48K19k69J96j03K20j15J02l35J26
6519e7J09j66J53L3k38K20L7j60J74l12K83j36P4L4k6j10K7k68L53J49j87O9r0
6542c5o0L41j74k7j68J77l43M84k27J94m0k88n7J40J47k48K41K8l9j58K03J20
6564B11j46J18m03L34j13L6M2k35J23L6J66kk34l2L05k57R1m3J73l16J45j00K73
6587A72l21q1J53l0J11Rnj60K23j77K7m5L71l02K87p17N29k71j09L66k45Q4J53
6610B2l19j28Q91m72N52p49n37O88j148J587R0n23j99K51L04k87N7k23K41r8j43
6631a43L41j87k5k2L9J27j85j31J66J31J4RL3j79J15R3m85L01j28J00j14n4J46
$$ plain form
6475 -86 -13 -180 -33 2 39 -269 -31 163 -79 31 152 -180 114 -116 26 -136 102 346 -78 -271 -231 -7
6497 -7 -315 219 82 33 -73 32 -80 -43 -133 -40 -88 50 -98 121 -148 48 -55 165 50 152 -183 -57
6519 -57 52 -114 39 72 -166 54 91 -69 105 -207 76 -60 14 48 22 -88 -61 -329 24 173 -14 55 -35
6542 -35 -95 246 72 45 -123 54 -289 195 -32 162 122 -166 -223 -83 64 -184 57 85 46 -112 91 211
6564 211 65 183 -220 114 1 37 79 -156 -33 3 169 167 -67 -99 206 -51 40 -3 170 -146 -1 -101 172
6587 172 -149 -230 -77 -107 4 13 8 -152 71 -106 -79 -124 247 -55 232 -485 44 -227 -336 30 -215 -131 22
6610 22 -297 -425 466 -6 546 -203 -740 -52 -1200 387 477 -46 -245 6 310 23 80 -143 98 0 -143
6631 -143 198 11 -14 -36 3 130 -55 -186 -20 111 125 134 167 -12 103 196 -289 12 -116 -16 -130 -184 -38
6654c8R8j7j11R7p4j91J93L61j98j84O7j96Q5L9J46l3M8p5K5P5q4nj45P9J52j17
6680cl01K27K80j34j33o9J65k37J18j98J16K17m7j63j73K62k13K91J3j05K23j18
6702A8l2Q6j2k29M00j16l70M24k83j3J69L1P2O4l78L54l52M16k75o4K69k15J35
6725I9J61j51k1N6l23J97J22m97J28M10k7j65l9q8K87j3J44j03l8k49N4p3L3K12
6749A16k30K61k74M12n07L42j28n0j1q0M0J47O0j09J5O8j98K14j4p5J95k09M4
6772B9l4K73j87k1k61L64j80j65L55l08J96j84Q8r0O5j73J07J4J8K49k06L7j84
6795a98J05P0J97j88J6j06L5n1J31Q1k09R7J47j22P7r2J45Lm4k51L13r4j86K3
6819a01J57o5%J50L4j10p3J01l00K16J5j6P4k7k58J77J45j25j7M0j31L1Q7R6k72
$$ plain form
6654 -38 60 43 -68 29 -45 -236 -43 318 120 -64 3 -193 -108 -69 77 44 92 17 42 117 33 28 -117 -38 114 -3
6680 -3 -304 -77 203 69 -64 -133 32 -205 -87 -285 -169 48 1 -162 -335 -73 -286 5 18 -87 136 18
6702 18 -14 72 60 -169 231 115 -255 169 -114 -127 42 73 145 209 -169 185 -167 249 -26 -90 179 -36 99
6725 99 260 109 88 144 -179 18 140 -357 -229 181 154 -11 -50 -138 149 136 280 177 139 -110 -56 -129 -96 116
6749 116 -114 147 -127 285 -222 120 -8 -58 -69 -149 -109 38 98 -11 4 72 -126 88 74 -1 194 -15 29
6772 29 -5 268 81 60 -201 163 -17 -182 173 -135 61 -123 -35 -125 -60 -233 -126 -112 -94 155 -51 -14 -198
6795 -198 -93 -23 174 -14 2 -104 -69 -120 11 92 -117 -20 127 5 82 -10 135 138 94 -157 156 62 -124 -101
6819 -101 56 -9 -9 141 175 65 -8 93 -207 9 24 8 82 55 -203 -26 119 -6 -23 17 -114 -83 4 100 -172
6844a72J55k63J74nQ4L1NQ4J73k54k26J00L77n03L15K3k43J29M6J06k22J01M6
6867F1j26m5Q2Q9l34L76j69O1k3m6K03j59N5J6j19L2J13L7r9J43O9l20j44M50
6891B03j89K8j69K09J02j31l69J36K11r7J06j53O2J73j54j9k11J55J68l7J1p1
6913c6l6m6J38K13j58K83m25j78K42J21l92K28L52l01K40k53l2lP3J07%r9j8j47
6937a27P0J86o6N9j76L04j80J83k48r6M26l59K71l82o2P2J90q6K68j67j83K53
6959A50j88M4r4K35n9k18J09r8R3n5J38k61L95O2k77n1R4M7j4k74K57r8j22J94
6983Ik08J54J47J2JLm17M17k93K74j4J3j97J93m0j57J70K4l4j76K52j79J29p3
7007A0j13NJ89qj28N1K02o1k1k24j1K66l18k3JJ69J5J55k44J81L5k17P0o6K31
$$ plain form
6844 -172 -17 -280 -106 -111 -27 4 9 93 266 12 -214 -114 263 -240 75 98 -145 -16 30 136 -86 15 61
6867 61 -65 -110 -28 61 -273 103 -66 -5 -28 -74 129 -30 25 41 -78 -46 67 104 5 148 217 -103 -247 203
6891 203 14 42 -127 82 184 53 -316 -180 31 -66 40 -113 -51 122 -32 -51 -262 -107 61 24 35 -36
6913 -36 -72 -118 20 233 75 358 -67 -245 -3 118 -274 -46 306 5 245 -8 -40 -43 30 137 137 38 20 -127
6937 -127 -57 129 63 122 -54 250 70 253 5 -91 335 -24 247 -135 -197 -125 65 -21 247 80 -103 150
6959 150 -38 6 -88 147 88 -130 -21 -119 -26 -81 57 -204 191 253 -24 -75 19 66 52 -222 35 -63 -185 9
6983 9 -199 -45 102 114 115 118 -299 118 -175 99 85 98 -99 94 54 -103 67 91 57 -119 133 -46 83 10
7007 10 -103 -98 91 83 -45 6 208 147 126 -98 -109 157 -161 -184 -183 -14 1 156 -88 93 128 -89 -19 -85 146
7032A46k91M9P9j94j03L01q4J26r3Mj05K12O2k42J23n5J15j79J99j24K21Q0k87
7055d0p4Q6j70M02j75o6K18k52o6R3j44P9K89l64K34p4Oj12K0L28k84j86L37O
7079I1p3J49j40r5J9J26j50l3j06L40j73J62q0J75k86q6K20J07L1l6p8j7q4J01
7103H4J70m44K7J61j0M1j50J95m2k13P7J36P8N1k8k42J5Q5j2J87k21k9L6LK52
7128B07k40nJ89l20K68p9j24K31j32j88J27L9j13O7M6m52O34j01j8k4l4j81M16
7151B13m29J94J07j03N7j97J12n2K66k21L4K6j2n2k9r1K45j22J18j77J03J00k11
7174a21M6L13j43k92K85j46k04L57N1k84J96o5J58k78P5P0j68K67j41j19K89k82
7196a36j05Q8K59p5j72J87P5k23n4N6k6J09K63N8k85L25m99K21l2K9K8k04JJ79
$$ plain form
7032 146 -145 -96 -17 -211 -314 -13 -97 29 -64 -60 -165 47 109 -133 -10 -65 50 -129 70 -54 167 247 -40
7055 -40 -114 -28 -198 204 29 -37 181 -71 -137 -44 -188 -109 180 -184 50 -24 -18 -130 -110 218 -66 -252 85 91
7079 91 18 167 27 -68 -49 77 -73 -106 -212 128 -45 117 37 212 -74 -160 60 167 198 162 84 67 -17 84
7103 84 254 -190 -163 -2 -12 29 -121 74 32 -181 -104 32 110 161 133 -109 -94 -9 -21 166 -55 -84 -48 -45 207
7128 207 -33 -38 151 -169 99 20 -104 127 -5 -193 -66 -27 -140 -73 -27 -479 155 54 36 12 -22 -203 213
7151 213 -216 -22 85 -18 39 -158 -46 -98 168 -53 -19 7 -5 -57 -86 -177 68 -54 64 -113 -10 90 -121
7174 -121 -75 238 95 -197 88 -58 -262 95 146 -138 58 -7 151 -127 -52 18 -150 117 -24 -143 146 -136
7196 -136 -241 -153 106 31 -141 46 121 -102 -156 -100 -126 -17 246 304 19 344 -155 66 34 63 91 -113 -112 67
7220F7j45j0j94J58j34K96m5N2R8k53J50P9j53r7R0p5J12K68k94j79J76K36k82
7243g9J53R9j72oJ70l85L10O3q4M6P7j32j72J10j8j31J17R7j37M1m2%N9L7k9j43
7269a51J42M8P9k53K92j40j40K2l3L61k55RO9Q5j13J8O3n3j22J74k97L53l39K52
7293G1J16k36m3P5j55L24j12l02M07k64ol6L7J45k6r0K87j36Q3j76K1N1j55R9
7317b1j23KQ2m6N4J68j90K86j1k54j21Q4K58l21K79R5m25K43P8Mj53k90M61m3
7341I6k8J63j84l08J56J19k0j16l5lm5N7J35R7j39n3J10J74j88r9K16mj48K64
7365B17k96J51o1l1k8J49P4J27m10J85k89J83l3mOR0j55qL1J34nLk9Kl3J03J52
7392B25k76L2m6J28R1k67LJ33Pk8O6k56K14j12Q7J19k93J17Q4j12J99m2l17K83
$$ plain form
7220 67 -78 -88 -282 -124 -258 38 -7 45 143 -110 40 119 -34 -131 -41 -116 -4 264 -30 -209 -33 203 -79
7243 -79 74 173 1 -5 165 -220 90 153 69 115 192 60 -112 -2 -20 -151 -34 63 -74 -33 -75 -75 -16 21 -8 -151
7269 -151 -9 39 118 -135 157 17 -123 -101 -134 227 -28 -19 50 135 22 40 103 50 -72 102 -195 158 -181 71
7293 71 187 -49 -92 -17 -172 152 40 -262 145 -119 -125 -161 -124 21 -5 -95 192 56 139 -37 -16 35 -120 -21
7317 -21 -144 -142 -60 -106 -52 116 -74 212 201 -53 -174 -90 168 -153 126 221 -204 39 117 121 -32 -322 139 96
7341 96 68 231 47 -261 -105 14 -6 -122 -157 -160 -205 -148 -13 84 -55 -108 2 176 -12 -111 105 101 -47 217
7365 217 -79 72 11 -20 -48 101 175 302 -108 77 -212 -29 -62 -66 -60 30 -125 -133 -102 32 27 30 1 3 -30 73 225
7392 225 -51 -19 -65 63 154 -113 -110 23 30 2 68 -188 26 -86 1 120 -173 -56 28 -84 115 73 -244 39
7416C9P0k4J7j03q9R8O7k74O5qL6K53k45K01P1j51j0Q9N8j77n6N6l86K89J92j83
7442a05J9J48O0l7l8K7J88k01p6k57K63j51L11j96n0J30P7Qqr6j84m2L69j4j70
7467b5j78L52n5r5k66K33J61j5k76K61nM6K37o60M26k35J70j80K23J30l67k24
7489c42N71J59j27o75M12K00k38K26k34K0r3J57n9j20J92k68L36K4j84N0j59k04
7511c56L13j06q8N57o68P60p53r0N85l8L64l41j26k13J074l79m75J65l3j32L24
7532C44o38M68L84l75m56P9J8j91L00n0N9P4Q6l13K22o4L4K57k96L9j78J93l1
7555c5j55L29j59l01M81p5j31J48o0j75J6k0j09L83M8Lj66l0K72k80L2j29K9j2
7579i6m9K2L12k63K01r6p0nJ12J29j38l4j88J77j0J51P1k75L1J06L8m8j24N9n9
$$ plain form
7416 39 109 85 102 -1 -90 8 75 -199 -134 -142 -106 147 -98 103 174 23 13 102 160 -17 -73 -17 -403 -114 78 -105
7442 -105 -86 62 122 85 47 74 262 61 -15 -272 -9 -160 151 -45 -95 35 112 120 112 16 -168 -210 159 145 -25
7467 -25 -203 149 94 -1 -267 -34 127 112 -164 97 92 138 375 -285 141 -94 76 -104 119 249 -118 -342
7489 -342 229 388 261 -414 -2 198 -40 186 -48 -28 -121 36 -23 -143 49 -219 117 141 -43 7 -152 -356
7511 -356 -43 -149 -237 320 -348 412 -341 -431 154 116 480 139 13 -200 874 495 20 185 152 20 344
7532 344 -294 174 558 183 -273 -194 -176 -367 -67 -117 -58 16 102 -211 11 -53 -19 238 -58 -19 -197 -4 -35
7555 -35 -190 139 -20 -321 160 85 -46 102 42 -133 -117 -137 -246 137 185 188 22 -8 264 -16 16 -113 -84 -96
7579 -96 -145 -123 189 -74 127 31 -39 -44 68 197 59 25 -163 14 4 155 226 -49 -18 88 126 78 -46 13 -46
7604d6J20j18j12L27p4j9m0j6k90L27j16N4K44l44M0N4j99K30j25K61j46M6mk63
7628b09J55nn0p0J75l8j14j49K58N3o9O1K6p5K15l08K37j29J45l50N1K19q3K04
7652A50L1j22K25l05J31j48J18R3k28M6oO8k02K50q2r5M6M8k63J96K26j34J95
7675B38J09j85k68K82P3j36K57m03P8o52M67l01K95j17M39p95R99P9p21L82J86
7696C06j96k42K88k66L93j55l48L69k03N56n28K55J12q1k9m71M21k66o40P81k50
7717a94K6O24j179J492o52L23m23o7k95J45K63l61J93K48k0k52J96r4J19j27K49
7738B14k60K40l39J46k35M25l18J62L7J27ql91K03K0j53K77J6j06j11Lk2J19j52
7761a06J72J24o7j79J29q7K49m00j8K39j06Q6M0M6j19r7J26K07q1k54J25j98j3
$$ plain form
7604 -46 74 -44 -156 171 97 78 38 22 -268 59 -57 -3 241 -103 -63 -9 -208 22 -103 158 12 58 54 -209
7628 -209 -54 -59 -109 -179 -4 -42 -156 -305 -47 6 -63 -2 24 -51 164 -144 93 -36 109 -241 -190 29 -54 150
7652 150 181 59 284 -21 110 -38 80 173 -55 -9 -15 53 -149 101 19 -76 -30 18 -245 -49 177 43 238
7675 238 347 162 -106 176 249 113 370 -33 45 -607 -140 -441 -146 -263 176 -619 380 459 -262 120 306
7696 306 110 -132 156 -110 283 128 -220 149 -54 502 -26 229 341 260 231 -240 181 -85 -725 56 -194
7717 -194 -168 456 -723 769 117 440 17 -50 -345 -200 63 -298 -105 143 123 -129 67 -27 92 -35 214
7738 214 -46 194 -145 1 -234 191 -127 35 72 199 191 -200 3 23 -130 147 163 57 -54 -51 -73 46 -106
7761 -106 66 190 123 -56 73 -14 235 -165 -183 56 -50 36 76 122 3 -94 32 239 158 -96 29 -169 -182
7784a82J24K36o6O0n9J2O1k33j0K96Lm4k97KK43k24M19m47J88k82K14j18J19n2
7808c7J72j32MJ35l00J08J01j24K26j99K04p5n1l34Q4J90P7jk0o1k2M3k95L25
7832A8n6J64j31j32O3jj61L03M9k25R7N8j52J00L02o04J82J54j21P1J6K49j44
7855I9l5r3O9J39N2m3j08k04K68K9j45OM9J09N7l68P6l4J33k79M91j92M6j24M5
7880D3Jk23R1%J1R0K23N0p5j36j75K98j98l3j51J88o4K01j54K20l28J06j10rM10
7905B76k62M8k96L28l8N6l16K98j68J8kj12K09k6J02j87L8K3o3L31l00L6N3j73
7929a27J48qQ0j38j00J64J08k84J93J02J48j61L1q1J19k03j43K42l19J05j00Q8
7951a36k5K4J7K68k11K19j90J06k22M23k86j0Mk3K40k82K21r6k7J2j58L1K06k82
$$ plain form
7784 -182 -58 178 112 172 113 125 186 -47 -57 239 242 198 -99 -97 146 -78 341 -106 82 -200 14 -104 15 -37
7808 -37 135 3 7 142 -158 -50 51 -73 153 -46 158 83 32 -302 -218 -28 49 48 28 -33 -55 -12 -307 18
7832 18 -38 126 -5 -137 -74 -75 -236 67 116 -109 -12 46 -106 -6 296 -308 -126 28 -93 -22 -6 243 99
7855 99 64 -29 40 179 231 188 80 -124 144 173 28 34 83 192 249 -119 -43 -77 56 -223 268 76 122 -2 43
7880 43 44 -179 -88 -88 -77 13 236 286 211 75 -100 198 0 -33 -184 4 -60 141 -13 207 -121 -15 -125 -134 276
7905 276 14 62 -234 94 56 112 -204 94 -74 -56 -58 -170 39 13 115 -72 -34 -11 -74 257 -43 -7 46 -127
7929 -127 21 13 93 -45 -145 19 127 -157 36 138 286 125 156 75 194 -9 -152 90 -229 -124 -224 -136
7951 -136 -161 -137 -120 148 -63 156 -34 72 -150 273 -13 -23 -19 -42 198 -84 137 41 14 26 -132 -101 105 -177
7975a77kR9J10No1N2P2M6j71j37L7N7J85pl18J7K26p2m1jm6K56M6l34m1L22l44
8002b22K0M19m15J95Jo1J9p9L53j93o9m4J04J84j47LLj28P1j72K68o8m2j65J82
8027A7K05k16J03n0nj51K56k36J72j53o9J31Nj49J63P2r3M6PJ21l68M02k80p1
8051a41J50jj68O4P3R2P1l86K16k6O9J57m38K75k04J46m6L20j87q6l5J56l3KN9
8076I9j09j14K62l46J60K52j84J38j93J88k33J68rk77J44Q9j63L52k17J5m63M65
8098B4l5P7p3l5K11l76M10j87r0M7J38k24JJ80O1k52J2L66k33k25K54o1j11K86
8122A65l46M65l92J67j00j11J10K41k71J3j72K31Np9j04O3K19m3j96L2K10oL9
8145A40q9Pn9J0J2o9J27j42J7J07m7j45R4K0J64M6l51K30j44J30pq7P6j20J94
$$ plain form
7975 -177 -179 -80 30 35 -26 26 98 144 -27 -164 -127 -70 115 108 -210 -193 33 -39 -80 -81 -127 129 175 -159 -200 122 -222
8002 -222 -202 217 -198 -3 -2 -63 -44 -123 230 37 -32 -76 28 212 65 68 71 -57 14 -158 110 42 0 -165 17
8027 17 222 6 109 59 54 -97 159 -77 95 -58 -127 4 9 -140 23 95 2 48 55 176 -192 210 -70 -141
8051 -141 9 8 -160 -96 -23 69 140 -246 -30 -56 13 170 -268 7 -197 -51 -97 223 36 -50 -85 71 38 40 99
8076 99 -10 -124 138 -208 -48 204 20 158 -35 153 -80 88 79 -198 -54 35 -128 224 7 22 -441 24
8098 24 -11 66 -7 -42 169 -207 203 16 -74 -27 111 -113 -112 68 129 -123 -111 255 22 -203 51 -10 -121 165
8122 165 -181 284 -108 59 -41 -152 -42 199 -72 -59 -231 0 5 -74 -178 -115 104 61 -135 -103 107 101 140
8145 140 51 58 -1 9 21 -48 79 -63 -46 61 14 -131 -37 -17 147 193 -158 72 -72 58 51 -36 40 -80 114
8170A14o3L5m9M4j54K07J86l69J82j8O1j33L6m3j2k40J22K5L10l0j98
$$ plain form
8170 114 51 86 37 81 -73 134 320 -49 133 115 176 43 79 36 24 -216 -94 -69 241 211 13
8191A3
$$ Imaginary data points
##PAGE= N=2
##DATA TABLE= (X++(I..I)), XYDATA
0@%%%%%%%%%%qJ6j6J6k4L2m0N0n8P2q8J07j31J57j84K16k53K96l44L95m54N20
32B77n92O72p62Q63r73J093j226J373j533J706j894K102k331K581k853L147l471
49a821L826m213M639n109N629o208O854p578Q399r337J0421j1690J3199j5027
63h016J7295k0199K4068k9519L7892n3117J30263l39733L12122J7773l18582N05129
75B75376l62213l132J78759j99413K45062j18488j60277J64973p3253J63558j12476
86a524q1573J42381q1277J03520n9980j14434Q7939o1782J66662r3900j41220
97a35188J84735p4979Q2279k5518j44060J70689j13656J10519L3024k49747K38207
108G6305q4247j5405J54796l30666K15840N9634k00622K69451k19583J9613K03091
$$ plain form
0 0 0 0 0 0 0 0 0 0 0 0 -8 8 -8 8 -16 16 -24 26 -32 40 -48 59 -72 85 -99 117 -136 160 -184 211 -243 277
32 277 -315 357 -405 458 -515 578 -648 725 -808 898 -996 1106 -1225 1356 -1497 1650 -1821
49 -1821 2005 -2208 2431 -2678 2951 -3257 3597 -3981 4418 -4919 5502 -6188 7011 -8016
63 -8016 9279 -10920 13148 -16371 21521 -31596 98667 -241066 71056 88829 -229753 275376
75 275376 -86837 -89969 88790 -110623 134439 15951 -144326 20647 -52606 110952 -1524
86 -1524 -83097 59284 -21993 81527 21547 -92887 -4948 -66730 99932 6032 -135188
97 -135188 49547 -25432 56847 31329 -112731 57958 -55698 54821 87845 -161902 76305
108 76305 -7942 -23347 131449 -199217 16623 76257 -124365 145086 -74497 -54884 148207
119A48207k38669J82405j06509j21157K81707j98204L6258P8584j61832J66067
129F6857o2966l2176O3463j01581J14713l0045j7392M5767j02942J14682m8325
140A0055n7458R9803j14563O4688K2111o0279Q7165q8327N3282K1749q1979J01176
152E7423r5354K9996N6101j11762J32824q5050m0126J25876j49968J02006K25
163B2191j11708J72461j11421K2984Q8304j71948J24140k2232o9335J17817j25686
174f4433N4577N1131r0474R0894p0417r12P1566p1046N5763l5929j6245O9274
186D3749n7214K8011k3438k3859N7258m7386K7861j3312j9790P1535m9483K2311
198A6243l652m8554P7243n0775J751L1381o4586P8171k8974l4290N5751p4188
$$ plain form
119 148207 -90462 91943 -14566 -135723 145984 -52220 -15962 62622 -99210 66857
129 66857 3891 -28285 35178 -66403 48310 18265 873 46640 -56302 58380 10055
140 10055 -47403 52400 -62163 2525 24636 -35643 51522 -36805 16477 38226 -43753 57423
152 57423 -37931 -7935 48166 -63596 69228 -15822 -55948 69928 -80040 21966 22191
163 22191 -89517 82944 -28477 -5493 82811 -89137 35003 12771 -56564 61253 -64433
174 -64433 -9856 41275 -49199 41695 -28722 -29634 41932 -29114 26649 -9280 -25525 43749
186 43749 -13465 14546 -8892 -32751 24507 -22879 4982 -8330 -28120 43415 -6068 16243
198 16243 12591 -35963 41280 -9495 -7744 23637 -40949 37222 8248 -26042 29709 -44479
210d4479N9270J2112o3572P8144n3035J3423M8963q6356N1494j2782l1137O1715
222C3760n8608J7630K2246l3387M4101l3725K445K2042l3742L7517k5531p950
234a3202L6529l7617K1383m643k6352K9180j9531Q054N033o980K4251k0574J2798
247H329l188k3526L2620k6039K9K2866l0841K6729n553j8751K5543k0486J3096
260H28M621j7481K5579j6686P428R625k9943K6433j1959j3509K6292k7634J1371
273e035J8929j9872J5120k140o693O519n652J857p892R124O402j5355J2831p280
287H63j1207J7923j1112k107J2447l021M677j170k067k842m094O478q710k505
301f447Q243o003M755J509n240M560p48Q72j746l812O470j654n86L387o193j143
$$ plain form
210 -44479 14791 26903 -36669 41475 -11560 1863 50826 -35530 15964 3182 -27955 33760
222 33760 -24848 -7218 15028 -18359 25742 -7983 -5538 16504 -17238 20279 -5252 -13202
234 -13202 23327 -14290 7093 2450 -23902 5278 -14253 -6199 -1166 -8146 16105 -4469 8329
247 8329 5141 -18385 14235 -11804 -11775 11091 -19750 6979 1426 -17325 8218 -12268 828
260 828 5449 -12032 13547 -3139 4289 13914 -16029 10404 -1555 -15064 11228 -16406 -5035
273 -5035 13894 -5978 9142 7002 309 6828 1176 3033 -4859 4265 10667 -4688 8143 863
287 863 -10344 7579 -3533 -5640 6807 3786 8463 7293 5226 2384 -1710 4768 -3942 -6447
301 -6447 1796 -4207 548 2057 -3183 1377 629 1501 -245 -4057 2413 759 173 3560 -2633 -3776
317c776J344l230l778J795P715j414J950O496r068L63N916j1688J035P937o542
332d945L479N210r126P25O123n549j65M901j47O52L479N11n401R37L853p645j475
349d583N236n492M285O458o619L781M018n009R38k120k003L383J173K075l446
364B075k577N227n945l715P480o601L646J1899r266k69N159j0067M329J666j0587
379g546P027J112l838P740o926k457Q466p264M418O22j0482J3816k555n943J1657
394G847j5039J836J0513j6778R470j359p339K0104r897o27P679j7230J4388j702
408A866j1939J5301j2558O245J3137k1306Q583o48r038K0019j0041n745J2746
421F622p023O228K731j5112L586O782n299N073k802j0777J6977J825j1643J2133
$$ plain form
317 -3776 -2432 -5662 -9440 -7645 70 -1344 606 7102 -1966 -1603 4313 -7375 -6340 1597 -4945
332 -4945 -1466 3744 -5382 -4657 1466 -4083 -4248 653 506 1158 4637 5148 -253 684 4537 -3108 -4583
349 -4583 653 -4839 -554 5904 -715 3066 7084 2075 3013 893 -1110 2273 3446 5521 2075
364 2075 -502 4725 -1220 -4935 2545 -4056 -410 11489 2223 1954 7113 -2954 1375 3041 -7546
379 -7546 -519 593 -3245 4495 -2431 -4888 3578 -3686 732 1354 -9128 4688 2133 -3810 7847
394 7847 -7192 -5356 5157 -11621 -2151 -3510 -10849 9255 -642 -1269 6410 -10820 3568 1866
408 1866 -10073 5228 -7330 -1085 12052 -9254 -671 -1319 -10357 9662 -379 -6124 6622
421 6622 -401 5827 8558 -6554 -2968 3814 -1485 3588 786 -9991 6986 8811 -2832 9301
435I301j5917K544K1783k4248R325K098j6803L2522j9024j1652J9419k8495K8610
448I463L587l1883L3474k0076L484K7679m5070J8432M730j7870L6395l1474m227
461a3356K6214k6726K4993o009k9375L1717o261l749J2648k1369M084J5120l956
474C975q832m46l619M175J5832j5489k286P765r257K5919j8182j6965K8233k7407
488a6584K6041J0340m9456M2460j3868j1150M1386n4317K0293K1068l3141M7306
500C0378l8547j0358M5850m5892L3703l693m5553N6683k2239n670K7101m4697
512b2934K5516J1642j8303J5537k2270O127J6779r309K791j1576N80Q043O069
525H692p265j5800J8782q040J0207J2090m3696K9414K076j9675L9463m6718P640
$$ plain form
435 9301 -6616 -4072 17711 -6537 2788 4886 -11917 20605 1581 -10071 9348 -19147 9463
448 9463 13050 -18833 14641 -5435 -1951 25728 -19342 -910 3820 -14050 22345 -9129 -13356
461 -13356 12858 -13868 11125 5116 -24259 7458 1197 -2552 10096 -11273 -7189 7931 3975
474 3975 -4857 -5303 -8922 -4747 11085 -4404 -6690 1075 -8182 17737 -445 -17410 10823 -16584
488 -16584 9457 19797 -29659 12801 -1067 -12217 29169 -25148 -4855 16213 -16928 30378
500 30378 -8169 -18527 27323 -18569 15134 11441 -34112 22571 332 -5338 21763 -22934
512 -22934 2582 14224 -4079 11458 -10812 -4685 12094 2785 5576 -6000 -5420 2623 8692
525 8692 1427 -14373 4409 -3631 6576 18666 -25030 4384 6460 -13215 26248 -20470 -12830
538a2830L4511m1490M1624k8351k5328O1966m7305K1931J2865n8870O3361j6695
550E389k0437L8487n4748L1828J8006l5825L1773l2295Q084L1302l2129J9394
562H829j6897o312L3602k1085L178o804l873K2418j1319L217j4924L96K3368j5774
576a980J1829j6908m964L3832k7530J4549q104k4957N1054l0366J503J8579m9041
589c2504N2647p469l1142M2020m7360K6324K5087n0070L8339k5247l274M3706
601C1057m7111J9151k748j8859M4051l3430K590J1458k4184L8577k0281j1698
613a1427J7886k2159K7789o723j7832J6088j5345J8621j970j4915J1489j2846
625a1344K0524m956j4480J6904k2053K2894K233k6567K8715k6130J3421K0752
$$ plain form
538 -12830 21681 -19809 21815 -6536 -31864 30102 -17203 4728 17593 -41277 22084 5389
550 5389 -15048 23439 -31309 519 18525 -17300 14473 -17822 -9738 21564 -10565 8829
562 8829 -8068 -14380 19222 -1863 1315 -5489 -9362 13056 1737 4954 -9970 -9574 13794 -1980
576 -1980 9849 -7059 -12023 21809 -5721 8828 724 -24233 26821 -3545 -2042 16537 -32504
589 -32504 20143 12674 -18468 23552 -23808 2516 27603 -22467 15872 -9375 -12649 31057
601 31057 -16054 3097 349 -18510 25541 -7889 -5299 6159 -18025 20552 271 -11427
613 -11427 6459 -15700 12089 5366 -12466 3622 -11723 6898 4928 -9987 1502 -11344
625 -11344 9180 4224 -10256 6648 -15405 7489 9722 -16845 11870 -14260 -839 19913
637A9913m2770L3462j3255j0863M1653m6326J8018J1552l3738M7359k9314j0469
649a4778L4589l6851K8872l568k7548L5136k2501Q331J2583k8956K2433p423j216
662h97J1769k0126J3348l583m61Q685j7342J3258n747J66J2634k2077J4873l384
676A116p087J9804k5159J3187M070j8304K7311k3271J699J8362k6952K6365j0818
689C23j5166L0818k8208J3073Q426k7398K8643j3470m465J8926k4780J5936K49
702B907j1679J7151j6036P206M289j1160J3364j1274L857M961r636J2421j1520
715e149L526P538j3995J5758r134l958J5449j7188J0542J93j0758J5335j1608
728c449N050L751j2446J5828j1148O57J0808j6800J3366k459q539J3601j2071
$$ plain form
637 19913 -22857 10605 -2650 -13513 28140 -18186 -168 11384 -22354 25005 -4309 -14778
649 -14778 19811 -17040 11832 8264 -19284 15852 -6649 1682 14265 -14691 7742 319 -897
662 -897 10872 -9254 4094 511 50 8735 -8607 4651 -1096 -930 11704 -10373 4500 1116
676 1116 -5971 13833 -11326 1861 5931 -12373 14938 -8333 -6634 11728 -15224 11141 323
689 323 -14843 15975 -12233 840 9266 -18132 10511 -2959 -7424 11502 -13278 2658 2907
702 2907 -8772 8379 -7657 -451 3838 -7322 6042 -5232 -1375 3586 -6050 6371 -5149
715 -5149 -1623 5915 -8080 7678 -1456 -5414 10035 -7153 3389 3582 -7176 8159 -3449
728 -3449 1601 5352 -7094 8734 -2414 -1757 9051 -7749 5617 3158 -5381 8220 -3851
741c851N278L005r009J1112r562K886N611j1478J1074m655m151R430r730N646
755A606j218l976Q051r260O427M40q396J1772q377j37P352r887O974j792k553
770b974N442p373O214j749m549R010q061K466M271p447O187k306p80L110m719
785c258N086l509m41N416o965M726R23m758N069k917L61K055l095L878l050N34
801E5K770n037M561j066k888M706k754KJ549j289R74j712K129j312j819L912l105
818c24O22J835l462L466j908p30K500l170K426o88j586K749l108J749R37m197
834b889L715j366j864L805k706J90J750k656K244o39k113K289n94m81J328j626
850a613K71J394k185K103m85k687M301p98k554L855l339L26L896m777K255M21
$$ plain form
741 -3851 1427 4432 -4577 6535 -3027 -141 5470 -6008 5066 411 -3740 5690 -4040 1606
755 1606 388 -3588 4463 -4797 1630 2070 -6326 5446 -2931 -3068 4284 -5603 1371 -421 -2974
770 -2974 2468 -4905 1309 -440 -4989 4021 -4040 -1574 2697 -4750 1437 -869 -1649 1461 -3258
785 -3258 1828 -1681 -2122 3294 -3671 1055 1978 -2780 2289 -628 -267 1788 -1307 2571 -479 55
801 55 2825 -2212 2349 1283 -1605 3101 347 349 1898 609 1583 -129 2000 688 -1131 2781 -324
818 -324 298 2133 -1329 2137 229 -501 1999 -1171 1255 567 -1019 1730 -1378 371 1308 -2889
834 -2889 826 -540 -2404 1401 -1305 -1115 635 -2021 223 -416 -2529 -240 -834 -1315 13 -1613
850 -1613 -1342 52 -2133 -30 -515 -3202 1099 301 -2253 1602 -1737 -1411 2485 -2292 -37 384
866C84l211N444k113k360L939l330K439J175m395L953k155P2M667n802Q90L038
882B635l973M591k401l673O189l199R15L293p462L479L621n336L827l169k594
897c257P804m439l62K692o925O102K219o880M434l246j66Q321q576N7L879o805
913e148Q211r61q893P855k608R64O048j1784L908M969o234P912o411n406J2321
928D743o421J905K666j2702J1367K485q300Q279q477O04J2280j0066J429P6o528
943f660J2455k475q100O525n084M717O766j1628J345L457k470Q347n751p533R281
958C192k263J625K952j3188O976O450p330P499q446m346J6174q636n8K060j2076
973i415J5064m96r288Q152j1468P502J0299j6946P782l628m495J8527j3360l602
$$ plain form
866 384 -2827 2617 504 -1856 2083 -1247 1192 2367 -2028 1925 -230 -158 4509 -1293 -403 2635
882 2635 -1338 3253 852 -2821 3368 169 1084 4377 -3085 394 4015 -1321 2506 -663 -3257
897 -3257 4547 108 -254 2438 -4487 1615 3834 -3046 1388 -1858 -2024 6297 -2279 -2222 1657 -5148
913 -5148 3063 2102 -6791 1064 -1544 -580 5468 -6316 -2408 2561 -3673 4239 -2172 -7578 4743
928 4743 -1678 227 2893 -9809 1558 4043 -4257 4022 -4455 -3851 8429 -1637 -208 -132 -6660
943 -6660 5795 3320 -4780 1745 -3339 1378 8144 -3484 -2139 1318 -1152 7195 1444 -6089 3192
958 3192 929 2554 5506 -7682 -706 5744 -1586 5913 -2533 -6879 9295 659 601 2661 -9415
973 -9415 5649 5153 -4135 4017 -7451 51 10350 -6596 1186 -2442 -6937 11590 -1770 -5372
987e372Q341j0149J2756r58j4085R563k326K149O839j2561N62P061k376M298m325
1002e83p816R036K993m044K373p702J363J1754r272J244M44q820J7315m711r857
1017f283J1965j2968Q368J0510k1248J2059k375o129J9803j7938p82J1079j3775
1030g714J7218n807j3593J7139j0139N558O943j9460J0933K494n777R975j1728
1043c958j200J0395m433J568j470o124N637M868n848j10j95m113J0783l022r116
1058f338R411q106M985Q857j8067J0275Np706J8199j6825j408J2984j5031J5864
1072G099n192j4394K0076j2182M850P418k0648J6086q13p069J3528j6804M862
1085c183R817j1303R296o757m423J2037o265J206N54n303N801K207l019k355J766
$$ plain form
987 -5372 2969 -7180 5576 4618 -9467 96 -2230 -81 6758 -5803 -5241 1820 -556 3742 -583
1002 -583 -8399 637 3630 -414 1959 -5743 -4380 7374 -1898 -654 -210 -9030 8285 3574 -6283
1017 -6283 5682 -7286 1082 11592 -9656 2403 28 -6101 13702 -4236 -5018 6061 -7714
1030 -7714 9504 3697 -9896 7243 -2896 2662 9605 -9855 1078 3572 -2205 7770 -3958
1043 -3958 -5158 5237 804 2372 902 -5222 415 5283 -565 -675 -870 -4983 5800 2778 -6338
1058 -6338 3073 -5033 -48 8809 -9258 1017 1022 -6684 11515 -5310 -6718 6266 -8765 7099
1072 7099 1907 -12487 7589 -4593 257 7675 -12973 3113 2300 -4769 8759 -8045 -3183
1085 -3183 6634 -4669 4627 -2130 -6553 5484 -781 425 979 -4324 1477 3684 665 -1690 76
1100G6q95K263L939j0043N107K761p093J2594j1575k444J3740j3922J0777j216
1114D069j4193J9155j0476m95J0988j9992J4790J067j1570J5210j4480L453J0856
1127H382j4891J0842m978n114J3118j0747L412J604p414J0097m760j539K810m862
1141d040N388j123j086K03k196M952l946K590j460m284R339p282K361L721j1062
1156g925J2444m386n322J2130j3809P620M505j2694J3321q302j307J1102j3280
1169e903Q212l66p412J2032r069J770N064q431Q571m491j449N264p011O819k525
1184A075k829N599o748N446j050m139O972o896M172J221o092P353o150J435M579
1199C948p697O619l693r31N390p749O221k113l372Q369r037M193K109p754R556
$$ plain form
1100 76 -819 1444 5383 -4660 447 3208 -3885 8709 -2866 -5310 8430 -5492 5285 4069
1114 4069 -10124 9031 -1445 -1940 9048 -10944 3846 4913 -6657 8553 -5927 -2474 8382
1127 8382 -6509 4333 -645 -5759 7359 -3388 24 1628 -5786 4311 -449 -1988 822 -4040
1141 -4040 1348 225 -861 -658 -2854 2098 -1848 742 -718 -5002 4337 -2945 -584 3137 -7925
1156 -7925 4519 133 -5189 6941 -6868 752 5257 -7437 5884 -2418 -3725 7377 -5903
1169 -5903 2309 1943 -5469 6563 -2506 -736 4328 -4103 4468 -23 -1472 3792 -3219 3600 1075
1184 1075 -1754 3845 -2903 2543 1493 -2646 4326 -2570 1602 2823 -3269 4084 -2066 -631 3948
1199 3948 -3749 2870 -823 -1754 3636 -4113 2108 -5 -3377 4992 -4045 148 2257 -5497 4059
1214D059n898n50O310q816O666j971l286O845p113M642M23n834P907o144J496
1229a264L667o774O952l329j286M983o405M758j136k599N558n625L210P04m450
1244c036O065m382J114L160n677N241k805j030M755n802M854j606k362N208n954
1259b257L671O43m731O451m694N97L519o182N365j849k032M833n171K731K78l334
1275b162M591l676R68K062m130M099k466n80K693l618L162j078j183K858l552
1290b012K248m91j718L406l327J555Q35k641L514k945P49J921l608L890k274q48
1306a746L525m228K919j97k521M287l107L09K536m167L721p16j692L035l093J272
1322A37J574k872K512j007o11J918j112l88K18m0M52K36j32j134R83J1p18J137
$$ plain form
1214 4059 -1839 -2389 3921 -4895 1771 -200 -3486 3359 -3754 888 1311 -4523 3384 -2760 -1264
1229 -1264 2403 -4371 2581 -748 -2034 2949 -3456 1302 166 -2433 3125 -2500 710 1414 -3036
1244 -3036 3029 -1353 -239 2921 -2756 2485 -320 -1350 3405 -2397 2457 851 -1511 3697 -2257
1259 -2257 1414 2057 -2674 3777 -917 -320 3199 -2983 2382 533 -1499 3334 -1837 894 1172 -2162
1275 -2162 2429 -1247 -279 1783 -2347 1752 -714 -1294 1399 -2219 943 -135 -1318 1540 -2012
1290 -2012 236 -255 -1973 1433 -1894 -339 496 -2145 1369 -1576 -827 1094 -2514 1376 -898 -1746
1306 -1746 1779 -2449 470 273 -2248 2039 -1068 -759 1777 -2390 1331 615 -1077 1958 -1135 137
1322 137 1711 -1161 1351 344 -267 1651 539 151 369 329 781 1017 885 -249 734 745 27 1164
1340A164j626R86L44r43J983l118Q39K345l394K987j046k987M924l411k5K756
1356A778m849L996P42l850L387k664k24L596l402J078L60k054L030j565j063J821
1372A17k002K355P43l416K143j25j776M235l500j449M866l275Q44K329n949L614
1388b46K538m148M068k926j594N559l761O32R42m162N791j279k907L752m653K994
1404F00L766o439L281m63l164P378m858k442N377m807L554J913p533M383P80k469
1420a143N198n268j528N898l907J829K18n797O553m15k657L627o646K451N800
1435D213o943L272o89m693R021l619m079N437o283M695M543r620M462k90k529
1450c102P777o369j773N970n556N729o02q404P907j236j195N309q984K332N824
$$ plain form
1340 1164 -462 524 868 -75 1908 -1210 -371 1974 -1420 1567 521 -2466 2458 -953 -978 1778
1356 1778 -3071 925 1667 -2183 1204 -1460 -1684 1912 -1490 -412 -52 -2106 924 -641 -1704 117
1372 117 -1885 470 1213 -2203 -60 -185 -1961 2274 -1226 -2675 2191 -1084 -240 2089 -3860 -246
1388 -246 2292 -1856 2212 -714 -2308 3251 -510 122 1064 -3098 2693 1414 -1493 2259 -2394 600
1404 600 4366 -2073 1208 745 -2419 4959 101 -2341 3036 -1771 1783 3696 -3837 546 1326 -1143
1420 -1143 4055 -1213 -2741 3157 -750 1079 1297 -4500 2053 1638 -1019 2608 -4038 -1587 4213
1435 4213 -2730 542 -147 -4840 4181 562 -3517 1920 -4363 332 4875 -4745 -283 -573 -3102
1450 -3102 4675 -1694 -3467 2503 -3053 2676 2074 -6330 1577 341 -854 4455 -4529 -2197 3627
1465C627o034N442l370n405J0206k925k418L874p216M986M326p432L755k200k004
1480b788Q430n329l432N725n355N882J479r871P028j391k209Q297r359l18P167
1495C956o920O488k109q363J0364k296j916N816j1047N765M902q677P305n908
1509b640j934J0266p258m67L487p253P867J529p313M599l693J565O626q073J87
1524b505L400l318N779j835o182N017j00j335M509o805N40N972m464K832p89o406
1540e690R206k478k855M926p505M883M034p459N659l841j948R817q205J228J994
1555A766o196R569l660m738N874m267L116K433p230L999j9k458N419l847j512
1570a751K542j56M71P1k601M12K669j245M57j594p08L688j575k674L562m638L578
$$ plain form
1465 3627 -2407 3035 -335 -5740 4466 1541 -877 2997 -4219 767 5093 -2339 1416 -784 -2788
1480 -2788 5642 313 -3119 2606 -2749 3133 4612 -5259 1769 378 -1831 6466 -2893 -3211 3956
1495 3956 -2964 3524 1415 -6948 3416 1120 -796 5020 -6027 -262 4640 -4037 3268 -2640
1509 -2640 -4574 5692 -1566 -2033 1454 -5799 2068 3597 -3716 883 -2810 -1245 5381 -2692 -2505
1524 -2505 895 -2423 3356 1521 -4661 356 256 -1079 3430 -3375 -2835 3137 -1327 1505 716 -5690
1540 -5690 3516 1038 -1817 3109 -4396 487 4521 -2938 2721 -1120 -3068 6749 -1456 -228 1766
1555 1766 -4430 5139 1479 -3259 2615 -1652 1464 3897 -3333 666 647 -1811 3608 -239 -1751
1570 -1751 791 635 1106 1177 -1424 -1012 1657 412 869 -725 -1433 2255 680 -1994 1568 -3070 508
1587E08K823p348N545k480j991P060p566J601L827n646N577j393l780N633m854
1602b484L262J664o229M801k547K0N012o123K564R98k461M117l510p82K754j555
1618d99J774j232q04J446l93Q83k368J299N78k78K512m507J750J535k942M359
1634C113l155j491M312m244L597j105l194N738m985J180K177m921M866j856j430
1649a398M648n742L287M59l143L908l499Q06K642m124L834k070j046L094l638
1664a982J554N98j507K567k063R60k66j832L083j863O44L51k320L584k627M71
1680f48K337m061M002k020j099L360m169K479N55k881M218l069M92K301l717L774
1696A854j983p13L292m251K589j82k262L724l360J698J300l457L848k648K81K067
$$ plain form
1587 508 3331 -4017 1528 -952 -2943 4117 -3449 -1848 1979 -3667 1910 517 -3263 2370 -2484
1602 -2484 778 2442 -3787 1014 -1533 -1513 3499 -2624 -60 938 -1523 2594 -916 -1698 1056 -499
1618 -499 1275 43 -761 685 292 1175 -1193 106 684 406 2918 -1589 161 1696 -1246 3113
1634 3113 -42 -1533 2779 -1465 2132 1027 -2167 3571 -1414 -234 1943 -2978 1888 32 -1398
1649 -1398 3250 -2492 795 1254 -1889 2019 -1480 -674 1968 -2156 1678 -392 -1438 1656 -1982
1664 -1982 -428 170 -1337 1230 -833 127 -139 -1971 1112 -751 -107 244 -2076 1508 -1119 -648
1680 -648 1689 -2372 1630 -390 -1489 1871 -2298 181 736 -2145 2073 -996 -504 1797 -1920 1854
1696 1854 -129 -842 2450 -1801 788 606 -1656 2068 -1292 406 1706 -1751 2097 -551 -270 1797
1712A797k978K856j110j067K413l067K022%k310L153k562J058R53k543K424j690
1728f51lK221l366L275j841q42K609l183J984O22k718L388k590M00K071l558K875
1745F93j110r00K584k961J683k04j349K599k083J274q5j378J967j255R6J139j687
1762i77J600r85m92J779k062J616l18m85J439j889J102M87j654K430k041M73J252
1779A275j902K022j197r92K540k463J470r6j279K758l030J068J178k709K734q95
1795D82j356K333k370R76Q23j881J559p42M9N89j648J513o73L5P22j037J00P90
1813B64k78r7K12m73l20R89j84j598J472q76L52J209j969J641q25q31L015k751
1831a048J73J945k339K856j565j836L081k257R90J366k573J777J52j181K056k495
$$ plain form
1712 1797 -1181 1675 565 -502 1911 -1156 866 866 -1444 1709 -853 205 1158 -1385 1039 -651
1728 -651 -654 1567 -1799 1476 -365 -1207 1402 -1781 203 825 -1893 1495 -1095 -695 1376 -2182 693
1745 693 -417 -1317 1267 -1694 -11 -215 -1564 1035 -1048 226 141 -1237 730 -525 -429 710 -977
1762 -977 623 -362 -854 925 -1137 479 161 -324 1115 -774 328 815 -839 1591 -450 23 1275
1779 1275 -627 1395 198 -794 1746 -717 753 657 -622 2136 -894 174 1352 -1357 1377 482
1795 482 -874 1459 -911 65 888 -993 566 -176 -127 462 -1186 327 -346 -311 411 -626 -526 264
1813 264 -14 -111 101 -372 -692 297 113 -1485 -13 -889 -537 672 -1297 344 -481 -1312 1703 -1048
1831 -1048 -875 1070 -1269 1587 22 -1814 1267 -990 0 1366 -1207 570 722 -459 1597 -898
1847h98L6K059j522J121Rk075K797r02j077J531j637R92J633k699K43J149j505
1864g45K747o99k402K559j680N91K079m162J976M25j315K577k851q76L052k507
1880a231J303J432m316L494Lj888K607l095M68L498l586J317J14k727M108r11
1896E90k510K562k816K300K119m713K430j91j925M631k950j721L109k040J686
1911E61J384m932L606N0j959L558m126K48M101k929J643n80l544M945o54k197
1927h25K754l989J572M343m921K114p73k410N377k311k074K523l123K825J835
1942B917n156K509J43j078L610l934r58L508k599K904l39m706L319L75j525L733
1958B723m980J171L600m056L094j639l169N168j787j820K437m070L040L361m880
$$ plain form
1847 -898 -862 1197 -325 796 805 -1270 1527 625 -452 1079 -558 434 2067 -632 -389 760 -745
1864 -745 2002 1303 -1099 1460 -220 371 2450 -1712 264 689 -626 1951 -900 -1776 1276 -1231
1880 -1231 72 1504 -2812 682 685 -1203 1404 -1691 -1223 2275 -1311 6 120 -2607 1501 590
1896 590 -1920 642 -2174 126 2245 -2468 -38 -229 -2154 2477 -473 -2194 915 -1125 561
1911 561 1945 -2987 619 669 -1290 2268 -1858 -1610 2491 -438 1205 625 -2919 2026 1372 -825
1927 -825 1929 -2060 -488 3855 -1066 1048 275 -2135 3242 931 -1143 1380 -1743 1082 2917
1942 2917 -2239 270 413 -665 2945 -989 -1947 1561 -1038 1866 1527 -3179 140 515 -1010 2723
1958 2723 -2257 -1086 2514 -1542 1552 -87 -3256 1912 125 -1695 742 -3328 -288 3073 -1807
1973a807J971j110j388N771l834j304K176k730M223k83m521M267k022M02K733
1988B544m667R43K403k340L190k339k697M176q88n99J784m030K120J884k378J557
2004F63m13j967M147k138J53R83k753K639N50l156K131p59r05M470m562K23K292
2021A598k491L313j588k667K325j154M10K723m341J754P30k071L245l157n63L165
2037A231j910J465j192j789K554k74q02M26j069M54K084k582K397r67k313K848
2053E61k18k089Q31O73J194O03k458L71M14q18J897j043j325L470k087M4J536
2070A556l520K551Q9j469K831k868l68L112k946K289p12k087L650k346j9J649
2086A392k776K201M55k902K704k082J054J284k056J223j44q63J466q83n38M50
$$ plain form
1973 -1807 164 -946 -2334 3437 -397 -1701 475 -2255 1968 1685 -2836 1431 -591 -189 2544
1988 2544 -2123 -1180 1223 -1117 2073 -266 -2963 1213 325 -274 1510 -2520 -400 1484 -894 663
2004 663 250 -1717 2430 292 445 1428 -1325 1314 1864 -1292 839 80 -825 3645 -917 -694 1598
2021 1598 -893 2420 832 -1835 490 -664 -254 2469 -1872 -118 612 -1459 1786 -1371 -1934 1231
2037 1231 -679 786 -406 -2195 359 85 -717 -291 -1360 -906 1178 -1404 993 26 -2287 561
2053 561 343 -1746 -915 -242 952 1555 -903 -532 -118 -936 961 -82 -1407 2063 -24 20 1556
2070 1556 -1964 587 676 -793 2038 -830 -1198 1914 -1032 1257 545 -1542 2108 -238 -257 1392
2086 1392 -1384 817 1272 -1630 1074 -1008 46 1330 -726 497 353 -510 956 73 -465 -15
2102a5J30l19O50k80j185J649p60o87J390k047J530P13k025K207j701m38K652
2119A464k778J393J91k313L338k097k33K154k967K261N4k249K755j824N39J306
2135I94k106J542r88l22J936j959J071k28l75J296j184Q31o2p87J185j360J165
2152F49l36o83J428j122P7P02j531J869j222k36K250k420J632m44j020J859j953
2169e01Q04N08j964K017j004j40J306k271J862n47r53J930k121R39Q00j569J182
2186B78p06o66J523j647J204J59o42J206j421N69K3m19J000j291N29P18j255J757
2204I19j290k7J359k069R98l91o07J980j589R25O66j823J804j051j10O78r83J909
2222A298q83o97J587j929J793r19p13J721j389M51J069j532R72j076l62J553k122
$$ plain form
2102 -15 115 -204 446 166 -1019 630 -130 -817 573 -1474 56 769 -1256 951 -750 -1188 1464
2119 1464 -1314 79 270 -2043 1295 -802 -1035 1119 -1848 413 467 -1782 973 -851 -312 994
2135 994 -1112 430 -558 -880 1056 -903 168 -60 -435 861 -323 508 446 -341 844 -516 649
2152 649 313 -370 1058 -64 13 715 -816 1053 -169 -405 1845 -575 1057 613 -407 1452 -501
2169 -501 303 811 -1153 864 -140 -280 1026 -1245 617 70 -883 1047 -1074 -135 665 -904 278
2186 278 -428 -1094 429 -1218 -14 145 -497 709 -712 -143 -120 -539 461 -830 -301 417 -838 919
2204 919 -371 -398 961 -1108 -110 -501 -1108 872 -717 208 874 -949 855 -196 -306 372 -611 1298
2222 1298 415 -282 1305 -624 1169 250 -463 1258 -131 320 1389 -143 829 -247 -609 944 -1178
2239a178J709q58J029N4j417P89L29o51J658j655M67M4j044J544j673O79Q9q13
2257h98J493q35L30M46j884J761m15q76J418j563L28J047j387J602j242l16J838
2274H47j907R85L39j488J671q60P8O62r10M85J08l47M20q22P97N06o21J57j48
2293d8o8N75n4n17l66J177q43K95M10j202J247j74n56J395k012Q37Q70j345J289
2312I10q80n86K052j524q6Q37j757J855n80p09J271j510J342K90j669J169q55
2329d30j09J529j625q5R41m48M15O4j239P87L64l63N93r80qJ082r54L20Q3j036
2349a099J502J32j183J183j258j1K247k364Q29j14j386K768j119r71J477j790
2365a157J568N98k303J958m73l85J792k038k08J526j313J617m70j859J944l42
$$ plain form
2239 -1178 531 -327 702 756 -661 128 457 -194 1464 -191 276 320 -724 820 -853 -174 -85 -898
2257 -898 595 -240 90 536 -1348 413 -2 -878 540 -1023 -695 352 -1035 567 -675 -991 847
2274 847 -1060 -75 264 -1224 447 -413 -335 327 -583 -98 10 -337 83 -739 58 564 -57 100 -48
2293 -48 -116 459 405 -112 -478 699 -144 151 561 -641 606 432 -124 1271 -741 96 966 -379 910
2312 910 30 -556 1496 -28 -114 723 -1034 821 241 -468 803 -707 635 925 -744 425 -430
2329 -430 -539 990 -635 -720 221 -227 188 252 -987 -200 164 -199 394 -586 -594 488 -466 -146 -63 -1099
2349 -1099 403 535 -648 535 -723 -734 1513 -851 -22 -136 -1522 1246 127 -844 633 -1157
2365 -1157 411 1009 -1294 664 191 -194 1598 -440 -648 878 -435 1182 712 -1147 797 455
2381D55o60J307k253J006J620j746J037n44j361K302m82r77J107k184J579J268
2397A474k628J556o02n14K608k103q42J836j847J885M5k731K386p10k93J972l104
2414a612P94J579j743J671q21j774K854r88k83Q03k135J523J042k032J643r25
2430d04o55K638j823k71J141j941K066M80k710K084q59j68K308k713P3J394j655
2447a015K228o42k203L075j290k4J574l279J842P48j485J734j732l97K768k170
2463b68M51P01k436K404N23k014J478j531K49J995k146M13L39j361K556r09j640
2480a196J847j370P96J429k948R21J034j401J981j604j046K502j504N00P61k781
2496b079K517N10j836J882j846k04K746k216k3N71j569K566o26j301J593j688
$$ plain form
2381 455 -205 1102 -1151 -145 1475 -271 766 222 -1139 1163 681 -296 811 -1373 206 1474
2397 1474 -1154 402 -200 -714 1894 -209 -1051 785 -1062 823 868 -1863 523 -187 -480 1492 -1612
2414 -1612 -818 761 -982 689 -132 -1906 948 -40 -323 480 -1655 -132 910 -1122 521 -404
2430 -404 -1059 1579 -244 -515 626 -1315 751 1231 -1479 605 -254 -422 1886 -827 -754 640 -1015
2447 -1015 1213 571 -1632 1443 153 129 1703 -1576 266 1014 -471 1263 -469 -866 1902 -268
2463 -268 183 884 -1552 852 1375 -639 839 -692 -443 1552 -594 -181 158 -1203 1353 444 -1196
2480 -1196 651 -719 77 1506 -1442 -521 513 -888 1093 -511 -1557 945 -559 -59 702 -2079
2496 -2079 438 948 -888 994 -852 -1056 1690 -526 -549 22 -1547 1019 393 -908 685 -1003
2512a003J114J081k311J289M0p88K004j658p98J716j082Q06L96j842J558L8n90
2529c0J267j533J50J426j539P23J76j861K229m18j313J475j104Q3J719k192N82
2546a60N70j223J894o74j123J285j347R70Q13k323J714k48r91J957j763k31J594
2563G14j291O22j25p70J197m77l76J008j306K39J042q71N24k33o81J325k10q29
2581d98N59m22j91J103r69Q9M90q82J265m42o32J220j043L05P02j397J036j72
2599A21o53J254j192M46O54r44P14k24n19J021q21J76M48o50O78k11n29N52k41
2618H0O4o9m5J17j97K52j88N8r0k07M50k93J23k2o23N14M0m08P12q72M12M79r16
2641f29R95n48j75P50r01P79l60l57O24o05N7O89r93Q16l91J1N51q95P13P1l92
$$ plain form
2512 -1003 111 1192 -1119 170 210 -578 1426 -232 -1030 686 -396 410 806 -1036 522 560 -30
2529 -30 1237 -296 -146 1280 -259 464 640 -1221 1008 590 -723 752 -352 -269 1450 -742 -160
2546 -160 410 -813 1081 407 -716 569 -778 192 1005 -1318 396 148 -843 1114 -649 -880 714
2563 714 -577 45 -80 -850 347 -130 -506 502 -804 -565 477 -394 130 -103 -784 541 331 -498
2581 -498 61 -361 -552 551 -418 -329 161 -721 544 102 -530 690 -353 -48 654 -743 293 121
2599 121 -532 722 -470 -24 630 -314 400 176 -343 678 -143 33 481 -169 509 298 -231 321 80
2618 80 144 75 30 147 -50 202 14 72 -18 -225 225 -68 55 33 -590 -76 -36 -444 268 -604 -192 287 -629
2641 -629 366 -182 -357 393 -508 271 -89 -446 178 -427 -370 319 -674 142 -249 -238 313 -582 131 202 -190
2662a90M51m06o8J72q4L43n61K47O15o79L87j77o5N39n83N65l58k68P79o47K63
2683B75K85o13M21k80kM23o50M70k49j85O96j116O94O4q02J001r44M98J07o74
2703e81P35k4m58N67q73L93J040j124N13m25N2K79m95M75m68J94J30l42M67k99
2723b44k6L43k27J25l36P6K82n58P68m10m5P19p97J91L41q61R12l80p5R14q56
2744a44N37j66n03Q79p91R3L64o34R74m06M09J69q91J42J18m01M67K62n60m6l09
2765d37Q41p56P52j052Q03j68K17k47l5K29J01n41J09L4k97Q11p59J56N61r62
2785f40J061k87r69J293r63J59M50j027Q00M6m39J037q92N2O74r20Q22j63q35
2804g41J195o09k7O03j045O83K35o16O03k23l72P24l23k83M01l44R6O41r22N02
$$ plain form
2662 -190 261 -145 -213 -41 -125 218 -343 -96 519 -160 227 50 -15 524 -59 506 148 -120 659 12 275
2683 275 560 -53 368 88 86 509 -141 329 80 -105 591 -525 169 233 -569 432 -512 -14 93 -581
2703 -581 154 130 -328 239 -634 -241 799 -325 188 -237 -185 94 -401 74 -394 -200 -70 -412 55 -244
2723 -244 -270 73 -154 -29 -365 -289 -7 -565 203 -207 -252 467 -330 -139 202 -659 253 -127 -202 712 -144
2744 -144 393 227 -276 603 -188 -95 269 -365 609 203 612 781 -110 32 150 -251 216 478 -82 -128 -437
2765 -437 404 -352 400 -652 151 -17 200 -47 -82 147 248 -293 -184 -150 -447 364 -395 -239 322 -640
2785 -640 421 134 -835 458 -505 -346 104 -923 -123 -77 -516 521 -371 -319 355 -565 257 94 -741
2804 -741 454 -155 -182 421 -624 59 294 -322 281 58 -314 410 87 -196 205 -139 -43 598 -324 178
2824A78K0p10J255l41q12J027q78L82O18j436J081m5q88J550j320j46J317j439
2842e87J212l16j209J680q31J22O71j579R06O95j156Q40q22l66J712j500j17R28
2860B83r31J051k90q01O43j44k33J202j207k37J018j044J103k74j327J656n33
2877f5l01J048j445O75R59j807J341o35q97K129j325O4O18j510J702K09j753J676
2895F83q63l07J792j649K50O74j330J717n10j120J325n18k11J020j969R77P68
2912G29j205J333r02j079J888q80J42P63j482Q89M29j177J324j290j75J817j464
2929c40l6Q56j627J620j6j402J382j012J50J486j568J16P79j212J598q33j372
2946a431J920q08J36N03j436J208K38q94R79q59k83J443q97J87M09j447J383K47
$$ plain form
2824 178 198 -512 743 402 -410 617 -261 121 739 -697 384 339 -549 1001 -319 -465 852 -587
2842 -587 625 309 -900 780 -51 71 742 -837 69 764 -392 448 -374 -740 972 -528 -645 283
2860 283 -648 403 113 -688 -45 -189 -422 780 -427 -664 354 -690 413 139 -1188 468 -65
2877 -65 -366 682 -763 -88 871 -936 405 -230 -1127 1002 -323 -259 359 -1151 551 760 -993 683
2895 683 -180 -487 1305 -344 -94 580 -750 967 457 -663 662 144 -67 953 -1016 -39 729
2912 729 -476 857 -45 -1124 764 -116 26 789 -693 196 625 -552 772 -518 -693 1124 -340
2929 -340 -376 480 -1147 473 457 -945 437 -575 -425 1061 -507 -391 388 -824 774 -59 -1431
2946 -1431 489 -319 -183 320 -1116 92 330 -564 415 -444 -727 716 -181 6 415 -1032 351 598
2964E98j234J414j237K77J032j355L50L89p13J668r17r21J424j083L69P79j683
2981h43R74J93o06J260j034l94J289j093N63J05j213J374k45n51O61q67J0J087
2999F70j055O57j36o97J139m01m78O93r08L82N43j025M18N6l20Q61q20m08J034
3018B05o24P30J11j344R36Q6j87L50q48k0R68n54K0L38p06J048m89l05O64q99
3038e20M96N00m93K53k38k0O94l63m02L84k56R1J96n88M87j42j2K15l24l53P43
3059C48l41O61j69q71N42J34m54O83n73j93N33m30L15K51m36L77m21o7K47l13
3079a77L57j03j31J49k61k87P69m43j63N01m62M22o28J74r3R1K11o7j01J73Q5
3100A6j69J83n8j99Q1J57k00L25l55J9L14j60q5J82k8R2k4k25O72q52M94J85l01
$$ plain form
2964 598 -636 778 -459 -182 850 -505 -155 234 -479 1189 272 -649 775 -308 61 840 -843
2981 -843 131 324 -282 978 -56 -450 839 -254 309 414 -799 575 330 -221 440 -427 -417 670
2999 670 -385 272 136 -561 578 177 -301 392 -516 -134 409 -616 -198 -142 -462 399 -421 -829 205
3018 205 -419 311 422 -922 14 100 -87 263 -585 -605 363 -191 -171 167 -539 509 20 -285 379 -520
3038 -520 -24 476 -17 236 -2 -22 672 309 -93 291 35 126 322 -266 221 79 67 282 -42 -395 348
3059 348 7 668 499 -372 170 304 -150 533 -40 -233 300 -130 185 436 0 377 -44 -111 136 -177
3079 -177 180 77 -54 95 -166 -453 316 -127 -290 211 -251 171 -457 -283 -376 -285 -74 -141 -242 -69 16
3100 16 -153 30 -28 -227 -146 11 -189 136 -219 -200 114 -46 -131 51 23 115 91 -134 538 -314 180 365 64
3123F4J78k09m7M46p29N25j44j51L03j09%Q1r3pJ70k11R5k68K30q8j30K53j37
3146B2L8m4L3K6N3r9j65MK56j66R6j19l86M66k99K50R5o15M91O5l02K50k64K71
3170d3p1k0p1m5k62Q80n22K9L37n40N67n28Q6L85l77M30l51J03R1q3O3j72Q7K74
3194B47l43K1J88j54K3M4J41j47K86L1j16m6J25k97L14l75k3L49l37K89o5k56
3216a01N43n78L88j12m97Q46n88o6M98o03K60M1m35N37j34RN86r52O49p9m60M7
3238b01j29K31K56l49J7j87L81k8j61J49k29Q9K7J93k3m12N35j63n8K95n05K04
3260f8L68p02O28l67J39L32m84K76K55p95Q94m72k41Q15q63N23J57n73O97j68
3280C51o70Q56n60PK95n59N59k55k36L82l21j30N36m40K22J75k18j3L07p21O18
$$ plain form
3123 64 242 33 -14 432 -297 228 84 -67 236 127 127 208 115 108 278 67 162 -106 124 36 -94 159 22
3146 22 60 16 49 75 128 29 -136 -132 124 -42 54 -65 -451 15 -284 -34 61 -554 -63 2 -300 -50 -314 -43
3170 -43 -114 -134 -205 -250 -512 368 -154 -125 212 -328 239 -289 -203 182 -195 235 -116 -13 78 -5 58 -114 -27 247
3194 247 -96 -75 113 -41 -18 26 167 20 306 337 221 175 300 3 317 -58 -81 268 -69 220 155 -101
3216 -101 442 -136 252 140 -357 489 -99 -165 333 -270 -10 31 -404 133 -1 8 594 -358 291 212 -248 -201
3238 -201 -330 -99 157 -192 -175 -362 19 -9 -170 -21 -250 -161 -134 59 36 -376 159 -4 -62 233 -272 -68
3260 -68 300 -402 226 -141 -2 330 -154 122 377 -418 476 4 -237 578 -285 238 395 -178 519 351
3280 351 -319 537 -23 -16 279 -280 279 24 -212 170 -151 -281 255 -185 37 212 -6 -19 288 -433 185
3301A85P4l60N45p31j45Q73p32K23L22q47J031m42m15Q09r27N11N41j142J063
3320D36o49m81J142j117L04N12p60R80l76n80Q49k33j16M85p91J54K76j71K39
3339A03k69j44P02o01jO00q01O98O22j188N34r6n13J170r24j61J087j308R13J43
3359E66j034R43n44K57O89j167K43L95q95J313p88l82J014p34p4M41q47N89K13
3378A98l23N86q76o2R71r62L31M96r62Q78j97p03Q27o52p5P77o06J50M40r20Q99
3399B15l49n17J185r28L17M51r54M27P01r52J110r83k53J161p88o5N02r55J071
3418C96j38o66J086q20K18N67p48K32o0l59R14m64n73Q49m50N0P95j416R70m3
3438C40m36P07n15o35Q70n44M67J81r13P92J40r30Q02p46KR17q20O03k24o39Q96
$$ plain form
3301 185 259 -101 444 -287 -432 441 -291 -68 254 -593 438 -4 -419 390 -537 -26 515 -627 436
3320 436 -213 -694 448 -669 -365 147 -613 367 -9 -589 260 27 -89 396 -395 -241 35 -136 103
3339 103 -166 -310 392 -209 -210 390 -411 287 909 -279 255 159 -354 816 -108 -269 818 -490 423 566
3359 566 -468 475 -69 188 877 -290 -47 348 -547 766 -22 -404 610 -124 -198 243 -604 -15 198
3378 198 -125 461 -415 -477 494 -468 -137 359 -603 275 78 -625 202 -450 -525 252 -354 -204 236 -684 215
3399 215 -134 -651 534 -394 -77 374 -580 -153 548 -404 706 -277 -530 631 -157 -222 280 -675 396
3418 396 258 -408 678 -142 76 643 -105 127 67 -292 622 158 -415 434 -16 34 829 -587 383 340
3438 340 -96 611 96 -539 331 -213 254 435 -478 314 454 -476 326 -420 -418 499 -321 282 58 -581 315
3459C15k70m81P54q65M68L98j124R13j71j55N63o96j4N30p46O65R2o12L80o7j35
3480b58N44n53j96P35o64L09J07k94L75j24j53N79o45M21%l03J42k4m10O31k22
3501cL3M67p74M58J16m61O47k88k70N83m10j1P5k82L08p9k70L98m45K96J80m14
3523a46P0J91l43L88j77k78M17j85r0L12m07M38M1n83N80k84k17N18m86j13N67
3544B13o53L85J14l96L79P5l3j19k23K74J02m30L24ql70L82Mo2J55k20L14j75
3566C2K1Q1P1k84K84l23L6P7kK12j86J08J86j16j20J67m78O35j25k68K81j28k47
3589h6M28k03p36J3O43o63P71k7L32n94K19N1k58N37q80O21L50n63p81O96q3J09
3611a04R0l29L29j13j08J55j28J3R8Q4o0j17k7J07P1j95l3L96O2J78m86L60j02
$$ plain form
3459 315 45 -436 318 -547 -79 319 -805 108 -63 -218 345 -351 -365 165 -581 84 176 -436 -56 -123 -258
3480 -258 286 -267 -463 272 -392 -83 24 -270 105 -19 -172 407 -238 183 183 -120 22 -2 -412 219 -3
3501 -3 30 497 -277 181 297 -164 483 195 -75 508 98 87 162 -120 188 109 -161 237 -208 88 268 -146
3523 -146 -76 115 -228 160 -17 -295 122 -63 -153 159 -248 190 231 -352 228 -56 -273 245 -241 -354 213
3544 213 -440 -55 59 -337 42 117 84 -35 -258 16 118 -312 12 4 -366 16 20 -42 113 -107 207 32
3566 32 53 134 205 -79 205 -118 -82 -5 -7 205 19 127 313 197 77 244 -234 401 276 8 289 161 -86
3589 -86 342 139 -597 -584 59 -604 167 140 472 -122 97 148 -110 427 -453 168 518 -45 -826 -130 -213 -104
3611 -104 -14 -343 -14 -127 -235 -80 -208 -195 -97 -13 -73 -190 -217 -110 -39 -234 -267 129 191 369 -117 243 141
3634A41m81N45L1l56J80l38K62P5J51n01K79j57K43J29l84M54j9l00J93m10N63
3655C00l13n1J95q1R1p8J0J27O9l48P2K80j21K4j34K0M7j19o1Q2r1J7L2J3L5M9
3681F6k86L55k27j32J54j52KK79k29J74j4j91K77k60L29P8l40k4J81l83N32j70
3703A9Nj18K7P4j06q1L35l76O9o9L45j76R8P4k43Rn8L77j83R2K79m82L90j37k16
3728e2K26p4j80M78l51j12K84m95O60k37l07L82K9l23L92n42L77j40l08P37m78
3749c4K1K93l74J61J50m23O20o00j80O67n49J91K91n57M34r1k55K30j40n0L25
3770A30n36L58K52n03L21k21j80L41l04r8O41m22J13K35n44Q42l93m11Q67p65
3790b77J70J43k17K52jm96O94n62L49K56n55M71J12m15N18o14O7O66m31o7M92
$$ plain form
3634 141 -340 205 236 -120 60 -278 -16 59 210 -291 -12 -169 74 203 -181 273 254 -46 147 -263 300
3655 300 -13 -64 131 50 141 63 73 200 269 -79 -7 273 152 176 42 62 109 -10 -71 11 -80 -63 -31 -18 17 66
3681 66 -220 135 -92 -224 -70 -222 -220 59 -170 4 -10 -201 76 -184 145 223 -117 -141 40 -343 189 19
3703 19 24 -94 -67 7 -99 -180 155 -221 -152 -221 124 -52 46 120 -123 -114 -172 205 22 114 393 -89 301 164 -52
3728 -52 174 100 -80 398 47 -65 219 -276 384 147 -160 222 251 -72 320 -222 155 15 -293 444 -34
3749 -34 -13 280 -94 67 217 -206 414 -186 -366 301 -248 -57 234 -323 111 20 -235 -5 -145 -195 130
3770 130 -406 -48 204 -299 22 -199 -379 -38 -342 -440 201 -221 -108 127 -417 425 32 -379 488 -277
3790 -277 -107 36 -181 71 70 -426 268 -294 55 311 -244 227 339 -76 442 -172 -105 561 130 63 555
3811E55p44J64L35n75M66l23L08J41m95o0O86p19M02k5n42K99j0J79L65p37J58
3832a72L43n35R17m70n67P66o50M83Q3p88Q21%m93M20k41k71P29q57M48j47k03
3853c84O01l18p7N19o52L7M77n62K23O6j37M82k02m94O36l26L13L2m05K14N53
3874E96n30K71m69j13P48m13j91N59r70Q07mo44O43n78M79J06n96L66K94p23R07
3895E45n47k85N20m42L25J23p22O67j5n87J030j084N24L82o71K29rl57M36ol87
3916c31N08m93J05P49r18K07L42p44R68k83l08L84m15M00K96j054J064m85l98
3935d06R34q09J31O40p26O30o6p19O73p2m41O05n37j32Q93p01N28n26Q2K37O6
3956B84l67K43l40L96Q2m51M02j13j79L53m10k36Q40m85Q4K21n88M36k38J78L21
$$ plain form
3811 555 -189 -25 310 -265 201 -122 186 327 -168 -228 458 -261 141 116 -426 -127 -137 42 407 -330 -172
3832 -172 171 -364 553 83 -484 282 -368 115 198 -590 231 231 -262 158 -83 -354 375 -482 -34 -181 -384
3853 -384 217 -101 -178 341 -311 -274 203 -359 -136 -70 -207 275 73 -421 215 -111 202 234 -171 43 596
3874 596 66 337 -132 -245 503 90 -101 458 -512 295 291 -353 290 -288 191 297 -299 67 361 -362 545
3895 545 -2 -287 233 -209 116 239 -483 184 169 -418 612 -472 52 434 -237 -8 -17 -374 62 56 -331
3916 -331 177 -316 -211 538 -380 -173 169 -575 393 110 -198 186 -229 171 467 -587 477 -8 -406
3935 -406 528 -281 -150 490 -236 394 328 -391 282 210 -231 374 -163 -295 598 -103 425 -101 -19 218 284
3956 284 -83 160 -180 216 298 -153 249 136 -43 310 -100 -336 504 19 103 324 -264 172 -66 112 433
3977D33o75L22J35n70N49m95r6N21k38j16J52l60N39j87j36O9L1o7K14j40o6L73
3999A92l02L27l95r4J50J22k4J18k17j9K67j97K73J2l29L23j50k87L09k98R1J27
4021al92N78j43j51K95r2j2N0l12M47Jk53l9L18j00p1r7L3M7j36Q9n6j50J79J6
4046D8j44J51j65O2K29k39qJ5j78K40k04L70k9k19P1K3k14J68o9J23K0k23j9K45
4070E4n0N9K5j26L4K0K8l9j17j09L19j48J95k29J93j36j4K75l53J41R5k48K29
4093I8o1r7K40j79K71k19L8j25O3k33J31K35M2k44L14k05R3k60J04M8J4q6K27
4116B09j52n4J57k00M0J56j36r6m9p4QK92j12k47J07K82K6m23J71K1K85m23J87
4139b5l8nJ93j08p0J04O7Q4j57m56Q06m09qJ70j59n58M15N07l35K27Q6p51M74
$$ plain form
3977 433 -242 80 215 -355 194 -301 -397 124 -114 -230 -78 -438 101 -86 -222 -153 -122 -189 25 -115 -181 192
3999 192 -110 217 -178 -272 -122 0 -24 94 -123 -142 125 -72 201 213 -116 207 57 -230 79 -219 -128 -1
4021 -1 -393 185 42 -109 186 94 82 132 -180 267 268 15 -24 294 194 123 26 59 106 -30 59 3 -147 32 48
4046 48 -96 55 -110 -48 181 -58 -66 -51 -229 11 -193 177 148 -71 0 23 -191 -23 -92 31 51 -172 -191 54
4070 54 4 63 88 -38 -4 16 44 5 -112 -221 98 -50 145 -84 109 -27 -41 234 -119 22 117 -131 98
4093 98 37 -60 180 1 272 53 91 -34 29 -204 -73 162 204 -40 274 69 162 -98 6 54 68 -18 209
4116 209 57 3 160 -40 0 156 20 -76 -125 -199 -191 101 -11 -258 -151 131 157 -266 -95 -74 211 -212 -25
4139 -25 -63 -68 125 17 -53 51 118 202 45 -411 395 -14 -22 148 -11 -569 -154 353 18 245 331 -420 54
4162E4k54n11L93r7P08k6j191J006L18l13R2p8R1M2k19q6J77j19R6km08N28m02
4185b01J41K14m53N21j39Q5p5L8j10R0o7j2N5k63J50mJ1J70j89k10M51j98j92
4208a87K26m18Q51n56J39K24q36L32O39m04k63M94m61j99J69Q9N59r31K0J059
4228E46j061M36O2m66P2J74L40J35j158Q59Q84l74j10k31o00P91o35k5N05j9K84
4249D09k68n22Q93m02J32J67q67N12j42l26L57j30m7P84n50k75K26P9j54Q3l45
4270c86N46Q0m69M96k86j5J08j55L8J51k81M58j76j44K92m37J3k4J8R6j75r2M12
4293F8MKM43p84M53j75l76N27l68K65J25j86j22L93n23K46J2m57N35l29K82J52
4315A87k25K08j64m36M67r7j66L98k55K91J82o55K06O3k97M75k12J8K66k87M36
$$ plain form
4162 54 -200 -711 -318 -415 293 267 -924 82 400 87 179 101 192 234 15 -71 106 -13 83 81 -327 201 -201
4185 -201 -60 154 -299 222 83 168 93 131 21 111 44 32 87 -176 -26 -30 -19 151 -38 -248 203 5 -187
4208 -187 39 -379 472 -84 55 279 -557 -225 414 10 -253 241 -220 -419 -250 -161 398 -533 -513 546
4228 546 -515 -79 -17 -483 -411 -237 103 238 -920 -61 823 449 339 108 -492 299 -336 -361 144 125 409
4249 409 141 -381 512 110 242 409 -458 54 -88 -414 -57 -187 -234 550 0 -275 -49 30 -124 -41 -386
4270 -386 160 240 -229 267 -19 -34 74 -81 -43 108 -173 285 109 -35 257 -180 -167 -191 -173 -77 -252 -344 68
4293 68 72 74 517 -267 186 11 -365 162 -206 59 184 -2 -124 269 -254 -8 4 -453 82 -247 35 187
4315 187 -38 170 6 -430 37 -60 -226 172 -83 208 390 -265 -59 4 -293 182 -30 -12 254 -33 403
4336D03m35k23N19r3j30K93o18M59L0m99K57k9r5L44q8m49M28j18p3K18m33L49
4358A7J69m38M20j34l7J96m72L73k4m42M01j60J57L01o42K41K58k25j2M4k60L60
4380I1j2m08M36l26M46k2m41L57k21r7M17l79K83J21r4l6K49o83P36l64O4L16
4402D33o49J71L33l31k0J46k18J80o6Q8K71n41J67L05n46M17p8j86K06j27m2N2
4424c5j37J21Q0j76L82j66r6L24j78k86J14J01J75J24l43K25O4qo86M70m13M14
4446G0q02J503p15O3k05p2m3N18q18L0L83k06N54k38J0J01m07L16K19l06K2N3
4468C0l98N81j39r7K68k14P3r5nL8m7j15J75J28j85OK4j85K03J18J12k37k06L23
4492A56j13j56J86l24N44j27m41K94N8j55J94l51K27K34j98O7k70m8L14J11l78
$$ plain form
4336 403 -32 -255 264 171 41 334 -284 175 205 -294 -37 -66 -161 183 95 -354 74 -44 -117 101 -332 17
4358 17 186 -252 168 34 -3 193 -279 94 70 -372 29 -131 26 327 -315 -74 184 -41 -53 -9 -269 91
4380 91 79 -329 107 -219 227 205 -236 121 -100 -197 220 -159 124 245 151 115 364 -319 417 53 117 433
4402 433 -216 -45 288 -43 -63 83 -135 45 -21 67 338 -203 -36 269 -277 140 62 -124 82 -45 -87 -35
4424 -35 -172 -51 29 -147 235 69 -27 297 119 -167 -53 48 223 347 4 229 293 285 -401 69 -344 70
4446 70 -732 771 56 119 -86 -158 -201 317 -501 -471 -88 -294 260 22 32 133 -274 42 261 -45 -23 30
4468 30 -368 213 74 -23 245 31 104 9 4 42 -5 -120 55 183 -2 4 28 -157 46 164 276 39 -167 156
4492 156 43 -113 73 -251 293 166 -275 19 77 -78 116 -235 -8 226 28 95 -175 -223 91 202 -176
4513a76M42m11k4K22r1J87l24K63j74K22j80J66p2P7j5j89J73k03K50j34Qj09
4535i2J53j22K45l30J14O8k3pK11k38J26J6j85Q2m0k12M28n8o3r5q3J73L45l22
4559I1J57o7j54j5n4K25k22p6J69q4J15K2n2J64l61J47j07J28J5R3k67J83j44
4582i4R1j71J60l9j71L76m18J50J2K73k0l65J74K6k78J64n9J45r6K21J31k23j56
4605a67O9j03L35j18K55k78R4j14J36j8o8jJ02J48M3l33K14j5l01M09l50n2J69
4628E6M5Q8k41J27q9K68k85R5l1Pk41L68j98j07j9P4J75k32M66k74j81L89k54
4651F%K12j65k26L7p5L53k29l4M42k79p2O7m6O6p8OK04j08k68J25J47k8k5k44
4676b12l7J78j4J04j15p1L86l41N2Q4R9Q6j55j55K03k04M2L78j23o5l75K00P6
$$ plain form
4513 -176 266 -145 -169 53 -38 149 -175 88 -86 136 -44 122 50 127 112 -77 96 -107 143 9 17 -92
4535 -92 61 -61 184 -146 -32 36 13 6 217 -21 105 121 -64 18 -22 -234 194 136 73 -22 -105 68 413 91
4559 91 248 181 27 12 -42 183 -39 -115 54 -30 85 107 55 219 -142 5 -102 26 41 134 -133 50 -94
4582 -94 -3 -174 -14 -53 -224 152 -266 -116 -104 169 149 -216 -42 -16 -294 -130 -189 -44 -140 81 212 -11 -167
4605 -167 -98 -201 134 16 271 -7 87 -27 109 91 23 22 124 272 315 -18 196 181 -120 289 -61 -113 56
4628 56 101 189 -52 75 -14 254 -31 64 33 40 -201 167 -31 -138 -157 -83 92 -140 326 52 -129 260 6
4651 6 6 218 53 -173 -136 -211 142 -87 -121 321 42 -30 37 -9 57 -21 -15 189 81 -187 -62 85 57 32 -212
4676 -212 -249 -71 -85 19 -96 -167 219 -122 -70 14 113 199 44 -111 92 -112 -70 308 185 120 -255 -55 21
4699B1p8J09K75m36J59J3l12K99j70J33K38k70J16Q9k65J52k12PJ71O6N7j01l29
4722b68J41J46k31L68k27L5K43j79J68p9k34Q3K10k91L89l32Q3Kk41m8L59k57
4744a60J19J8k71M37m17L11N1l06J71O0j85k9K51o7m4k11K1K90j35K61o9k42K02
4767E6k12K33J83n32L46j39q9J87J0K54j85k05J26K52l42K44o1o3J36l40O2J86
4789A07k33J39r6j86M47k84R1O8j27j71M22n51K56j0j16K90j29P7M2l51M44K32
4811C61n92K32P6J9K15l57p9K89k66R8P9j81J56o2j91K59k83P3J92k08J57K9p2
4834e6P7R4j57J14l03K94J37m09K23J23k07M03o04p0O70j86k37J11j32L20l1L6
4856B10Kk35K90j07k20O8K8k34L68q9j02L93m67J19J07l87K76k1k1R3q6j29L12
$$ plain form
4699 21 -57 52 327 -109 50 63 -249 50 -120 13 251 -19 97 186 -79 73 -139 -132 39 105 162 61 -268
4722 -268 -127 19 -212 156 -71 -36 207 28 196 117 -117 -34 176 -115 274 -58 25 27 -214 -262 97 -160
4744 -160 -41 -23 -294 143 -274 37 88 -218 -47 13 -172 -201 50 -17 -61 -272 -251 39 -96 165 96 -146 56
4767 56 -156 77 260 -272 74 -65 -154 33 43 297 112 -93 33 285 -57 187 126 63 199 -141 -79 107
4789 107 -126 13 -83 -269 178 -106 -15 53 -74 -245 177 -374 -118 -128 -244 46 -83 -6 36 -315 129 361
4811 361 -231 1 77 96 311 -46 -125 164 -102 -4 75 -106 50 -12 -203 56 -227 -154 38 -170 -13 16 -56
4834 -56 21 115 -42 72 -231 63 200 -209 14 137 -70 333 -271 -341 329 143 -94 17 -115 205 174 210
4856 210 212 -23 267 160 -60 8 36 -198 170 81 -21 372 -95 24 131 -256 20 -1 -22 71 -15 -144 168
4879A68k62J24K35n75R0J88k57M83k18J15k00KJ70m9k83K65r2L8K71l89J94n9
4901d1N2K4M3l87N09k12J60K25l80J24j44P4Q6l14Q0M10m74L03K01n09J91j17
4923i6J19P2j07j44K39l57M43m4J24j19m5PK7J1k53L15n1j76J96j65K2Pr1j53
4947b19J22J01J73l97K23J8j07R5k49J53J84l69K11j05k2M00j51j89J12K8n0m4
4969h2n6N3lj88L41o8l6J63k44r0K47j45k0OK82l53Q9K67k10jJ28k65J96k36J41
4994h4J39j52J48l9qO1J1nN4l21L90l67J39Q0j7K1k3J70j16p8J26j14K00m5k35
5019f5Q0p1o0m7J06J35K4j35j44J16R4m6mn6j53O7K31j71J93k34M3J60l8k18J84
5044ij68L61j51k8L6k8l1j46K06m02L19J06l77L90q3k52J55j29n3M83j24m5l4
$$ plain form
4879 168 -94 30 265 -310 -220 -32 -289 194 -24 91 -109 -107 63 14 -269 -4 -96 -58 213 -176 18 -41
4901 -41 11 35 78 -309 200 -12 148 373 -7 117 -27 47 133 -181 -101 309 -165 138 339 -170 21 -96
4923 -96 23 95 -12 -156 83 -274 169 125 249 130 85 92 119 130 -123 192 141 -35 161 -4 18 25 -66 -219
4947 -219 -97 4 177 -220 3 21 -86 9 -240 -87 97 -272 -61 -166 -188 212 61 -128 -16 12 -38 -82
4969 -82 -138 -85 -88 -276 65 -3 -39 124 -120 -210 37 -108 -128 -122 160 -193 -104 163 -47 -48 80 -185 11 -225 -84
4994 -84 55 -97 51 12 4 65 76 71 125 -196 194 -173 -34 46 29 50 27 197 81 3 129 15 215 170 -65
5019 -65 15 -56 -116 -163 -57 78 102 -33 -177 -61 33 -13 -17 -73 -226 -159 72 -99 94 -140 -97 63 25 -193 -9
5044 -9 -177 184 33 5 41 13 -18 -164 42 -360 -41 65 -312 78 -5 -257 -102 -231 -284 199 75 30 -4
5067dj8J88l92L49j93J04k9j75J82Qk7j12R6R4j23L6K90l18P0k2K00Q7k34j64
5091a07J05J2O0Q6o4j04J20j44K09j16J2l8J97n0j21k36K12N6pJ45k96J40l6j13
5115g8J85j12O7k20j4K35j1l5K5J11l11L1R2R5j29K54k48j42M12l95K31j37J02
5138Hl5R8k49N1J90mJ53k45L8K2L8J78j95j3k8k47K73P9k81R8N5k30K07J2O7J78
5164B18l23J27L5j84J77k03JK28r5J69n35K40M75m32Q24n64J86j64r27P48pk40
5186b46N70r1K26n44j56L81m09QJ64L66l96q2LM12K98n25k65R34r27L19r08J637
5208G69j405K45M00l40N90n3J16l07M69m06k57k5P01j294N79O7Q96n27k90K99
$$ plain form
5067 -4 -22 166 -226 123 -70 34 5 -170 12 20 -7 -119 -23 71 -52 -16 274 -44 26 4 204 291 57 -107
5091 -107 -2 10 70 156 92 -12 108 -36 173 57 69 31 228 178 57 -179 33 89 82 227 -69 71 35 -78
5115 -78 107 -5 62 -158 -172 63 52 17 42 153 -158 -127 -35 60 -69 185 -63 -205 207 -188 43 -94 8
5138 8 -27 71 -178 -127 63 59 212 -33 5 27 65 243 48 35 7 -240 33 112 -169 -71 -16 -246 -39 -27 40 218
5164 218 -105 22 57 -127 50 -153 -152 76 -19 150 -385 -145 330 -102 722 158 344 180 -747 1 -6 -246
5186 -246 324 233 459 -85 -241 140 -269 -261 -97 269 -127 -209 -206 206 504 -21 -286 648 -279 40 -868 769
5208 769 -636 -391 9 -331 259 206 322 15 484 78 -179 -204 497 -797 -218 -151 745 218 -72 227
$$ [...]
8191g7
##END NTUPLES=NMR FID
##END=
