##TITLE=1H_SR26_rm
 CDCl3, 8 sc, 
 27.11.2020
##JCAMPDX= 6.0         $$ Bruker NMR JCAMP-DX V2.0
##DATA TYPE= NMR FID
##DATA CLASS= NTUPLES
##ORIGIN= UXNMR, Bruker Analytische Messtechnik GmbH
##OWNER= root
$$ XWIN-NMR		Version 3.5
$$ Fri Nov 27 11:55:29 2020 Russian Standard Time (UT+4h)  she@DPX200
##.OBSERVE FREQUENCY= 200.1315066352
##.OBSERVE NUCLEUS= ^1H
##.DELAY= (6, 6)
##.ACQUISITION MODE= SIMULTANEOUS
##.ACQUISITION SCHEME= undefined
##.AVERAGES= 8
##.DIGITISER RES= 18
##SPECTROMETER/DATA SYSTEM= spect
##.PULSE SEQUENCE= zg30
##.SOLVENT NAME= CDCl3
##.SHIFT REFERENCE= (INTERNAL, CDCl3, 0, 15.7039)
##AUDIT TRAIL= $$ (NUMBER, WHEN, WHO, WHERE, WHAT)
$$ ##TITLE= Audit trail, XWIN-NMR		Version 3.5
$$ ##JCAMPDX= 5.01
$$ ##ORIGIN= Bruker BioSpin GmbH
$$ ##OWNER= she
$$ F:/spectra/data/she/nmr/H-F/1/audita.txt
$$ ##AUDIT TRAIL=  $$ (NUMBER, WHEN, WHO, WHERE, WHAT)
(   1,<2020-11-27 11:54:19.29 +0400>,<she>,<DPX200>,
      <created by zg, POWCHK disabled, PULCHK disabled
       configuration hash MD5:
       00 E9 B6 7A A2 85 ED C7 34 08 36 98 17 FE 4E 26
       data hash MD5: 16K
       D4 D9 00 4F 2C CD 15 5D 2F 97 87 6E 98 3C 58 09>)
$$ ##END=
$$ 
$$ hash MD5
$$ 57 8E AE B0 5E E3 33 22 32 78 64 06 D0 76 9B 8B
##$RELAX= 
##$RELAX= 
##$RELAX= 
##$RELAX= 
##$RELAX= 
##$RELAX= 
$$ Bruker specific parameters
$$ --------------------------
##$DU= <F:/spectra>
##$EXPNO= 1
##$NAME= <H-F>
##$PROCNO= 1
##$TYPE= <nmr>
##$USER= <she>
##$AMP= (0..31)
100 100 100 100 100 100 100 100 100 100 100 100 100 100 100 100 100 100 
100 100 100 100 100 100 100 100 100 100 100 100 100 100 
##$AQSEQ= 0
##$AQ_mod= 1
##$AUNM= <au_zg>
##$AUTOPOS= <>
##$BF1= 200.13
##$BF2= 200.13
##$BF3= 200.13
##$BF4= 200.13
##$BF5= 200.13
##$BF6= 200.13
##$BF7= 200.13
##$BF8= 200.13
##$BYTORDA= 1
##$CFDGTYP= 0
##$CFRGTYP= 5
##$CHEMSTR= <none>
##$CNST= (0..31)
1 1 145 1 1 1 1 1 1 1 1 1 1 1 1 1 1 1 1 1 1 1 1 1 1 1 1 1 1 1 1 1 
##$CPDPRG= <>
##$CPDPRG1= <>
##$CPDPRG2= <>
##$CPDPRG3= <>
##$CPDPRG4= <mlev>
##$CPDPRG5= <mlev>
##$CPDPRG6= <mlev>
##$CPDPRG7= <mlev>
##$CPDPRG8= <mlev>
##$CPDPRGB= <>
##$CPDPRGT= <>
##$D= (0..31)
0 1.2 0 0 0 0 0 0 0 0.06 0 0.03 0 0 0 0 0.0002 0 0 0 0 0 0 0 0 0 0 0 0 
0 0 0 
##$DATE= 1606463658
##$DBL= (0..7)
120 120 120 120 120 120 120 120 
##$DBP= (0..7)
150 150 150 150 150 150 150 150 
##$DBP07= 0
##$DBPNAM0= <>
##$DBPNAM1= <>
##$DBPNAM2= <>
##$DBPNAM3= <>
##$DBPNAM4= <>
##$DBPNAM5= <>
##$DBPNAM6= <>
##$DBPNAM7= <>
##$DBPOAL= (0..7)
0.5 0.5 0.5 0.5 0.5 0.5 0.5 0.5 
##$DBPOFFS= (0..7)
0 0 0 0 0 0 0 0 
##$DE= 6
##$DECBNUC= <off>
##$DECIM= 32
##$DECNUC= <off>
##$DECSTAT= 4
##$DIGMOD= 1
##$DIGTYP= 9
##$DL= (0..7)
0 120 120 120 120 120 120 120 
##$DP= (0..7)
150 150 150 150 150 150 150 150 
##$DP07= 0
##$DPNAME0= <>
##$DPNAME1= <>
##$DPNAME2= <>
##$DPNAME3= <>
##$DPNAME4= <>
##$DPNAME5= <>
##$DPNAME6= <>
##$DPNAME7= <>
##$DPOAL= (0..7)
0.5 0.5 0.5 0.5 0.5 0.5 0.5 0.5 
##$DPOFFS= (0..7)
0 0 0 0 0 0 0 0 
##$DQDMODE= 0
##$DR= 18
##$DS= 0
##$DSLIST= <SSSSSSSSSSSSSSS>
$$ [...]
##$SUBNAM2= <"">
##$SUBNAM3= <"">
##$SUBNAM4= <"">
##$SUBNAM5= <"">
##$SUBNAM6= <"">
##$SUBNAM7= <"">
##$SUBNAM8= <"">
##$SUBNAM9= <"">
##$SW= 16.9725356469052
##$SWIBOX= (0..15)
0 0 2 0 0 0 0 0 0 0 0 0 0 0 0 0 
##$SW_h= 3396.73913043478
##$TD= 16384
##$TD0= 1
##$TE= 0
##$TE2= 300
##$TE3= 300
##$TEG= 300
##$TL= (0..7)
0 120 120 120 120 120 120 120 
##$TP= (0..7)
150 150 150 150 150 150 150 150 
##$TP07= 0
##$TPNAME0= <>
##$TPNAME1= <>
##$TPNAME2= <>
##$TPNAME3= <>
##$TPNAME4= <>
##$TPNAME5= <>
##$TPNAME6= <>
##$TPNAME7= <>
##$TPOAL= (0..7)
0.5 0.5 0.5 0.5 0.5 0.5 0.5 0.5 
##$TPOFFS= (0..7)
0 0 0 0 0 0 0 0 
##$TUNHIN= 0
##$TUNHOUT= 0
##$TUNXOUT= 0
##$USERA1= <user>
##$USERA2= <user>
##$USERA3= <user>
##$USERA4= <user>
##$USERA5= <user>
##$V9= 5
##$VALIST= <valist>
##$VCLIST= <CCCCCCCCCCCCCCC>
##$VD= 0
##$VDLIST= <DDDDDDDDDDDDDDD>
##$VPLIST= <PPPPPPPPPPPPPPP>
##$VTLIST= <TTTTTTTTTTTTTTT>
##$WBST= 1024
##$WBSW= 4
##$XGAIN= (0..3)
0 0 0 0 
##$XL= 0
##$YL= 0
##$YMAX_a= 892576
##$YMIN_a= -516394
##$ZGOPTNS= <>
##$ZL1= 120
##$ZL2= 120
##$ZL3= 120
##$ZL4= 120
##$ABSF1= 10
##$ABSF2= 0
##$ABSG= 5
##$ABSL= 3
##$ALPHA= 0
##$AQORDER= 0
##$ASSFAC= 0
##$ASSFACI= 0
##$ASSFACX= 0
##$ASSWID= 0
##$AUNMP= <proc_1d>
##$AZFE= 0.1
##$AZFW= 0.1
##$BCFW= 1
##$BC_mod= 2
##$BYTORDP= 1
##$COROFFS= 0
##$CY= 11.3945322036743
##$DATMOD= 1
##$DC= 2
##$DFILT= <>
##$DTYPP= 0
##$F1P= 15.9154993809931
##$F2P= -4.1035820241983
##$FCOR= 0.5
##$FTSIZE= 0
##$FT_mod= 4
##$GAMMA= 1
##$GB= 0.15
##$INTBC= 1
##$INTSCL= 1
##$ISEN= 128
##$LB= 0.24
##$LEV0= 0
##$LPBIN= 0
##$MAXI= 10000
##$MC2= 0
##$MEAN= 0
##$ME_mod= 0
##$MI= 1.114404
##$NCOEF= 0
##$NC_proc= 0
##$NLEV= 6
##$NOISF1= 3.799351
##$NOISF2= 2.8
##$NSP= 1
##$NTH_PI= 0
##$NZP= 0
##$OFFSET= 15.70392
##$PC= 1
##$PHC0= -10687.09
##$PHC1= 8.600882
##$PH_mod= 1
##$PKNL= yes
##$PPARMOD= 0
##$PSCAL= 0
##$PSIGN= 0
##$REVERSE= no
##$SF= 200.130013532006
##$SI= 16384
##$SIGF1= 3
##$SIGF2= 2
##$SINO= 400
##$SIOLD= 16384
##$SREGLST= <1H.CDCl3>
##$SSB= 0
##$STSI= 0
##$STSR= 0
##$SW_p= 3612.71676300578
##$SYMM= 0
##$S_DEV= 0
##$TDeff= 0
##$TDoff= 0
##$TI= <>
##$TILT= no
##$TM1= 0
##$TM2= 0
##$TOPLEV= 0
##$USERP1= <user>
##$USERP2= <user>
##$USERP3= <user>
##$USERP4= <user>
##$USERP5= <user>
##$WDW= 1
##$XDIM= 8192
##$YMAX_p= 0
##$YMIN_p= 0
$$ End of Bruker specific parameters
$$ ---------------------------------
##NTUPLES= NMR FID
##VAR_NAME=  TIME,          FID/REAL,        FID/IMAG
##SYMBOL=    X,             R,               I
##VAR_TYPE=  INDEPENDENT,   DEPENDENT,       DEPENDENT
##VAR_FORM=  AFFN,          ASDF,            ASDF
##VAR_DIM=   8192,          8192,            8192
##UNITS=     SECONDS,       ARBITRARY UNITS, ARBITRARY UNITS
##FACTOR=    0.0002944,     1,               1
##FIRST=     0,             0,               0
##LAST=      2.4114304,     0,               0
##MIN=       0,             -516394,         0
##MAX=       2.4114304,     892576,          0
$$ Real data points
##PAGE= N=1
##DATA TABLE= (X++(R..R)), XYDATA
$$ [...]
2287A650p10r52L02K78j82j258q63R92M6j072j196P38P48o0j520l67J9J274m22
$$ 1650 940 -12 290 568 386 -872 -1735 -743 -697 -1769 -2965 -2227 -1479 -1539 -3059 -3426 -3407 -2133 -2555
2306b555j789P85J374o16j235k33J362J015j021j303J548J037j98j132J60J233
$$ -2555 -4344 -3559 -2185 -2801 -4036 -4269 -2907 -1892 -2913 -4216 -2668 -1631 -1829 -2961 -2801 -1568
2322a568J160p00n26P71J400n20n63K1J724L80n28m93J011J546q95l10k14J589
$$ -1568 -408 -1108 -1634 -863 537 17 -546 -525 1199 1579 1051 558 1569 3115 2220 1910 1696 3285
2340C285N49r16j017J234R61m86j336K87J100P02j683n67Q48P85j044j189l9R80
$$ 3285 3834 2918 1901 3135 4096 3610 2274 2561 3661 4363 2680 2113 2961 3746 2702 1513 1474 2454
2358B454l4j506n87O16N86o26j344OP43o02j388L06k73J093j143j099K79P68j58
$$ 2454 2420 914 327 943 1529 903 -441 -435 308 -294 -1682 -1376 -1649 -556 -1699 -2798 -2519 -1751 -1909
2377a909j400l40P37P77r30r72N25J394n15r89k18J100P10j028o63J117J192j66
$$ -1909 -3309 -3649 -2912 -2135 -3065 -4037 -3512 -2118 -2633 -3622 -3840 -2740 -2030 -3058 -3721 -2604 -1412 -1578
2395a578o98l8J496M18o21l54P38J317j92r07M08J550P58j015l61P66J287n02
$$ -1578 -2276 -2314 -818 -400 -1021 -1375 -637 680 488 -419 -11 1539 2297 1282 921 1687 2974 2472
2413B472j048L83J350P86j460k95J016O93o76j003J60R10J67j006q74Q66Q10j075
$$ 2472 1424 1807 3157 3943 2483 2188 3204 3897 3221 2218 2378 3288 3455 2449 1575 2441 3251 2176
2431B176j305J11L43P63j707J33J165J80j458k733K070L47Kj522m97O22L76m08
$$ 2176 871 982 1325 2088 381 514 1679 1859 401 -2332 -262 85 87 -1435 -1932 -1310 -934 -1342
2449a342j594O93O61l91j042m51J038J94q19o39N60R74k44r97j6J380M31p36l60
$$ -1342 -2936 -2243 -1582 -1973 -3015 -3466 -2428 -2234 -3053 -3692 -3132 -2158 -2402 -3399 -3415 -2035 -1604 -2340 -2700
2468b700N63P74Q7p69K15J293P44j086j07Q14J259k46q53M46J148K33o31k96J029
$$ -2700 -2137 -1363 -1276 -2045 -1830 -537 207 -879 -986 -172 1087 841 -12 434 1582 1815 1184 888 1917
2487A917R63n30n06K80Q75M40r74n31J100N48p40q67J21J153J02j331l51R97K95
$$ 1917 2880 2350 1844 2124 2999 3439 2465 1934 3034 3582 2842 1975 2096 3249 3351 2020 1669 2666 2961
2506B961r18j132p9J479n11j383p81J165K11r79j728N12J420o1j873L48Q07j36
$$ 2961 2043 911 832 2311 1800 417 -364 801 1012 33 -1695 -1183 237 176 -1697 -1349 -542 -678
2524f78j565r5N96R81j282l90o33J121J68r83j98j05J314q95n03K53P57K06j00
$$ -678 -2243 -2338 -1742 -761 -2043 -2433 -3066 -1945 -1777 -2760 -2958 -3063 -1749 -2644 -3147 -2894 -2137 -1931 -2031
2543b031p15R67O48J96j074M86J254N48j088k2Q89J017m82o57M34J474K53q10
$$ -2031 -2746 -1779 -1131 -935 -2009 -1523 -269 279 -809 -831 58 1075 593 -64 370 1844 2097 1287
2561A287m57J148O43l77p23L59J153R2j050n0N52P77o50r78N44P46k25r34m73
$$ 1287 830 1978 2621 2244 1521 1880 3033 3125 2075 2025 2577 3354 2704 1726 2270 3016 2791 1857 1384
2580A384N38P80j318p34K46O38j61j058o22R25M7p14j008K78P74l68j444j78O57
$$ 1384 1922 2702 1384 650 896 1534 1373 315 -307 618 665 -49 -1057 -779 -5 -373 -1817 -1995 -1338
2599a338J19o25q93O64M50m21r91M6R35N4p15q33J287M66l66q33M91R11M14o84
$$ -1338 -1219 -1844 -2737 -2073 -1623 -2044 -3035 -2989 -2054 -2000 -2715 -3548 -2261 -1795 -2161 -2994 -2503 -1592 -1178 -1862
2619a862l84M78J115J14j160O76P68N49r68J75O96J274m85m60L42R31K30o66j61
$$ -1862 -2246 -1768 -653 -539 -1699 -1023 -255 294 -674 -499 197 1471 986 526 868 1799 2029 1363 1202
2638A202Q12N57k87o26L55J057l26j029K66M06P57r76k28Q9Q85n72j470J23N91
$$ 1202 2014 2571 2284 1658 2013 3070 2744 1715 1981 2387 3144 2168 1940 2029 2914 2342 872 995 1586
2657A586M86r45j102J78J575j594j97p5K23N35j169o96O35k6j82j123j94P94J48
$$ 1586 2072 1127 25 203 1778 184 -13 -88 135 670 -499 -1195 -560 -586 -768 -1891 -2085 -1291 -1143
2676a143j127n78Q79M63n26q65K79N86M43j030l57Q84N28l77n47J39J251J40r25
$$ -1143 -2270 -2848 -1969 -1506 -2032 -2897 -2618 -2032 -1589 -2619 -2976 -2092 -1564 -1941 -2488 -2349 -1098 -958 -1883
2695a883j81J162O12m17l26L01J039M2o11k33J131P54j66r47R10P65K98j062J44
$$ -1883 -2064 -902 -290 -707 -1033 -732 307 349 -262 -495 636 1390 1224 277 1187 1952 2250 1188 1332
2714A332P92N59n61o22O59N38P4j113K32N65K23j023l55M86N10k15q43k45Q51
$$ 1332 2124 2683 2122 1500 2159 2697 2771 1658 1890 2455 2678 1655 1300 1786 2296 2081 1238 993 1844
2733A844l8r26q36M30N67j32j225k88R37j94j030o09L48N79l25r45j31P86r3r59
$$ 1844 1806 880 44 474 1041 909 -316 -604 333 139 -891 -1500 -1152 -573 -898 -1843 -1974 -1188 -1281 -2240
2753b240o65J020M38l80p75J65Q84J63r41q7N44O18p5q13J52Q93K34o04J20O12
$$ -2240 -2905 -1885 -1447 -1827 -2602 -2437 -1553 -1390 -2331 -2418 -1874 -1256 -1331 -2144 -1992 -1099 -865 -1469 -1349 -737
2773g37Q34m96l72O84N50K89n11n4Q43N46p40l05P47O26j97n38J87P63O39p46
$$ -737 97 -399 -771 -87 463 752 241 187 1030 1576 836 531 1278 1904 1707 1169 1356 2119 2758 2012
2793B012n56N94P60l49o70l15Q69L65j122l56K42O61m27j050R5P72l9q09o69L77
$$ 2012 1456 2050 2810 2461 1791 1476 2345 2710 1588 1232 1474 2135 1708 658 753 1525 1486 677 8 385
2813C85M33n30j046J16P47m78o44k87L49L28m20j042K20M42K05m44n07L42L99
$$ 385 818 288 -758 -642 105 -373 -1017 -1304 -955 -627 -1047 -2089 -1869 -1427 -1222 -1666 -2173 -1831 -1432
2832a432l58m90K39M28K37p67k91Q58M47k83o93P13O04j04k39N9N64N08l65m18
$$ -1432 -1790 -2280 -2041 -1613 -1376 -2143 -2434 -1576 -1129 -1412 -2105 -1392 -788 -892 -1131 -1072 -508 0 -365 -783
2852g83O42O72J1n70K60Q91K80n25l40P49P03k57l65l19J003J18l55p03O61P72
$$ -783 -141 531 542 -28 232 1123 1403 878 538 1287 1990 1733 1368 1049 2052 2170 1815 1112 1773 2545
2872B545l26n91k94P99M0p23o15P31K64l45p90j31P53k63p75k09L59k6n89m49
$$ 2545 2219 1628 1334 2133 2173 1450 835 1566 1830 1485 695 564 1317 1054 279 70 429 403 -186 -635
2892f35Q1J94n3p75l31M90O91r17o69M7N56L1o77l15O40M79n27p23O34K87L5m12
$$ -635 -554 -360 -413 -1188 -1519 -1029 -338 -1255 -1924 -1877 -1321 -1290 -1967 -2282 -1642 -1163 -1690 -2413 -1779 -1492 -1457 -1869
2914a869q2Q15L50o48m13K92P58M13j149K71P33J147r24l67O74Q34j5p48L08Q53
$$ -1869 -1951 -1136 -786 -1434 -1847 -1555 -797 -384 -1533 -1262 -529 618 -306 -673 1 835 820 72 380 1233
2934A233J49m15k32M98O23J37o79J16M79K77p59j17M00L27Q5j114K63R28k57q49
$$ 1233 1382 967 735 1233 1856 1993 1314 1430 1909 2186 1427 1310 1710 2037 2122 1008 1271 2199 1942 1093
2954A093l12K98N70n55o80J94L68k68n96m72M58L7r5j032J74O36l39n93l62L75
$$ 1093 781 1079 1649 1094 414 608 976 708 112 -360 98 135 40 -992 -818 -182 -521 -1114 -1476 -1101
2974a101L09n51n22Q5P93l45m64m97R23M79r28j46L18L92M1o05k4R90L0r2n08
$$ -1101 -792 -1343 -1865 -1780 -987 -1332 -1796 -2293 -1370 -891 -1819 -1965 -1647 -1255 -1214 -1819 -1843 -853 -823 -915 -1423
2995a423N31N95j13m47K00M51O48n89m83J097L95j64n34L44Q28O6n17j67P24L63
$$ -1423 -892 -297 -410 -857 -657 -206 442 -147 -630 467 862 698 164 508 1336 1402 885 718 1442 1805
3015A805j29o10J73Q37j77n63k06N23L30k55o89j1O18Ro53l68N90J62m09p04K3
$$ 1805 1676 1066 1239 2076 1899 1336 1130 1653 1983 1728 1039 1028 1646 1655 1002 634 1224 1386 977 273 296
3036B96N34j3j109k1M13K42n57o43rN66k59n70k86L61L93q53k08J69N43k44o72
$$ 296 830 817 -292 -313 100 342 -215 -858 -867 -301 -560 -1130 -1416 -1055 -662 -1515 -1723 -1554 -1011 -1255 -1927
3057a927J09L20L27n89K6L33N87m43l87K02K96M87K6n32M18R73o49j8oO46K27
$$ -1927 -1818 -1498 -1171 -1760 -1734 -1401 -814 -1257 -1644 -1442 -1146 -659 -633 -1165 -747 226 -423 -441 -447 199 426
3078D26k88l47M46O66p2l51J17Q64k69K7m45N83N71p04m42J93Q89J60j007M24
$$ 426 138 -209 237 903 831 480 597 1461 1192 1219 774 1357 1928 1224 782 975 1864 2024 1017 1441
3098A441m0K27j40n06j25M14p52n35r3Q38O54j276K12M82n4j398N18Q7nj18o62
$$ 1441 1401 1628 1488 982 857 1271 519 -16 -109 729 1383 107 319 801 747 -651 -133 -46 -51 -169 -831
3119h31Or2N62l12n83N4J66J31k70p88K26P75k16l81k10N91J81m54l39M51N31
$$ -831 -825 -917 -355 -667 -1250 -1196 -1030 -899 -1169 -1957 -1731 -956 -1172 -1553 -1763 -1172 -991 -1445 -1784 -1333 -802
3140h02j43n15L78K97L16k74j63M63J33L51o27K92L88K23j98Q5N01N62q38K71
$$ -802 -945 -1460 -1082 -785 -469 -743 -906 -443 -310 41 -586 -294 94 317 119 204 705 1267 429 700
3160G00L6M55M89q82K20n1N61r8l95L64L01J80l75p53M24p1J54l54j02O54m74
$$ 700 736 1191 1680 798 1018 967 1528 1430 1035 1399 1700 1880 1505 752 1176 1105 1259 905 803 1457 983
3181I83o62K07L50m2l40o54K54L58k66l63l65L92K8m90m06K20L19l58l95r5N36
$$ 983 321 528 878 836 496 -158 96 454 188 -175 -540 -148 -120 -610 -1016 -796 -477 -835 -1230 -1325 -789
3202g89J27p21l59M70N62m08n78P3O93mk28m63M71N10k93j42l62J073J25k72m95
$$ -789 -662 -1383 -1742 -1272 -710 -1118 -1696 -1623 -930 -934 -1162 -1625 -1154 -644 -937 -1079 -1441 -368 -243 -515 -1010
3223a010Q75M40k23l85M60K54j85J40k86P31M8K42q09O40L23j37o57m10J200L2
$$ -1010 -135 305 82 -303 157 411 226 366 80 811 859 1101 292 932 1255 1118 461 51 1251 1283
3243A283J1o25Q45p4n9m27k76M15M60j238K7N05m5P0l43n40J120n56m94k37P6
$$ 1283 1294 669 1514 1440 1381 954 678 1093 1553 315 342 847 802 872 529 -11 1109 553 59 -178 -102
3264a02O00l08p03r6J60J86m88l49J96M92l82o91L00L43M1o13k15N28K90k30m80
$$ -102 498 190 -513 -609 -449 -263 -751 -1100 -904 -412 -794 -1485 -1185 -842 -801 -1414 -1629 -1101 -811 -1041 -1521
3285a521K84M34J08n51j47P74J96m59k24M50R6J78j52n00J118j36L51j054N75
$$ -1521 -1237 -803 -695 -1246 -1393 -619 -423 -882 -1106 -656 -560 -382 -534 -1034 84 -52 299 -755 -180
3304a80Q79M32o19L90N15n89K30n4l77L00L88k03r07K15J794j442j63K12J115
$$ -180 699 1131 512 902 1417 828 1058 1004 627 927 1315 1112 205 420 2214 772 609 821 1936
3323A936o97r54j84O39N01j91m49Q0J32r4o03q1P23n79k9n10K39K22l17m26L4
$$ 1936 1239 285 101 740 1241 1050 601 681 813 719 116 35 758 179 150 -360 -121 101 -216 -642 -608
3344f08J32J6k20l41K04J00n0l73j20L79J82n80k64N66J14j78l01J84L45Q4k66
$$ -608 -476 -460 -680 -1021 -817 -717 -767 -1140 -1260 -881 -699 -1279 -1543 -977 -863 -1041 -1342 -1158 -813 -729 -995
3365i95k56O62P1j36m97M33L74J96l26K0O22J9r7j35L27N62n7p57j7O06L44k6
$$ -995 -1251 -589 -518 -654 -1151 -718 -344 -148 -474 -454 168 187 90 -45 282 844 787 30 13 619 963 937
3387I37l45R7M71q3k84j20J25J72l51O29k25KK55l79l7OJ62n14M9J87n1j28k80
$$ 937 592 689 1160 1077 793 673 798 970 619 1248 1023 1025 1280 901 864 870 1032 518 567 754 703 575 295
3410B95m15L31K13n26j06K11m2n8o95K49K16j2l64k94M48k09J24l69L1J77l9m85
$$ 295 -120 211 424 -102 -208 3 -39 -97 -792 -543 -327 -339 -703 -997 -549 -758 -634 -1003 -972 -795 -834 -1319
3432a319K37M29l6p8p61M20N49K1m36j51N12L37k16l64L23L73J46m46L73L77Q3
$$ -1319 -1082 -653 -689 -767 -1528 -1108 -559 -538 -974 -1125 -613 -276 -492 -856 -533 -160 -14 -460 -87 290 373
3453C73k3k99J98O17l16m15j27J032P1k91PJ28K81m90k18K74L13J03n91J63K54
$$ 373 350 51 249 866 550 135 8 1040 1111 820 827 955 1236 746 528 802 1115 1218 627 790 1044
3474A044n5j18l87J17J25J21m51q2P4K80l82o38L25M19k83l48o7K18J03n90k32
$$ 1044 989 871 484 601 726 847 396 314 388 668 286 -352 -27 392 109 -239 -306 -88 15 -575 -807
3495h07L18M62n10j37l84O00j76m48R1j42O20j30l09j31P9J82j19k97K01L64P9
$$ -807 -489 -27 -537 -674 -1058 -458 -634 -1082 -991 -1133 -513 -643 -952 -1083 -1004 -822 -941 -1238 -1037 -673 -594
3516e94k77j57M46J92k26N5K57L86J3k55J47L05J30l44K99K72o8J47k48o6K09
$$ -594 -871 -1028 -582 -390 -616 -561 -304 82 95 -160 -13 292 422 78 377 649 581 728 480 414 623
3537F23J89o4k77M23M02j25o40K16K44J6j4m61N88n46p5j13p6N05o3m37k05J82
$$ 623 812 748 471 894 1296 1171 531 747 991 1007 993 532 1120 574 499 386 310 815 752 315 110 292
3559B92L66m82j87l7L22n08J05kr7J88n60R3q2N13m20k24j66M08j15k54l71M58
$$ 292 658 176 -11 -48 274 -234 -129 -131 -228 -40 -600 -507 -589 -76 -496 -720 -886 -478 -593 -847 -1218 -760
3581g60m5O4k76L35n7K05r5k58P8L52J75n82M22J18J92k33n5M84K2J0k78R7L62
$$ -760 -805 -741 -1017 -682 -739 -534 -629 -887 -809 -457 -282 -864 -442 -324 -132 -365 -420 64 86 96 -182 -85 277
3604B77M7r9l03L88M75N6k62J4K91r4l57M1M63j89R0l43K80M91m40P7l98o7N49
$$ 277 324 225 -78 310 785 841 579 593 884 790 433 474 937 748 838 495 775 1266 826 903 505 438 987
3627I87m06j97K7J80M3l63j32K2K70l94k37J65J89r8l10M6j92K46l23j08K50o9
$$ 987 581 384 411 591 634 271 139 161 431 37 -200 -35 154 56 -254 -208 -400 -154 -477 -585 -335 -404
3649d04o4l03j1K12J21n04p0K68K39k68p2j39J44L43l30K10m5M13l09l42L62M21
$$ -404 -468 -771 -782 -570 -449 -953 -1023 -755 -516 -784 -856 -995 -851 -508 -838 -628 -673 -260 -569 -911 -549 -128
3671a28m7j15J85J22K66j65j56R3J25L45k78j54L13L92l35j52K40M55R1n70mK80
$$ -128 -175 -290 -105 17 283 118 -38 55 180 525 247 93 406 798 463 311 551 1006 1097 527 523 803
3693H03J24l74l1K40J02K26k92l27J16L63m58l90N56j04pl62l90M55k02L2l40
$$ 803 927 553 522 762 864 1090 798 471 587 950 492 102 658 554 547 185 -205 250 48 80 -260
3714b60L11m01L56j85k74O6K08k04o10N28P6L5m22q0K43J4l02k6K77M0J58p43
$$ -260 51 -350 6 -179 -453 -387 -179 -383 -993 -465 -389 -354 -776 -856 -613 -599 -901 -927 -650 -610 -452 -1195
3736a195K23N30K0l58j75M04L69j78j30K35K19j10j78j40N53nm4PK73J18j87k00
$$ -1195 -972 -442 -422 -780 -955 -551 -182 -360 -490 -255 -36 -146 -324 -464 89 84 40 47 320 438 251 51
3758E1K82O1L82k14j53MN32%l28k57O05N3k63k57j89M73l1m01L40j46R7j3m77
$$ 51 333 394 776 562 409 413 945 945 617 360 965 1018 755 498 309 782 751 350 690 544 641 628 151
3781A51QK40n1l85J82R0o4n57K09r9J81O4l63Q6k03K60k30k14J51K07j64m20L77
$$ 151 159 399 348 -37 145 235 171 -386 -177 -276 -95 -31 -394 -308 -511 -251 -481 -695 -544 -337 -501 -921 -544
3804e44J31J68n79n8K73K16k65j93K25jJ48j7l0J42J08j4j23J71K06n4l5P6Q8
$$ -544 -413 -245 -824 -882 -609 -393 -658 -851 -626 -627 -479 -496 -526 -384 -276 -290 -413 -242 -36 -90 -125 -49 39
3827C9K09r5N7J37m4J25j68K79M6J91k83j30K44K15j55o1l13M09K10l02o4O8L33
$$ 39 248 153 210 347 303 428 260 539 585 776 493 363 607 822 667 606 293 702 912 610 546 614 947
3850I47j06k19j46J21J87l62k36j03M55l35q5k65J84K31n32J39l9k0K37m46J59
$$ 947 841 622 476 597 784 422 186 83 538 203 118 -147 37 268 -264 -125 -164 -184 53 -393 -234
3871b34%j27k35j15Q7K99k95M6j95J26J08j86K26k00L22k39j87J69K80k20J9k25
$$ -234 -234 -361 -596 -711 -624 -325 -620 -574 -769 -643 -535 -721 -495 -695 -373 -612 -799 -630 -350 -570 -551 -776
3893g76L82O2n5L48r4K05J8j20l85M31K83k94k19L32Q0K47l23J85J90K32n9j34
$$ -776 -394 -332 -387 -39 -133 72 90 -30 -415 16 299 5 -214 118 198 445 122 307 497 729 670 536
3915E36K05Kj40J8k31J76M37l19j45N9j55J91j38k78J40N6N5m71K52j2p4m85L24
$$ 536 741 743 603 621 390 566 1003 684 539 598 443 634 496 218 358 414 469 -2 250 238 164 -321 3
3938Ck46O9J25l50J25M76m12l66kJ45L44k87j46O24k55m05p4j49O64qK53n14K3
$$ 3 -243 -174 -49 -399 -274 202 -210 -576 -578 -433 -89 -376 -522 102 -153 -558 -632 -781 -117 -125 128 -386 -363
3961c63L96o37Q8N10L27m73n6k5M7m2L40o45p4J584j006j69Q46J67o16P12j088
$$ -363 33 -604 -516 -6 321 -152 -208 -233 -186 -228 112 -533 -607 977 -29 -198 648 815 199 911 -177
3982a77J023j77o61k31J019n66L01J84r74P0J495j98j25J25o31M55p92R82k66
$$ -177 846 669 8 -223 796 230 531 715 -259 -189 1306 1108 983 1108 477 932 140 1122 856
4001H56j00m96m24n35J533r8m21m24L25M46j011J038k72j269J071j27M3N23L0
$$ 856 756 260 -164 -699 834 736 315 -109 216 662 -349 689 417 -852 219 92 135 658 688
4020F88k87r41N19N8n2r7n64l02L27L75o91N16J93k42J0M96j03j2o7k77K76K9
$$ 688 401 -540 -21 37 -15 -112 -676 -978 -651 -276 -967 -451 -258 -500 -490 6 -97 -109 -176 -453 -177 -148
4042a48J10k45k62Q1M24J68j25k58N83k11m43N22j83M25j28l95Q14o46N14K07
$$ -148 -38 -283 -545 -464 -40 128 3 -255 328 117 -326 196 13 438 310 -85 729 83 597 804
4062H04n15J91J4J55J30n26O09j52l58R6J05L73m74m51k45J232m99p78J285k18
$$ 804 289 480 494 649 779 253 862 710 352 448 553 926 452 1 -244 988 489 -289 996 778
4082G78j27k07j246M16P47r84P54J5k06J27j95k51n2K5J15j60j01J06N64p11P22
$$ 778 651 444 -802 -386 361 -623 131 146 -60 67 -128 -379 -431 -406 -291 -451 -552 -446 118 -593 129
4103A29N2n05O23q31k3r2k04L52N7M99j66n51M34r9N8m43O76j71M56m46k76R0
$$ 129 181 -324 299 -532 -555 -647 -851 -499 -442 57 -109 -660 -226 -325 -267 -710 -34 -205 251 -195 -471 -381
4125c81P17L67l02r18P26M51j063P05L51K6O03j177q9P69k40j18q5O01K1j093
$$ -381 336 703 401 -517 209 660 -403 302 653 679 1282 105 16 785 545 427 342 943 964 -129
4145a29P09o27K98M18K86o78j30M06m07K74m22M54m86L12j00r23J054j50O8p20
$$ -129 580 -47 251 669 955 277 147 553 146 420 -2 452 -34 278 178 -745 309 159 227 -493
4165d93k50Q27k49j89l0K30J17m20r9J22M40m07o5K6K2j36L12n84O17j02n56L19
$$ -493 -743 84 -165 -354 -384 -154 -37 -457 -556 -434 6 -401 -466 -440 -418 -554 -242 -826 -209 -311 -867 -548
4187e48j59M40K55l89N32m28R3J60m40M53P58q86R2J40l40R85q43J3K62J05J61
$$ -548 -707 -267 -12 -401 131 -297 -204 -44 -484 -31 727 -159 -67 73 -267 718 -125 -112 150 255 416
4208D16j33M6j4J46p1k59J02K04n6j25K49k81L85j00m30K65K48l50l0J27n9j5
$$ 416 283 329 315 461 390 131 233 437 381 256 505 224 609 509 79 344 592 242 212 339 280 265
4230B65K00k31n5K98m10L9l4Ko3k26j68K14K31k02k91L12k35K19j18j15J33m3
$$ 265 465 234 179 477 67 106 72 74 11 -215 -383 -169 62 -140 -431 -119 -354 -135 -253 -368 -235 -278
4252b78L65p79K94p2Q6q0j01K50J06k51k65J70J22O8R1k26K77J35Ll62J86K21
$$ -278 87 -692 -398 -470 -384 -464 -565 -315 -209 -460 -725 -555 -433 -365 -274 -500 -223 -88 -85 -447 -261 -40
4274d0K08J0j34j0J74J42j84J20j81K40J8j11J55J78l59K1k03N11P0l77j8K9J05
$$ -40 168 178 44 34 208 350 166 286 105 345 363 252 407 585 226 247 44 555 625 248 230 259 364
4297C64m5j94J79K0j1k99K9L20Q8l66J28k39P38k60p13N65j33k11O9J94L4j93
$$ 364 319 125 304 324 313 14 43 363 451 85 213 -26 712 452 -261 304 171 -40 29 223 257 64
4319F4L53m65o70M01N36p45J1k1J12kO9j67K99n9k32L41j09o1j08M1j74L63K19
$$ 64 417 -48 -718 -317 219 -526 -515 -536 -424 -426 -357 -524 -225 -284 -516 -175 -284 -345 -453 -412 -586 -223 -4
4342dk67K4K48j57K68m72K95L83p6k71j56J13J14J25k44N46L5q36Q66n43N4P29
$$ -4 -271 -247 1 -156 112 -360 -65 318 242 -29 -185 -72 42 167 -77 469 504 -332 534 -9 45 774
4364G74n14m3j24O24l84r6j06M15j76P2m85N41k57k4K07m28j40L22J47J65m18
$$ 774 260 217 93 717 333 237 131 546 370 442 -43 498 241 217 424 -4 -144 178 325 490 72
4385G2M17m50j54p8L08k7l12J91n2k50L50J44n12J88j58k48j09N63O48j152J59
$$ 72 489 39 -115 -193 115 88 -224 -33 -85 -335 15 159 -353 -165 -323 -571 -680 -117 531 -621 -462
4406d62m34O9J354n86K13r72M60l66N59j299J331M24q24P9R37r58J90k60M52L00
$$ -462 -896 -827 527 -59 154 -818 -358 -724 -165 -1464 -133 291 -533 -454 483 -475 -285 -545 -93 207
4426B07j63j54L5N18k08l6k82K52J47K75o75M05J65m3m5m7k87M39j63J22n0K7
$$ 207 44 -110 -75 443 235 199 -83 169 316 591 -84 321 486 443 398 351 64 503 340 462 412 439
4448D39j2j41n4j59M69l45j06Rj09q6J48J8M9J41k5l81M2n1L75o10M39k45OQ5
$$ 439 427 286 232 73 542 197 91 100 -9 -95 53 71 120 261 236 -145 -103 -154 221 -389 50 -195 -189 -104
4472a04j39M6o9K27l43q2L9R9N5J14l14O7K60l59M57l81L45o2m4k0J49Q1l79k67
$$ -104 -243 -197 -266 -39 -382 -464 -425 -326 -271 -157 -471 -404 -144 -503 -46 -427 -82 -144 -188 -208 -59 22 -357 -624
4496f24M68K03k70J16K21K42l30j07L89P7J8l01J07J76m8O0r8%J12K3j00J54k07
$$ -624 -156 47 -223 -107 114 356 26 -81 308 385 403 102 209 385 337 397 299 299 411 434 334 488 281
4519B81r8K10N1k31M1J54p4l69L33J60l55j11K28k06L72l46R5j88M20j98l67J77
$$ 281 183 393 444 213 254 408 334 -35 298 458 103 -8 220 14 386 40 135 -53 367 169 -198 -21
4541b1j14O4l42J25j10M49m19%k75P42j76m14K18o39L82P0J6M02o55O59q9l70
$$ -21 -135 -71 -413 -288 -398 51 -368 -368 -643 99 -77 -491 -273 -912 -530 -460 -444 -42 -697 -38 -127 -497
4563d97J54L44p79M04j0J131q37N6l32K37J38r3J48O0j83K59n20K79L60pj30l68
$$ -497 -343 1 -778 -374 -384 747 -90 -34 -366 -129 9 -84 64 124 -59 200 -320 -41 319 312 182 -186
4585a86J34L80j3K30k64k2L03l68O5J15q3J48M7k25J49L7j35j47Q7j57K26l65
$$ -186 -52 328 315 545 281 259 562 194 259 374 291 439 486 261 410 447 312 165 252 95 321 -44
4607d4K68j83N35m63J49k56K64l54k33L43j62J74o9l54J64j16J77K39m30O6J19
$$ -44 224 41 576 113 262 6 270 -84 -317 26 -136 38 -31 -385 -221 -337 -160 79 -351 -285 -166
4628a66l4j76n2K50Rn59M59K36l18K07J17n86L60j49M7KJ71j36K9N7L03k71K13
$$ -166 -200 -376 -428 -178 -169 -728 -269 -33 -351 -144 -27 -613 -253 -402 -355 -353 -182 -318 -289 -232 71 -200 13
4651A3o85M80K44k01PK34l48P7n47K80K64Q22n17Q42o62J33k53l60K98Q5K4J46
$$ 13 -672 -192 52 -149 -142 92 -256 -179 -726 -446 -182 640 123 965 303 436 183 -177 121 206 230 376
4673C76k15j76M68k31l84K84J82J02k76P4l72L09J91k83j54Q0K23m65J45j7n2
$$ 376 161 -15 453 222 -162 122 304 406 130 204 -168 141 332 49 -105 -25 198 -267 -122 -139 -191
4694a91J12l42K6J09K31k89L2J68r1P5r5j75K46K66n20J35j29j5MK86J64j34o8
$$ -191 -79 -421 -395 -286 -55 -344 -312 -144 -235 -160 -255 -430 -184 82 -438 -303 -432 -447 -443 -157 7 -127 -195
4717a95J44k59R7P7n6N1kM29k9k33q8q2L38k50J67j13M07m0j71j30K04L8n3P8
$$ -195 -51 -310 -213 -136 -192 -141 -143 286 257 24 -64 -146 192 -58 109 -4 403 363 192 62 266 304 251 329
4741C29p7j9L35l65J56L7K7k33j75K92kn9q7j30K26N3j40l61M95j86l2j65K3J44
$$ 329 252 233 568 203 359 396 423 190 15 307 305 246 159 29 255 308 168 -193 302 116 84 -81 -58 86
4765H6n5p3l76L37j15J30k9l09J78l6J86l35J30Q6oJ45l81N89l70j40N9R0Q5Q2
$$ 86 31 -42 -418 -81 -196 -66 -95 -404 -226 -262 -76 -411 -281 -195 -201 -56 -437 152 -218 -358 -299 -209 -124 -42
4789d2m10K01K54j92k87J02M14jk21L30q2m35N68k78R8J51Q8m9k95L26j14J71
$$ -42 -452 -251 3 -189 -476 -374 40 39 -182 148 66 -369 199 -79 19 170 258 209 -86 240 126 297
4811B97k51L56l26J80j8j9J65j40K25l15k1L91m71M81m18J39J38l48J46j91J02
$$ 297 46 402 76 256 238 219 384 244 469 154 133 524 53 534 116 255 393 45 191 0 102
4832A02J15ol17L80k71K81j32n60K67J19jj66p9J25Q7j54k42L91j32l6l84L18
$$ 102 217 211 -106 274 3 284 152 -408 -141 -22 -23 -189 -268 -143 -56 -210 -452 -61 -193 -229 -613 -295
4854b95L02j16l83J42RK47J14m09L86k11R3k52Q4J46L7r9J6K35k37J05J15r1Q3
$$ -295 7 -109 -492 -350 -341 -94 20 -389 -3 -214 -121 -373 -289 -143 -106 -205 -189 46 -191 -86 29 -62 21
4877B1L7k12L84o4M5j46m6J43PM6K9j31J97K1q6J54o7P3k28P4l7P1J35k47p7j76
$$ 21 58 -154 230 166 211 65 19 162 169 215 244 113 310 331 245 399 332 405 177 251 214 285 420 173 96 -80
4903h0N06k74j19k1K29r8j5k45J78L2O0l86o4K41J84j78j84j32K68J32m33O9J71
$$ -80 426 152 33 12 241 143 128 -117 61 93 153 -233 -297 -56 128 -50 -234 -366 -98 34 -399 -330 -159
4926a59O7m2j66P2mk26K44j36J57j38R0j46J92o6q3J62o4L2J79O6l11J26J64%
$$ -159 -92 -134 -300 -228 -232 -458 -214 -350 -193 -331 -241 -387 -195 -261 -344 -182 -246 -214 -35 31 -280 -154 10 10
4950A0j04J91N8n4j51J27L8J5O2n6o6n3K72k77J30J27n3P7p9J30K9j38k97L86
$$ 10 -94 97 155 101 -50 77 115 130 192 136 70 17 289 12 142 269 216 293 214 344 373 235 -62 324
4974C24j58mJ03l31M39m4m6k01J64J83l80lj05l2J44j04k07K9k41N33l47lL5L08
$$ 324 166 162 265 -66 373 329 283 82 246 429 49 46 -59 -91 53 -51 -258 -229 -470 63 -284 -287 -252 56
4998E6k83o6j78K15J92k41L6N7J16j26o4k27M74j30k53L5M9PQ9q8L11p7j1O9R2
$$ 56 -227 -293 -471 -256 -64 -305 -269 -212 -96 -222 -286 -513 -39 -169 -422 -387 -338 -331 -242 -330 -19 -96 -107 -38 54
5023E4l7q5lk98Q51K3p05K39P0J36J75j33j41J28k08Q2j69K82l9MR5k89K80J59
$$ 54 17 -68 -71 -369 482 505 -200 39 109 245 420 287 146 274 66 148 -21 261 222 226 321 32 312 471
5047D71j07l51K38j80J44M0J0%l83L29j32L02l22k05J70j21N8J96J9k10k60K05
$$ 471 364 13 251 71 215 255 265 265 -118 211 79 381 59 -146 24 -97 -39 157 176 -34 -294 -89
5069h9n4J43j36J04j46J69k50j49J24J13J15n20L98pK2l1j23J05P2j42PK58J42
$$ -89 -143 0 -136 -32 -178 -9 -259 -408 -284 -171 -56 -576 -178 -185 -163 -194 -317 -212 -140 -282 -275 -17 125
5092A25m44K79k09L24j12k05J55k95L92P1l09J38J54q7M8j51L99J00j55K30m48
$$ 125 -319 -40 -249 75 -37 -242 -87 -382 10 81 -228 -90 64 -23 25 -126 273 373 218 448 0
5113@N5N27n87J86M06o73J62M89l82K9j55O15n47J51M9J06m90M9O64j043J002
$$ 0 55 582 -5 181 587 -86 76 565 183 212 57 672 125 276 325 431 -59 -10 654 -389 613
5134F13p93r4K05m60M22J14L59k76o54Q30l81L64n57J65j5J29r3j62m2L20j03
$$ 613 -180 -274 -69 -529 -107 7 366 90 -564 266 -115 249 -308 -143 -158 -29 -122 -284 -326 -6 -109
5155a09p9j33K25J73j27o29P26p65K75K97jj19M60k84j96K29l50M39l49J31L9
$$ -109 -188 -321 -96 77 -50 -679 47 -718 -443 -146 -147 -266 194 -90 -286 -57 -407 32 -317 -186 -147
5176a47K76K7q0k00J24K15r3J15j92J38M43n15n1J98j6l32J07M31k64Q6m1L9k82
$$ -147 129 156 76 -124 0 215 122 237 45 183 626 111 60 258 242 -90 17 448 184 270 229 268 -14
5199a4L15k2l97M64j09k3k95M27k31J13k92J14K20j79j52k02J20K70l49j15R0
$$ -14 301 279 -118 346 237 214 -81 346 115 228 -64 50 270 91 -61 -263 -143 127 -222 -337 -247
5220b47K94r7j37K35j67M4k09j5JK47K4k52q9N09k20j24k81M70j41M0p7p7J02
$$ -247 47 -50 -187 48 -119 -75 -284 -299 -298 -51 -27 -279 -368 141 -79 -203 -484 -14 -155 -115 -192 -269 -167
5243a67J43j37q5N26L55j004K53N65l26J85m98K82o49J379k90q85M38L62j093
$$ -167 -24 -161 -246 280 635 -369 -116 449 123 308 -190 92 -557 822 532 -353 85 447 -646
5262f46P90m9M01K8m53l15J474r92P3N83j010L19K48N08p79l53N14o79J049r05
$$ -646 144 95 496 524 71 -244 1230 238 311 894 -116 203 451 959 180 -173 341 -338 711 -194
5282a94J57J05P97r61J41M3K30qj2q72N95M51p27L25l07J60j1l35M41N4k12k08
$$ -194 -37 68 865 -96 45 88 318 310 298 -574 21 472 -255 70 -237 -77 -88 -423 18 72 -140 -348
5304c48j1J35J23q1j55K21Nk29M9J78R0k2k18K16j12m7J94m13K81lJ44lN4J24
$$ -348 -359 -224 -101 -182 -337 -116 -111 -340 -291 -113 -23 -45 -263 -47 -159 -206 -12 -425 -144 -147 -3 -6 48 172
5328A72J51j46o8j39J26N7j86k2M4J34J0L02l71J16m8j82K56j74J40n6r3J10J66
$$ 172 323 177 109 -30 96 153 -33 -55 -11 123 133 435 64 180 132 -50 206 32 172 116 23 133 299
5351B99k34n40P69P4m00m05M75L9J58m9l89L92l86M24O8k73l22L48k82k33K20
$$ 299 65 -475 294 368 -32 -437 38 77 235 186 -203 189 -197 227 295 22 -300 48 -234 -467 -247
5372b47j74M01k35J51K50J37o96K87l87K99q2J03M12l85j01j26M60k02R1j90m1
$$ -247 -421 -20 -255 -104 146 283 -413 -126 -513 -214 -296 -193 219 -166 -267 -393 67 -135 -44 -234 -275
5393b75K65l28K73j22N7P9q7O3j30N2n5k57N05k41L69j63M5q5K93j17N28l25L33
$$ -275 -10 -338 -65 -187 -130 -51 -138 -75 -205 -153 -208 -465 40 -201 168 5 50 -35 258 141 669 344 677
5416F77j40l04O2m30q4N08m00l33J329q19P03m69M03n22k56N25L97n96o50P95
$$ 677 537 233 295 -135 -219 289 -111 -444 885 66 769 300 703 181 -75 450 847 251 -399 396
5436C96J0n45m05K2J391q82o47P01M13o17l76L68m66K75K46k45k4J97L10k27L42
$$ 396 406 -139 -544 -522 869 -13 -660 41 454 -163 -539 -171 -637 -362 -116 -361 -385 -188 122 -105 237
5457B37o89J08O09l39p2J72l30N4K13K75k52l04O99k46J32l78K38m38N16K62p01
$$ 237 -452 -344 265 -74 -146 26 -304 -250 -37 238 -14 -318 381 135 267 -111 127 -311 205 467 -234
5478b34M13l12J55j2L48J92k25m43L56J48j70%N6m27Q63J70j036K54l9N45o62
$$ -234 179 -133 22 10 358 550 325 -118 238 386 216 216 272 -155 708 878 -158 96 57 602 -60
5499f0J94n65O53l34J3M82k90J16k50j55R2K96k14K44l88K09J13k05j22n7P2J
$$ -60 134 -431 222 -112 -99 383 93 209 -41 -196 -104 192 -22 222 -166 43 156 -49 -171 -228 -156 -155
5521a55J91k38L0J91j07J16k37K29j69r4nJ19r4j4j2Q5K01L2j04q9l3L6R9j0k16
$$ -155 36 -202 -172 19 -88 28 -209 20 -149 -243 -248 -129 -223 -237 -249 -164 37 69 -35 -124 -157 -121 -22 -32 -248
5546b48J61r0O6J20j47o9J96j06K45j89J95Q4k56J95k0O6n5p5K27k7j72P6q1J39
$$ -248 -87 -177 -111 9 -138 -207 -11 -117 128 -61 134 218 -38 157 137 203 148 73 300 273 101 177 96 235
5570B35K7j61p5J59P7l55oK37L50q8l55m1K59P6j23l5l3j65J50j6l13K39o8j89
$$ 235 262 101 26 185 262 -93 -99 138 488 400 45 4 263 339 216 181 148 -17 133 117 -196 43 -25 -214
5594b14K45m5K15j38l57K47k78M23k04J21m07K33J8k19L05j44R0n6l51L14J95
$$ -214 31 -14 201 63 -294 -47 -325 98 -106 15 -392 -159 -141 -360 -55 -199 -109 -165 -516 -202 -7
5615gJ7m7J08q8k32J25j23M07q7j37j23L57j9q5q6Q9j73M6J49n7m4J87Q0L4j16
$$ -7 10 -37 71 -17 -249 -124 -247 160 73 -64 -187 170 151 66 -20 69 -104 -58 91 34 -10 177 257 291 175
5640A75j21L94l83J49J85m08J50j89J38R9K6n2M5J30o02O1K16P0K2j78K75m06
$$ 175 54 448 65 214 399 -9 141 -48 90 189 215 163 208 338 -264 -203 13 83 105 -73 202 -204
5662b04L36l17L16k7j23J93l47jK65j68Jn9l9j3J21j17K72l24Q5o6n7K64k02j12
$$ -204 132 -185 131 104 -19 174 -173 -174 91 -77 -76 -135 -174 -187 -66 -183 89 -235 -150 -216 -273 -9 -211 -323
5686c23J46N4j65R7q4J41p4J59L2k06J04L1J41Jl44J82P4L0Q6j77j6K19O0k75
$$ -323 -177 -123 -288 -191 -275 -134 -208 -49 -17 -223 -119 -88 53 54 -290 -108 -34 -4 82 -95 -111 108 168 -107
5710a07L27o3N9j61K1r3o8K66J43l08J75q1q7j03K84J9l11K40m09N07r1K6m4k39
$$ -107 220 157 216 55 76 -17 -85 181 324 16 191 110 23 -80 204 223 -88 152 -257 250 159 185 141 -98
5734i8J66O1j11n4OJ94j91M6j1K73k36p8r8L33l75O7k8oJ73j10l0J7j46j19K08
$$ -98 68 129 18 -36 -30 164 -27 19 8 281 45 -33 -131 202 -173 -106 -134 -140 33 -77 -107 -90 -236 -355 -147
5759a47k41O34k26j91J08J10R4mk86J13R3J3j90J24J53k92J13J63k73K40l06K61
$$ -147 -388 246 20 -171 -63 47 141 137 -149 -36 57 70 -120 4 157 -135 -22 141 -132 108 -198 63
5781F3O4K6P1k79K92R0j71m6j52J09Q2j02K20l27J45J50m4k07k06L85L9M5L8j38
$$ 63 127 153 224 -55 237 327 156 110 -42 67 149 47 267 -60 85 235 191 -16 -222 163 202 247 285 147
5805A47k1Kj11L6L03m11K29q5r3Rn1k04R5J27j97o1J42J91k95J43j3M5J20j00
$$ 147 126 128 17 53 356 -55 174 89 -4 5 -46 -250 -155 -28 -225 -286 -144 47 -248 -105 -118 -73 47 -53
5829e3l15L30K59n16J71k64k3M76k94K4L40j08k53M40l62P4R1r5J71j45q2M21
$$ -53 -368 -38 221 -295 -124 -388 -411 65 -229 -205 135 27 -226 214 -148 -74 17 -78 93 -52 -134 287
5851B87k89L4J35j93L07l32R0pK42k35k6P0j3J61r0O8P8J3Rj47j61L08j74q5l1
$$ 287 -2 32 167 -26 281 -51 39 32 274 39 13 83 70 231 141 209 287 300 309 162 1 309 135 50 19
5876A9J09K54o04L52r9q1n5L61j73o0K0j33L38k26j0J65p1l95L55j82P2k07K63
$$ 19 128 382 -222 130 31 -50 -105 256 83 23 43 -90 248 22 12 177 106 -289 66 -116 -44 -251 12
5899A2j92K13N6o36K69L02j33O4%q1l1J65j67K0Q1J7p2J01o5p6or9K16L46k57
$$ 12 -180 33 89 -547 -278 24 -109 -45 -45 -126 -157 8 -159 -139 -58 -41 -113 -12 -77 -153 -159 -258 -42 304 47
5924D7J93j21n8k0J39l91Q8J56K34R8l32J2Q1K21m27J69j46j05K41M1K3p1P1j1
$$ 47 240 119 61 41 180 -211 -123 33 267 365 33 45 126 347 -80 89 -57 -162 79 120 143 72 143 132
5948A32L33l35j80J81q8M5q7J18k09M87l75K2nj15K66k10J70l12J11Mp9%J68j46
$$ 132 465 130 -50 131 43 88 1 119 -90 397 22 44 39 -76 190 -20 150 -162 -51 -47 -126 -126 42 -104
5972a04L0o6j07L77j53j18Q4m4M4n9J47k75K16J23k57p3J03N2p9k13K24O1j42
$$ -104 -74 -140 -247 130 -23 -141 -57 -101 -57 -116 31 -244 -28 95 -162 -235 -132 -80 -159 -372 -148 -87 -229
5995b29J53J55j09r6m6R6J96J40j26l3R2k80K59j15K59j88j25K3P5K6j1lk17K42
$$ -229 -76 79 -30 -126 -172 -76 120 260 134 101 193 -87 172 57 316 128 3 26 101 127 116 113 -104 138
6019A38M2k41K22l50K39p3J22p5j86J42J62k06J30k23K12mj43m7j32L47J0l61
$$ 138 180 -61 161 -189 50 -23 99 24 -162 -20 142 -64 66 -157 55 51 -92 -139 -271 76 86 -275
6041b75R1K00k09J19Pj32M72k55q8M7j85J71k68J63J50j5j78N7k18J77K32j81
$$ -275 -184 16 -193 -74 -67 -199 273 18 -70 -23 -208 -37 -305 -142 8 -7 -185 -128 -346 -169 63 -118
6063a18K16j71J44p7j85k7L21j56O5k2q7Q4Q2k50J12J07J01k05P7J24M7m16L89
$$ -118 98 -73 71 -6 -191 -218 103 -53 12 -10 -97 -13 69 -181 -69 38 139 -66 11 135 182 -234 155
6086A55k4k11K13j24O4J4nj52qK59k69nL20l64J46j92o6L11J63j09Qj72J22pl6
$$ 155 131 -80 133 9 73 87 82 -70 -78 181 -88 -93 227 -137 9 -183 -249 62 225 116 124 -48 74 67 31
6111C1k32J74j57JK54L0O3j64o3r3K61k5j40j8J7J16k89K0j0K26j79J68N3k65
$$ 31 -201 -27 -184 -183 71 101 164 0 -63 -156 105 80 -60 -78 -61 55 -234 -214 -224 2 -177 -9 44 -221
6135b21R9l2K9q6K45j37j04L89j41L68l48j90j22J95J81j22k0O7k80K05K91k26
$$ -221 -122 -154 -125 -211 34 -103 -207 182 41 409 61 -129 -251 -56 125 3 -17 50 -230 -25 266 40
6157D0KJJM8R1k3J23k12K19k99J4q1R9J37k08K20r2Q0P3l7j99j00o6L33nj53O8
$$ 40 42 43 44 92 183 160 283 71 290 -9 5 -76 23 160 -48 172 80 160 233 196 -3 -103 -169 164 159 6 74
6184G4J3k8j73J34p6J01m04K46K30l20J83J40k92L50k90Nm1L6J84k52M5L2j12
$$ 74 87 59 -114 20 -56 45 -359 -113 117 -203 -20 120 -172 178 -112 -107 -148 -112 72 -180 -135 -103 -215
6207b15Q5k54K89p9J69K68r4m47K54k66M58J71o26K88l78K33J55Rr3M60k8n98
$$ -215 -130 -384 -95 -174 -5 263 169 -278 -24 -290 168 339 -287 1 -377 -144 11 20 -73 387 359 -239
6229b39M53K6l21K29N3J04M9k8r17R99J42p62K38LK98j28p7O7rj68J98j90j19
$$ -239 214 240 -81 148 201 305 354 326 -591 408 550 -212 26 29 327 199 122 189 180 12 210 20 -99
6252i9L05j9k67J90n4J26j33k51K04M43n80J79o6k69K49k04L17l18J68n19M68
$$ -99 206 187 -80 110 56 182 49 -202 2 445 -135 44 -22 -291 -42 -246 71 -247 -79 -598 -130
6273a30k9O51l41l30p5M90o19P79o96M70J23k38J2q1k69q8j56J15O99o29N60o08
$$ -130 -159 492 151 -179 -254 236 -383 396 -300 170 293 55 67 -14 -283 -371 -527 -412 287 -342 218 -390
6295c90Q03p17M43k49j30l14N0M63PR2R5k16Mn20m1Q44m92j56N44r7l28L74o13
$$ -390 413 -304 139 -110 -240 -554 -504 -41 -34 58 153 -63 -59 -579 -620 224 -268 -424 120 23 -305 69 -544
6318e44J79L49J20K84j109R39j19m39J74P2m24K32j0L62P9J85j65j50j51M01j94
$$ -544 -365 -16 104 388 -721 218 99 -340 -166 -94 -518 -286 -296 66 145 330 165 15 -136 265 71
6339G1n01N96l04K03kk68K37K83m51j68L92j18k8j72L26j10k04L86n32L99p4j02
$$ 71 -430 166 -138 65 63 -205 32 315 -136 -304 88 -30 -58 -230 96 -14 -218 168 -364 35 -39 -141
6361a41Q4N1j29K89q8kk7q2K11n4k8J01j21l30L75J35l03J89M4j41K6J34j84J00
$$ -141 -57 -6 -135 154 66 64 37 -45 166 112 84 185 64 -266 109 244 -59 130 174 33 59 193 9 109
6385A09k66RK09r1m2K50L43m49jo7L64k12j87K83M5j52k38L71j94K40l58k9N2
$$ 109 -157 -148 61 -30 -72 178 521 72 71 4 368 156 -31 252 297 145 -93 278 84 324 -34 -63 -11
6408a1J13j31jK94j20L24o22J60Q0J46M7k84j14P23m55K07Mm20j53k17K26M89
$$ -11 102 -29 -30 264 144 468 -154 6 86 232 279 -5 -119 604 149 356 360 -60 -213 -430 -204 285
6430B85n53L66j38k69K48J02L9k71R9n4J56j8n4K42j34jk5m24O06q9J87m72J79
$$ 285 -268 98 -40 -309 -61 41 80 -191 -92 -146 10 -8 -62 180 46 45 20 -404 202 113 300 -172 7
6453Gj2j35K45j2L7P4j91m6J91J3p5l19K09L53j61l06K24L37k17kq2r4r7k7J64
$$ 7 -5 -140 105 93 130 204 13 -33 158 171 96 -223 -14 339 178 -128 96 433 216 214 132 38 -59 -86 78
6478G8k11J92q4N5O6m2j97J89k41J91K9k29N0R3K06k78K3Rl9J2kK84m6j84J2M5
$$ 78 -133 59 -25 30 96 54 -143 46 -195 -4 25 -204 -154 -61 145 -133 -110 -101 -140 -128 -130 154 108 -76 -64 -19
6504a9pj01L7L16m34M5J06j9j41J95n1j13J96n5J77K2j20K5J91m08O1j9K04m20
$$ -19 -26 -127 -90 226 -208 -163 -57 -76 -217 -22 -73 -186 10 -45 132 154 34 59 250 -158 -97 -116 88 -332
6528c32L65J80l0j49j0J66k26J46p1L28l24q2j5J06K52pl68J16K8k53J34J07J28
$$ -332 33 213 183 34 24 190 -36 110 39 367 43 -39 -54 52 304 297 -71 45 73 -180 -46 61 189
6551A89r7j12j32P4p1K34J8l24R6K50N7j69j45K22m4K9J04j76J99l70K92j30J44
$$ 189 92 -20 -152 -78 -149 85 103 -221 -125 125 182 13 -132 90 46 75 179 3 202 -168 124 -6 138
6574A38j90n9J39k23J66M3l05N9J46J1J1J88Jk99J49j12KR9J25j57k50L25P8l2
$$ 138 -52 -111 28 -195 -29 14 -291 -232 -86 -75 -64 124 125 -174 -25 -137 -135 -36 89 -68 -318 7 85 53
6598E3j10N5N1L35l36j19J66k11K00r6j4Q5n7j08M40j54j60j56K79k30K15m2j02
$$ 53 -57 -2 49 384 48 -71 95 -116 84 -12 -26 59 2 -106 334 180 20 -136 143 -87 128 86 -16
6621a6J09k07K34j81K56l34J17J24l61L26O8J67l50J1K8K24j77l7j62K14m4p2
$$ -16 93 -114 120 -61 195 -139 -22 102 -259 67 135 302 -48 -37 -9 215 38 1 -161 53 9 -63
6643f3P1o8O3j1j73j27L73m2l33K02J42l5j10P2Lj43K12j55q6J02l30K78P5j23
$$ -63 8 -60 3 -8 -181 -308 65 23 -310 -108 34 -1 -111 -39 -36 -179 33 -122 -208 -106 -436 -158 -83 -206
6667b06O0J35K41l39J44j0n4K4k5K60n3k73K39N5k11K20q2k04K00K2k84K08M0
$$ -206 -146 -11 230 -109 35 25 -29 -5 -30 230 177 -96 143 198 -13 207 125 -79 121 143 -141 67 107
6690A07j04j55K35l0j20K84Ll70L97j83j00J19Q4j27j02J20o4P9J5O4r3M0j1J8
$$ 107 3 -152 83 53 -67 217 220 -150 247 64 -36 83 167 40 -62 58 -6 73 88 152 59 99 88 106
6714A06j54j41R6P4j66J64n0L6N9j33Q0P8K7j27q9m9J84Rm0m3o4l4J87p7k7J16
$$ 106 -48 -189 -93 -19 -185 -21 -71 -35 24 -109 -29 49 76 -51 -140 -189 -5 4 -36 -79 -143 -177 10 -67 -94 22
6740B2J1j81K92m8q5k50qL53k19R0J48j15lN1j21j72L01K9k62L41j48K21j80O9
$$ 22 33 -148 144 96 11 -239 -247 106 -113 -23 125 10 7 58 -63 -235 66 95 -167 174 26 247 67 136
6764A36J18l39K0r8J24p5J8J61J22M5k42P1l1J57j32P9j83pL08k19r5J01K6j44
$$ 136 254 -85 -65 -163 -39 -114 -96 65 187 232 -10 61 30 187 55 134 -49 -56 252 33 -62 39 65 -79
6788g9M8J24L5l62K08Q6m1k23M07K08l55J91k44k98R4j18K9K63j49J86L3J39l29
$$ -79 -31 93 128 -234 -26 60 19 -204 203 411 56 247 3 -295 -201 -319 -290 -27 -176 10 43 182 -147
6811a47N9J4j51J16L70k50l1j23N36j36m00R2k04M8k55O98o72N02j46p42J007
$$ -147 -88 -74 -225 -109 261 11 -20 -143 393 257 -143 -51 -255 -207 -462 236 -436 66 -80 -822 185
6832A85p5L04j150O29Q07j145O24K13M69n07K7J4p46J83N74o45O58M67j034L7
$$ 185 110 414 -736 -107 700 -445 179 392 861 354 381 395 -351 -168 406 -239 419 886 -148 -111
6852a11K34k95Q60m42m57O51j357Q17j45m43J179Q84j200K04r2n59O49L39Q9j062
$$ -111 123 -172 688 246 -211 440 -917 -100 -245 -688 491 1375 175 379 287 -272 377 716 805 -257
6872b57l1P93q52K6K64l42J008j008O24k18J01k09k92P65q87N62p5q4Q8j27J99
$$ -257 -288 505 -347 -321 -57 -399 609 -399 225 7 108 -101 -393 372 -515 47 -28 -112 -24 -151 48
6893D8O3j59K01j09m9M9J29l32k46M37j65J47P7j08j92K1L89o13P1R04n64L42
$$ 48 111 -48 153 44 -5 44 173 -159 -405 32 -133 14 91 -17 -209 -188 201 -412 -341 563 -1 341
6915C41l43N63j52k35q69O75K16k88j53l72N26m92J195o9m26k23n07l9L90N76
$$ 341 -2 561 409 174 -695 -20 196 -92 -245 -617 -91 -583 612 543 117 -106 -613 -652 -262 314
6935C14j90j02O0o10N69k83L14m60N32j67M41l72r19L94M06m1J68J9J14m58M28
$$ 314 124 22 82 -528 41 -242 72 -388 144 -23 418 46 -873 -479 -73 -114 54 73 187 -271 157
6956A57r57Q67l34L00k21L27%n31K56j58M26k54L4k1L1J51Rn1r1P9L30m68K61
$$ 157 -800 67 -267 33 -188 139 139 -392 -136 -294 132 -122 -88 -109 -78 73 82 31 -60 19 349 -119 142
6979A42q4j27J10J32N5r4J40j84j18k38L98N1j44J14l29L61l24K24j12J34l6J93
$$ 142 58 -69 41 173 228 134 274 90 -28 -266 132 183 39 153 -176 185 -139 85 -27 107 71 264
7001B64j83L37o70K22q8K77J00k24l43P22o22J33P36r28N72k53k66K16J0k24K61
$$ 264 81 418 -252 -30 -118 159 259 35 -308 414 -208 -75 661 -267 305 52 -214 2 12 -212 49
7022D9m5o0p0L68j82r5k1J22j8jmpm2q0J03o2M1j10Qj24L29l7r4m8jN4J85k21
$$ 49 4 -56 -126 242 60 -35 -56 66 48 47 43 36 -6 -86 17 -45 -4 -114 -106 -230 99 62 -32 -80 -81 -27 158 -63
7050f3J14J98k05l9N9j68J60j03j1k09L19P4k35k5K73p5o6J79N2l03L48k21p9
$$ -63 51 249 44 5 64 -104 56 -47 -58 -267 52 126 -109 -134 139 64 -2 177 229 -74 274 53 -26
7073b6J73j31k27L88J6l83M74j12j73K29j94n0Q6j90L66k11n1O2J4K71l08Lj30
$$ -26 147 16 -211 177 193 -190 284 172 -1 228 34 -16 70 -120 246 35 -16 46 60 331 23 26 -104
7096a04O2J54m49L09j8O3m1j85J00L5Q9j54K44k27jj02J81pL1j90L49l17K63j72
$$ -104 -42 112 -337 -28 -46 17 -24 -209 -109 -74 15 -139 105 -122 -123 -225 -44 -51 -20 -210 139 -178 85 -87
7120h7O6pJ61N0n7J19j92K4j22J54j19k63N04j44k23L68k11P7j36P7R6k37J63
$$ -87 -21 -28 133 183 126 245 53 77 -45 109 -10 -273 231 87 -136 232 21 98 -38 39 135 -102 61
7143F1P9j15N3j27j68K82J5j01M02m62K51k20K0n6J60k15M4N9J22N8J8K49l31
$$ 61 140 25 78 -49 -217 65 80 -21 381 -81 170 -50 -30 -86 74 -141 -97 -38 84 142 160 409 78
7166G8p4K4q4j36K38j12KJ09j06J07r3j50J15n3K47q9K9j33j06n3J37J77K25n94
$$ 78 4 28 -56 -192 46 -66 -64 45 -61 46 -47 -197 -82 -135 112 23 52 -81 -187 -240 -103 74 299 -295
7190b95L10n4p7K4l4K99l64J41k8N9k9R4j01JK37J07m42K15J04k47J75o8j65J28
$$ -295 15 -39 -116 -92 -126 173 -191 -50 -78 -19 -48 46 -55 -54 183 290 -152 63 167 -80 95 27 -138 -10
7214a0O9K43p3k6j72j15J54l0j07L28k53N1O6l9K1K12k30r4j07j4o3K95J35K3
$$ -10 59 302 229 203 31 -84 70 40 -67 261 8 59 125 86 107 319 89 -5 -112 -126 -189 106 241 264
7238B64k32J58j66j29L14q3m6K27m87K68j32O4Mj52m9j3o2O4J68J13j96j51L54
$$ 264 32 190 24 -105 209 126 80 307 -180 88 -44 20 24 -128 -177 -190 -252 -188 -20 93 -103 -254 100
7261A00k0j78J21Ql02K66m3q1p2K43O3q33N84j55P27n55j46M74J73o47n4k69O38
$$ 100 80 -98 23 31 -271 -5 -48 -129 -201 42 105 -728 -144 -299 428 -127 -273 201 374 -273 -327 -596 42
7284D2k30N17p67J32R2O9M18o9j32L56m01M16n93J19L37j73j71N7k21L21m5l49
$$ 42 -188 329 -438 -306 -214 -145 273 204 72 428 27 443 -150 -31 306 133 -38 19 -202 119 74 -275
7306b75L36p6n1m7K52j44K39j60oK57j64p5L0M4k38J69j79k75q3K51L02Rm05J67
$$ -275 61 -15 -66 -113 139 -5 234 74 68 325 161 86 116 160 -78 91 -88 -363 -446 -195 107 116 -289 -122
7330a22J87p86J308p11k00N31k64n7l23J318o55R5m86k91K49N05l48O4j61K21
$$ -122 65 -721 587 -124 -324 207 -57 -114 -437 881 226 321 -165 -456 -207 298 -50 14 -147 74
7350G4L18m5n14J20K38n11K78L67p15J87M08K45l40N0k04K68j5m90K46J88l20
$$ 74 392 347 -167 -47 191 -320 -42 325 -390 -203 205 450 110 160 -44 224 209 -281 -35 153 -167
7371a67l38J50L87o87N79o7M3L18m79Q5P96j229j94M63L71m5Q1M96n56l16O41
$$ -167 -505 -355 32 -655 -76 -143 -100 218 -261 -176 620 -609 -803 -340 31 -14 67 563 7 -309 332
7392C32J84n69n9O99k83p78L76r8Q8p1k09M57j95j56K16n0Rj42K75O3n33L12J90
$$ 332 516 -53 -112 587 304 -474 -98 -196 -108 -179 -388 69 -126 -282 -66 -116 -107 -249 26 89 -444 -132 58
7415E8j27n8L7J1R5m2R6l49L20l57J99J49P7k88L13k66J05J90k95L77l15J17j09
$$ 58 -69 -127 -90 -79 16 -26 70 -279 41 -316 -117 32 109 -179 134 -132 -27 163 -132 245 -70 47 -62
7438f2J99j55J29j93r3K88M8l44P6J37K5P8j50K85m05K64j52M0K21q7l57K36Q3
$$ -62 137 -18 111 -82 -175 113 161 -183 -107 30 55 133 -17 268 -137 127 -25 15 236 149 -208 28 111
7461A11j47J24l2k53K60k06N8K16j41K49n53K06o2M12j66l13J69m9J38q7K22j36
$$ 111 -36 88 56 -197 63 -143 -85 131 -10 239 -314 -108 -170 242 76 -237 -68 -117 21 -66 156 20
7483B0J32k49J55q3oj63J51K72k82k2K8k41P8K33k26Q1O4J77j51K0J7M1j57J81
$$ 20 152 -97 58 -25 -31 -194 -43 229 -53 -75 -47 -288 -210 23 -203 -122 -58 119 -32 -12 5 46 -111 70
7507G0k18J69K48l82N2%Q8j59K78r7Pl7j25J2M24l08Q1l78K78P5j55J63o5J4O
$$ 70 -148 21 269 -113 -61 -61 27 -132 146 49 56 19 -106 -94 330 22 103 -275 3 78 -77 86 21 35 41
7532D1k70K31J16nL27l53m02K59K69j93q8K05k68K45mj69q9L3k18O69l52J37j75
$$ 41 -229 2 118 113 440 87 -315 -56 213 20 -68 137 -131 114 110 -59 -148 -115 -333 336 -16 121 -54
7555e4J40k20j25L33l58K59l40L33M24p03J99J53p50R23n02LK40m3J52l29j4J58
$$ -54 86 -134 -259 74 -284 -25 -365 -32 392 -311 -112 41 -709 214 -288 -285 -45 -88 64 -265 -279 -121
7577a21P4K58k01P4K35l79J57l19K24J34L9k25K67j58p4Q4n2K91k03k61K09O1
$$ -121 -47 211 10 84 319 -60 97 -222 2 136 175 -50 217 59 -15 69 17 308 105 -156 53 114
7599A14j00k02J24L9l1K73j3l70L54O8k09J79j79j20n2K57p9J07j67n1L9m3j9
$$ 114 14 -188 -64 -25 -56 217 204 -166 188 256 47 226 47 -73 -125 132 53 160 -7 -58 -19 -62 -81
7622h1k2j94K67j08J5L0K8nj88RK82j22m8k5p5K47j03J47j78m2L11l31rL36m8
$$ -81 -103 -297 -30 -138 -123 -93 -65 -70 -258 -249 33 -89 -137 -162 -237 10 -93 54 -124 -166 145 -186 -195 141 93
7647I3l1k07L51j42p9pM3J12o1l0MN5j36j27K93o5K04M2k69k32J96R0o0J03K0
$$ 93 62 -145 206 64 -15 -22 21 133 72 42 46 101 -35 -162 131 66 270 312 43 -189 7 97 37 140 160
7672A60j15J3K7j79L22o5J62l04lJ98j27Q2l37O4K00q2k3P0J24k32pK74l85K95
$$ 160 45 58 85 -94 228 163 325 21 18 216 89 171 -166 -102 98 16 -7 63 187 -45 -52 222 -163 132
7696A32j99J27k75J32J45k05R2j15J82N4k03K40j14r5L3j39J03j45K30K14l68
$$ 132 -67 60 -215 -83 62 -143 -51 -166 16 70 -133 107 -7 -102 -69 -208 -105 -250 -20 194 -174
7717a74J74Lq5J46j06m1M5J21o0k66K46k24J10m2K70l75L03N0j62J63k68L50k87
$$ -174 0 3 -82 64 -42 -83 -38 83 23 -243 3 -221 -111 -153 117 -258 45 95 -67 96 -172 178 -109
7740a09K98k27P1J37k17j54L50m8j74K14j9J43n61L82R8j36j39J40j07K39j26
$$ -109 189 -38 33 170 -47 -201 149 101 -73 141 122 265 -296 86 184 48 -91 49 -58 181 55
7761E5OJ0j31OL0L4J75l47K36j84J50j03P6R8l18R2K02j91Q3m4J36J64j55k29
$$ 55 61 71 -60 -54 -24 10 185 -162 74 -110 40 -63 13 111 -207 -115 87 -104 -21 -65 71 235 80 -149
7785a49N4Q2k8r0K73j7n1k98K28j30N6R4o6K86n41L70n9mj57J42o1o1N7m5K41
$$ -149 -95 -13 -41 -131 142 125 74 -224 4 -126 -70 24 -42 244 -297 73 14 10 -147 -5 -66 -127 -70 -115 126
7810A26J8o1m7k4J4j02J87J6k97j9N62l13j3J96l00J02O2J5O1k32R7j58m5K36
$$ 126 144 83 36 12 26 -76 111 127 -170 -189 373 60 47 243 -57 45 107 122 183 -49 48 -110 -155 81
7834H1K6J15j70J46l13J38O0j13nK4JN2J13j02j41m0J81lJ21k87j16J12K14o5
$$ 81 107 222 52 198 -115 23 83 -30 -35 -11 -10 42 155 53 -88 -128 53 50 171 -116 -232 -120 94 29
7858B9J5j58J4J48j93p4L0K30p6q4L8L05j38L6o2j31L46k81q9m2l8J32N7p4J75
$$ 29 44 -114 -100 48 -145 -219 -189 41 -35 -119 -81 224 86 122 60 -71 275 -6 -95 -137 -175 -43 14 -60 115
7883A15m3m9K5r2k5J35m8l3J6N1oj43K88j62M4J99k44k09L55j07j15M30k48l90
$$ 115 72 23 48 -44 -69 66 18 -15 1 52 46 -97 191 29 73 272 28 -181 174 67 -48 382 134 -256
7907b56O35l45J25m7j28n9J17k25K02O7J12k58O1k31L45nj34R8o6m6R7j34l1l0
$$ -256 379 34 159 112 -16 -75 42 -183 19 86 198 -60 1 -230 115 110 -24 74 8 -38 59 -75 -106 -136
7931a36J28p8r9r5K86r1J75j2j14NJ2p5j85J29P3M0M4j80j9L24m8j1o6J11j84
$$ -136 -8 -86 -185 -280 6 -85 90 78 -36 -31 -19 -94 -279 -150 -77 -37 7 -173 -192 132 84 73 7 118 -66
7956f6M2JJ32K7j98l6p1J07k2J15j51J12K33l2j13j2Q7M2J18l91j01K83J8N0j23
$$ -66 -24 -23 109 136 -62 -98 -169 -62 -84 31 -120 -8 225 193 80 68 155 197 315 -76 -177 106 124 174 51
7981E1P7p7j61Q3K46J2l75k03L78J25K0k84K2m4J56nNj87J26Mj3j2q0k0K88p3
$$ 51 128 51 -110 -27 219 231 -144 -347 31 156 176 -108 -86 -130 26 21 26 -161 -35 -31 -44 -56 -136 -156 132 59
8007E9N5l83J48p3Q5K19l0n44P09j01j65m5L9L5J50k38p5p3l24R20l06o25L30
$$ 59 114 -269 -121 -194 -109 110 80 -464 245 144 -21 -66 -27 8 158 -80 -155 -228 -552 368 62 -563 -233
8030b33j10K47K41l94O23k85n18l4O67m42P39j039j98K79O36p4j58k87M01j08
$$ -233 -343 -96 145 -249 374 89 -429 -463 204 -238 501 -538 -736 -457 179 105 -53 -340 61 -47
8050d7j30L35k80K76j90m8J17R5j20K19l01Q7l5oj6o6K94j47j23k4Q5q7J28k89
$$ -47 -177 158 -122 154 -36 -84 33 128 8 227 -74 13 -22 -28 -44 -110 184 37 -86 -110 -25 -112 16 -273
8074b73L15j15J80j05j24K71j4k09j47M80k70k9J31r3J38k08J79j91R0l24J81
$$ -273 42 -73 107 2 -122 149 135 -74 -221 259 -11 -40 91 -2 136 -72 107 -84 6 -318 -137
8095a37r8K24L8q2K16k28K84l21K0J66n0J08O1m78K60j01Q3o3K23j65J82o3k38
$$ -137 -235 -11 27 -55 161 -67 217 -104 -84 82 32 140 201 -277 -17 -118 -35 -98 125 -40 142 79 -159
8118a59L03l8m8j03j93K18J2j30J65J04P6j34l8k38K51k19J06J32k6n2OP8O3k9
$$ -159 144 106 58 -45 -238 -20 -8 -138 27 131 207 73 35 -203 48 -171 -65 67 41 -11 -5 73 136 107
8142A07o0j05j68J62r2J84rp9J58l56M1K30K7K4j37n1O0K7R7j16r5K20k52J87
$$ 107 47 -58 -226 -64 -156 28 19 -60 98 -258 -217 13 40 64 -73 -124 -64 -37 60 -56 -151 69 -183 4
8166Dj49P4R6k09J63J67k78J73j28P3P0r7P9j77M06k94J65o6K1k02n3J10J19j38
$$ 4 -145 -71 25 -184 -21 146 -132 41 -87 -14 56 -41 38 -139 267 -27 138 72 93 -109 -162 -52 67 -71
8190g1J
8191g0
$$ Imaginary data points
##PAGE= N=2
##DATA TABLE= (X++(I..I)), XYDATA
0@%%%%%%qJ6j6J6k4L2m2N8q0J04j26J52j86K26k71L25l84M52n32O21p21Q38r67
$$ 0 0 0 0 0 0 0 -8 8 -8 8 -16 16 -26 32 -48 56 -70 82 -104 122 -149 176 -208 244 -288 333 -388 450 -517
29e17J108j268J445j640J858k099K366k659K977l326L711m131M591n092N637o233
$$ -517 591 -677 768 -872 986 -1113 1253 -1406 1571 -1755 1956 -2175 2416 -2676 2961 -3272
45c272O886p601Q381r234J0171j1198J2333j3595J4998j6566J8332k0337K2634
$$ -3272 3614 -3987 4394 -4840 5331 -5867 6466 -7129 7869 -8697 9635 -10702 11932
58A1932k5299K8432l2175L6739m2446M9814n9720P3790r5419J33050k15943O83121
$$ 11932 -13367 15065 -17110 19629 -22817 26997 -32723 41067 -54352 78698 -137245 545876
70E45876j19821r42449J408970q08857j84721Q46458o23472j24304N90148l23104
$$ 545876 426055 -516394 892576 83719 -101002 745456 121984 -2320 587828 264724
80B64724k70241K42870R9037k42981K41022j26756k39476L07251j43077j04906
$$ 264724 -5517 237353 336390 93409 334431 207675 -31801 275450 132373 27467
90B7467J12410j05685J88713k52734o8307K36706k97078J95229P2341m31040L58818
$$ 27467 139877 34192 222905 -29829 -98136 138570 -158508 36721 109062 -321978 36840
101C6840O092m13913K93488P1190k81797K09226K4033l79256K96450J75975m85050
$$ 36840 42932 -370981 -77493 -6303 -288100 -78874 -54841 -434097 -137647 38328 -446722
112d46722K87455J59982m03274K94785l0350k64306L74234o7980j86570J47626
$$ -446722 -159267 715 -402559 -107774 -138124 -402430 -28196 -96176 -282746 -135120
122a35120l3537M4058J2601n4081P7841J0965K3896k2706o4294J20446O1549p3649
$$ -135120 -168657 -124599 -111998 -166079 -88238 -77273 -53377 -76083 -140377 -19931 41618 -32031
134c2031J4260K9501N470M8685k8049l8893J22050K1177r7121M6875p968J3451
$$ -32031 -17771 11730 17200 65885 37836 -1057 120993 142170 45049 91924 83956 97407
146I7407J02089r9996k9279J39635p9411m5603Q2472o9429N7151P5273j76752
$$ 97407 199496 99500 70221 209856 130445 84842 167314 97885 155036 230309 53557
157E3557K0447J25269j13165J4614M4773j05191Q7095P373j60314P8620N3851
$$ 53557 74004 199273 86108 100722 145495 40304 127399 134772 -25542 53078 106929
168A06929p4790K3700n6744k3604Q5232q1513l2851N0904m1768M6300l7928j18526
$$ 106929 32139 55839 -905 -24509 60723 -20790 -53641 -2737 -44505 1795 -36133 -154659
180a54659J19470K1484j15740P7595k9630o2782J24898q3840r6906J73677k3430
$$ -154659 -35189 -13705 -129445 -51850 -81480 -144262 -19364 -103204 -200110 -26433 -49863
191d9863j15232R9548m5626l8991J46131q8808p5532J61046l8819q4600R3276
$$ -49863 -165095 -65547 -111173 -150164 -4033 -92841 -168373 -7327 -46146 -130746 -37470
202c7470k7011o463J03739p7245n3672J26611j3542o3004O9742j5492M887P0142
$$ -37470 -64481 -70944 32795 -44450 -98122 28489 14947 -48057 21685 6193 11080 81222
214H1222q3727j1805J03779l1111j2393K2882l5897N4326J3897p6700M0410M9386
$$ 81222 -2505 -14310 89469 58358 45965 68847 32950 87276 101173 24473 64883 114269
226A14269l1189k71j8180k3405O8597l370q0952M5895K4350n1535K3493l2571
$$ 114269 83080 82809 64629 41224 109821 106451 25499 71394 95744 44209 67702 35131
238C5131k3303R1681n5002p4075O8276k3239j4434L2928p9251K1239P4384r6896
$$ 35131 11828 103509 48507 -25568 42708 19469 5035 37963 -41288 -20049 54335 -42561
250d2561k0140N7101m5136K9383Q961j01593O4608N3955j13391L4486L7292o2118
$$ -42561 -62701 -5600 -50736 -21353 -12392 -113985 -49377 4578 -108813 -74327 -37035 -99153
262i9153P4453l0134r9656J20660J1574r1358O8423j6783k7461Q4036o1125l8804
$$ -99153 -24700 -54834 -154490 -33830 -22256 -113614 -45191 -61974 -89435 -5399 -66524 -105328
274a05328J05981j4410n0537L8852j3614J1180N6469n3186j4824P6272j8127k6177
$$ -105328 653 -13757 -64294 -25442 -39056 -27876 28593 -24593 -39417 36855 18728 -7449
286g449K5751j2108L8491K3188o1574K0254M0942j7178N928j2517J447N0691k4638
$$ -7449 18302 6194 44685 67873 6299 26553 67495 50317 56245 43728 45175 95866 71228
299G1228m3229K9621J5742K555m089l5056J3826L6653l5153k7551K3518R898R17
$$ 71228 27999 57620 73362 75917 71828 36772 50598 87251 52098 24547 48065 57963 58880
312E8880k2110l6125K1042L1159k9226l1478J2999J0547p759j8299k5870J3738
$$ 58880 36770 645 21687 52846 23620 -7858 5141 15688 7929 -10370 -36240 -22502
324b2502L5241l3330l8292K4586L955q422Q0l2332J4788M2694m6964k7267L9789
$$ -22502 12739 -20591 -58883 -34297 -30342 -38764 -38684 -71016 -56228 -13534 -60498 -87765 -47976
337d7976o443L019P154m0268K3992M2186m8949q279M3831p718L460L043l2362
$$ -47976 -54419 -51400 -44246 -84514 -60522 -18336 -67285 -75564 -31733 -39451 -35991 -32948 -65310
350f5310L3630M1952m4657p012M3213p674N498L115k4831M1318K9013m7260N623
$$ -65310 -31680 10272 -34385 -41397 1816 -5858 -360 2755 -22076 19242 48255 995 6618
363F618K7225K215J3264j9860j0492M5429O7k9079M521N985K1356P068m2937O864
$$ 6618 33843 36058 49322 29462 18970 64399 64466 35387 39908 45893 67249 74317 31380 38244
377C8244L6603j9155r999l36r288L2710q219n2276J9625K8714k4754n566p527
$$ 38244 74847 55692 45693 45357 36069 68779 60560 8284 27909 56623 31869 26303 18776
390A8776j5150K9362r100n2279K5200K7988l8067k331o290j9477M1553j4663n4346
$$ 18776 3626 32988 23888 -28391 -3191 24797 -13270 -15601 -21891 -41368 185 -14478 -68824
403f8824L8636J3200l4920R552j4362l903M3248k8857l6620L9211L344j4676O197
$$ -68824 -30188 -16988 -51908 -42356 -56718 -60621 -17373 -46230 -82850 -43639 -40295 -54971 -48774
416d8774j5097J5869L0376l5832j3586L0520R009K179q169j1409K6685J8999k6917
$$ -48774 -63871 -48002 -17626 -53458 -67044 -36524 -27515 -25336 -33505 -44914 -18229 770 -26147
429b6147j079K7075P484M786j3412j2984M2992J0327l1940J4427R570L685J8354
$$ -26147 -27226 -151 7333 12119 -1293 -14277 28715 39042 7102 21529 31099 34784 53138
442E3138l0874k355M9589j4186k2623J5482o661J4783J1022l9374J0744L6550
$$ 53138 22264 19909 69498 55312 32689 48171 41510 56293 67315 27941 38685 75235
454G5235k5266j3276K888m272K2051o980l5772J0106K0553j6629j8534J727K931
$$ 75235 49969 36693 39581 35309 57360 50380 14608 24714 45267 28638 10104 11831 14762
467A4762P876r145l4403P884K6992j9412j8086j148J186J1800j5329k4589J4706
$$ 14762 22638 13493 -20910 -13026 13966 -5446 -23532 -24680 -23494 -11694 -27023 -51612 -36906
480c6906J5309j2115j7690n173J3450J1799j8215j4249J6277J0951n716j4591
$$ -36906 -21597 -33712 -51402 -56575 -43125 -31326 -49541 -63790 -47513 -36562 -42278 -56869
492e6869l542K4809R437j8588n012J2049J6173k052j3633P158J9565R901j7332
$$ -56869 -60411 -35602 -26165 -44753 -49765 -37716 -21543 -23595 -37228 -30070 -10505 -604 -17936
505a7936q893K8216R656m507k255q159K5858J4130k8502O553K3046Q83J081j2809
$$ -17936 -26829 1387 11043 6536 4281 -3878 21980 36110 7608 14161 37207 38090 39171 26362
519B6362k072K7826L434k2752P68J6977K839p186j1934j2K1131n4k7274j267J5443
$$ 26362 24290 52116 55550 32798 33566 50543 53382 46196 34262 34250 55381 55327 28053 26786 42229
534D2229k086o572j3486k805K0376r332k7831M958Q965J200q079k3640N942J5349
$$ 42229 40143 33571 20085 17280 37656 28324 493 5451 14416 15616 7537 -16103 -10161 5188
548E188j4631j4078r66P350N894j7757j7363J2975J2957j1590j2433r65Q594R509
$$ 5188 -9443 -23521 -24487 -17137 -11243 -29000 -46363 -33388 -20431 -32021 -44454 -45419 -36825 -27316
562b7316j5738j3219J9421R879q984q919j382J6450Q631j3545o254J6206J3545
$$ -27316 -43054 -56273 -36852 -26973 -35957 -44876 -46258 -29808 -21177 -34722 -40976 -24770 -11225
575a1225r972p408P017J2943J3374j4234r235K3799O442m656k123K59K0279L548
$$ -11225 -21197 -28605 -21588 -8645 4729 -9505 -18740 5059 11501 6845 4722 4981 25260 28808
589B8808j5709L02J4504J2500p914j1033Q369R699M917j3997o646J9588K154j0278
$$ 28808 13099 13401 27905 40405 32491 21458 29827 39526 44443 30446 23800 43388 45542 35264
603C5264q260k21J6791l420j8096N70O872N024j1605j5488P960R109o113j5749
$$ 35264 27004 26783 43574 40154 22058 22628 29500 34524 22919 7431 15391 24500 18387 2638
617B638o456J2006K35j1801j0690J629J2617r950j6775J667O868N756j2942j3322
$$ 2638 -3818 8188 8423 -3378 -14068 -12439 178 -9772 -26547 -24880 -18012 -12256 -25198 -38520
631c8520R207P790n460j2793n77J4312J186j1526o780P126J5795p616j1953P016
$$ -38520 -29313 -21523 -26983 -39776 -40353 -26041 -24855 -36381 -43161 -36035 -20240 -27856 -39809 -32793
645c2793R589O315r530p744J6511J0790m531q130K325J8397K060q717J44R778
$$ -32793 -23204 -16889 -26419 -34163 -17652 -6862 -11393 -19523 -17198 1199 3259 -5458 -5314 4464
659D464J3886o282j1185J0887J1957L672q870o118J4764Q307p645p156M384J3152
$$ 4464 18350 12068 883 11770 23727 27399 18529 12411 27175 35482 27837 20681 25065 38217
673C8217j137j2112j425R565Q955j0435j2175P613Q606l794j2863m368J0786M101
$$ 38217 37080 24968 23543 33108 42063 31628 19453 27066 35672 31878 19015 14647 25433 29534
687B9534j2907j1662M678Q121n677j3187l905Q697L552j6276r249P495N563m054
$$ 29534 16627 4965 9643 17764 12087 -1100 -5005 3692 7244 -9032 -18281 -10786 -5223 -9277
701i277j4414m484J2853K1j2528o338O252R232p765j1570K058J1137L722j2940
$$ -9277 -23691 -28175 -15322 -15301 -27829 -34167 -27915 -18683 -26448 -38018 -35960 -24823 -21101 -34041
715c4041n014J1134P031l976q717K572J5816Q94r728l21R022J0845k547r834O133
$$ -34041 -39055 -27921 -20890 -24866 -33583 -31011 -15195 -14301 -24029 -24350 -15328 -4483 -7030 -16864 -10731
730a0731J5174k43p942K49J1574R904m344j0723P599J4005j524p312k7R169Q059
$$ -10731 4443 4200 -3742 -3493 8081 17985 13641 2918 10517 24522 22998 15686 15659 24828 32887
745C2887o311q875P578J1076l156r630p57P317O584q812j0924P818Q520q452q260
$$ 32887 26576 17701 25279 36355 33199 23569 22812 30129 36713 27901 16977 24795 33315 24863 16603
760A6603l232N627O747j3671j0158Q789L110o272r956n163J0338J855j4952o838
$$ 16603 13371 18998 25745 12074 1916 10705 13815 7543 -2413 -7576 2762 4617 -10335 -17173
774a7173N593N518n944j1030j603R074J093j3805m759Q755M569m309r814j243
$$ -17173 -11580 -6062 -12006 -23036 -24639 -15565 -14472 -28277 -33036 -24281 -19712 -24021 -33835 -35078
788c5078J3234J814j2564n73R334M442j760q971J733J6346M17j1280K934Q242
$$ -35078 -21844 -20030 -32594 -33167 -23833 -19391 -21151 -30122 -28389 -12043 -11626 -22906 -19972 -11730
802a1730O717m46r541N795J6322k139q133K567Q110Q230k174q815P121J2963k913
$$ -11730 -5013 -5459 -15000 -9205 7117 4978 -3155 -588 7522 15752 13578 4763 11884 24847 21934
817B1934p820K065Q348O537n022r884O959J1168n200q355O93N891M845p921j0507
$$ 21934 14114 16179 24527 31064 26042 16158 23117 34285 29085 20730 21423 27314 32159 24238 13731
832A3731P889P760p347q631j403N043M497j1754r753Q619L218p262p667m350P668
$$ 13731 21620 29380 22033 13402 11999 17042 21539 9785 32 8651 11869 4607 -3060 -7410 258
847B58K509j3461n649O509L152o232q649q82P785K376j2350n835J0102K826n545
$$ 258 2767 -10694 -16343 -9834 -6682 -12914 -21563 -22445 -14660 -12284 -24634 -30469 -20367 -17541 -23086
862b3086m504k072J0072L263j3232n1J0543K581k762n574J431J2668J474j0520
$$ -23086 -27590 -29662 -19590 -16327 -29559 -29610 -19067 -16486 -19248 -24822 -23391 -10723 -9249 -19769
876a9769K400J0284L404j197n212K787J4104p94q814M169P983M763k873o033N659
$$ -19769 -17369 -7085 -3681 -4878 -10090 -7303 6801 6007 -2807 1362 9345 14108 11235 5202 10861
891A0861J1636j505r104K627Q022K840k434p614L982J2288p112q323M229L330
$$ 10861 22497 20992 11888 14515 22537 25377 22943 15329 19311 31599 24487 16164 20393 23723
905B3723L942n562j1126P583P227q406o211k75L031L532r082r346P337M277q816
$$ 23723 27665 22103 10977 18560 25787 17381 11170 10895 13926 17458 8376 -970 6367 10644 1828
920A828n761p11L220K851j0120q256Q870K953q054n350p69M974L228j0392n950
$$ 1828 -3933 -4644 -1424 1427 -8693 -16949 -8079 -5126 -13180 -18530 -19299 -14325 -11097 -21489 -27439
935b7439J0677J473p113j731j541Q113M212j2713j98J0696O89j686m079Q78J1421
$$ -27439 -16762 -15289 -22402 -24133 -25674 -17561 -13349 -26062 -26260 -15564 -14875 -16561 -20640 -19762 -8341
950h341O84q938K391R073L194k397l401K866J0967M13q798L701Q739J940j226
$$ -8341 -7657 -16595 -14204 -5131 -1937 -4334 -7735 -4869 6098 6511 -2287 1414 10153 12093 10867
965A0867m991L239J1926k829p812M187N990J917k204p265M931J0250o362p335
$$ 10867 5876 9115 21041 18212 10400 14587 20577 22494 20290 13025 17956 28206 21844 14509
979A4509K887L293K458n204p631N266O057o810p182J585L677O59p155p101N059
$$ 14509 17396 20689 23147 17943 10312 15578 21635 14825 7643 9228 12905 13564 6409 -692 4367
994D367M853q058o824J554K798O60p764p104O989L621q047m409K17L913K043q869
$$ 4367 9220 1162 -5662 -4108 -1310 -650 -8414 -15518 -8529 -4908 -12955 -17364 -17147 -13234 -11191 -20060
1010b0060m024Q414K768o424l392J239O262K096p598j960Q971K852m962j713L098
$$ -20060 -24084 -15670 -12902 -19326 -22718 -21479 -15217 -13121 -20719 -22679 -13708 -10856 -15818 -17531 -14433
1025a4433O251K842p684l13J1139J741l761n64K176Q406J973r104L374R293M13
$$ -14433 -8182 -5340 -13024 -13337 -2198 -457 -4218 -4782 -2606 5800 7773 -1331 2043 11336 11749
1040A1749j766k468J887R824j683q140L608O393J192l631m638L421P746l721p986
$$ 11749 9983 7515 9402 19226 17543 9403 13011 19404 20596 16965 12327 15748 23494 19773 11787
1055A1787K651N017j389l565n036K079P747p221q337M176J882m03m682p544M888
$$ 11787 14438 19455 18066 14501 9465 11544 19291 12070 3733 7909 9791 9388 4706 -2838 2050
1070B050N073q734n430K112J875Q11o726o073O533L426q241l726J989L236J449
$$ 2050 7123 -1611 -7041 -4929 -3054 -2243 -8969 -15042 -8509 -5083 -13324 -17050 -15061 -11825 -10376
1085a0376p584l840Q216K601o013k962K331M948R05n937j875R047L066o509k54
$$ -10376 -17960 -21800 -13584 -10983 -16996 -19958 -17627 -12679 -11774 -17711 -19586 -10539 -7473 -13982 -14236
1100a4236K971N053L192p527P48J0071N62l139m31K146Q243j61o975L140P429
$$ -14236 -11265 -6212 -3020 -10547 -9799 272 834 -2305 -2736 -590 7653 7492 517 3657 11086
1115A1086J051l259k505M433O567k133o257K088P135j10m291k503L076N915l616
$$ 11086 12137 8878 6373 10806 17373 15240 8983 11071 18206 18096 13805 11302 14378 20293 16677
1130A6677p678L298N112k023m137m172K820N709o303p102L259K717j946m736m660
$$ 16677 8999 12297 17409 15386 11249 7077 9897 15606 9303 2201 5460 8177 6231 1495 -3165
1145c165L960M278p374n877K810K760j141o088l383N010K836o461m698L079L719
$$ -3165 795 5073 -2301 -8178 -5368 -2608 -3749 -9837 -13220 -8210 -5374 -11835 -16533 -13454 -9735
1160i735j571m849k294N469L933o673k712M362L772k15m637j411Q347K367n480
$$ -9735 -11306 -16155 -18449 -12980 -9047 -15720 -18432 -14070 -10298 -10513 -15150 -16561 -8214 -5847 -11327
1175a1327k98L670M429O78m997J053Q156J178m088m03M161N106n97m664J742P518
$$ -11327 -11625 -7955 -3526 -2848 -7845 -6792 1364 2542 -1546 -1949 2212 7318 6721 2057 3799 11317
1191A1317Q37m884k44M265M142j060n565J246P346j297m810q81L320L524k394
$$ 11317 12154 7270 7026 11291 15433 14373 8808 10054 17400 16103 11293 10412 13732 17256 14862
1206A4862p091K279N748l050m466k206K005L971m574o531K969L406l152m695k834
$$ 14862 7771 10050 15798 12748 8282 6076 8081 12052 7478 947 3916 7322 4170 -525 -3359
1221c359L186L229n845n843K878L265k943m585k052L517K760n821m524M294K800
$$ -3359 -173 3056 -2789 -8632 -5754 -2489 -5432 -10017 -12069 -8552 -5792 -11613 -16137 -11843 -9043
1236i043k300l579j591N344K800n738k482M623L091p50l405l16O333K407m919
$$ -9043 -11343 -14922 -16513 -11169 -8369 -14107 -16589 -11966 -8875 -9625 -13030 -13346 -7013 -4606 -9525
1251i525o33M399L606K61l852O38P604R54m493L61M025L514k12l578J222O786
$$ -9525 -10158 -5759 -2153 -1892 -5744 -5106 2498 3452 -1041 -680 3345 6859 6647 3069 4291 11077
1267A1077Q91m826M86L651L002j602m433J128O071r71m808R3K342L479l680n239
$$ 11077 11968 7142 7628 11279 14281 12679 8246 9374 15445 14474 9666 9759 12101 15580 11900 6661
1283F661K314M459k431m646j514K726K362m676n063K172L323k762m997j483L061
$$ 6661 8975 13434 11003 6357 4843 7569 9931 5255 192 2364 5687 2925 -2072 -3555 -494
1298d94J389m894m424K369K933k746m366j039L114J822m480l642L417K996k260
$$ -494 895 -3999 -8423 -6054 -3121 -5867 -10233 -11272 -8158 -6336 -10816 -14458 -11041 -8045 -10305
1313a0305l366k53M091K086m413k268M477K986j603k814N93N400J711m166n35
$$ -10305 -13671 -13924 -9833 -7747 -12160 -14428 -9951 -6965 -8568 -11382 -10789 -5389 -3678 -7844 -8379
1328h379M591L171q39k646J039N913J464l961k28M915K727j373k933J442N782
$$ -8379 -3788 -617 -1456 -4102 -3063 2850 4314 353 125 5040 7767 6394 3461 4903 10685
1343A0685K34m178j20L983K227j796l273J329M635p00m511k31L104J197k579m002
$$ 10685 10919 6741 6621 10604 12831 11035 7762 9091 13726 13026 8515 8284 11388 12585 10006 6004
1359F004J771L644k180m898p97K860J224l940m240J570L003k473m582q96K610
$$ 6004 7775 11419 9239 4341 3544 6404 7628 3688 -552 1018 4021 1548 -3034 -3930 -1320
1374a320J112m359l714J930L083k664l739p07L427J074m274k850K865K939k101
$$ -1320 -208 -4567 -8281 -6351 -3268 -5932 -9671 -10378 -6951 -5877 -10151 -13001 -10136 -7197 -9298
1389i298l629O50L975Q93l551j838M020L461k106k468J313M242J614l331m74M233
$$ -9298 -12927 -12277 -8302 -7409 -10960 -12798 -8778 -5317 -7423 -9891 -8578 -4336 -2722 -6053 -6527 -2294
1405b294K776j491k171K008M575Q43l272k17M100K762j453k596J993M616q8l603
$$ -2294 482 -1009 -3180 -1172 3403 4246 974 757 4857 7619 6166 3570 5563 10179 10091 6488
1421F488l31M161K012k593k722K059L096l22m293q19L817O32l065k904P21L536
$$ 6488 6157 10318 12330 9737 7015 9074 12170 11848 7555 6736 10553 11185 8120 5216 5937 9473
1437I473j809m798O4K387M44l286l974K222K720l365l594n05K376M66m339k487
$$ 9473 7664 2866 2930 5317 5761 2475 -1499 723 3443 78 -3516 -4021 -1645 -1179 -5518 -8005
1453h005K009K298k142l781k19L154K77l468k081K920K696k397l073J247L224
$$ -8005 -5996 -3698 -5840 -9621 -9840 -6686 -6409 -9877 -11958 -9038 -6342 -8739 -11812 -10565 -7341
1468g341P77k725j579L590L258k404k073J890L388J350l177k41M238K195j523
$$ -7341 -6564 -9289 -10868 -7278 -4020 -6424 -8497 -6607 -3219 -1869 -5046 -5287 -1049 1146 -377
1483c77j859J831M961m06k797N80L164K798j988k219K838L382o26k954o53M195
$$ -377 -2236 -405 4556 4150 1353 1933 5097 7895 5907 3688 6526 9908 9282 6328 5675 9870
1499I870J733l353j636J650K742o20m312J49L437M16l266k572J315K951k428l830
$$ 9870 11603 8250 6614 8264 11006 10386 6074 6223 9660 10076 6810 4238 5553 8504 6076 2246
1515B246j4K143J64l370l022J882K184k663l514l69K550K57m099j983J972J553
$$ 2246 2232 4375 4539 1169 -1853 29 2213 -450 -3964 -4333 -1783 -1526 -5625 -7608 -5636 -4083
1531d083j804l892Q74L410p85k961j275K158K724k303k933J826L000L5k599j129
$$ -4083 -5887 -9779 -8905 -5495 -6280 -9241 -10516 -8358 -5634 -7937 -10870 -9044 -6044 -6009 -8608 -9737
1547i737M038J730j777j611J719L814M02l023M81L457K315j315k073K201M111
$$ -9737 -5699 -3969 -5746 -7357 -5638 -1824 -1422 -4445 -3964 -507 1808 493 -1580 621 4732
1562D732p74j790L45K736K204k211j775K425L165o44k674k58L443J477k990j408
$$ 4732 3958 2168 2513 5249 7453 5242 3467 5892 9057 8413 5739 5481 8924 10401 7411 6003
1578F003J511K570j473l024N5K561K78l045k360J847K051k269l241l29K426J92
$$ 6003 7514 10084 8611 5587 5642 8203 8481 5436 3076 4923 6974 4705 1464 1135 3561 3753
1594C753l756k223K140R90k031l223O9K399p8l910r84J647J626j895l295P09K889
$$ 3753 -3 -2226 -86 904 -1127 -4350 -4281 -1882 -1960 -5870 -6854 -5207 -3581 -5476 -8771 -8062 -5173
1611e173m37k839j215K411K247k322k095J609K747Q8k521m11L237J669j346j858
$$ -5173 -5610 -8449 -9664 -7253 -5006 -7328 -9423 -7814 -5067 -4979 -7500 -7911 -4674 -3005 -4351 -6209
1627f209J905L538n56k066Q15K826J582j412j562K544L114o37j877M78L139J455
$$ -6209 -4304 -766 -1322 -3388 -2573 253 1835 423 -1139 1405 4519 3882 2005 2483 5622 7077
1643G077k268j105K203K383m82k833N40K892N76k649j255J991K048j760k835O62
$$ 7077 4809 3704 5907 8290 7808 4975 5515 8407 8983 6334 5079 7070 9118 7358 4523 5185
1659E185J665Q45l078k118J692J893k507k593q5J886n82l094j268J448J372k701
$$ 5185 6850 7695 4617 2499 4191 6084 3577 984 899 2785 2203 -891 -2159 -711 661 -2040
1675b040k626J6K386n93l238q49K083J504k722k051P53K345l74k466o70K569J129
$$ -2040 -4666 -4650 -2264 -2857 -6095 -6944 -4861 -3357 -6079 -8130 -7377 -5032 -5406 -7872 -8542 -5973 -4844
1692d844j928j675J473K624j36k279K23K645J577j444j254J571L099l62k122P60
$$ -4844 -6772 -8447 -6974 -4350 -4486 -6765 -6542 -3897 -2320 -3764 -5018 -3447 -348 -710 -2832 -2072
1708b072K986J417j346j379J977L107q64j629N42K686J487k186j294K475K293
$$ -2072 914 2331 985 -394 1583 4690 3826 2197 2739 5425 6912 4726 3432 5907 8200
1723H200j265k210Q14K102P09k330j674J919J723j410k674M02J878L65l085j330
$$ 8200 6935 4725 5539 7641 8350 6020 4346 6265 7988 6578 3904 4306 6184 6549 3464 2134
1739B134J587J194j922k559m7K045l68l281j191J628Q65k381k327J80J963m05
$$ 2134 3721 4915 2993 434 387 2432 2064 -1217 -2408 -780 85 -2296 -4623 -4443 -2480 -2885
1755b885k943p77J888J109k186j909O12K748o33k515k76K269J096j595j398J243
$$ -2885 -5828 -6605 -4717 -3608 -5794 -7703 -7091 -4343 -4976 -7491 -7767 -5498 -4402 -5997 -7395 -6152
1771f152K477J0k636N17K199J666j942j32K086K038P4k562J286J751J805j519
$$ -6152 -3675 -3665 -6301 -5784 -3585 -1919 -3861 -3993 -1907 131 205 -2357 -1071 680 2485 966
1787I66n19J475K491p3k143O45L266J24j792q08J620K027j331j685Q88J814N84
$$ 966 447 1922 4413 4340 2197 2842 6108 6232 4440 3632 5252 7279 5948 4263 5151 6965 7549
1804G549j949j545J591J773j988j949O60J503m06k538j092J194J129k301k260
$$ 7549 5600 4055 5646 7419 5431 3482 4142 5645 5239 2701 1609 2803 3932 1631 -629
1819f29R99J404o84k678p16J095P42k323j393J94J791n15k645o75K117P0j980
$$ -629 370 1774 1090 -1588 -2304 -1209 -467 -2790 -4183 -3989 -2198 -2713 -5358 -6033 -3916 -3846 -5826
1836e826n91Q15J942j239k531O27K403J373k515n84J132K172p46j870Q01K322
$$ -5826 -6417 -5602 -3660 -4899 -7430 -6803 -4400 -3027 -5542 -6126 -4994 -2822 -3568 -5438 -4637 -2315
1852b315R76j276r39K121K093o96j593J139K596L92j351n25J863J989n12j782
$$ -2315 -1339 -2615 -3554 -1433 660 -36 -1629 -490 2106 2498 1147 622 2485 4474 3962 2180
1868B180J044J956M23j325o60J765J602j478j608O44J828J92k202p97J562J210
$$ 2180 3224 5180 5603 4278 3618 5383 6985 5507 3899 4543 6371 6563 4361 3564 5126 6336
1884F336j840j782L87J590n62k248p87J296R80k190k105N74J413o57k290j029
$$ 6336 4496 2714 3101 4691 4129 1881 1094 2390 3370 1180 -925 -351 1062 405 -1885 -2914
1900b914J949K53k128j547O95J243m74k358k92J921K74j871j334J156J809o19
$$ -2914 -965 -712 -2840 -4387 -3692 -2449 -2923 -5281 -5573 -3652 -3378 -5249 -6583 -5427 -3618 -4237
1916d237k135L03J917Q21j685o44J537J818n61j513L99K193J057j653k59J762
$$ -4237 -6372 -6069 -4152 -3331 -5016 -5660 -4123 -2305 -2866 -4379 -3980 -1787 -730 -2383 -2642 -880
1932h80J671n71j360Q70K500M59j529k24J873J703j128j114Q80K042J11j552m41
$$ -880 791 220 -1140 -270 2230 2689 1160 936 2809 4512 3384 2270 3150 5192 5303 3751 3310
1949C310J783J519j698j632Q60J903m06j896l57J161J044j858j645P22J503l48
$$ 3310 5093 6612 4914 3282 4142 6045 5639 3743 3386 4547 5591 3733 2088 2810 4313 3965
1965C965k392q91R90J090j922k506J583J161j466j589n11J055J10j451j310K28
$$ 3965 1573 682 1672 2762 840 -1666 -83 1078 -388 -1977 -2488 -1433 -1323 -2774 -4084 -3856
1981c856J532n47k054l31J664L07j838p08J106J174o31j653M65K560K39k018m53
$$ -3856 -2324 -2871 -4925 -5256 -3592 -3285 -5123 -5831 -4725 -3551 -4182 -5835 -5370 -2810 -2571 -4589 -5042
1998e042J635J075j24j169K13K371N09j544O3J294J846l88j125O68K372q0j239
$$ -5042 -3407 -2332 -2456 -3625 -3412 -1041 -532 -2076 -2013 -719 1127 739 -386 282 2654 2574 1335
2015A335j00J800J231j040r09Q46J752K4j333k77J456R36j195j615N13J773m42
$$ 1335 1235 3035 4266 3226 2317 3163 4915 4939 3606 3329 4785 5721 4526 2911 3424 5197 4755
2032D755j670q8J565K68j965j293R21J204r80k225j59J387M16k210j472J065L54
$$ 4755 3085 2997 4562 4830 2865 1572 2493 3697 2717 492 333 1720 2136 -74 -1546 -481 -127
2049a27j81k180j75J441k65j534j299R18J150q64j949J43J624K85j941l47R48
$$ -127 -308 -2488 -2663 -1222 -1487 -3021 -4320 -3402 -2252 -3116 -5065 -4922 -3298 -3013 -4954 -5301 -4353
2066d353J051m10j327L01J569K87j454j07J507J625j41k289M52L282j62q22j044
$$ -4353 -3302 -3712 -5039 -4738 -3169 -2882 -4336 -4443 -2936 -1311 -1452 -3741 -3289 -7 -169 -991 -2035
2083b035K858N80j064o65J720O74K24n00m63J572J083q55r42Q72K236m56j650
$$ -2035 823 1403 339 -326 1394 2068 2292 1792 1329 2901 3984 3129 2187 3059 5295 4839 3189
2100C189k00J282R17j245j323P82J279r13r62p00K285J19j885j766J306O69r44
$$ 3189 2989 4271 5188 3943 2620 3402 4681 3768 2806 2106 4391 4510 2625 859 2165 2834 1890
2117A890q37p93J574l99j649j285j86J862j064j721k4J364j48j851r12N43J336
$$ 1890 1053 260 1834 1435 -214 -1499 -1685 177 -887 -2608 -2632 -1268 -1416 -3267 -4179 -3636 -2300
2134b300m95j437o80J730M46j958o62J377J854k138n14J329P82O76j271J74P0
$$ -2300 -2795 -4232 -4912 -3182 -2736 -4694 -5356 -3979 -2125 -4263 -4777 -3448 -2666 -1990 -3261 -3087 -3017
2151c017K111j151r84R83K030q6j247L55J825N01m00n06N25J377M55q65j016J980
$$ -3017 -906 -2057 -3041 -2058 -28 -114 -1361 -1006 819 1320 920 414 939 2316 2771 1906 890 2870
2169B870K245j617j095Q69P14m18p00O2J134M42j487o97J105Q47q02j387L36P03
$$ 2870 5115 3498 2403 3272 3986 3568 2868 2930 4064 4506 3019 2322 3427 4274 3472 2085 2421 3124
2187C124m1j669r05R21J765j569k283M16O94O45j516j188Q17Q29j158j787K16
$$ 3124 3083 1414 509 1430 3195 1626 -657 -241 453 1098 -418 -1606 -789 40 -1118 -2905 -2689
2204b689J333l04j546p24P97J075j161j154L03J278m5j400m61J556Q15p20j308
$$ -2689 -1356 -1660 -3206 -3930 -3133 -2058 -3219 -4373 -4070 -2792 -2837 -4237 -4698 -3142 -2327 -3047 -4355
2221d355R15J065L75r88o24J113J401k70j048Q49J940p0j265Q7J369R73o67p17
$$ -4355 -3440 -2375 -2000 -2988 -3612 -2499 -1098 -1368 -2416 -1567 373 303 -962 -875 494 1467 800 83
2239H3J247K275r88j622K46J814P89p76j097J365J220Lj881K01J419l7j279o85
$$ 83 1330 3605 2617 995 1241 3055 3844 3068 1971 3336 4556 4559 2678 2879 4298 4261 2982 2297
2257B297L50J537n42j645N68Q53l27j414o17P94M30j773j50n98L10O65j988j59
$$ 2297 2647 4184 3642 1997 2565 3418 3091 1677 1060 1854 2284 511 361 -237 73 738 -1250 -1409
2275a409M38R82j721l56l10P34M0j410p96J412M28q65j242O06P10p7j303L5J787
$$ -1409 -971 11 -1710 -2066 -2376 -1642 -1602 -3012 -3808 -2396 -1968 -2833 -4075 -3469 -2759 -2836 -4139 -4104 -2317
2294b317n12J66j034M46J484j17j017k0J574N00p40q04J520J392q8j040L10J420
$$ -2317 -2829 -2663 -3697 -3251 -1767 -1884 -2901 -2921 -1347 -847 -1587 -2391 -871 521 433 -607 -297 1123
2312A123M29o85Q0R36R74l72p39R1J063J138q95j167J392Q51o08j144J21J196
$$ 1123 1552 867 947 1883 2857 2485 1746 1837 2900 4038 3143 1976 3368 4219 3611 2467 2588 3784
2330C784L06j340m67N85Q53p27j862O48R77m4j268r32O42O49r62j369L8J005k83
$$ 3784 4090 2750 2283 2868 3721 2994 1132 1780 2757 2713 1445 513 1155 1804 842 -527 -489 516 233
2349B33j590l86P18N77j188j036j76J218j76j434j99P41K52m81j336P18J560p27
$$ 233 -1357 -1743 -1025 -448 -1636 -2672 -2848 -1630 -1806 -3240 -3439 -2698 -2446 -2927 -4263 -3545 -1985 -2712
2367b712r75j73O77J230p65o30N56J301K1j014J8J330Q25p46p06R56J479j7q65
$$ -2712 -3687 -3860 -3183 -1953 -2718 -3348 -2792 -1491 -1470 -2484 -2466 -1136 -311 -1057 -1763 -807 672 655 -210
2386b10K19J287M96p24m43J117J112k07q09P5R64P32r33n24O94J244o98j188K05
$$ -210 9 1296 1792 1068 625 1742 2854 2647 1838 1913 2877 3609 2676 2152 2846 4090 3392 2204 2409
2405B409J294m52n61n66K87R94j021j133J87P54k15j001p53Q49M09j076j244L59
$$ 2409 3703 3251 2690 2124 2411 3405 2384 1251 1438 2192 1977 976 223 1072 1481 405 -839 -480
2423d80P16l72j200l69N28N48j169j374Q03O21o17q64p01R55P39l95r37j99J570
$$ -480 236 -136 -1336 -1705 -1177 -629 -1798 -3172 -2369 -1748 -2365 -3229 -3930 -2975 -2236 -2631 -3568 -3767 -2197
2442b197M9j720O59J177N63j255J99J46R08K78j044L95J366J28m97m26R36J173
$$ -2197 -2148 -3868 -3209 -2032 -1469 -2724 -2525 -2379 -1471 -1193 -2237 -1842 -476 -348 -845 -1271 -335 838
2460H38j96o87K31J243N73p40n77J162J009n31n42J03J329K59j220k10R52O26
$$ 838 642 -45 186 1429 2002 1262 685 1847 2856 2325 1783 1886 3215 3474 2254 2044 2996 3622
2478C622n47j178L84J167l31r28r10J404J45p86o94k49R43j44j266p75R12L8p50
$$ 3622 3075 1897 2281 3448 3117 2189 1279 2683 2828 2042 1348 1099 2042 1898 632 -143 769 807 57
2497E7r69j4R60l29j369n21R91M37q50j135L42N34Q9r37l79Q47J41r18n22J168
$$ 57 -912 -926 34 -295 -1664 -2185 -1194 -757 -1607 -2742 -2400 -1866 -1777 -2714 -3093 -2246 -2105 -3023 -3545 -2377
2517b377O03k36j021K39M05P85p90l80R82R83m35n16p34K250J136j948K96R40
$$ -2377 -1774 -2010 -3031 -2792 -2387 -1602 -2392 -2772 -1790 -807 -1242 -1758 -2492 -242 894 -1054 -758 182
2535A82J468j293l18P68Q94L32m90n43Q03J171m78j004P24O37L9q11j06P67M15
$$ 182 1650 357 39 807 1701 2033 1543 1000 1803 2974 2496 1492 2216 2853 2892 2081 1975 2742 3157
2554C157k83r10J2J002o4j380o8N01P86j125r83K19R21k29j271m37O83K56j176
$$ 3157 2874 1964 1976 2978 2914 1534 1466 1967 2753 1628 645 864 1785 1556 285 -152 531 787 -389
2573c89p70L08P09m73j279j83R00N9p66j163N31R66j55j406L22O96J23r02k84
$$ -389 -1159 -851 -142 -615 -1894 -2077 -1177 -1118 -1884 -3047 -2516 -1550 -1705 -3111 -2789 -2093 -1970 -2872 -3156
2592c156Q05N12k28p07q0J292N08r34l91J096O47l02o90L37J170M11q00j73J067
$$ -3156 -2351 -1839 -2067 -2774 -2854 -1562 -1054 -1988 -2379 -1283 -636 -938 -1628 -1291 -121 290 -510 -683 384
2611C84R40k94q66O37J055J17n61m8P28O68n29p36M35R33L22j111l24R27N00o05
$$ 384 1324 1030 164 801 1856 1973 1412 1364 2092 2760 2231 1495 1930 2863 3185 2074 1750 2677 3177 2572
2631B572r77J99R82j96j194j88P88L44j293o37L93O75l54j241l91N73J008j751
$$ 2572 1595 1794 2776 2580 1386 1198 1986 2330 1037 400 793 1468 1114 -127 -518 55 1063 -688
2649f88p78P77M16p80n65j93M85J41j055k50P97J055r89j082j072K310o99p36
$$ -688 -1466 -689 -273 -1053 -1618 -1811 -1326 -1185 -2240 -2490 -1693 -638 -1627 -2709 -3781 -1471 -2170 -2906
2667b906k54Q96P10n5r00K37P90M27o58n75J082J080o13p65M49J188K83m71l90
$$ -2906 -3160 -2264 -1554 -1609 -2509 -2272 -1482 -1055 -1713 -2288 -1206 -126 -739 -1504 -1055 133 416 -55 -445
2686d45J035N68j39n57M56R89k49l92O8Q11P17r58l49K96J170l45q68OO88M72
$$ -445 590 1158 1019 462 918 1907 1658 1266 1334 2145 2862 1904 1555 1851 3021 2676 1808 1814 2502 2974
2706B974j040o05K43J001l00j106j10P17J58r18r05N74L90m43r22k30O20m7q19
$$ 2974 1934 1329 1572 2573 2273 1167 1057 1774 1932 1014 109 683 1073 630 -292 -522 98 51 -768
2725g68p34L63N39m10p80j08O28K3q50n12P65L05m85o12L62N44K87r31k94N24
$$ -768 -1502 -1139 -600 -1010 -1790 -1898 -1270 -1247 -2097 -2609 -1844 -1539 -2024 -2636 -2274 -1730 -1443 -2374 -2668 -2144
2745b144O86l14o64M68Q22M93p01k46P69J027p64n73P11Q96L68j046K84Q80N00
$$ -2144 -1458 -1772 -2436 -1968 -1146 -653 -1354 -1600 -831 196 -568 -1141 -430 466 834 -212 72 952 1452
2764A452l00o53M58J297m23k71m75Q64N36n87n28Q49N53m01q30O1Q26q7m73n10
$$ 1452 1152 499 957 2254 1831 1560 1085 1949 2485 1898 1370 2219 2772 2371 1541 1602 2428 2341 1868 1358
2784A358K30M06k84q66n5O69J15r93n09L01L08l23j008j77R30k15j100k95L89
$$ 1358 1588 1994 1710 844 789 1458 1573 580 71 372 680 357 -651 -828 102 -113 -1213 -1508 -1119
2803a119N44m86r53J92O94j23j081q6M96N99o12m97L35N82j87n04k09Q06N48l99
$$ -1119 -575 -1061 -2014 -1822 -1128 -1251 -2332 -2418 -1922 -1323 -1935 -2432 -2097 -1515 -1702 -2206 -2415 -1609 -1061 -1460
2823a460p53O33J024L3q91K46M50R69m19o44P07P87J60j004L87O67M39l75j80
$$ -1460 -2213 -1580 -556 -523 -1414 -1168 -718 251 -168 -812 -105 682 842 -162 225 892 1331 956 776
2842G76M87O25j69l50J32N54L61o94m64O30N35l27p88K21O00J29o89m11J00O67
$$ 776 1263 1888 1719 1369 1501 2055 2416 1722 1258 1888 2423 2096 1308 1529 2129 2258 1569 1158 1258 1925
2862A925m81o84k15L59r4o25m12M67K69j94j257J29P00j43p52p09Q18K25q12m20
$$ 1925 1444 760 545 904 810 185 -227 240 509 315 -942 -813 -113 -256 -1008 -1717 -899 -674 -1486 -1906
2882a906n8O76O0q96j10N55M66p32n52N35J001p32l46J10N69M36l78k61K97O88
$$ -1906 -1964 -1288 -1228 -2124 -2234 -1679 -1213 -1945 -2497 -1962 -961 -1693 -2039 -1929 -1360 -924 -1302 -1563 -1266 -578
2902e78q0m00r3R19N35n77o45Q89Q50J00o93J09P92L71n67k55O45P35k32o36j54
$$ -578 -658 -1058 -1151 -232 303 -274 -919 -30 820 920 227 336 1128 1499 932 677 1322 2057 1825 1189 1035
2923A035J386n20l21o09l8J265l16o98J24P30j88o43l88M36N05o97p18J88O19
$$ 1035 2421 1901 1580 971 933 2198 1882 1184 1308 2038 1850 1207 819 1255 1760 1063 345 533 1152
2942A152o9j065k31M34J33n01p86K90M77m84o37k82O72K76p17n63L08M81l8q19
$$ 1152 1083 18 -213 221 354 -147 -933 -643 -166 -650 -1287 -1569 -897 -621 -1338 -1901 -1593 -1112 -1150 -1969
2962a969J05Q2N59j70q59N48N10po05p8P35L09n56j01M43N26J47n64J37Q22L06
$$ -1969 -1864 -1782 -1223 -1393 -2252 -1704 -1194 -1201 -1806 -1884 -1149 -840 -1396 -1497 -1054 -528 -381 -945 -808 14 320
2983C20k96n59O88O54j3l99m3P89L06m88r6O93J34l05k64K8P35J77p21j88O90
$$ 320 24 -535 153 807 794 395 352 1141 1447 959 863 1556 1690 1385 1121 1149 1884 2061 1340 1152 1842
3004A842lk6p42J61N29J30r49k77N40M26o57o66J51M42k74n39o77N49K94o25n91
$$ 1842 1839 1813 1071 1232 1761 1891 942 665 1205 1631 974 308 459 901 627 88 -589 -40 254 -371 -962
3025i62K97L14j89m74m40L90L38n73m91L52K73j74o04l83J139J64m99k54K77P06
$$ -962 -665 -351 -540 -1014 -1454 -1064 -726 -1299 -1790 -1438 -1165 -1339 -1943 -2326 -1187 -1023 -1522 -1776 -1499 -793
3045g93n59m67K35O40K23j97l02M85N71J19n41q8R76Pm51r9M77P24N6o60oQ33
$$ -793 -1352 -1819 -1584 -944 -721 -918 -1220 -735 -164 -45 -586 -674 302 309 -142 -241 236 960 1016 356 350 1183
3067A183l9J64n84O84M60l30m20K20M01l7l58n23O93O74p78k96N7L66j24j022
$$ 1183 1144 1308 724 1408 1868 1538 1118 1338 1739 1702 1344 821 1514 2188 1410 1114 1171 1537 1413 391
3087C91L02r0M68n01n20L01j6P9l57q05P31R21j228q95Q1J006o95m10J45J262
$$ 391 693 603 1071 570 50 351 335 414 57 -748 -17 904 -324 -1219 -1138 -132 -827 -1237 -1092 170
3107A70j294m93l76m37O31K98j35j00R64J56n87l98M39L01m2o53L10Q01j93j44
$$ 170 -1124 -1617 -1993 -2430 -1799 -1501 -1636 -1736 -772 -616 -1203 -1601 -1162 -861 -903 -1556 -1246 -445 -638 -782
3127g82l11L53Q10j38o68P59K41J13j14m78Q51L36M1o62J40O54K48m49k22M98
$$ -782 -1093 -740 70 -68 -736 23 264 377 263 -215 636 972 1013 351 491 1145 1393 944 722 1220
3147A220N54n54j65K1L57J03o54R1O71o5l19o02L92K20j00m40k88M08J54n67o62
$$ 1220 1774 1220 1055 1076 1433 1536 882 973 1644 1579 1260 658 1050 1270 1170 730 442 850 1004 437 -225
3168b25Q29j98m7r21J28Q96l41q96L28m42N81k80l81l25K35M04p14k82L44M26
$$ -225 604 406 359 -562 -434 462 121 -775 -447 -889 -308 -588 -969 -1294 -1059 -655 -1369 -1651 -1307 -881
3188h81k99m03k8O65j50k80j48K15N13k28l13L32M78L49n03k07N17M92k28k85
$$ -881 -1180 -1583 -1611 -946 -1096 -1376 -1524 -1309 -796 -1024 -1337 -1005 -527 -178 -681 -888 -371 121 -107 -392
3208c92J95P25j02n5k49M76K05J14n65M54M36p4k88Q6L09L36l87m52K73L94O2
$$ -392 -197 528 426 371 122 598 803 917 352 806 1242 1168 880 966 1275 1611 1224 772 1045 1439 1501
3229A501q06K00M17J75p1q52J91J96j50j10k59j28P53l68p58K4R8M17j076l8J77
$$ 1501 695 895 1312 1487 1416 564 755 951 801 691 432 304 1057 689 -69 -45 53 470 -606 -644 -467
3250d67O73p99l21K32l17K64p67K88K85Q8p70J11N22J31l15k93k93P80J74o02
$$ -467 206 -593 -914 -682 -999 -735 -1502 -1214 -929 -841 -1611 -1500 -978 -847 -1162 -1455 -1748 -968 -794 -1396
3270a396o7M04O87o34j32J58J117l87k52j15O37N05n61p6K77L71Q3k61k73L33
$$ -1396 -1463 -1059 -372 -1006 -1138 -980 137 -250 -502 -617 20 525 -36 -112 165 536 619 358 85 418
3290D18O33m41k56L71N52j87K41j32k5N39o49J49j60M91K24r33K63l23O6P90j310
$$ 418 1051 610 354 725 1277 1090 1331 1199 1174 1713 1064 1213 1053 1544 1768 835 1098 775 841 1631 321
3311C21L14O52k75r18K56k14M43r97R58n08j15ml13J82k0j38m20k59K11j32Pk39
$$ 321 635 1287 1012 94 350 136 579 -418 540 32 -83 -87 -400 -218 -238 -376 -796 -1055 -844 -976 -969 -1208
3333a208K6N08l44l08J69L12k48K1l58J68M84j19l16R3M31L33o04q7K05R02k47
$$ -1208 -1182 -674 -1018 -1326 -1157 -845 -1093 -1072 -1430 -1262 -778 -897 -1213 -1120 -689 -356 -960 -1047 -842 60 -187
3354a87j87o3K39N33l5k96pO57J11n13J08L81L79j87o00M98J97K31n34K66L35
$$ -187 -374 -437 -198 335 300 4 -3 654 765 252 360 741 1120 933 333 831 1028 1259 725 991 1326
3375A326j40j58k38J07N03l93m86J29M98j76n45j35L21p2J6j83m45N29j47m21
$$ 1326 1186 1028 790 897 1400 1007 521 650 1148 972 427 292 613 541 557 374 -71 458 311 -110
3395a10K71j11J79l12o96k77R33k04l88l37M15K81m54m24M9L96R7k92j40J96L3
$$ -110 161 50 229 -83 -779 -1056 -123 -327 -715 -1052 -637 -356 -810 -1234 -1185 -789 -692 -984 -1124 -928 -895
3416h95l69N2j03O68J02o47J71K81L02Ll81L42J52K94n58L33O27J45m11R2R5M12
$$ -895 -1264 -1212 -1315 -647 -545 -1192 -1021 -740 -438 -435 -816 -474 -322 -28 -586 -253 374 519 108 200 295 707
3438G07J45o55n3O27J22l8l30K46L40oj57j56M93k02k18j86K40L09k24n93L0K68
$$ 707 852 197 144 771 893 855 525 771 1111 1105 948 792 1285 1083 865 679 919 1228 1004 411 441 709
3460G09J19j33L9r2J15l64m79k4O01k07n97N8j37N28m67j59j56K68J34o50m7L32
$$ 709 828 695 734 642 757 393 -86 -110 491 284 -313 -255 -392 136 -331 -490 -646 -378 -244 -894 -941 -609
3482f09J04l34n70M32J26K46o20r8P35K9k69q1q6M99r3k67Q2L57M62n11k30M43
$$ -609 -505 -839 -1409 -977 -851 -605 -1225 -1323 -588 -559 -828 -909 -995 -496 -589 -856 -774 -417 45 -466 -696 -253
3504b53K40L4J1k29O10k70j0M8J63O7J61k88K25M08K1l40J38K61j16L01n19P1
$$ -253 -13 21 32 -197 413 143 133 181 344 411 572 284 509 917 938 598 736 997 881 1182 663 734
3526G34L01J97m76j29M01o1r4k83k27O57k26m46J6k0J36K23q39J53K43m1m45k83
$$ 734 1035 1232 756 627 1028 967 873 590 363 1020 794 348 364 344 480 703 -136 17 260 219 -226 -509
3548e09Q5K06j61m01L40m0P6l88k35L29R9r2n20K59P51n52K61l33o7Q2k73n66
$$ -509 -424 -218 -379 -780 -440 -480 -404 -792 -1027 -698 -599 -691 -1211 -952 -201 -753 -492 -825 -892 -810 -1083 -1649
3570a649J035K60J76n74J56K33K52l45K5k01N98k98M0J48M82J69m01N3L82K00
$$ -1649 -614 -354 -178 -752 -596 -363 -111 -456 -431 -632 -34 -332 -292 -144 338 507 106 159 541 741
3590G41j18k01NM40n2r0k29M83L05n72J47J22J24l01j83k33L36L69n62q8J17k
$$ 741 623 422 427 867 815 725 496 979 1284 712 859 981 1105 804 621 388 724 1093 531 443 560 558
3612E58K11n32q3J18K64l94k29mK10q1k93j78m0K63k58k80J26R9J25m76o7M81
$$ 558 769 237 154 272 536 142 -87 -91 119 38 -255 -433 -473 -210 -468 -748 -622 -523 -398 -874 -941 -460
3634d60n1m7m86K86K69q8m90P2L91J70l39l8R7K87n6j36K5K41L03k41j25K72P5
$$ -460 -511 -558 -1044 -758 -489 -577 -1067 -995 -604 -434 -773 -811 -714 -427 -483 -619 -594 -353 -50 -291 -416 -144 -69
3657f9K80l1j44L17J21j03k45M17K84k74L5q5L13Mj21k55M77N6m02k23J3O60k08
$$ -69 211 180 36 353 474 371 126 543 827 553 588 503 816 820 699 444 921 977 575 352 365 1025 817
3680H17k07k15M86n4l31j95O4K68j85k77j39K13J11j50k91J41j11J8j29l74K28
$$ 817 610 395 881 827 496 301 365 633 448 171 32 245 356 206 -85 56 -55 -37 -166 -540 -312
3701c12L23m03l85J43K82rl27k19M43j52M1l82L5M87j65k52o8M58%j54j13K83
$$ -312 11 -392 -777 -634 -352 -361 -688 -907 -464 -616 -575 -957 -922 -435 -600 -852 -920 -462 -462 -616 -729 -446
3723d46J62k83P6K56K45J59k56r5J31K81r8k32J50M59m9k39J0J81K79l60N4J44
$$ -446 -284 -567 -491 -235 10 169 -87 -182 -51 230 132 -100 50 509 460 221 231 412 691 331 385 529
3745E29K94l25M2J35J98J32j74l87P5K29L7k40m09N08k86q4r9P8L51l34k23l39
$$ 529 823 498 540 675 873 1005 831 444 519 748 785 545 136 644 358 274 175 253 604 270 47 -292
3767b92O37k02Qm57K91J3k57Nj68J11J48l03k50R9M16k70l01k73M38J18l39k9
$$ -292 345 143 151 -306 -15 -2 -259 -254 -422 -311 -163 -466 -716 -617 -201 -471 -772 -1045 -607 -489 -828 -857
3789h57K94o6K88m28r6M40K39l46K9K75M7%m26K24K74J55j98k94M18L89j26j79
$$ -857 -563 -629 -341 -769 -865 -425 -186 -532 -503 -228 -181 -181 -607 -383 -109 46 -152 -446 -28 361 235 56
3811E6P9L72K6l40J22J12o0L4k40K24N26l3l17OK21K6Jj96l2K01l11J07j01l0
$$ 56 135 507 533 193 315 427 367 401 161 385 911 878 561 567 788 814 815 619 587 788 477 584 483 453
3835D53R1l53J03n7J3o6q6K34J35k68n7l64J26J07k97J1j97M26l44k35L4N7J85
$$ 453 544 191 294 237 250 184 98 332 467 199 142 -222 -96 11 -286 -275 -472 -46 -390 -625 -591 -534 -349
3858c49j71m84M70M8J19n44J89J54J11j21l14J57O02k06k71J6J25L85q3k44M2
$$ -349 -520 -1004 -534 -486 -367 -911 -722 -568 -457 -578 -892 -735 -133 -339 -610 -594 -469 -84 -167 -411 -369
3879c69L26k9l24L33J04M04k34j02K55J30L95r36K41K92K07k03j77L54Q1j36p1
$$ -369 -43 -72 -396 -63 41 445 211 109 364 494 889 -47 194 486 693 490 313 667 748 612 541
3900E41k70M75k1l9l11J32K67N5n97L5J36N7k90l03L78Q1j19l87K17R9J92m64
$$ 541 271 746 725 686 375 507 774 829 232 267 403 460 170 -133 245 326 207 -180 37 136 328 -136
3922a36l40R7M30j61l40k92M01K31mm87k8Q2M5j72k7K52m3l20K09J79Q1m62J09
$$ -136 -476 -379 51 -110 -450 -742 -341 -110 -114 -601 -629 -547 -502 -674 -701 -449 -492 -812 -603 -424 -343 -805 -696
3945f96K8k75M84R6k7k39O3Q33l02K66l09M25o88j62J218q02N91j92n12N82q2
$$ -696 -668 -943 -459 -363 -390 -629 -566 267 -35 231 -78 347 -341 -503 715 -87 504 312 -200 382 300
3966C00l42P8N7P51m38L52J31J21l34P65l34j321J382n32q33L84R4l52M60n9o66
$$ 300 -42 36 93 844 406 758 889 1010 676 1441 1107 -214 1168 636 -197 187 281 -71 389 330 -336
3987c36J62N74q33L61K06j28M2o3n69R77n73n5L40o56N6l0N5N75R4r85R30j052
$$ -336 -174 400 -433 -72 134 6 48 -15 -584 393 -180 -235 105 -551 -495 -525 -470 105 199 -786 144 -908
4009i08J047j041L10r0k82M34n31O01o39P92r58M93n29L59Q08n48L49L77K53o60
$$ -908 139 -902 -592 -682 -964 -530 -1061 -460 -1099 -307 -1265 -772 -1301 -942 -134 -682 -333 44 297 -363
4029c63O71m92K86J08k53l2J62L3R9P0k33M63Rk16K0QN27l49k46J001m58k89j42
$$ -363 308 -184 102 210 -43 -75 87 120 219 289 56 519 528 312 332 340 867 518 272 1273 815 526 384
4052C84k91O79P2r03K94N11m74J85o89K67M66r3l81k3m56j59N77n4M06p7l02M69
$$ 384 93 772 844 -59 235 746 272 457 -232 35 501 408 27 4 -452 -611 -34 -88 318 241 -61 408
4074D08p41M50k95j28j80L45j67p88N62L84q7K81j096R6N66pJ32M46r18O02j89
$$ 408 -333 117 -178 -306 -486 -141 -308 -1096 -534 -150 -237 44 -1052 -956 -390 -397 -265 181 -737 -135 -324
4095c24L32m06L57j158J932j092O6K71l00R2j05K3m26J331j156P46K33j7r1N6
$$ -324 8 -398 -41 -1199 733 -359 -293 -22 -322 -230 -335 -312 -738 593 -563 183 416 399 308 364
4115C64J57o50K40K18j36L62k01L60k57P32K9o1j670J354k28K02j74j242Q00P73
$$ 364 521 -129 111 329 193 555 354 714 457 1189 1218 1157 -513 841 613 815 641 -601 199 972
4135I72n97m86j48O06j44m3J56L64n57J49j98o94J050o74l01K6J29j48O1k30P39
$$ 972 375 -111 -259 347 203 160 316 680 123 272 74 -620 430 -244 -545 -519 -390 -538 -477 -707 32
4156C2l20k60O0K17J44j04K16n97J90n8L54k78k4j70J34K46r8J58k6M9j68J14
$$ 32 -288 -548 -488 -271 -127 -231 -15 -612 -422 -480 -126 -404 -428 -598 -464 -218 -316 -158 -184 -135 -303 -189
4178a89L12l08M9j60K49J47J77k52M34m85N20k35R7J47J68m38J37k80R08k03p18
$$ -189 123 -185 -136 -296 -47 100 277 25 459 -26 494 259 356 503 671 233 370 90 998 795 77
4199G7M47q34J372q49M34m63O92n66k7j68J97q7R2m11L53j35R9l40K62j92K14
$$ 77 524 -310 1062 213 647 184 876 310 283 115 312 225 317 -94 259 124 223 -117 145 -47 167
4220A67l32l09J96J70K1k14j08K5N0J23j80j75L57j59l33J84J12M82n02P6K33
$$ 167 -165 -474 -278 -108 -87 -301 -409 -384 -334 -211 -391 -566 -209 -368 -701 -517 -405 77 -425 -349 -116
4241a16k72p5P7j29j10K69J40j97J01L04l33K92k8J60o4k04K7J85K47k84O7J12
$$ -116 -388 -463 -386 -515 -625 -356 -216 -413 -312 -8 -341 -49 -77 83 19 -185 -158 27 274 -10 57 169
4263A69K18J82m51l2K67o8J46q3p0K90k2j17L7j27K10k67nk7K72R7m32q3R4J13
$$ 169 387 569 118 86 353 285 431 348 278 568 546 429 466 339 549 282 277 250 522 619 187 104 198 311
4287C11j80k96M37j19m07l2J14K92j11k59q4K7L46l65r7j02j9r7O70n73j39N59
$$ 311 131 -165 272 153 -254 -286 -172 120 9 -250 -334 -307 39 -326 -423 -525 -544 -641 29 -544 -683 -124
4309a24k79M14o83O42N20r63j29J09m92K36R00k38P74n30q49N13l37Q9J14K85
$$ -124 -403 11 -672 -30 490 -473 -602 -493 -985 -749 151 -87 687 157 -692 -179 -516 -427 -313 -28
4329b8k32K58j06J61m9m0L71j33l7m7K40j11k95M8J04K18K50k11J10o1R0O6m14
$$ -28 -260 -2 -108 53 4 -36 335 202 165 118 358 247 -48 0 104 322 572 361 471 410 500 566 152
4352A52P17k94k29J86k85pl44L78l00L46K04r68L07l76L84P66p49j01K43m9Jm92
$$ 152 869 575 346 532 247 240 -104 274 -26 320 524 -444 -137 -513 -129 637 -112 -213 30 -19 -18 -510
4374e10P27k49K65p25M5K46J97j86M4m55P26k90m43R6k69K0M46J73rJ41k56K0
$$ -510 217 -32 233 -492 -447 -201 -4 -190 -146 -601 125 -165 -608 -512 -781 -761 -315 -142 -151 -10 -266 -246
4396b46l91M91R9j93m3o08J348j051L87q6O11l72L16o94J15Q5J84L03L37m87j59
$$ -246 -637 -146 -47 -240 -283 -891 457 -594 -207 -293 318 -54 262 -432 -317 -232 -48 255 592 105 -54
4417e4M64o26J096l82k60j4K47j75J16j43P6K86k40k37MK83M5j96j35MK4l8L3
$$ -54 410 -216 880 498 238 224 471 296 412 269 345 631 391 154 158 441 486 290 155 159 183 145 178
4440A78n5j28J28J72j30l01J78J99l14k30J67n5n6jj27M6M49k30n42M86O9j15
$$ 178 123 -5 123 295 165 -136 42 241 -73 -303 -136 -191 -247 -248 -375 -329 120 -110 -652 -166 -97 -212
4462b12M4k03j18O10o00O3J04N0nJ23l81K33L13j45qJ55p9J55l51QJ67K12J9j55
$$ -212 -168 -371 -489 121 -479 -416 -312 -262 -267 -144 -525 -292 21 -124 -132 23 -56 99 -252 -244 -77 135 154 -1
4486aJ72K86j25l20K90p5NL0j33M06m8Nn2k71K87j26l15M77J76j2l27l0K5J9m50
$$ -1 171 457 332 12 302 227 232 262 129 535 487 492 440 169 456 330 15 492 668 656 329 299 324 343 -107
4511a07L25l6k18M15l73k8K07j70J60n00J17M31l53m5k14J68kp0j14KR9j30K20
$$ -107 218 182 -36 379 6 -22 185 15 175 -325 -208 223 -130 -175 -389 -221 -223 -293 -407 -405 -306 -436 -216
4534b16k73M6J95m0k85Q0J18k6n5j77J55M12j15j4m9J9k13J20J3L70K42p25q9
$$ -216 -489 -443 -248 -288 -573 -493 -375 -401 -456 -633 -478 -66 -181 -195 -244 -225 -438 -318 -305 65 307 -418 -507
4557e07J98O54j85r8M31k68J53k5n02M24N4j62j27L54j44J45R7k81M45j50n46
$$ -507 -309 345 160 62 493 225 378 353 -149 275 329 167 40 394 250 395 492 211 656 506 -40
4578d0L04l50J77K43Pl00M2P5J34J08k33J20L39m56L06j074M47K82l88L92j52
$$ -40 264 -86 91 334 341 41 83 158 292 400 167 287 626 170 476 -598 -151 131 -257 135 -17
4599a7k79K95k45M5L4j82O3M6K60n65m9J45p3K19J26j56J40k32M67l49l01J09
$$ -17 -296 -1 -246 -201 -167 -349 -286 -240 20 -545 -594 -449 -522 -303 -177 -333 -193 -425 42 -307 -608 -499
4621d99M18k76J66j42J72j57j8j96L32K81O1j27p5J47K1j42J23M97l83J54l91
$$ -499 -81 -357 -191 -333 -161 -318 -336 -532 -200 81 142 15 -60 87 108 -34 89 586 203 357 -34
4642c4J9J66l8Kq0J19L85j49l40K09O9n76L93l84P17l07L80k83k97j8L21Q8j02
$$ -34 -15 151 113 115 35 154 539 390 50 259 328 -248 145 -239 478 171 551 268 -29 -47 274 362 260
4665B60m43K7J09l50O95j15P4k61k20j78M10Nl73J21K54j54k59k9K49k23K23k62
$$ 260 -183 -156 -47 -397 298 183 257 -4 -224 -402 8 13 -360 -239 15 -139 -398 -427 -178 -401 -178 -440
4687d40K63j32j0j78L19j09k9Q1k05L68k17O1M9q5K32j22lMJ93J66l82J76K12
$$ -440 -177 -309 -319 -497 -178 -287 -316 -235 -440 -72 -289 -228 -179 -264 -32 -154 -157 -153 40 206 -176 0 212
4710B12M6j9m7O1K83k30j95n5K30J28J04l93M55jl87N2j48L00K4J24n50K12K98
$$ 212 258 239 192 253 536 306 111 56 286 414 518 125 580 579 192 244 96 396 420 544 -6 206 504
4733E04j55k95J67j06K68k32k77J97o5q6j30K10j49J94j15k35L44J41j04L8n14
$$ 504 349 54 221 115 383 151 -126 71 6 -80 -210 0 -149 45 -70 -305 39 180 76 114 -400
4754d00L08J08j02j47K6p5j87k8N4rK68j50J24m5M64m72l23M1N30j28q2m5Q9L8
$$ -400 -92 16 -86 -233 -207 -282 -469 -497 -443 -452 -184 -334 -210 -255 209 -263 -586 -545 -15 -143 -225 -270 -181 -143
4778a43m3J06P6J33J80j72j02J53J48n1j01n2j21J75J30j87N0MJ96MJ2O0k63m5
$$ -143 -186 -80 -4 129 309 137 35 188 336 285 184 132 11 186 316 129 179 183 379 383 395 455 192 147
4802A47N7K9J60k41O0l2K67L6l22q9L58m5l69J64o7O1j88K2k94K96J06k04k14
$$ 147 204 233 393 152 212 180 447 483 161 72 430 385 16 180 113 174 -14 8 -286 10 116 -88 -302
4825c02M73j29l1j08k56J44K40l84J91J5O2K6m63J40M10l45k8J18j02J23j82J44
$$ -302 171 42 11 -97 -353 -209 31 -353 -162 -147 -85 -59 -522 -382 28 -317 -345 -227 -329 -206 -388 -244
4847b44l38L83K51j45m4k16K13J06K0J52M5K48m66j47K05M8M0J38J27j36n4n1
$$ -244 -582 -199 52 -93 -137 -353 -140 -34 -14 138 183 431 -35 -182 23 71 111 249 376 240 186 135
4869A35L04j38J80k86K53k41K55q9k5l91J60J77o6j83L3P5k46K83q8Lp8n0k25
$$ 135 439 301 481 195 448 207 462 373 348 -43 117 294 228 45 78 153 -93 190 102 105 27 -23 -248
4892b48J58j32J79m0O4K52j79l72K17m1j02L5K00j53r1L82k96Q5j33r3j8K8l41
$$ -248 -90 -222 -43 -83 -19 233 54 -318 -101 -142 -244 -209 -9 -162 -253 129 -167 -82 -215 -308 -326 -298 -639
4915f39M69l6k94K30J19Mj16K3r7K56j54jo9P1K65K16k57Q7j37Q1K12k84o2J16
$$ -639 -170 -206 -500 -270 -151 -147 -263 -240 -337 -81 -235 -236 -305 -234 31 247 -10 77 -60 21 233 -51 -113 3
4939CO4L02l56K78n4n0q3J36J35l2J9r8n2K48j48J75j55j18J25k85K37k04L27
$$ 3 67 369 13 291 237 187 104 240 375 343 362 264 212 460 312 487 332 214 339 54 291 87 414
$$ [...]
8191d2
##END NTUPLES=NMR FID
##END=
