##TITLE=1H_SR26_oil
 CDcl3, 8 sc, 
 15.12.2020
##JCAMPDX= 6.0         $$ Bruker NMR JCAMP-DX V2.0
##DATA TYPE= NMR FID
##DATA CLASS= NTUPLES
##ORIGIN= UXNMR, Bruker Analytische Messtechnik GmbH
##OWNER= root
$$ XWIN-NMR		Version 3.5
$$ Tue Dec 15 13:19:45 2020 Russian Standard Time (UT+4h)  she@DPX200
##.OBSERVE FREQUENCY= 200.1315066352
##.OBSERVE NUCLEUS= ^1H
##.DELAY= (6, 6)
##.ACQUISITION MODE= SIMULTANEOUS
##.ACQUISITION SCHEME= undefined
##.AVERAGES= 8
##.DIGITISER RES= 18
##SPECTROMETER/DATA SYSTEM= spect
##.PULSE SEQUENCE= zg30
##.SOLVENT NAME= CDCl3
##.SHIFT REFERENCE= (INTERNAL, CDCl3, 0, 15.7039)
##AUDIT TRAIL= $$ (NUMBER, WHEN, WHO, WHERE, WHAT)
$$ ##TITLE= Audit trail, XWIN-NMR		Version 3.5
$$ ##JCAMPDX= 5.01
$$ ##ORIGIN= Bruker BioSpin GmbH
$$ ##OWNER= she
$$ F:/spectra/data/she/nmr/H-F/1/audita.txt
$$ ##AUDIT TRAIL=  $$ (NUMBER, WHEN, WHO, WHERE, WHAT)
(   1,<2020-12-15 13:18:34.84 +0400>,<she>,<DPX200>,
      <created by zg, POWCHK disabled, PULCHK disabled
       configuration hash MD5:
       00 E9 B6 7A A2 85 ED C7 34 08 36 98 17 FE 4E 26
       data hash MD5: 16K
       22 41 0E AE 27 03 01 D5 0A CE CE 9C 42 B4 B4 38>)
$$ ##END=
$$ 
$$ hash MD5
$$ 95 BB 21 CF 6E 49 B8 9B EE 00 7E C2 89 24 6F 78
##$RELAX= 
##$RELAX= 
##$RELAX= 
##$RELAX= 
##$RELAX= 
##$RELAX= 
$$ Bruker specific parameters
$$ --------------------------
##$DU= <F:/spectra>
##$EXPNO= 1
##$NAME= <H-F>
##$PROCNO= 1
##$TYPE= <nmr>
##$USER= <she>
##$AMP= (0..31)
100 100 100 100 100 100 100 100 100 100 100 100 100 100 100 100 100 100 
100 100 100 100 100 100 100 100 100 100 100 100 100 100 
##$AQSEQ= 0
##$AQ_mod= 1
##$AUNM= <au_zg>
##$AUTOPOS= <>
##$BF1= 200.13
##$BF2= 200.13
##$BF3= 200.13
##$BF4= 200.13
##$BF5= 200.13
##$BF6= 200.13
##$BF7= 200.13
##$BF8= 200.13
##$BYTORDA= 1
##$CFDGTYP= 0
##$CFRGTYP= 5
##$CHEMSTR= <none>
##$CNST= (0..31)
1 1 145 1 1 1 1 1 1 1 1 1 1 1 1 1 1 1 1 1 1 1 1 1 1 1 1 1 1 1 1 1 
##$CPDPRG= <>
##$CPDPRG1= <>
##$CPDPRG2= <>
##$CPDPRG3= <>
##$CPDPRG4= <mlev>
##$CPDPRG5= <mlev>
##$CPDPRG6= <mlev>
##$CPDPRG7= <mlev>
##$CPDPRG8= <mlev>
##$CPDPRGB= <>
##$CPDPRGT= <>
##$D= (0..31)
0 1.2 0 0 0 0 0 0 0 0.06 0 0.03 0 0 0 0 0.0002 0 0 0 0 0 0 0 0 0 0 0 0 
0 0 0 
##$DATE= 1608023914
##$DBL= (0..7)
120 120 120 120 120 120 120 120 
##$DBP= (0..7)
150 150 150 150 150 150 150 150 
##$DBP07= 0
##$DBPNAM0= <>
##$DBPNAM1= <>
##$DBPNAM2= <>
##$DBPNAM3= <>
##$DBPNAM4= <>
##$DBPNAM5= <>
##$DBPNAM6= <>
##$DBPNAM7= <>
##$DBPOAL= (0..7)
0.5 0.5 0.5 0.5 0.5 0.5 0.5 0.5 
##$DBPOFFS= (0..7)
0 0 0 0 0 0 0 0 
##$DE= 6
##$DECBNUC= <off>
##$DECIM= 32
##$DECNUC= <off>
##$DECSTAT= 4
##$DIGMOD= 1
##$DIGTYP= 9
##$DL= (0..7)
0 120 120 120 120 120 120 120 
##$DP= (0..7)
150 150 150 150 150 150 150 150 
##$DP07= 0
##$DPNAME0= <>
##$DPNAME1= <>
##$DPNAME2= <>
##$DPNAME3= <>
##$DPNAME4= <>
##$DPNAME5= <>
##$DPNAME6= <>
##$DPNAME7= <>
##$DPOAL= (0..7)
0.5 0.5 0.5 0.5 0.5 0.5 0.5 0.5 
##$DPOFFS= (0..7)
0 0 0 0 0 0 0 0 
##$DQDMODE= 0
##$DR= 18
##$DS= 0
##$DSLIST= <SSSSSSSSSSSSSSS>
$$ [...]
##$SUBNAM2= <"">
##$SUBNAM3= <"">
##$SUBNAM4= <"">
##$SUBNAM5= <"">
##$SUBNAM6= <"">
##$SUBNAM7= <"">
##$SUBNAM8= <"">
##$SUBNAM9= <"">
##$SW= 16.9725356469052
##$SWIBOX= (0..15)
0 0 2 0 0 0 0 0 0 0 0 0 0 0 0 0 
##$SW_h= 3396.73913043478
##$TD= 16384
##$TD0= 1
##$TE= 0
##$TE2= 300
##$TE3= 300
##$TEG= 300
##$TL= (0..7)
0 120 120 120 120 120 120 120 
##$TP= (0..7)
150 150 150 150 150 150 150 150 
##$TP07= 0
##$TPNAME0= <>
##$TPNAME1= <>
##$TPNAME2= <>
##$TPNAME3= <>
##$TPNAME4= <>
##$TPNAME5= <>
##$TPNAME6= <>
##$TPNAME7= <>
##$TPOAL= (0..7)
0.5 0.5 0.5 0.5 0.5 0.5 0.5 0.5 
##$TPOFFS= (0..7)
0 0 0 0 0 0 0 0 
##$TUNHIN= 0
##$TUNHOUT= 0
##$TUNXOUT= 0
##$USERA1= <user>
##$USERA2= <user>
##$USERA3= <user>
##$USERA4= <user>
##$USERA5= <user>
##$V9= 5
##$VALIST= <valist>
##$VCLIST= <CCCCCCCCCCCCCCC>
##$VD= 0
##$VDLIST= <DDDDDDDDDDDDDDD>
##$VPLIST= <PPPPPPPPPPPPPPP>
##$VTLIST= <TTTTTTTTTTTTTTT>
##$WBST= 1024
##$WBSW= 4
##$XGAIN= (0..3)
0 0 0 0 
##$XL= 0
##$YL= 0
##$YMAX_a= 24887
##$YMIN_a= -23995
##$ZGOPTNS= <>
##$ZL1= 120
##$ZL2= 120
##$ZL3= 120
##$ZL4= 120
##$ABSF1= 10
##$ABSF2= 0
##$ABSG= 5
##$ABSL= 3
##$ALPHA= 0
##$AQORDER= 0
##$ASSFAC= 0
##$ASSFACI= 0
##$ASSFACX= 0
##$ASSWID= 0
##$AUNMP= <proc_1d>
##$AZFE= 0.1
##$AZFW= 0.1
##$BCFW= 1
##$BC_mod= 2
##$BYTORDP= 1
##$COROFFS= 0
##$CY= 11.3945322036743
##$DATMOD= 1
##$DC= 2
##$DFILT= <>
##$DTYPP= 0
##$F1P= 15.9154993809931
##$F2P= -4.1035820241983
##$FCOR= 0.5
##$FTSIZE= 0
##$FT_mod= 4
##$GAMMA= 1
##$GB= 0.15
##$INTBC= 1
##$INTSCL= 1
##$ISEN= 128
##$LB= 0.24
##$LEV0= 0
##$LPBIN= 0
##$MAXI= 10000
##$MC2= 0
##$MEAN= 0
##$ME_mod= 0
##$MI= 1.114404
##$NCOEF= 0
##$NC_proc= 0
##$NLEV= 6
##$NOISF1= 3.799351
##$NOISF2= 2.8
##$NSP= 1
##$NTH_PI= 0
##$NZP= 0
##$OFFSET= 15.70392
##$PC= 1
##$PHC0= -10763.01
##$PHC1= 19.60089
##$PH_mod= 1
##$PKNL= yes
##$PPARMOD= 0
##$PSCAL= 0
##$PSIGN= 0
##$REVERSE= no
##$SF= 200.130013532006
##$SI= 16384
##$SIGF1= 3
##$SIGF2= 2
##$SINO= 400
##$SIOLD= 16384
##$SREGLST= <1H.CDCl3>
##$SSB= 0
##$STSI= 0
##$STSR= 0
##$SW_p= 3612.71676300578
##$SYMM= 0
##$S_DEV= 0
##$TDeff= 0
##$TDoff= 0
##$TI= <>
##$TILT= no
##$TM1= 0
##$TM2= 0
##$TOPLEV= 0
##$USERP1= <user>
##$USERP2= <user>
##$USERP3= <user>
##$USERP4= <user>
##$USERP5= <user>
##$WDW= 1
##$XDIM= 8192
##$YMAX_p= 0
##$YMIN_p= 0
$$ End of Bruker specific parameters
$$ ---------------------------------
##NTUPLES= NMR FID
##VAR_NAME=  TIME,          FID/REAL,        FID/IMAG
##SYMBOL=    X,             R,               I
##VAR_TYPE=  INDEPENDENT,   DEPENDENT,       DEPENDENT
##VAR_FORM=  AFFN,          ASDF,            ASDF
##VAR_DIM=   8192,          8192,            8192
##UNITS=     SECONDS,       ARBITRARY UNITS, ARBITRARY UNITS
##FACTOR=    0.0002944,     1,               1
##FIRST=     0,             0,               0
##LAST=      2.4114304,     0,               0
##MIN=       0,             -23995,          0
##MAX=       2.4114304,     24887,           0
$$ Real data points
##PAGE= N=1
##DATA TABLE= (X++(R..R)), XYDATA
$$ [...]
$$ plain form
1786 -240 -177 -57 85 -47 12 1 13 49 43 113 42 416 291 -86 90 195 143 -65 389 66 286 306 154 301
1810 301 187 168 104 197 411 149 -89 291 -27 51 -34 38 79 170 188 -154 -173 156 55 -152 43 5 13 -99
1834 -99 -106 -256 -283 -72 -269 -260 -404 -322 -265 -192 -161 -413 111 -526 -163 -510 -422 -209 -236 -87 -493 -257 -203 -178 -133
1859 -133 -258 -65 177 -60 -75 -23 -142 -168 -56 144 208 -1 175 3 96 277 159 367 473 278 482 -60
1881 -60 31 511 67 159 95 173 96 -30 270 204 111 175 403 -14 -46 184 -48 54 -27 -30 180 89 -27 -134 -212
1906 -212 46 0 -202 -16 -101 -66 -281 -330 -226 -534 -180 -243 -57 -70 -53 -200 -296 -30 -122 -109 -157 -402 -111 -200
1930 -200 -51 -26 -67 -266 -228 58 -69 88 56 -56 -173 259 147 102 302 -56 148 -67 288 148 317 15
1952 15 162 187 -65 428 198 232 139 435 76 257 -47 32 84 30 146 -44 138 44 213 -6 -75 27 139
$$ packed form
1786b40O3J20J42j32N9j1J2L6oP0p1L74j25l77J76J05n2k08M54l23K20K0j52J47
1810C01j14j9o4R3K14k62k38L80l18P8q5P2M1R1J8l42j9L29j01k07J95l8Qj12
1834i9pj50k7K11j97Rj44Q2N7P3L1k52N24o37L63l47Q8K13k7J49m06K36N4K5M5
1859a33j25J93K42k37j5N2j19k6J12K00O4k09J76j72R3J81j18K08J06j95K04n42
1881f0R1M80m44R2o4P8p7j26L00o6r3O4K28m17l2K30k32J02q1lK10r1j16j07p8
1906b12K58m6k02J86q5L5k15m9J04l08L54o3J86j3J7j47r6K66r2J3m8k45K91q9
1930b00J49K5m1j99L8K86j27J57l2j12j17M32j12m5K00l58K04k15L55j40J69l02
1952A5J47K5k52M93k30L4r3K96l59J81l04P9N2n4J16j90J82r4J69k19o9J02J12
$$ plain form
1975 139 -34 37 24 -50 -65 65 -234 -87 238 -199 -271 -274 -7 70 -270 -206 -98 -244 -343 -328 -179 -106 -331 -205
1999 -205 -91 -271 -46 -294 -111 -206 -69 -152 -154 -8 13 -245 73 -5 -261 107 -57 -127 255 80 246 94
2021 94 68 116 232 22 -37 256 210 264 254 180 9 245 227 305 168 86 163 174 140 314 448 478 177 226 225 174
2047 174 140 76 46 -21 139 -217 -11 -197 -51 -125 38 15 -305 41 -23 -258 -152 -111 -191 -149 2 -200 -32
2070 -32 -290 -160 -196 -8 -210 -397 -59 -209 -38 -30 -118 -91 -45 -50 84 37 -95 127 40 41 -176 100 34 -12 212
2095 212 73 256 33 -23 189 211 61 266 115 299 209 -90 346 397 173 2 75 118 428 92 -158 102
2117 102 162 83 103 168 -29 201 114 -22 60 102 85 47 -263 14 -129 20 -148 -69 -123 -247 -104 -29 -140 -103
2141 -103 -99 -115 83 -530 -158 -310 34 -288 42 -203 -245 -103 -135 -184 -59 142 -81 180 165 -133 -251 210
$$ packed form
1975A39j73P1j3p4j5J30k99J47L25m37p2lK67P7l40O4J08j46r9J5J49P3k25J26
1999b05J14j80K25k48J83r5J37q3kJ46K1k58L18p8k56L68j64p0L82j75J66j52
2021I4k6M8J16k10n9K93m6N4j0p4j71K36j8P8j37q2P7J1l4J74J34L0l01M9jn1
2047A74l4o4l0o7J60l56K06j86J46p4J63k3l20L46o4k35J06M1q0M2J51k02J68
2070c2k58J30l6J88k02j87L38j50J71Qq8K7M6nJ34m7j32K22q7Jk17K76o6m6K24
2095B12j39J83k23n6K12K2j50K05j51J84r0k99M36N1k24j71P3M3L10l36k50K60
2117A02O0p9K0O5j97K30q7j36Q2M2j7l8l10K77j43J49j68P9n4j24J43P5j11L7
2141a03Mj6J98o13L72j52L44l22L30k45m2J42l2m9J25K01k23K61j5k98j18M61
$$ plain form
2163 210 187 59 159 -38 -91 190 97 -160 327 338 255 166 187 186 167 296 99 207 57 169 283 213 -53 173
2187 173 347 321 216 98 215 353 164 99 418 138 381 165 -114 -53 -80 -143 -49 -47 290 -38 -157 -221 -259
2210 -259 -20 -417 195 -176 -435 29 -297 -406 -216 580 665 -1146 -141 -275 -134 -285 -141 -330 -130 -33
2230 -33 -128 -344 89 445 -189 -37 -136 -121 -15 370 -134 -438 -126 -475 559 -224 503 184 100 25 -902 -271
2252 -271 -71 -321 801 361 355 145 -66 57 68 184 57 82 71 253 76 74 102 162 207 -148 41 -55 -36 -65
2276 -65 18 54 5 -306 130 -80 223 -33 -55 82 -60 237 -213 -222 24 -63 -217 -173 -307 36 -257 -121 -43
2299 -43 -47 -135 -166 -170 55 -211 160 -1 -107 -38 -126 -137 -328 -13 -216 -29 61 187 98 2 154 -18 168 215 106
2324 106 80 101 172 153 423 103 103 102 183 158 21 -144 155 171 249 -139 166 109 84 259 52 85 13 211 34
$$ packed form
2163B10k3j28J00j97n3K81r3k57M87J1q3q9K1jj9J29j97J08j50J12J14p0k66K26
2187A73J74k6j05j18J17J38j89o5L19k80K43k16k79O1k7o3R4KL37l28j19o4l8
2210b59K39l97O12l71k59M64l26j09J90P96Q5j811J005j34J41j51J44j89K00R7
2230c3r5k16M33L56o34J52r9J5J06L85n04l04L12l49J034p83P27l19q4p5r27O31
2252b71K00k50J122m40ok10k11J23J1J16j27K5j1J82j77kK8O0M5l55J89r6J9k9
2276f5Q3L6m9l11M36k10L03k56k2J37j42K97m50rK46q7j54M4j34L43k93J36P8
2299d3mq8l1mK25k66L71j61j06O9q8j1j91L15k03J87R0J26q9r6J52j72J86M7j09
2324A06k6K1P1j9K70l20%jQ1k5j37j65K99J6P8l88L05n7k5J75k07L3p2J98j77
$$ plain form
2349 34 72 41 26 -40 -246 -260 -190 -161 84 -47 11 193 -153 -327 -7 -439 -181 -270 -114 27 -138 -183 -268 30
2373 30 -39 -201 -53 -128 -102 -180 -151 153 -58 -282 -57 -28 -28 -7 -136 -65 -150 179 -141 -16 197 43 184 75
2397 75 -6 89 193 217 138 128 97 337 140 229 12 337 -6 -123 92 352 250 -22 406 259 80 29 169
2420 169 188 -52 91 96 151 -123 137 101 120 -194 -227 -26 -81 -16 -138 -247 -14 -217 -317 -220 -293 -126 -136 -12
2444 -12 -268 8 -82 -169 -165 104 -191 -114 -201 97 58 -39 26 127 -113 -18 -2 -84 4 78 -21 -83 140 110 26 -4 33
2471 33 101 190 45 -111 90 205 160 17 -41 171 259 86 40 124 182 109 110 126 288 164 124 304 56 103 -5
2496 -5 -131 145 78 -49 70 -73 125 -27 97 -280 64 118 -72 -156 -91 -49 -239 5 -177 -84 -284 -97 -321
2519 -321 -299 -150 -112 -309 -201 -29 -298 -219 -114 -107 -26 -16 62 -78 -45 163 -35 1 26 95 -129 51 95 -19
$$ packed form
2349C4L8l1j5o6k06j4P0K9K45j31N8J82l46j74L20m32K58q9J56J41j65m5q5K98
2373C0o9j62J48p5K6p8K9L04k11k24K25K9%K1j29P1q5L29l20J25K13j54J41j09
2397G5q1R5J04K4p9j0l1K40j97Q9k17L25l43j17K15K60j02k72M28j47j79n1J40
2420A69J9k40J43NN5k74K60l6J9l14l3K01n5O5j22j09K33k03j00R7p3J67j0J24
2444a2k56K76r0q7MK69k95P7q7K98l9r7O5J01k40R5J6q2Q8P4r9o2K23l0q4l0L7
2471C3O8Q9j45j56K01J15m5j43n8K12Q8j73m6Q4N8p3JJ6J62j24m0J80k48M7j08
2496ej26K76o7j27J19j43J98j52J24l77L44N4j90q4O5M2j90K44j82R3k00J87k24
2519c21K2J49L8j97J08J72k69P9J05PQ1J0P8j40L3K08j98L6K5O9k24J80M4j14
$$ plain form
2543 -19 160 234 -17 136 203 138 303 331 115 244 -36 256 157 457 307 186 312 112 90 41 31 378 228
2566 228 188 1 39 101 -106 285 187 -33 103 -75 261 127 129 -2 -126 -162 33 -249 -114 -60 81 -96 3
2589 3 -256 -51 -59 -103 -254 143 -81 -267 -23 27 -34 -189 -22 -255 105 -6 -272 -133 -56 4 84 -137 99
2612 99 -62 -98 146 85 48 33 126 219 106 -8 80 51 -67 130 320 70 -12 113 -79 67 -75 92 77 182
2636 182 229 73 -98 217 -30 -69 168 -129 220 38 -135 54 -96 5 -73 59 152 -1 -53 -144 -202 100
2658 100 -25 -124 -118 20 73 -17 38 55 -240 -625 -54 -47 -130 -87 -202 2 -179 -229 -158 -1 -145 40 136 58 -29
2683 -29 200 -143 80 -96 183 237 79 14 -32 151 81 149 339 153 38 226 184 38 272 -169 -530 -280
2705 -280 29 -520 -470 604 249 -245 -88 48 -14 -214 -252 -27 236 107 -263 521 -338 181 249 837 170
$$ packed form
2543a9J79P4k51J53O7o5J65K8k16J29k80K92r9L00j50j21J26k00k2m9j0L47j50
2566B28m0j87L8O2k07L91r8k20J36j78L36j34Kj31j24l6J95k82J35N4J41j77R9
2589Ck59K05qm4j51L97k24j86K44N0o1j55J67k33L60j11k66J39P7O0Q0k21K36
2612I9j61l6K44o1l7j5R3R3j13j14Q8k9j18J97J90k50q2J25j92J46j42J67j5J05
2636A82M7j56j71L15k47l9K37k97L49j82j73J89j50J01p8J32R3j53n2r1n8L02
2658A00j25r9OJ38N3r0N5J7k95l85N71Pq3M3j15K04j81n0P1J57j44J85R6p8q7
2683b9K29l43K23j76K79N4j58o5m6J83p0O8J90j86j15J88m2j46K34m41l61K50
2705b80L09n49N0J074l55m94J57J36o2k00l8K25K63j29l70P84q59N19O8N88o67
$$ plain form
2726 170 -243 281 -266 -84 -100 176 117 28 -130 -265 -54 324 152 -60 -60 42 -276 -207 -176 -223 -153 124 -9
2749 -9 111 -41 246 -340 -84 64 -153 47 -220 138 2 95 -74 -182 127 222 56 99 11 -153 -145 88 323
2772 323 204 198 -56 137 49 140 -70 -4 85 -95 135 357 99 74 117 170 48 148 187 198 2 -153 -107 0
2796 0 -133 5 -16 -138 -65 -64 -58 52 -66 -303 -45 -244 -16 19 -181 -59 -169 20 -67 -295 27 -236 -279 103
2820 103 -151 40 -60 -40 -191 -118 -160 99 -99 40 -54 -183 -77 -81 24 117 30 -256 -137 -112 -49 93 -78
2843 -78 16 124 178 3 -62 84 103 -11 -27 -17 -35 279 21 22 79 95 219 158 149 67 -244 217 -111 -126 22 -23
2869 -23 99 168 67 25 68 29 -38 9 150 86 134 214 103 -75 -97 -234 82 -266 -225 -126 -47 -62 -69 85 -99 -81
2895 -81 -263 102 -42 -239 -214 -150 -172 -19 -13 -103 -44 -43 -192 53 -94 22 144 -52 243 118 -40 -53 -92 -128
$$ packed form
2726A70m13N24n47J82j6K76n9q9j58j35K11L78j72k12%J02l18O9L1m7P0K77j33
2749iJ20j52K87n86K56J48k17K00k67L58j36R3j69j08L09R5j66M3q8j64QK33K35
2772C23j19ok54J93q8R1k10O6Q9j80K30K22k58k5M3N3j22J00L9J1j96j55M6J07
2796@j33J38k1j22P3JOJ10j18k37K58j99K28L5k00J22j10J89q7k28L22k63m3L82
2820A03k54J91j00K0j51P3m2K59j98J39r4j29J06mJ05R3q7k86J19K5O3J42j71
2843g8R4J08N4j75o5J46J9j14j6J0j8L14k58JN7J6J24o1rq2l11M61l28j5J48m5
2869b3J22O9j01m2M3l9o7M7J41o4M8Q0j11j78k2j37L16l48M1R9P9j5pJ54j84J8
2895h1j82L65j44j97K5O4k2J53Or0N9Jj49K45j47J16J22j96K95j25j58j3l9l6
$$ plain form
2919 -128 -61 183 17 -153 48 -171 50 187 311 75 90 -27 178 245 25 -107 55 -83 103 94 50 -39
2941 -39 353 92 -69 59 -5 -77 -105 113 -22 19 242 161 29 413 -50 -235 -304 -44 -290 301 -196 -192 -181
2964 -181 -590 -473 -75 -77 -13 -128 -279 -25 98 -124 124 81 -115 -60 47 -182 12 -168 -116 -37 -27 -38 97
2987 97 -68 37 -39 4 -67 208 123 24 -50 -143 64 -288 85 146 -237 -96 82 93 104 41 -92 42 122 193 176
3012 176 -283 88 216 -159 365 0 -17 -143 264 -34 107 229 199 137 -428 -124 -80 102 -40 -79 -220 -329
3034 -329 -115 -6 -250 -66 -296 5 -28 -166 -74 146 253 -158 33 -61 104 -9 16 -39 106 -98 -88 -184
3056 -184 181 -114 -155 -279 -216 -22 197 -183 -115 63 99 102 -112 -114 36 0 168 43 187 95 -92 253 58
3079 58 -45 -72 340 154 -128 68 19 168 100 0 86 -92 -89 174 113 119 77 100 -5 273 67 76 -304 -164 32
$$ packed form
2919a28O7K44j66j70K01k19K21J37J24k36J5j17K05O7k20j32J62j38J86rm4q9
2941c9L92k61j61J28o4p2k8K18j35M1K23q1j32L84m63j85o9K60k46N91m97MJ1
2964a81m09J17L98kO4j15j51K54J23k22K48m3j96N5J07k29J94j80N2P9J0j1J35
2987I7j65J05p6M3p1K75q5r9p4r3K07l52L73O1l83J41J78J1J1o3j33J34Q0P1j7
3012A76m59L71J28l75N24l65j7j26M07k98J41J22l0o2n65L04M4J82j42l9j41j09
3034c29K14J09k44J84k30L01l3j38R2K20J07m11J91r4J65j13K5n5J45k04J0r6
3056a84L65k95m1j24O3J94K19l80O8J78L6Lk14kJ50l6J68j25J44r2j87L45j95
3079E8j03k7M12j86k82J96m9J49o8j00Q6j78LK63o1Om2K3j05K78k06Rl80J40J96
$$ plain form
3104 32 -74 -130 -102 -99 -180 27 -293 95 -111 -182 13 -62 -62 -312 45 -156 -247 -194 48 107 91 -242 -282 -65 -27
3129 -27 -112 -256 36 61 19 -293 28 103 -243 -35 153 -37 -288 269 85 -124 50 24 -28 145 -70 62
3151 62 71 -199 -100 -28 6 132 11 81 -118 -93 68 -8 -64 138 -5 305 12 -10 302 205 -2 221 47 -76
3175 -76 146 -148 55 -30 79 13 -182 -125 -3 -35 48 -248 0 106 -15 -27 88 175 -120 45 51 -84 -62 2
3199 2 -48 28 -75 10 -80 29 64 -167 78 61 72 153 -100 151 -40 -134 269 -95 314 -166 46 203 322 223
3223 223 89 -37 139 246 -6 177 -36 72 121 85 190 -140 50 102 247 -215 -47 -5 -55 229 -250 7
3245 7 -3 122 -48 -57 111 -148 223 328 -39 154 -31 19 155 158 -131 -192 -113 -150 70 288 49 33 -111 18
3269 18 136 -46 -88 13 178 -77 116 -175 43 -68 -26 87 -132 -166 -7 -18 3 -92 42 128 6 161 96
$$ packed form
3104C2j06n6K8Lq1K07l20L88k06p1J95p5%k50L57k01r1N3K42N9j6l33m0K17L8
3129b7q5j44K92K5m2l12L21P5l46K08J88j90k51N57j84k09J74k6n2J73k15J32
3151F2Rk70R9P2L4J26j21P0j99K5J61p6n6K02j43L10k93k2L12r7k07K23j74j23
3175g6K22k94K03q5J09o6j95N7J22l2Q3k96K48J06j21j2J15Q7k95J65Oj35K2O4
3199Bn0P6j03Q5r0J09L5k31K45j7J1Q1k53K51j91r4M03l64M09m80K12J57J19r9
3223B23j34j26J76J07k52J83k13J08M9l6J05l30J90N2J45m62J68M2n0K84m79K57
3245Gj0J25j70rJ68k59L71J05l67J93j85N0J36Lk89o1P9l7K20K18k39j6j44J29
3269A8J18j82m2J01J65k55J93k91K18j11M2J13k19l4J59j1K1r5J34Q6j22J55o5
$$ plain form
3292 96 147 -13 158 -33 0 21 140 -82 111 108 115 174 8 269 221 194 -20 193 -98 1 120 47 263 1
3316 1 226 118 -97 51 -46 -175 111 4 -196 -127 -105 -32 -51 -77 -28 19 -120 110 -113 110 -62 -28 -77 -11
3340 -11 -304 -77 67 -143 59 -278 -167 -57 173 55 -284 20 11 -78 -235 -54 -11 -105 -1 -287 98 7
3362 7 -10 367 -21 6 12 120 -153 -58 199 18 136 -119 76 132 -96 46 -110 2 -11 152 194 -94 65
3385 65 -103 -226 230 -58 254 -244 119 102 186 -31 70 -110 -25 -61 3 -127 -226 64 117 -2 200 70 12
3408 12 85 62 -153 -125 -13 167 -5 -139 -21 -3 -74 79 -109 -285 -36 -14 56 83 -30 -12 269 207 -44 -19
3432 -19 117 -36 146 -28 -125 -38 -111 -105 -31 44 2 114 -382 -164 85 137 -55 -4 -1 23 45 -149 216 -50 96
3457 96 258 -251 15 331 -134 -14 1 -17 9 -145 51 259 151 -49 -5 113 -2 -111 -216 281 100 -40
$$ packed form
3292I6N1j60J71j91L3K1J19k22J93lPN9j66K61m8k7k14K13k91R9J19p3K16k62
3316AK25j08k15J48r7j29K86j07k00O9K2P3j9k6M9M7j39K30k23K23j72L4m9O6
3340a1k93K27J44k10K02l37J11J10K30j18l39L04rq9j57J81M3r4J04k86L85r1
3362Gj7L77l88K7OJ08k73R5K57j81J18k55J95N6k28J42j56J12j3J63M2k88J59
3385F5j68j23M56k88L12m98L63j7Q4k17J01j80Q5l6O4j30r9K90N3j19K02j30n8
3408A2P3k3k15K8J12J80j72j34J18J8p1J53j88j76K49K2P0K7j13J8K81o2k51K5
3432a9J36j53J82j74r7Q7p3OP4P5m2J12m96K18K49N2j92N1LK4K2j94L65k66J46
3457I6J62n09K66L16m65J20J5j8K6j54J96K08j08k00M4J18j15j09j05M97j81j40
$$ plain form
3479 -40 -91 8 -416 -92 -273 48 -196 -5 45 -82 51 -224 -193 -179 -15 -399 -10 12 23 99 -114 -135 71
3502 71 -332 -83 -279 -117 -303 -112 -441 -94 322 65 -116 19 -79 236 -103 77 -204 -508 63 -180 312
3523 312 -25 -405 104 -320 -2 110 -339 431 -57 34 -435 -177 91 483 370 233 392 17 -487 -59
3543 -59 446 -417 428 -175 304 -644 -269 190 -129 439 -568 279 119 -78 28 -221 109 43 22 -112 16
3564 16 -130 -126 -138 6 -271 -197 -66 10 -96 -127 -68 103 205 8 54 47 29 111 128 -18 -51 -141 53 220 141 -186
3590 -186 148 52 164 24 116 71 158 -99 211 240 -148 186 -36 -137 82 -2 107 -53 139 116 -71 -54 -47
3613 -47 -66 -108 57 110 203 157 48 -48 -104 -178 -263 -146 32 12 -44 -18 -265 -113 -76 -32 -59 -101 177 22 -119 160
3639 160 -14 16 -137 -110 60 -102 77 85 -165 -95 25 19 56 -311 30 41 69 -22 -127 -165 223 -289 88 145
$$ packed form
3479d0n1R9m24L24j81L21k44J91N0j27J33k75L1J4J64l84L89K2J1P6k13k1K06
3502G1m03K49j96J62j86J91l29L47M16k57j81J35r8L15l39J80k81l04N71k43M92
3523C12l37l80N09m24L18J12m49P70m88R1m69K58K68L92j13j37J59l75n04M28
3543e9N05q63Q45o03M79r48L75M59l19N68j007Q47j60j97J06k49L30o6k1j34J28
3564A6j46Mj2J44k77P4J31P6j06l1N9J71J02j97M6pj8Q2J7j46l3r0J94J67p9l27
3590a86L34r6J12j40R2m5Q7k57L10K9l88L34k22j01K19q4J09j60J92k3j87J7P
3613d7j9m2J65N3R3m6j09r6n6p4q5J17J78k0n6K6k47J52L7M4k7m2K78j55j41K79
3639A60j74L0j53K7J70j62J79Qk50P0J20oL7l67L41J1K8r1j05l8L88n12L77N7
$$ plain form
3663 145 123 -214 198 373 139 332 217 -161 362 185 -214 -25 -496 106 365 164 358 313 -542 396 569
3684 569 -35 -371 484 -19 -28 -230 -16 149 -29 -287 221 -277 -184 -74 -61 -75 -25 -13 56 119 -57 35 111 40
3708 40 -33 120 29 -241 -43 64 -76 96 118 -292 383 402 179 121 -283 -138 85 -305 327 38 -59 -208
3730 -208 173 205 338 880 91 21 272 -239 129 -206 -183 -187 -1 -269 -48 -209 346 -91 225 1369 -12
3751 -12 -515 -636 -318 494 -29 -196 245 216 413 -762 -359 -1068 722 -218 -177 730 797 -738 366 323
3771 323 276 -265 278 324 326 -195 825 -422 6 23 -118 411 113 -16 777 -249 -792 204 -309 -166 3
3792 3 112 220 655 -522 -662 13 -209 -243 441 -191 -271 121 100 159 85 -24 -16 2 93 19 -151 9 56 80
3816 80 118 75 169 -69 -85 99 199 -118 41 -135 -3 47 104 -52 70 120 34 -267 75 -101 25 -124 -2
$$ packed form
3663A45k2l37M12J75k34J93j15l78N23j77l99J89m71O02K59k01J94m5q55R38J73
3684E69o04l36Q55n03rk02K14J65j78k58N08m98R3J10J3j4N0J2O9O3j76R2P6p1
3708D0p3J53r1k70J98J07j40J72K2m10O75J9k23n8m04J45K23l90O32k89r7j49
3730b08L81L2J33N42p89p0K51n11L68l35K3mJ86k68K21j61N55m37L16J144j381
3751a2n03j21L18Q12n23j67M41k9J97j175M03p09J790r40M1R07O7j535J104m3
3771C23m7n41N43M6Kn21J020j247M28J7j41N29k98j29P93j026n43R96n13J43J69
3792CJ09J08M35j177j40O75k22l4O84o32q0L92k1N9p4j09QJ8R1p4j70J60M7K4
3816H0L8m3R4k38j6J84J00l17J59j76J32N0N7j56J22N0q6l01L42j76J26j49J22
$$ plain form
3839 -2 34 5 -26 157 0 -144 -174 125 67 -31 -11 196 -160 -49 104 -24 -238 -35 -50 -14 -13 -83 133 -242 -6
3864 -6 -163 148 -143 -68 77 -141 -43 151 -280 -37 -27 29 -169 245 -89 40 18 19 -178 -8 -87 39 -2 68
3888 68 126 -117 -15 -72 70 181 101 17 -16 88 196 158 227 56 50 241 -42 32 86 35 -108 58 -75 118
3912 118 -141 252 -30 116 135 -100 138 59 115 -409 -347 307 -127 -176 -539 -16 -350 32 41 75 -151 291 -99
3935 -99 18 287 -31 34 -337 527 -192 -81 -503 -439 -416 -438 4 -92 -102 -604 -104 595 0 -193 -6 507
3957 507 -4 -121 -104 93 166 73 123 3 185 -61 -31 133 -23 86 -83 20 13 -16 5 123 -95 137 201
3980 201 43 -85 98 178 219 277 -20 243 -113 -99 100 96 101 59 21 149 -46 -86 170 -22 3 -75 -322 109
4004 109 -214 130 108 -80 11 -4 281 13 -193 -74 -146 106 -182 -44 -38 -72 -32 51 -29 -52 189 -54 17 25 -176
$$ packed form
3839bL6k9l1J83j57j44l0K99n8r8K0K07l56J11J53j28k14K03j5L6Jp0K16l75K36
3864fj57L11k91P5J45k18R8J94m31K43J0N6j98M14l34J29k2Jj97J70p9J26m1P0
3888F8N8k43J02n7J42J11q0q4l3J04J08l8O9j71oJ91k83P4N4n1j43J66j33J93
3912A18k59L93k82J46J9k35K38p9N6n24O2O54m34m9l63N23l34L82RL4k26M42l90
3935i9J17K69l18O5l71Q64p19J11m22O4K3k2M42r6j0n02N00O99n95j93J87N13
3957E07n11j17J7J97P3r3N0j20J82k46L0J64j56J09j69J03pk9K1J18k18K32O4
3980B01j58j28J83Q0M1N8k97K63l56J4J99mNm2l8J28j95m0K56j92K5p8k47M31
4004A09l23L44k2j88R1j5K85k68k06J19p2K52k88J38Ol4M0Q3q0k3K41k43P1Qk01
$$ plain form
4029 -176 -246 43 -111 -287 147 10 5 -118 -235 81 -94 -47 -51 -139 33 -48 168 156 118 147 2 -462 209 231
4053 231 107 -7 -69 408 -131 -66 167 210 225 -92 295 202 21 102 49 14 19 62 100 79 41 88 67 37 -84 155
4079 155 83 -233 -76 -13 -202 -119 -127 4 -79 -207 65 -59 -167 -29 -56 -140 123 -33 170 -41 43 76 -225
4102 -225 194 129 139 50 302 -180 31 -312 171 142 92 55 374 197 -60 -216 -37 115 116 293 14 68 1
4125 1 -86 -82 107 -73 -9 171 -263 96 172 -28 152 104 147 177 67 106 5 -105 -25 -442 -33 -79 36 -69
4149 -69 -178 11 4 62 125 -111 -101 -128 5 -7 70 -96 -9 143 -286 -92 -131 -158 212 -131 110 -155 84 -19
4173 -19 30 -243 -170 176 -4 -28 -51 87 31 18 -87 131 205 29 -43 42 85 331 43 -153 134 284 213 -27
4197 -27 -5 -95 33 26 42 105 -91 72 -49 -120 -10 -253 -390 -59 -19 -31 -105 -181 155 103 18 104 -55 5 115
$$ packed form
4029a76p0K89j54j76M34j37nj23j17L16j75M7mq8J72q1K16j2l8K9j45m64O71K2
4053B31j24j14o2M77n39O5K33M3J5l17L87r3j81Q1n3l5NM3L8k1l8M7k1l0j21K39
4079A55p2l16J57O3j89Q3qJ31q3j28K72j24j08J38k7q4K63j56K03k11Q4L3l01
4102b25M19o5J0q9K52m82K11l43M83k9n0l7L19j77k57j56J79J52JJ77k79N4o7
4125Aq7MJ89j80O4J80m34L59P6k00J80m8M3L0j10L9j01j10Q0m17M09m6J15j05
4149f9j09J89pN8O3k36J0k7J33j2P7j66Q7J52m29J94l9k7L70l43K41k65K39j03
4173a9M9k73P3L46j80k4k3J38n6j3j05K18P4j76p2Q5M3K46k88j96K87J50p1k40
4197b7K2r0J28pJ6O3j96J63j21p1J10k43j37L31M0j2p4p6L36n2q5Q6j59O0J10
$$ plain form
4222 115 -87 -123 -111 -71 -90 24 9 -167 -80 95 10 318 -217 107 38 -120 91 -68 -48 -81 55 -72 -83 -41
4246 -41 60 100 -104 -115 98 106 -67 215 -49 -33 34 71 160 -122 -24 109 6 -79 54 39 -5 -86 -210 151 248
4271 248 199 449 147 96 51 -100 60 89 54 -171 -72 -17 157 51 49 23 -173 -251 184 -58 122 53 -187 62
4295 62 134 -47 187 -67 71 -31 76 -14 37 -73 -4 189 12 186 -476 -30 -21 119 -128 -80 -162 -162 -88 -54
4319 -54 -34 -49 63 40 -58 -29 -1 25 90 -30 -2 82 -10 -46 135 -53 33 51 -99 61 32 220 13 375 -24
4344 -24 235 97 -60 270 66 -321 82 -455 726 -297 241 -92 104 1056 46 323 -722 -72 -153
4363 -153 414 1 165 -263 -480 164 43 -95 106 268 -331 -97 -185 468 131 -398 -348 -132 882 241
4383 241 -122 -239 379 72 -222 -234 69 -427 -125 -8 -104 -1 -100 3 -93 50 172 -92 -59 -180 -22 -189
$$ packed form
4222A15k02l6J2M0j9J14j5j76Q7J75q5L08n35L24o9j58K11j59K0l3J36j27j1M2
4246d1J01M0k04j1K13Qj73K82k64J6O7L7Q9k82R8J33j03q5J33j5m4q1j24L61R7
4271B48m9K50l02n1m5j51J60K9l5k25R9N5J74j06kk6j96p8M35k42J80o9k40K49
4295F2P2j81K34k54J38j02J07r0N1j10O9J93j77J74o62M46RJ40k47M8q2%P4L4
4319e4K0j5J12k3r8K9K8K6O5j20K8Q4r2l6J81j88Q6J8j50J60k9J88k07L62l99
4344b4K59j38j57L30k04l87M03n37J181j023N38l33J96R52j010K77j045O50q1
4363a53N67m13J64m28k17O44j21j38K01J62n99K34q8O53l37n29N0K16J014o41
4383B41l63j17O18l07k94j2L03m96L02J17r6J03r9J03r6J43J22k64L3j21J58j67
$$ plain form
4405 -189 -10 189 -114 4 -31 49 333 31 322 22 305 109 148 -115 13 -117 -118 81 195 43 -44 -8
4427 -8 -79 -39 8 -24 17 131 292 85 18 51 -173 -6 -116 105 89 174 -149 199 107 -6 -7 -39 144 -170 25
4452 25 -155 -229 6 -162 -4 -137 208 -42 -175 88 -95 -95 -152 -71 217 -66 14 286 -97 32 -144 100
4474 100 -164 96 12 -44 33 212 -80 -252 -22 -135 -16 -82 -46 50 147 68 138 39 67 -180 -3 167 -68 -6
4498 -6 98 -390 -128 79 48 163 50 -52 157 -196 1 40 -14 152 42 5 -104 76 114 201 -44 101 -95
4521 -95 -21 -14 96 58 134 81 -1 -116 -30 -180 -267 -140 -58 -173 -26 13 107 -202 -11 -15 76 150 -260 -44 58 7
4547 7 59 -152 2 -109 76 -33 214 -27 47 10 99 25 86 78 88 298 -41 95 -85 -265 54 -136 -50 194
4571 194 180 131 -33 91 -13 -124 64 8 -87 -216 4 42 110 -148 65 71 -126 104 98 80 -11 40 142 -156
$$ packed form
4405a89J79J99l03J18l5Q0K84l02K91l00K83j96L9k63J28j30jJ99J14j52q7L6
4427hp1M0M7l2M1J14J61k07o7L3k24J67j10K21j6Q5l23L48r2j13jl2J83l14J95
4452B5j80p4K35j68J58j33L45k50j33K63j83%n7Q1K88k83Q0K72l83J29j76K44
4474A00k64K60q4n6P7J79k92j72K30j13J19o6L6R6R7p9P0r9K8k47J77J70k35O2
4498fJ04m88K62K07l1J15j13j02K09l53J97L9n4J66j10l7j09J80L8Q7k45J45j96
4521i5P4PJ10l8P6n3q2j15Q6j50q7J27Q2j15J47L9R4l09J91mR1P4m10K16J02n1
4547GN2k11J54j11J85j09K47k41P4l7Q9p4O1qJ0K10l39J36j80j80L19j90Q6K44
4571A94j4m9j64J24j04j11J88n6r5j29K20L8O8k58K13Oj97K30oj8r1N1J02k98
$$ plain form
4595 -156 145 -45 -126 -35 35 59 -206 101 -119 59 -66 -61 -35 76 -135 84 78 -101 92 -7 42 47 172 -145
4619 -145 -39 94 -45 66 17 3 -112 -132 -140 -186 139 14 15 -72 -3 130 -63 124 22 38 -43 -41 130 -254 -159
4644 -159 -117 -79 -18 -91 -198 26 -43 186 350 -136 -184 24 79 -42 -3 34 18 -74 7 125 91 46 -11 177 -133
4669 -133 87 62 250 -32 18 175 -8 25 6 181 82 24 8 -35 241 -98 -43 48 271 -87 -208 -1 -15 135
4693 135 35 112 -143 8 -268 -78 81 -86 107 92 58 -79 -244 196 -23 -46 65 46 4 -1 54 -145 11
4716 11 -152 59 155 -15 -31 239 114 -171 -106 234 -85 -69 297 -109 163 -31 -63 -179 140 -39 -55 107
4738 107 39 -28 11 -56 -78 144 31 -2 35 151 -188 -108 111 43 129 167 -26 148 222 -140 -199 10 3 184 46
4763 46 -34 -243 -74 -36 -59 -269 12 -89 -371 -29 -155 0 -77 73 69 -30 149 140 -7 -78 -126 110 47 -3 -99
$$ packed form
4595a56L01j90q1R1P0K4k65L07k20J78j25NK6J11k11K19oj79J93r9M9NJ25l17
4619a45J06J33j39J11m9j4j15k0qm6L25j25Jq7O9J33j93J87j02J6q1KJ71l84R5
4644a59M2L8O1p3j07K24o9K29J64m86m8K08N5j21L9L7j6r2Q1J18l4m5n7J88l10
4669a33K20k5J88k82N0J57j83L3j9J75r9n8j6m3K76l39N5R1K23l58j21K07j4J50
4693A35j00P7k55J51k76J90J59j67J93j5l4j37j65M40k19k3J11j9m2nN5j99J56
4716A1j63K11R6j70j6K70j25k85O5L40l19J6L66m06K72j94l2j16L19j79j6J62
4738A07o8o7L9o7k2K22j13l3L7J16l39Q0K19o8Q6L8j93J74P4l62n9K09pJ81j38
4763D6q0k09J69L8k3k10K81j01k82L42j26J55p7J50mr9J79rj47p1m8K36o3n0r6
$$ plain form
4788 -99 13 99 166 145 60 301 117 58 55 -19 184 134 115 163 -43 -40 -6 -96 -298 -163 135 -74 73 -7 29 37 310
4815 310 -18 69 -70 137 73 97 -156 -59 -4 -111 -344 -103 181 84 121 -123 184 -98 -111 7 5 154 -281
4838 -281 121 -132 -211 -89 49 122 35 208 -214 62 77 -146 -121 62 69 108 83 179 55 55 -60 227 169 -69
4862 -69 79 33 -62 133 36 -163 -205 -245 -151 7 -56 7 126 115 49 105 1 -55 37 -60 4 44 113 102 4 -54 -34
4889 -34 -121 -19 -39 -65 -91 -239 99 142 129 -167 -168 -50 51 90 -152 226 65 -105 -74 149 226 -189 125 -147
4913 -147 141 -187 -304 -262 -107 -73 -198 -187 96 64 -18 -71 -21 -1 5 -91 117 18 -265 -62 18 -51 -110 136 43
4938 43 134 -22 154 129 166 195 -253 67 237 31 149 -119 -18 -2 -174 -84 15 -6 -103 35 -62 -114 -53 -21 316
4963 316 -82 99 18 158 46 -87 -119 18 -21 -232 -69 -110 105 56 -49 -87 -63 199 -57 -32 -240 38 100
$$ packed form
4788i9J12Q6O7k1q5K41j84n9lp4K03n0j9M8k06LL4r0k02J35K98k09J47q0L6QK73
4815C10l28Q7j39K07o4K4k53R7N5j07k33K41K84r7L7k44L07k82j3J18kJ49m35
4838b81M02k53p9J22J38P3q7J73m22K76J5k23K5J83PL9k5R6j24%j15K87n8k38
4862f9J48m6r5J95r7j99m2m0R4J58o3O3J19j1o6N6j04n6R2r7O4M0O9j1r8n8K0
4889c4q7J02k0k6k6j48L38M3j3k96jJ18J01L9k42L78j61j70L1K23P7m15L14k72
4913a47K88l28j17M2J55L4j25J1K83l2q2n3N0K0Or6K08r9k83K03Q0o9n9K46r3
4938D3R1j56J76k5L7K9m48L20J70k06J18k68J01J6j72R0R9k1r7J38r7n2O1L2L37
4963C16l98J81q1J40j12j33l2J37l9k11J63m1K15m9j05l8K4K62k56K5k08K78O2
$$ plain form
4986 100 -14 57 -182 -14 -172 -25 81 -40 -32 167 26 170 -189 79 -249 43 96 117 2 -47 48 -171
5008 -171 109 238 151 393 50 -90 162 -2 -39 -32 61 159 2 -67 50 -222 40 -36 165 112 -49 171 -40
5031 -40 -191 104 -62 -4 151 -24 -86 30 76 139 6 139 44 6 23 80 -306 -203 -57 101 49 168 -66
5054 -66 88 -81 94 139 144 -95 -62 -120 124 26 68 -92 -101 251 -95 -19 -22 4 276 117 -41 -77 15 -68 -229 -122
5080 -122 -30 -96 22 -108 100 -36 -178 -19 -169 149 107 -49 -39 236 -55 87 220 -123 13 42 137 -83
5102 -83 -68 297 82 -181 -49 58 99 3 190 111 106 187 118 161 -140 -276 -146 -191 128 -96 346 61 70 -161
5126 -161 45 -104 -46 -51 -177 43 57 -67 -33 -69 -178 -84 15 -50 103 -126 210 -75 -82 -103 81 -76 -204 121
5150 121 94 -103 22 125 159 -116 -135 -14 78 74 99 -9 -2 144 89 106 -125 -85 51 255 110 -9 35 -26 165
$$ packed form
4986A00j14P1k39J68j58J47J06j21QJ99j41J44l59K68l28K92N3K1j15m9R5k19
5008a71K80J29q7K42l43j40K52j64l7PR3R8j57o9J17k72K62p6K01n3j61K20k11
5031d0j51K95j66N8J55j75o2J16M6O3j33J33r5l8J7N7l86J03J46J58n2J19k34
5054f6J54j69J75M5Nk39L3n8K44r8M2j60rL52l46P6lK6K72j59j58l6R2q3j61J07
5080a22R2o6J18j30K08j36j42J59j50L18m2j56J0K75k91J42J33l43J36K9R5k20
5102h3J5L65k15k63J32J07M1r6J87p9nQ1o9M3l01j36J30m5L19k24M42k85Rk31
5126a61K06j49N8nj26K20J4j24L4l6j09R4R9o5J53k29L36k85pk1J84j57j28L25
5150A21k7j97J25J03L4k75j9J21R2mK5j08PJ46n5J7k31M0J36K04j45j19M4o1J91
$$ plain form
5175 165 8 -100 157 37 24 126 -75 8 132 -67 -162 51 194 24 -180 -102 60 316 -129 50 -47 -146
5197 -146 -166 238 230 127 2 2 90 -108 -57 -65 -102 -257 -196 46 -145 -64 -25 -32 -46 -314 -103 131 -186 184 -76
5222 -76 93 191 -6 -204 41 5 -56 157 11 159 106 -169 110 60 16 46 -18 19 54 -88 16 33 164 -142
5246 -142 -177 117 -61 -178 48 146 -44 -55 78 -92 -9 -147 -88 229 -13 -157 47 -103 36 108 15 -29 185
5269 185 -14 -63 119 -206 35 -212 -133 63 3 244 278 -445 113 -232 25 -35 -283 232 -358 143 -403 -170
5291 -170 176 -172 39 -25 -15 -64 -154 -255 -117 -48 -443 32 2 169 255 -169 221 -72 -397 -288 147 54 160
5314 160 -150 115 -170 248 163 469 -334 -127 200 -35 115 -21 332 183 31 -38 420 50 -160 -257 345
5335 345 222 -160 213 113 -108 -74 163 95 -118 -28 -235 143 193 4 156 234 145 202 -203 -225 208 -15 -53
$$ packed form
5175A65j57j08K57j20j3J02k01Q3J24j99r5K13J43j70k04P8J62K56m45J79r7r9
5197a46k0M04qj03j25%Q8j98N1ql7j55O1K42j91Q1L9pj4k68K11K34l17L70k60
5222g6J69R8j97j98K45l6o1K13j46J48n3k75K79n0m4L0o4L7L5j42J04J7J31l06
5246a42l5K94j78j17K26R8j90j1J33j70Q3j38N9L17k42j44K04j50J39P2r3m4K14
5269A85j99m9J82l25K41k47P9J96o0K41L4p23N58l45K57o0k48N15n90N01n46K33
5291a70L46l48K11o4J0m9r0j01J38O9l95M75l0J67Q6m24L90k93l25J09M35r3J06
5314A60l10K65k85M18q5L06q03K07L27k35J50j36L53j49j52o9M58l70k10r7O02
5335C45j23l82L73j00k21L4K37o8k13R0k07L78N0j89J52P8q9N7m05k2M33k23l8
$$ plain form
5358 -53 87 -17 56 85 120 33 7 -18 -77 108 83 -37 35 -226 63 44 83 -74 -12 -177 -109 100 0 -79 -52
5383 -52 136 195 -1 44 -200 57 -2 174 56 105 -110 -170 175 128 100 108 -95 -15 -77 -70 349 -23 -37 -163 65
5408 65 -42 -240 -42 -17 7 -161 2 39 151 136 118 -52 110 -89 201 24 223 291 -69 -246 -198 546 484
5431 484 269 368 149 -226 -124 -16 38 -163 223 20 227 -23 36 11 76 226 -120 108 32 -23 -90 -70 -87
5454 -87 -49 61 -5 109 -80 -160 92 -100 -26 272 -108 -206 59 -106 20 -188 30 -161 -84 31 -54 48 136
5477 136 -6 150 -18 11 159 279 118 -44 -23 -89 155 -40 -467 -41 164 -48 165 -77 77 -146 -106
5498 -106 -36 -121 -3 -75 48 -97 -159 11 73 195 -135 -127 -129 84 -86 -161 -191 -269 115 -65 -46 35 -3 272 -48
5523 -48 21 -86 -221 -83 29 79 18 93 -6 16 -38 250 270 80 45 123 51 -20 67 43 -57 -226 -131 78 6 191
$$ packed form
5358e3J40j04P3K9L5q7k6k5n9J85k5j20P2k61K89j9L9j57O2j65O8K09j00p9K7
5383e2J88N9j96M5k44K57n9J76j18M9k15o0L45m7k8Qk03Q0o2PM19l72j4j26K28
5408F5j07j98J98K5K4j68J63L7J12j5j8j70J62j99K90j77J99O8l60j77M8P44o2
5431D84k15R9k19l75J02J08N4k01L86k03K07k50N9k5O5J50l46K28p6n5o7K0j7
5454h7L8J10o6J14j89q0K52j92P4K98l80r8K65j65J26k08K18j91P7J15q5J02Q8
5477A36j42J56j68K9J48J20j61j62K1o6K44j95m27M26K05k12K13k42J54k23M0
5498a06P0q5J18p2J23j45o2J70O2J22l30QkK13j70p5l0p8L84j80J9Q1l8K75l20
5523d8O9j07j35J38J12N0o1P5r9K2n4K88K0j90l5P8p2p1Q7k4j00j69R5K09p2J85
$$ plain form
5549 191 -147 106 -100 -206 31 -48 88 -222 157 128 271 -101 76 152 -86 -57 -281 42 19 -10 -32 91
5571 91 167 145 -76 217 73 -159 -81 -256 160 51 74 65 -70 272 -39 242 -140 -143 19 -170 52 -54 74
5594 74 197 -99 50 -58 -33 24 89 178 -72 -95 265 -283 88 -38 -63 59 -4 121 -71 -139 227 136 -245
5617 -245 9 14 -11 -151 -117 -140 -179 -102 248 68 257 -238 131 -41 -32 -240 -62 177 -75 11 -32 32 3 117
5641 117 -31 -66 -14 192 20 129 -68 -98 -74 101 -44 145 117 -60 -177 -262 -49 -73 10 -20 -173 28 -158
5664 -158 -144 34 -31 -100 81 63 -82 -131 83 -95 2 294 -67 239 -38 -16 -2 -192 -224 140 -55 -76 112
5687 112 -34 162 37 -26 63 49 316 36 139 -37 83 -97 -74 -79 149 -155 58 82 -54 90 164 -297 138
5710 138 115 -98 -31 -92 9 93 -108 1 272 26 39 136 146 -81 438 -274 57 -245 -148 191 2 -22 -41
$$ packed form
5549A91l38K53k06j06K37p9J36l10L79k9J43l72J77P6k38K9k24L23k3k9k2J23
5571I1P6k2k21K93j44k32P8j75M16j09K3rj35L42l11K81l82lJ62j89K22j06J28
5594G4J23k96J49j08K5N7O5Q9k50k3L60n48L71j26k5J22o3J25j92o8L66r1l81
5617b45K54Nk5j40L4k3l9P7L50j80J89m95L69j72Rk08J78K39k52Q6m3O4k9J14
5641A17j48l5N2K06j72J09j97l0K4J75j45J89k8j77j17q5K13k4Q3l0j53K01j86
5664a58J4J78o5o9J81j8j45m9K14j78R7K92l61L06k77K2J4j90l2L64j95k1J88
5687A12j46J96j25o3Q9j4K67k80J03j76J20j80K3nK28l04K13K4j36J44P4m61M35
5710A38k3k13O7o1J01Q4k01J09K71k46J3R7J0k27N19p12L31l02R7L39j89k4j9
$$ plain form
5733 -41 -72 246 67 136 -19 -205 -51 -111 14 -204 121 -17 109 -51 -32 163 101 3 -278 137 -11 -6 201
5756 201 -6 -78 -34 -40 -3 102 14 -102 119 142 92 252 182 -107 218 9 -213 20 -51 215 38 -27 56 80
5780 80 -171 12 39 18 146 141 -156 147 -159 52 16 149 198 80 243 -22 -155 108 -26 271 -119 46
5802 46 -68 32 89 -119 -136 57 -146 209 83 -41 61 -66 311 -51 -323 -192 330 155 61 -513 115
5823 115 -309 178 291 -225 114 498 -21 -98 -624 -580 -406 163 5 71 52 -252 221 113 320 -210 74
5844 74 -254 -230 235 97 173 4 -275 -16 -65 -54 -229 63 -8 221 155 97 198 99 219 -28 69 109 -40 74
5868 74 -183 130 101 -69 1 -163 108 5 -162 202 99 -60 -48 -3 -3 71 164 164 -4 -360 53 -12 -140 28
5892 28 106 169 120 -108 81 95 81 -142 36 -98 83 17 -218 -9 -18 -92 -124 131 -22 -130 120 -62 38 65
$$ packed form
5733d1l1L18j79O9j55j86J54o0J25k18L25j38J26j60J9J95o2r8k81M15j48NK07
5756B01k07p2M4oL7J05q8j16K21K3n0J60p0k89L25k09k22K33p1K66j77o5Q3K4
5780H0k51J83K7k1J28nk97L03l06K11l6J33M9j18J63k65j33K63j34K97l90J65
5802D6j14J00N7k08j7J93k03L55j26j24J02j27L77l62k72J31N22j75r4n74O28
5823A15m24M87J13n16L39L84n19p7n26M4J74N69j58O6j9l04M73j08K07n30K84
5844G4l28K4M65j38P6j69k79K59m9J1j75K92p1K29o6n8J01r9J20k47R7M0j49J14
5868G4k57L13k9j70P0j64K71j03j67L64j03j59J2M5%P4R3%j68l56M13o5j28J68
5892B8P8O3m9k28J89J4j4k23J78j34J81o6k35K09rp4l2K55j53j08K50j82J00K7
$$ plain form
5916 65 103 -116 262 26 182 231 90 -69 -39 165 160 143 -6 121 -103 169 -61 69 41 71 -7 -3 282 11
5940 11 97 29 53 86 175 -29 -24 34 156 202 -64 61 69 28 -289 1 -91 115 -41 39 81 233 73 13 37 -17
5966 -17 -70 -13 -170 -367 59 -70 82 -36 -207 73 -176 -8 -65 247 -189 1 89 51 -102 154 -64 -161
5988 -161 -162 -127 -51 -138 211 -123 16 119 -46 6 37 -6 100 54 45 -102 62 -62 264 112 -20 5 -186 -10
6012 -10 -38 -34 47 82 68 287 87 -24 107 79 -163 197 -18 -59 -1 -43 40 -2 132 -25 -58 42 -76 145 78
6037 78 12 175 0 220 106 153 220 -63 78 -39 -92 19 -280 -36 33 -11 -41 61 -9 -96 -48 -2 -37 -7 -122
6062 -122 245 6 -67 -54 182 -240 -103 -94 -59 59 88 145 -10 -71 91 49 -58 66 -47 -132 14 -204 145
6085 145 176 -174 -37 -136 -30 -194 -84 -19 126 102 -221 26 15 160 31 -120 142 -90 271 136 257 129
$$ packed form
5916F5L8k19L78k36J56M9j41j59L0K04nj7j49J27k24K72k30J30k8L0p8MK85k71
5940A1Q6o8K4L3Q9k04NN8J22M6k66J25Qm1l17K90r2K06j56Q0M2J52j60o0K4n4
5966a7n3N7j57j97M26j29J52j18j71K80k49J68n7L12m36J90Q8l8j53K56k18r7
5988a61jL5P6q7L49l34J39J03j65N2L1m3J06m6rj47J64j24L26j52j32K5j91J76
6012a0k8MQ1L5j4K19k00j11J31k8k42L60k15m1N8m2Q3m2J34j57l3J00j18K21o7
6037G8o6J63j75K20j14M7O7k83J41j17n3J11k99K44O9m4l0J02p0q7M8M6l5L0j15
6062a22L67k39p3J3K36m22J37RL5J18K9N7j55o1J62m2j07J24j13q5J46k18L49
6085A45L1l50J37r9J06j64J10O5J45k4l23K47j1J45j29j51K62k32L61j35J21j28
$$ plain form
6107 129 102 -68 48 45 75 21 -40 53 98 -79 32 238 -17 -248 108 -30 116 50 -239 -137 -28 179 -3
6130 -3 -96 -86 -108 132 55 -87 36 -205 -23 161 182 -10 -68 -80 -157 -26 -48 -19 -190 -283 185 -175 33 54 -62
6155 -62 28 -47 -83 61 111 4 300 63 -165 290 222 -3 -82 226 223 31 -265 -53 163 13 83 77 65 131 -163
6180 -163 -59 -11 -17 -16 48 39 8 -115 151 4 -98 2 119 348 142 74 -30 105 11 -21 300 -107 117 -62
6204 -62 -491 225 446 -260 138 -30 -61 85 -25 45 33 11 -97 243 -20 -129 111 13 -261 66 -27 7 -2
6227 -2 -126 98 -183 -39 258 -81 -44 -46 145 -50 8 -150 -58 220 10 -32 -172 -91 94 241 -11 -7 -133 124
6251 124 -50 8 52 -20 73 3 228 -136 75 -20 -42 -6 91 72 -85 147 11 147 -184 147 -109 156 64 123
6275 123 5 55 -66 43 -34 -207 281 11 95 -197 65 187 -98 24 61 -143 141 165 -10 -18 -459 277
$$ packed form
6107A29k7j70J16lL0n4o1R3M5j77J11K06k55k31L56j38J46o6k89J02J09K07j82
6130cr3J0k2K40p7j42J23k41J82J84K1j92n8j2p7J31k2K9j71r3M68l60K08K1j16
6155f2R0p5l6J44N0j07K96k37k28M55o8k25p9L08lj92k96K12K16j50P0oj2O6k94
6180a63J04M8oJO4rl1j23K66j47j02J00J17K29k06o8j04J35r4l2L21m07K24j79
6204f2m29P16K21p06L98j68l1J46j10P0j2k2j08L40k63j09K40r8k74L27r3L4r
6227bj24K24k81J44K97l39L7kJ91j95N8j58R2K78k10m2j40Q1J85J47k52Mj26K57
6251A24j74N8M4p2R3p0K25l64K11r5k2L6R7j9j57K32j36J36l31L31k56K65r2N9
6275A23j18N0j21J09p7j73M88k70Q4k92K62J22k85J22L7k04K84K4j75qm41P36
$$ plain form
6297 277 -190 86 -31 -165 101 -268 -325 -394 34 8 196 56 61 218 95 -87 -127 -87 -160 -122 -90 -71 25 3
6321 3 172 -129 -251 -115 107 -156 36 -107 25 -67 245 -82 7 284 25 -156 -20 -80 -127 142 -120 -21
6343 -21 128 -6 -170 -33 -158 64 -107 233 185 75 56 46 -74 -167 281 -45 -125 -77 30 364 -52 -181
6365 -181 418 91 70 277 45 747 349 -65 25 101 -178 -163 314 -52 -157 -31 132 80 51 13 65 -118 -9
6388 -9 -8 -34 -71 -119 85 -209 91 -31 50 140 63 40 -302 -210 -20 58 63 130 94 -71 138 -137 10 -180 -96 23
6414 23 10 135 60 -3 -135 408 163 64 185 -39 16 93 75 29 -53 -164 78 -125 192 -20 -16 -8 196 102 -46
6439 -46 -84 48 26 -178 64 -115 109 70 64 -37 19 -146 148 -65 -31 4 197 124 -37 -73 -51 156 -96 -65
6463 -65 204 -5 25 188 239 94 -25 -4 77 279 79 15 2 -32 163 -179 133 47 -120 225 -291 32 -82
$$ packed form
6297B77m67K76j17j34K66l69n7o9M28k6J88j40NJ57j23j82m0M0p3L8L2J9R6k2
6321CJ69l01j22J36K22k63J92j43J32r2L12l27Q9K77k59j81J36o0m7K69k62R9
6343b1J49j34j64J37j25K22j71L40m8j10j9j0j20r3M48l26q0M8J07L34m16j29
6365a81N99l27k1K07k32P02l98m14R0P6k79J5M77l66j05J26J63n2k9l8N2j83J09
6388iJk6l7m8K04k94L00j22Q1R0p7k3l42R2J90P8NO7l6j65K09k75J47j90Q4J19
6414B3j3J25p5o3j32N43k45r9J21k24N5P7j8m6q2j11K42k03L17k12MQK04r4j48
6439d6l8J32k2k04K42j79K24l9oj01N6j65K94k13L4L5J93p3j61l6K2K07k52L1
6463f5K69k09L0J63N1j45j19K1Q1K02k00o4j3l4J95l42L12q6j67L45n16L23j14
$$ plain form
6486 -82 -7 -155 -129 117 -298 -39 -205 219 209 -32 38 -67 -390 50 108 -136 -76 127 -174 134 306 20
6508 20 17 133 29 21 16 82 28 -74 76 -97 -173 38 150 81 45 200 128 -219 -176 -95 -73 123 179 -50 142 359
6534 359 -185 208 -28 -117 126 46 -114 -61 -43 -98 160 -88 221 -303 235 62 -110 196 -122 -81 213 198
6556 198 -115 25 49 203 -35 149 -87 129 174 -89 -177 24 45 34 -92 40 -47 161 -131 -162 -68 20 -113
6579 -113 -5 209 182 -72 491 119 -257 -353 164 -233 197 -4 144 269 -173 -485 379 317 183 530 392
6600 392 -59 421 -68 71 -308 508 73 -370 964 189 177 -208 -137 10 -724 199 -104 43 -73 298
6620 298 128 -14 12 27 -83 21 -76 115 35 58 -122 61 -250 65 179 -118 -127 18 72 -333 23 -215 -154
6643 -154 0 138 74 29 -44 -86 -52 -178 -189 152 -68 -196 -56 115 -26 -152 -8 69 83 -109 8 -82 125
$$ packed form
6486h2P5j48K6K46m15K59j66M24j0k41P0j05l23M40N8k44O0K03l01L08J72k86
6508B0lJ16j04qnO6n4j02J50j73p6K11J12o9l6J55p2l47M3Q1K2J96N6k29J92K17
6534C59n44L93k36q9K43q0j60N3J8n5K58k48L09n24N38j73j72L06l18M1K94j5
6556A98l13J40K4J54k38J84k36K16M5k63q8K01K1j1j26J32q7K08k92l1R4Q8j33
6579a13J08K14k7k54N63l72l76r6N17l97M30k01J48J25m42l12Q64o2j34L47j38
6600C92m51M80m89J39l79Q16m35m43J334p75j2l85P1J47p34R23l03J47j16L71
6620B98j70j42K6J5j10J04r7J91q0K3j80J83l11L15J14k97rJ45N4m05L56k38O1
6643a54J54J38o4m5p3m2L4j26j1L41k20j28J40J71j41j26J44P7J4j92J17r0K07
$$ plain form
6666 125 -14 -209 51 -37 23 64 -9 119 252 -37 -90 92 -109 -60 121 82 -203 70 -122 110 -26 98
6688 98 -105 80 -23 86 117 -20 -13 -83 -31 107 35 91 -71 458 -36 132 99 61 168 131 12 7 153 -77
6712 -77 0 128 176 -158 105 -74 13 116 -103 -17 39 74 141 32 -13 147 6 15 -163 -102 -36 8 -147 -43 115
6737 115 12 81 -169 183 -5 198 56 -256 -240 -214 -14 -97 221 226 33 69 -3 153 -49 -215 -212 -92 -26 -407
6761 -407 118 170 45 17 81 161 45 190 -62 -74 -83 -61 67 62 43 206 7 29 -172 -108 55 -120 64 95 90
6786 90 106 -173 44 -88 154 196 -10 394 45 98 118 -161 7 37 17 142 -147 195 54 50 162 202 12
6809 12 76 -67 -206 -22 -30 -45 -251 45 -24 20 123 -139 70 12 -20 -146 -129 -74 -122 -24 -83 27 17 -216 144
6834 144 2 -80 -55 -33 -210 152 -30 85 -172 2 -22 108 11 65 -273 -94 80 -8 13 -1 247 -107 133
$$ packed form
6666A25j39j95K60q8O0M1p3J28J33k89n3J82k01M9J81l9k85K73j92K32j36J24
6688I8k03J85j03J09L1j37Pp0N2J38p2N6j62N29m94J68l3l8J07l7j19nJ46k30
6712g7P7J28M8l34K63j79Q7J03k19Q6N6L5O7j09m5J60j41Rj78O1O6M4j55J04J58
6737A15j03O9k50L52j88K03j42l12J6K6K00q3L18Nj93L6p2J56k02j66LJ20O6l81
6761d07N25N2j25k8O4Q0j16J45k52j2rK2J28nj9J63j99K2k01O4J63j75J84L1n
6786I0J6k79K17j32K42M2k06M04l49N3K0k79J68L0k0J25k89L42j41mJ12M0j90
6809A2O4j43j39J84qj5k06K96o9M4J03k62K09n8l2j26J7N5m8R8n9J10j0k33L60
6834A44j42q2K5K2j77L62j82J15k57J74k4J30r7N4l38J79J74q8K1j4K48l54K40
$$ plain form
6857 133 72 -13 -152 36 -76 -1 110 93 -117 76 -296 -182 17 59 83 185 68 -125 79 43 103 132 121
6880 121 -30 -20 -54 -22 186 124 -12 195 -45 -129 195 112 -19 -19 -18 88 63 59 -155 -225 5 -90 38 44 -30 1
6906 1 81 -97 -122 -88 -170 -74 53 165 80 30 -52 -60 47 -219 224 8 -142 216 -87 294 17 -24 196 -18
6930 -18 110 -5 16 134 -112 72 200 12 0 125 -104 143 -85 45 201 76 198 149 -99 -68 -29 150
6952 150 -127 82 1 -123 169 16 33 -171 -125 -62 70 97 -165 -96 -36 -139 -145 63 109 -148 50 -45 3 80
6976 80 -195 46 -29 247 -30 63 -41 125 -18 3 91 9 -58 -89 3 11 -150 -115 -338 -99 -31 53 66 -7 -10 -222
7002 -222 112 -282 108 42 50 343 118 -215 50 123 232 67 5 2 81 130 -79 131 -165 -20 87 -117 87
7025 87 226 -157 -28 -207 214 -171 -45 -76 -161 -6 -116 -2 -97 -147 -168 132 218 -235 -174 31 5 -65 -157 83
$$ packed form
6857A33o1q5j39J88j12P5J11j7k10J93l72J14J99M2K4J02j17j93K04l6O0K9j1
6880A21j51J0l4L2K08o2j36K07k40q4L24q3j31%JJ06k5mk14p0K30r5J28Op4L1
6906AQ0j78k5L4q2R6J27J12q5n0q2qJ07k66M43k16j50L58l03L81k77m1K20k14
6930a8J28j15K1J18k46J84J28j88j2J25k29K47k28J30J56j25J22m9k48L1L9J79
6952A50k77K09q1j24K92j53J7k04M6O3J32K7k62O9O0j03oK08M6k57J98r5M8P7
6976H0k75K41p5K76k77R3j04J66j43K1Q8q2o7l1R2Qj61L5k23K39O8Q4J3p3lk12
7002b22L34l94L90o6QK93k25l33K65P3J09j65o2lP9M9k09K10k96J45J07k04K04
7025H7J39l83J29j79M21l85J26l1q5J55j10J14r5n0k1L00Q6m53O1K05k6p0r2K40
$$ plain form
7049 83 -55 -133 179 -134 -125 -149 -127 -33 -331 35 91 -172 -76 35 -54 -68 46 -94 -38 23 -110 106 26 -201 -143
7074 -143 62 6 -142 -24 68 3 -234 50 86 -2 24 342 16 169 204 25 74 142 177 8 226 -15 136
7097 136 116 45 175 49 -91 22 119 -8 -182 -13 170 204 214 193 103 -3 -3 154 201 -65 164 3 337
7120 337 -89 -140 -85 22 6 -90 82 10 -6 -118 49 83 -140 71 47 -117 -136 22 -122 38 152 -87 118
7143 118 -301 128 187 -85 277 -133 -43 48 11 158 -12 8 36 -176 52 25 62 63 116 123 -96 245 14 121
7167 121 -28 -42 48 -200 -88 -21 177 -38 87 93 23 -71 5 107 -96 272 -156 -39 -63 96 -118 -53 124
7190 124 54 -33 70 -190 108 14 -57 -204 -26 29 24 -24 130 58 -45 17 21 -147 -40 2 -50 -297 87 52 221
7215 221 -83 26 -70 -207 -31 25 67 -57 -234 -69 139 44 -158 -155 -132 26 -51 119 -144 109 -13 -96 -90 -49
$$ packed form
7049H3j38p8L12l13Rk4K2R4k98L66N6k63R6J11q9j4J14j40N6O1j33K16q0k27N8
7074a43K05n6j48J18R2o5k37K84L6q8K6L18l26J53L5j79M9O8L5j69K18k41J51
7097A36k0p1J30j26j40J13R7j27j74J69J83L4J0k1r0j06%J57M7k66K29j61L34
7120C37m26n1N5J07j6r6J72p2j6j12J67L4k23K11k4j64j9J58j44J60J14k39K05
7143A18m19M29N9k72L62m10R0R1l7J47j70K0K8k12K28k7L7JN3Pk19L41k31J07
7167A21j49j4R0k48J12O7J98k15J25Op0r4P6J02k03L68m28J17k4J59k14O5J77
7190A24p0q7J03k60K98r4p1j47J78N5nm8J54p2j03O2Mj68J07M2n2k47L84l5J69
7215B21l04J09r6j37J76N6M2j24j77J65K08r5k02LK3J58p7J70k63K53j22q3OM1
$$ plain form
7239 -49 -15 -50 102 165 245 -32 -58 57 -68 2 121 -91 -61 -40 -135 15 92 -258 80 62 52 86 122 -16 88
7264 88 -155 -79 152 294 -174 -4 116 -203 -34 -88 -67 97 -104 -89 182 -8 143 -56 -44 -176 -15 90
7286 90 -13 104 90 120 145 -55 113 145 -181 -26 86 -110 -304 -64 77 -101 88 -88 -54 -51 -9 31 67 -104
7310 -104 -26 -230 -339 106 66 3 -48 55 -28 112 92 -2 -116 -312 106 146 100 91 154 -85 -132 -4 -105 61
7334 61 311 109 -47 -2 -106 -71 -96 50 198 47 202 130 86 326 128 -103 69 60 -114 63 -93 -6 -66
7357 -66 73 -84 56 -109 -167 -31 -119 -33 8 146 -86 -234 -108 153 132 42 21 75 -180 -128 -145 -172 -5 38
7381 38 -145 306 -204 -65 -57 -126 -130 22 -7 84 -82 56 -116 23 66 81 -81 -74 225 70 19 48 97 207 -111
7406 -111 53 21 -9 -52 -13 62 25 -230 35 136 -81 61 -134 95 37 -5 6 74 -53 218 77 -14 97 -169
$$ packed form
7239d9L4l5J52O3Q0k77k6J15j25P0J19k12L0K1r5J50P7l50L38j8j0L4L6j38J04
7264H8k43P6K31J42m68J70J20l19J69n4K1J64k01J5K71j90J51j99J2j32J61J05
7286I0j03J17j4L0K5k00J68L2l26J55J12j96j94K40J41j78J89j76L4LM2M0L6j71
7310a04P8k04j09M45m0o3n1J03q3J40k0r4j14j96M18M0m6rO3k39m7J28j01J66
7334F1K50k02j56M5j04L5k5J46J48j51J55p2m4K40j98k31J72rj74J77j56Q7o0
7357f6J39j57J40j65n8J36q8Q6M1J38k32j48J26K61k1r0k1N4k55N2j7k7J67M3
7381C8j83M51n10J39Qo9mJ52k9R1j66J38j72J39M3J5j62PK99j55n1K9M9J10l18
7406a11J64l2l0m3L9P5l7k55K65J01k17J42j95K29n8m2J1O8j27K71j41r1J11k66
$$ plain form
7430 -169 -118 -58 -99 141 210 -62 -10 -68 47 -176 51 203 -192 -1 -40 -38 -124 99 114 155 63 224 -17 -44 162
7455 162 18 40 64 -89 134 -8 -1 -144 -85 -128 56 299 -49 -113 -12 -76 89 -79 137 14 95 37 0 -32
7479 -32 143 2 97 208 58 253 108 43 17 -70 -95 42 80 15 -70 -82 -200 7 180 134 -106 369 -99 -70
7503 -70 -21 -62 -27 -137 -69 -195 272 -196 69 -153 -82 21 -142 -132 -177 -52 -48 -39 -21 -285 13 141 -245 -118
7527 -118 -91 -25 323 -154 -123 35 76 82 -148 -123 198 -36 -192 -532 -197 17 341 148 -85 -195 -377 -25
7549 -25 35 -134 -276 444 -248 1 113 -20 363 307 -375 -1210 -969 365 -1095 -164 248 -510 383 -189
7569 -189 266 -65 -89 -153 -7 43 -186 -200 -16 118 -52 -177 -31 -137 39 22 -275 14 -114 21 4 -100
7591 -100 80 295 -225 160 -122 159 33 201 164 15 171 -22 -207 53 -55 146 84 50 72 -146 -130 -25
$$ packed form
7430a69N1O0m1K40O9k72N2n8J15k23K27J52l95J91l9Kq6K23J5M1r2J61k41k7K06
7455A62j44K2K4j53K23j42Pj43N9m3J84K43l48o4J01o4J65j68K16j23Q1n8l7l2
7479c2J75j41R5J11j50J95j45o5k6q7k5J37L8o5q5j2j18K07J73m6k40M75m68K9
7503g0M9m1L5j10O8j26M67m68K65k22P1J03j63J0m5J25MRJ8k64K98J28l86J27
7527a18K7O6L48m77L1J58M1Ok30K5L21k34j56l40L35K14L24j93k33j10j82L52
7549b5O0j69j42P20o92K49J12j33L83n6o82q35K41J334j460R31M12p58Q93n72
7569a89M55l31k4o4J46N0k29j4J84J34j70j25J46j06J76j7k97K89j28J35j7j04
7591a00J80K15n20L85k82K81j26J68l7j49J56j93j85K60j08K01o2l4K2k18J6J05
$$ plain form
7613 -25 201 -22 147 -4 143 -68 -10 -131 -210 -27 61 -152 -49 -50 54 77 124 212 45 53 -23 212 115 -193
7637 -193 -164 198 90 -11 102 -88 115 169 255 107 130 -19 -55 -106 30 188 -38 109 153 45 -4 104 -68
7660 -68 6 -24 -12 -14 90 105 -69 -61 -13 52 -88 137 -95 -116 -31 -144 60 88 12 -34 -102 -206 31 48 135 191 46
7687 46 -156 -44 -49 -41 -57 38 -215 130 55 309 -118 -17 198 -217 -60 101 86 101 -128 30 -37 -75 -17 11 5
7712 5 -38 19 83 195 -188 -190 0 -89 -83 73 124 -155 -35 14 61 -128 50 -107 73 -93 -31 -29 -6 -33 -29 -72 -109
7739 -109 108 77 -191 113 -41 119 -116 112 69 107 -16 129 194 6 -122 -187 163 -108 98 -6 -63 -9
7761 -9 -9 93 17 -22 136 -119 -87 124 15 69 112 275 -37 -86 -35 -99 120 84 -86 266 157 -26 -129 71
7785 71 75 15 67 -137 16 139 125 -79 147 -66 100 -97 -119 83 143 43 118 38 -73 57 -136 97 14 -88
$$ packed form
7613b5K26k23J69j51J47k11N8j21p9J83Q8k13J03jJ04K3M7Q8j67Qp6K35r7l08
7637a93K9L62j08j01J13j90K03N4Q6j48K3j49l6n1J36J58k26J47M4j08m9J08j72
7660f8P4l0J2kJ04J5j74QM8O5j40K25k32k1Q5j13K04K8p6m6o8j04K37J7Q7N6j45
7687D6k02J12nQj6R5k53L45p5K54m27J01K15m15J57J61j5J5k29J58o7l8N8K8o
7712Em3N7O4J12l83kJ90q9OJ56N1k79J20M9M7j89J78j57J80j66O2KK3k7Mm3l7
7739a09K17l1k68L04j54J60k35K28m3L8j23J45O5j88j28o5L50k71K06j04n7N4
7761i%J02p6l9J58k55L2K11j09N4M3J63l12m9N1o4K19l6j70L52j09j83j03K00
7785G1Mo0N2k04J53J23j4k04K26k13J66j97k2K02O0j00P5q0j11J30j93K33q3j02
$$ plain form
7809 -88 17 -104 -32 -40 -232 64 134 36 -148 -31 93 111 -224 -126 -177 -15 198 89 35 -76 272 165 12
7832 12 -62 -12 -154 3 69 -130 -171 19 -12 -50 115 -62 103 167 27 -21 -109 139 160 33 66 103 162 20 170
7857 170 198 65 -56 171 -59 71 16 144 -20 -131 112 -132 25 -227 160 163 342 40 -246 207 137 -41
7879 -41 -158 -59 -92 -82 -60 -21 134 54 -170 -60 135 97 -57 90 -11 -171 -126 29 71 17 -56 13 163 45
7903 45 104 252 -7 141 21 2 95 88 55 83 -63 43 278 288 9 135 -164 -21 17 74 87 -27 -150 -134
7927 -134 -60 145 -134 -29 -87 30 38 -185 219 82 79 -103 58 -176 -122 25 -148 108 13 -52 14 -101 -118 128
7951 128 9 -54 91 45 -63 -123 -14 56 53 153 96 -180 -4 -45 46 75 244 59 -138 -96 56 176 33 -16
7975 -16 329 -23 -259 -85 120 227 88 -327 -24 179 117 61 28 41 70 -127 -82 125 229 197 71 144 55
$$ packed form
7809h8J05j21P2qj92K96P0r8j84J17J24J8l35R8n1J62K13j09n4j11L48j07j53
7832A2p4N0j42J57O6j99m1J90l1l8J65j77J65O4j40m8q8K48K1j27L3L7N9j42J50
7857A70K8j33j21K27k30J30n5J28j64j11K43k44J57k52L87LJ79l02k86M53p0j78
7879d1j17R9l3J0K2L9J55q0k24J10J95l8j54J47j01j60M5J55M2n4p3O9J50j18
7903D5N9J48k59J48j20j9R3pl3K8j46J06K35J0k79J26k99J43L8N7J3j14j23J6
7927a34P4K05k79J05n8J17Qk23M04j37lj82J61k34N4J47j73K56r5o5O6j15j7K46
7951A28j19o3J45m6j08o0J09P0lJ00n7k76J76m1R1K9J69j85j97M2J52J20j43m9
7975a6L45l52k36J74K05J07j39m15L03K03o2n6l3J3K9j97M5K07J04l2j26P3q9
$$ plain form
7998 55 -174 -76 139 -115 23 84 -65 -73 132 -181 126 -28 49 -73 7 -14 -97 -224 -20 -25 54 -12 37 24 -89
8023 -89 104 128 104 6 -20 40 -98 -8 77 160 36 36 -1 72 -203 -4 -154 112 133 231 -225 93 -76 8 -58 -7
8049 -7 39 -224 244 167 121 93 242 -234 -99 -73 68 106 81 42 74 118 45 23 326 19 171 -72 33 319 -8
8074 -8 -266 60 -84 -152 76 44 146 22 20 63 182 -162 -118 17 -19 320 -76 -104 -145 108 -26 -292 16 318
8098 318 -38 154 -21 129 -162 123 103 -96 -22 -3 -24 -107 -11 -74 -184 -55 -49 -228 263 -197 114 36 -164
8121 -164 73 -4 -484 146 74 -224 -121 -67 -195 1 3 8 -152 -16 -19 14 -188 -84 -127 139 172 -200 -139 18
8145 18 -134 129 -127 -212 -98 65 30 -238 -158 96 -37 -32 344 14 -92 -65 134 127 -14 62 -52 173 111 -76
8169 -76 160 -94 80 -61 -103 213 15 93 -141 -64 -68 129 47 61 84 63 -55 -189 80 -80 25 21
$$ packed form
7998E5k29R8K15k54J38O1j49qK05l13L07j54P7j22Q0k1q3j27K04nP9o6M9j3j13
8023h9J93K4k4r8k6O0j38R0Q5Q3j24%l7P3k75J99j50K66K1R8m56L18j69Q4o6N1
8049gM6k63M68p7m6k8J49m76J35K6J41L8k5l9L2M4p3k2L03l07J52k43J05K86l27
8074hk58L26j44o8K28l2J02j24kM3J19l44M4J35l6L39l96k8m1K53j34k66L08L02
8098C18l56J92j75J50k91K85k0j99P4J9k1q3R6o3j10J29Oj79M91m60L11p8k00
8121a64K37p7m80O30p2k98J03N4j28J96KNj60J36lL3k02J04m3K66L3l72O1J57
8145A8j52K63k56q5J14J63l5k68Q0K54j33NL76l30j06K7J99pj41P6j14K25o2j87
8169g6K36k54J74j41m2L16j98P8k34P7mJ97q2J4K3k1j18j34K69j60J05m
8191B1
$$ Imaginary data points
##PAGE= N=2
##DATA TABLE= (X++(I..I)), XYDATA
$$ plain form
0 0 0 0 0 0 0 0 0 0 0 0 0 0 0 0 0 0 0 0 -2 8 -8 8 -8 8 -9 15 -16 16 -21 24 -27 31 -35 39 -45 52 -57 64 -71 80
40 80 -90 99 -110 122 -135 151 -167 183 -201 221 -244 268 -296 327 -360 397 -441 489 -546 613
60 613 -692 786 -902 1052 -1250 1529 -1946 2659 -4240 19490 -17151 1339 23720 -19350
74 -19350 11077 11455 -6923 4713 5310 -2456 -1386 2152 3940 -4054 4087 -1211 -7905 1275 -1131
89 -1131 -3734 -13 -1251 -3268 -7682 486 -3782 -10822 4888 -3070 -13172 2882 -4437 -12347 2856
104 2856 -481 -11647 -1005 356 -13318 -1761 2280 -11758 1864 1384 -12287 1885 -2139
117 -2139 -7897 4177 -2883 -4011 1547 -4613 -187 -314 -2260 3830 -1892 -1089 2873 -3422 -76
132 -76 4087 -1195 591 3213 -1010 -125 3309 336 274 3823 583 -553 2880 -394 -66 4286 -219
$$ packed form
0@%%%%%%%%%%%%%%%%%%kJ0j6J6j6J6j7K4l1L2l7M5n1N8o6P4q4R7j09J21j35J51
40H0j70J89k09K32k57K86l18L50l84M22m65N12n64O23o87P57q38R30j035J159
60F13j305J478j688J954k302K779l475M605o899K3730l6641J8490K2381m3070
74a9350L0427L78j8378J1636N97p766J070L538J788p994Q141n298o694R180k406
89a131k603L721j238k017m414Q168m268p040J5710p958j0102J6054p319p910J5203
104B856l337j1166J0642J361j3674J1557M041j4038J3622m80j3671J4172m024
117b139n758J2074p060j128N558o160M426j27j946O090n722Q03L962o295L346
132g6M163n282J786K622m223Q85L434k973o2L549l240j136L433l274L28M352m505
$$ plain form
149 -219 314 3528 -1981 153 3430 -2177 1772 2851 -3333 1722 988 -3009 2756 612 -2197 2014
165 2014 -1780 -1881 1646 -1901 336 754 -2324 880 -1226 -2379 1843 -1418 -1566 2488 -2347 -1949
181 -1949 2691 -1896 -901 3400 -1650 -1113 2773 -1444 -807 3478 81 -249 3480 -363 -512 3362
197 3362 1181 210 3558 842 -253 2830 915 2176 3131 1150 2741 1653 417 3620 609 1110
213 1110 4992 -761 997 4546 -2263 1673 4418 -1985 1629 2934 -2880 1289 1723 -1802 1275
228 1275 747 -2073 -250 -97 -2395 -598 2 -2128 -1552 -1295 -2888 -1642 -1332 -2584 -1008 -2428 -3260
245 -3260 -1279 -2988 -2653 -451 -3483 -2527 -448 -4475 -2313 -18 -3832 -1228 -359 -3846 -619 -751
261 -751 -3116 410 -473 -1974 524 -1185 -1403 812 -866 317 806 -489 464 527 -23 1251 1346 676
$$ packed form
149b19N33L214n509K134L277n607L949J079o184N055p34l997N765k144k809M211
165B014l794j01L527l547K237M18l078L204k106j153M222l261j48M054m835L98
181a949M640m587R95M301n050N37L886m217O37M285l397l30L729l843j49L874
197C362k181r71L348k716j095L083j915J261R55j981J591j088j236L203l011N01
213A110L882n753J758L549o809L936K745o403L614J305n814M169M34l525L077
228A275n28k820J823J53k298J797O00k130N76K57j593J246L10j252J576j420q32
245c260J981j709L35K202l032R56K079m027K162K295l814K604Q69l487L227j32
261g51k365L526q83j501K498j709k18K215j678J183M89j295R53O3n50J274R5o70
$$ plain form
279 676 1386 1223 468 1110 2046 1078 1403 2490 786 1351 2583 772 1710 2578 562 1379 2079 -5
297 -5 1602 1748 651 1253 800 383 807 275 743 605 -167 768 -93 -893 945 -748 -478 1019 -1433
316 -1433 -1023 -16 -1592 -950 -141 -1188 -855 -907 -1324 -969 -815 -453 -1031 -1100 -355 -1762 -913 -208 -1327
335 -1327 -472 306 -1114 -363 -38 -910 211 578 11 -109 254 512 -70 1048 1280 -160 1241 1237 -580
354 -580 1806 1460 -501 2029 1215 -274 1823 1271 471 1666 1144 673 1178 852 669 481 933 895 363
373 363 767 747 -464 991 177 -681 519 -163 -941 118 -215 -935 -73 -282 -1453 -1471 -589 -1190 -1285 -402
393 -402 -1359 -1837 -204 -1607 -2049 -337 -1624 -1868 -239 -1559 -2044 -258 -1227 -1468 -195 -1390 -1129
410 -1129 -340 -794 -699 -603 -97 -278 -612 441 -521 -116 1125 -124 101 1046 -180 502 1193 378 907
$$ packed form
279F76P10j63p55O42R36r68L25J087j704N65J232j811R38Q68k016Q17P00k084
297eJ607J46j097O02m53m17M24n32M68j38p72R35q61q00J838j693K70J497k452
316a433M10J007j576O42Q09j047L33n2m17L55J54L62n78o9P45j407Q49P05j119
335a327Q55P78j420P51L25q72J121L67n67j20L63K58n82J118K32j440J401mj817
354e80K386l46j961K530q14j489K097n52q00J195n22m71N05l26j83j88M52l8n32
373C63M04k0j211J455q14q58J200o82p78J059l33p20Q62k09j171j8Q82o01r5Q83
393d02r57m78J633j403m42J712j287k44J629j320m85J786r69k41J273j195K61
410a129P89m54R5R6N06j81l34J053r62M05J241j249K25R45j226O82O91q15N29
$$ plain form
429 907 733 1131 1154 776 1893 819 639 2032 326 641 1888 207 1187 1842 312 954 1310 415
447 415 905 1009 651 238 738 108 193 754 -66 -66 86 -70 -728 -45 -29 -516 -542 -130 -1036 -641 -368 -1208
469 -1208 -784 -771 -927 -505 -842 -699 -303 -1402 -304 -827 -925 2 -1376 -288 -194 -1354 279 -457 -1084
488 -1084 325 -463 -506 412 -108 18 27 668 560 16 853 361 111 1195 375 523 1561 592 832 1323
508 1323 331 1201 1208 651 946 967 1199 744 964 1085 643 822 824 675 514 431 352 317 549 259 -275 521 -254
531 -254 -320 81 -670 -633 -226 -961 -681 -709 -830 -747 -1612 -487 -1173 -1294 -394 -1380 -1340 -556 -1640 -912 -1002 -1439
553 -1439 -838 -809 -1182 -893 -1068 -748 -763 -1085 -265 -602 -255 -100 -669 -220 281 -525 -201 526 -46 232 481
574 481 557 465 484 476 718 666 705 801 354 990 977 569 1221 972 730 1377 708 862 1126 490 971 798 851 865
$$ packed form
429I07j74L98K3l78J117j074j80J393j706L15J247j681R80O55j530O42L56q95
447D15M90J04l58m13N00o30Q5N61q20%J52j56o58O83J6m87k6M12r06L95K73q40
469a208M24J3j56M22l37J43L96j099J098n23r8R27j378J088R4j160J633p36o27
488a084J409p88m3R18n20J26RO41j08n44Q37m92k50J084q20J48J038r69K40M91
508A323r92Q70Pn57K95K1K32m55K20J21m42J79Kj49j61q3p9l5K32k90n34P96p75
531b54o6M01p51L7M07p35K80k8j21Q3q65J125o86j21R00r86M0P84j084P28r0m37
553a439O01K9l73K89j75L20j5l22Q20l37L47J55n69M49N01q06L24P27n72K78K49
574D81P6r2J9qK42n2L9R6m47O36j3m08O52k49k42O47o69J54K64o36M81j73N3J4
$$ plain form
598 865 619 618 718 -17 541 310 226 837 -262 71 381 -315 76 -127 -217 -115 -507 -187 -288 -494 -427 -533
620 -533 -710 -294 -515 -694 -589 -602 -714 -743 -550 -354 -571 -643 -764 -536 -666 -377 -27 -440 0 -387 -204
641 -204 281 -299 -27 377 -98 134 175 295 570 246 357 408 160 991 341 589 987 352 657 704 447
662 447 779 478 484 732 272 475 538 121 587 241 197 632 -166 191 61 -73 53 -179 -303 67 -210 -268
684 -268 -356 -60 -396 -446 -642 -607 -606 -731 -651 -820 -766 -458 -855 -638 -545 -931 -869 -887 -1053 -668 -843 -823 -806 -569
708 -569 -416 -600 -472 -192 -273 -385 117 -215 -85 185 24 52 330 108 313 441 233 774 687 472 733
729 733 763 740 574 601 914 650 746 840 622 1090 852 707 980 622 880 986 405 1031 979 230 779 314
751 314 306 478 65 184 143 42 210 -152 -133 107 -204 -415 -291 -464 -378 -290 -561 -590 -600 -723 -675 -742 -660 -705
$$ packed form
598H65k46jJ00p35N58k31q4O11j099L33L10o96L91k03r0J02l92L20j01k06O7j06
620e33j77M16k21j79J05j3j12k9J93J96k17p2j21K28j30K89L50m13M40l87J83
641b04M85n80K72M04m75K32M1J20K75l24J11N1k48Q31o50K48L98o35L05M7k57
662D47L32l01OK48m60K03O3m17M66l46m4M35p98L57j30j34J26k32j24L70k77n8
684b68q8K96l36n0j96L5Jj25Q0j69N4L08l97K17R3l86O2j8j66L85j75K0J7K37
708e69J53j84J28K80q1j12N02l32J30K70j61K8K78k22K05J28k08N41q7k15K61
729G33L0k3j66K7L13k64R6R4k18M68k38j45K73l58K58J06n81O26n2p49N49m65
751C14qJ72m13J19m1j01J68l62J9K40l11k11J24j73Q6Q8k71k9j0j23M8o7Q2m5
$$ plain form
775 -705 -588 -304 -934 -492 -379 -822 -591 -299 -508 -321 -328 -688 -220 -328 -517 -91 -350 -64 -91 2 -10 83
797 83 -64 5 62 83 330 122 342 632 213 468 526 414 538 674 462 613 503 450 550 352 724 483
819 483 355 358 191 375 453 368 356 84 25 267 11 -436 -100 63 -150 -226 -245 -391 -386 -349 -266 -597 -455 -542 -561
844 -561 -309 -765 -544 -230 -540 -584 -776 -670 -355 -399 -813 -264 -68 -606 -243 -330 -307 -140 -255 -74 29 -354
866 -354 134 -39 -26 262 273 -98 396 143 400 412 319 518 534 464 557 614 547 508 563 597 557 559 854 330 928
891 928 928 288 626 365 218 636 653 -129 428 329 75 101 186 -337 -238 -11 133 -100 -259 -283 -295 -313 -115 -689
915 -689 -535 -49 -548 -349 -296 -710 -688 -513 -526 -775 -594 -422 -731 -449 -265 -973 -374 -128 -828 -253 -408
936 -408 -657 -68 -175 -360 57 -86 -180 44 114 22 -73 174 118 53 178 229 294 200 471 371 522 645 397
$$ packed form
775g05J17K84o30M42J13m43K31K92k09J87pl60M68j08j89M26k59K86k7R3j2R3
797H3j47O9N7K1K47k08K20K90m19K55N8j12J24J36k12J51j10n3J00j98L72k41
819D83j28Lj67J84P8q5j2k72n9K42k56m47L36J63k13p6j9j46NL7Q3l31J42q7j9
844e61K52m56K21L14l10m4j92J06L15m4m14N49J96n38L63q7K3J67j15J81J03l83
866c54M88j73J3K88J1l71M94k53K57J2r3J99J6p0R3N7o7l9N5L4m0KK95n24N98
891I28%o40L38k61j47M18J7p82N57r9k54K6Q5n23R9K27J44k33j59k4j2j8J98n74
915f89J54M86m99J99N3m14K2J75j3k49J81J72l09K82J84p08N99K46p00N75j55
936d08k49N89j07j85M17j43r4K24P0r2r5K47n6o5J25N1O5r4K71j00J51J23k48
$$ plain form
959 397 264 466 435 495 709 763 290 401 251 238 466 360 297 492 264 148 487 201 11 58 76 -123 164
982 164 -32 -18 -74 -318 -54 -288 -241 -434 -285 -325 -449 -408 -493 -772 -419 -201 -536 -555 -239 -455 -595 41 -588
1005 -588 -207 -348 -420 -210 -555 -325 -35 -342 -533 -128 -357 -44 -134 13 -67 -204 221 195 129 204 271 344 565
1028 565 265 658 605 491 709 437 506 401 517 861 315 438 594 402 256 491 328 214 478 292 318
1049 318 390 185 66 169 -271 50 -117 -70 -144 17 -149 -234 -26 -180 -560 15 -356 -51 -272 -500 -427 -407
1071 -407 -273 -514 -606 -480 -587 -129 -311 -290 -264 -747 -275 -179 -657 -144 -485 -546 -22 -443 53 -200 -509 141
1093 141 -263 -20 21 -48 107 -24 178 233 206 203 48 43 578 154 276 540 395 440 463 223 560 707 191
1116 191 294 198 160 427 498 118 277 245 78 382 -86 114 -166 -81 260 107 -1 222 -22 -253 238 22
$$ packed form
959C97j33K02l1O0K14N4m73J11j50j3K28j06o3J95k28j16L39k86j90M7J8j99K87
982A64j96J4n6k44K64k34M7j93J49m0j24M1q5k79L53K18l35j9L16k16j40O36o29
1005e88L81j41p2K10l45K30K90l07j91M05k29L13r0J47q0j37M25k6o6P5O7P3K21
1028E65l00L93n3j14K18k72O9j05J16L44n46J23J56j92j46K35j63j14K64j86K6
1049C18P2k05j19J03m40L21j67M7p4J61j66q5K08j54l80N75l71L05k21k28P3K0
1071d07J34k41r2J26j07M58j82K1K6m83M72R6m78N13l41o1N24m21M96k53l09O50
1093A41m04K43M1o9J55j31K02N5k7lj55nN35m24J22K64j45M5K3k40L37J47n16
1116A91J03r6l8K67P1l80J59l2j67L04m68K00k80Q5L41j53j08K23k44k31M91k16
$$ plain form
1138 22 -500 -210 -481 15 -364 -261 -183 -116 -269 -113 -285 -153 -274 -346 -121 -392 -443 -295 -425 -74 -149 -388
1160 -388 -86 -71 -278 -42 79 0 -136 -44 182 40 257 442 85 322 436 98 184 403 534 483 532 440
1182 440 618 450 126 533 444 31 416 312 326 364 113 419 242 558 256 -7 347 146 -154 -9 -18 58
1204 58 -59 141 -45 -145 172 -164 -220 98 52 -482 -12 -451 -440 -105 -155 -750 -331 -491 -298 -210 -430 -330
1226 -330 -458 -458 -468 -321 -352 -181 -236 -197 -559 -499 -188 -158 -281 2 -85 -238 -117 -58 -63 94 -118 6 -1 -271 254
1251 254 -41 154 422 -5 144 391 124 542 -17 249 395 509 756 194 -150 298 369 -61 523 394
1271 394 78 -21 178 -123 38 -158 79 351 435 174 56 121 -256 220 43 -65 -37 13 -46 45 37 279 -122
1294 -122 -585 220 308 -138 -160 -110 -408 -468 62 -175 -344 -106 -234 -553 -46 185 -423 24 -96 -570 -204
$$ packed form
1138B2n22K90k71M96l79J03P8O7j53J56j72J32j21p2K25k71n1J48j30L51p5k39
1160c88L02J5k07K36J21p9j36R2K26j42K17J85l57K37J14l38Q6K19J31n1M9r2
1182D40J78j68l24M07q9m13L85j04J4L8k51L06j77L16l02k63L54k01l00J45rP6
1204E8j17K00j86j00L17l36n6L18m6n34M70m39J1L35n0n95M19j60J93Q8k20J00
1226c30j28%j0J47l1J71n5L9l62O0L11L0j23K83q7j53J21N9nJ57k12J24pk70N25
1251B54k95J95K68m27J49K47k67M18n59K66J46J14K47n62l44M48P1m30N84j29
1271C94l16r9J99l01J61j96K37K72Q4k61j18O5l77M76j77j08K8N0n9R1qK42m01
1294a22m63Q05Q8m46k2N0k98o0N30k37j69K38j28l19N07K31o08M47j20m74L66
$$ plain form
1315 -204 -515 -13 447 118 16 273 157 393 569 6 -336 -574 640 -381 898 342 -94 307 680
1334 680 669 636 418 150 611 95 870 385 231 697 54 -7 296 -405 -103 -118 19 331 589 -239 -238 30
1356 30 167 -544 -33 124 -937 -444 215 -264 367 -146 -685 -386 150 135 -199 -162 -2 -569 -858 -647 -210
1377 -210 -221 -332 27 -646 -577 -181 266 -320 -689 64 97 -574 -298 -74 -128 -643 -453 498 -210 -267 59 278
1399 278 190 24 255 283 293 693 356 76 173 160 80 337 748 433 620 436 281 26 -64 288 143 368
1421 368 430 295 -127 325 -77 -199 110 -363 3 57 -97 -156 -359 -451 325 216 -435 526 -208 -560 -384
1442 -384 -37 -19 134 -426 -445 -138 -536 -318 -357 -236 173 57 -206 43 -76 -10 -411 -814 504 254 271
1463 271 -626 289 139 -96 398 92 177 467 152 -76 -22 -255 367 163 9 334 369 68 -526 504 477
$$ packed form
1315b04l11N02M60l29j02K57j16K36J76n63l42k38J214j021J279n56m36M01L73
1334F80j1l3k18k68M61n16P75m85j54M66o43o1L03p01L02j5J37L12K58q28JK68
1356C0J37p11N11J57j061M93O59m79O31n13n39K99N36j5l34L7J60n67k89K11M37
1377b10j1j11L59o73O9L96M47n86l69P53L3o71K76K24n4n15J90R51p08n7L26K19
1399B78q8j66K31K8J0M00l37k80R7j3q0K57M11l15J87j84j55k55r0L52j45K25
1421C68O2j35m22M52m02j22L09m73L66N4j54n9k03r2P76j09o51R61p34l52J76
1442c84L47J8J53n60j9L07l98K18l9J21M09j16k63K49j19O6m01m03J318k50J7
1463B71q97R15j50k35M94l06Q5K90l15k28N4k33O22k04j54L25L5l01n94J030k7
$$ plain form
1484 477 -12 743 -504 929 412 520 -85 58 542 -77 -35 284 -229 610 -36 -213 99 370 151 314
1504 314 141 -25 -305 -124 -92 -327 95 158 -382 -581 -564 -680 409 -339 -370 -167 -688 -1 96 -195 48
1525 48 -55 -302 -309 -151 -155 -758 -475 48 -145 364 -135 145 -3 -136 43 -41 -507 -234 -99 -93 246 -64 10
1548 10 -22 -13 46 265 249 463 162 324 191 448 350 243 390 635 270 217 230 374 414 256 228 334 349 -142
1572 -142 2 15 63 64 234 -130 313 219 -116 32 132 -189 1 122 188 9 -226 -74 -298 -295 -270 -142 -46
1595 -46 -40 -612 -268 -301 -108 -584 -158 -368 -934 -471 -508 -59 360 -595 -528 -401 156 179 219 326 231 -24 204
1618 204 336 -70 125 -226 -103 -503 -36 -13 346 211 97 150 74 203 45 -174 111 -423 -43 -57 354
1639 354 -22 484 509 -246 318 89 -227 160 359 136 358 772 221 3 18 233 307 216 36 -38 272 92
$$ packed form
1484D77m89P55j247J433n17J08o05J43M84o19M2L19n13Q39o46j77L12K71k19J63
1504C14j73j66k80J81L2k35M22O3n40j99J7j16J089p48l1K03n21O87R7k91K43
1525D8j03k47pJ58mo03K83N23j93N09m99K80j48j33J79q4m66K73J35OL39l10P4
1548A0l2RN9K19j6K14l01J62j33K57r8j07J47K45l65n3J3J44M0j58k8J06J5m91
1572a42J44J3M8JJ70l64M43r4l35J48J00l21J90J21O6j79k35J52k24LK5J28R6
1595d6On72L44l3J93m76M26k10n66M63l7M49M19r55O7J27N57K3M0J07r5k55K28
1618B04J32m06J95l51J23m00M67K3L59j35j14N3p6J29j58k19K85n34L80j4M11
1639C54l76N06K5p55N64k29l16L87J99k23K22M14n51k18J5K15P4r1j80p4L10j80
$$ plain form
1661 92 -2 -115 -364 -345 87 -421 370 -419 244 -573 97 -351 -377 204 372 668 77 261 -429 -244 -598
1682 -598 -635 329 -130 218 -599 -562 368 77 -537 -17 381 -735 134 283 25 166 -199 331 -16 277
1702 277 83 56 108 503 413 618 324 387 -93 658 824 48 -187 698 128 70 235 104 213 -11 -179 566
1724 566 109 309 277 -63 179 -122 116 159 210 156 -90 -275 1 80 -126 -65 -12 -47 -219 -37 -277 -310 -15
1747 -15 -197 -72 -268 -92 -345 -175 -317 -201 14 78 -405 -356 -203 -220 -110 -227 -147 -13 -142 -346 -130 44
1769 44 6 111 151 -27 -105 -41 213 125 305 245 37 389 37 27 188 -8 333 321 115 173 -71 376 10
1792 10 333 288 196 358 353 253 126 141 143 249 50 42 128 79 125 285 58 -45 99 -165 -318 -226 23 -86 -238
1817 -238 -425 -61 -290 -87 63 -125 -321 -118 -190 -424 -370 -447 -258 -395 -71 -177 -102 -41 -131 -368 -72 -39
$$ packed form
1661I2r4j13k49J9M32n08P91p89O63q17O70m48k6N81J68K96n91J84o90J85l54
1682e98l7R64m59L48q17L7R30k91o14N20L98j116Q69J49k58J41l65N30l47K93
1702B77j94k7N2L95r0K05k94O3m80P51J66p76k35Q85n70n8J65j31J09k24j68P45
1724E66m57K00l2l40K42l01K38M3N1n4k46j85K76P9k06O1N3l5j72J82k40l3K95
1747a5j82J25j96J76k53J70j42J16K15O4m83M9J53j7J10j17Q0J34j29k04K16J74
1769D4l8J05M0j78p8O4K54q8J80o0k08L52l52j0J61j96L41j2k06N8k44M47l66
1792A0L23m5r2J62nj00j27J5KJ06j99qQ6m9M6J60k27j03J44k64j53R2K49j09j52
1817b38j87L64k29K03J50j88j96K03p2k34N4p7J89j37L24j06P5O1r0k37K96L3
$$ plain form
1839 -39 11 -157 8 -191 -81 204 -240 86 -8 -11 -93 114 -70 -24 152 166 199 238 241 246 284 178 354 185 113
1864 113 364 136 34 256 242 421 375 130 214 287 -42 -131 -104 48 162 44 200 171 71 -24 -52 -308 -160
1887 -160 -89 16 -54 13 -270 81 -239 -168 -152 -114 -33 -245 -210 -191 -352 -195 -237 -227 -296 -361 -31 -263 -29 -214
1911 -214 -50 -295 -280 -121 -120 58 -41 104 2 -5 303 -10 62 325 153 333 114 247 123 -6 270 52
1933 52 87 319 33 85 257 282 -39 266 117 49 136 26 102 215 397 -18 62 -9 -53 149 153 146 -148 162 27
1958 27 -195 278 -134 -42 138 -309 34 -277 -411 -353 -73 -61 55 -181 -102 -318 -34 -320 -387 -288 -210 -106 -220
1981 -220 -92 -314 -105 -120 58 -21 0 -123 149 -22 43 -161 -34 116 116 92 19 119 134 24 31 70 25 225
2005 225 181 184 429 319 -35 133 -69 428 202 149 363 29 259 136 141 288 235 170 135 316 148 274 207
$$ packed form
1839c9N0j68J65j99J10K85m44L26r4lq2K07j84M6J76J4L3L9LNL8j06J76j69p2
1864A13K51k28j02K22j4J79m6k45Q4P3l29q9K7J52J14j18J56k9j00r5k8k56J48
1887a60P1J05p0O7k83L51l20P1J6L8Q1k12L5J9j61J57m2J0o9o5L30k32K34j85
1911b14J64k45J5J59JJ78r9J45j02pL08l13P2K63j72J80k19J33j24j29K76k18
1933E2L5K32k86N2J72K5l21L05j49o8Q7j10P6J13J82m15Q0p1m4K02Mpk94L10j35
1958B7k22M73m12R2J80m47L43l11j34N8K80J2J16k36P9k16K84k86o7R9P8J04j14
1981b20J28k22K09j5J78p9K1j23K72j71O5k04J27J50%k4p3J00J5j10PL9m5K00
2005B25m4LK45j10l54J68k02M97k26n3K14l34K30j23NJ47n3o5l5J81j68J26o7
$$ plain form
2028 207 238 193 -27 145 -104 -145 -80 -122 -424 -147 -91 -258 -108 -106 8 -316 -228 -176 -373 -64 -318 -169 -45
2051 -45 -329 -179 -252 -309 -221 -226 -268 -484 -168 -91 27 -149 32 67 18 47 99 69 33 -114 16 269 -163 234 -72
2076 -72 304 111 154 236 11 210 188 171 158 385 76 30 343 313 79 144 417 156 165 229 -45 192 243 238 -65
2101 -65 52 108 28 192 103 -22 -77 -211 -257 64 -152 -4 -50 -7 192 -357 -29 -221 -163 -135 -235 -314 -288 -168
2125 -168 -420 -125 108 -447 -236 -193 136 -58 -258 -97 -82 169 -278 105 -204 -239 11 -48 11 -10 -33 102
2147 102 -116 -8 -88 18 125 -30 100 62 362 337 80 304 36 -130 206 23 159 6 353 219 137
2168 137 182 117 -24 221 226 70 115 236 -199 26 -299 -6 -62 5 30 -94 -48 -250 216 -84 -191 -97 -154 -74
2192 -74 -162 -147 -197 -151 -70 -188 55 -21 10 -239 -487 -115 -22 -290 -260 21 -86 -524 -136 44 350 -258 -185 -109
$$ packed form
2028B07L1m5k20J72k49m1O5m2l02K77N6j67J50KJ14l24Q8N2j97L09k54J49J24
2051d5k84J50p3n7Q8nm2k16L16P7J18j76J81L5m9K9N2l0l6j47J30K53m32L97l06
2076g2L76j93M3Q2k25J99k2j7j3K27l09m6L13l0k34O5K73k61RO4k74K37N1nl03
2101f5J17N6q0J64q9j25n5j34m6L21k16J48m6M3J99n49L28j92N8K8j00p9K6J20
2125a68k52K95K33n55K11M3L29j94k00J61J5K51m47L83l09l5K50n9N9k1k3J35
2147A02k18J08q0J06J07j55J30l8L00k5k57K24k68j66L36j83J36j53L47j34q2
2168A37M5o5j41K45Nj56M5J21m35K25l25K93n6O7K5j24M6k02M66l00j07R4n7Q0
2192g4q8J5n0M6Q1j18K43p6L1k49k48L72R3k68L0K81j07m38L88J80L06o08P3P6
$$ plain form
2216 -109 -168 145 -625 663 -395 -211 -551 -157 -288 -36 230 135 208 156 153 51 245 791 -321 95 340
2237 340 111 27 -237 790 -14 -255 8 305 77 43 5 -344 -271 -299 -262 186 278 325 -577 125 -194 -212 -163
2260 -163 261 0 53 -72 -223 -88 -211 -73 -199 -140 -68 -221 -76 -220 -190 -19 -141 -143 -261 -246 67 -98
2282 -98 -183 83 6 -9 -30 21 -22 -41 146 7 -148 -88 -240 27 -41 141 -83 145 216 222 5 202 -7 180
2306 180 361 230 198 104 -21 151 176 183 161 46 1 161 138 74 61 27 55 18 111 58 137 -102 -80 264 -1 -56
2332 -56 117 -67 -120 54 -107 -58 104 -110 -99 -173 -129 -342 86 -205 -182 -308 -141 -185 -145 -130 -202 -299 -221 -223 -171
2357 -171 -53 118 -36 -226 -76 -350 165 -165 81 150 97 -8 28 -190 48 107 77 89 87 -182 101 100 51 -133
2381 -133 64 -11 137 211 315 286 173 -26 247 118 -20 235 204 50 109 182 -50 130 165 88 -3 -182 23
$$ packed form
2216a09n9L13p70J288j058J84l40L94j31K52K66r5P3n2lj02J94N46j112M16K45
2237C40k29q4k64J027q04k41K63K97k28l4l8l49P3k8L7M48R2M7r02P02l19j8M9
2260a63M24k61N3j25j51J35j23J38j26N9P2j53J45j44L0J71j22kj18J5L13j65
2282i8q5K66p7j5k1N1m3j9J87j39j55O0j52K67o8J82k24K28P1Ok17J97k09J87
2306A80J81j31l2r4j25J72K5Pk2j15m5J60k3o4j3l4K8l7R3n3P9k39K2L44k65n5
2332e6J73j84n3J74j61M9J62k14J1p4M4k13M28k91K3j26J67m4M0J5p2r7P8kN2
2357a71J18J71j54j90J50k74N15l30K46O9n3j05L6k18K38N9l0J2kk69K83jm9j84
2381a33J97p5J48P4J04k9j13j99K73j29j38K55l1j54N9P3k32J80L5p7r1j79K05
$$ plain form
2404 23 178 45 16 -125 10 -134 -84 -267 -94 -88 -235 -12 -160 -2 -75 -154 -197 -281 -33 184 0 78 94 -269
2428 -269 -221 -108 -191 31 -221 -407 -255 128 -113 -182 -103 23 119 52 135 -58 -32 166 -27 -330 114 226 196
2451 196 45 100 344 -45 7 110 207 240 77 103 320 323 157 164 181 351 -14 79 13 -53 226 69 5 315 10
2476 10 -67 144 -91 117 28 -111 -107 -77 -145 -22 -138 23 -192 -9 -211 -41 -9 42 57 -277 -9 -457 -188
2499 -188 -381 -118 -205 -288 -236 -133 -45 -158 -108 105 46 -163 -184 -55 119 93 58 -26 -267 -23 -157 66 -80
2522 -80 -44 -74 -12 0 107 278 156 64 174 185 40 218 123 38 222 94 385 118 322 -101 317 174 -83
2545 -83 168 23 70 157 105 222 113 -19 125 40 -56 36 -37 58 -57 59 -198 -4 -74 190 -27 -235 -292 -144
2569 -144 6 -108 -161 -58 -78 -94 53 -235 -222 178 139 -28 -121 -369 -56 -75 -74 -37 27 25 145 48 -11 -129 192
$$ packed form
2404B3J55j33k9j41J35j44N0j83J73Oj47K23j48J58p3p9m3q4K48K17j84P8J6l63
2428b69M8J13q3K22k52j86J52L83k41o9P9J26R6o7Q3j93K6J98j93l03M44J12l0
2451A96j51N5K44l89N2J03R7L3j63K6K17Lj66PJ7J70l65R3o6o6K79j57o4L10l05
2476A0p7K11k35K08q9j39ML0o8J23j16J61k15J83k02J70L2N1J5l34K68m48K69
2499a88j93K63q7q3N2J03Q8j13N0K13n9k09k1J29J74k6l5q4k41K44j34K23j46
2522h0L6l0O2J2J07J71j22r2J10J1j45J78r5q5J84j28K91k67K04m23M18j43k57
2545h3K51j45M7Q7n2J17j09j32J44q5r6R2p3R5j15J16k57J94p0K64k17k08n7J48
2569a44J50j14n3J03k0j6J47k88J3M00l9j67r3k48L13j9JL7O4kJ20r7n9j18L21
$$ plain form
2594 192 166 26 -108 -78 75 76 161 -123 197 31 -71 123 73 3 -74 112 82 185 -150 205 147 423 198
2617 198 -136 96 -40 196 186 118 51 77 -87 -353 -189 149 16 -33 -133 -207 -90 48 27 -87 -287 -171
2639 -171 -278 -311 -177 89 -340 23 -164 -192 85 -385 -54 -197 -93 -128 20 -316 -254 -109 -280 -21 -49 -270
2661 -270 7 -49 143 3 -112 -93 -236 -41 186 291 -38 140 46 74 0 34 105 -113 148 75 37 -3 -6 -38
2685 -38 75 329 72 -53 -15 44 70 242 143 309 307 -306 179 -114 323 -351 202 313 -217 -126 -55 -233 -95
2708 -95 -989 266 642 203 675 -443 -84 348 140 -487 475 627 390 277 -18 -549 -285 -88 -523 -292
2728 -292 13 -110 -52 -61 96 -149 -23 132 -77 1 -239 -222 -175 -39 -92 -34 170 -145 -9 18 267 399 141
2751 141 240 170 31 239 227 -14 -67 -16 97 11 175 176 123 86 10 -18 -82 57 -180 44 136 206 -16 190 -176
$$ packed form
2594A92k6j40j34L0J53JQ5k84L20j66j02J94n0p0p7J86l0J03l35L55n8K76k25
2617A98l34K32j36K36j0o8o7K6j64k66J64L38j33m9j00p4J17J38k1j14k00J16
2639a71j07l3J34K66m29L63j87k8K77m70L31j43J04l5J48l36O2J45j71K59k8k21
2661b70K77n6J92j40j15J9j43J95K27J05l29J78r4K8p4L4P1k18K61p3l8m0ll2
2685c8J13K54k57j25L8N9K6J72r9J66ko13M85k93M37o74N53J11n30R1P1j78J38
2708i5q94J255L76m39M72j118L59M32k08o27R62J52k37j13k95n31K64J97m35K31
2728b92L05j23N8rJ57k45J26J55k09P8k40J7M7J36n3N8K04l15J36K7K49J32k58
2751A41R9p0j39K08j2k41n3N1J13q6J64Jn3l7p6k8o4J39k37K24R2P0k22K06l66
$$ plain form
2776 -176 -151 -108 -20 89 32 -43 -111 24 52 -2 98 110 -82 -46 22 -106 -377 -15 -42 17 -385 -36 -66 -215 -103
2801 -103 66 -139 -112 6 -20 -10 4 24 185 -110 112 -131 -29 26 256 -38 -11 117 237 -71 69 124 153
2824 153 96 69 241 33 234 410 -28 0 -126 57 24 29 328 137 -97 157 210 -27 138 -50 129 -100
2846 -100 136 -60 57 -10 150 44 -70 -139 -84 34 -100 -391 247 59 -189 43 95 117 -274 -182 -281 -208 10
2869 10 -79 -158 34 -48 -94 66 -91 -328 -41 172 -142 0 -165 -73 -97 -12 37 -99 -99 -124 -75 8 10 -325 -75
2894 -75 107 221 -56 88 -34 129 122 -119 228 157 296 215 3 137 -3 75 130 1 189 120 226 113 -22
2917 -22 -15 -178 232 214 327 -50 -81 -60 -73 -39 154 265 32 87 -186 16 -34 -27 27 117 67 -36 -62 -150 115 26
2943 26 -224 -62 -151 -83 -49 77 -185 -217 35 -82 250 116 -227 351 38 -149 -58 120 265 544 46 791
$$ packed form
2776a76K5M3Q8J09n7p5o8J35K8n4J00J2j92L6O8j28k71L62k7N9m02L49l0j49J12
2801a03J69k05K7J18k6J0J4K0J61k95K22k43J02N5K30k94K7J28J20l08J40N5K9
2824A53n7k7J72k08K01J76m38K8j26J83l3NK99j91k34K54N3k37J65j88J79k29
2846a00K36j96J17o7J60j06j14o9N5J18j34k91O38j88k48K32N2K2l91R2r9P3K18
2869A0q9p9J92q2m6J60j57k37K87K13l14J42j65R2k4Q5M9j36%k5M9Q3Kl35K50
2894g5J82J14k77J44j22J63pk41L47p1J39q1k12J34j40P8N5j29J88o9J06j13j35
2917b2Pj63M10j8J13l77l1K1j3L4J93J11k33N5k73K02n0PN4R0n0j03k6q8K65q9
2943B6k50J62q9O8L4J26k62l2K52j17L32j34l43N78l13j87R1J78J45K79m98P45
$$ plain form
2965 791 -109 89 156 141 409 66 152 111 -69 -264 -7 260 -267 290 80 68 -28 176 82 252 96 95 173
2988 173 -124 108 -33 -51 86 78 -16 61 104 291 145 155 24 134 375 -163 238 50 -204 175 -254 42
3010 42 -28 -42 -34 74 31 -264 -67 -91 -70 -256 -210 -173 82 -3 -136 -33 -125 -80 57 -31 23 12 44 51 -33 53 -175
3037 -175 153 -199 -205 271 -35 -82 126 70 157 48 -214 48 -24 -104 112 -11 84 81 48 229 -71 84 -14 -2
3061 -2 147 -81 143 -3 -32 146 264 117 -31 -9 -3 21 202 -90 -119 -269 -49 20 -80 -141 -70 111 -54 178
3085 178 115 70 -64 -149 -233 78 29 -170 44 4 4 -242 7 115 64 82 53 -337 -40 2 59 102 -107 -69 11
3110 11 111 -180 -181 -218 -53 47 21 -30 -35 -225 96 -33 -67 146 -10 -262 -158 -141 -118 29 -24 203 5 106
3134 106 24 106 55 71 -28 158 67 152 -38 -5 5 20 236 63 257 134 71 122 -87 -18 19 -60 -153 -42 -138 -385
$$ packed form
2965G91r00J98O7j5K68l43Q6m1j80j95K57K67n27N57k10j2r6K04r4J70j56jP8
2988A73k97K32j41j8J37qr4P7M3J87j46J0j31J10K41n38M01j88k54L79m29K96
3010D2p0j4QJ08m3k95J97k4K1j86M6L7K55q5j33J03r2M5J37q8N4j1L2Pq4Q6k28
3037a75L28l52oM76l06m7K08n6Q7j09k62K62p2q0K16j23R5ll3J81l00J55r8J2
3061bJ49k28K24j46k9J78J18j47j48K2OK4J81k92k9j50K20O9j00o1P1J81j65K32
3085A78o3m5j34q5q4L11m9j99K14m0%k46K49J08n1J8k9l90K97M2N7M3k09L8Q0
3110A1J00k91jl7J65J00k6n1nj90L21j29l4K13j56k52J04J7K3J47n3K27j98J01
3134A06q2Q2n1J6r9J86r1Q5j90L3J0J5K16j73J94j23o3N1k09O9L7p9r3J11r6k47
$$ plain form
3160 -385 -53 -36 -75 187 -229 -62 1 -164 -143 45 -65 -293 39 7 -131 19 -38 69 -136 10 -206 -6
3182 -6 -115 115 48 -101 39 2 -139 -153 76 -74 202 218 -5 -44 112 -102 -75 9 53 172 -103 101 -152
3205 -152 -215 -140 92 168 103 129 71 113 130 354 23 124 182 85 123 127 238 74 113 -109 -52 -275 225 168 2
3230 2 -5 85 328 -72 -150 37 -212 -55 -81 -187 -233 57 31 -35 111 -76 -333 40 21 416 -37 -122 350 -218
3254 -218 114 -65 -88 -40 -293 169 196 -115 -6 21 126 -28 217 -132 -76 -97 34 114 1 62 88 -162 75
3277 75 -223 -145 -64 34 -65 201 109 -43 15 -146 -74 -142 46 141 152 -57 -79 -8 -29 195 55 -19 138 2 107
3302 107 89 -78 -152 -84 229 197 -31 -40 7 39 154 -40 158 -109 -361 -217 -153 -72 -195 -68 -123 22 44 -14
3326 -14 -73 13 -175 -217 -183 159 -94 -161 10 -91 -69 -48 122 85 14 -192 13 33 115 3 -225 -343 1 -71
$$ packed form
3160c85L32J7l9K62m16J67O3j65K1J88j10k28L32l2j38J50n7J07k05J46k16K00
3182fj09K30o7j49J40l7j41j4K29j50K76J6k23l9J56k14K7Q4M4J19k75K04k53
3205a52o3P5K32P6o5K6n8M2J7K24l31J01N8r7L8MJ11j64L9k22N7k23N00n7j66
3230BpR0K43m00p8J87k49J57k6j06m6K90k6o6J46j87k57L73j9L95m53q5M72n68
3254b18L32j79k3M8k53M62K7l11J09K7J05j54K45l49N6k1J31Q0j13O1K6k50K37
3277G5k98P8Q1R8r9K66r2j52N8j61P2o8J88R5J1k09k2P1k1K24j40p4J57j36J05
3302A07j8j67p4O8L13l2k28rM7L2J15j94J98k67k52J44O4Q1j23J27n5J45K2n8
3326a4n9Q6j88m2L4L42k53o7J71j01K2K1J70l7p1k06K05K0Q2j12k28j18L44p2
$$ plain form
3350 -71 -158 119 -133 20 -29 -99 3 -170 18 68 19 150 152 -97 -36 49 161 1 362 116 -91 184 134 223
3374 223 -165 77 150 -15 144 95 65 -170 78 -85 8 73 -95 0 68 -146 23 114 15 45 99 27 -120 -65
3398 -65 -131 -72 102 -86 -218 -38 -140 -8 71 -205 -167 -73 -66 19 -216 -128 1 59 25 186 -104 242 -49 91
3422 91 78 15 94 165 39 41 -44 -99 -6 394 91 295 61 -53 -94 270 -78 31 85 107 120 204 -69 35 109
3447 109 -56 -128 -91 39 7 133 18 157 -69 60 84 -132 -29 279 -216 -133 165 -93 11 -60 -43 -26 -148
3470 -148 186 -62 -136 -243 -167 5 128 59 -258 -293 -194 150 79 108 30 -137 -173 329 198 -226 424 137 -366
3493 -366 103 46 195 -449 -285 195 -245 -261 -111 372 -56 -560 130 543 590 272 -373 56 426 80 -84
3514 -84 -279 -211 128 323 -299 -486 -219 -81 93 817 63 -228 310 358 37 29 120 -370 122 539 16 -702
$$ packed form
3350g1q7K77k52J53m9p0J02j73J88N0m9J31Kk49O1Q5J12j60L61k46k07K75n0Q9
3374B23l88K42P3j65J59m9l0k35K48j63R3O5j68R5O8k14J69R1r9L0N4p2j47N5
3398f5o6N9J74j88j32J80j02J32P9k76L8R4PQ5k35Q8J29N8l4J61k90L46k91J40
3422I1j3o3P9P1j26Kq5n5R3M00l03K04k34j14m1L64l48J09N4K2J3Q4k73J04P4
3447A09j65p2L7J30l2J26j15J39k26J29K4k16J03L08m95Q3K98k58J04p1J7J7j22
3470a48L34k48p4j07P6J72J23o9l17l5R9L44p1K9p8j67l6N02j31m24O50k87n03
3493c66M69n7J49o44J64M80m40j6J50M83m28n04O90M13M7l18o45M29L70l46j64
3514h4j95O8L39J95o22j87K67J38J74P24p54k91N38M8l21qR1m90M92M17n23p18
$$ plain form
3536 -702 138 -478 -133 -493 329 -16 -300 -597 578 398 622 -54 235 71 -375 470 -660 131 482
3555 482 112 -118 -568 -136 55 -191 54 -47 66 -108 -121 -70 -11 97 60 82 -229 -17 -92 -178 208 194 144
3578 144 120 -112 82 -22 -52 228 416 282 228 33 42 -35 5 -47 -119 57 -135 108 -138 21 -29 -106 163 -248
3602 -248 -8 -130 145 19 -152 172 -9 -88 23 35 88 10 -100 47 24 -173 6 -22 48 110 274 31 52
3625 52 -333 79 204 -190 85 -46 -340 35 279 -93 -160 -136 19 19 -72 -151 238 124 -115 37 145 48 -158
3648 -158 -100 -147 -7 -72 16 115 17 -74 -60 -10 93 305 -332 120 29 -304 -91 365 -166 351 450 39 -12 -80
3672 -80 516 11 -132 51 -15 84 473 651 -474 274 142 295 -46 -121 -37 352 -16 -292 355 -29 -1 -259
3694 -259 -66 -156 9 -83 -147 -165 -21 54 37 -123 -75 129 119 24 -235 -246 83 151 -523 -279 155 -282 180 108
$$ packed form
3536g02Q40o16L45l60Q22l45k84k97J175j80K24o76K89j64m46Q45j130P91L51
3555D82l70k30m50M32J91k46K45j01J13j74j3N1N9J08l7K2l11K12p5q6L86j4n0
3578A44k4k32J94j04l0K80J88j34n4j95Rp7M0n2p2J76j92K43k46J59n0p7K69m11
3602b48K40j22K75j26j71L24j81p9J11J2N3p8j10J47k3j97J79k8P0O2J64k43K1
3625E2l85M12J25l94K75j31k94L75K44l72o7K4J55%r1p9L89j14k39J52J08r7k06
3648a58N8m7J40o5Q8R9r8r1J4N0J03K12o37M52r1l33K13M56n31N17R9m11n1o8
3672h0N96n05j43J83o6R9L89J78j125P48j32J53l41p5Q4L89l68k76O47l84K8k58
3694b59J93r0J65r2o4j8J44P5j7j60M8K04j0r5k59j1L29O8o74K44M34m37M62p2
$$ plain form
3718 108 121 65 -285 -181 -175 -65 168 140 -185 -286 -279 329 625 120 -42 338 280 -345 -97 -108 -550 -12 165
3741 165 304 298 213 505 -145 -566 478 251 -308 240 130 -327 462 359 -394 -185 -954 -52 -289 646 -9
3762 -9 199 -304 -318 230 89 -28 -160 -100 -928 -268 -325 -245 -517 -443 100 96 -243 -778 -700 -379 -255 -212 -91 439
3786 439 472 -249 686 93 -100 -485 165 -321 -264 -193 -252 -91 309 62 -185 310 130 177 248 -460 -4 289
3808 289 55 34 -41 232 118 210 -112 -50 -91 66 -63 -72 202 -69 30 89 -12 34 -50 22 -10 -106 173 49 -96
3833 -96 156 86 -134 -31 45 82 -44 -40 -47 -24 -374 -137 -20 11 -88 165 -43 11 -1 224 -145 134 63 -32 -249
3858 -249 35 -401 -20 193 10 -214 49 2 -20 49 94 -75 -114 48 -18 108 -81 331 98 12 198 22
3880 22 191 43 -15 -2 -71 37 214 163 80 -39 -159 -62 69 120 -96 -164 -22 26 -131 -35 -72 -245 -77 31
$$ packed form
3718A08J3n6l50J04OJ10K33k8l25j01PO08K96n05j62L80n8o25K48j1m42N38J77
3741A65J39oq5K92o50m21J044k27n59N48j10m57P89j03p53K09p69R02k37R35o55
3762iK08n03j4N48j41j17j32O0q28O60n7Q0k72P4N43ml39n35P8L21J24M3J21N30
3786D39L3p21R35n93j93l85O50m86N7P1n9J61M00k47k47M95j80M7P1p08M56K93
3808B89k34k1p5K73j14R2l22O2m1J57j29rK74k71R9N9j01M6q4P2l2r6K79j24j45
3833i6K52p0k20J03P6L7j26MpK3l50K37J17L1r9K53k08N4j2K25l69K79p1r5k17
3858b49K84m36L81K13j83k24K63m7k2O9M5j69l9J62o6J26j89M12k33q6J86j76
3880B2J69j48n8J3o9J08J77n1q3j19j20R7J31N1k16o8J42M8j57R6l7j73J68J08
$$ plain form
3904 31 -26 40 245 24 229 -174 -15 -34 -135 68 -20 -95 104 -1 47 88 -371 339 -113 324 -66 14 -32
3927 -32 -294 -546 -269 178 45 205 58 403 549 -237 25 100 -174 -177 -338 381 -289 55 -227 74 228
3948 228 -89 63 -8 301 -495 -858 582 76 -83 101 -300 35 4 195 -361 79 87 -96 102 6 -120
3969 -120 124 323 47 142 -10 97 -25 -23 -104 -72 -9 347 40 240 68 -137 -118 88 136 206 -180 -109 88
3992 88 43 -191 -65 -73 -237 -293 -114 -147 132 237 2 -208 -32 -74 26 -187 -48 31 78 -1 -5 -97 158 -31
4016 -31 -17 -45 -86 74 31 75 245 -177 -130 -103 -3 199 -106 50 -46 171 60 58 163 43 64 32 156 -132
4040 -132 142 -12 128 -198 159 129 110 -76 -5 113 -34 73 -85 -112 -162 32 113 -229 -289 -4 -113 -238
4062 -238 93 115 136 14 111 36 -22 -16 -81 -109 2 -36 -52 42 -183 -23 -53 5 125 35 45 -250 -49 -43 123 129 29
$$ packed form
3904C1n7O6K05k21K05m03J59j9j01K03q8p5J99j05M8M1m59P10m52M37l90Q0m6
3927c2k62k52K77M47j33J60j47L45J46p86K62P5k74lj61P19o70L44k82L01J54
3948B28l17J52p1L09p96l63J440n06j59J84m01L35l1J91n56M40Qj83J98r6j26
3969a20K44J99k76R5j52J07j22Kq1L2O3L56l07K00j72k05J9K06M8P0l86P1J97
3992H8m5k34J26qj64n6J79l3K79J05k35k10J76m2J00k13J39P9M7p9mr2K55j89
4016c1J4k8m1J60m3M4J70m22M7K7J00K02l05J56r6K17j11kJ05j20K1l2J24k88
4040a32K74j54J40l26L57l0j9j86P1J18j47J07j58k7n0J94Q1l42o0K85j09j25
4062b38L31K2K1j22R7p5n8Oo5k8J11l8j6R4k25J60l0N8J20r0J0k95K01OJ66Oj00
$$ plain form
4089 29 54 -243 -15 131 -153 -57 -42 -252 87 85 -288 -38 52 -78 227 275 147 64 387 -1 -392 -408 -736
4112 -736 18 439 361 243 118 283 -173 17 -93 -106 84 325 128 7 67 192 -269 121 162 -164 95
4133 95 -271 -10 -254 -242 11 -90 -253 -27 -67 123 43 39 156 182 -95 -114 -126 136 -166 -26 -130 98 133
4156 133 -192 92 2 -187 151 147 -77 86 -158 -65 57 90 104 317 33 130 -330 122 2 2 234 134 126 -86
4180 -86 -2 -3 -99 44 255 17 -1 193 -190 -37 203 -27 48 123 -25 108 -114 139 136 39 22 168 389 -168
4204 -168 -131 11 115 15 -8 -23 -183 -18 56 -13 103 -186 -68 -187 -16 20 25 114 -44 153 33 -236 -204
4227 -204 110 -25 26 -209 15 27 -41 61 -112 329 133 -149 49 58 193 204 147 -122 -117 152 19 -98 159
4250 159 -62 67 -108 187 123 1 -70 158 241 15 33 293 -53 102 95 61 -73 210 37 107 -24 -95 -227
$$ packed form
4089B9K5k97K28J46k84R6J5k10L39kl73K50R0j30L05M8j28q3L23l88l91j6l28
4112g36P54M21p8j18j25J65m56J90j10j3J90K41j97j21O0J25m61L90M1l26K59
4133I5l66K61k44J2K53j01j63K26m0J90q0mJ17K6k77j9j2K62l02J40j04K28L5
4156A33l25K84r0j89L38mk24J63k44R3J22L3J4K13k84R7m60M52j20%K32j00qk12
4180h6Q4jr6J43K11k38j8J94l83J53K40k30P5P5j48J33k22K53lr7j7J46K21n57
4204a68L7J42J04j00k3j5j60J65P4o9J16k89J18j19J71L6NQ9j58J97j20k69L2
4227b04L14j35N1k35K24J2o8J02j73M41j96k82J98RJ35J1n7k69NK69j33j17K57
4250A59k21J29j75K95o4j22p1K28Q3k26J8K60l46J55pl4j34K83j73P0j31p1j32
$$ plain form
4273 -227 249 224 -303 234 81 230 -66 194 398 153 -37 74 -59 -118 -161 -274 325 -226 97 -173 -231
4294 -231 220 -56 -42 -158 206 -53 -42 -172 99 185 -32 -186 -79 -69 -134 23 -51 -109 -25 54 181 -40 108
4317 108 63 -24 -92 -222 6 135 88 81 25 128 261 132 140 11 -56 289 43 86 124 -1 -57 -14 408 197 209
4342 209 221 -242 266 -286 -158 593 -52 -531 -136 -442 -186 237 269 -163 -135 111 -524 277 62 -266 -321
4363 -321 339 68 233 8 -91 125 -103 307 -49 -38 -63 204 218 -318 228 -361 284 770 58 -532 4
4384 4 -799 -527 -61 -252 264 -586 237 -274 -88 19 -111 -54 -9 5 34 77 84 179 69 0 -17 -24 -27 238 -32
4409 -32 220 92 -1 -37 127 -117 13 212 64 -224 -121 162 -75 -329 11 -142 85 99 31 97 -201 -9
4431 -9 -121 92 -96 164 -99 13 -323 31 -164 41 177 -7 110 130 -113 72 -170 -6 109 21 -234
$$ packed form
4273b27M76k5n27N37j53J49k96K60K04k45j90J11j33n9m3j13N99n51L23k70n8
4294b31M51k76J4j16L64k59J1j30K71Q6k17j54J07J0o5J57p4n8Q4P9J27k21J48
4317A08m5q7o8j30K28J29m7pn6J03J33j29Qj29o7L45k46M3L8j25n6M3M22k11J2
4342B09J2m63N08n52J28P51o45m79L95l06K56M23L2m32K8K46o35Q01k15l28n5
4363c21O60k71J65k25r9K16k28M10l56J1k5K67J4n36N46n89O45M86p12n90N36
4384Dq03K72M66j91N16q50Q23n11J86J07j30N7M5J4K9M3PR5j10o9j7plK65k70
4409c2K52j28r3l6J64k44J30J99j48k88J03K83k37k54L40j53K27J4o8O6k98J92
4431ij12K13j88K60k63J12l36L54j95K05J36j84J17K0k43J85k42J64J15q8k55
$$ plain form
4452 -234 71 104 -85 -166 71 129 -8 69 -38 7 1 95 -267 175 -177 -134 -85 -223 -82 2 86 54 -212 131
4476 131 -84 9 156 55 -296 66 -127 186 -29 -151 169 21 86 158 -40 20 -212 -194 -45 -41 69 30 33
4499 33 26 -217 -70 157 56 -10 -288 -22 33 -87 -4 32 10 -59 -6 -59 -272 -212 -55 -149 -191 42 120 -113 125
4524 125 -5 225 31 121 -259 -160 -72 70 9 -48 115 253 23 -69 -246 152 164 45 -72 139 35 43 70
4547 70 3 155 7 171 113 37 40 -41 -96 -90 -126 -119 82 -192 209 4 -130 -4 58 125 -10 -18 116 -157 73 -20
4573 -20 -126 -123 -30 -88 -76 -77 -181 -2 71 17 86 -31 -45 18 115 71 -35 120 -41 -31 -71 -31 -125 -70 54 61 -15 -9
4601 -9 38 96 -145 171 -30 98 8 198 321 121 113 -176 11 -142 -350 138 128 132 102 -61 199 -33 -66 -64 44
4626 44 -35 19 -37 -53 4 14 -79 125 -113 -380 138 79 -123 139 108 176 -188 65 112 25 -60 43 136 -45 -4
$$ packed form
4452b34L05L3j89q1K37N8j37P7j07M5oR4l62M42l52M3M9j38J41Q4Q4l2k66L43
4476A31k15R3J47j01l51L62j93L13k15j22L20j48O5P2j98O0k32J8J49MJ10l9L
4499C3pk43J47K27j01o6k78K66N5j20Q3L6k2o9N3n3k13O0J57r4m2K33P8k33K38
4524A25j30K30j94R0l80R9Q8J42o1n7J63J38k30r2j77L98J2j19j17K11j04QK7
4547G0o7J52j48J64n8p6Lq1n5Ol6PK01k74M01k05j34J26O2O7j35qJ34k73K30r3
4573b0j06LR3n8J2jj04J79P3n4O9j17j4O3R7m4j06J55j61J0m0M0r4N5J24Pp6O
4601iM7N8k41L16k01J28r0J90J23k00qk89J87j53k08M88j0Ml0j63K60k32l3KJ08
4626D4p9N4n6j6N7J0r3K04k38k67N18n9k02K62l1O8l64K53M7q7q5J03R3j81M1
$$ plain form
4651 -4 -67 -18 -116 -35 180 -122 29 68 -186 -233 -60 218 33 -5 -63 -8 259 -103 247 -52 -89 201 -149 -173
4675 -173 -26 -208 -116 -113 176 101 -8 -15 -96 -156 163 -101 9 -144 -13 -22 -102 -29 237 185 148 39 -68 94 -235
4700 -235 187 -1 138 -3 194 121 169 17 169 -75 9 -202 136 42 82 126 22 -45 -165 67 -52 77
4722 77 180 53 -40 -253 31 96 20 -21 163 27 46 -89 3 -5 133 -87 -90 -101 -201 -105 -39 -204 -261 -3 -48
4747 -48 -42 -214 123 -60 49 -203 161 -250 192 -42 -173 -4 -46 -107 -94 66 98 42 -16 203 -94 -122 -17
4770 -17 -48 -33 247 -52 76 -13 8 108 159 98 -38 -337 -6 66 -66 -262 19 169 34 -30 -75 -90 -73 50
4794 50 167 -89 -125 -192 113 114 -69 -39 39 7 -192 -91 -9 -195 -21 74 121 -33 -108 34 105 -10 -237 119
4818 119 68 -31 -16 87 9 -123 -60 -107 18 157 -210 -172 -9 -187 -41 -110 -153 294 163 115 -77 253 -10
$$ packed form
4651do3M9r8Q1K15l02J51L9k54m7J73K78j85l8n8N5K67l62L50k99l7K90l50k4
4675a73J47j82R2LK89p5j09pq1o0L19k64J10j53J31rq0P3K66n2l7j09j07J62l29
4700b35M22j88J39j41J97p3M8j52J52k44Q4k11L38r4M0M4j04o7j20K32j19J29
4722G7J03j27r3k13K84O5p6m1J84j36J9j35R2qJ38k20lj1j00R6O6j65n7K58m5
4747d8Oj72L37j83J09k52L64m11M42k34j31J69m2o1J3J60L2n6n8K19k97k8J05
4770a7l1J5K80k99J28q9K1J00N1o1j36k99L31P2j32j96K81J50j35o4m5j5J7J23
4794E0J17k56l6o7L05Jj83L0P8l2j99J01Q2j86J74R5M7j54p5J42P1j15k27L56
4818A19n1r9J5J03p8j32O3m7J25J39l67L8J63j78J46o9m3M47j31m8j92L30k63
$$ plain form
4841 -10 28 -106 -56 -113 -37 -74 -38 130 26 -184 -78 9 0 38 -155 146 87 178 23 76 -165 73 -16 180 106
4866 106 -41 -57 3 47 210 65 -76 -72 112 63 27 121 97 93 394 2 -144 -21 -112 -94 -185 -209 82 -75 8
4891 8 98 62 -276 207 -65 130 166 -234 -54 98 63 -15 -10 -153 112 42 67 -121 -10 -70 -234 -58 -229 136
4915 136 -23 454 -72 69 3 89 100 94 165 -96 98 30 155 115 -148 -107 28 213 -16 -85 -209 150 -138
4938 -138 -78 195 -174 19 -198 138 -80 111 135 -186 233 328 126 -173 -193 24 12 64 -78 -11 -207 89
4960 89 -200 -67 65 128 -112 -63 25 35 85 -73 51 157 -103 -48 -81 -302 -113 77 112 -162 -107 69 -137
4983 -137 162 80 -161 14 -105 -11 127 -174 -122 -157 86 113 -63 117 -249 -66 -150 65 5 -80 -100 108 -53
5006 -53 18 260 -41 45 147 374 -108 -9 -56 -141 100 -277 -75 22 -45 -11 182 4 -101 -128 -269 20 68 90
$$ packed form
4841a0L8j34N0n7P6l7L6J68j04k10J06Q7rL8j93L01n9R1j55N3k41K38q9J96p4
4866A06j47j6O0M4J63j45j41MJ84m9l6R4k4mL01l92j46J23r1J8r1k4K91j57Q3
4891HR0l6l38M83k72J95L6m00J80J52l5p8Nj43K65p0K5j88J11o0j64J76j71L65
4915A36j59M77n26J41o6Q6J1oP1k61J94o8J25m0k63M1J35J85k29o9j24L59k88
4938a38O0K73l69J93k17L36k18J91K4l21M19R5k02k99k0K17j2N2j42O7j96K96
4960H9k89J33J32O3k40M9Q8J0N0j58J24J06k60N5l3k21J89J90L5k74N5J76k06
4983a37K99q2k41J75j19R4J38l01N2l5K43K7j76J80l66J83q4K15o0q5k0K08j61
5006e3P1K42l01Q6J02K27m82R9m7q5K41l77K02R7o7L4J93j78j05k7j41K89M8K2
$$ plain form
5030 90 168 336 42 140 -91 -59 -4 -237 -180 -190 -270 9 -87 -105 -36 62 -42 85 -172 5 222 -110 -8 65
5054 65 -38 126 -144 97 -54 -113 -126 119 87 -138 73 -52 -64 60 36 93 116 -26 18 103 -56 -65 163 -78
5078 -78 105 -174 98 -30 47 142 5 -175 140 199 17 -62 -33 154 -106 -21 -53 127 -28 -91 131 29 77
5101 77 268 71 -74 74 -78 -56 2 -151 -256 154 -48 36 192 87 -127 -150 -116 286 27 -103 -3 -36
5123 -36 -176 -41 -165 51 50 39 -148 -250 48 100 -16 -280 -169 -161 88 -13 43 31 -81 97 10 106 -198 1
5147 1 -2 114 180 -13 43 7 315 26 15 -99 -184 247 -122 -121 67 171 -171 -9 24 122 47 303 -177 98 140
5172 140 -33 -11 6 -48 20 258 -16 -34 -132 -111 -3 -89 -30 316 19 149 40 83 43 -85 171 9 -63 29
5196 29 -14 32 232 179 10 130 53 -17 55 -107 2 18 5 -56 -224 71 8 182 114 195 -58 -42 -80 316 146
$$ packed form
5030I0P8J68k94R8k31L2N5k33N7j0q0K79r6j8O9R8j04J27k57J77K17l32J02P3
5054F5j03J64k70K41j51n9j3K45l2k25K11j25j2J24k4N7K3j42M4Q5j59rK28k41
5078g8J83k79K72j28P7R5j37j80L15N9j82p9K9J87k60Q5l2J80j55o3K22j02M8
5101G7J91j97j45J48j52K2N8j53j05M10k02Q4J56j05k14k3L4M02k59j30J00l3
5123c6j40J35j24K16jj1j87j02K98N2j16k64J11QK49j01N6j2j12J78q7R6l04J99
5147AlJ16O6j93N6l6L08k89j1j14q5M31l69JJ88J04l42J62L3R8p5K56m80K75M2
5172A40j73K2J7n4O8K38k74j8r8K1J08q6N9L46k97J30j09M3m0j28K56j62p2R2
5196B9m3M6K00n3j69J20p7p0P2j62J09J6j3o1j68K95o3J74o8Q1k53J6l8L96j70
$$ plain form
5221 146 -245 -75 -137 -69 14 -52 -1 -65 108 139 -122 -94 23 113 54 -23 62 190 -80 -7 46 -39 -118 -71 155 156
5247 156 -107 164 52 -3 -36 -213 -49 -139 87 4 180 -231 -81 56 243 -238 134 22 -96 -58 -84 27
5269 27 225 166 -269 174 134 195 -187 -43 -353 228 218 222 -74 153 86 -123 176 8 -49 18 -338 -81 -244
5292 -244 12 206 39 137 -80 -310 -390 221 -106 152 88 -95 151 37 -1 -20 -89 -141 -106 -65 -155 -76 -144 62
5316 62 -182 -112 81 -46 201 156 31 -71 37 116 -144 -14 85 -30 -142 23 -53 -320 186 -45 319 -110
5338 -110 -207 193 117 2 18 -98 65 -26 134 105 294 80 -114 -220 -133 139 26 -83 -181 -121 -75 -84 3 17
5362 17 -26 -75 205 -60 -19 80 197 -73 75 86 -156 -177 -57 128 278 -233 -13 -85 94 71 187 21 -128
5385 -128 20 51 100 -128 -188 162 -2 -46 44 -95 -141 -84 269 71 9 -84 -30 -25 26 9 37 48 169 169 -46 71
$$ packed form
5221A46l91J70o2O8Q3o6N1o4J73L1k61K8J17R0n9p7Q5J28k70P3N3q5p9M7K26J
5247A56k63K71j12n5l3j77J64r0K26q3J76m11J50J37J87m81L72j12j18L8k6J11
5269B7J98n9m35M43m0O1l82J44l10N81j0Mk96K27o7k09K99j68n7O7l56K57j63
5292b44K56J94j67R8k17k30q0O11l27K58o4j83K46j14l8j9o9n2L5M1r0P9o8K06
5316F2k44P0J93j27K47m5j25j02J08P9k60J30R9j15j12J65p6k67N06k31L64m29
5338a10r7M00p6j15J6j16J63r1J60k9J89k14j94j06Q7K72j13j09r8O0M6rQ7J4
5362A7m3m9K80k65M1R9J17k70J48J1k42k1J20J85J50n11K20p2J79k3J16j66j49
5385a28J48L1M9k28o0L50j64m4R0j39m6N7L53j98o2r3N4NN1j7K8J1J21%k15J17
$$ plain form
5411 71 -92 31 245 41 88 133 -198 128 399 140 156 -137 -273 191 -182 -492 -121 195 -201 262 -23
5432 -23 183 -16 -205 146 148 266 -142 129 -27 -30 -96 -237 -201 -52 94 131 -6 213 46 124 -68 -77 60 -273
5456 -273 -20 89 161 40 -149 -27 139 100 3 -27 81 -175 -26 -45 94 24 -73 16 -49 14 27 152 64 176
5480 176 -1 -121 -17 220 166 -243 76 -71 21 71 86 3 -170 -16 -37 70 -91 86 -210 182 244 -203
5502 -203 -46 101 191 12 127 -178 -62 -41 -80 49 81 194 87 11 -161 11 12 196 56 -152 -57 -139 -28
5525 -28 153 101 113 349 -34 74 56 -87 102 274 5 -163 21 12 -8 -82 109 -314 290 -6 -185 46 112
5548 112 56 21 -17 63 27 -271 18 -131 -63 233 -32 -40 124 -38 152 171 79 12 127 -23 -109 -69 -4 -202 -220
5573 -220 -28 -186 248 89 33 -97 -19 176 -29 18 50 11 2 -36 1 30 35 204 -14 70 70 -128 225 -141 3
$$ packed form
5411G1j63J23K14k04M7M5l31L26K71k59J6k93j36M64l73l10L71L16l96M63k85
5432b3K06j99j89L51KJ18m08K71j56lo6j41L6J49J46L7j37K19j67P8j92rJ37l33
5456b73K53J09P2j21j89J22J66l9r7l0J08k56J49j9J39p0r7Q9o5O3J3J25q8J12
5480A76j77j20J04K37n4m09L19j47R2N0J5q3j73J54k1J07j61J77k96L92O2m47
5502b03J57J47R0j79J15l05J16K1l9J29L2J13j07p6j72J72JJ84j40k08R5q2J11
5525b8J81n2J2K36l83J08j8j43J89J72k69j68J84rk0p4J91m23O04k96j79K31O6
5548A12n6l5l8Q0l6k98K89j49O8K96k65qJ64j62J90J9r2o7J15j50q6M0O5j98j8
5573b20J92j58M34j59n6j30P8J95k05M7L2l9rl8L7K9NJ69k18Q4%j98L53l66J44
$$ plain form
5598 3 52 -49 98 -120 68 161 -362 -49 24 -112 -200 -33 22 -174 -55 23 -376 -20 91 14 58 219 -25
5621 -25 -171 -103 -30 124 -15 146 81 -154 -88 -23 -64 -303 83 15 -20 249 -232 -109 32 -94 183 38 18
5644 18 195 -353 -86 88 -158 103 75 49 189 87 234 194 -180 157 -20 50 30 -121 -59 127 73 -100 -272
5667 -272 13 -83 -192 129 4 -39 1 -182 -64 9 136 -22 111 -182 180 48 25 92 134 -65 245 -89
5689 -89 159 -157 -46 381 -73 170 -228 -4 -77 -40 16 11 -218 -83 -111 -124 -32 238 30 15 24 -296 257 200
5713 200 -206 -6 165 -102 37 -4 30 58 127 -195 -129 90 -11 86 158 48 111 -71 -144 -110 196 -75 -91 265
5737 265 -6 6 204 212 116 -27 -31 282 58 31 86 162 99 133 185 -104 7 44 -191 29 15 117 -226 -231 81
5762 81 -111 -305 60 103 46 114 189 -143 -70 -85 -54 20 -231 -100 -251 154 -4 204 43 19 190 -54 195
$$ packed form
5598CM9j01J47k18J88R3n23L13P3j36q8J67N5j96J19P8l99L56J11p7M4J61k44
5621b5j46O8P3J54j39J61o5k35O6O5m1k39L86o8l5K69m81J23J41j26K77j45k0
5644A8J77n48K67J74k46K61k8k6J40j02J47m0l74L37j77P0k0j51O2J86n4j73j72
5667b72K85r6j09L21j25m3M0j83J18P3J27j58J33k93L62j32k3O7M2j99L10l34
5689h9K48l16J11M27m54K43l98K24p3L7N6nk29J35k8j3R2K70k08j5Rl20N53n7
5713B00m06K00J71k67J39m1L4K8O9l22O6K19j01R7P2j10O3j82p3L4L06k71j6L56
5737B65k71J2J98Qr6j43mL13k24k7N5P6o3L4N2k89J11L7k35K20j4J02l43nL12
5762H1j92j94L65M3n7O8P5l32P3j5L1P4k51J31j51M05j58K08j61k4J71k44K49
$$ plain form
5785 195 36 60 93 -82 79 -54 24 39 -40 -123 -98 291 -98 -356 300 -219 -182 -226 -55 25 11 8 -112 -125 -476
5810 -476 93 -64 214 -261 437 11 132 -49 372 437 216 498 393 543 -15 204 -471 -219 -411 -200
5830 -200 371 -440 372 142 -19 15 815 -461 -125 -551 104 687 -57 61 -566 81 74 -206 -22 123 151
5851 151 46 151 74 67 -40 145 -119 -146 103 -283 195 -178 -36 -32 -56 12 -298 126 -138 41 65 52 -119
5874 -119 -301 65 -17 80 -260 160 142 -11 -190 -14 114 -135 21 59 -133 137 -179 -56 -147 -154 -94 -212 -30
5897 -30 6 117 -115 -84 6 16 -100 -80 123 -187 -144 30 -114 -105 -176 -42 -209 -90 55 -134 24 24 -151 -37
5921 -37 -257 105 44 36 18 330 156 186 375 -104 30 -3 108 -43 95 57 206 86 16 -4 139 -382 65
5944 65 71 89 23 328 56 -80 -105 14 113 -62 -33 -43 158 144 176 -16 143 239 -104 4 111 92 -16 -3 30
$$ packed form
5785A95j59K4L3j75J61j33P8J5p9q3K5L89l89k58O56n19L7m4J71Q0j4lj20j3l51
5810d76N69j57K78m75O98m26J21j81M21O5k21K82j05J50n58K19o75K52j92K11
5830b00N71q11Q12k30j61L4Q00j276L36m26O55N83p44J18o27O47pk80J84J45K8
5851A51j05J05p7pj07J85k64k7K49l86M78l73J42Mk4O8l10M24k64J79K4j3j71
5874a19j82L66q2R7l40M20j8j53j79J76J28k49J56L8j92K70l16J23r1pO0j18J82
5897c0L6J11k32L1R0J0j16K0K03l10M3J74j44Rp1J34j67J19J45j89J58%j75J14
5921c7k20L62o1qj8L12j74L0J89m79J34l3J11j51J38l8J49j20p0k0J43n21M47
5944F5OJ8o6L05k72j36k5J19R9j75K9j0K01j4L2j92J59R6l43J08J07j9j08J3L3
$$ plain form
5969 30 -285 97 -52 69 -66 -178 -337 64 -358 -136 73 -160 26 -163 -132 -128 189 84 37 183 26 -53
5991 -53 116 200 67 -98 -101 254 -5 -148 141 -193 -170 -266 -104 1 116 -105 106 37 -42 75 154 178 100 -143
6015 -143 74 76 39 90 76 -54 -28 159 -171 33 -8 -214 39 -75 -81 307 -189 164 -13 62 -80 -176 -2 -119
6039 -119 -56 -59 -67 -75 -82 47 194 34 27 115 27 38 113 6 -103 -62 314 98 -54 -141 35 167 225 -77 -136 -123 45
6066 45 121 13 -81 285 27 160 92 -66 -256 208 95 -88 -43 198 -136 11 -31 -174 47 -229 37 64
6088 64 -66 -1 -88 147 -7 148 61 75 26 62 161 195 -185 95 119 -245 -200 106 -158 -53 28 -320 65 139
6112 139 58 -170 -146 93 157 102 -110 -12 -185 170 69 -70 66 -37 212 -171 30 53 141 48 -77 11 39
6135 39 44 151 74 30 94 -46 -96 -194 -70 -106 -116 63 -45 93 -57 -151 -42 188 123 99 -150 -111 6 -88 40
$$ packed form
5969C0l15L82j49J21j35j12j59M01m22K22K09k33J86j89L1ML17j05m7J46j57p9
5991e3J69Q4j33j65lL55k59j43K89l34K3r6J62J05J15k21K11o9p9J17P9K4p8k43
6015a43K17Kl7N1j4j30K6J87l30K04m1k06K53j14oL88m96L53j77P5j42r6J74j17
6039a19O3lqqpJ29J47j60pQ8q8J1P5j07j09M1L76k16j52q7J76J32N8l02n9J3J68
6066D5P6j08r4L66k58J33o8j58j90M64j13j83M5K41l34J47m2j43K21k76K66K7
6088F4j30O5q7K35j54J55q7J4m9L6R9L4l80K80K4l64M5L06k64J05Q1l48L85P4
6112A39q1k28K4K39O4n5k12R8j73L55j01j39J36j03K49l83K01K3Q8r3j25Q8K8
6135C9NJ07p7m4O4j40n0r8J24l6j0J79j08J38j50r4J09K30o5k4k49L9J17r4J28
$$ plain form
6160 40 -173 -76 -204 -91 -155 -72 -31 130 207 -175 -169 192 43 270 161 -224 -171 74 -104 -44 -49 70 -4 194
6184 194 -57 -324 -46 169 71 -256 -14 -20 -19 24 -2 103 -111 100 94 -361 270 -9 0 45 62 -116 -125 -30 -162
6209 -162 53 185 -184 -171 -14 115 206 -47 -93 41 30 -49 75 -46 102 88 228 -102 -175 -45 -17 32 125
6232 125 62 -240 -178 -196 33 144 -187 -19 -153 -34 -2 -57 -56 82 -131 -136 63 -96 112 -265 145 -395 288
6255 288 193 -22 -28 -2 -139 53 162 165 -33 -6 -178 -108 30 88 68 -115 171 -154 -177 95 88 -102 33 -120
6279 -120 147 68 275 -243 -11 -227 -23 -55 -254 -7 -112 358 49 -54 280 -608 -178 -484 243 -167 52
6300 52 4 -282 -362 -497 -258 -89 57 -26 321 8 -192 -137 180 -98 227 -239 42 40 -65 133 -25 83
6322 83 -30 -62 117 14 -12 -35 102 -65 132 60 34 -174 15 -155 176 182 211 -46 -209 166 130 126 -245 -262
$$ packed form
6160D0k13R7j28J13o4Q3M1J61P7l82OL61j49K27j09l85N3K45j78O0nJ19p4J98
6184A94k51k67K78K15r8l27K42oJM3k6J05k14K11om55O31k79RM5J7j78rR5j32
6209a62K15J32l69J3J57J29R1k53m6J34j1p9J24j21J48j4J40l30p3J30K8M9R3
6232A25o3l02O2j8K29J11l31J68j34J19L2n5JJ38k13nJ99j59K08l77M10n40O83
6255B88r5k15oK6j37J92J09Lj98K7j72P0J38N8k0j83K86l25k3K72pj90J35j53
6279a20K67p9K07n18K32k16K04l2j99K47j05M70l09j03L34q88M30l06P27m10K19
6300E2m8k86q0j35K39J69J46q3L47l13k00N5L17k78L25m66K81kj05J98j58J08
6322H3j13l2J79j03k6k3J37j67J97p2k6k08J89j70L31OK9k57j63L75l6ml71j7
$$ plain form
6346 -262 27 61 -38 248 -118 38 -171 -30 253 399 -48 24 34 -73 -167 -163 -182 -282 -308 350 -26 -345 262
6369 262 -444 25 -376 490 -180 55 26 -97 -3 11 -80 99 -127 -53 -129 -42 -40 -10 143 84 -68 -30 278 285 140
6394 140 -51 134 177 -25 -37 136 -11 -45 -56 -161 25 -31 -55 101 -47 -31 74 -102 -90 109 91 15 -99
6417 -99 14 7 -73 109 -10 107 -90 44 -34 -155 -73 40 114 31 -54 -155 -26 45 26 87 139 -101 -152 -225 -184
$$ packed form
6346b62K89L4r9K86l66J56k09J41K83J46m47P2J0j07r4Mj9j00k6O58l76l19O07
6369B62p06M69m01Q66o70K35k9j23R4J4r1J79k26P4p6Q7KL0J53n9j52L8L08Pj45
6394A40j91J85M3k02j2J73j47l4j1j05J86n6k4J56j48J6J05j76J2J99j8p6j14
6417i9J13pq0J82j19J17j97J34p8j21Q2J13P4q3q5j01J29P1j9O1N2k40n1p3M1
$$ [...]
8191f0
##END NTUPLES=NMR FID
##END=
