##TITLE=1H_SR26
 CDCl3, 8 sc, 
 17.12.2020
##JCAMPDX= 6.0         $$ Bruker NMR JCAMP-DX V2.0
##DATA TYPE= NMR FID
##DATA CLASS= NTUPLES
##ORIGIN= UXNMR, Bruker Analytische Messtechnik GmbH
##OWNER= root
$$ XWIN-NMR		Version 3.5
$$ Thu Dec 17 11:59:09 2020 Russian Standard Time (UT+4h)  she@DPX200
##.OBSERVE FREQUENCY= 200.1315066352
##.OBSERVE NUCLEUS= ^1H
##.DELAY= (6, 6)
##.ACQUISITION MODE= SIMULTANEOUS
##.ACQUISITION SCHEME= undefined
##.AVERAGES= 8
##.DIGITISER RES= 18
##SPECTROMETER/DATA SYSTEM= spect
##.PULSE SEQUENCE= zg30
##.SOLVENT NAME= C6D6
##.SHIFT REFERENCE= (INTERNAL, C6D6, 0, 15.7039)
##AUDIT TRAIL= $$ (NUMBER, WHEN, WHO, WHERE, WHAT)
$$ ##TITLE= Audit trail, XWIN-NMR		Version 3.5
$$ ##JCAMPDX= 5.01
$$ ##ORIGIN= Bruker BioSpin GmbH
$$ ##OWNER= she
$$ F:/spectra/data/she/nmr/H-F/1/audita.txt
$$ ##AUDIT TRAIL=  $$ (NUMBER, WHEN, WHO, WHERE, WHAT)
(   1,<2020-12-17 11:57:56.92 +0400>,<she>,<DPX200>,
      <created by zg, POWCHK disabled, PULCHK disabled
       configuration hash MD5:
       00 E9 B6 7A A2 85 ED C7 34 08 36 98 17 FE 4E 26
       data hash MD5: 16K
       55 64 1F D9 D9 B9 2E EB 7D 8F 2F 13 17 AA 27 A0>)
$$ ##END=
$$ 
$$ hash MD5
$$ 24 A5 0E F4 E8 CC 5D 7B 09 75 26 7D 8D FD 03 0E
##$RELAX= 
##$RELAX= 
##$RELAX= 
##$RELAX= 
##$RELAX= 
##$RELAX= 
$$ Bruker specific parameters
$$ --------------------------
##$DU= <F:/spectra>
##$EXPNO= 1
##$NAME= <H-F>
##$PROCNO= 1
##$TYPE= <nmr>
##$USER= <she>
##$AMP= (0..31)
100 100 100 100 100 100 100 100 100 100 100 100 100 100 100 100 100 100 
100 100 100 100 100 100 100 100 100 100 100 100 100 100 
##$AQSEQ= 0
##$AQ_mod= 1
##$AUNM= <au_zg>
##$AUTOPOS= <>
##$BF1= 200.13
##$BF2= 200.13
##$BF3= 200.13
##$BF4= 200.13
##$BF5= 200.13
##$BF6= 200.13
##$BF7= 200.13
##$BF8= 200.13
##$BYTORDA= 1
##$CFDGTYP= 0
##$CFRGTYP= 5
##$CHEMSTR= <none>
##$CNST= (0..31)
1 1 145 1 1 1 1 1 1 1 1 1 1 1 1 1 1 1 1 1 1 1 1 1 1 1 1 1 1 1 1 1 
##$CPDPRG= <>
##$CPDPRG1= <>
##$CPDPRG2= <>
##$CPDPRG3= <>
##$CPDPRG4= <mlev>
##$CPDPRG5= <mlev>
##$CPDPRG6= <mlev>
##$CPDPRG7= <mlev>
##$CPDPRG8= <mlev>
##$CPDPRGB= <>
##$CPDPRGT= <>
##$D= (0..31)
0 1.2 0 0 0 0 0 0 0 0.06 0 0.03 0 0 0 0 0.0002 0 0 0 0 0 0 0 0 0 0 0 0 
0 0 0 
##$DATE= 1608191876
##$DBL= (0..7)
120 120 120 120 120 120 120 120 
##$DBP= (0..7)
150 150 150 150 150 150 150 150 
##$DBP07= 0
##$DBPNAM0= <>
##$DBPNAM1= <>
##$DBPNAM2= <>
##$DBPNAM3= <>
##$DBPNAM4= <>
##$DBPNAM5= <>
##$DBPNAM6= <>
##$DBPNAM7= <>
##$DBPOAL= (0..7)
0.5 0.5 0.5 0.5 0.5 0.5 0.5 0.5 
##$DBPOFFS= (0..7)
0 0 0 0 0 0 0 0 
##$DE= 6
##$DECBNUC= <off>
##$DECIM= 32
##$DECNUC= <off>
##$DECSTAT= 4
##$DIGMOD= 1
##$DIGTYP= 9
##$DL= (0..7)
0 120 120 120 120 120 120 120 
##$DP= (0..7)
150 150 150 150 150 150 150 150 
##$DP07= 0
##$DPNAME0= <>
##$DPNAME1= <>
##$DPNAME2= <>
##$DPNAME3= <>
##$DPNAME4= <>
##$DPNAME5= <>
##$DPNAME6= <>
##$DPNAME7= <>
##$DPOAL= (0..7)
0.5 0.5 0.5 0.5 0.5 0.5 0.5 0.5 
##$DPOFFS= (0..7)
0 0 0 0 0 0 0 0 
##$DQDMODE= 0
##$DR= 18
##$DS= 0
##$DSLIST= <SSSSSSSSSSSSSSS>
$$ [...]
##$SUBNAM2= <"">
##$SUBNAM3= <"">
##$SUBNAM4= <"">
##$SUBNAM5= <"">
##$SUBNAM6= <"">
##$SUBNAM7= <"">
##$SUBNAM8= <"">
##$SUBNAM9= <"">
##$SW= 16.9725356469052
##$SWIBOX= (0..15)
0 0 2 0 0 0 0 0 0 0 0 0 0 0 0 0 
##$SW_h= 3396.73913043478
##$TD= 16384
##$TD0= 1
##$TE= 0
##$TE2= 300
##$TE3= 300
##$TEG= 300
##$TL= (0..7)
0 120 120 120 120 120 120 120 
##$TP= (0..7)
150 150 150 150 150 150 150 150 
##$TP07= 0
##$TPNAME0= <>
##$TPNAME1= <>
##$TPNAME2= <>
##$TPNAME3= <>
##$TPNAME4= <>
##$TPNAME5= <>
##$TPNAME6= <>
##$TPNAME7= <>
##$TPOAL= (0..7)
0.5 0.5 0.5 0.5 0.5 0.5 0.5 0.5 
##$TPOFFS= (0..7)
0 0 0 0 0 0 0 0 
##$TUNHIN= 0
##$TUNHOUT= 0
##$TUNXOUT= 0
##$USERA1= <user>
##$USERA2= <user>
##$USERA3= <user>
##$USERA4= <user>
##$USERA5= <user>
##$V9= 5
##$VALIST= <valist>
##$VCLIST= <CCCCCCCCCCCCCCC>
##$VD= 0
##$VDLIST= <DDDDDDDDDDDDDDD>
##$VPLIST= <PPPPPPPPPPPPPPP>
##$VTLIST= <TTTTTTTTTTTTTTT>
##$WBST= 1024
##$WBSW= 4
##$XGAIN= (0..3)
0 0 0 0 
##$XL= 0
##$YL= 0
##$YMAX_a= 45512
##$YMIN_a= -24997
##$ZGOPTNS= <>
##$ZL1= 120
##$ZL2= 120
##$ZL3= 120
##$ZL4= 120
##$ABSF1= 10
##$ABSF2= 0
##$ABSG= 5
##$ABSL= 3
##$ALPHA= 0
##$AQORDER= 0
##$ASSFAC= 0
##$ASSFACI= 0
##$ASSFACX= 0
##$ASSWID= 0
##$AUNMP= <proc_1d>
##$AZFE= 0.1
##$AZFW= 0.1
##$BCFW= 1
##$BC_mod= 2
##$BYTORDP= 1
##$COROFFS= 0
##$CY= 11.3945322036743
##$DATMOD= 1
##$DC= 2
##$DFILT= <>
##$DTYPP= 0
##$F1P= 15.9154993809931
##$F2P= -4.1035820241983
##$FCOR= 0.5
##$FTSIZE= 0
##$FT_mod= 4
##$GAMMA= 1
##$GB= 0.15
##$INTBC= 1
##$INTSCL= 1
##$ISEN= 128
##$LB= 0.24
##$LEV0= 0
##$LPBIN= 0
##$MAXI= 10000
##$MC2= 0
##$MEAN= 0
##$ME_mod= 0
##$MI= 1.114404
##$NCOEF= 0
##$NC_proc= 0
##$NLEV= 6
##$NOISF1= 3.799351
##$NOISF2= 2.8
##$NSP= 1
##$NTH_PI= 0
##$NZP= 0
##$OFFSET= 15.70392
##$PC= 1
##$PHC0= -10765.45
##$PHC1= 13.20094
##$PH_mod= 1
##$PKNL= yes
##$PPARMOD= 0
##$PSCAL= 0
##$PSIGN= 0
##$REVERSE= no
##$SF= 200.130013532006
##$SI= 16384
##$SIGF1= 3
##$SIGF2= 2
##$SINO= 400
##$SIOLD= 16384
##$SREGLST= <1H.CDCl3>
##$SSB= 0
##$STSI= 0
##$STSR= 0
##$SW_p= 3612.71676300578
##$SYMM= 0
##$S_DEV= 0
##$TDeff= 0
##$TDoff= 0
##$TI= <>
##$TILT= no
##$TM1= 0
##$TM2= 0
##$TOPLEV= 0
##$USERP1= <user>
##$USERP2= <user>
##$USERP3= <user>
##$USERP4= <user>
##$USERP5= <user>
##$WDW= 1
##$XDIM= 8192
##$YMAX_p= 0
##$YMIN_p= 0
$$ End of Bruker specific parameters
$$ ---------------------------------
##NTUPLES= NMR FID
##VAR_NAME=  TIME,          FID/REAL,        FID/IMAG
##SYMBOL=    X,             R,               I
##VAR_TYPE=  INDEPENDENT,   DEPENDENT,       DEPENDENT
##VAR_FORM=  AFFN,          ASDF,            ASDF
##VAR_DIM=   8192,          8192,            8192
##UNITS=     SECONDS,       ARBITRARY UNITS, ARBITRARY UNITS
##FACTOR=    0.0002944,     1,               1
##FIRST=     0,             0,               0
##LAST=      2.4114304,     0,               0
##MIN=       0,             -24997,          0
##MAX=       2.4114304,     45512,           0
$$ Real data points
##PAGE= N=1
##DATA TABLE= (X++(R..R)), XYDATA
0@%%%%%%%%%%%%%%%%%%%%pJ5j6J6j6J6j8K5l1L2l8M5m8N5o2P0p9Q7j00J12j23
41f5J36j51J69j88K09k30K53k81L09l39L74m11M53n00N55o16O83p63Q59r70J105
62E91j277J495j790K212k867M045o841K8040K1697r213K309j3014r856n646m41
77I444q261k58L964K169l733K396M387o63j916O179N746k03j9K977k627n977j675
94A1930L108o93k296K300M30o962p292k507m781p669l168R29l772m554J253L004
110b0740j143J233O605M721p24K661N304j100m354J61p02m696l019L983J355k142
126a2597K060L428k309m330K012K211k746j653L937L81k400K978N322Q55J639
141a212M802N540l22J197L445Ok711n03J429k423l283J034L216j209p70L706J223
$$ plain form
0 0 0 0 0 0 0 0 0 0 0 0 0 0 0 0 0 0 0 0 0 0 -7 8 -8 8 -8 8 -10 15 -16 16 -22 23 -25 30 -32 38 -41 46 -54 58 -65
41 -65 71 -80 89 -99 110 -120 133 -148 161 -178 196 -215 238 -262 293 -323 360 -403 456 -514 591
62 591 -686 809 -981 1231 -1636 2409 -4432 23608 45305 36092 38401 25387 15531 9885 9444
77 9444 1183 925 4889 7058 3325 5721 10108 9445 7529 13708 19454 19251 19232 22209 19582 13605 11930
94 11930 15038 14345 12049 14349 14779 7817 525 -1982 -6763 -14432 -17600 -16671 -20443 -24997 -23744 -20740
110 -20740 -21883 -20650 -14045 -9324 -10048 -7387 -2083 -3183 -7537 -7376 -8078 -12774 -15793 -11810 -10455 -12597
126 -12597 -10537 -7109 -9418 -13748 -11736 -9525 -12271 -13924 -9987 -9606 -12006 -9028 -3706 -2851 -1212
141 -1212 3590 9130 8808 10005 13450 13456 10745 10242 11671 9248 5965 6999 10215 9006 8236 11942 13165
158A3165k270O08J854j674k746J09M64l480n93L250N7j406N07L066j413j636O03
175H465k59l938k772J70j043m278j551J730m47j438J880Q36k688j438P11p91l366
192a0217k98J147j875r34J848Q92q41P99J985R41Q1P56J921j112j606L22N82k102
210g711n68K622O44j58J907J709Q7p47J665Q53o26m90K233R82j278J069K681L98
228E272k43K893J554m57K10J060k43l056j40M53k043j514J238J458j727q5J818
245F448n12j952J376j60R6k905J755n32j193j024N30R4j027q44Q35j162j009R6
263a090j073k040j134Q11o83k664J681j4J60l14J598M48k70l86J493n76o15M2
281d626L71l35j361J137j87N46M37K353q22m27O19O29M56n15N79J015o8m25K186
$$ plain form
158 13165 10895 11503 13357 11683 8937 9046 9510 6030 5437 8687 8744 7338 7845 10911 9498 7862 8465
175 8465 8206 4268 1496 1666 623 -3655 -5206 -3476 -3923 -5361 -3481 -2645 -5333 -6771 -6060 -6851 -10217
192 -10217 -10515 -9368 -11243 -12177 -10329 -9437 -10278 -9479 -7494 -6553 -6472 -5716 -3795 -4907 -6513 -6191 -5609 -7711
210 -7711 -8279 -5657 -5013 -5171 -3264 -1555 -1468 -2215 -550 303 -323 -813 1420 2402 1124 2193 4874 5272
228 5272 5029 7922 9476 9019 9229 10289 10046 6990 6850 7303 5260 3746 4984 6442 4715 4630 6448
245 6448 5936 3984 5360 5200 5296 2391 4146 3614 2421 1397 1927 2021 994 150 985 -177 -1186 -1090
263 -1090 -2163 -4203 -5337 -4526 -5209 -7873 -6192 -6206 -6046 -6360 -4762 -4314 -4584 -4970 -3477 -4053 -4668 -4626
281 -4626 -4255 -4590 -5951 -4814 -5001 -4455 -4018 -1665 -2487 -2914 -2295 -1666 -1210 -1725 -1146 -131 -199 -624 1562
300A562L23j6J201N11m5m38O84N48o09m13J763q06j104J21P57j16K55N63Q92n70
320E063p26J74n44j60K81m91j220j152n5N64r80J9J059j213j430J92Q46r00l40
339a013Q59p81j014q87M01K53j308J631q4j018o98J233j156r27J457r03M30j439
357d964J007M92J46M33q8J173r23J53J212J20l03J296j15m62r2L04P92N8L85P58
377A382l43l22O3J246k45O72J31K0m01P67K13Q1o79L73P02q80l21M99N10J32q38
398B762L75l30j362o1P19j86l10L53q7j155j52J048m06j103j10k84J14r28N41
417e62P10j670J6K32k76o12O00l91k46L36J47l65n23l2k36P04m92L79R72m36p13
438b458k07J123K11o53N64l67L40P26l71N7j5P78N1k97M32R83j99p52O40L69q0
$$ plain form
300 1562 1885 1869 3070 3581 3536 3098 3782 4330 3721 3308 5071 4265 3161 3282 4039 3923 4178 4741 5633 5063
320 5063 4337 4511 3967 3807 4088 3597 2377 1225 1170 1734 754 773 1832 619 -811 -619 227 -673 -1013
339 -1013 -154 -935 -1949 -2836 -2435 -2182 -3490 -1859 -1943 -2961 -3659 -2426 -3582 -4509 -3052 -3955 -3525 -4964
357 -4964 -3957 -3465 -3319 -2886 -2974 -1801 -2724 -2571 -1359 -1239 -1542 -246 -361 -823 -915 -611 181 239 624 1382
377 1382 1039 717 780 2026 1781 2453 2584 2604 2203 2970 3183 3264 2585 2958 3660 2780 2459 2958 3468 3600 2762
398 2762 3137 2807 1445 1384 2103 1917 1607 1960 1873 718 566 1614 1208 105 -5 -289 -175 -1103 -562
417 -562 148 -1522 -1506 -1274 -1550 -2162 -1562 -1953 -2199 -1863 -1716 -2081 -2604 -2636 -2872 -2168 -2660 -2281 -1309 -1745 -2458
438 -2458 -2665 -1542 -1331 -1984 -1420 -1787 -1447 -721 -1092 -1035 -1050 -272 -221 -518 -86 897 698 -54 586 955 875
459H75K19L43j22r1K04J36R5rn1P99m0l40J45L3m77n2M56j51o64k19N79k44k88
482A136p5O09k11m61Q2n68j40m88J22M58L04m14l2M9n41m31l4K11p72J068o55
503g83j56r7K85q31K0k95N75m37K71J77mN2K53j16l70k10N50k51k34M33O86n71
525a053j83O12k8j66J1N25J16J71J40j81r6j74N1M28k86L93L41K06k38J38n6k08
547D63j16M02K50j96%J94j28o58M79m9p7k1L44M30o69P1Q8n31K47J59J16j06j29
570E63K46j83l20j21M48j31m61j34L39j88N6k45rk44j82M08M20k92q4J01l58m09
592g80L04K18l60L25P6k95j31k4K23m20J83L48j1m63j99O86m2l00M10K47r94N42
614d57J63R8K7J48J41m54l0k86N43o0J79j74n46M72M40J25j94l99N95j74l51J88
$$ plain form
459 875 1094 1437 1315 1224 1428 1564 1659 1650 1599 2398 2358 2018 2163 2196 1719 1667 2123 1972 1308 1089 1668 1424 1136
482 1136 1061 1670 1459 998 1080 512 372 -116 6 464 768 354 322 371 -170 -601 -635 -424 -1196 -128 -783
503 -783 -939 -1036 -751 -1582 -1562 -1857 -1282 -1719 -1448 -1271 -1275 -1223 -970 -1086 -1456 -1666 -1116 -1367 -1601 -1168 -482 -1053
525 -1053 -1236 -624 -652 -818 -807 -282 -166 5 145 -36 -132 -306 -255 173 -113 280 621 827 589 727 671 463
547 463 347 749 999 803 803 997 869 211 690 641 564 543 887 1317 648 719 807 276 523 682 798 692 563
570 563 809 626 306 185 633 502 41 -93 246 58 114 -131 -140 -384 -566 -158 262 -30 -114 -13 -371 -780
592 -780 -476 -258 -618 -293 -217 -512 -643 -667 -444 -864 -681 -333 -344 -807 -1006 -320 -362 -662 -252 -5 -999 -457
614 -457 -294 -196 -169 -21 120 -334 -364 -650 -107 -167 12 -162 -708 -236 204 329 135 -264 331 157 -194 -6
636fM14L08q76N73j85J60j65N82j253J427m22n91L33k86L92R46m44j219J251o2
656H77P3j022R73k08j65o63N65j49o84J236L63m61k63m87o9M2J94O04o3k51l95
677D7M96k37n92L79p7r2m43O68k32M19n06J86M9j90J49k04K79l19Q17p86M4j1
699a56qm15K38q8K99j60k25K16J87k73j94J11J02k92j52N09j95j89K76P5j1n4
721c99L53m89o5L55J35l01j03L41m6j4J53K87n26K83L18j22j79rJ79j96M9K48
743B52q7K18m1P8j73P8j40j64P2J51o2K18p7K80l81K53j50q0J55k96K3J92j73
766A46l19L08j06J74N8kJ9k65K61P0j31K6j4j80j07M8J16J25k81j49K00K8j15
789i0J39J61j94j41kl9j64j09K62k39k3Q7P3J66J2k34J78j43J0j95R0J1j99J40
$$ plain form
636 -6 408 716 -160 413 228 388 223 805 -448 979 557 -34 299 13 405 1351 907 -312 939 877
656 877 950 -72 901 693 528 -135 430 281 -403 833 1196 735 472 -15 -84 -42 152 756 693 442 47
677 47 543 306 -286 93 16 -76 -519 149 -83 336 -170 16 65 -125 24 -180 99 -220 597 -189 -145 -156
699 -156 -164 -579 -341 -429 -130 -290 -515 -299 -112 -385 -579 -468 -366 -658 -810 -301 -496 -685 -409 -334 -345 -399
721 -399 -46 -535 -600 -245 -110 -411 -514 -173 -219 -233 -80 207 -319 -36 282 160 -19 -28 151 -45 4 252
743 252 165 383 342 420 247 325 185 21 93 244 182 400 323 603 222 475 325 245 400 104 127 319 146
766 146 -173 135 29 203 261 259 278 13 274 344 213 239 225 45 -62 -14 102 227 -54 -203 -3 25 -90
789 -90 49 210 16 -125 -127 -166 -330 -439 -177 -416 -439 -352 -279 -113 -101 -335 -157 -300 -290 -485 -395 -384 -583 -443
813d43K04j9j85Q5L8K26q7N8j5K42k44j3q6N4j00J27k04J00K49j93J19k4m0Q2
837f9R9L28k83l5R5j42L7L4K39K2K43l65K53k17j46O2m2j91J82N5J60M4J17k7
861D53K9j99O9r4K86q1k86P4k41L10q9J19k07JK08n81N86j66k7p1J6o9J17l32
885a75K5k65K45j17q0R1n1L56k45K46o3k23j73r3j12J89j35L19k21q5K81j19p2
908d77j08J92R3O4l76L30k52K79J90j40j73K1QN5K68N4o6r6rJ05J78r5jj76K26
933I4L6l3J8q0L36L10l65O9P2J92k47p5j30L15k22K69q8j31J07m6J28l18K18m31
957bM50q9p0J47j90RK7j12j3J65o6J66l63J20j88o7K03k98j29K36l5J82k37k92
981d46O5K72l5j11L0j02p4K01o2k37J09l09J59J92l2m9J81KJ2j60K45M3l34L70
$$ plain form
813 -443 -239 -258 -443 -358 -320 -94 -181 -123 -138 104 -140 -153 -239 -185 -285 -158 -362 -262 -13 -206 -87 -111 -151 -69
837 -69 30 358 75 40 135 -7 30 64 303 325 568 203 456 239 93 155 113 -78 104 159 319 363 480 453
861 453 482 283 352 258 544 463 177 251 10 320 231 350 143 144 352 -229 357 191 164 93 109 40 157 -175
885 -175 -150 -415 -170 -287 -367 -276 -327 29 -216 30 -33 -256 -429 -522 -634 -445 -580 -261 -482 -567 -286 -405 -477
908 -477 -585 -393 -300 -236 -612 -282 -534 -255 -65 -205 -378 -357 -349 -294 -26 28 -38 -134 -143 -38 140 45 44 -132 94
933 94 130 97 115 35 371 681 316 385 457 649 402 327 197 512 290 559 471 340 447 401 529 211 429 -2
957 -2 448 359 289 436 246 255 282 170 157 322 256 422 59 179 -9 -76 127 -171 -300 -64 -99 83 -154 -446
981 -446 -381 -109 -144 -255 -225 -327 -401 -200 -262 -499 -390 -699 -540 -348 -380 -429 -248 -246 -234 -394 -149 -106 -440 -70
1005g0l16L4j49L04J72P2k10N5l3k8k9K62o1l4j71L20j75n6K70k5J00J28M6m9
1029C57q9J38j66Q3k9q4p7n2ML12j91K11n7j5j98J44K47m65M46l01m2m0O9k86
1053h1N58j12m06M11m57L57j22q6K76l34L42k37J14n62m56J288l03l10M38k22
1073I6j0m55J2k82P0J08P55n82m50P99o56O64P9l19k12J53J22p1K40j42K38l62
1095b05k67L03R5J37n88M07j43j9K90j14J54k46J15J41m3j9p0O5j23L70j20k38
1117a18j16j6J42j21K76j48J04k30K03N4P1O2l6J70k03J71k58N1J95j19j36K12
1139B10K8J14k40J10J09N9j35j36L25N7l32Q4Q9l66M5O4K60j67rJ1k40P9j6J46
1163A49j0q2p0l0J36j42L04O9l75m4M30k70k60L19k87K5K9l6q2Q4j1l13K85p9
$$ plain form
1005 -70 -386 -352 -501 -197 -25 47 -163 -108 -141 -169 -198 64 3 -31 -202 118 -57 -113 157 132 232 360 406 357
1029 357 268 406 240 323 294 210 133 81 85 397 206 417 360 345 147 291 538 73 519 218 176 136 205 -81
1053 -81 477 365 -41 370 -87 270 148 62 338 4 346 109 223 -339 -795 493 190 -120 318 96
1073 96 86 -369 -357 -639 -569 -461 294 -288 -738 61 -595 69 148 -171 -383 -230 -108 -179 61 -81 157 -205
1095 -205 -472 -169 -74 63 -525 -118 -261 -280 10 -104 50 -196 -81 60 17 -2 -72 -7 -130 240 120 -118
1117 -118 -234 -250 -108 -229 47 -101 3 -227 -24 30 101 163 127 297 94 265 7 58 253 134 -2 210
1139 210 238 352 112 222 331 390 255 119 444 501 169 253 342 -24 21 85 345 178 169 180 -60 19 3 149
1163 149 139 57 -13 -43 93 -49 255 324 -51 -95 335 65 -195 124 -163 -138 -109 -145 -227 -143 -154 -467 -182 -261
1187b61J14K8rJ03j67O4k67J74K5J8J02j92J69o5k8m9J66k52K85J27j12j62M9
1210a40J00k53J04K81j08n2J52j77J76m1O9n6p8M3P5j6k07N9K69j0q7p1kJ71P
1235B08k03J44J10j76K0K64m32K56M1j70P6L47k08j75q9J22J92l05N23j10k92
1256A43J20j11O8l01J79m57J85L01l8O01j199J00O36K23q00M15J15l23j94N1O03
1277C17j42r0l10l8L2j7K29l15J62Pr7LQ6J92Qj57Q7j05K7l02K13j77J79K0l3
1302b21L34k64o6J90j8k71J72P1k16K04K6R2O0j02n6J33j1j29J72k0k0k07K37
1325I0k64J61J23k3R1j87K08j63j92K39J61r7j32J65k2j52K72J8j17M5n4J3k24
1348d1J12j06K17k19L29o6k76N9K33j58k33R2N4J0p1K23Nk48j38P2L6M5o2j60
$$ plain form
1187 -261 -147 -119 -128 -25 -192 -128 -395 -221 -196 -178 -76 -268 -99 -164 -192 -241 -75 -327 -42 85 -27 -189 -140
1210 -140 -40 -293 -189 92 -16 -68 84 -93 83 42 111 55 -23 20 95 79 -128 -69 200 190 103 32 30 201 208
1235 208 5 149 259 83 103 367 -65 191 232 62 138 485 277 102 13 135 327 22 545 435 143
1256 143 263 152 220 -81 98 -359 -174 127 89 690 -509 -409 227 450 -350 65 180 -143 -337 -286 317
1277 317 175 85 -225 -263 -231 -248 -19 -334 -172 -165 -262 -259 -173 19 27 -130 -43 -148 -121 -423 -210 -387 -208 -188 -221
1302 -221 113 -151 -217 -27 -45 -316 -144 -73 -289 -85 -59 33 93 -9 -65 68 57 -72 100 80 60 -147 90
1325 90 -174 -13 110 87 178 -9 199 36 -156 83 244 147 15 180 158 6 278 296 179 224 170 183 -41
1348 -41 71 -35 182 -37 292 226 -50 9 242 84 -149 -57 -3 7 -64 159 164 -84 -222 -150 -114 -69 -131 -291
1372b91J51J30m00K21J62l16K23L5M9l15K68J49l54q4K66p8j39K81nm61K97J00
1394a11Pm77M85Lq7j3o5M52q7l50R9K6j14N3M24k7j95k3N2Om0R8J24J30k25N4
1420A99r5J71Ok38J83%J84l07J10j4J61k83r0L49j27j89J16N8O4ml6j99k1J47
1444A45J25k10j72K9J57p3N6L2k68n1K52N2k31R1j18J11j18k7n5Q19j160j72P92
1467FJ36k36n20P6K69N10J2k19l00K59K7J72p30k6K63R1l78P66o78N93l6qk01
1490a52q5J94R4kp0p6j14J6j38J41M01j00M56l22l89L89o15R53m40J35J91n57
1512i0J5R38j116j01O69k74J94m7l26K59k57q4L64l66M75m47RM50j22l33J2K20
1534D2J86l64P46p90M9l85M23J36k13P9qr9m33Q72r00O04lJ02K23l00n48J84l98
$$ plain form
1372 -291 -140 -10 -410 -189 -27 -343 -120 -85 -36 -351 -83 66 -288 -372 -106 -184 -323 -42 -47 -508 -211 -111
1394 -111 -104 -581 -96 -93 -180 -193 -258 194 107 -243 -144 -118 -232 -179 245 218 23 0 52 58 18 116 240 370 145 199
1420 199 104 275 281 43 226 226 410 103 213 199 360 77 -13 336 209 20 136 194 258 254 218 19 -2 145
1444 145 270 60 -112 -83 74 1 57 89 -179 -230 22 74 -157 -66 -184 -73 -191 -218 -273 546 -614 -786 6
1467 6 142 -94 -614 -538 -269 241 253 34 -266 -7 20 192 -538 -564 -301 -210 -588 178 -500 93 57 49 -152
1490 -152 -237 -43 51 49 -21 -97 -211 -195 -333 -192 209 109 565 243 -146 243 -372 581 141 276 467 -90
1512 -90 -75 863 -253 -354 315 41 235 188 -138 121 -136 -220 144 -222 253 -194 -185 265 143 -190 -178 42
1534 42 228 -136 610 -180 -131 -516 -93 43 -170 -91 -99 -198 -631 241 -659 -55 -58 44 267 -33 -581 -397 -795
1557g95O98M90j02l68J74n87k81O59L2o64M90M06L5j46L42k39J99m16K58L56o16
1578g5M63q19R81m43M56j41R1r39L87K45Rj27j36J57L16m58N9m0P2m3j77L72n93
1601c83O98n54M91o55K52m28l02Q17L33j85l71Q0R6o10M94j51K51j0o33P91n86
1622e65M97oo00O06j25l71R0R7J68n26N44n1M50m04N64n42N40l35M4j9r1M11o57
1645b81O09n1M6J51l31j67K38J50K21k69K10k04R6j38k15M78o3j20n9j28M48m23
1667A98R5n3Po4l04L34j59K3P8j7l54P8L8l74j7J05m0J37k57L02l45J05Q8K64
1691a32l0k99J0P8Pj87j24j8J87m9K5j26J64J69J13k36L80k74P7N9L62m4j56o
1715e0l0J37r8J57k5P5J12k13K36P9j19L37k53J07K06p8K43k62Q8M1j27j19m8
$$ plain form
1557 -795 -97 393 291 -77 97 -490 -771 -112 -80 -744 -254 152 187 41 383 144 343 -73 185 541 -75
1578 -75 388 -431 550 107 563 422 513 -426 -39 206 215 88 -48 109 425 -33 26 -14 58 15 -162 210 -383
1601 -383 315 -239 252 -403 -151 -579 -881 -64 269 84 -287 -207 -111 -721 -227 -378 -127 -137 -770 21 -565
1622 -565 -68 -74 -674 -68 -193 -564 -474 -377 -209 -735 -191 -242 208 -196 368 -174 366 31 75 56 -35 376 -281
1645 -281 328 277 323 474 143 -24 214 364 585 316 526 322 418 280 65 543 480 360 301 173 621 198
1667 198 293 240 247 183 -121 213 54 77 155 138 -216 -138 -100 -474 -491 -386 -426 -289 -546 -244 -589 -484 -396 -132
1691 -132 -162 -461 -451 -373 -366 -553 -677 -695 -508 -557 -532 -658 -494 -325 -212 -448 -68 -342 -265 -206 156 112 -44 -50
1715 -50 -80 57 -41 116 91 166 278 65 301 380 261 598 345 452 658 580 823 561 649 690 563 444 396
1738C96K48j02j30p1K45j85j1J89j87m01K65Q4k47k58M76j68P1K7l82L21m30N23
1760B73n11l2jj62K9j20j30J06j75N5K33j09O9j67J0R1j97O4J51l33N9J85O3q7
1784f36J11J8J19n5P6k6j19O2L11j25r9J91L11k19J73K7P0J04j73K99l2q8K19
1807E19j03J7J44j10K47j81K8j12r2M09k54J0R2n6j36%j11L93j69j2q6j13J3N4
1831C91k40j50K76l64J95j88M4k26J58Mk78K19P1k20r8q1j13K31l8j78M05l78
1853e58j77J83J23l3Qk31K08j76J49J05j98P2M4K82k23K50M5m43J64K95j59J3
1875b57P3J06j9L7l7J80m8O2K05J01j15j35R2J69j66M7K50K8q0j42L10M6k40J70
1899F37K2j00l50N11q1j43k41K25o4l49L08j66j34N3O8k13J48r7J7J31j15l23
$$ plain form
1738 396 644 542 412 341 586 401 390 579 392 -9 256 340 93 -165 311 143 214 241 -141 180 -250 273
1760 273 -238 -270 -271 -433 -404 -524 -654 -548 -723 -668 -435 -544 -475 -642 -632 -541 -738 -674 -523 -856 -797 -612 -549 -636
1784 -636 -525 -507 -388 -443 -367 -393 -512 -450 -139 -264 -363 -172 139 -80 93 120 190 294 121 420 388 300 519
1807 519 416 433 577 467 714 533 561 449 357 766 512 522 614 558 422 422 311 704 535 523 437 324 337 391
1831 391 151 1 277 -87 108 -80 -36 -262 -104 -100 -378 -159 -88 -308 -406 -487 -600 -369 -407 -585 -180 -558
1853 -558 -735 -552 -429 -462 -454 -685 -477 -653 -504 -399 -597 -525 -481 -199 -422 -172 -127 -570 -406 -111 -270 -257
1875 -257 -184 -78 -97 -60 -97 83 35 97 302 403 288 153 245 414 248 295 545 573 493 351 661 707 467 637
1899 637 659 559 209 720 639 496 255 480 416 67 375 209 75 128 196 -17 131 34 51 182 67 -256
1921b56K94j01k03j61J63J61j64r5r5K84j61M5k8j58M2n8p6M0j06L08J94m37J06
1944d62J03J13n0R1q5Nl0J55n7r2K05k71M21k8r0q9J04L70P1Lm7J11k97J02j01
1969A55J16j6q1K92j94J08j09LK10j00K0k79J76j22K10j30J30j6l53K58k46n1
1991a9J45j37M9j6l2j18K79j44m07L74j22l3r3m8J12O1j34J10J1p1p5j21L8q3
2015d74K93N3j77K15j09Q2j9Q0j16K19k47J32j02j94K34n4L15j55r8M27m02R68
2037H71n15M09l84Q3P9m16N18m63N3j39L08l10J02J51n5j54J74m6k87K30q5m7
2059G7J16J41k66o3r7L39j80n9l0K02j15J01j47j17l5J14k6n6K9m5m3p1r0K19
2083a02o3k22K88j88n5j3P9q5J32q7Mj27J41K4P4k36L74k22N5K60K66k56j24J60
$$ plain form
1921 -256 38 -63 -266 -427 -264 -103 -267 -362 -457 -173 -334 -289 -317 -475 -433 -491 -567 -527 -633 -325 -131 -568 -462
1944 -462 -359 -246 -296 -205 -290 -285 -315 -160 -217 -309 -104 -375 46 18 -72 -161 -57 313 384 387 340 451 154 256 155
1969 155 271 255 174 466 272 380 271 274 484 384 404 125 301 179 389 259 389 373 20 278 32 -19
1991 -19 126 -11 38 22 -10 -128 151 7 -400 -26 -148 -181 -274 -322 -210 -149 -283 -173 -162 -233 -308 -429 -391 -474
2015 -474 -181 -128 -305 -90 -199 -117 -136 -56 -172 47 -200 -68 -170 -364 -130 -184 131 -24 -122 305 -97 871
2037 871 356 765 381 464 543 127 645 182 235 96 404 94 196 347 292 138 312 266 -21 209 124 77
2059 77 193 334 68 5 -92 247 67 8 -22 180 65 166 19 -98 -133 -19 -45 -101 -72 -117 -160 -231 -321 -102
2083 -102 -165 -387 -99 -287 -342 -355 -276 -361 -229 -316 -312 -439 -298 -274 -200 -436 -62 -284 -229 31 297 41 -83 77
2107G7o6k5J1J66Q7nk73Q3J98m7j75Q5J03k7J75J11k02o1J63r8pJ39j55J48K1
2132D26o0k95K48k16M4N6J57o7j6j27p9j75R6K45k22L3m1q3P0o7n8L8R7j04p5
2157a75k48K78P0j95J4J8j45K93j94j68N9L65j66l42N9J18o6M20k35j01K33q9
2179a97L5p1j09K26j84J53R0m7o1K29M4M2Q9M7k22j02J68K05j65j22j2p5K93q2
2203A72J81k8j48J67j36N9j61N5M7r4K08l31N47k79j32k8O9l91M74j11R0r1j87
2226d8K72j20j05M0K1j39j35R0l6L1n9k7Q3R9J6n5j78Q3J68k98L52l04pJ64j91
2251b83M11k91j5J53j23j04K05m04N48l44K71Rk08J59J50j35j0j78J26Ko7J90
2273F2l86M58k74J64P7P5j33n7o3J88q2K30l27L95m72R2J44L0J34lO5k89%J17
$$ plain form
2107 77 11 -14 -3 163 250 245 -28 55 253 206 31 116 219 192 367 478 276 215 378 280 273 412 257 405 426
2132 426 366 71 319 103 147 203 360 293 277 150 71 -104 -8 237 15 48 7 -76 -6 -73 -131 -93 4 -100 -175
2157 -175 -423 -145 -75 -270 -256 -238 -383 -90 -284 -452 -393 -28 -194 -536 -477 -359 -425 -5 -240 -341 -108 -197
2179 -197 -162 -233 -342 -116 -300 -147 -57 -104 -165 64 108 150 239 286 64 -38 130 335 170 48 36 -39 254 172
2203 172 353 325 177 344 208 267 106 161 208 114 322 -9 538 259 127 99 168 -223 251 140 230 139 -48
2226 -48 224 104 -1 39 60 -79 -214 -124 -160 -129 -188 -215 -132 -33 -17 -72 -250 -167 1 -297 55 -249 -256 -92 -283
2251 -283 128 -163 -178 -25 -148 -252 -47 -451 97 -247 24 33 -175 -16 134 -1 -11 -189 -63 -61 -128 62
2273 62 -324 134 -140 24 101 176 43 -14 -77 111 29 259 -68 327 -145 -53 91 121 255 252 317 28 28 145
2297A45J38l21J77l7J11k7k96L37J12l08J36l1R1j19R3m89K77J26o9M2j37L2k37
2320b54M45l3m1q5r2l8L40q2j76K7j11k6j59J00M39k69j57M8J74J62j35j16l62
2343d01M07j13J60Q6n29K61K8K1qj09L7L8J27n4J94l99J14O4r6J21R6p4M4j24
2367a09R9l6j12J17n5O3j49J68K17L1k42q8O6M2O5j89K72k50J11J22j32J75j56
2390C0L9n1j04L7J7K73l69J24l5J1J09J00q6j58j31J23J36l9j30K09N5m7J06j46
2414G3O1l15Q4L00k28K7J17o0J1J44k66r4L52j92N7N5l06M79n09K74k3j20L9k84
2438c24L83j13kJ31k68J80Q5q2K62n23Q0P0K20k36j17L34k37J26J3J00K2j58k61
2461c15L56J9q9j17K05J3k8O6j38m3J43j57K21m5l14K82L2r2J32j5j25J14j1p8
$$ plain form
2297 145 283 -38 139 102 213 186 -110 227 339 31 167 136 227 108 201 -288 -11 115 46 88 -49 -17 -254
2320 -254 191 158 117 32 -60 -98 242 160 -16 11 -100 -126 -285 -185 254 -15 -172 -124 50 212 77 -39 -401
2343 -401 6 -107 53 139 -390 -129 -101 -80 -88 -197 -160 -122 5 -49 145 -254 -140 -76 -172 -51 45 -29 15 -109
2367 -109 -10 -46 -158 -41 -96 -33 -182 -14 203 234 -8 -96 -30 12 77 -112 160 -90 21 143 11 186 30
2390 30 69 18 -86 -49 -32 241 -128 -4 -39 -28 81 181 95 -63 -194 -71 65 26 -104 105 160 113 219 73
2414 73 134 -181 -97 203 -25 2 119 59 70 214 -52 -146 206 14 71 126 -180 299 -210 64 41 -79 -40 -324
2438 -324 59 -54 -56 75 -193 -13 72 -10 252 -271 -191 -121 99 -137 -254 80 -157 -31 -18 82 104 -54 -315
2461 -315 41 60 -29 -146 59 72 44 110 -28 -71 72 -85 136 91 -223 59 91 -1 131 116 -9 105 94 16
2485A6O2j69J05L8j75N1P5M0J95j49j3p3J87J75m01J07k18K01Nk8N0j9K07j80
2509H9k29k3L01k73R2J77q0O0j89N6M3j86K52j48J33j52k97M14R6j59K27j51j64
2532a11Q2J87k20m7J70j68K9lj70M1M09k97k6KPj7RJ47j12L9J26Nj07j29m0J33
2558f1n7O6q6Q0j4l32N79l03K39j17l9j58lK51L9r7r7j52N53j92k54J69m7k58
2582b91M39k02L03j17j31Q9j1L6J3j10M8J21k44J33j34J23j73K47N9j86j07J31
2604C6O7L5m3LQ8j08Mn4k14K76Mj35J74l35J36K67k29K09J07k40J28m9O1k26j17
2629a55K29j47n2J47j8r4k93L75k02Lj07M31J87m77N2J44j58J25j02j03J76M8
2651Ik19M0J07j63J23k28L99oo4l6j33J88R1j84J26J8k7k0k14J35O7J05k39J01
$$ plain form
2485 16 78 -91 14 52 -123 -72 3 43 238 89 76 3 190 365 -36 71 -147 54 59 31 81 62 269 89
2509 89 -140 -163 138 -135 -43 134 54 114 -75 -19 24 -162 90 -58 75 -77 -374 40 136 -23 204 53 -111
2532 -111 -29 158 -62 -109 61 -107 -78 -81 -251 -210 199 -98 -124 -122 -115 -132 -123 24 -88 -49 77 82 -25 -154 -194 -61
2558 -61 -118 -52 -138 -58 -72 -404 175 -128 111 -6 -45 -203 -206 45 84 -13 -110 -262 291 99 -155 14 -33 -291
2582 -291 148 -54 249 132 1 90 79 115 128 18 66 187 -57 76 -58 65 -108 139 198 12 -95 36
2604 36 103 138 95 98 186 78 82 28 -186 90 94 -41 133 -202 -66 201 -28 181 288 48 176 127 188 -38 -155
2629 -155 74 -73 -125 22 4 -90 -383 -8 -210 -207 -314 117 304 -173 -121 23 -135 -10 -112 -215 -39 9
2651 9 -210 -170 -63 -226 -103 -331 68 62 -2 -38 -171 17 108 -76 50 68 41 21 -193 -58 9 114 -125 -24
2675b4J03Q0j20J23k00p1N6j0J06K63q0l78j4L87j51J05m43m19J117j291Q68J06
2697A13n5K19m31K46l4j17J88m9M7m24J64J51M0m1O2Q8P1r5j31q3j91K86j27p7
2721a80J80Qr8K84k91m6J40J93j90Rk0R1j84k1j63L0L08j97K0l4n2K59j72J92
2745F6m80K36J93k12J62J33q3n8Q6kJ95l53K68l5J68k47j33K92n9j15o4K72m56
2768b26J96l9L6L5R9j45J43k64M49l11K5j18j43J89J5K55m17J13K49m43M07N5
2790A60j01J48j47O9J11k23j60L32r0j18K6r5j9J28J9l3J5j25K50k88L31p0j02
2813A8r6J54j6j75p5J47j92J88K4j83L36m02L27j94k7LJ69j94R2K01k95M8L15
2836A73m36K85o7Ok83N60j32j14L1j19m4n6M54k90j8n6R1m8Q3q6l0J54j60j07
$$ plain form
2675 -24 79 159 39 162 -38 -109 -53 -63 43 306 226 -152 -166 221 70 175 -268 -687 430 -861 7 113
2697 113 58 277 -154 92 58 -59 129 80 127 -297 -133 18 58 17 79 167 238 143 12 -71 -262 24 -103 -180
2721 -180 0 8 -90 194 -97 -143 -3 190 0 9 -11 80 -104 -125 -288 -258 50 -147 -127 -161 -213 46 -126 66
2745 66 -414 -178 15 -197 -35 98 15 -43 43 41 236 -117 151 116 284 37 -96 196 137 22 -42 230 -226
2768 -226 -30 -69 -33 2 101 -44 99 -165 284 -27 -2 -120 -263 -74 -59 196 -221 -108 141 -302 105 160
2790 160 59 207 60 129 240 17 -143 189 99 -19 7 -88 -107 21 40 7 22 -103 147 -141 190 120 18
2813 18 -78 76 60 -115 -190 -43 -235 -47 -23 -206 130 -272 55 -139 -166 -163 6 -188 -96 105 -190 -142 173
2836 173 -263 22 -45 -39 -322 238 106 -8 23 -96 -140 -196 258 -32 -50 -106 -15 -63 20 -66 -96 58 -102 -209
2860b09K60J53O0k31R5k48J89k7L3o5J70j4k07J12j70J88j85J74R0r7q2J35k11
2883h7L03j38p6j05K70K33k84n2m02N8K70L5j27K95j64M79p54L86K08l81n89N87
2905c5l4K92j23m8j17L96m34K08q0k79N07k75J63j2l62J93J53n65J58r4L87J67
2927A66k83p0J09l62J28K45j1K36n61M18o6k6k38O38o47K12J82J46k09k68N06
2948B45l18j3N0Q7l83K10j33M04m00J38J80K3j60j6J8jJ9J13k59K21J4q9K3J00
2972G3j49J43j67M47k55J72k50J17j38j07N9Qj37K38O4l19J1J28k1q1K28rJ4j77
2996a08k8L43o9k40K67l06j58J80R1J9L83l97J0k45L61K8m17L31j70J6j36M24
3018A79l50M06Jk81j02N5J31K41m00K55j21L6j16q9K60l38K88j32J90l30K94P6
$$ plain form
2860 -209 51 204 264 33 128 -120 69 42 75 10 180 166 -41 71 -99 89 -96 78 168 71 -11 124 -87
2883 -87 216 78 2 -103 167 400 116 64 -338 -280 -10 25 -102 193 29 508 -246 140 348 -33 -622 -35
2905 -35 -69 223 100 52 -65 331 -103 105 25 -254 253 -22 141 129 -233 -40 113 -452 -294 -388 -1 166
2927 166 -117 -187 -78 -440 -312 -67 -78 158 -403 15 -51 -77 -315 323 -324 -112 70 216 7 -261 245
2948 245 -73 -86 -36 51 -332 -122 -255 149 -251 -113 67 90 -70 -86 -68 -69 -50 63 -196 25 39 -50 -27 73
2972 73 -76 67 -100 347 92 264 14 131 -7 -114 -55 -47 -184 54 118 -201 -190 -62 -83 -164 64 55 69 -108
2996 -108 -136 207 138 -102 165 -141 -299 -119 -28 -9 374 -23 -13 -258 103 131 -286 45 -125 -109 -245 179
3018 179 -171 235 236 -45 -147 -92 39 280 -120 135 14 50 -66 -155 105 -233 55 -77 113 -217 77 153
3040A53k40L2K53k25j06J65J79p1l04J30O1q0P8o0k02M11k99jL24Jj68L61j58
3063B34l51k5K98J2q8l7K22l35j23L05n9p6R6p5j26J36J7L5j55K63J26q6k68K15
3087A55q2O2q1r3J08k48M45k24m6j14Lm1K34n5Q9k00j3O0K4L4k42J83j76J11K33
3112A26m07L83j92n0P7M4l72K99J32L0j94K70j61p3j74N1L2J48nJ01j95K78l43
3135a95J2P1j26M27n61M57l07K27km1j51L18jl36J10K06N5Qj62j41P6L9J63P2
3159B18J73m43n2qJ05J80J5l21K74j80o1L86l11J08j31k2J54j31R3O8Q6k28R6
3182F8j30L13k28J14j02k44j71K64K41n1j55P5O3L8L6o6k19N1j45K6K72j8Mj02
3206f6m4K13q4r4L72l19P1o1p5J53j03K70k29Q2k46J92n7j04J81k82J96J47J13
$$ plain form
3040 153 -87 -55 198 -27 -133 32 211 140 -164 -34 27 -53 25 -35 -237 174 -125 -126 198 199 31 392 234
3063 234 -117 -142 156 168 80 43 265 -70 -193 112 53 -23 73 -2 -128 8 25 60 -95 168 294 208 -60 155
3087 155 73 135 54 -39 69 -179 266 42 -4 -118 -115 -156 78 23 112 -88 -101 -41 -17 17 -225 -42 -218 -107 126
3112 126 -281 102 -90 -140 -63 -19 -391 -92 40 70 -124 146 -15 -88 -262 -211 -179 -31 -36 65 -130 148 -195
3135 -195 -183 -112 -238 189 -372 85 -222 5 3 -38 -189 129 128 -208 -98 108 163 171 9 -132 -56 -17 146 218
3159 218 391 -52 -104 -112 -7 173 188 -133 141 -39 -100 286 -25 83 -48 -70 84 -47 46 114 200 -28 68
3182 68 -62 251 23 137 35 -209 -380 -116 125 74 -81 -6 57 95 131 65 -154 -103 -248 -222 50 32 36 -66
3206 -66 -110 103 19 -75 297 -22 49 -12 -87 66 -37 233 4 86 -160 32 -25 -129 52 -230 -34 113 226
3229B26l77J11l4r9M1J73j1j41J45Q6k35L2M54m00M11m75j80L85l1l17K81K18
3251B63l89J99K86r6l0m98K47J27j11j19r1K79K57J72k62N44q62J84n13N90j0
3272A67k05m20K98j43K16L94j2M6R5k87r03P86J80n43M35L50o15m1j93j57O20
3293F8l64M53m04K55k8Q8k33m54M16j16K43K07m09M94l31k14j50Q06p52J91r6
3314c30J078j423J67J33M07O4n76K94k92L90j98k6j7k80m7O83J15l02l94R06l15
3335C7J25j159P19L32k1j45J16K58k41o1J78k45P2N6J11j77P44j183M54k32K03
3356e9N85j80k60J04j12n16L80k65K85J77m65l35L9N2N19l64P52r13J60l1J54
3377b93O53r75P63n12M49k97j41M46m49J11j03N64o40R11k35N43M5j117P54o44
$$ plain form
3229 226 -151 -40 -74 -173 -132 41 30 -111 34 120 -115 -83 371 -29 382 -93 -273 112 81 -236 45 263
3251 263 -126 73 359 263 233 -265 -18 109 -2 -121 -212 67 324 496 234 778 -84 100 -413 177 167
3272 167 -38 -458 -160 -303 -87 307 295 341 436 149 -754 32 212 -331 104 454 -161 -202 -395 -552 68
3293 68 -296 157 -247 8 -20 68 -165 -619 -203 -319 -76 131 -278 216 -115 -329 -479 327 -425 -234 -330
3314 -330 748 -675 -508 -375 32 96 -480 -186 -478 -88 -286 -312 -329 -609 -656 27 142 -160 -554 352 37
3335 37 162 -997 -278 54 33 -112 4 262 21 -40 138 -107 -35 21 132 -45 699 -484 -30 -262 -59
3356 -59 526 346 86 190 78 -438 -58 -323 -38 139 -326 -661 -622 -570 -51 -415 337 -576 -416 -447 -293
3377 -293 360 -615 148 -364 85 -212 -353 93 -356 -245 -348 216 -424 487 252 795 840 -277 477 -167
3397a67L91o61P69m5r36J024q66P14p71j05M50J030p03j78K31N22l16J67j68k19
3417A63l57L02R3k49J54k62j31J91j59K65k76J56K47k19L09k48q6k9L61m13j21
3438c09L37N2kj29K6P7j18K59l74J21J56n1J99k50M0M6Lj39J60r3j6J40j80J48
3462A03R7k1j73j92J43J34k94L05p3J06k7r2L22l27J77j71L1j76K6P9K58k04J28
3485A59j51J08o4m6ln8k48O2J23k0J18r4l8J68j05J95j56j27R0J4j65J02Q9j76
3509b23J67K02j48OL3K8k40L6J6O7M1P5k58K35m33M93L1O0k32j92K66j82J17j68
3533b03L89k96K84l00R4L72j47n4J23J1k68J28M15n86k70L76q4M27m44J13j48
3554f8J22k5J90k22J40lo3J04j14p9J3m0L03k14k2j26J79l5Q7m6k68j4q4K93j05
$$ plain form
3397 -167 224 -437 332 287 -649 375 -491 223 -548 -653 -203 827 124 -54 177 699 383 550 382 163
3417 163 -194 108 201 -48 106 -156 -287 -96 -255 10 -266 -110 137 -82 227 -21 -107 -136 225 -188 -309
3438 -309 28 80 78 -51 -25 52 -66 193 -181 -60 96 45 244 -6 34 80 83 -56 104 11 -5 135 -45 103
3462 103 200 179 6 -186 -43 91 -203 102 29 135 108 16 338 11 188 17 48 -128 -102 -23 235 31 159
3485 159 8 116 52 6 3 -55 -303 -241 -118 -138 -20 -114 -152 16 -89 106 -50 -177 -87 -73 -238 -136 -47 -223
3509 -223 -56 146 -2 4 37 65 -175 -139 -123 -56 -15 60 -198 37 -396 97 128 188 -44 -236 30 -152 -35 -203
3533 -203 186 -110 174 -126 -32 340 193 139 262 273 5 133 548 -38 -308 68 -16 411 -33 80 -68
3554 -68 54 29 219 -3 137 134 71 175 61 -18 -5 -45 258 44 22 -104 75 40 127 81 -187 -201 -285 8 -97
3579i7J63k38M20j63Q4k36r4L41j84M21o49L4k38J009m35q81P39P8L02p07M57
3600A26k97m88L94l46K78N7M96r64P52j25m4Q4M82l96Q5p20J036L88o79L27K30
3621F76n84m44P02J81k00n79J14l9k1L83k70l83P57O4m13J07j29M02L5j332J291
3642C18r8j42qJ42k75K48J14o59R05k86j103M91K27p9R04p80k17j78L40m6L54
3663A72k50j15Q5p20J155q26k41L10L50P13m49j33k92J04O26j061P08N92n29n31
3683c32N89M43o12k62m3n19K85J079J72q82J2j53L06r97M89K95O69m11N2m12K37
3704EM74q58q8M97O81j042M81j31Q9J94m83o6j18J04J45N0q4N0K14p66R19k55
3726A2K63l37NK63p3o4J25m69P3M60k16q1j34K65l12K93k4j89j93P31p22N04J80
$$ plain form
3579 -97 66 -172 248 85 169 -67 -161 180 -4 417 -232 -198 -436 573 138 -743 -4 74 376 -331 126
3600 126 -171 -659 -265 -611 -333 -276 220 -744 8 -117 -161 -77 405 9 94 -626 410 798 119 446 676
3621 676 92 -352 350 531 331 -248 -134 -173 -194 189 -81 -464 293 357 -56 51 -78 324 359 -973 318
3642 318 220 78 70 212 -63 185 299 -360 545 259 -844 -353 -126 -205 699 -81 -298 -476 -136 -182 172
3663 172 -78 -193 -108 -828 327 -499 -740 -430 -80 633 184 51 -241 -137 489 -572 136 728 199 -332
3683 -332 257 700 88 -174 -217 -736 -451 628 800 -82 -70 -223 83 -914 -425 -130 539 128 180 -232 5
3704 5 479 -379 -467 30 711 -331 150 19 108 302 -181 -247 -365 -261 -116 -66 -150 -100 114 -652 267 12
3726 12 275 -62 -57 206 133 69 194 -275 -202 258 42 -39 -173 92 -220 73 49 -140 -333 398 -324 180 360
3749C60m12j36J0RK73l64Q8j16K35j77K12Nm6r3J12j45J79jJ26k76J07J09q8j5
3773d4K57Q0j23j99j7m8J69j08j50K27Jl6L1o0K91j81j05j74K54J14J13k43m13
3796c64M40K6j96q8R3J00k27J29K46k36P4%q5J77k12N8J85k12j80L63m14M50j83
3819e6M0l7J33M4%k30J39J45k98J56O9p8j34J22k64K60K62k37j0M9l27J67P6j57
3843a66L57J37k05K17l80k34J92M2o4J14j65M44j54l21K67P7j85M60J22o01L33
3864B87l69j68J76n7j56M97j92o4M6J5j5K8J68R4n25K73j87l8K36k62J88l9j6
3887h0J80k00J25m42N39m96J99K33l20J53J35k36N8L38l02J46m89K25J84j99N91
3908C42l54O1j77K13R7M9j6m76L37j23L69m69m7J23O1K02j92O7o6J68k13K11k10
$$ plain form
3749 360 -52 -188 -178 -169 104 -260 -172 -288 -53 -230 -18 -13 -59 -152 -40 -185 -6 -7 119 -157 -50 59 -29 -44
3773 -44 213 293 170 -29 -46 -94 75 -33 -183 44 45 9 40 -20 271 90 -15 -189 65 179 292 49 -364
3796 -364 76 102 -94 -182 -89 11 -216 -87 159 -77 -3 -3 -88 89 -123 -65 120 -92 -272 91 -323 127 -56
3819 -56 -16 -53 80 124 124 -106 33 178 -120 36 105 27 -107 15 -249 11 273 36 26 75 -252 -85 -9 -166
3843 -166 191 328 123 340 -40 -274 -82 -40 -104 10 -155 289 135 -186 81 158 -27 433 555 -46 287
3864 287 -82 -250 -74 -131 -287 210 18 -46 0 15 0 28 196 290 -235 38 -149 -187 49 -213 -25 -64 -80
3887 -80 100 -100 25 -417 122 -374 -175 58 -262 -109 26 -210 -152 186 -116 30 -459 -234 -50 -249 342
3908 342 -12 49 -128 85 182 231 215 -261 76 -47 322 -147 -194 -71 -10 192 0 67 1 169 -44 167 -43
3931d3o8K06r7R9J46k44k50K47P9j05J8K4L4l81M88n8k20L69j48j7l29N93l74
3954c1Q0r9K12J55j09l54J1p3M70l20L9k34N13k61l3M40p09K05K79J19o8j56K34
3977C10n28K08k06M2L50l22M05n57j52N99l19J26K02k91K4J82m81J06M30j10l39
3998c21K83m9j08L68R5l97K7P7J11l73J69K59j84jp8K62j0j31j9K59L8m64MK43
4022F0l09M31J81l96r4L4J16o5Q5j69J79j70J44m0K1J08r5K0J97k67N8n9l8k3
4046i1m5J41l4O3j4ml4j39K22j77J37O3Mj91M1J29j25J59j87J37j00O6K20n99
4070c58K32l6J78j5j12N1j33J46J05k13k6J46j03K61j74N0J55k65O3J20K25j60
4092A37j73Rq0N3R3R4n02N54k58Q6j90K29n8p7L85m12J86k24L63k93J09O2j37
$$ plain form
3931 -43 -111 95 -2 97 243 -1 -251 -4 75 -30 -12 12 46 -335 153 95 -125 244 96 79 -250 343 -31
3954 -31 49 -50 162 317 208 -146 -135 -208 262 -58 -19 -253 260 -1 -34 406 -303 -98 181 300 232 76 310
3977 310 -218 -10 -216 -174 176 -146 259 -298 -450 149 -170 -44 158 -133 -109 73 -408 -302 128 18 -321
3998 -321 -38 -87 -195 173 268 -129 -102 -25 86 -287 -118 141 -43 -44 -122 140 130 -1 -20 239 277 -187 -183 60
4022 60 -249 182 363 -33 -127 -93 23 -42 43 -126 53 -117 27 -13 8 116 21 41 238 -29 29 -30 -68 -91
4046 -91 -136 5 -29 34 20 16 -18 -157 65 -112 25 88 92 -99 -58 71 -54 105 -82 55 -45 21 241 -358
4070 -358 -126 -162 16 1 -111 -60 -193 -47 58 -155 -181 -35 -138 123 -51 -1 154 -111 -48 72 297 137
4092 137 -36 -27 -107 -54 39 133 -369 185 -73 13 -177 52 -6 -83 302 -110 76 -148 215 -78 31 93 -44
4115d4j24J47j09K38k06J52J06j20j86R5R2J07j28k83K73Pk5J16r3K13l03n9J49
4138A5MJ10k02J55q5j63K04j33pq3J21J51j68p2J44J27p6j3M7O7j60J52k79j03
4162b47K75R1j37m2J74r5r4j48L52k60k6J31J22O6k26K94l79P7R8M0r0O4j17j03
4186a80J02L42k18J46l0L9j54j5R4r3o7j11J07J55j52J10j04k76J45K62k20K00
4208H2j61J7J32j26K02j96j37J47l6L21k39Nj06Q6J26M4j54m0N2J1l1nJ2o5jR7
4234C7J27j76J90j99J51M5l19L62k70l9q9p0K64k00M22q2j94J35n4k77K06j31
4256a61m7K68j16r2J18p3M28m01L33j24Q6m39J50l77P88k80k01M95m28M07q0m7
4278B07J6o98K65L7N0j47K68o6j68O62k05m96M60j44j25K19j30m5l3R7j48J98
$$ plain form
4115 -44 -168 -21 -130 108 -98 54 160 40 -146 -51 41 148 20 -263 10 17 -8 108 15 228 -75 -134 15
4138 15 19 129 -73 82 -3 -166 38 -95 -102 -185 -64 87 -81 -153 -9 118 42 29 76 143 -17 135 -144 -247
4162 -247 28 119 -18 -60 114 19 -75 -223 129 -131 -157 -26 96 162 -64 230 -149 -72 26 66 -24 40 -77 -180
4186 -180 -78 264 46 192 162 201 47 32 126 33 -34 -145 -38 117 -35 75 -29 -305 -160 102 -118 82
4208 82 -79 -62 70 -56 146 -50 -187 -40 -76 245 6 11 -95 -9 117 161 7 -33 19 30 -1 -6 6 -59 -60 37
4234 37 164 -12 178 -21 130 175 -144 218 -52 -91 -180 -250 14 -186 236 154 -40 95 41 -236 -30 -161
4256 -161 -208 60 -56 -148 -30 -103 325 -76 257 133 219 -220 -70 -447 341 61 -140 355 -73 334 254 207
4278 207 223 -475 -210 -173 -123 -270 -2 -68 -236 426 221 -275 185 41 -84 135 5 -40 -73 24 -124 74
4300G4j41J74j12J40k16K66k90J86m81M49O1k24J64k41M11j69J23l3k07K98k15
4321A7N8qJ3J16j94l9j36L71l74M78l20J28K79k86l93J068p38J7k48K72Rj75j5
4344a00K01j59L9p7J50lj66J46j02L02k38J93km56M79j42L93l85J88p29L23j37
4366b82J43J20l21k3j5J53N6J55o34J157j612J091J98k07n27j70M25l17R40K38
4386E68j427K95J00N14J69k68k45j25O45j79Jl95K03L94J2n41M17k43O7k15q3
4407c36j16N39J25m09K33n6L38n59N96n89K72j76mm40M54q3K42K4j13j84O05l31
4429C2j25J23J39J56o6j62j3L93n16j68J9J94K10m32N48m45j21Jj2LR4j34j44
4452d26O83j92o92Q62K09n79j24L21P2o60R8N27l43mL96j66k7m8J66k83J13j39
$$ plain form
4300 74 -67 107 -5 135 -81 185 -105 81 -400 49 110 -114 50 -191 220 51 174 141 -66 232 17
4321 17 75 67 80 196 2 -37 -173 198 -176 302 -18 110 389 103 -290 778 40 57 -191 81 90 -85 -100
4344 -100 101 -58 -19 -96 54 51 -115 31 -71 231 -7 186 184 -272 207 65 458 73 261 -468 -145 -282
4366 -282 -139 -19 -340 -363 -378 -225 -169 -14 -648 509 -1103 -12 186 -21 -548 -718 -293 -610 330 568
4386 568 -859 -564 -464 50 219 -49 -294 -419 226 47 48 -347 -144 250 262 -279 138 -105 -38 -253 -336
4407 -336 -452 87 212 -197 36 -20 318 -241 355 -234 38 -138 -142 -582 -128 -211 31 55 -58 -242 363 32
4429 32 -93 30 169 325 259 97 84 477 -39 -207 -188 6 216 -216 332 -113 -234 -233 -245 -242 -148 -282 -426
4452 -426 257 65 -627 235 444 -135 -259 62 134 -526 -428 99 -244 -248 148 -18 -45 -93 73 -210 -97 -236
4474b36L48o7K89l06K2n0J42j34P5k77M11l20J34K7l06K22q4N1K69k54j52K34
4496C8j73L19k88j19K60O0J36p5k01R0l00O1K06j00K60L8p9j98N7K64m08K29j26
4519d9K81j91J79j43k88Q5q7K84k42K02j56K16l05J78R6pj88K12K28j92o7m3j31
4542a28K95k93K03Q0q3J35j62q3k3N8J39k17J43j7p4k32K02O1R7r7Q5k21n3M86
4566C01l24K20j17k38R6J73m7l16L85k08k38M03k6K44k57k66N01l32j02L5M20
4587C07o11m13L67N42l20o91P55J07j99j07K00J58k77K89j51R6k48K17n9N6O0
4608G8j48m6J08K58k12O6k31K30kl1L1k76K50N92n22K99o42m5M36o99N8O67m08
4631a89J00l60N89j36%J62o0k76K88K8K0l82K27j4K14l28J12R6j91J09L3qj07
$$ plain form
4474 -236 112 45 334 28 50 0 142 8 83 -194 217 -103 31 58 -248 -26 -110 -59 210 -44 -196 38
4496 38 -135 184 -104 -223 37 97 233 158 -43 47 -253 -192 14 -86 174 212 133 -65 -8 256 -152 77 -49
4519 -49 232 41 220 77 -211 -126 -213 71 -171 31 -125 91 -214 -36 60 53 -135 77 305 113 46 3 -128
4542 -128 167 -126 77 157 74 209 47 -36 -59 -1 138 -79 64 47 -27 -259 -57 4 101 4 89 -132 -185 301
4566 301 -23 197 80 -158 -62 111 64 -252 133 -75 -313 90 64 308 51 -215 286 -46 -148 -113 307
4587 307 -304 -717 -350 192 -128 -819 -64 43 -156 -263 -63 95 -182 107 -44 52 -196 21 -38 18 78
4608 78 -70 -116 -8 250 38 104 -127 103 101 70 101 -175 75 667 145 444 -198 -243 193 -506 -448 219 -189
4631 -189 -89 -449 140 4 4 166 106 -170 118 146 166 -216 11 -3 211 -117 -5 91 -100 9 42 34 -73
4654g3j10j32K68J02J66l70p7J22J41k37q9K82J74j87J83m15L23K1k8J24j37l7
4676A4k27lK88J61k91N2QL3n5P4j33O5Lj4l7K29j02l6o4K01j78K10j44n8k1P8
4702E3j54J12l7J65k21L17k01m6J29j12r2K63j18j48J48p4J35j21J41k9j99%J93
4725A04p7O2j76p6J37M9J87p8j58K2q9R4j01K05L7j87k6r6n1oO6L34j8K6j86l5
4751c7j5o3P3L5Q4pj17o7J24o8j5l5M7j41J97M0J03m50Q3J61k5lK12k30J12L3
4777C1j35n2K55o9J6M8j24NqJ08J02j61K38k51R1p0q8q5K19m27M62j04k54J57
4801i6M86j93k7m76K87j26K36o6j97M22l76k17O41l38P9J97k73M87k44m52L61
4822A15j37r8J93k5n3J83l69M2M75k39j3j67M05m77K8J16j34jL54l16J21j88J36
$$ plain form
4654 -73 -183 -315 -47 55 221 -149 -226 -104 37 -200 -289 -7 167 -20 163 -252 71 92 64 188 51 14
4676 14 -213 -216 72 233 -58 -6 2 35 -20 54 -79 -14 -11 -25 -62 167 65 29 -35 166 -12 198 54 -4 -25 53
4702 53 -101 11 -26 139 -82 235 34 -12 117 5 -87 176 58 -90 58 -16 119 -2 139 110 -89 -89 104
4725 104 27 89 -87 -163 -26 23 210 132 -26 -4 -93 1 -100 105 142 -45 -71 -167 -218 -224 -158 176 158 184 -2 -37
4751 -37 -52 -115 -42 -7 77 70 -47 -114 10 -58 -73 -108 -61 -202 -5 35 138 -312 -229 -68 -93 -96 116 -114 -2 31
4777 31 -104 -156 99 30 46 94 -30 -25 -33 75 177 16 254 3 94 24 -64 -149 70 -357 105 1 -253 -96
4801 -96 390 197 170 -306 -19 -145 91 25 -172 250 -126 -343 298 -40 39 236 -37 450 206 -246 115
4822 115 -22 -120 73 48 -5 178 -191 -149 326 87 74 -93 312 -165 -137 -21 -155 -156 198 -118 3 -185 -49
4845d9J83J2k25j69L25j11j0j04J13j36J40J1k49M01q4r0o3K4m44Q95n69K37j72
4868a34J81n6J51j12N0k5M0J67k05J9k84P1L68j86j79L01l20J43RO7k32K5K53
4891A12n7k87L53k38J2K86j62R3l19K35J5L1o2J84j37k00L29Q5k79q1J2K00q4
4914D1L5Q3j63J50n1P5j66j49P6l6J33P2q2P3j23r4K69j82j49L99m27L00j44k78
4938c38L28j25p8J81J48k97O6l3J7j42M66K07l89J5J12j91J85l31M0K79k39J92
4960G3k89j73J38L91k00J30m22M41O6l14q0J42j23L48j48J74k7K12r03J66L69
4981b9L63l02n3n33Q60l89n4p36Q64p89P73j66K14N33n8o78J25K00k61J22j20
5002a14J57J07j39J67j42n1p3R9n8J66k60P1Pr5J55j19J87n1%J07k3k95p3r0K82
$$ plain form
4845 -49 134 146 -79 -248 77 -34 -44 -148 -35 -171 -31 -20 -269 132 48 -42 -105 -81 -525 370 -199 38 -134
4868 -134 47 -9 142 30 80 55 95 262 57 76 -208 -137 231 45 -134 167 -153 -10 -1 66 -166 -141 112
4891 112 55 -232 121 -117 -105 181 19 112 -207 28 43 74 12 196 59 -141 188 273 -6 -87 -75 125 41
4914 41 76 159 -4 146 95 170 4 -145 -69 -105 28 100 18 91 -32 -126 143 -39 -188 211 -216 84 -60 -338
4938 -338 -10 -135 -213 -32 116 -181 -115 -148 -131 -273 193 400 11 26 138 -53 132 -199 -159 120 -119 73
4960 73 -216 -389 -251 140 -60 70 -352 89 155 -159 -239 -97 -220 128 -20 154 127 339 -564 -398 -29
4981 -29 334 32 -21 -554 306 -83 -137 -873 -9 -798 -25 -191 23 556 498 -180 -55 145 -116 6 -114
5002 -114 43 150 11 178 36 -15 -88 11 -47 119 -141 -70 -63 -158 -3 -122 65 14 14 121 98 -197 -270 -360 -78
5027g8J07m8k08K24l5pQ5j5r0K0P3k81K73n0r6o1M09k08l7J43k14J10j9p5j95
5052b73L63j21J06l82K59r0J15J48p3o7J82k70K70j23j19M4J0J86p1j95j31K58
5074B6J22p4r4L2j38r7K19M8P4q1k13J05R1m4k8j52K39J7k11P5O6k96J34k2K51
5099D9J06J2k92J28j07Q9n8K7K17j47J92o6j97JJ15j8O5J69k88K1K09l62J66J10
5123A41l6k2r8J59j54m3J6rj33P1K21j6q2j69K59l14K38j38K4M5j31N9k5K42o9
5148C6p1r1J06j27J51K7J73j70j13K36j42j90K86o6K8R8n7j36j16L02k23K64l05
5171a00M1J41p5j8k37R7J06k55K03j63J78K62l56L37r5J8k42L93k29Q7k95J64
5193c8J0r4R0K36j61Q3j48P6K9j03L06k83J61j03j54J12k23J47M0q7K26k9j48
$$ plain form
5027 -78 29 -19 -227 -3 -38 -45 40 25 -65 -45 28 -253 20 -30 -126 -187 222 14 -23 120 -94 16 -3 -78 -273
5052 -273 90 -31 75 -307 -48 -138 -23 125 52 -15 167 -103 167 44 -75 -31 -21 165 94 -101 -232 26
5074 26 148 74 -20 12 -126 -223 -4 44 118 37 -176 -71 20 -24 -52 -204 35 52 -159 -84 -18 -314 -180 -202 49
5099 49 155 167 -125 3 -104 -15 -73 -46 171 24 216 150 -47 -46 69 51 116 285 -3 18 227 -135 31 141
5123 141 105 83 -15 144 -10 -53 -37 -46 -179 -108 113 97 15 -154 105 -209 29 -109 -85 -40 -171 -112 -137 105 36
5148 36 -35 -126 -20 -147 4 31 204 34 -79 157 15 -175 111 45 73 171 114 -22 -138 164 -59 205 -100
5171 -100 -59 82 7 -11 -248 -151 -45 -300 -97 -260 -82 180 -176 161 66 84 -158 235 6 93 -202 -38
5193 -38 -28 -122 -32 204 43 126 -22 54 83 -20 286 3 164 61 -93 19 -204 -57 -17 -104 122 93 -55
5216e5j21J65j75J90j10K25L2l56m7K30j65O17j22k70j38J05K18l21rJ35O0k05
5238a17K84k90L3J05qJ27j09o5O0j44l7m0Q7J64j35Q1R1o1J58j26k36K24J1Q6
5262A43j44J08K3j78O0m2J25j17N9o6J2n3kl9O8K30k74j7P2r9K53l50K33j92P2
5287a15M4p4K1K42q2k00K27R0l04K69l9j17m7K12r2k04J47j03J03j15J90j77K06
5310H2R8j31L2p3mk48K13O0k3j41o9L57P7j88jQ8k39N4K29l14K20o7K41l45J96
5335A04k24K3J28L0r4K8r3N0Q4K8L3J86k13k19J35R1j22j45K18j06J01n2J36k36
5359a29L76k61J03k38O0J12j89K81j57J93j34j15J62q8M5J14l71O5R0L80k07O6
5381A58k14L7O0J1o0M4m1n2j6J38O2o3p3r0r0L2O3n1R5L6K25J77l23j99O7p8L09
$$ plain form
5216 -55 -176 -11 -186 4 -106 119 151 -205 -252 -22 -187 430 308 38 -100 5 223 -98 -107 28 88 -117
5238 -117 167 -123 -90 15 7 134 25 -40 20 -124 -161 -201 -114 50 -85 -4 87 26 184 58 -178 46 57 143
5262 143 -1 107 130 -48 12 -30 95 -22 37 -29 -17 -70 -72 -111 -43 187 -87 -104 -32 -131 122 -228 5 -187 -115
5287 -115 -71 -145 -124 118 36 -164 63 153 -151 118 79 -38 -85 127 35 -169 -22 -125 -22 -137 53 -124 82
5310 82 180 49 81 8 4 -244 -31 29 6 -135 -204 153 230 42 41 129 -110 -56 173 -141 79 12 253 -92 104
5335 104 -120 -97 31 61 -33 -5 -98 -48 36 64 97 283 70 -149 -14 77 -45 -190 28 -78 23 -29 107 -129
5359 -129 247 -14 89 -149 -89 23 -166 115 -42 151 17 -98 64 -24 21 135 -236 -171 -81 299 92 158
5381 158 -56 -19 41 52 -8 36 -5 -57 -73 65 127 64 -9 -99 -189 -157 -94 -145 -50 -14 211 388 65 -134 -67 -145 164
5408A64l00M81n97LJ38K73j76J14L36o23R8J1K43l23K43k80M03j16n8O9l5k73
5430b05L9M95n0l12L12j72m5K45l25J32J19k94k9j34L1L07j58K22l10pL15l70
5452a94k2L57k70j8K30P5j27j21N5r8M76m40j0L42k88k27L58Ok54J33j66L21j60
5475d2o3M5M7m4J51j78LJ31R8k63J11r3J79k26L13j95l41K84O5L44m80K85K85
5498D16p19mK96O6J53k76q82O10N33l76L25O3j99j42OL3J76k12J36M2L65l11l20
5521b21L30K5j51k8J4n0pl5qR2q8M0M1l5K72k33R1j7j45m2m3O2j6J07j10K11O3
5548A19j06K01l84J36J53P4j04k01M43n00J24Q1j48M11m13QP0Jk27K16J87K6l50
5571a83K14L0O4j59j75O0K73n2o5NK0p4K11o7j5r6m7J18q9o1J14jn8J23m48K38
$$ plain form
5408 164 -136 345 -252 -249 -111 162 -14 100 436 -187 -89 -78 165 -158 85 -195 208 92 34 103 68 -205
5430 -205 -166 329 279 -33 279 107 62 307 -18 114 233 -61 -90 -224 -193 114 -44 178 -132 -139 176 -194
5452 -194 -216 141 -129 -147 83 158 31 -90 -35 -133 343 -97 -107 235 -53 -280 78 84 -170 -37 -203 118 -42
5475 -42 -105 -60 -13 -57 94 -84 -81 50 148 -115 -4 -97 82 -144 169 -26 -367 -83 -18 326 -154 131 416
5498 416 -303 -307 -11 55 208 -68 -950 -340 193 -183 142 205 6 -136 -130 -97 79 -133 3 45 410 99 -221
5521 -221 109 134 -17 -45 -31 -81 -88 -123 -131 -39 -127 -87 -46 -81 191 -42 49 32 -113 -155 -198 -136 -152 -45 -155 56 119
5548 119 13 214 -170 -34 119 193 89 -112 331 -169 -45 36 -112 299 -114 -106 -36 -35 -262 -46 141 167 -183
5571 -183 31 61 125 -34 -209 -149 124 72 7 12 32 -42 169 102 87 -9 -56 62 -27 -88 26 25 -33 90 -358 -120
5597a20K51k76J05j4J61M4k18RJ62l54J14J70K02k82J06L7j03R1Q4o7NK4j39L6
5621B8j30P2N5j99L25l4q8OM7N9J28k65J06p5J59j77j09M6Pr3J12J06N0l30K37
5646D3k22K32j63j7L15m09J31p1k1K58r3K06k12l4o4J37j57K1J87j36K15k36J20
5669C0r4l3J12r4K86p9r3R0j46KRL35l40J22j1l12J44O7k2o5j87L33j53K48j32
5694A7k88J15L87o7j30m8R2j10k6L7j06K33j06M7q4J6J39q7P2lmk6j49J64R9j30
5720E4k14J7K52n9j57KK23k74J23o0J64j70J83J59j79pj07%K3K9lq1l5J32l2J97
5746A80n4j76K19o9k13J63K8J02q7O9l02K52j66J08p6N5r9p6K22Q7k68o4J56P4
5770F5r0J53l26N7Q3J48j01K10j82j78N8J27q2k6J87j0l20Q6J82k10lJ76L6k55
$$ plain form
5597 -120 131 -145 -40 -54 107 151 -67 -58 104 -250 -136 34 236 -46 60 97 -6 85 169 102 107 131 -8 28
5621 28 -102 -30 25 -174 151 117 29 35 82 141 269 4 110 35 194 17 -92 -46 -39 -132 -20 86 136 -194 43
5646 43 -179 53 -110 -127 188 -221 -90 -161 -182 76 -17 189 -23 -57 -121 16 -141 -120 67 -69 146 -90 30
5669 30 -64 -97 15 -79 207 128 35 125 -21 -19 -10 325 -15 107 96 -216 -72 -5 -27 -92 -279 54 -99 149 17
5694 17 -271 -156 231 164 34 -14 78 -32 -58 -21 -127 106 0 47 -37 -21 118 31 103 100 96 70 -79 85 184 54
5720 54 -160 -143 109 50 -107 -105 118 -156 -33 -93 71 -99 84 243 64 57 -50 -50 -27 2 -1 -82 -117 15 -17 180
5746 180 126 -50 169 100 -113 50 78 180 93 162 -140 112 -54 54 -22 33 -66 -142 80 167 -101 -165 -9 65
5770 65 -25 128 -198 -141 -58 90 -11 199 17 -161 -103 24 -58 -84 103 93 -227 -141 41 -169 -172 4 40 -215
5794b15K13L48m57J76P0l00J84j15j50J98j14L33k28m23M76O1l27j14L81n7K53
5815A93j25k9l81J39p05J394k61j555J003P96r48K49L31N12l29j40K19j087Q50
5834A26J6k78J33Q7l24L71n7J15k35J29n2j24L40j42j84J6J09k9j43K01k64K54
5856F5j36J09k9K93l47L6j30M2J49r8R9n1K23k78J68j70p0K29n0l9K24k11l3J25
5880A20N5o5O4j33R8j9o4l1J06j38k99K93R5r4L7k11K10j0q6Q8mQ9l1m6j09K46
5906A61r8j96J23J9k63L70j32J7J7j80L56K6j6k74j01K84j65J88j81n9p7K24m8
5929ej50J54n1K9Q2l9J03k26K10oj54m1K90k89Q1pj05Q2J25R9j14k45l3K14J06
5954A10k09K80j61qk8KJ2L1p4K0j04J0J55l4R0j39n6kJ30O5l29R4J40n6K39k60
$$ plain form
5794 -215 -2 346 -111 65 135 -165 19 -96 -246 -48 -162 171 -57 -480 -4 57 -270 -384 -3 -60 193
5815 193 68 39 -342 -203 -908 486 225 -1330 -327 469 -479 -230 101 613 284 144 363 -724 126
5834 126 142 -136 -3 84 -240 131 74 189 -46 83 31 -93 247 105 -79 -63 46 17 -126 75 -189 65
5856 65 -71 38 9 302 -45 -9 -139 -97 52 -46 53 2 225 -53 115 -55 -125 104 54 15 239 28 -5 120
5880 120 175 110 174 41 139 120 56 25 131 -7 -306 -13 82 -12 25 -186 24 14 -72 16 12 101 70 24 -85 161
5906 161 63 -133 -10 9 -254 116 -16 1 18 -162 194 220 204 -70 -171 113 -52 136 -45 -104 -181 43 -5
5929 -5 -155 -1 -52 -23 59 20 123 -103 107 101 -53 -94 196 -93 -12 -19 -124 -42 83 182 68 -177 -210 4 110
5954 110 -99 181 20 12 -16 -14 -2 29 -45 -25 -129 -119 36 2 92 -47 -103 -105 25 90 -239 -145 -5 -61 178 -82
5980h2J69k81J44J97j98p5K7J3l0K62k17j09M3J75K09o9k82J49N3j80L29k58O9
6003E8j21J03K55l57n8j4K17n5n9J10k97J00J64L5k30K19j29J8r1K39r5r5O2J19
6027I8J51r9m9p2P6j98M0K12n6k8mL9j22O9j80l3j5K10j65n4J12J5J21p5J34k11
6053h4J53j08O1j58K34j66M7k7K7j19K9K0p1L23j34n3K50k15P1m2J56j58n7jQ6
6078F4Mj38k38K40K73p4J41l45P1j58n9J64P3J55k19j06J59K28l00K58Jj16j69
6101i1J79m17L47MJ2n4J9j19R4J63j81L2O1j90J27j32J69Q2q6J11r1K61k97J93
6125A96k04k59L41Q9l66M34j56k30L12j10J40k48j75L08k65K59R2k75K73l63M24
6146B17k45K19J09n99Q63l98k88L13q3k46J65k30J2K98M1J03L00o54M01m01q5
$$ plain form
5980 -82 87 -194 -50 147 -51 -126 -99 -86 -116 146 -71 -180 -137 38 247 178 -104 45 98 -82 247 -11 58
6003 58 -63 40 295 -62 -120 -134 83 28 -31 79 -218 -118 46 81 -149 70 -59 -41 -132 107 12 -83 -21 98
6027 98 249 150 101 29 105 -93 -53 159 103 75 71 110 -12 57 -123 -156 -171 39 -126 -180 -68 -53 68 -7 127 -84
6053 -84 69 -39 22 -136 98 -68 -21 -48 -21 -140 -111 -91 -162 161 27 -26 224 9 80 38 194 36 -21 -22 64
6078 64 68 -70 -308 -68 205 131 272 -73 -2 -160 -219 -55 18 173 -46 -152 7 235 -65 193 194 78 -91
6101 -91 88 -329 18 22 34 -20 -1 -120 -26 137 -44 -12 49 -141 -14 -146 23 105 19 130 39 300 3 196
6125 196 -8 -267 74 163 -203 231 75 -155 157 47 187 -61 -236 72 -193 66 158 -117 156 -207 217
6146 217 -28 191 300 -299 564 166 -122 191 108 -138 27 -203 -191 107 148 251 551 -103 298 -103 -188
6167a88O37o88N85j013N51J46k30J84j92J77j25K69J11p17L67J07K30k88m4K84
6187A63r81J412j0l98R8J99o84l34P15n01Q08M2l60m31P19o38L17M76j19j23m06
6208c6l06K25K38k79r2J18M76K5n8m06K52l13N97k50l1K31o20k2L92O8m4m83J73
6231a45J72J39J06j60Q7R7j37j82j90m9L20r5J31k7k59j80M09k07J41q3J15J48
6253A51o7J11k23j87K88k26M17m11j4K98p1n2j36K34j34K5J70k35n6J37J51k28
6275e8N3j93J01K18l11J43m4P9Mp2J06J0k56L10l16J11J90N6l65K65M3k89P78
6298E63n31j71L39m02qK87k10P7j8J45j21p5R9Rj54L03j78j21K76k41J67o0M6
6321B1j48L35k84J6J24N8j01M6M0l82K58p3P0J48l14l7Q5j70M27k26M4n3M41m15
$$ plain form
6167 -188 449 -239 346 -667 -116 30 -200 -16 -208 -31 -156 113 224 -493 -126 -19 211 -77 -121 163
6187 163 -818 594 584 186 284 483 -201 -535 180 -321 487 529 169 -262 457 -181 136 612 493 370 -36
6208 -36 -342 -117 121 -158 -250 -132 344 369 311 -95 157 -156 441 191 160 391 -229 -251 141 209 165 -318 -145
6231 -145 27 166 272 112 199 296 159 -23 -213 -262 58 -37 94 67 -192 -372 37 -170 -29 -112 3 151
6253 151 84 195 -28 -215 73 -153 264 -147 -161 137 66 14 -122 112 -22 3 173 -62 -118 19 170 -58
6275 -58 -5 -198 -97 121 -190 -47 -91 -12 -8 -80 26 36 -220 90 -226 -115 75 131 -234 31 74 -215 563
6298 563 32 -139 200 -202 -210 77 -133 -56 -74 71 -50 -125 -26 -17 -171 132 -46 -167 109 -132 35 -25 21
6321 21 -127 208 -76 -60 64 122 21 67 107 -275 -17 -90 -20 128 -186 -223 -138 -308 119 -107 -63 -116 325 -90
6345i0M4O5j56L26o4j45qq8J74P3j75J10j26K55k59n8J47P0J61n10O78o9j22j32
6369A01r5J44k18L48n80K69J95j41K77m10k77J77O96k87j09k71j20L84k68R87
6389H02j137K0Q09k39M25n54j69P1J25j18%j48K51l73L43j17k44L57k71R9L27
6410B59l59q4K26j83K51j55k13L52k49j45L0K53J13n0N1J38k51J03P1m6j24o6
6432g8K46j57n9K70j66J24k33LJ05j02J70m7L4k2M7l56J53q3J03L57l30j35J96
6455D0o0O1j78LJ75K1j05Q7j17J72j09J09J29j07J18N5j42l28J23P6J07O6k16
6478b0K27j50m1K1K23j23Oj33J28N1j32J40k67J17m9j10J80q4m0r8K02k79J69
6501f2Q8j0K15k17J9K32j86o7k94Q2J08O1K73l85J64O6j99J99q8k3j4PL11n11
$$ plain form
6345 -90 -46 19 -137 189 125 -20 -28 -116 58 131 -44 66 -60 195 -64 -122 25 95 256 -254 424 355 233 101
6369 101 6 150 -68 280 -300 -31 164 23 300 -110 -387 -210 486 199 90 -181 -301 83 -185 802
6389 802 -335 -315 494 255 680 126 -43 28 153 35 35 -113 138 -235 108 -9 -253 104 -167 -68 259
6410 259 -100 -184 42 -141 110 -45 -258 94 -155 -300 -270 -17 96 46 97 235 -16 87 158 112 -12 -78
6432 -78 168 11 -48 222 56 180 -53 -50 55 -47 123 76 110 88 135 -221 -68 -151 -48 309 -21 -156 40
6455 40 -20 41 -137 -134 41 62 -43 44 -73 99 -10 99 228 121 239 294 152 -176 -53 23 130 196 -20
6478 -20 207 57 16 37 260 137 143 10 138 189 57 197 -70 47 -2 -112 68 -16 -56 -154 48 -231 -62
6501 -62 26 16 231 14 33 265 79 12 -282 -200 -92 -31 242 -143 21 87 -112 87 -1 -24 -38 -31 280 -231
6525b31N46k49j65L2n4J71k50K70j18j03R2J03J07j76j20K75M7k79qL28l61k38
6547c81K13K39k3p4O9JN2j57J7R0k73L30r6p8P6N1k06K32j03p2J71k06%J69K3
6572F4j64L16k69M2J15Pj89K3M9P6k21K59j35Jj90K87r8m7P1K2RO8j40j12K32
6597G6l16J23P8J75k04j10NM0RJ17M7n8J22J40k96j40K76k27J28J9k05L0K09k37
6621a99K94K8%Q3N9j67o8j57J27K1n0n7L00j67m9k41K04J02J36j13J17k04j99
6644b00K52J7j0j17j41Q6K82j15n0L6J4k39K96q5k87K01J61k51P8j53J52O8j55
6667a60J39L3l40J01M46l53L23k17N2J7J6O4k7n5J4k51L64p7j14r0J78k53K42
6690E2l49K90Q8m31J58M30k90j9J09M0j82J29j80K21P6Ql75p7L96q4P5j51K54
$$ plain form
6525 -231 315 66 -99 -67 -121 50 -200 70 -48 -151 -59 44 151 -25 -145 130 177 -102 -110 218 -143 -381
6547 -381 -168 71 48 -26 43 44 96 -61 -44 46 -227 103 7 -71 5 56 -150 82 -21 -93 78 -128 -128 41 64
6572 64 -100 216 -53 -11 104 111 -78 -55 -6 70 -151 108 -27 -26 -216 71 -27 -74 -3 19 28 96 -44 -156 76
6597 76 -240 -117 -39 136 -68 -178 -173 -133 -124 -7 40 -18 104 244 -52 -192 84 -143 -15 4 -201 -171 38 -199
6621 -199 95 123 123 206 265 98 30 -127 0 21 -29 -86 214 47 -2 -243 -39 63 199 86 203 -1 -200
6644 -200 52 69 59 -58 -199 -113 169 54 4 40 54 -185 111 26 -261 -60 101 -150 -72 -225 -73 -5 -160
6667 -160 -21 12 -328 -227 219 -134 189 -28 24 41 57 121 94 39 53 -198 166 89 -25 -115 63 -190 52
6690 52 -297 -7 81 -350 -192 238 -52 -71 38 78 -104 25 -155 66 142 150 -225 -302 94 10 85 -66 188
6713A88j70M5O2L14n45L67p26M45r4M05l31k35N42p2m76L09q3J72n5m14R8J51
6735a03q7K23n84j10O50L02l07L36O2K7m55nR5n2j12j91O15l9k62j20l6k19ko7
6759d41N28M78m39n50L36J37m06M21Q6l08K47L40J21m42J95j170L26N08L92K08
6779E67k98j39N05o59j7M67k13o7j66j61K93P63j042j19q2M50q06J023n34L57
6799A22q69P62M68o01J87l21M35N5K44o8o82k2k37R80l72k57J34l73N93mj86m69
6821d81L28M91J32l07K80m96L6N4p70K96N49l26l92P81l42M06n83L41Q1p0rl68
6843c69R09p70N03K1l41k13j67M09P7K52q47L51k57O48J26j51m77O16l17k26O80
6864D57n34k38J62j76M27k18l90J51Q99n75l58L50j07K34k08k56O01l42m3N19
$$ plain form
6713 188 18 63 125 439 -106 261 -465 -20 -114 291 -40 -275 267 195 -281 28 -55 117 62 -352 -254 -103
6735 -103 -190 33 -551 -661 -11 291 -16 320 382 409 -46 -51 44 -8 -120 -311 304 265 3 -117 -153 -372 -374 -441
6759 -441 87 565 126 -424 -88 49 -357 64 150 -158 89 429 550 108 303 -867 -541 -33 359 567
6779 567 269 130 635 -24 -41 426 213 146 -20 -181 112 875 -167 -286 -368 82 -724 299 -235 122
6799 122 -747 15 483 -118 69 -252 183 238 482 414 -268 -290 -527 453 81 -176 -42 -415 178 174 -12 -481
6821 -481 -153 338 470 163 443 -53 -17 37 -733 -437 112 -214 -606 175 -167 239 -344 -3 78 8 -1 -369
6843 -369 540 -230 273 294 -47 -260 -427 -18 59 311 -536 -185 -442 206 332 181 -296 320 3 -223 457
6864 457 -77 -315 -153 -329 98 -120 -510 -359 540 -35 -393 -43 -150 84 -124 -380 221 -121 -164 355
6884C55n43M25n43L6j43N07o69N44N85j298J136L41o98q34J435m63M79K26m97
6903C81l96N8L13J75q42L20N46l94m39J47J41n52J258p27JM39l03J45l83O11o76
6924a77O23l3n51Q03j14L18q21J4k22O30o68N12m23l4L65o7l02n6k24Q43n89L82
6946B09m49L77N7n38Q36n73J44R9l29L87K47p07N62k22q4j69M88p9k81r6L34j09
6968A04j39j1J90k43j5J04J1J34k08J79j58K19k55NJ19j14k39K02J27k12J05O0
6990c5K87l75K0J12j00P5L08l16m9K40l24L7O4K14k80K3J01J55j27k02L08K1n8
7013I9n1k38Q4K64j82j50J93R7j10L5l5k0j53K87j94r8R1J53PJ03k27N4j28J51
7037C2j29M10l63k8O4J7r6J24l0j50L65k30J26k0mLk68L89p9j10K39m8k63p2k
$$ plain form
6884 355 -188 237 -306 -270 -413 94 -575 -31 554 -744 392 733 35 -799 636 173 652 878 381
6903 381 -15 43 356 531 -311 9 555 161 -278 -131 10 -542 716 -11 -10 429 126 271 -112 499 -177
6924 -177 446 413 -138 665 551 869 48 62 -160 470 -198 314 -109 -143 222 155 -147 -203 -427 416 -173 209
6946 209 -240 137 194 -344 492 -81 63 162 -167 220 467 -240 322 100 16 -153 335 256 -25 -121 213 104
6968 104 -35 -46 144 -99 -114 -10 1 135 -73 106 -52 167 -88 -83 36 -78 -317 -115 12 -200 -95 -35
6990 -35 252 -123 -103 9 -91 -16 292 -24 -73 167 -157 -120 -56 158 -122 -99 2 157 30 -172 136 157 99
7013 99 48 -190 -106 158 -24 -174 19 116 6 41 6 -14 -167 120 -74 -172 -81 72 79 182 -45 9 -119 32
7037 32 -97 313 -50 -78 -14 3 -93 31 1 -149 216 -14 112 92 88 91 -177 212 133 23 262 214 -49 -121 -123
7062a23k01L27J00K4k97K61j09R0R2k27J94q1P4n8q1j44J89j31K22j01j65L03
7084A58l43K01j22P6PK0K18j25j43r4J34j35KP6M2K61k77j12K24m6N5j48L44k28
7108D5j31K51k11k85N70l44K06k10Q8o3J81j67M4K3n1J18k16K33N7j34L1j3k02
7131a80R1j90L52Qj55N5j61J43j36l4J31J23k9N9q7J61j87K00j62J60j75M7j45
7154a11K84k13O9q2N3O0P0P5k69J55R1k74qQ2M8J10j75J23j24P7p1l8K40k66q
7179a02L05j70m5J51m64J49K93p7m5j4j55K65j55Rj72J96M4Rk52L39j03k76M85
7202B15k12l26K08L26j39k01p8M81k42J6l25J21J87j9oRJ16kn1k33K51j67j12
7225a83N8K91j74r4L7J08N0J5l27J82J37o5k09K38J60j55r4q8M2NJ14j82J43J13
$$ plain form
7062 -123 -324 3 103 127 -170 91 -18 72 164 -63 131 50 124 66 -15 -159 30 -101 121 20 -145 158
7084 158 -185 16 -106 -30 -23 -3 215 90 -53 -147 -13 -148 -146 -70 -28 233 -44 -156 68 22 77 -71 273 45
7108 45 -86 165 -46 -331 239 -105 101 -109 -21 -84 97 -70 -26 -3 -54 64 -152 81 138 4 35 22 -180
7131 -180 -89 -279 73 81 -74 -19 -180 -37 -173 -207 -76 47 18 77 -10 151 -36 164 2 162 -13 34 -111
7154 -111 173 -40 29 -53 0 60 130 205 -64 91 182 -92 -100 -18 30 140 -35 88 -36 41 -30 -68 172 -94 -102
7179 -102 203 33 -12 139 -325 -176 117 40 -5 -19 -174 91 -64 -55 -227 -31 13 22 -230 109 6 -270 215
7202 215 3 -323 -115 211 72 -129 -207 274 32 48 -277 -156 31 12 6 15 131 129 78 -155 96 -71 -183
7225 -183 -125 166 -8 -102 -65 43 93 108 -219 -37 100 35 -174 64 224 69 -25 -113 -71 -66 48 -134 9 122
7249A22k53p8K51m6M4NRK38k03k40J92l9k20q9K78p9k4N1j64J23K61l0k60K06
7273E5p5J0k29K50NK45k05RJ0j72K15k51J10L1K97m62L17r4N6r7p2jP4K20k75
7298b9k50M87j30n9k81K32Q1Q8j63M0L4lJ24pk49Q7J14j19J58m9M5k31R4J13j03
7323B4j58J83L4k66J93QK8J1j31k15K19J79n2k0j19M10n31J41K4J94J5p1k28K75
7347A47K8m63K47OM5k0J23j92J60j73p3J26o4K15q6J52l39J21L8n7q8K07R2k42
7371i0q9J90q8J6rP8L9j96J66k0K9O0l36K21q0K77j63j22kJ11k2J2p8l1J71n2
7397hK15k86M80l09j21R3k28K45O7J27o8k35J04j44J4L10k99J09j48J51J13k01
7419a9nr5R8N0pNR0l4q2N3J7j84L27k14k8M0J03j21K8l8j40L90j93m6L9p7l5j23
$$ plain form
7249 122 -131 -209 42 -4 40 45 54 292 89 -151 41 2 -218 -307 -29 -108 -132 -81 -245 -122 139 109 -151 55
7273 55 -20 -10 -239 11 16 261 56 65 75 -97 118 -133 -23 8 305 -157 160 66 122 25 -47 -48 26 246 -29
7298 -29 -279 208 78 19 -262 -30 51 139 -24 16 50 47 171 164 -85 2 116 -3 155 106 151 -80 14 127 24
7323 24 -134 49 83 -183 10 18 46 57 -74 -289 -70 109 57 37 -82 328 -203 -62 -38 156 171 100 -128 147
7347 147 175 -288 -41 -35 10 -10 113 -79 81 -92 -165 -39 -103 112 26 178 -161 -40 -2 -59 -147 60 152 -90
7371 -90 -179 11 -77 -61 -70 8 47 -149 17 -3 26 86 -250 -29 -109 168 5 -117 -119 -8 -30 -18 -96 -127 44 -8
7397 -8 207 -79 401 92 -29 64 -164 81 148 275 207 -28 76 -68 -54 256 -43 66 -82 69 182 -19
7419 -19 -24 -119 -21 29 22 27 117 83 1 54 71 -113 214 0 -28 12 115 -6 22 -16 -156 234 41 -5 34 -43 -78 -201
7447b01J36R0q4O7j84K54n4Ql3j49M1R5q9J2k81M3K44M5J02J2K5o1m3R0j74mJ10
7474A7j50P0q0pL52k77Q1P2K03j89K0j62J90r7r3j23R2k1j9N9j97J28Q0J70q8
7499C1j00J6J69J71k20J38l48L17p1k95J77P1K25l22k8k3j73k5K85K13l90J01
7521h1O2J60O7k10K8j45rj06M08j50K3P1L3n9k2m9j39J44p2k1lK2J09Lj04R1j6
7548C5j21N9J20l04L49k18K7M42m48j32K04Rn5J36j15p8o9L13j03j40L2K75j15
7571A03k39L09o6k29K06K5m3Qj00K95l66J75j10j31J87j31Q0J83q1q2J29j09j8
7594el2k06L84n11L14K3n9q1K18K48k18Q2p0k53J19J62j12o5J39m26L65J4r9L4
7618c5q0K72j56J00M1j53jj92K17O9m9NJ68l34K03J67j70j22J94P6j31j69M2m1
$$ plain form
7447 -201 -65 25 -59 8 -176 78 24 32 -1 -150 -109 -14 -103 -91 -372 -329 -85 -40 62 74 99 38 -5 85 -89 -93 17
7474 17 -133 -63 -143 -150 202 -75 6 78 281 92 112 -50 140 43 -50 -173 -81 -102 -121 -62 -259 -131 -51 119 31
7499 31 -69 -53 116 287 67 205 -143 174 103 -192 -15 56 281 -41 -69 -92 -265 -290 -5 208 -182 -81
7521 -81 -19 141 208 -2 26 -119 -128 -234 174 24 47 118 151 92 70 21 -118 26 -46 -67 -70 -48 61 64 -40 51 35
7548 35 -86 -27 93 -211 138 -80 -53 389 -59 -191 13 22 -33 103 -12 -90 -159 154 51 -89 -57 218 103
7571 103 -136 173 107 -122 84 109 66 74 -26 269 -97 78 -32 -163 24 -107 -27 156 75 -7 122 13 -5
7594 -5 -37 -243 141 -370 -56 -33 -92 -173 45 293 75 157 87 -166 -47 115 3 -62 77 -349 16 30 -69 -35
7618 -35 -115 157 1 101 142 -11 -12 -204 13 82 33 38 206 -128 75 242 72 -50 144 220 89 -80 -38 -79
7642g9L99n8l93j08L5L88l55J08oJ22k4l5K60k62l6J48k97L43k01k8J69l75L11
7665B6j16P8k02L06j2k83L96l14j29L91o3j11J8K82l40L22l68J27j7L0M3K52j37
7688A79m37M27rj39J87p7l76L80p0l5l97M30j51K02Q7k41J69j34m4n8K17m20J18
7711a92L42n65J32O50n83K46J73N1j54k51mK37o01M23P1k15J81O40r31L82N49
7732E81p82N33j058J096o6k30L5j77L5j46j6k19M98p5m21L93j52Q37j061N92k79
7753h2n8k4L24k06J11K39k25Q54j510J416n01J20k11j114J152j2o45j54J248o79
7773D3M79n09l38M28o77N92j63Q79l43l94j29Q15k07n90O6J4o53O68l91M52M72
7794E14p73l43Q4J018K4m77P9l48N09j21q19N92K74j10q52N35N09o92J24k5L73
$$ plain form
7642 -79 320 262 -131 -239 -204 184 -171 -63 -69 53 29 -6 254 -8 -44 104 -193 150 -51 -79 90 -285 26
7665 26 -90 -12 -214 92 80 -203 193 -121 -250 141 78 -33 -15 267 -73 249 -119 8 -9 21 64 316 179
7688 179 -258 169 160 21 208 131 -245 135 65 30 -367 63 -88 114 201 -40 129 -5 -49 -107 110 -310 -192
7711 -192 150 -415 -283 367 -216 30 203 254 100 -151 -155 82 -519 -96 -25 -240 -59 581 -350 32 581
7732 581 -201 332 -726 370 304 74 109 -68 -33 -179 -195 -414 84 9 -412 -19 -171 666 -395 197 -82
7753 -82 -140 -164 160 -46 65 304 79 933 -577 839 338 458 247 -867 285 273 -372 -526 722 43
7773 43 522 13 -325 103 -574 18 -145 734 391 -3 -132 683 476 -114 -48 -34 -687 -19 -410 42 514
7794 514 -259 -602 -518 500 524 47 126 -222 287 166 -653 -61 213 103 -749 -214 295 -397 -273 -298 75
7815G5n52N12m26K83k7n15Q74l97L5J02L28m08L16k99M0J3j52L34lj96k88L00
7837e1M37j124J656p56Q89o60M44j218K00m41J478j286l62O12J74o59J194m48
7855G9M9M9k72Q3K57l45J78K10j68J62m09o2M35j407P54QN38O4k23N28j340Q83
7877E1m57N57p29J042p58L36k3O0M16m44N19N3n11K04m18n34P69k00k2L4M8m5
7899e2K7J76o0l8r4R5k54K14R7j26J42k05J67l59O85o06J67n14J129j239P64l26
7921b10k16O33j3o09J46N57R54j769O54m34L30n91R97q83R71m39J8J32j080J020
7941A68j34K75m98J30l62N35m67k8j22j36Q95j85j07k3M8m29p0M95j25J48J22
7962A30m38L78N7k21J80l84L94J6k51L62l38K80j57K40p1k99NK16j22JL94o66
$$ plain form
7815 75 -477 35 -391 -108 -135 -650 224 -173 -138 -36 292 -116 200 -99 -59 -46 -198 136 133 -63 -351 -51
7837 -51 386 -738 918 162 1051 391 835 -383 -183 -624 854 -432 -794 -182 -8 -667 527 79
7855 79 128 177 -95 -12 245 -100 78 288 120 282 -127 -189 246 -1161 -407 -399 139 203 -20 508 -832 51
7877 51 -406 151 -578 464 -294 42 19 79 495 51 570 623 112 316 -102 -636 133 -67 -89 -55 -7 -52
7899 -52 -25 151 91 53 -41 54 -200 14 111 -15 127 -78 89 -270 415 -191 -24 -538 591 -648 116 -210
7921 -210 -426 207 194 -415 -269 288 1242 -527 127 -307 23 -568 429 -454 517 78 96 228 -852 168
7941 168 34 309 -189 -59 -421 114 -353 -381 -503 -639 256 71 -36 -59 -11 -440 -510 -15 -140 8 130
7962 130 -308 70 127 -94 86 -298 96 112 -139 223 -115 165 8 248 177 -122 -117 99 -23 -22 372 -294
7984b94L43k61K65k0J68J31k48J17m41K78k04N6n9J62M6R6K2k26Q4q5J20l9O8
8007G9oJ0L7k31K15N0j87%k39L02j44L18k48%L7O7o9o1J69r5k48L12J30m1k13
8032e6J79o4k2j15J42L00o1k80K16o24L42j00J24L91l88q0K69k73q2L5Q2J39J36
8055B10l16m3Q5M4J15k19N7J5P8q2K35j75j44qL26k01K27k3k3j6K30m01q0L48
8079B39k86J04Q1k24L3J72O9l94J16N9k13M57j63k24J51o7J88m0j13J91l05P4
8101i5Q3p9j08K29o4J97j53J6N7o2Q4l2l14K66o7N4M00l58j83P7l9J36J04%j19
8126C0l6j83K74R4j58MO5j55M0k19L36k4j22j7L2R0n4j58N0m3R3N9j29K0K3N8
8152c0k11J82n2nL21j29l3j80o9J39j7O8J5L33m09J06R8k89O6O0M6P7Nj53O4k2
$$ plain form
7984 -294 49 -212 53 33 201 332 84 201 -240 38 -166 -110 -169 -7 39 135 157 -69 15 -70 50 11 79
8007 79 73 83 120 -111 104 154 -33 -33 -272 30 -114 204 -44 -44 -7 60 -9 -70 99 4 -244 68 198 157 -56
8032 -56 123 59 37 -78 64 364 303 23 239 -385 -43 -143 -19 372 -16 -96 173 -100 -182 -147 -65 74 210
8055 210 -106 -149 -64 -20 95 -124 -67 -52 26 -56 179 4 -140 -148 178 -23 204 181 158 142 372 -29 -109 239
8079 239 -47 57 138 -86 -53 119 188 -206 -90 -31 -244 213 50 -174 -23 -90 98 58 -55 136 -169 -95
8101 -95 -12 -91 -199 30 -34 163 10 26 83 21 105 73 -241 25 -42 12 412 54 -129 -52 -91 45 149 149 30
8126 30 -6 -189 85 179 21 25 90 -65 -25 -244 92 68 -54 -71 -39 51 -3 -161 -111 -154 -61 -2 -131 -111 -88 -30
8152 -30 -241 -59 -111 -116 205 76 43 -137 -206 -67 -84 -16 -1 332 -77 29 127 -162 -96 -36 10 87 92 -61 3 -19
8178a9P1P5k82P1j34Q4m3J89Kj09M21l86R3
$$ plain form
8178 -19 52 127 -155 -84 -218 -134 -177 12 14 -95 326 -60 33
8191C3
$$ Imaginary data points
##PAGE= N=2
##DATA TABLE= (X++(I..I)), XYDATA
0@%%%%%%%%%%%%%%%%%%%Qj6J6j6J6j6K2l0L2l2M0m8N4o2P0p8Q6r7J08j21J35j50
41g9J68j87K07k29K52k78L08l40L75m12M52m99N51o08O71p45Q30r26J040j177
61f26J343j551J819k179K697l499M934q320L5376J5518k5548l182o435m179o575
76d07N802O35m545o595R34n437o125J80M953l553k684Q18O48n511l22N551J779
93a3879p10M395M612r19k364J367j303o116l462K654R7l070K247L239j711k104
109a7027L495L537NJ770M045O67n121J41K049j340k05O366O104J66K124O017J380
126A4173j961R00J812j706m245K270J063l341k7L056q30k684K279K442p53j600
142A0848J690J17m097j574J588m5k534J358L057p57j023K848J431k971k021O00
$$ plain form
0 0 0 0 0 0 0 0 0 0 0 0 0 0 0 0 0 0 0 0 0 8 -8 8 -8 8 -8 14 -16 16 -16 24 -24 30 -32 38 -40 46 -51 57 -64 71 -79
41 -79 89 -98 109 -120 132 -146 162 -178 197 -215 237 -262 289 -319 352 -393 437 -489 551 -626
61 -626 717 -834 985 -1194 1503 -1996 2938 -5382 29994 45512 19964 16782 10347 6168 -407
76 -407 5395 6030 1485 -5110 -4176 -9613 -15738 -15558 -10605 -14158 -16842 -16024 -15376 -20887 -21209 -15658 -13879
93 -13879 -14589 -10194 -5582 -6501 -8865 -7498 -8801 -14917 -18379 -15725 -15628 -18698 -16451 -13212 -14923 -17027
109 -17027 -13532 -9995 -9990 -8220 -4175 -3508 -8629 -8488 -6439 -7779 -7984 -1618 4486 4652 6776 12793 14173
126 14173 12212 13112 14924 13218 8973 11243 12306 8965 8938 11994 11164 8480 10759 13201 12448 10848
142 10848 12538 12655 8558 6984 8572 8527 5993 7351 10408 9651 8628 11476 12907 9936 7915 8515
158H515l149n193k648p21k970l156J515P63k615p25K457L46k118P7K207k197k509
175a2121J330J261j473m67K836J223l56J084K743j251j812N66q91k878p79J949
191i036k23j051K351L089n42O20L438K853m8R33K567Q05j910O52J449n02j149
208D296J684J614m93L23K244J10k111o9Q47j927k153J634k81m37K50J659P0q15
226F445J354N84o2r69J39q76k725j454K78j625k176O16N54o18j441O95J49k078
244c210q83J155r32k206K89Q0m71j087J276K13n41q2J195J18m69k63R62j430j04
263f390N78m53j092J484J580j60L33J767Q80N6M97N5J59m56N03O01O1j40O78J272
283A813K66Q50J302L88q50j07J970q04r82J066J6K05m11N21R76j401k86P48j024
$$ plain form
158 8515 5366 173 -2475 -3196 -6166 -9322 -7807 -7044 -9659 -10384 -7927 -7581 -9699 -9622 -7415 -9612 -12121
175 -12121 -10791 -9530 -11003 -11470 -8634 -7411 -7767 -6683 -3940 -5191 -7003 -6437 -7328 -10206 -10985 -9036
191 -9036 -9259 -10310 -7959 -4870 -5412 -4792 -1354 1499 1451 2384 4951 5756 3846 4498 5947 5445 4296
208 4296 5980 7594 7101 7424 9668 9778 7667 7598 8445 6518 4365 5999 5718 5281 5531 7190 7260 6445
226 6445 7799 8383 8321 7352 7491 6615 3890 2436 2714 1089 -1087 -471 83 -535 -1976 -1281 -1132 -3210
244 -3210 -4093 -2938 -3870 -6076 -5787 -5707 -6178 -7265 -5989 -5776 -6317 -6399 -5204 -5086 -5555 -5818 -4856 -6286 -6390
263 -6390 -5812 -6265 -7357 -5873 -4293 -4453 -4120 -2353 -1473 -1417 -920 -865 -706 -1162 -659 -58 3 -137 541 1813
283 1813 2079 2929 4231 4619 3769 3662 5632 4828 3846 4912 4928 5133 4722 5243 6219 4818 4532 5280 4256
302D256q78N00m94n99q61K68l38o87n7J191K74j290m0J77r93o53O79k14j777m37
322a973q69m33r40M86j5J04j372Q56L67q32R4J168J6j219J327R0q65K99J046J05
342b560n03O70N2n70j38J707M86m53r85M65O28L80K36J275l62Q4J162L90k98O90
362B356M93P46j434l38J401m72J509m29n26j241O61L09J61m07Q84j34o10q17m26
381A686N99n44K23P91r93l74J51j392J467l74j052L40o82j34l79L03o77l90O82
400g49m17j050J84K59k95M3k16j21j474M02R37l5L8M09o33Q4m23P61p73J88L49
421b532J460o09k01J432k44k24k0P3J70M07l29P42L41m35L89K68J22m48R45j01
441A206k09L35P27P7m61n62J042N3J34J11j20n4n61R68o73jL61k95o96r6M41n19
$$ plain form
302 4256 3378 3878 3384 2785 1924 2192 1854 1167 1110 2301 2575 1285 1245 1422 429 -224 455 241 -1536 -1973
322 -1973 -2842 -3275 -4215 -3729 -3744 -3640 -5012 -4156 -3789 -4621 -4527 -3359 -3343 -4562 -3235 -3145 -4010 -3711 -2665 -2560
342 -2560 -3063 -2393 -2341 -2911 -3049 -1342 -856 -1309 -2294 -1829 -1201 -821 -585 690 328 412 1574 1964 1666 2356
362 2356 2849 3595 2161 1823 3224 2752 4261 3832 3306 2065 2726 3035 3196 2789 3673 3539 2929 2112 1686
381 1686 2285 1741 1964 2755 1762 1388 1539 147 1614 1240 188 528 -154 -288 -667 -364 -1041 -1431 -749
400 -749 -1166 -2216 -2032 -1773 -2068 -2025 -2241 -2362 -3836 -3434 -2497 -2532 -2494 -2085 -2718 -2634 -3057 -2296 -3069 -2881 -2532
421 -2532 -1072 -1681 -1882 -450 -694 -918 -938 -865 -695 -288 -617 125 466 31 420 688 810 362 1307 1206
441 1206 997 1332 2059 2136 1675 1113 2155 2208 2342 2453 2333 2279 1718 2686 2013 2012 2373 2078 1382 1286 1727 1208
463A208j84N9J08j27l64P9l06m25J24l6K6q29K27J92l07l2l97J43J5j03j7l25
485a271M98r44j7K59k09l72O92J08n92R57n01m01l53J116m05L21J37j29M39n25
505a192j6L11l52J26N12L23M9L4M69r4l38j88P73n81M96M90n3p22R44J58n59Q7
527F77L83Q1m2J52l39j25k37N4K97q6P5N2N99l43k66L45k76l81K56j17J54n07
549D06J50K57o31P6Q2l11K6J21K57l91l60N69k81j93j78O6J23n2K1M7l62j85L38
572d05n06J58j86O73l38j94P0J04j5m61P35o8o8J18l4q4p7%K32k36o4L44j36K42
596a96k17M39k15l74K29q4N29m04N48J23m91q4K65l11L68l49O91k18k03J39k7
617A58k0o9j78P00l36p11J48P13q70R80o26J93j83J067J2n59M80k24j001o27J900
$$ plain form
463 1208 1024 1083 1191 1064 700 779 473 48 172 136 162 -667 -440 -248 -555 -587 -984 -841 -826 -929 -946 -1271
485 -1271 -773 -1717 -1734 -1475 -1684 -2056 -1364 -1256 -1848 -891 -1392 -1793 -2146 -1030 -1435 -1114 -977 -1106 -667 -1192
505 -1192 -1208 -897 -1249 -1123 -611 -288 -239 -205 264 170 -168 -356 417 -164 332 822 769 47 991 1149 590 677
527 677 1060 1141 1099 1251 912 787 550 604 901 815 890 942 1541 1198 932 1277 1001 620 876 759 913 406
549 406 556 813 182 258 340 29 55 176 433 42 -318 251 -30 -223 -401 -335 -212 -264 -243 -196 -558 -743 -405
572 -405 -911 -753 -939 -266 -604 -798 -728 -624 -639 -1100 -365 -433 -501 -383 -417 -501 -578 -578 -346 -582 -646 -302 -438 -196
596 -196 -413 26 -189 -563 -334 -418 111 -293 255 378 -113 -197 68 -243 125 -224 467 249 46 185 158
617 158 138 69 -109 591 255 -456 -308 405 -465 515 -111 82 -101 966 978 419 899 675 -326 -953 947
638I47m59o9k9J25r2p48P94l93k5M9Q18r88Q95n03m23L93KMN27r29J90j16M29
661C99n60k7N52n40L89j76L07m55j58m15J244j066L62j01M91q32L2K26m40L53
681d15L45j2l75mj77L71j54J65j03K9K33j22L6J34k16J59P1m1k50K98k98J85J89
704D8p9j90K68k9K13l67K60NmL2R8l62P55rm03o1j56J54Q2l6j22Q0P6j29L3L79
730E36m40L96k7o4q4KJ77j85o2K0K8J85j61Q3j18r0j70K38k53K18j49K34j6l02
754dK61j13L6j01N9r6j27J10j39J49l09J64o0j31J14O2P3q4j42M6j58Q2M8J76
778h4l45J91p5J62k91J21NQ4R3l29J10K23j55Q3j08L4P5l7j02K50o8r1K72m26
802d08J46n5L9k7J04P7J75l03R9R5K64K0j0n8J33j16J07m8m2j90J99K67m91J81
$$ plain form
638 947 488 419 390 515 423 -325 469 76 51 100 918 -70 825 322 -101 292 294 298 825 -104 86 -30 399
661 399 -161 -188 364 -176 213 37 344 -111 -269 -684 560 -506 -144 -245 246 -586 -554 -328 -768 -415
681 -415 -70 -82 -457 -461 -638 -267 -421 -256 -359 -330 -97 -219 -183 -49 -265 -106 -35 -76 -326 -28 -326 -141 48
704 48 -31 -221 47 18 231 -136 124 129 125 157 255 -107 648 639 236 175 19 173 255 219 97 177 253 124 157 536
730 536 96 492 465 401 317 319 496 311 249 269 297 482 321 404 286 196 26 264 11 229 80 314 298 -4
754 -4 257 144 180 79 138 42 -85 25 -114 35 -274 -110 -170 -301 -187 -125 -52 -136 -278 -232 -390 -308 -260 -84
778 -84 -429 -238 -313 -151 -442 -321 -316 -232 -139 -468 -358 -135 -290 -207 -315 -281 -206 -243 -345 -95 -163 -254 18 -408
802 -408 -262 -317 -278 -305 -201 -124 51 -252 -153 -58 206 226 216 158 291 175 282 234 192 2 201 468 -23 158
826A58q9K60O1K58k72n5O4o4k7O6O7p1J11K6j74m8KRr6R8n49K48m75N65Q11n78
852C06k56K57l1l58L93l90K75n0j31j1J7r0j41K5k5R6j40pM9r3o1K22n2l5j31
877c62j2K4l7K13k69K83k00j35Pj00N8L35k03J09J39k42L22j02K4m5k81K92l8
900b20J75J0NJ45k19m6J77n1K66j66k00L93Q5J8k94M5M78k81J44N5Q8M2k41p9
924C29O7o8o3j84M95j88j8Q8j2O5r9j65K56J53j20j8J5m11j90J58q1J41J60R3
948D03l59J36n7k89K33j69R4L3k50M67l35j51J86j9k65J23j46q2J98l21R4J17
970c59l75J12J21k29K42J97J16k87K69O8J80n45oK94j71J82j69j3P0J82J43j15
992i3J84j63J73M04n23r4J48j6P3M6N6j08M8K88q3m8j7Q5k75K20o1r1J09j17L97
$$ plain form
826 158 69 329 390 648 376 321 385 321 294 360 427 356 467 493 319 271 273 282 186 284 -265 -17 -492 73 884 306
852 306 50 307 276 -82 311 -79 196 146 15 4 21 -69 -210 -185 -210 -114 -254 -261 -212 -305 -366 -144 -196 -231 -362
877 -362 -374 -350 -387 -174 -443 -160 -360 -495 -488 -588 -530 -195 -398 -289 -150 -392 -70 -172 -148 -193 -474 -182 -220
900 -220 -45 -35 -30 115 -104 -150 27 -24 242 76 -124 269 354 372 78 123 601 320 464 519 607 649 408 329
924 329 396 328 265 81 576 388 370 458 446 511 412 247 503 656 536 518 533 122 -68 90 9 150 310 403
948 403 44 180 123 -166 67 -102 -8 25 -225 242 -93 -244 -58 -77 -342 -219 -365 -447 -249 -570 -476 -359
970 -359 -734 -622 -501 -730 -488 -291 -175 -462 -193 -125 55 -490 -496 -202 -373 -191 -360 -373 -303 -121 22 -93
992 -93 91 -72 101 505 -18 -112 36 20 93 139 195 87 135 423 340 292 275 360 85 305 244 153 262 145 542
1017E42k73j90J72R8K12l57J86j47j24k5K46j62j3l09J43K52n3l37K59K05k31
1038I4j30J73Ml16K53k77K50j24o0K6J34K60l29J9m28L06m9J55Q4n61J66J68k41
1061d23L82k37M23j52K17q7l08N46p45J14OJ83K49k32k96o02J92O47L44m13Q0
1082a12K46j063R27K3N76o22l11J83J18J87j57NK27j30n5r7J49J37p7K15l50J50
1104A69j87k6K77J4j64J29j79L6J46p8r4K20K8j78Oj7J81j89J10J90k43k02J05
1127E4K17M5q1m7j54J97j97K0Q9k01J39J03j07M5J1l38L11J16l56K36j23J10m
1150H5k75K78j44J68j04j4J55m51K48J83k45p0n3N0k7qK90l02J25P9j71p2j20
1173c95J01L15j61J93l12K82k53J15L01m02J29j96J75OJ46p0o0k45M3L67p9j89
$$ plain form
1017 542 269 79 251 349 561 204 390 243 119 94 340 178 165 -144 -1 251 198 -139 120 325 94
1038 94 -36 137 141 -175 78 -199 51 -73 -133 -107 27 287 -42 -23 -451 -145 -194 -39 45 -516 -350 -182 -423
1061 -423 -41 -278 145 -7 210 123 -185 361 -384 -270 -264 -81 168 -64 -360 -962 -770 -123 221 -192 -112
1082 -112 134 -929 -2 21 597 -25 -336 -153 -35 152 -5 0 227 97 42 -55 94 231 154 369 19 169
1104 169 -18 -44 233 247 83 212 33 69 215 137 43 263 291 113 119 102 283 94 204 394 151 -51 54
1127 54 271 316 235 188 34 231 34 54 143 -58 81 184 77 122 133 -205 106 222 -134 102 -21 89 85
1150 85 -190 88 -56 112 8 -6 149 -302 -54 129 -116 -186 -239 -189 -216 -224 66 -236 -111 -32 -203 -275 -395
1173 -395 -294 21 -140 53 -259 23 -230 -115 186 -216 -87 -283 -108 -102 44 -26 -86 -331 -288 79 0 -189
1195a89J70J15p2r2j25K02J14k39J72M7l23M59j24j6R0j02K97k04J6j46P2j34
1217a2j5J43J68o34N59J59j53j9N2j81K9k16L84j91j8O7J3rl6N6r8K2K5k32N7
1242h0Q5J99r7m8j15m3J24k20K69K3j18l10K79M59n86l55N64l54L43p3K15l82
1264b21k12P86j034L87P4L85Q0j130N26M76j28L3j93o7j61R7K83j8j70pJ45R6
1286B7k85K42K9N7j68P8O6k05K58JL26n32L25R9l18J80j76J41j47J18L23r7k68
1309G4L14k12n4j61L60l18J63q1L42k63m81N42J07j78J3J49rk60R0J08k24n4K27
1332A94P6k90j02J5J78r9J83k03m9J18R9j41j42j56J30J72l03K77m8j94P0J29
1354h6K70m27P4j83M2N2P2K0l5J03l03R5J20q3p5J01k7K36J12k14j90J77J55j80
$$ plain form
1195 -189 -19 96 24 -68 -193 9 123 -116 56 103 -220 239 115 99 189 87 384 180 196 50 122 -12
1217 -12 -27 116 284 -350 209 368 215 196 248 67 96 -120 264 73 55 122 135 126 90 146 48 70 95 -137 -80
1242 -80 5 204 107 59 -56 -99 25 -195 74 97 -21 -331 -52 407 -179 -534 30 -324 19 -54 161 -221
1264 -221 -433 353 -681 -294 -220 165 245 -885 -359 117 -11 22 -171 -238 -399 -302 -19 -37 -207 -214 -69 27
1286 27 -258 -16 13 70 -98 -20 46 -159 99 100 426 -106 219 318 0 180 4 145 -2 116 439 342 74
1309 74 388 176 122 -39 321 3 166 85 427 164 -317 225 332 154 167 316 307 47 137 245 21 -33 194
1332 194 270 -20 -122 -107 71 -28 155 -48 -97 21 120 -21 -163 -319 -189 -17 -320 -43 -91 -285 -215 -86
1354 -86 184 -243 -169 -352 -310 -258 -186 -166 -201 -98 -401 -306 -186 -269 -344 -243 -270 -34 78 -136 -326 -149 6 -174
1378a74MK95q9J87l76J70m9k40O07n03L32j11m9J16J06p1M6Pl78J61R3J84k46
1401B2J88Q0m03L88J20j43Mk86L90q4k33K88j55k9P6J16J33j55l00Q6K66l06L34
1424C97j18k03k3J01p7k73K93r7j45R6K9jq1o3j5J41k43J19LJ13o9J34l2k90J3
1449b91Q8k29J68K49j81J15m70L10M00m49K45J19m77O63j41j60p21q8J311n63
1469a02K03l4J78n89J74Q9n2M8J64Q5R2k80N6K34l12N05L31q01K35p6J65M9l86
1492b4j06M32n94Q39j84m47L17j31K40k93j62L46R9n14P2M08r3m23J37o8m5J11
1514h3J46M34q05l68M32O47l92L70k64p83M31N3j58N19j37O6k85N50p84M65k83
1535b29k0N90q44R08p11P12n13M74p4O6k82q6R9k30M67l64L99n67L68P6k76P9
$$ plain form
1378 -174 -170 125 36 223 -153 17 -32 -272 335 -168 164 53 4 120 226 155 201 208 -170 -9 84 268 22
1401 22 210 290 -113 275 395 252 256 -30 360 276 43 331 176 147 223 339 472 317 17 103 369 63 397
1424 397 279 76 53 154 77 -196 97 0 -145 -49 -20 -21 -102 -165 -180 -39 -282 -163 -160 -47 -116 18 -14 -304 -291
1449 -291 -203 -432 -264 -15 -196 -81 -551 -241 159 -290 -45 74 -403 260 119 -41 -762 -850 461 -102
1469 -102 101 67 245 -344 -170 -81 -133 -85 79 164 256 -24 32 266 -46 459 790 -11 224 148 313 362 -24
1492 -24 -130 302 -292 547 363 -84 233 102 342 49 -113 233 332 -182 -110 298 205 -218 -81 -149 -194 -83
1514 -83 63 497 -308 -676 -244 403 11 381 117 -666 -235 -182 -340 179 42 108 -177 373 -411 54 -229
1535 -229 -249 341 -503 405 -306 406 -107 367 293 359 77 -9 90 -140 327 -37 362 -205 163 239 -37 42
1557D2K33J65j19j97Q7l27N82n13J94l24N02o13O21k03m00j30R88o55J64j66J47
1578G8L38m85l45R0M37J3m11O61n77M06m77R4j63K30oM72r30M42K47q46K90N08
1600F6m45J40K22k61j48j83L92k4q4M02j74l8k95O69J62o16M72k88m53L99r9J6
1622a68N23l46M20l11L42K02j0p20J62J75k54J51j7K85J50k91j19J55k36K5O1
1643A79L62p6o6k66l15N62j06n7j65L23k94K9J89l17j37J5M4o0J35j78Jj87l6
1666d21J80k75K54j22k6k0K18k09k25J57P2J01m5j8k08R6R4P8L4o4p8L37P9l41
1690c52K13J07L8k52L75J20j98J88k38K20N5r2J91J40r1J10M1j42j67J96L6k78
1712B20K14J05q0L74k80M9R1j67m7J00k34K75q6j34l39L49Rk49L38k77O9k31R5
$$ plain form
1557 42 275 440 321 124 211 -116 466 -47 147 -177 325 -288 333 130 -270 -400 588 -67 97 -69 78
1578 78 416 -69 -414 -324 113 126 -285 376 -201 205 -272 -178 -341 -111 -117 355 -575 -133 114 -732 -442 66
1600 66 -379 -239 -17 -278 -426 -609 -217 -241 -325 77 -97 -135 -430 239 401 -215 257 -31 -484 -85 -184 -168
1622 -168 355 9 429 118 460 662 652 -68 94 269 15 166 149 434 584 293 174 329 93 118 179
1643 179 541 465 399 133 -182 380 274 217 52 375 81 110 299 -18 -155 -140 -96 -156 -21 -199 -198 -385 -421
1666 -421 -241 -516 -262 -384 -410 -430 -212 -421 -646 -489 -417 -316 -361 -379 -587 -491 -397 -319 -285 -349 -427 -90 -11 -352
1690 -352 -139 -32 6 -246 129 249 51 239 1 221 276 184 375 515 424 534 575 433 266 462 498 220
1712 220 434 539 459 833 553 602 693 526 479 579 345 620 534 400 61 410 419 170 508 231 300 69 164
1735A64j01r2j60Pk3r4K91Jj60k95J49j96r3J65q0ok01J81j85R6RO9r4J04Q5j80
1761f39J1J4j81J88K79m2K8L1l91K27L74l10K96j13p6N43l24J62K51k61J41k3
1783A85rL35n4l5J02L6P2J2M2K3K1j17N1Q6j44L2J85m07K48k08J90P6l46J74J19
1808F69k85l05o8j0K44j85L38j41k71j07j56L22j58k8k25K31K4k39o9j33j9J19
1830d52j50J53j16k1P8M5k11K8r3M3n8K9K64l5k0J84R6k72J88n7J52n6J57o7M
1855a87Q7K47j82o8K11J32K1L0O0j37K84j19J65m3p3K95k36J0k63M73j4k56k4
1878D13Q9j46K0J15n4k21R5R3K25m11J18L5j4j94o0O0K41m12K13k05J1k41K10
1901b0j00n5j02P5k44r0J60q5j1M0q4J28j12q7J94j90K05J12j95j82K71o4N0R1
$$ plain form
1735 164 63 -29 -189 -182 -205 -299 -8 -7 -167 -462 -313 -509 -602 -437 -517 -523 -724 -543 -728 -632 -623 -554 -648 -544 -459 -639
1761 -639 -628 -614 -795 -607 -328 -370 -342 -311 -702 -475 -101 -411 -115 -228 -304 239 -85 77 328 67 208 185
1783 185 176 511 457 422 524 560 632 644 686 709 730 613 664 750 606 638 823 416 664 456 646 722 376 550 669
1808 669 384 79 11 1 245 60 398 257 -14 -121 -277 45 -113 -141 -366 -135 -111 -350 -419 -552 -571 -452
1830 -452 -602 -449 -565 -586 -508 -463 -674 -646 -739 -696 -754 -725 -461 -496 -516 -332 -236 -508 -320 -377 -225 -281 -124 -191 -187
1855 -187 -100 147 -35 -103 108 240 261 291 351 214 498 379 544 501 428 723 487 497 234 707 693 437 413
1878 413 502 356 376 491 437 216 311 404 629 218 336 371 357 163 103 163 404 -8 205 0 11 -230 -20
1901 -20 -120 -175 -277 -202 -446 -536 -376 -461 -472 -432 -516 -388 -500 -587 -393 -583 -378 -266 -461 -643 -372 -436 -386 -295
1925b95l66L15Q3k12K25k9O0p7J16p5J48J30k96K40K1L67j19k83K89Oj34M5N6
1948B15J52r2k59M29Q4q1j28J19O0j66J40k65J33n9J30m5L6nl63R0J50j41J19
1971B53m7j10J25j90k08K11L1j27R4K97m23k0k60L56l53R0J9J17k98J34J30K29
1993E0l53K40m86J85K40L3k10n1L2m5J68K46l32J93J39j98j1J16rJ71n5j16N27
2016D74l08o6n3J00j42J58oP3j4J97k63N6J67k17K19k58r0K59N3J26k44j82k54
2039b15R78n39j93K40j62j55J06m1O4p8J01m4k5k30L21l87J38Q6J56k75L4j70
2061b90N0Q6j18m5J8K21j27L5j33j07K47j50K06j43j8j02K18m0l8j51K27L3mO9
2085e6j50K61O6Lj59k7J73O6j0J81j65J01j45N9J34J3k66j32L72j81K45k30J67
$$ plain form
1925 -295 -661 -346 -263 -475 -250 -279 -219 -296 -180 -255 -107 23 -273 -33 -12 355 236 -47 242 248 114 159 215
1948 215 367 275 16 445 529 448 320 439 499 333 473 208 341 282 412 367 403 398 35 125 275 134 253
1971 253 206 96 221 31 -177 34 65 -62 32 329 -94 -114 -374 -18 -371 -281 -262 -145 -443 -309 -179 50
1993 50 -303 -63 -549 -364 -124 -91 -301 -352 -320 -365 -197 49 -283 -90 49 -149 -160 -44 -53 118 63 -53 474
2016 474 166 100 47 147 5 163 157 230 216 413 150 206 373 156 375 117 27 286 339 465 221 39 -215
2039 -215 763 224 31 271 109 -46 60 19 83 5 106 62 37 -193 128 -259 -121 -35 121 -154 -120 -290
2061 -290 -240 -154 -272 -317 -299 -78 -205 -170 -303 -410 -163 -313 -107 -250 -268 -370 -152 -192 -230 -381 -154 -121 -125 -56
2085 -56 -206 55 121 124 -35 -62 111 177 167 348 183 284 139 198 332 345 79 -53 319 138 383 153 320
2108C20K8j87J07m8K02j88Q2k58J98n3O2j33P8Q9PQ6k29Ll83J08O1j14J75m21
2132d08M06k86P7nJ12o8k58R4J80L7J13N0k71l2k86N10n09N41k35K49l01k35K99
2155b26M1l44N6K77j52K72M1j93N4K05j49K72l49K18R4J17k26j4K35j19k1k20
2177a31J97K77M6N9j82q2R0j97J4K53j24n3J6j73J53o5l4K37n3Mj1L8j91L2l8
2202H2oM8Q3j20p1n7O5o7j17J95k26K95j69j14K08ok64N3K36j43n7n3q6M6mK10
2228c9l37m0K21l1M5k10J21K65r6K53m52OJ43L8k96O4J21J45M2m2L5J03j01j9
2252f1NM4m8K14j17N4k8j00P3l2k1r6J00k5J90J50j20J27j29k98L31J07j80j25
2276A5J95k4j45J47r4K2Q0j64l9M7O5o2K22j18o3k15M27k26o6j56L36q3m5o5K7
$$ plain form
2108 320 348 161 268 220 422 234 316 58 256 203 265 132 210 299 306 392 163 166 -217 -109 -48 -162 13 -408
2132 -408 -2 -288 -211 -216 -104 -172 -430 -336 -156 -119 -6 44 -227 -259 -545 -35 -544 -3 -238 11 -290 -525 -226
2155 -226 -185 -529 -473 -196 -348 -76 -35 -228 -174 31 -118 154 -195 23 117 234 8 -6 229 110 89 -131
2177 -131 66 343 389 448 266 184 274 77 91 344 220 167 183 10 163 98 64 301 248 252 241 279 88 120 82
2202 82 76 124 207 87 16 -41 24 -43 -160 35 -191 104 -65 -179 29 23 -241 -188 48 -95 -152 -205 -291 -245 -249 -39
2228 -39 -376 -416 -195 -226 -181 -391 -270 -5 -101 152 -300 -294 -151 -113 -409 -345 -224 -79 -37 -79 -44 59 -42 -61
2252 -61 -56 -12 -60 154 37 91 63 -37 36 4 -17 -113 -13 -38 152 302 182 309 180 -118 213 320 140 15
2276 15 210 186 41 188 94 116 196 32 -7 40 105 43 265 147 84 -131 296 70 4 -152 184 101 56 -9 18
2301A8L9j34j8kN4j33L20j98J66k47J03q8j42L89k5j53Q7n6l65J41l4K96k64K8
2325b18l0m9K83k17K20j17J56j58j87P8J21K06j49J17j09J50k30J03R2p5l8J63
2347A12j6n1J80P2l61K10k1k17K94ll04J88m1J32J91j59k33O2R3o1j2o9k43N91
2371C34j92o8l0J99k00k01J4L63l3m21J72K34j3k41J55j95J66L06m81J17J06j97
2393a06J5MJ31k1R5j73K3L7j09K26k87n5L04R9j67Lj47J41N4k13K26n1Qj72J43
2418Hj65J54m1J29n3p7K10k52K6m7L31k28Q9j82J71o1rk04Q5J13l2j48j97N07
2442A27m09M17m1J46l88J44k22m1K20n9km5O8K80j49k7J97k75L7j63K66j0L3N4
2466A58J42n6r3o3r4r6L07nk26J14L3l5j2jJ96k15M7k9n7J08j84K0J18O3k9k83
$$ plain form
2301 18 57 -77 -95 -97 -43 -176 144 -54 112 -135 -32 -120 -262 127 102 -51 36 -20 -385 -244 -278 18 -246 -218
2325 -218 -248 -297 -14 -231 -11 -128 28 -130 -317 -239 -118 88 -61 56 -53 97 -133 -30 62 -13 -51 112
2347 112 96 45 225 297 -64 146 125 -92 202 199 -105 83 42 174 365 206 -27 35 128 67 55 -14 -257 334
2371 334 142 74 44 243 43 -158 -144 219 186 -235 -63 171 158 -83 72 -123 43 349 -132 -15 91 -106
2393 -106 -91 -87 44 23 118 -55 -32 5 -104 122 -165 -220 84 183 16 19 -128 13 67 -146 80 29 37 -135 8
2418 8 -157 -3 -44 85 32 -45 165 -87 -61 -108 223 -5 84 -98 73 12 3 -201 -116 -3 -35 -183 -380 127
2442 127 -282 135 94 240 -148 -4 -226 -267 -47 -106 -108 -153 -85 195 46 19 216 -59 -22 -185 81 71 104 158
2466 158 300 244 151 88 -6 -102 205 200 -26 88 121 86 74 73 269 54 101 72 15 123 -61 -41 77 140 111 -172
2492a72K13j00rJ78J01j57l9K29k91L14n14M48m44J20J90k8J13l61K50k93J52
2513a00O6J07p7k39L40L7l52LK01J67j72j63Mj74O22n95M08P9k04j95L72l1j57
2536e3r7K67j02l7m6p4J28q2p2K41J61l30k75N23L0j82J2j72r3K46oL8J00M7r9
2561G3j44J62J83l43J82j64J27k0J43j41j00M62m77K52j80O6J00j34k0J67k29
2582c5J53k32L6L49k09k91J31O2k2mk8J34K09m79K58J15p4l00L04o5K16Ml70J97
2606E9l78J75O3l4K14j32o3M0J28k94j12J42J7J81k62o0M03kq2m51K93R8J45j19
2630c1J5M5K37j91m40J6K84J27n6k9N9R7j77N1J8J2m5P2j37J56j13K57j30k4Q4
2655A57m16M2L92k76K52l21K30J47j19q8L9Nj60J81m2Oq3J16J9l2j36K67l5k19
$$ plain form
2492 -172 41 -59 -68 110 211 54 15 244 -47 267 -247 201 -243 -123 67 39 152 -209 41 -252 -100
2513 -100 -34 73 -4 -243 97 134 -218 -215 -14 153 -19 -182 -178 -352 270 -325 83 162 -42 -237 135 104 -53
2536 -53 -150 117 15 -22 -68 -142 -14 -96 -168 73 234 -96 -371 152 182 0 12 -160 -253 -7 -13 25 125 172 73
2561 73 -71 91 274 -69 113 -51 76 56 199 58 -42 420 -57 195 15 81 181 47 27 194 -35
2582 -35 118 -114 -78 271 62 -229 -98 -36 -58 -62 -90 44 253 -226 32 147 73 -227 77 12 228 232 -138 59
2606 59 -319 -144 -81 -115 99 -33 -96 -56 72 -222 -334 -192 -175 6 -256 -316 87 85 3 -448 -155 -57 88 -31
2630 -31 -16 29 266 75 -365 -349 -65 62 6 -23 36 133 -44 7 25 37 -8 64 -73 83 -30 227 97 73 157
2655 157 -259 -217 175 -101 151 -170 60 207 88 0 39 44 -116 65 23 29 -54 62 81 49 -87 180 145 -74
2679g4p3L74j24j66L79m54K70J27l19J85j87l36M74m22Q5Q87q72J22m6o7n7L96
2701A02q2j40Q7M1J24j62q9L69l5l18M2l5j47J04L5j88K09J30j10J9J29l5l14
2724b64K04P8J69l11n5J07J4K7j6J96k70J18m1N9J6k5OJ04q1o1P2p6J33J44k62
2749a5k0L7P0Nr1J89j34o1J18M4k08K56k15O4j94K37q0K85r0q3j3Jj33J61j20
2774A0R5o3j83m3K56K67k88j42J88j58K19qk21J10M2J9j42j28M8n0K85j07j13
2797a07p9Q8J87j62J63j22k12L57m0j19J98k38J68j36n7K9k9j39J69l8N64n45
2819a00P8m3P6k07K16J75k03j9%rK5j65R0K33j60KNL2J26j69j9R6r6J25rn4R9
2846A25j08j73N1K21k2p4lK27j13R6k02l5l3J23Q7j5j60J87q3n7q8l4J46K7j00
$$ plain form
2679 -74 -147 227 103 -63 316 -138 132 259 -60 125 -62 -398 76 -346 -261 626 -246 -124 -170 -237 -294 102
2701 102 20 -120 -33 8 132 -30 -119 250 215 -103 -61 -96 -243 -139 -104 -292 -83 47 -63 -44 85 50 -264
2724 -264 -60 18 187 -124 -179 -72 -58 -31 -47 149 -121 -3 -44 15 31 6 12 116 35 -26 46 -30 103 247 -15
2749 -15 -35 2 72 77 -14 175 41 -20 98 142 -66 190 -25 39 -155 82 2 287 197 114 101 102 -31 130 10
2774 10 105 42 -141 -184 72 339 51 -91 97 -61 158 150 -71 39 81 100 -42 -170 -122 -172 113 6 -107
2797 -107 -186 -98 89 -73 90 -32 -244 113 73 -46 152 -86 82 -54 -111 -82 -111 -250 -81 -119 445 -100
2819 -100 -22 -65 11 -196 20 195 -8 -27 -27 -36 -11 -176 -86 147 -13 -11 -6 26 152 -17 -36 60 -36 89 80 26 125
2846 125 17 -156 -105 116 94 20 17 244 131 227 25 -10 -43 80 167 152 -8 179 96 39 -49 -83 63 90 -10
2871a0P3o6J02Rj05j22L90r5j10k51K34j8j33K59M2r8mj03J63J68k18m8l16J90
2895f7K0L6l5j4P9k92j59K64JJ80k17j04J79J06J59J90j3o43L38K3l57N54rk78
2919e9k3O5j89r4L15J00k00L30k35L12l94K54m88L12j66K18K63m08L08o2l25K05
2941C9j02J57J17o9j10P2k59R0J6K2K69l54L60K1J41j26l10N6J25j30J79o9J64
2964B99l40k10J23J08J60k54J84l82K37L3O0k1j68K08L2j25J58k24N2o4J77N9
2986A02j60O8jJ7L01m09k17J70K80l71L36j36J6kj56K65l2j93K8j28M63m63K27
3009Ek54P5p3M19o32K41M61j40l75M42J86j42l65J50m9M5L52k10m70M04J58n56
3031c28L02j59M9L66q2k61o8OL50l61L32j63M3M9j80j31M29j49J83j23j79K72
$$ plain form
2871 -10 63 -3 99 108 3 -119 271 176 66 -185 49 31 -102 157 199 101 97 -6 157 325 107 59 -257 -67
2895 -67 -47 -11 -46 -60 19 -273 -432 -168 -167 13 -204 -308 -129 -23 136 326 313 -330 8 31 -326 228 219 -59
2919 -59 -82 -17 -206 -300 15 115 -85 245 10 322 -72 182 -306 6 -160 58 321 -87 221 159 -166 39
2941 39 -63 94 211 142 32 104 -155 -65 -49 -27 242 -112 248 269 410 284 -26 30 155 25 204 135 299
2964 299 -41 -251 -128 -20 140 -114 70 -312 -75 -42 18 -3 -171 37 69 -56 102 -122 -70 -134 43 102
2986 102 -58 10 9 26 327 -82 -299 -129 151 -220 116 -20 -4 -6 -162 103 71 -122 -94 -222 241 -222 5
3009 5 -249 -174 -247 172 -460 -219 242 102 -273 169 355 213 -152 -2 -51 -6 346 136 -334 70 228 -328
3031 -328 -26 -185 -136 230 148 -113 -181 -175 175 -186 146 -17 26 75 -105 -236 193 44 227 104 -75 197
3053A97n1k66P1O2J10r1n8o4K40o5j08J76j55J51k23K43pn29M85k85K20J02l15
3076a60K31j10k12J04J58j52J15J06J5l03K02J53l5k24P9l8j28K73J38m00J87
3097al1N2r8pP4o8K72j37n7K0mr0K71k22j09Q3O3P0Q6l39K64k80R0K22R1r7n9
3124E9m65M65l5j07J13j32j01O5J98j24J98r7J48k95lL24k67J88j37M4j08L64
3146B95k24kr1o0K6K71n6k09L55k18o5p0J05K7l5j60J69r2j36J35K25m20L45k18
3170a03R9N3p6Ok0j71J09j23J83j00K55j11N0J20L8k06o5j6K2n6J38j80lK82k25
3195a00O7R3J05j49J25k03L10m37PM0P4k0q3J67J49l4k16M03k96J67q5m9K7K28
3219B90l56r0Q7K88k7l06N7L1J50o4q9K86j70o1J20J15k40K74m92jR4K5J8K38
$$ plain form
3053 197 146 -120 -49 13 123 32 -26 -90 150 85 -23 153 -2 149 -74 169 162 -367 118 -167 53 155 -160
3076 -160 71 -39 -251 -147 11 -141 -26 80 95 -208 -6 147 112 -112 -33 -71 -199 74 212 -188 -1
3097 -1 -32 20 -78 -85 -11 -79 193 56 -1 19 15 -75 196 -26 -135 -52 11 81 167 -172 92 -188 -98 124 215 118 59
3124 59 -406 59 24 -83 30 -102 -203 -138 60 -64 134 37 185 -110 -113 211 -56 132 -5 39 -69 295
3146 295 71 69 -22 -82 -56 215 159 -50 305 87 22 -48 57 84 49 -111 58 -34 -170 -35 190 -230 115 -103
3170 -103 -4 49 -27 -21 -41 -212 -103 -226 -43 -143 112 1 51 171 209 3 -62 -78 -56 -112 26 -154 -157 125 -100
3195 -100 -33 60 165 16 141 -62 248 -189 -182 -142 -68 -88 -171 -4 145 111 -105 298 2 169 84 35 62 290
3219 290 -66 -156 -69 219 192 -114 -57 -26 124 60 -29 257 87 26 146 261 21 295 -197 -198 -104 -79 -61 177
3243A77L79j28m19K84j62K01j42n67P99l31l08K72K72P2q9j17l60K06q34Q58j73
3264a10K30l98M09j71K4j16M54J23n25N22k92o88N73J36N05n60j68J2j49N2M36
3285B99k41R8o47K19L4L20k37K73m56K16O08j006R79m15k81J024k40k84k76j44
3305a57L01J72j44J7P7p68P02nm16R0L55l44K18J5r8L06J67j051Q37J12m48m34
3327d96L30M29l74M69k8L33q02K06N35n56L91k85R0j54k29l52N11m13R19o82M25
3348B67J0j85l4M4n9P1p06M44M00M24m50l44J1J01K08p26Q77m67j8P32q79N49
3370B70k68M00k8r6n67J021r79J71M39j60l10L11no85m4L37L95j27M48p54K93
3391F2M19p48J19K78K8L58o99N07q15J02k3J189j012n8r6J94L98k88J55Q08q56
$$ plain form
3243 177 556 428 9 293 131 332 190 -377 422 91 -217 55 327 399 310 193 -167 39 -795 63 -110
3264 -110 120 -278 131 -40 -16 -132 322 445 -80 442 150 -538 35 171 676 116 -52 -40 -189 -137 299
3285 299 58 156 -491 -272 -238 82 -155 118 -338 -122 486 -520 459 44 -237 787 547 263 -13 -157
3305 -157 144 316 172 189 266 -502 200 195 -221 -131 224 -120 98 113 15 321 488 -563 274 386 -62 -496
3327 -496 -166 263 -111 358 330 663 -139 67 602 46 437 152 242 88 -141 -493 18 -395 524 -158 267
3348 267 277 92 58 102 43 114 -592 -148 252 676 226 -118 -107 -6 202 -524 353 -114 -132 600 -279 270
3370 270 2 402 374 278 -289 732 -247 -76 363 203 -107 204 199 -486 -530 -193 202 75 523 -231 62
3391 62 481 -267 -148 130 158 516 -183 324 -491 -389 -412 777 -235 -293 -389 -195 203 -85 70 878 22
3412B2k61N78q51L01J54Q92j091l99J058m64l85L91N0m0o6K23m57n6N44J90n09
3433a76P1K26k13L71j38q8pO0p5n9Q7k42M05j27OM4k77K09j59J16K58k58j21J63
3457G6J82k52K12j17m3k04K20o2r1K24l32M42m50K67J6kK6k46L6j31K8J74P7j27
3481g7kOj26J41o4L5l8Q3j5N1R1j13J0L3j57J9K47j89k24O1J53J7M6P1ok65K25
3508A3k0M6K35k75j2J2j2K30k88R2K87m54M7J26K22n6mj28j62Q4JJ47o2Q2k01
3533e0K34j93p4J61R6j58l4k51J75L07k63J38L8k6J93l69q5O0J0L20k81J15j88
3556a25J34j43K24j59m6j35J36P2J47k23n5n5rL78j63k42J44K8k2J62j51J23l57
3579c37J83K14m50L60k25L05l52N11m00J9K67j95j0N53p63l06L99K53L5l26J39
$$ plain form
3412 22 -239 339 -512 -211 -57 835 -256 -655 403 -61 -446 -55 -5 -45 -111 112 -345 -401 143 333 -176
3433 -176 -105 121 -92 279 141 53 46 106 31 -28 59 -183 222 95 101 145 -132 77 -82 34 292 34 -87 76
3457 76 258 6 218 101 58 -146 74 12 -79 145 -187 255 -195 72 88 86 112 -134 -98 -229 -201 -27 50 -77
3481 -77 -79 -73 -199 -58 -122 -87 -125 -42 -57 -6 85 -28 -18 15 -142 -123 124 -65 -289 -228 -75 -58 -12 59 53 -212 13
3508 13 -7 39 274 -1 -13 -1 -13 217 -71 21 308 -146 -99 27 249 193 189 61 -101 -17 -16 131 69 151 -50
3533 -50 184 -9 -83 78 174 16 -18 -269 -94 213 -50 88 126 100 293 -76 -161 -101 -91 229 -52 63 -125
3556 -125 9 -134 90 -69 -115 -250 -114 -42 105 -118 -173 -228 -237 141 -22 -264 -120 -92 -114 48 -103 20 -337
3579 -337 -154 60 -390 -30 -255 50 -302 209 -191 -172 95 -100 -110 443 -320 -626 -227 26 61 -265 -126
3600a26K65K51M41m75M5q3j076O75M85K90p37p25J120M5j51k0O54o14j91J295
3620A368r77P8j223P22J85Q51j527J518r63J26l09J3MK9k3K75j64j96N05j14j23
3641E5k01M12Q4k84M30m85K03l54J36j55L42m86P5M16l46n4j24l6N84k30O85p85
3663a18L34o8N4p17O13l6M83n55q9j59k83R10m07p77R39r7J070j158K96o8K89
3684D56o13O5m49k87K97K58N62m92M10m40K09L34j1l3j19l01O14n20L93m00j63
3705b30K23m48L87J72M99m78l23K83l35pK23J76o7J30L0j71n9j13mn1K22L13n29
3728a57J83r2J12r7j41Q2K65j28N7l0J19j07l39J97q6J25J24K2k44J02o2J34l9
3751@j30l7Q4J08j70r9r5N32j52O9J66j15l2j11j82j54K79O1n9J31p4L4K05L3
$$ plain form
3600 -126 139 390 831 356 401 318 -758 -83 402 692 -45 -770 350 395 244 224 878 264 73 1368
3620 1368 391 469 -754 -32 153 1004 -523 995 32 158 -151 -138 -134 -105 -128 147 -17 -213 292 178 55
3641 55 -146 266 350 66 496 11 214 -140 -4 -159 183 -303 -228 188 -158 -212 -336 -372 212 -18 667 -118
3663 -118 216 148 202 -515 98 62 545 -10 -99 -258 -541 369 -38 -815 124 27 1097 -61 235 167 456
3684 456 -157 -92 -541 -828 -531 -273 289 -203 207 -233 -24 310 299 266 147 -154 460 -60 333 -67 -230
3705 -230 -7 -455 -68 104 603 125 -198 85 -250 -257 -34 142 75 205 235 64 5 -108 -112 -163 59 372 -157
3728 -157 26 -66 46 -51 -192 -110 155 27 84 54 173 66 -273 -76 -162 -37 87 109 -135 -33 -95 39 0
3751 0 -130 -167 -83 25 -145 -244 -339 193 41 110 276 161 129 18 -164 -318 -39 22 -37 94 20 54 259 292
3775B92l64n9L21n4oR0k91L51j85k27J19j55J74J14M8o0j03l1l5o0O2K03j57j28
3799a41n4K55j55K70j56NK0j17K37m02K38K4O3Jk16m9JL66k84J4J96j21K78m05
3823a32K35L2k63M55l16N1l3%k1J27Q8l00L42j03j0k03K91m2K6p9p2l56K88l80
3847c75P29k18K57j15m53M58m29K62l15O2l5N73k52l64j02N09K00q37l8Q34O72
3868A023m62q30M33j16l90M17m3r7k03R7J61l12N68l18K89j21k44K9O4l65L48
3889g2J57n1k39k2K00k86M37o2j07M8M3k0R3J86k26rq5J7K94k90K13L7L9J62n91
3914a34O56k05k81K9j69J10L2O1L2l5j74K41Jj70N2k40J20M73j04k93K87j85r0
3937A4Q5j36j49m4K52Mj01K44j16m28K44L55k02o4K0j28K90l77K03R4j47K29k57
$$ plain form
3775 292 -72 -131 190 136 130 220 -71 280 95 -132 -13 -168 6 120 168 108 5 -26 -61 -121 -59 144 -13 -141
3799 -141 -195 60 -95 175 19 24 44 -73 164 -238 0 24 87 88 -128 -177 -176 190 -94 -80 116 -5 273 -132
3823 -132 103 135 -128 327 11 62 29 29 8 135 223 -77 265 162 152 -51 240 198 224 145 73 -283 5 -375
3847 -375 354 136 393 278 -175 283 -146 116 -199 -137 -172 401 149 -215 -317 192 392 -445 -483 351 1023
3868 1023 561 -269 164 48 -342 75 32 -65 -268 -171 -10 -322 246 -72 217 96 -148 -119 -55 -420 -72
3889 -72 85 34 -205 -227 -27 -313 124 62 -45 3 46 26 119 305 79 70 -15 2 296 6 219 256 295 457 -134
3914 -134 522 317 36 65 -104 6 38 99 131 96 -78 163 164 -6 46 -194 -74 399 295 2 289 104 14
3937 14 99 -37 -186 -230 22 26 -75 169 53 -375 -131 224 22 -42 -22 -150 140 -237 -34 60 -87 142 -115
3960a15J79q3K07l49K28j77L3R4k96J51K03l32L16o5P9k26K57l05K9K84l02j58
3982c48L29j94M62j4l93O97m01l68L20J88j77J59l13M1j45j22M11N0l66J88j10
4003a06j14J62n1L84m56J95Q5k06L33k02N8q1R2K87n37r3N83l88NQ4L2j97L68
4026B37l48Q4j8j4M00l93O5kl0j7L26n27K26j30J79j51J20J0o7K49k46K2m6O1
4050a0J14k72P3J35rJr8K4R3N1j90J35j34J00O7q6q9J5jQ4R1j3N6L4l62K87j37
4077d1J17j41j7P3J84k40Q4j86M7K31j19K25p6n0k00OK48m2J03l17L62k53J23
4100A21l0l26K56k2J70k77K53k38L06r1J25l2r7k17L14k40kL4J59k19j59N9M58
4123C05m59K3L23P3k48Pj79j82K75L48l62K62q2j40o4J80n8K3n1q0K4K03k94p7
$$ plain form
3960 -115 64 -19 188 -161 67 -110 -77 17 -279 -128 75 -257 59 -6 73 -153 104 -201 -172 112 -190 -348
3982 -348 -19 -213 249 235 -158 539 138 -230 90 278 101 260 -53 -12 -157 -279 132 182 -184 4 -106
4003 -106 -220 -58 -109 275 -181 14 99 -107 226 24 82 1 93 380 -157 -250 333 -55 -50 34 66 -131 237
4026 237 -111 -27 -45 -59 341 -52 13 11 -19 -36 290 -237 -11 -141 38 -113 7 17 -50 199 -47 -25 -71 -10
4050 -10 104 -168 -95 40 31 32 -66 -42 51 102 -88 47 -87 13 80 -6 -95 -80 -81 3 94 81 137 171 -191 96 -41
4077 -41 76 -65 -82 -9 175 -65 19 -167 -120 111 -8 217 141 91 -109 -103 145 103 206 -111 251 -2 121
4100 121 91 -235 21 -1 169 -108 145 -93 213 122 247 215 118 -99 215 -25 -27 7 166 -53 -212 -153 305
4123 305 -154 -131 192 265 17 24 -155 -337 -62 286 -76 186 104 -36 -100 80 22 45 -6 -86 -62 141 -153 -230
4147b30K78r0j37j5J68j58J53L07l40J41L4M1l70K55L2Jj09k9p5j5N3K20k53l5
4171a73J49QR2q3K9p5j44J66K25k67j56J90r1l8K24R1j00j84K62o4k66K65M5m25
4195c20K31J14J43l91J35J50k1r1J18J79k95J10j09O6J13r7q7J77j34J14l8J17
4217A84l21K95l00n2k2L70j99k1J55m6rl2J97J30m29J45J38l13J26r8J46j24O6
$$ plain form
4147 -230 48 -42 -179 -194 -26 -184 -31 276 -64 77 111 152 -218 37 69 70 -39 -68 -143 -158 -105 115 -138 -173
4171 -173 -24 -16 76 -7 22 -53 -197 -31 194 -73 -229 -39 -130 -168 56 147 47 -137 125 61 -205 60 105 -320
4195 -320 -89 25 168 -223 -88 62 41 -50 68 247 -48 62 -47 19 132 35 -52 125 -9 105 67 184
4217 184 -137 158 -142 -194 -216 154 -45 -66 89 43 34 2 199 329 -100 45 183 -130 -4 -102 44 -80 -14
$$ [...]
8191e7
##END NTUPLES=NMR FID
##END=
