##TITLE=1H_SR21_rm3
 CDCl3, 8 sc, 
 26.10.2020
##JCAMPDX= 6.0         $$ Bruker NMR JCAMP-DX V2.0
##DATA TYPE= NMR FID
##DATA CLASS= NTUPLES
##ORIGIN= UXNMR, Bruker Analytische Messtechnik GmbH
##OWNER= root
$$ XWIN-NMR		Version 3.5
$$ Mon Oct 26 13:40:43 2020 Russian Standard Time (UT+4h)  she@DPX200
##.OBSERVE FREQUENCY= 200.1315066352
##.OBSERVE NUCLEUS= ^1H
##.DELAY= (6, 6)
##.ACQUISITION MODE= SIMULTANEOUS
##.ACQUISITION SCHEME= undefined
##.AVERAGES= 8
##.DIGITISER RES= 18
##SPECTROMETER/DATA SYSTEM= spect
##.PULSE SEQUENCE= zg30
##.SOLVENT NAME= CDCl3
##.SHIFT REFERENCE= (INTERNAL, CDCl3, 0, 15.7039)
##AUDIT TRAIL= $$ (NUMBER, WHEN, WHO, WHERE, WHAT)
$$ ##TITLE= Audit trail, XWIN-NMR		Version 3.5
$$ ##JCAMPDX= 5.01
$$ ##ORIGIN= Bruker BioSpin GmbH
$$ ##OWNER= she
$$ F:/spectra/data/she/nmr/H-F/1/audita.txt
$$ ##AUDIT TRAIL=  $$ (NUMBER, WHEN, WHO, WHERE, WHAT)
(   1,<2020-10-26 13:39:01.18 +0400>,<she>,<DPX200>,
      <created by zg, POWCHK disabled, PULCHK disabled
       configuration hash MD5:
       00 E9 B6 7A A2 85 ED C7 34 08 36 98 17 FE 4E 26
       data hash MD5: 16K
       79 D1 D8 A6 96 06 59 0D D1 9D 86 A2 77 78 BF FC>)
$$ ##END=
$$ 
$$ hash MD5
$$ E9 8D 2D 5C 6E 4B EB A9 94 97 1C 78 E5 C7 C8 3B
##$RELAX= 
##$RELAX= 
##$RELAX= 
##$RELAX= 
##$RELAX= 
##$RELAX= 
$$ Bruker specific parameters
$$ --------------------------
##$DU= <F:/spectra>
##$EXPNO= 1
##$NAME= <H-F>
##$PROCNO= 1
##$TYPE= <nmr>
##$USER= <she>
##$AMP= (0..31)
100 100 100 100 100 100 100 100 100 100 100 100 100 100 100 100 100 100 
100 100 100 100 100 100 100 100 100 100 100 100 100 100 
##$AQSEQ= 0
##$AQ_mod= 1
##$AUNM= <au_zg>
##$AUTOPOS= <>
##$BF1= 200.13
##$BF2= 200.13
##$BF3= 200.13
##$BF4= 200.13
##$BF5= 200.13
##$BF6= 200.13
##$BF7= 200.13
##$BF8= 200.13
##$BYTORDA= 1
##$CFDGTYP= 0
##$CFRGTYP= 5
##$CHEMSTR= <none>
##$CNST= (0..31)
1 1 145 1 1 1 1 1 1 1 1 1 1 1 1 1 1 1 1 1 1 1 1 1 1 1 1 1 1 1 1 1 
##$CPDPRG= <>
##$CPDPRG1= <>
##$CPDPRG2= <>
##$CPDPRG3= <>
##$CPDPRG4= <mlev>
##$CPDPRG5= <mlev>
##$CPDPRG6= <mlev>
##$CPDPRG7= <mlev>
##$CPDPRG8= <mlev>
##$CPDPRGB= <>
##$CPDPRGT= <>
##$D= (0..31)
0 1.2 0 0 0 0 0 0 0 0.06 0 0.03 0 0 0 0 0.0002 0 0 0 0 0 0 0 0 0 0 0 0 
0 0 0 
##$DATE= 1603705140
##$DBL= (0..7)
120 120 120 120 120 120 120 120 
##$DBP= (0..7)
150 150 150 150 150 150 150 150 
##$DBP07= 0
##$DBPNAM0= <>
##$DBPNAM1= <>
##$DBPNAM2= <>
##$DBPNAM3= <>
##$DBPNAM4= <>
##$DBPNAM5= <>
##$DBPNAM6= <>
##$DBPNAM7= <>
##$DBPOAL= (0..7)
0.5 0.5 0.5 0.5 0.5 0.5 0.5 0.5 
##$DBPOFFS= (0..7)
0 0 0 0 0 0 0 0 
##$DE= 6
##$DECBNUC= <off>
##$DECIM= 32
##$DECNUC= <off>
##$DECSTAT= 4
##$DIGMOD= 1
##$DIGTYP= 9
##$DL= (0..7)
0 120 120 120 120 120 120 120 
##$DP= (0..7)
150 150 150 150 150 150 150 150 
##$DP07= 0
##$DPNAME0= <>
##$DPNAME1= <>
##$DPNAME2= <>
##$DPNAME3= <>
##$DPNAME4= <>
##$DPNAME5= <>
##$DPNAME6= <>
##$DPNAME7= <>
##$DPOAL= (0..7)
0.5 0.5 0.5 0.5 0.5 0.5 0.5 0.5 
##$DPOFFS= (0..7)
0 0 0 0 0 0 0 0 
##$DQDMODE= 0
##$DR= 18
##$DS= 0
##$DSLIST= <SSSSSSSSSSSSSSS>
$$ [...]
##$SUBNAM2= <"">
##$SUBNAM3= <"">
##$SUBNAM4= <"">
##$SUBNAM5= <"">
##$SUBNAM6= <"">
##$SUBNAM7= <"">
##$SUBNAM8= <"">
##$SUBNAM9= <"">
##$SW= 16.880792210976
##$SWIBOX= (0..15)
0 0 2 0 0 0 0 0 0 0 0 0 0 0 0 0 
##$SW_h= 3378.37837837838
##$TD= 16384
##$TD0= 1
##$TE= 0
##$TE2= 300
##$TE3= 300
##$TEG= 300
##$TL= (0..7)
0 120 120 120 120 120 120 120 
##$TP= (0..7)
150 150 150 150 150 150 150 150 
##$TP07= 0
##$TPNAME0= <>
##$TPNAME1= <>
##$TPNAME2= <>
##$TPNAME3= <>
##$TPNAME4= <>
##$TPNAME5= <>
##$TPNAME6= <>
##$TPNAME7= <>
##$TPOAL= (0..7)
0.5 0.5 0.5 0.5 0.5 0.5 0.5 0.5 
##$TPOFFS= (0..7)
0 0 0 0 0 0 0 0 
##$TUNHIN= 0
##$TUNHOUT= 0
##$TUNXOUT= 0
##$USERA1= <user>
##$USERA2= <user>
##$USERA3= <user>
##$USERA4= <user>
##$USERA5= <user>
##$V9= 5
##$VALIST= <valist>
##$VCLIST= <CCCCCCCCCCCCCCC>
##$VD= 0
##$VDLIST= <DDDDDDDDDDDDDDD>
##$VPLIST= <PPPPPPPPPPPPPPP>
##$VTLIST= <TTTTTTTTTTTTTTT>
##$WBST= 1024
##$WBSW= 4
##$XGAIN= (0..3)
0 0 0 0 
##$XL= 0
##$YL= 0
##$YMAX_a= 158434
##$YMIN_a= -79549
##$ZGOPTNS= <>
##$ZL1= 120
##$ZL2= 120
##$ZL3= 120
##$ZL4= 120
##$ABSF1= 10
##$ABSF2= 0
##$ABSG= 5
##$ABSL= 3
##$ALPHA= 0
##$AQORDER= 0
##$ASSFAC= 0
##$ASSFACI= 0
##$ASSFACX= 0
##$ASSWID= 0
##$AUNMP= <proc_1d>
##$AZFE= 0.1
##$AZFW= 0.1
##$BCFW= 1
##$BC_mod= 2
##$BYTORDP= 1
##$COROFFS= 0
##$CY= 11.3945322036743
##$DATMOD= 1
##$DC= 2
##$DFILT= <>
##$DTYPP= 0
##$F1P= 16.9975609425685
##$F2P= -3.02152046262296
##$FCOR= 0.5
##$FTSIZE= 0
##$FT_mod= 4
##$GAMMA= 1
##$GB= 0.15
##$INTBC= 1
##$INTSCL= 1
##$ISEN= 128
##$LB= 0.24
##$LEV0= 0
##$LPBIN= 0
##$MAXI= 10000
##$MC2= 0
##$MEAN= 0
##$ME_mod= 0
##$MI= 1.114404
##$NCOEF= 0
##$NC_proc= 0
##$NLEV= 6
##$NOISF1= 3.799351
##$NOISF2= 2.8
##$NSP= 1
##$NTH_PI= 0
##$NZP= 0
##$OFFSET= 15.70392
##$PC= 1
##$PHC0= -10683.05
##$PHC1= -2.399119
##$PH_mod= 1
##$PKNL= yes
##$PPARMOD= 0
##$PSCAL= 0
##$PSIGN= 0
##$REVERSE= no
##$SF= 200.130013532006
##$SI= 16384
##$SIGF1= 3
##$SIGF2= 2
##$SINO= 400
##$SIOLD= 16384
##$SREGLST= <1H.CDCl3>
##$SSB= 0
##$STSI= 0
##$STSR= 0
##$SW_p= 3612.71676300578
##$SYMM= 0
##$S_DEV= 0
##$TDeff= 0
##$TDoff= 0
##$TI= <>
##$TILT= no
##$TM1= 0
##$TM2= 0
##$TOPLEV= 0
##$USERP1= <user>
##$USERP2= <user>
##$USERP3= <user>
##$USERP4= <user>
##$USERP5= <user>
##$WDW= 1
##$XDIM= 8192
##$YMAX_p= 0
##$YMIN_p= 0
$$ End of Bruker specific parameters
$$ ---------------------------------
##NTUPLES= NMR FID
##VAR_NAME=  TIME,          FID/REAL,        FID/IMAG
##SYMBOL=    X,             R,               I
##VAR_TYPE=  INDEPENDENT,   DEPENDENT,       DEPENDENT
##VAR_FORM=  AFFN,          ASDF,            ASDF
##VAR_DIM=   8192,          8192,            8192
##UNITS=     SECONDS,       ARBITRARY UNITS, ARBITRARY UNITS
##FACTOR=    0.000296,      1,               1
##FIRST=     0,             0,               0
##LAST=      2.424536,      0,               0
##MIN=       0,             -79549,          0
##MAX=       2.424536,      158434,          0
$$ Real data points
##PAGE= N=1
##DATA TABLE= (X++(R..R)), XYDATA
$$ [...]
$$ plain form
1742 -164 -104 31 36 -185 -292 9 105 51 -85 80 81 -58 363 -60 -76 106 -258 161 250 -290 104 16 -65 179
1766 179 -7 -126 55 -81 26 152 -13 64 -34 33 -47 -38 -47 -117 283 -50 160 -36 -424 -100 23 224 126
1789 126 -137 109 -205 47 104 9 -4 -137 53 44 72 110 -135 -6 228 112 241 167 -41 114 207 115 198 -85
1813 -85 -156 96 165 26 144 -27 -115 -124 -108 -255 42 3 -128 -49 42 -232 170 279 258 91 228 105 -224 -93
1837 -93 -116 134 -76 50 139 138 -71 -88 36 -76 64 -47 -54 -129 -75 -126 -68 282 -89 4 -126 16 -152 131
1861 131 -198 -37 -126 25 -72 6 4 -174 81 81 86 -31 -68 17 -266 -156 75 10 222 -76 137 -7 122 -103
1885 -103 119 -180 102 30 159 -30 124 -4 118 78 -98 -55 34 89 147 323 -130 -106 103 41 -53 -91 -5 -99
1909 -99 -148 -247 -21 45 -133 304 116 111 -57 -154 -48 -23 7 189 8 105 -138 98 -7 -69 -103 162 104 -29
$$ packed form
1742a64O0J35Nk21j07L01R6n4j36J65Jj39M21m23j6J82l64M19Q9n40L94q8q1K44
1766A79j86j19J81j36J07J26j65P7r8O7q0Rrp0M00l33K10j96l88L24J23K01r8
1789A26k63K46l14K52N7r5j3j33J90rK8L8k45J29K34j16J29p4k08J55R3r2Q3k83
1813h5p1K52O9j39J18j71q8rJ6j47K97l9j31P9R1k74M02J09k1j67J37j23l29J31
1837i3k3K50k10J26Q9jk09j7J24j12J40j11pp5N4n1N8L50l71R3j30J42j68K83
1861A31l29J61q9J51r7P8kj78K55%Nj17l7Q5k83J10K31o5K12k98K13j44J29k25
1885a03K22k99K82p2J29j89J54j28J22m0j76M3Q9N5N8J76m53K4K09o2r4l8Q6r4
1909i9m9r9K26O6j78M37j88nj68r7J06K5L0J82j81R7k43K36j05o2l4K65n8j33
$$ plain form
1933 -29 -10 104 250 -168 -15 40 71 -355 288 -57 -97 -202 -118 -57 -57 -120 122 139 -135 38 107 -209 67 -98
1957 -98 61 113 -211 91 -67 -48 106 -129 205 200 -110 -29 95 -65 99 81 19 -19 -94 -215 -168 28 21 -106
1981 -106 92 -67 -99 -131 118 -23 -27 99 60 39 83 70 -135 39 137 42 -63 -65 227 -82 -26 100 -137 57
2005 57 -21 -16 -239 86 -102 36 102 210 -156 -57 -82 0 -10 -205 15 61 -53 123 -190 -25 163 -7 -183
2028 -183 109 -33 -145 213 -56 -109 -201 88 106 -140 -66 -86 -20 93 -97 91 -101 143 -261 -6 -67 194
2050 194 59 101 16 -109 -385 64 29 -86 155 164 60 144 182 72 -54 308 -286 -146 -18 30 -24 25 179
2073 179 -161 103 177 245 -262 -213 57 226 -84 -187 -72 -254 153 210 179 -93 -116 -83 116 85 96 -39 22
2096 22 194 -122 56 -120 -127 183 -124 -195 -40 -14 -312 -177 33 -58 114 89 79 128 -42 -5 -109 25 -163
$$ packed form
1933b9J9J14J46m18J53N5L1m26O43l45m0j05Q4O1%o3K42J7k74J73O9l16K76j65
1957i8J59N2l24L02j58J9J54k35L34nl10Q1J24j60J64j8o2l8p5j21M7J96pj27
1981a06J98j59l2l2K49j41mJ26l9k1M4j3k05J74R8r5j05kK92l09N6J26k37J94
2005E7p8Nk23L25j88J38O6J08l66R9k5Q2j0j95K20M6j14J76l13J65J88j70j76
2028a83K92j42j12L58k69n3r2K89J8k46P4k0O6J13j90J88j92K44m04K55o1K61
2050A94j35M2q5j25k76M49l5j15K41Rj04Q4L8j10j26L62n94J40J28M8n4M9J54
2073A79l40K64P4O8n07M9K70J69l10j03J15j82M07N7l1k72k3L3J99l1J1j35O1
2096B2J72l16J78j76pL10l07p1J55K6k98J35K10r1J72k5j0M9j70L7j04J34j88
$$ plain form
2119 -163 201 65 -353 -180 -119 -43 -99 147 -115 -84 -33 -158 6 173 -93 75 31 -175 6 44 132 -77 -141
2142 -141 71 52 -4 111 73 27 207 -173 68 -233 -12 40 80 -146 -209 -163 -156 -144 53 198 -162 -29 -99 -147
2166 -147 -5 -130 -147 -66 -10 233 -20 -255 -73 120 300 237 449 123 -209 -79 -203 -175 6 54 121 -186
2188 -186 58 130 78 244 185 -72 -158 49 -126 117 26 -243 -93 -182 -101 -56 -73 -44 -223 60 -16 207 33 -63
2212 -63 -218 49 -89 73 29 -13 157 223 -76 191 -19 -169 -207 -117 -49 -29 15 8 -222 34 48 104 56 -15 226
2237 226 -94 -133 111 1 206 -115 243 92 85 54 207 219 159 93 -69 -201 153 70 -138 -117 97 -15 -31
2260 -31 198 -111 -126 -129 -47 -112 -168 -68 -145 -147 151 -153 -129 45 232 139 17 347 -12 -11 62 -87 42 -249 -64
2285 -64 -125 -74 71 31 37 -145 6 -27 9 -260 84 47 -187 -150 -8 -115 -27 112 -150 -223 85 101 117 -126 176
$$ packed form
2119a63L64j36m18J73O1P6n6K46k62L1N1j25J64J67k66J68m4k06J81L8Q8k09o4
2142a41K12j9n6J15l8m6J80l80K41l01K21N2M0k26o3M6PJ2J97J45l60J33p0m8
2166a47J42j25j7Q1N6K43k53k35J82J93J80o3K12l26l32J30j24K8J81M8O7l07
2188a86K44P2n2J66n9k57q6K07j75K43r1k69J50q9Q1M5j7K9j79K83p6K23j74r6
2212f3j55K67j38J62m4m2J70O6k99K67k10j50l8R0O8K0M4pk30K56J4N6m8p1K41
2237B26l20l9K44j10K05l21L58j51pl1J53J2o0o6j62j32L54q3k08K1K14j12j6
2260c1K29l09j5lQ2o5n6J00p7kK98l04K4J74J87r3j22L30l59JP3j49J29k91J85
2285f4o1N1J45m0Oj82J51l3L6k69L44l7k34L7J42j07Q8J39k62p3L08J6J6k43L02
$$ plain form
2310 176 57 139 -53 -19 16 223 10 94 -158 -34 1 84 114 10 -50 97 -56 56 83 -5 185 98 -128 223
2334 223 -138 47 -147 -117 229 239 153 -270 91 -129 -124 48 -145 -149 105 52 43 72 -82 -120 205 -18 8 235
2358 235 -85 -200 90 179 23 184 4 -316 -101 -95 48 22 -38 8 -113 -30 1 -165 83 -121 -285 -51 -54
2381 -54 68 -19 -55 32 -19 -287 -107 -191 -36 1 38 84 219 -49 -32 -96 -200 -152 -44 46 106 -3 186 122 78
2406 78 58 217 18 11 -5 107 -150 -13 -57 -74 157 43 2 4 101 -54 156 47 87 97 -118 -58 -36 -172 -84
2431 -84 4 229 162 236 -89 -83 4 -15 -59 1 115 -247 -38 -8 45 6 24 -37 51 -218 9 47 72 -160 119 -188
2457 -188 -88 167 112 -44 -40 -106 -117 44 -76 107 148 137 -102 12 -13 140 -110 90 71 9 165 10 -157
2480 -157 19 90 -70 -58 283 76 110 49 25 35 170 22 75 69 -168 -28 -29 19 -93 66 40 -10 -39 -129 -136 96
$$ packed form
2310A76j19Q2j92L4L5K07k13Q4k52J24L5Q3L0j04o0J47j53J12K7q8J90q7k26L51
2334B23l61J85j94L0L46J0q6m23L61k20NJ72j93mK54n3rK9j54l8L25k23K6K27
2358B35l20j15K90Q9j56J61j80l20K15OJ43k6o0M6j21Q3L1j66K48k04j64K34l
2381e4J22q7l6Q7n1k68J80q4J55L7L7M6J35k68J7o4j04M8J08R0O0j09J89o4m4
2406G8k0J59j99pj6J12k57J37m4j7K31j14m1KR7j55K10j09M0J0k15O0K2j36Q8
2431h4Q8K25o7P4l25OQ7j9m4O0J14l62K09L0N3l9J8o1Q8k69K27L8K5k32K79l07
2457a88J00K55n5j56Mo6j1J61j20J83M1j1k39J14k5J53k50K00j9o2J56j55j67
2480a57J76P1j60J2L41k07L4o1k4J0J35j48N3ok37J40jM8j12J59k6n0k9r0pK32
$$ plain form
2506 96 -68 -6 30 -125 12 -125 -28 7 -221 -23 -38 328 332 -61 316 3 -216 55 -18 253 -41 -105 -98 130
2530 130 49 -30 159 188 -71 258 -127 90 205 206 -66 -85 97 -119 -10 215 -93 -40 146 -160 359 -183
2552 -183 54 -175 -193 263 -5 62 87 -25 -46 -101 -137 146 153 106 23 191 7 99 -32 65 176 -116 -10 -28
2576 -28 65 73 -215 -187 -32 -32 139 113 -131 -299 -54 101 7 261 116 -128 81 77 80 -9 -66 108 9 69 -84 37
2602 37 -160 20 129 79 38 -177 -31 9 -32 -98 -33 55 -90 1 118 75 17 7 53 -83 53 123 -85 194 266
2627 266 108 -38 -54 44 184 115 -42 -68 122 -219 -139 -89 -173 16 33 38 33 -241 -218 -134 -7 -35 -213 26 113
2652 113 -17 -211 203 -2 -138 -96 -61 -116 -62 -15 227 -326 99 -66 54 165 139 112 45 -23 -107 9 8 -96
2676 -96 -34 86 65 -340 281 77 69 77 95 -5 273 -103 -175 105 3 -48 -41 86 26 0 -15 236 -265 -171 -15
$$ packed form
2506I6j64O2L6j55J37j37R7L5k28J98j5L66Ml93L77l13k19K71p3K71k94o4PK28
2530A30q1p9J89K9k59L29l85K17J15Jk72j9J82k16J09K25l08N3J86l06N19n42
2552a83K37k29j8M56k68O7K5j12k1n5l6K83Pm7q3J68j84R2j31R7J11k92J06j8
2576b8R3Qk88K8J55%J71k6k44j68K45J55r4K54j45k44K09mLq9n7J74r9O0j53J21
2602C7j97J80J09n0m1k15J46M0m1o6O5Q8j45R1J17m3n8j0M6j36J36P0k08K79P2
2627B66j58j46j6R8J40o9j57k6J90l41Q0N0q4J89J7Nnk74K3Q4J27k8j78K39Q7
2652A13j30j94M14k05j36M2L5n5N4M7K42n53M25j65J20J11k6k7o7o8q4J16jj04
2676i6O2J20k1m05O21k04qQJ8j00K78l76p2K80j02n1PJ27o0k6j5K51n01R4J56
$$ plain form
2701 -15 -285 -51 52 61 -32 -157 58 -131 -77 77 -126 27 -265 286 115 -88 110 45 43 180 34 -119 272
2724 272 175 -67 111 -104 -11 271 -301 -53 -100 204 70 -43 160 -58 -38 -65 196 -12 105 8 177 78
2746 78 7 54 -144 -49 -159 -174 115 67 -16 -105 150 130 482 63 -269 411 -124 -123 -133 -207 81 -226 -1 34 -41
2771 -41 33 197 128 -103 -12 -148 195 123 128 120 -69 -170 -105 -120 -22 110 109 24 30 -17 68 -1 47 -77 -87 -7 99 -131
2799 -131 27 -128 -275 38 96 121 -143 89 230 -129 -37 -51 57 148 118 -8 69 -196 -41 66 -55 -31 30
2822 30 -69 -288 189 -179 -73 253 79 -20 -90 -117 157 144 -126 -61 -264 147 117 -235 -58 39 29 -181 -47
2845 -47 -200 45 79 -1 53 5 92 -49 195 -233 -26 23 -192 234 50 163 -154 -112 -15 19 71 47 -40 -2 -14
2870 -14 -181 54 -178 -78 -79 -59 137 43 41 136 -60 98 42 -11 204 172 72 53 -41 -58 77 124 321 126 116
$$ packed form
2701a5k70K34J03Rr3j25K15j89N4J54k03J53k92N51j71k03J98o5kJ37j46j53L91
2724B72r7k42J78k15R3K82n72K48m7L04j34j13K03k18K0k7K61k08J17r7J69r9
2746G8p1M7j98R5j10j5K89m8q3q9K55k0L52m19l32O80n35Jj0p4K88l07K25L5p5
2771d1P4J64o9k31R1j36L43p2Nqj89j01O5j5R8J32jq5Om7Q5o9M8j24j0Q0J06k30
2799a31J58j55j47L13N8K5k64K32J41l59R2j4J08R1l0j26P7k65J55J07j21K4O1
2822C0r9k19M77l68J06L26j74r9p0k7K74j3k70O5k03M11l0l52J77R7j0k10J34
2845d7j53K45L4q0N4m8Q7j41K44m28K07M9k15M26j84J13l17M2R7L4N2k4q7L8j2
2870a4j67K35k32J00jK0J96r4kR5j96J58n6n3K15l2j00j9r4j7J35M7J97j95j0
$$ plain form
2895 116 230 127 -49 89 -36 187 -85 -112 -45 -118 57 -147 230 -54 23 -162 -75 -159 2 -5 -96 -80 -20 -129
2919 -129 172 -118 -78 12 -104 106 -114 180 41 293 -103 -59 171 -49 4 86 98 -71 -98 54 -40 172 204
2942 204 -21 -39 -184 166 2 18 -41 13 49 35 -184 -96 131 5 93 13 -219 -80 -9 -43 182 -32 107 77
2966 77 -13 -88 98 111 84 1 -173 -248 -246 195 -250 57 19 -73 92 386 27 42 -156 -61 19 37 -208 -14 -3
2991 -3 167 -91 158 -66 -76 226 120 -59 -188 -92 183 24 114 -35 -310 5 100 -15 -287 145 159 -40
3013 -40 -49 25 166 73 93 -99 -299 10 -1 126 -327 91 205 -225 -35 47 -26 -30 -32 -46 -27 153 -5 -289 172
3038 172 118 -46 -221 -16 77 115 45 34 -151 168 -78 -86 -51 18 47 19 179 26 -224 57 72 -57 -77 154
3062 154 -111 78 -77 -158 -10 8 -303 53 -137 122 177 65 28 7 90 151 -83 -138 -312 132 -4 174 121
$$ packed form
2895A16J14j03j76J38j25K23k72k7O7p3J75k04L77k84P7j85Q7q4J61pr1J6O0j09
2919a29L01k90M0R0j16K10k20K94j39K52l96M4K30k20N3Q2J2j69k7J52r4K12L2
2942B04k25j8j45L50j64J6n9N4L6j4k19Q8K27j26Q8q0k32J39P1l4K25k14J39l0
2966G7r0p5J86J3k7q3j74p5KM41m45L07l8r2J65K94l59J5j98R5Q0J8k45J94J1
2991cJ70k58K49k24j0L02j06j79j29R6K75j59R0j49k75L15R5j15k72M32J4j99
3013d0rP4J41r3K0j92k00L09j1J27m53M18J14m30J90Q2p3mkj4J9J80j58k84M61
3038A72n4j64j75K05R3L8p0j1j85L19k46qL5O9K9k8J60j53k50K81J5j29k0K31
3062A54k65J89j55q1J48J8l11L56j90K59N5j12l7k1Q3O1k34n5j74M44j36J78n3
$$ plain form
3085 121 -43 136 -44 130 82 -189 -155 -80 -133 -147 84 -129 -143 76 11 38 -24 -115 147 -46 -186 -59 210
3108 210 53 -74 67 -174 10 -280 169 -8 160 -6 76 -15 52 68 -62 181 41 -42 62 249 60 187
3130 187 119 142 -146 74 184 -115 -63 110 125 -174 -85 -178 -119 -168 -287 -45 105 28 -4 -17 -216 54 -122 99
3154 99 -162 -52 64 -25 -90 144 -130 37 54 38 62 19 -93 -2 6 68 311 87 -157 163 -72 -200 245 -65
3178 -65 160 28 52 -79 63 57 140 196 82 -130 -30 53 -97 -71 -107 -247 54 -87 -45 161 244 -201 -1 14
3202 14 86 168 65 -8 78 69 -143 43 -240 -120 276 -36 162 -158 -22 50 201 28 -88 0 -66 -263 53
3225 53 247 -87 128 35 33 101 96 51 -96 182 -74 -29 172 -76 -96 -152 -50 94 -147 130 -169 -18 10 -139
3249 -139 -88 -125 108 -76 57 57 -10 83 -157 26 16 68 71 198 186 -242 139 287 -56 121 -119 -24 -210 76
$$ packed form
3085A21j64J79j80J74m8k71L4P5n3j4K31k13j4K19o5K7o2r1K62j93j40J27K69
3108B10j57j27J41k41J84k90M49j77J68j66Q2r1O7J6j30K43j40q3J04J87j89J27
3130A87o8K3k88K20J10k99N2J73J5k99Q9r3N9m9j19K42J50p7l2j3j99K70j76K21
3154I9k61J10J16q9o5K34k74J67J7j6K4m3j12R1QO2K43k24k44L20k35j28M45l10
3178f5K25j32K4j31J42oQ3N6j14k12J00Q3j50K6l6j40L01j41M2K06Q3m45K00J5
3202A4P2Q2j03p3Q6rk12J86k83J20L96l12J98l20J36P2J51j73j16Q8o6j97L16
3225E3J94l34K15r3kO8nm5j47K78k56M5K01k48k0n6J02J44k41K77k99J51K8j49
3249a39N1l7K33j84J33%o7R3k40J83j0N2LJ27j2m28L81J48l43J77k40R5j86K86
$$ plain form
3273 76 195 -5 -52 -180 -59 30 -80 -102 38 115 12 57 -63 -187 54 -152 -45 148 87 -60 76 37 -31
3296 -31 -116 37 131 -141 -53 93 22 -80 -54 -219 41 -19 1 -3 250 70 130 -79 -80 17 -79 50 35 -235 -187 -102
3322 -102 -161 -43 -149 -184 -94 188 53 17 102 20 126 -24 171 -6 25 -121 -215 -58 26 192 67 65 10 -62
3346 -62 152 107 -163 98 1 -75 81 -6 148 93 -108 -216 -76 17 27 -253 143 -263 -22 -141 -123 209 -186
3369 -186 -194 -129 -38 -76 160 -178 -64 5 -260 171 -77 -74 -95 -5 65 -83 -50 147 116 -202 -188 79 -176 -88 48
3394 48 -15 -214 -55 189 -105 -120 92 -80 138 86 -87 98 -122 -59 59 -138 266 -80 -213 -31 -195 -157
3416 -157 62 -107 37 -186 -286 -77 -65 -39 -25 -139 -38 32 1 -180 23 61 -19 -149 87 179 146 -156 109
3439 109 -107 -88 54 -248 -141 131 -243 -166 43 79 -230 -51 -3 225 -144 170 -205 -138 107 -138 59 8
$$ packed form
3273G6J19k00m7j28J21Q9j10k2J40P7j03M5j20j24K41k06J07J93o1j47J36l9o8
3296c1q5J53R4k72Q8J46p1j02K6j65K60o0K0mK53j80O0k09jR7r6J29j5k70M8Q5
3322a02n9J18j06l5R0K82j35l6Q5q2J06j50J95j77L1j46r4J57Q4J66j25kn5p2
3346f2K14m5k70K61r7p6J56q7J54n5k01j08J40R3J0k80L96m06K41j19J8L32l95
3369a86qO5R1l8K36l38J14O9k65M31k48Lk1R0P0j48L3J97l1l18J4K67k55Q8J36
3394D8o3j99J59K44k94j5K12j72K18n2j73J85k20O3J18j97M04l46j33J82j64L8
3416a57K19j69J44k23j00K09J2K6J4j14J01P0l1j81K03L8q0j30K36R2l3l02K65
3439A09k16J9J42l02J07K72l74P7K09L6l09J79M8K28l69L14l75O7K45k45J97n1
$$ plain form
3461 8 132 -108 152 269 -179 188 151 -140 55 181 -63 -130 329 79 29 154 172 58 -14 -1 47 -177 -97
3484 -97 9 144 51 -55 -20 80 74 108 254 49 211 323 -21 -152 182 139 192 5 -279 9 185 -7 206
3507 206 -49 60 102 11 -122 -287 -60 -138 50 -80 177 -208 -108 -3 -230 -21 98 -45 18 119 -49
3528 -49 -201 32 -117 -156 156 -69 -2 -46 -300 -69 -114 -173 -65 -92 -115 -147 -35 -92 -53 -88 15 -92 61 25
3552 25 270 -125 109 -338 31 -103 141 -22 -12 81 -225 125 123 -372 -52 -9 -110 -25 54 61 -141 230 -280
3575 -280 160 212 22 -74 -48 -61 21 -80 26 70 30 151 177 278 -54 27 86 98 92 -5 -85 148 70 -29 -31 16 188
3602 188 -75 74 -143 -70 23 -22 -65 153 155 201 248 169 37 116 129 -19 -215 100 -268 29 47 44 -12 10 43 29
3628 29 -368 -221 149 -52 14 179 12 -8 -127 -140 7 -158 35 130 -60 -124 62 96 -238 -9 188 57
$$ packed form
3461HJ24k40K60J17m48L67l7k91J95J26k44o7M59k50n0J25J8j14p2J3M8k24Q0
3484i7J06J35r3j06L5J00oL4J46k05J62J12l44j31L34m3N3j87k84K88J76j92K13
3507B06k55J09M2r1j33j65K27p8J88j30K57l85J00J05k27K09J19j43O3J01j68
3528d9j52K33j49l9L12k25O7m4k54K31m5n9J08k7k3l2J12n7L9l5J03j07J53l6
3552B5K45l95K34m47L69j34K44j63J0R3l06L50km95L20M3j01Q5P9Pk02L71n10
3575b80M40N2j90r6K6j3Q2j01J06M4m0J21K6J01l32Q1N9J2or7q0K33p8r9kM7J72
3602A88k63J49k17P3R3m5m3K18KM6M7p9j32P9J3j48j96L15l68K97J8ln6K2L3j4
3628B9l97J47L70k01O6J65j67k0j19j3J47j65J93R5j90o4J86L4l34K29J97j31
$$ plain form
3650 57 -200 220 -10 -126 25 87 302 -54 -111 -2 -64 172 44 136 68 -117 132 154 28 11 73 -296 -198
3673 -198 -275 110 233 138 186 -68 -42 -146 51 97 21 -21 -7 141 -25 51 234 -58 165 145 -19 -309 1
3696 1 -209 -97 71 134 237 -242 -282 -3 162 -112 45 -87 45 -152 -93 27 -10 182 -54 37 39 -43 163
3719 163 -15 58 218 157 -90 116 -138 36 282 -22 -3 -283 118 -333 -71 258 67 71 -138 181 -170 0
3741 0 -22 -170 -133 140 -5 329 -64 -93 185 103 131 2 -245 -240 -19 -24 -54 -104 40 -7 326 -287 -261 55 -116
3766 -116 -82 -59 18 142 -47 -73 -79 -100 -186 58 -107 -39 65 21 -130 -172 69 135 -129 -19 315 -3 -97 6
3790 6 170 0 37 43 317 -39 268 -124 -227 -156 54 -140 270 48 198 32 101 -189 -5 -64 -56 170 17
3813 17 -145 -35 -195 -325 10 13 471 -170 54 15 44 -193 35 -1 273 -52 136 130 42 -4 135 -32 -10 -100
$$ packed form
3650E7k57M20k30j16J51O2K15l56n7J09o2K36j28R2o8j85K49K2j26j7O2l69R8
3673a98p7L85J23r5M8k54K6j04J97M6p6m2J4J48j66P6J83k92K23k0j64k90L10
3696Ak10J12J68O3J03m79m0K79J65k74J57j32J32j97N9J20l7J92k36R1Kq2K06
3719A63j78P3J60o1k47K06k54J74K46l04J9k80M01m51K62L29j91Mk09L19l51J70
3741@k2j48L7K73j45L34l93k9K78q2K8j29k47NK21nl0n0J44m7L33o13K6L16j71
3766a16L4K3P7J24j89k6ok1q6K44j65O8J04m4j51m2K41O6k64J10L34l18r4J03
3790FJ64j70L7OK74l56L07l92j03P1K10j94M10k22J50j66O9k90J84n9QK26j53
3813A7j62J10j60j30L35LM58o41K24l9K9k37K28l6K74l25J88oq8m6J39j67K2r0
$$ plain form
3837 -100 -205 -24 140 45 -55 162 76 -77 218 -144 159 10 -211 42 62 44 156 141 -192 -112 77 199
3859 199 243 78 -97 -15 22 156 150 -206 -144 113 -54 -52 -126 25 51 59 -46 94 117 143 96 -191 -133 12 -60 305
3885 305 -132 74 -159 -126 -86 -74 21 64 -221 -176 -301 78 -128 128 -217 -145 4 -34 119 -90 155 291 200
3908 200 -171 -58 164 9 45 148 60 103 -68 114 -53 -6 -124 89 -22 194 -34 180 -96 45 30 -65
3930 -65 -63 79 131 110 23 91 47 -5 56 196 -180 5 274 -163 206 -221 -59 -9 -29 2 50 -122 -34 -38 100 -20
3956 -20 -34 -63 92 5 -14 -42 91 29 247 73 -70 141 50 204 -59 -128 89 218 -54 132 209 10 -2 44
3980 44 -78 202 -38 56 6 175 93 -85 -87 -10 -23 -56 49 -40 -43 84 -35 -178 -40 54 -332 9 -122 -256
4004 -256 110 6 194 114 -250 -248 76 38 -134 -40 70 139 -96 -130 66 131 -118 123 -39 -4 16 -31 86 -213
$$ packed form
3837a00j05J81J64r5j00K17q6j53K95l62L03j49k21K53K0j8J12j5l33Q0J89J22
3859A99M4j65j75Q2L7J34ol56O2K57j67Kp4J51K6Qj05J40K3K6m7k87N8J45p2L65
3885C05m37K06k33L3M0J2R5M3k85M5j25L79k06K56l45P2J49l8J53k09K45J36r1
3908B00l71J13K22j55L6J03q8M3j71J82j67M7j18K13j11K16k28K14k76J41j5r5
3930f5KJ42N2k1q7O8m4n2O1J40l76J85K69m37L69m27J62N0k0L1M8j72Q8mJ38j20
3956b0j4k9J55q7j9k8J33o2K18j74j43K11r1J54k63o9K17J29k72J86P7j99j2M6
3980D4j22K80k40R4n0J69q2j78kP7j3l3J05q9lJ27j19j43J38R4l86L41j31j34
4004b56L66j04J88q0l64KL24l8j72R4J10O9k35l4J96O5k49K41j62L5K0m7J17k99
$$ plain form
4028 -213 165 93 145 -81 68 -79 105 -101 -212 -59 132 -140 -79 -37 -70 196 -207 -58 -152 17 -72 16 194
4051 194 -29 229 179 57 156 49 -3 -297 -30 48 -121 -184 -183 214 114 111 -102 -141 -30 111 -65 214 -148
4074 -148 119 10 -189 -63 -62 26 130 73 37 203 295 -83 -54 -79 84 0 -101 63 -108 -259 132 -39 57
4097 57 86 -62 -86 122 -16 -102 86 -103 57 40 125 -163 165 52 -96 -13 -150 -72 -10 -108 54 26 65 -53
4121 -53 97 142 35 20 -121 146 -166 -17 120 150 227 -49 -47 154 50 -392 -46 13 -38 76 -39 109 378
4144 378 113 22 -36 32 62 99 233 -32 175 281 58 -108 -244 -23 49 -36 246 -76 -96 -111 209 -32 101
4167 101 79 -216 29 -43 -45 -184 93 -211 -197 187 -40 -27 -118 -190 161 -17 -174 -76 195 -54 85 103 107 206
4191 206 -38 -88 -128 63 28 -13 18 -96 -41 50 -24 90 289 -6 -39 -134 99 -84 -7 -129 -107 134 -158 -3
$$ packed form
4028b13L78p2N2k26J49j47J84k06j11J53J91k72O1M2l3K66m03J49r4J69q9Q8J78
4051A94k23K58n0j22R9j07n2k94K67P8j69o3JL97j00lk13l9J11J41j76K79l62
4074a48K67j09j99J26JQ8J04n7l6J66R2l78K9k5J63q4j01J64j71j51L91j71R6
4097E7K9j48k4K08j38q6J88j89J60j7Q5k88L28j13j48Q3j37P8O2r8J62k8L9j18
4121e3J50M5j07j5j41K67l12J49J37L0P7k76KK01j04m42L46N9n1J14j15J48K69
4144C78k65r1n8O8L0L7J34k65K07J06k23j66j36K21P2q5K82l22k0j5L20k41J33
4167A01k2k95K45p2kj39K77l04J4L84k27J3r1p2L51j78j57R8K71k49J39J8MR9
4191B06k44n0m0J91l5m1L1j14N5R1p4J14J99k95l3r5K33j83P7j22K2K41k92J55
$$ plain form
4215 -3 117 -64 -2 111 -122 -44 23 -232 -288 193 372 -59 -182 77 -63 104 -65 -1 -227 3 -17 -9 -101 -148
4239 -148 -14 -77 -195 5 84 -157 -356 -170 -145 -21 -144 10 -81 -120 129 -45 -11 -186 -10 35 85 37 -250
4262 -250 -29 -188 56 262 -24 0 -117 -57 100 21 -116 56 -46 -17 0 -71 145 190 25 -109 86 97 188
4285 188 75 -25 -4 61 -108 90 -24 -109 7 -118 -46 42 69 111 -41 -103 79 66 -75 -23 -17 111 8 -2
4309 -2 -176 -216 116 -39 49 -98 89 -86 228 -98 -146 -18 119 339 23 31 145 -168 -102 -121 0 73 -122
4332 -122 28 -14 -10 270 -27 -9 23 -8 -197 69 106 110 79 -87 -42 -103 126 216 81 -43 190 217 56 -35 -251
4357 -251 -94 105 19 -292 37 136 -192 -41 70 128 173 123 78 103 144 -63 157 160 -6 -224 125 53 -167 28
4381 28 86 -82 115 49 -272 0 -81 41 -9 -187 20 147 145 70 117 33 40 -12 104 -48 61 -260 149 144 152 96
$$ packed form
4215cJ20j81O2J13k33P8O7k55n6M81J79m31j23K59j40J67j69O4k26K30k0Qr2m7
4239a48J34o3j18K00P9k41j99J86K5J24j23J54r1l9K49j74L4j75J76M5N0m8k87
4262b50K21j59K44K06k86K4j17O0J57p9j37J72j02K9J7p1K16M5j65j34J95J1R1
4285A88j13j00K1O5j69J98j14q5J16j25P2Q8K7M2j52o2J82j3j41N2OJ28j03j0
4309bj74m0L32j55Q8j47J87j75L14l26m8J28J37K20l16QJ14l13O6j9J21P3j95
4332a22J50m2MK80k97J8L2l1j89K66L7Ml1j66M5o1K29R0j35j24K33K7j61r1k16
4357b51J57J99q6l11L29R9l28J51J11N8M5n0m5K5M1k07K20Lj66k18L49p2k20J95
4381B8N8j68J97o6l21K72q1J22n0j78K07J27kp5M7q4Pn2J16j52J09l21M09nQn6
$$ plain form
4407 96 93 43 179 -111 162 108 81 -8 -59 97 -412 -61 -102 -35 157 -170 -121 -20 -162 42 -45 31 265 132
4431 132 90 230 -17 -102 240 194 -124 186 125 72 169 -91 152 -7 74 15 -107 1 99 -92 -198 -110 -26 -10
4455 -10 -59 -196 -86 -39 193 -66 88 171 141 154 -125 -149 -40 33 208 -126 47 -10 -125 -29 -232 -44 71
4478 71 77 -169 46 -86 -38 -146 -214 91 50 89 -78 -106 -89 -43 6 -97 -25 183 -169 130 -83 33 -186 85
4502 85 104 125 199 8 -5 -9 -82 -292 -80 -54 -57 -247 -91 133 -68 23 -46 -46 -150 152 -131 -118 239 22 165
4527 165 -27 -22 -144 355 -128 61 -210 -32 -145 113 -204 -193 119 -130 -195 119 -257 58 -6 93 -275 -5
4549 -5 95 134 145 53 34 -42 158 -17 161 22 226 -85 178 -98 -82 19 -20 79 -31 92 101 -206 27 126
4573 126 159 -394 155 -28 -236 -48 -229 -68 -9 16 -54 24 -33 78 -380 6 21 118 -300 -260 200 19 -126
$$ packed form
4407I6ln0J36k90K73n4k7q9n1J56n09L51m1O7J92l27M9J01j42K04q7P6K34j33
4431A32m2J40k47q5L42m6l18L10o1n3R7k60K43j59Q1n9j22J08R8j91j06Q8Q4J6
4455a0m9j37J10M7K32k59J54Q3l0J3k79k4J09P3J75l34J73n7j15R6k03J88J15
4478G1Ok46K15j32M8j08o8L05m1L9j67k8J7M6M9j03P2K08l52K99k13J16k19K71
4502H5J9K1P4j91j3mp3k10K12K6lj90J56K24k01R1o9%j04L02k83J3L57k17J43
4527A65j92Nj22M99m83J89k71J78j13K58l17J1L12k49o5L14l76L15o4R9l68K70
4549eJ00L9J1r2j9p6K00j75J78j39K04l11K63k76J6J01l9R9j10J23Rl07K33R9
4573A26L3n53N49j83k08J88j81J61N9K5p0P8n7J11m58L86J5R7m18M0M60j81j45
$$ plain form
4596 -126 49 120 83 -30 -22 -333 -96 -75 -139 -24 -119 -193 26 13 25 245 265 -51 48 191 80 36 -108 -66 -77
4621 -77 -81 100 -279 -197 62 -239 126 35 -119 12 -100 155 286 105 37 -133 -14 82 -144 14 60 111 111 93
4645 93 -65 2 -23 186 -326 -44 294 -213 -211 97 -35 -85 -20 -89 -76 -67 -28 236 11 -16 -95 -344 -111 181 -48
4670 -48 -24 135 -11 143 -182 225 7 -58 -45 59 -122 -159 -251 46 9 -161 132 59 19 -198 76 126 -33
4693 -33 -21 -181 16 -18 14 -175 86 -26 -37 72 91 3 -127 -146 221 32 -26 -8 -2 -65 -60 134 52 7 -84 144
4719 144 -20 -66 166 15 -98 29 142 125 -63 -389 -173 62 -232 -114 174 136 -15 -138 93 24 73 -97
4741 -97 -131 -78 53 80 -182 101 234 -151 -51 -241 -132 -140 -34 149 94 322 -70 -101 29 -97 53 -21 67
4764 67 -85 215 -59 -216 88 301 -23 -25 -198 -55 91 -159 15 -5 -62 -50 244 -53 128 113 268 -53
$$ packed form
4596a26J75P1l7j13Ql11K37K1o4J15r5p4K19j3J2K20K0l16R9J43j11m4j44M2j1
4621g7mJ81l79Q2K59l01L65r1j54J31j12K55J31j81o8j70J19R6k26J58M6N1%j8
4645I3j58O7k5K09n12K82L38n07KL08j32n0O5o9J3RL9K64k25k7p9k49K33K92k29
4670d8K4J59j46J54l25M07k18o5J3J04j81l7r2K97l7j70K93p3m0k17K74N0j59
4693c3J2j60J97l4L2j89K61j12j1J09J9q8j30j9L67j89n8J8Oo3NJ94q2m5r1K28
4719A44j64m6K32j51j13J27J13j7j88l26K16K35k94J18K88l8j51j23K31o9M9j70
4741i7l4N3J31K7k62K83J33l85J00j90J09qJ06J83n5K28l92l1J30j26J50p4Q8
4764F7j52L00k74j57L04K13l24kj73J43J46k50J74k0n7J2K94k97J81j5J55l21
$$ plain form
4786 -53 -62 -125 -46 272 -86 -26 -18 151 104 130 172 -78 41 77 -65 -296 -47 -91 -31 214 -217 383 106 -38 -135
4811 -135 -37 50 -101 19 -334 30 -14 106 -146 4 23 4 14 -92 -112 28 72 48 -119 -63 260 264 28 123
4835 123 -24 88 -126 -6 -135 -35 71 -92 -19 245 80 108 -18 41 74 -20 -70 -1 41 20 -61 -25 -68 23
4859 23 87 -280 50 -78 310 11 88 -172 10 -150 -85 -132 -78 93 44 13 -55 -93 -38 152 -201 76 27 126
4883 126 108 -313 99 -73 224 -67 -150 120 -81 208 -61 185 -289 -81 115 -169 -126 21 -59 -76 50 106
4905 106 -127 76 34 -75 -22 -139 111 -168 258 121 -185 -169 229 128 -197 -137 -53 -27 -33 -163 -118 -91 -67 -62
4929 -62 49 68 -33 51 -221 -314 62 81 -186 -47 51 -73 54 -101 -68 3 -114 210 68 230 -147 169 167
4952 167 -170 -65 154 83 -175 -31 -313 79 -124 43 3 -76 4 -4 156 -91 -25 156 -135 -138 209 -72 50
$$ packed form
4786e3ro3P9L18l58O0QJ69m7K6M2k50J19L6j42k31K49m4O0K45m31O00k77j44r7
4811a35R8Q7j51J20l53L64m4J20k52J50J9j9J0j06k0J40M4k4j67N6L23Mk36R5
4835A23j47J12k14J20j29J00J06j63P3K64j65K8j26N9L3r4n0O9M2k1q1L6m3R1
4859B3O4l67L30j28L88k99P7k60J82j60O5m7N4J71m9l1o8l8N5J90l53K77m9R9
4883A26j8m21M12j72K97k91q3K70k01K89k69K46m74K08J96k84M3J47q0j7J26N6
4905A06k33K03m2j09N3j17K50k79M26j37l06J6L98j01l25O0Q4K6oj30M5K7K4N
4929f2J11J9j01Q4k72r3L76J9k67J39R8j24J27j55L3P1j17L24j42J62l77L16k
4952A67l37J05K19p1k58J44k82L92k03J67m0p9Q0qJ60k47O6J81k91lL47k81J22
$$ plain form
4975 50 -42 34 181 71 -314 -106 -116 115 99 112 22 -6 114 30 -130 -277 104 -103 -139 118 -173 -39 152
4998 152 14 17 80 -16 57 166 22 -88 117 -92 73 51 26 38 -34 0 -53 84 241 214 -70 -56 -122 -76 32
5023 32 68 -54 -199 33 -105 36 100 249 -148 -84 26 -435 -89 -83 -102 -148 148 141 31 -126 -76 -27 166 -18
5047 -18 91 1 -126 -77 29 77 -27 292 100 69 -146 -113 118 -188 -146 200 104 77 67 -43 2 -150 136 -7
5071 -7 -379 142 79 -61 90 90 -218 40 -81 106 2 151 -4 36 -336 -75 134 -41 154 -26 -124 7
5093 7 107 110 226 -145 98 -208 192 -16 10 -65 -177 159 9 -22 135 -10 96 126 42 69 83 24 -153 55
5117 55 141 87 46 171 224 17 -29 324 21 -237 128 88 -94 -73 70 -166 -81 -177 -5 142 13 88 -246 -189
5141 -189 -89 -26 137 -94 23 125 -103 4 -138 200 128 -138 -28 -70 -209 -40 -59 64 -205 341 -55
$$ packed form
4975E0r2P6J47j10l85K08j0K31j6J3r0k8J20q4j60j47L81k07l6K57k91J34J91
4998A52j38LO3r6P3J09j44j10K05k09J65k2k5J2p2L4n3J37J57k7k84J4o6M6J08
5023C2L6j22j45K32j38J41O4J49l97O4J10m61L46Oj9m6K96pj10j57N0M9J93j84
5047a8J09r0j27M9J06M8j04L19j92l1k15L3K31l06M2L46r6k7j0j10M5j52K86j43
5071gl72N21o3j40J51%l08K58j21J87j04J49j55M0l72K61K09j75J95j80r8J31
5093GJ00LJ16l71K43l06M00k08K6p5j12L36j50l1J57j45J06L0q4K7J4n9j77K08
5117E5Q6n4m1J25N3k07m6L53l03k58L65m0j82K1J43k36Q5r6J72J47j29P5l34N7
5141a89J00O3J63k31J17J02k28J07j42L38p2k66J10m2j39J69j9J23k69N46l96
$$ plain form
5162 -55 -27 112 -87 -29 -139 -21 -107 104 -82 0 11 -253 -58 176 123 -93 249 44 -60 87 125 172 0
5185 0 44 -21 66 -134 -149 -276 29 190 -62 151 197 -38 -74 210 235 -96 80 -69 -136 -70 172 -138 3 -167
5209 -167 147 137 -75 191 20 193 55 103 -72 -29 -23 -80 -2 186 47 -200 -169 38 -32 102 43 58 88 37
5233 37 184 -73 -91 -312 -264 -108 15 292 -219 53 -40 52 -16 -94 256 213 197 -136 -101 120 -146 198 -63
5256 -63 -166 -295 136 16 -200 13 -69 -386 131 136 -138 114 220 63 77 24 131 161 69 -280 -25 162 -48
5279 -48 29 -146 58 -249 5 -23 48 22 -123 183 -54 -45 5 281 -21 121 245 -26 -153 -90 -173 102 -153
5302 -153 -136 -76 137 -118 -39 -223 117 162 -3 -73 -69 -29 -306 73 -55 76 53 34 -34 104 -247 -139 -216 -148
5326 -148 261 -34 38 127 -315 -48 -38 -73 19 -6 2 -181 156 84 186 114 145 -93 -296 -278 -64 161 -43 70
$$ packed form
5162e5K8J39j99N8j10J18q6K11j86Q2J1k64J95K34n3k16L42k05j04J47L8M7j72
5185@M4o5Q7k00j5j27L05J61k52K13M6k35l6K84K5l31J76j49o7O6K42l10J41j70
5209a67L14j0k12K66j71J73j38M8j75M3On7P8J88j39k47L1K07p0J34n9J5L0n1
5233C7J47k57j8k21M8J56J23K77n11K72r3R2o8p8L50m3j6l33L5K21k66L44k61
5256f3j03j29M31j20k16K13q2l17N17Nk74K52J06j57J4n3J07L0r2l49K55J87k10
5279d8P7j75K04l07K54k8P1k6j45L06k37RN0K76l02J42J24k71j27O3q3K75k55
5302a53J7O0K13k55P9j84L40M5j65p0MM0k77L79j28J31k3j9o8J38l51J08p7O8
5326a48M09k95P2Q9m42K67J0l5R2k5Qj83L37p2J02p2L1k38k03J8K14K25k04J13
$$ plain form
5350 70 -29 -65 -62 136 -39 114 96 -95 -156 -127 71 -119 52 176 -40 40 -103 135 -27 -87 -11 -5 -240 212
5374 212 116 -44 90 -258 173 -106 -42 -221 67 -146 241 -56 -184 -81 -140 17 48 -85 19 143 262
5395 262 32 43 -52 25 18 -150 -30 -123 63 130 -49 184 365 17 -132 -245 -130 104 80 138 -37 72 -189
5418 -189 194 -89 0 53 -146 -34 -67 75 -93 58 -66 33 -152 -28 2 -96 -45 -202 104 63 59 -39 -85 -76 -168
5443 -168 91 -210 -11 -97 -134 75 13 52 -45 -147 -13 -209 153 -137 110 181 -232 164 41 53 162 -22
5465 -22 27 -105 -64 -179 -93 195 -19 80 -260 -137 79 347 15 -164 -35 -235 -147 -161 170 -107 -78 17 55
5488 55 266 205 -10 -285 4 19 -169 27 193 -62 -144 -121 51 99 114 26 130 -182 23 -142 -201 120 -102
5511 -102 -24 -84 99 -79 65 -156 -18 68 -217 94 -47 88 15 -16 119 20 -25 172 125 -112 25 98 55
$$ packed form
5350G0r9l6LJ98j75J53j8j91o1K9J98j90J71J24k16Q0j43K38j62o0P6Ok35M52
5374B12r6j60J34l48M31k79O4j79K88k13L87k97j28J03n9J57L1j33J04J24J19
5395B62k30J1r5P7pj68J20r3J86O7j79K33J81l48j49j13J15K34k4N8j75J09k61
5418a89L83k83Q9N3j99J12l3J42j68J51j24R9j85J24L0r8N1j57L06m1mr8m6Rr2
5443a68K59l01J99q6l7K09o2L9r7j02J34j96L62k90K47P1m13L96j23J2J09j84
5465b2M9j32M1j15Q6K88k14R9l40J23K16K68l32j79J29k00Q8j4L31k77K9R5L8
5488E5K11o1k15k75K89J5j88J96J66k55q2K3J72M8J5q8J04l12K05j65n9L21k22
5511a02P8o0J83j78J44k21J38Q6k85L11j41J35p3l1J35r9m5J97m7k37J37P3m3
$$ plain form
5534 55 -25 115 104 -48 -80 -145 -164 82 -280 -170 65 -58 -278 56 -167 126 244 -45 -164 19 46 -273
5556 -273 -140 13 -108 -63 -139 193 78 97 -52 -68 -200 30 -17 13 -259 236 162 144 81 -175 -12 44 -104
5579 -104 -53 -121 -89 -81 112 302 -82 -12 50 -21 -119 107 -11 -130 45 226 352 67 110 -93 146 -35 -216
5602 -216 61 -71 -176 121 18 30 8 129 -44 164 162 32 -221 236 -159 39 112 38 -227 100 -52 -52 122
5625 122 179 70 -111 -36 -70 134 -119 -70 -49 129 -307 -91 33 214 -332 -8 71 -133 -109 -168 -12 20 70
5648 70 131 -232 15 -28 8 120 -107 55 -55 -36 -142 126 -117 -114 -142 199 3 64 83 -117 -134 -107 -35 -178
5672 -178 -94 -55 -108 31 72 29 61 -110 -75 119 -265 272 -61 -18 222 -166 -27 32 160 124 41 -33 78 -8
5696 -8 -102 59 -50 44 69 45 -218 9 -24 40 -29 31 -42 -160 264 28 21 -29 83 14 -89 27 -34 -168 90
$$ packed form
5534E5q0J40j1j52l2o5j9K46l62J10K35j23k20L34k23K93J18k89j19J83K7l19
5556b73J33J53j21M5p6L32j15J9j49j6j32K30m7L0k72M95p4j8o3k56J63N6j48
5579a04N1o8L2QJ93J90l84P0O2p1r8K26j18j19J75J81J26k85M3k03K39j81j81
5602b16K77j32j05K97j03J2k2J21j73K08kj30k53M57l95J98P3p4k65L27j52%J74
5625A22N7j09j81P5l4K04k53M9K1J78m36K16J24J81n46L24P9k04K4n9J56L2N0
5648G0O1l63K47m3L6J12k27J62j10J9j06K68k43Lk8L41j96O1J9k00j7K7P2j43
5672a78Q4L9n3J39M1m3L2j71L5J94l84N37l33M3K40l88J39N9J28l6q3p4J11q6
5696hr4J61j09R4K5k4k63K27l3O4o9O0p3j18M24k36pn0J12o9j03J16o1j34K58
$$ plain form
5721 90 -143 -157 47 155 -262 -67 -56 -62 -40 61 47 -25 227 -2 -72 145 299 -40 -119 -225 -67 -41 68 37
5745 37 -32 148 -71 25 169 207 114 12 211 -114 -71 40 -272 -33 -97 -12 -61 193 -161 185 -182 113 40
5768 40 -74 2 265 9 119 123 -195 -145 -153 -8 33 -43 -71 -83 -6 -72 207 -126 -54 -4 96 -329 81 -124 3
5793 3 210 116 171 160 10 -29 -88 0 -14 48 25 93 39 121 232 40 224 15 72 174 238 90 -261 37 -140
5818 -140 -71 132 22 96 103 -243 -2 -204 13 87 81 -233 -76 -182 -11 5 -155 228 -53 155 -57 117 21
5841 21 -85 -141 -58 9 -1 -216 -220 292 -10 -240 -29 -80 -182 152 -16 -14 168 9 -72 -62 75 -145 -152 85 33
5866 33 -26 12 -68 24 -145 -132 -76 -36 38 14 135 -55 135 74 -140 -76 24 -122 -163 73 79 44 29 -33 -89 160
5892 160 -49 -104 -31 -57 -103 -60 -160 -356 0 -84 -218 -23 17 -196 140 -6 37 -91 115 -106 -76 51 -94
$$ packed form
5721I0k33j4K04J08m17J95J1oK2J01j4p2K52k29p0K17J54l39p9j06J58K6J09l1
5745C7o9J80k19R6J44L8r3j02J99l25M3J11l12K39o4Q5m9K54l54L46l67K95p3
5768D0j14P6K63k56J10Ml18N0qJ45M1p6k8j2P7o6K79l33P2N0J00m25M10k05J27
5793CK07r4N5j1j50l9n9Q8j4O2k3O8n4Q2J11j92J84k09N7J02O4j48l51K98j77
5818a40O9K03j10P4Pl46K41k02K17P4ol14J57j06J71J6j60L83k81K08k12J74r6
5841B1j06n6Q3O7j0k15mN12l02k30K11n1j02L34j68KJ82j59q1J0J37k20pK37n2
5866C3n9L8q0R2j69J3N6M0P4k4J21j90J90o1k14O4J00j46m1K36Ol5j5o2n6K49
5892A60k09n5P3k6m6M3j00j96L56q4j34J95M0k13L36j46M3j28K06k21L0J27j45
$$ plain form
5915 -94 148 -91 116 -113 -119 -50 -14 73 -192 89 -168 -64 91 -172 -47 171 283 -24 163 173 125 205 107
5938 107 -8 -9 180 -241 -105 135 159 -163 -201 6 -297 60 28 -251 -94 -63 -95 180 -164 -149 -8 -29 -46
5961 -46 -98 -249 -29 11 104 -199 79 -78 -133 -123 27 134 81 45 -186 103 -23 85 -30 -230 -43 187 288
5984 288 -191 134 -148 343 -109 4 -10 -182 9 -191 218 -88 -52 145 281 -121 31 -39 34 -276 19
6005 19 -100 28 -45 -171 -91 -38 -106 -401 -8 -77 -20 92 39 209 0 97 142 -5 -16 -173 -221 -97 4 94
6029 94 -70 -146 -8 -83 -72 -10 -65 20 93 -89 105 -288 -212 -233 -228 112 -53 -2 170 116 27 -150 211 -53 -110
6054 -110 117 65 121 -41 -78 -3 108 100 -35 209 51 -156 115 24 -93 -74 142 72 20 126 -62 61 199
6077 199 136 -346 53 40 123 215 -65 92 161 8 52 143 -304 -10 -175 -286 56 -125 13 -10 85 -219 -23
$$ packed form
5915i4K42k39K07k29oO9L6Q7k65K81k57J04J55k63J25K18J12l07J87J0m8Q0r8
5938A07j15jJ89m21J36K40K4l22l8K07l03L57l2k79J57L1l2K75l44J5J41k1j7
5961d6n2j51K20M0R3l03K78j57n5J0J50J07n3l6k31K89j26J08j15k00J87K30J01
5984B88m79L25k82M91m52J13j4j72J91k00M09l06L6J97J36m02J52p0P3l10K95
6005A9j19J28p3j26Q0N3o8k95L93o9N7J12n3J70k09R7M5j47j1j57m8J24J01R0
6029I4j64p6J38p5J1O2n5Q5P3j82J94l93P6k1NL40j65N1J72n4q9j77L61k64n7
6054a10K27n2N6j62l7P5J11qj35K44j58k07K71r1j17J9K16p0n2J06j88J23J38
6077A99o3m82L99j3Q3R2k80J57O9j53M4R1m47K94j65j11L42j81J38k3R5l04J96
$$ plain form
6100 -23 139 -23 189 86 90 12 -224 125 35 0 248 109 144 66 -31 185 98 -243 -242 -132 -92 -285 71 166 61
6125 61 118 -236 50 -64 53 223 -253 -51 -14 -44 -87 -47 260 10 -93 -56 -151 -92 28 -202 -141 45 53 -4
6149 -4 -71 233 -62 27 18 165 -92 113 19 -101 58 -24 -141 -131 235 -16 122 121 72 -161 24 -199 -14 -74
6173 -74 -100 -230 -12 40 -104 231 -39 -19 81 -249 67 233 96 -54 0 167 184 175 -70 87 -211 133 -150
6196 -150 92 -108 257 -47 -34 45 -111 -190 119 -271 180 258 -53 36 -48 112 -199 -88 -91 -159 16 170 23
6219 23 122 131 -98 -293 -234 -37 -83 -136 153 91 133 169 -20 -89 -96 35 124 1 -57 33 -13 138 -8 -365 156 121
6245 121 -168 -419 116 -32 -169 -134 -146 -125 289 217 113 25 4 -6 334 66 -47 -15 -105 -47 39 29 224 13
6269 13 55 121 114 -115 75 132 -72 -17 126 -280 117 65 127 -15 -96 11 71 -177 -262 47 88 -36 -202 -6
$$ packed form
6100b3J62j62K12j03Mp8k36L49r0l5K48j39L5p8r7K16q7l41JJ10M0j93L56R5j05
6125F1N7l54K86j14J17J70m76K02L7l0m3M0L07k50j03L7r5N9J20k30O1J86Qn7
6149do7L04k95Q9rJ47k57K05r4j20J59q2j17J0L66k51J38jm9k33J85k23J85o0
6173g4k6j30K18N2j44L35k70K0J00l30L16J66j37j50N4J67J7rk45J57k98L44k83
6196a50K42k00L65l04J3P9j56p9L09l90M51P8l11Q9q4J60l11J11lo8J75J54j47
6219B3R9Rk29j95N9J97m6n3K89o2M2L6j89o9pJ31Q9j23n8R0m6J51j46l57N21l5
6245A21k89k51N35j48j37L5j2K1M14p2j04q8k1j0L40k68j13L2r0N8Q6j0J95k11
6269A3M2O6pk29J90N7k04N5J43m06L97n2O2j42q1J07O0k48q5L09M1j24j66J96
$$ plain form
6293 -6 132 144 -143 162 -20 135 -30 86 -46 115 -20 102 -105 39 -178 150 264 48 -136 -7 -42
6314 -42 36 158 -176 9 111 111 -91 57 9 -23 -115 48 -36 -51 -149 226 -47 98 18 62 -114 -71 -101 -31 129
6339 129 -257 25 -9 35 109 133 -69 -216 -32 326 51 -28 -204 17 97 56 344 -76 40 -146 158 -110
6361 -110 45 35 -362 -110 38 -107 18 -201 212 211 -90 -166 153 172 -111 -216 99 -79 -221 -108 443 61
6383 61 -71 -62 -61 -40 7 -44 40 -21 -168 -41 130 101 -163 -183 233 237 -149 12 150 -38 189 79 54 -85 199
6408 199 -21 59 42 -61 -51 50 201 43 94 -72 -32 125 -137 -31 238 108 205 26 8 30 12 60 -290
6431 -290 101 -104 -19 140 -11 -162 -103 32 61 -181 -195 93 -173 -99 -203 42 17 -27 150 -192 -169 -166 188
6454 188 182 114 53 1 -153 42 -217 -116 217 -30 6 -69 147 163 -8 10 10 47 47 -2 220 129 -141 56 74 1
$$ packed form
6293fJ38J2k87L05j82J55j65J16j32J61j35J22k07J44k17L28J14k16j84J29l5
6314d2P8J22l34J85J02%k02J48m8l2r2J63q4j5r8L75k73J45q0M4j76M3l0P0J60
6339A29l86K82l4M4P4K4k02j47J84L58k75p9j76K21Q0m1K88m20J16j86L04k68
6361a10J55j0l97K52J48j45J25k19M13jl01p6L19J9k83j05L15j78j42J13N51l82
6383F1j32RJK1M7n1Q4o1j47J27J71k9k64k0M16Ml86J61J38j88K27j10k5j39K84
6408A99k20Q0j7j03J0J01J51j58N1j66M0J57k62J06K69j30R7j79j8K2j8M8l50
6431b90L91k05Q5J59j51j51N9J35K9k42j4K88k66P4j04K45k5m4J77l42K3LL54
6454A88oo8o1n2j54J95k59J01L33k47L6p5K16J6j71J8%L7%m9K22r1k70J97J8p3
$$ plain form
6480 1 -85 9 -38 66 124 -186 -9 0 -121 0 -310 173 -247 -136 -224 -164 -48 78 -72 215 78 174 125 -11
6504 -11 192 -221 37 144 190 -163 -9 106 187 46 -91 42 271 -424 144 -4 -27 112 119 -115 -55 76
6526 76 -64 35 -123 -25 78 165 234 41 137 -204 41 -201 103 -90 -147 -4 49 42 88 -30 100 162 -61 -88
6550 -88 -4 -115 4 4 -331 18 126 -233 27 136 -296 -210 -36 -158 236 1 -188 90 76 -40 -163 -53
6572 -53 -47 118 -189 262 279 -89 66 11 37 -121 -53 411 151 -181 96 203 -43 164 -163 9 -46 68 -14
6595 -14 59 368 -77 -168 114 -14 114 7 35 -11 -275 -178 -228 -59 69 3 46 53 0 -75 -78 8 -61 3 -94 7
6621 7 5 213 -116 -89 -47 205 20 11 138 -136 -21 -10 -80 -222 206 127 -167 -82 -174 60 164 -245 -10 124
6645 124 -275 183 57 91 -4 -178 40 191 114 -46 40 -247 -23 -92 2 -125 -182 25 -297 132 146 75 33
$$ packed form
6480Aq6R4m7J04N8l10J77Rj21J21l10M83m20J11q8O0J16J26j50K87j37R6m9j36
6504a1K03m13K58J07M6l53J54J15Q1j41j37J33K29o95N68j48k3J39Pk34O0J31
6526G6j40R9j58R8J03Q7O9j93R6l41K45k42L04j93n7J43N3pM6j18J30O2k23k7
6550h8Q4j11J19%l35L49J08l59K60J09m32Q6J74j22L94k35j89K78j4j16j23J10
6572e3OJ65l07M51J7l68J55n5K6j58O8M64k60l32K77J07k46K07l27J72n5J14q2
6595a4P3L09m45r1K82j28J28j07K8m6k64R7n0J69J28o6M3Pn3p5lQ6o9O4r7J01
6621GkK08l29K7M2K52j85rJ27k74J15J1p0j42M28p9k94Q5r2K34J04m09K35J34
6645A24l99M58j26L4r5j74K18J51p7j60Q6k87K24o9R4j27n7K07l22M29J4p1m2
$$ plain form
6668 33 25 -282 84 73 -311 -34 170 -94 70 -85 -36 255 -15 -57 -190 149 155 26 -43 134 57 -39 118 213
6692 213 -159 30 178 70 186 10 119 -5 53 102 290 -39 -29 6 1 18 57 48 -106 179 185 -124 -27 -237
6716 -237 162 58 19 -408 -76 78 12 36 -31 -82 97 105 59 -145 -246 -66 22 -256 -109 -102 53 -50 217 45
6740 45 187 -91 28 342 107 211 -52 -80 33 84 -67 -106 -160 -20 100 -4 -94 -92 -62 69 -25 -149 -81 191
6764 191 65 -85 17 84 120 91 -233 59 -1 14 10 -113 65 73 -104 -71 51 -9 -45 0 -17 18 -48 119 26 -75
6790 -75 -172 -2 44 -120 239 -168 -45 -5 -114 138 -93 72 42 -8 190 -154 -18 243 35 -224 42 45 -85
6813 -85 -126 -17 -83 83 -144 43 9 -36 -85 -262 -73 -79 82 0 -131 -142 -1 -69 272 62 183 103 -97 -41
6837 -41 216 -86 3 -96 82 199 102 -178 -153 -33 -200 -114 8 -217 80 59 -125 77 -26 -309 -117 48
$$ packed form
6668C3ql07L66j1l84K77K04k64J64j55M9K91k70m2j33L39Oj29o9J77p7r6J57R5
6692B13l72J89J48j08J16j76J09j24N8M9J88l29J0L5nJ7L9rj54K85Ol09R7k10
6716b37L99j04l9m27L32J54o6K4o7n1J79Qm6k04j01J80Q8k78J47PJ55j03K67j72
6740D5J42k78J19L14k35J04k63k8J13N1j51l9n4J40J20j04r0KL0J31r4j24O8K72
6764A91j26j50J02O7L6k9l24K92o0J5mj23J78Qj77L3J22o0l6M5j7L5o6J67r3j01
6790g5r7J70M6j64L59m07J23M0j09K52k31J65l0n0J98l44J36K61k08k59K66Lj30
6813h5m1J09o6J66k27J87l4m5m9j77J89oJ61q2j31j1J41o8L41k10J21q0k00N6
6837d1K57l02Q9r9J78J17r7k80K5J20j67Q6J22k25K97k1j84K02j03k83J92J65
$$ plain form
6859 48 -156 -99 -160 -14 175 130 -80 -106 -172 -94 -84 -63 139 -33 78 33 54 12 -8 117 -166 -33 25 121 -28
6884 -28 236 -251 -63 201 100 -80 121 -164 0 -82 -31 96 -162 119 106 280 55 78 76 68 -341 -101 54
6907 54 131 20 260 250 228 156 79 19 71 13 -201 261 -256 -192 -14 -53 -94 62 -3 -134 -1 145 37 24 -117
6932 -117 249 -137 -66 -58 -104 -79 -189 -105 -201 148 194 48 118 220 33 23 58 -101 27 17 -233 -111 44 239
6956 239 -93 -79 -57 -28 31 -306 0 -161 113 -130 132 -58 250 69 -202 -231 -40 71 -115 291 106 248
6978 248 128 3 23 -52 50 -24 69 155 15 -28 102 129 -135 -11 -17 -56 93 -100 169 -197 -5 -13 54 79 156
7003 156 -110 -63 -62 -104 -107 -54 -177 -16 26 -33 65 -101 -118 32 -32 -153 107 5 -97 36 58 23 -120 114 -236
7028 -236 233 -51 23 -213 32 -69 67 80 145 -35 30 168 40 -321 4 40 -506 116 218 -142 -182 6
$$ packed form
6859D8k04N7o1J46J89m5k10k6o6P8J0K1K02j72J11m5K1m2k0J25k83J33N8R6j49
6884b8K64m87J88K64j01j80K01k85J64q2N1J27k58K81j3J74k25K3kqm09K40J55
6907E4P7j11K40j0k2p2p7o0N2n8k14M62n17O4J78l9m1J56o5j31J33J46j08j3j41
6932a17L66l86P1Qm6K5j10Q4r6L49M6j46P0J02j87j0L5j59J28j0k50J22J55J95
6956B39l32J4K2K9N9l37L06j61K74k43K62j90L08j81k71k9J91J11j86M06j85J42
6978B48j20j25K0p5J02p4R3Q6j40m3J30K7k64J24ol9J49j93K69l66J92qO7K5P7
7003A56k66M7Jm2lN3j23J61M2n9R8j66j7J50o4j21K60j02j02J33K2l5j43K34l50
7028b36M69k84P4k36K45j01J36J3O5j80O5J38j28l61L25L6n46O22J02l60m0J88
$$ plain form
7050 6 91 -28 34 88 199 -216 62 -54 -236 -60 -166 325 225 39 267 -159 -100 -179 189 160 101 -58 -134
7073 -134 107 214 113 66 10 92 220 61 147 -17 57 69 177 90 281 165 64 58 78 -15 -101 -5 20 82 -292
7098 -292 -175 19 -168 50 12 40 -39 -13 77 -52 -108 121 68 -61 -95 34 124 18 153 -61 33 3 -65 110
7122 110 30 165 139 4 -146 -240 61 52 63 210 -285 -182 -28 162 -7 -342 186 -170 66 184 -89 113
7144 113 -42 -41 210 -19 -32 -18 50 1 218 127 -198 129 53 -11 -186 -70 -52 250 -4 159 38 -153 -273
7167 -273 -98 20 -366 -63 65 -135 -94 2 19 52 114 21 167 -38 92 -18 -29 -122 -200 -38 281 130 86
7190 86 -163 228 204 17 188 -15 61 152 -86 -77 -60 -128 247 -69 76 132 89 120 -66 251 93 -48 226 100
7214 100 183 -11 52 193 -31 88 13 -253 -160 -88 60 -122 -78 8 -81 174 -149 18 -96 -118 72 112 73 -189
$$ packed form
7050FQ5j19O2N4J11m15K78j16j82J76j06M91j00j86K28m26N9p9L68k9n9j59p6
7073a34K41J07j01m7n6Q2J28j59Q6j64P4J2J08q7J91j16j01oK0r3q6R6K5O2l74
7098b92J17J94j87K18l8K8p9K6R0j29n6K29n3j29l4J29R0j06J35k14R4l0o8J75
7122A10q0J35k6j35j50r4L01rJ1J47m95J03J54J90j69l35N28l56K36J18k73K02
7144A13j55JK51k29j3J4O8m9K17r1l25L27p6o4j75J16J8L02k54J63j21j91j20
7167b73J75J18l86L03J28k00M1R6J7L3O2r3J46k05J30j10j1r3p8J62L19j51m4
7190H6k49L91k4j87J71k03P6R1k38RJ7o8L75l16J45N6m3L1j86L17j58j41K74j26
7214A00Q3j94O3J41k24J19p5k66R3P2J48j82M4Q6q9K55l23J67j14k2J90M0l9k62
$$ plain form
7238 -189 353 -59 7 13 -100 -165 -19 280 71 136 31 -162 -234 -204 -179 4 -28 -173 -226 7 47 -104 2 71
7262 71 18 -89 270 -216 -52 -228 -42 -17 -14 267 -30 163 0 265 -109 -67 78 -31 -86 -154 36 47 -111
7285 -111 44 -94 -112 -137 -16 -94 185 30 -64 -222 -75 -179 -44 -5 7 21 -25 75 -73 58 136 97 142 187
7309 187 90 -317 -14 -22 214 34 13 61 129 -40 -7 -17 457 267 120 138 -77 199 -117 41 -84 168 65
7332 65 -208 67 131 178 188 91 209 -35 13 78 115 198 74 -65 -119 -23 -129 -89 154 -40 -39 184 228 92 -82
7357 -82 211 148 124 81 -159 -291 -43 -84 -24 -206 -107 187 221 97 -132 71 20 -16 -155 182 4 62 92 47
7381 47 176 48 12 -80 67 187 260 250 -78 154 218 131 -120 -146 -142 80 139 -24 138 106 -17 17 109 -112 198
7406 198 -24 -42 252 -62 91 399 -53 -28 -57 75 -6 23 206 50 -230 -168 -10 10 -81 47 0 63 -128
$$ packed form
7238a89N42m12O6Oj13o5J46K99k09O5j05j93p2L0K5J83l2j45n3K33M0j51J06O9
7262G1n3j07L59m86J64j76J86K5LK81k97J93j63K65l74M2J45j09n5o8J90J1j58
7285a11J55j38j8k5J21p8K79j55r4j58J47j04J35L9J2J4m6J00j48J31P8l9M5M5
7309A87r7m07L03qK36j80k1M8O8j69L3j0M74j90j47J8k15K76l16J58j25K52j03
7332F5k73K75O4M7J0r7J18k44M8O5L7Q3j24j39n4R6j06M0K43j94JK23M4j36j74
7357h2K93o3k4m3k40j32K48m1O0j82R9K94L4j24k29K03n1l6j39L37j78N8L0m5
7381D7J29j28l6r2J47J20P3j0l28K32O4q7k51k6MK22N9j63J62l2j23L4R2k21L10
7406A98k22j8K94l14J53L08m52K5k9J32q1K9J83j56k80O2J58K0r1J28m7O3j91
$$ plain form
7429 -128 26 154 38 104 54 -92 170 -66 7 40 -207 -243 -91 28 7 -74 -107 -83 -32 -144 -43 145 -83
7452 -83 -16 28 18 53 -31 51 201 -194 -46 -19 -203 -140 67 169 -79 -216 -82 181 -156 59 119 -148 -72 183
7476 183 -34 15 13 315 -215 95 -65 110 253 42 -17 -108 -158 37 -59 -97 212 -32 115 34 116 -33 -53 -50
7500 -50 21 149 36 -29 -63 -50 264 250 280 38 49 2 -24 156 63 -83 -164 -42 28 159 -46 95 37 -135 -118
7525 -118 6 -187 -41 -81 68 82 165 -44 86 66 -28 125 -214 162 96 -125 46 -115 27 62 182 219 94
7548 94 63 113 -42 -221 -137 38 -208 13 11 -109 -87 148 280 -108 43 110 -48 48 136 -62 58 -131 -9
7571 -9 -73 -87 42 -265 57 297 7 26 26 136 -71 -1 -20 193 -10 -104 -9 24 115 10 -113 142 -75 127
7595 127 126 -162 4 -101 160 115 224 117 75 43 -67 168 -105 -138 -53 -30 -26 -333 109 122 -117 -17 102 -183
$$ packed form
7429a28J54J28j16O6n0j46K62k36P3L3k47l6J52J19k1q1l3K4N1j12J01J88k28
7452h3O7M4j0L5q4Q2J50l95J48K7j84O3K07J02k48j37J34K63l37K15O0k67P6K55
7476A83k17M9kL02n30L10j60J75J43k11n9r1n0J95r6l8L09k44J47q1Q2j49k0L
7500e0P1J28j13o5l4J3L14j4L0k42J1m7k6J80r3j46q1J22P0J31k05J41n8j72J7
7525a18J24j93J46m0J49J4Q3k09J30k0r4J53l39L76o6k21J71j61J42L5J20L7j25
7548I4l1N0j55j79Q4J75k46K21kj20K2K35J32l88J51O7j58R6Q8j98J20j89J22
7571io4j4J29l07L22K40k90J9%J10k07P0j9K13k03r4R5L3R1j05j23K55k17K02
7595A27jk88J66j05K61m5J09j07m2l2j10K35k73l3Q5K3Ml07M42J3k39J00J19k85
$$ plain form
7619 -183 -216 86 -90 34 -88 -158 173 71 -25 190 -90 -108 -32 54 81 66 -197 -8 64 146 1 -37 95 -194
7643 -194 5 39 -80 54 -50 8 106 -13 31 260 3 207 98 -64 104 -47 -154 66 -69 -26 28 73
7665 73 55 221 163 52 174 -55 -35 -26 274 10 -61 67 -129 127 -81 148 -124 185 -205 -129 27 -96 -33
7688 -33 -14 -56 -232 -48 -54 4 11 -177 196 256 -141 -69 173 -107 -63 95 24 -21 197 -144 49 95 68 107 134 -120
7714 -120 121 -28 22 79 -76 -15 -65 81 53 -156 -90 23 -95 49 -333 -10 -104 -191 -209 -2 -288 146 -87
7737 -87 63 -209 43 40 -212 -95 43 126 -25 -106 121 99 234 -82 -162 52 -40 154 -88 82 281 41 121
7760 121 30 123 -60 21 124 -54 356 -97 -65 203 -269 -37 -52 15 69 138 -66 32 196 -106 -44 44 -28 -108
7784 -108 -53 -92 -66 -85 -81 -35 173 70 -253 -36 40 42 51 -192 118 -126 12 82 -81 117 -100 -44 -87 291 134
$$ packed form
7619a83l3L02j76J24j22p0L31j02r6K15k80j8P6Q6K7j5k63J89P2Q2j45l8J32k89
7643a94J99L4j19J34j04N8R8j19M4K29k57K04j09j62J68j51j07K20j35M3N4M5
7665G3j8J66n8j11J22k29K0RL00k64p1J28j96K56k08K29k72L09l90P6J56j23O3
7688c3J9m2j76J84oN8Pj88L73O0l97P2K42k80M4J58p1m5K18l41J93M6k7L9K7k54
7714a20K41j49N0N7j55O1n0J46k8k09O6J13j18J44l82L23r4q7j8K07k86M34k33
7737h7J50k72K52lk52J17J38Q3j51q1K27k2J35l16q0K14r2J94k42J70J99k40Q0
7760A21r1R3j83Q1J03j78M10m53L2K68m72K32j5O7N4O9k04R8J64l02O2Q8p2q0
7784a08N5l9K6j9MM6K08j03l23K17P6KRk43L10k44J38P0j63J98k17N6m3L78j57
$$ plain form
7809 134 -18 171 -232 167 -176 -216 297 183 148 21 -120 -194 26 -165 -12 -40 234 66 -11 138 48 -55
7831 -55 44 211 -169 117 146 -31 14 22 110 110 -95 94 83 -225 74 -27 185 177 96 -54 -76 -18 103 7 151
7856 151 54 -216 -24 -23 26 -250 -87 -115 -213 -13 -4 -141 57 3 77 -33 -159 114 52 -20 -10 -81 -47 94 -102
7881 -102 -256 124 -68 25 41 -148 -12 186 -16 103 19 42 89 302 128 0 -114 -9 -261 121 111 -5
7903 -5 172 137 -18 34 -158 -23 135 -108 -125 -170 -179 -49 56 56 104 83 -213 116 -87 70 62 372 5 200 9
7928 9 -235 114 13 120 208 177 -43 -34 -60 -260 -185 -163 -86 -203 -167 -82 -140 157 367 -153 -22 -130 254 212 -70
7953 -70 -121 84 -236 -42 -84 -96 158 -253 214 -40 -86 7 -45 87 109 20 294 -127 -36 -212 -50 -18 -188 253
7977 253 -106 -272 -60 -221 41 -100 -123 90 -78 -204 -95 -99 38 -1 55 -283 175 -163 -47 -43 165 -55
$$ packed form
7809A34j52J89m03L99l43m0N13j14l5j27j41p4K20j91J53k8K74j68p7J49r0j03
7831e5R9J67l80K86K9j77M5QQ8%k05J89j1l08K99j01K12qq1j50k2N8J21r6J44
7856A51r7k70J92JM9k76J63k8r8K00Rj37J98n4P4j10j26K73o2p2J0p1L4J41j96
7881a02j54L80j92R3J6j89J36J98k02J19q4K3M7K13j74j28j14J05k52L82j0j16
7903eJ77l5j55N2j92J35J58k43j7m5rJ30J05%M8k1k96L29k03J57qL10l67J95j91
7928Ik44L49j01J07Q8l1k20Rk6k00P5K2P7j17L6Q5n8K97K10n20J31j08L84m2k82
7953g0n1K05l20J94m2j2K54m11M67k54m6R3n2J32K2q9K74m21R1j76J62L2j70M41
7977B53l59j66K12j61K62j41k3K13j68j26J09mJ37l9N6l38M58l38J16MK08k20
$$ plain form
7999 -55 17 -51 -14 -60 176 -171 -14 -24 62 -32 10 -53 15 -81 4 83 -205 -92 -127 130 -100 -31 56 -157 41 75
8025 75 -33 -119 -135 -49 50 -75 -7 183 222 -3 169 -124 112 89 -7 -45 76 -104 93 -162 -78 -186 32 -55
8049 -55 177 117 76 -45 -92 -58 27 99 156 -128 -66 -22 44 124 -86 -281 41 -125 -198 -140 258 59 70 114 156 63
8075 63 99 -43 33 -122 174 13 -142 -85 350 25 -252 111 39 19 -71 -51 20 88 29 208 33 -99 144 112
8099 112 177 164 -86 201 121 3 -3 76 170 144 65 92 -171 -43 -113 -72 128 -99 90 112 -125 165 -92 50
8123 50 45 -106 -66 389 -44 171 -92 -51 -25 109 116 -99 55 -179 -256 95 197 63 -247 -6 105 -203 7
8146 7 86 -106 -3 -11 136 -121 -187 -116 -22 101 -93 -82 -170 72 -154 94 42 -163 200 97 -169 -191 -128 162
8170 162 9 139 -55 -281 -185 130 15 125 -32 16 86 43 58 43 -121 151 -264 126 -2 308 -127
$$ packed form
7999e5P2o8L7m6K36l47J57j0Q6r4M2o3O8r6Q5P9k88J13l5K57k30O9Q7k13J98L4
8025G5j08q6j6Q6R9j25O8J90L9k25J72k93K36k3r6l8J21j80J97k55Q4j08K18q7
8049e5K32o0m1j21m7L4Q5P2N7k84O2M4O6Q0k10j95L22j66p3N8L98j99J1M4M2r3
8075F3L6j42P6j55K96j61j55N7M35l25k77L63p2k0r0K0P1O8n9J79j75j32K43l2
8099A12O5j3k50K87q0j18oP9R4k6p9K7k63J28p0M1K00k27J89K2k37K90k57J42
8123E0nj51M0M55m33K15k63M1K6J34Pk15J54k34p7L51J02j34l10K41J11l08K10
8146GP9j92J03qJ47k57o6P1R4J23j94J1q8K42k26K48n2k05L63j03k66k2O3K90
8170A62j53J30j94k26R6L15j15J10j57M8P0m3J5j5j64K72m15L90j28L10m35
8191a27
$$ Imaginary data points
##PAGE= N=2
##DATA TABLE= (X++(I..I)), XYDATA
$$ plain form
0 0 0 0 0 0 0 0 0 0 0 0 0 8 -8 8 -8 8 -16 16 -24 24 -32 40 -48 56 -64 72 -86 96 -112 128 -147 168 -191
33 -191 216 -243 272 -306 342 -382 427 -475 526 -583 646 -714 788 -869 959 -1055 1164 -1280
51 -1280 1412 -1557 1717 -1899 2104 -2334 2603 -2916 3286 -3727 4275 -4964 5868 -7107 8909
66 8909 -11781 17068 -29970 128628 124797 -42497 158434 6275 13669 84185 40146 84148
78 84148 38731 34544 63979 -6440 72370 60197 45227 77043 8670 29138 38661 975 63123
91 63123 58014 20304 12964 24321 8212 -10369 49005 35460 -11382 21072 -7103 -20424 -58
104 -58 6238 15363 -10400 -10360 -18751 -41194 -9363 -17973 -10059 -3213 -45538 -26115 -33526 -49526 -7009
119 -7009 -15329 -30627 -30700 -37221 -41254 -47394 -15990 -16332 -39167 -20571 -39209 -49239 -25633 -27335
$$ packed form
0@%%%%%%%%%%%Qj6J6j6J6k4L2m0M8n6P2q8J04j20J36j58J82k08K40k75L15l59
33a91M07m59N15n78O48p24Q09r02J001j109J229j360J502j657J828k014K219k444
51a280K692k969L274l616M003m438M937n519O202p013Q002r239J0832j2975J6016
66H909k0690K8849m7038J58598l831j67294K00931j52159P394P0516m4039M4002
78H4148m5417m187K9435p0419P8810j2173j4970L1816o8373K0468R523l7686O2148
91F3123n109l7710p340J1357j6109j8581N9374j3545m6842L2454k8175j3321K0366
104e8O296R125k5763M0q391k2443L1831q610P914O846m2325J9423p411j6000M2517
119g009q320j5298p3o521m033o140L1404l42k2835J8596j8638j0030K3606j702
$$ plain form
133 -27335 -18687 -16421 -28439 -30851 -32544 -28023 -19215 -6335 -12663 -21228 -14987 -28325 -20306 -3016
147 -3016 -5560 1196 -8285 -9779 -8176 -17329 10944 8297 -1923 18435 -7392 -6139 12753 -1464
161 -1464 20084 19894 4364 15505 1459 6698 20497 14371 25780 16854 7978 15870 6533 16886
175 16886 27906 15706 20503 17921 4796 13808 19023 15434 23207 18867 8618 11695 9159 11380
189 11380 19065 14956 15073 9041 2644 8738 5356 12011 15440 3755 7300 1751 -4516 7543 4371
204 4371 4872 6888 -2778 -2914 -4563 -2917 2756 -1121 1107 -3541 -10829 -5239 -7239 -5106 595 -6061
220 -6061 -7303 -8760 -12450 -8323 -5956 -5739 -5432 -9052 -11299 -11757 -10529 -7459 -5653 -7121 -8573 -11104
236 -11104 -12897 -8580 -7670 -7231 -3495 -9292 -10858 -7639 -10945 -4993 -2030 -6785 -3628 -7600 -9429
$$ packed form
133b7335Q648K266j2018k412j693M521Q808J2880o328q565O241j3338Q019J7290
147c016k544O756r481j494J603r153K8273k647j0220K0358k5827J253J8892j4217
161a464K1548j90j5530J1141j4046N239J3799o126J1409q926q876P892r337J0353
175A6886J1020j2200M797k582j3125R012N215l589P773m340j0249L077k536K221
189A1380P685m109J17o032o397O094l382O655L429j1685L545n549o267J2059l172
204D371N01K016r666j36j649J646N673l877K228m648p288N590k000K133N701o656
220f061j242j457l690M127K367K17L07l620k247m58J228L070J806j468j452k531
236a1104j793M317R10M39L736n797j566L219l306N952K963m755L157l972j829
$$ plain form
251 -9429 -3941 -5065 -1271 100 -5028 -2258 -5018 -4775 1965 -753 1415 2365 -3618 110 52 -188
267 -188 6265 3251 2439 3714 -365 2897 5134 4317 7514 5296 3375 4457 2687 6578 8108 6050
283 6050 8206 5297 3033 6600 5486 7010 9227 5630 5618 5178 3498 6559 6524 6603 6734 3129 4110
300 4110 3455 2727 6493 4456 3190 4459 163 1056 3402 1169 3548 2528 -1274 178 -1537 -1455
316 -1455 1404 -555 85 -1406 -4172 -2073 -2974 -2728 312 -3496 -3638 -2911 -6553 -3703 -2821 -4444 -2599
333 -2599 -3980 -6462 -4572 -5558 -3887 -2822 -4430 -3494 -5398 -5833 -3237 -4888 -3084 -1946 -5035 -3556
349 -3556 -3728 -5146 -1421 -1748 -2599 -1435 -2844 -2441 -1539 -1656 561 -247 -456 54 -1910 -269 1369
366 1369 965 2299 1462 445 1409 996 2133 3342 2254 2956 2188 1428 2795 2417 3305 4250 2310 2949
$$ packed form
251i429N488j124L794J371n128K770k760K43O740k718K168R50n983L728n8k40
267a88O453l014q12J275m079L262K237q17L197k218j921J082j770L891J530k058
283F050K156k909k264L567j114J524K217l597j2m40j680L061l5P9J31l605R81
300D110o55p28L766k037j266J269m296Q93K346k233K379j020l802J452j715Q2
316a455K859j959O40j491k766K099r01K46L040l808j42P27l642K850Q82j623J845
333b599j381k482J890r86J671J065j608R36j904m35K596j651J804J138l089J479
349c556j72j418L725l27q51J164j409M03R02j17K217q08k09N10j964J641J638
366A369m04J334q37j017R64m13J137J209j088P02p68p60J367l78Q88R45j940O39
$$ plain form
384 2949 2359 1494 4006 3090 2943 4311 1703 1877 2608 1227 3473 3068 1594 2776 488 1275 2218
401 2218 791 2213 1777 -148 757 -216 179 1603 -35 536 555 -1784 -462 -315 -1183 648 -446
418 -446 -1551 -673 -2152 -1583 -49 -1538 -817 -999 -2618 -1142 -2071 -1585 -25 -2156 -1331 -1616 -2845
435 -2845 -642 -1399 -1607 -91 -1803 -1899 -1001 -1776 -714 -387 -518 -313 -1664 -604 -917 -964 684 -447
453 -447 -639 -167 -1150 -452 320 -7 431 245 -346 -280 -39 401 255 402 534 -108 -202 728 265 669 1491
474 1491 224 302 524 -529 1113 1107 116 1222 22 48 905 -204 895 1159 -12 1242 -69 -156
492 -156 1160 -133 836 902 -581 746 169 -275 1368 445 214 956 -540 190 436 143 917 579 -177
511 -177 595 -111 269 843 -50 695 468 -693 539 162 -254 1141 -33 -48 420 -577 51 230 -93
$$ packed form
384B949n90q65K512r16j47J368k608J74P31j381K246m05j474J182k288P87R43
401B218j427J422m36j925R05r73L95J424j638N71J9k339J322J47q68J831j094
418d46j105Q78j479N69J534j489P21j82j619J476r29M86J560k131Q25k85j229
435b845K203p57k08J516j712r6Q98p75J062L27j31K05j351J060l13m7J648j131
453d47j92M72r83O98P72l27M38j86n91O6K41M40j46J47J32o42r4R30m63M04Q22
474A491j267P8K22j053J642or91J106j200K6Q57j109J099K64j171J254j311q7
492a56J316j293R69O6j483J327n77m44J643r23k31P42j496P30K46k93P74l38p56
511a77P72p06L80N74q93P45k27j161J232l77m16J395j174j5M68r97O28J79l23
$$ plain form
530 -93 313 -349 -378 -15 -319 149 -38 -196 -224 -832 13 -369 -413 -312 -458 -713 -481 -877 -705 -376 -568 -375
552 -375 -624 -624 -543 -880 -539 -129 -665 -505 -554 -1182 -322 -286 -328 94 -778 -969 -245 -789 43 -107 -423 421
574 421 -700 -409 424 -556 426 149 -475 468 -211 -22 887 -66 466 782 -132 375 347 133 896 363
594 363 435 846 561 816 755 543 813 734 137 748 454 184 994 552 484 669 25 517 716 302 699 302
616 302 13 346 -186 266 296 85 491 45 -378 377 -217 -117 -201 -478 -70 -343 -604 -442 -400 -88 -609
637 -609 -528 -410 -809 -420 -300 -498 -464 -414 -752 -556 -350 -393 -345 -549 -514 -390 -837 -144 -174 -444 -76 -423 -487
660 -487 -46 -301 169 117 -153 292 -197 -66 248 -75 146 389 -191 281 276 -17 621 445 143 632 142
681 142 213 338 442 397 335 284 285 116 233 784 150 391 311 -254 439 145 95 710 139 75 277 -210 -160 78
$$ packed form
530i3M06o62k9L63l04M68j87j58k8o08Q45l82m4J01j46k55K32l96J72L29j92J93
552c75k49%Q1l37L41M10n36J60m9o28Q60L6m2M22q72j91P24n44Q32j50l16Q44
574D21j121K91Q33r80R82k77o24R43o79J89R09r53N32L16r14N07k8k14P63n33
594C63P2M11k85K55o1k12K70p9n97O11k94k70Q10m42o8J85o44M92J99m14L97l97
616C02k89L33n32M52L0k11M06m46m23P55n94J00q4k77M08k73k61J62M2L12n21
637f09Q1J18l99L89J20j98L4N0l38J96K06m3M8k04L5J24m47O93l0k70L68l47o4
660d87M41k55M70n2k70M45m89J31L14l23K21K43n80M72nk93O38j76l02M89m90
681A42P1J25J04m5o2n1Jj69J17N51o34K41q0n65O93k94n0O15n71o4K02m87N0K38
$$ plain form
705 78 63 209 26 181 56 -340 208 -150 -147 253 -220 -434 -259 -94 -184 -94 -119 -133 -519 -90 -122 -58 -365 -131
729 -131 147 72 -294 -182 -74 -172 -1 121 -398 -269 -170 122 -27 -81 -121 280 -168 -32 45 192 278 -176 -24
752 -24 265 28 221 241 167 204 -185 -101 283 -89 118 489 75 153 247 -11 191 -7 -277 390 -344 5 259
775 259 -8 -118 45 -47 132 -210 -177 259 -94 22 3 -223 -48 131 -110 -23 -452 9 -124 -514 -122 65
797 65 -73 33 -578 57 60 -272 -33 -102 -146 -93 -114 -30 -113 -63 -134 162 156 177 79 167 124 200 336 162 34 419
823 419 -35 -47 240 -46 283 429 -87 62 -3 240 214 7 -201 80 -249 119 75 -256 39 50 12 209
845 209 -180 -72 193 -127 151 74 -204 -16 31 90 208 -134 -146 -261 -150 -27 -205 -312 174 -83 123 15
867 15 -334 -184 -183 -187 62 -306 17 302 -239 -204 -23 -255 -173 -110 -311 -151 -270 -51 323 32 -13 -74 -31 -94
$$ packed form
705G8j5J46j83J55j25l96N48l58LM00m73k14J75J65r0R0k5j4l86M29l2O4l07K34
729a31K78p5l66J12J08r8J71J22n19J29R9K92j49n4m0M01m48J36P7J47Q6m54J52
752b4K89k37J93K0p4L7l89Q4L84l72K07L71m14P8R4k58K02j98k70O67p34L49K54
775B59k67j10J63r2J79l42L3M36l53J16j9k26J75J79k41Q7m29M61j33l90L92J87
797F5j38J06o11O35Ll32K39o9m4N3k1Q4q3N0p1K96oK1r8Q8m3P6J36j74j28L85
823D19m54j2K87k86L29J46n16J49o5K43k6k07k08K81l29L68m4l31K95J1l8J97
845B09l89J08K65l20K78p7k78J88M7N9J18l42j2j15J11J23j78j07M86k57K06j08
867A5l49J50JmK49l68L23K85n41L5J81k32Q2O3k01J60j19K19L74k91m5o1M3o3
$$ plain form
891 -94 129 -65 33 -120 218 71 -37 -44 -79 267 272 119 18 163 389 139 2 114 235 144 88 178 276 90
915 90 180 11 128 39 -30 297 144 83 244 170 221 -68 -115 104 -43 68 181 -151 -51 -7 -144 38 -67
938 -67 -117 -106 -305 -338 -33 -131 -144 -16 -77 -201 -285 -284 -205 -148 -70 174 67 115 -279 60 140 71 -132 139 87 143
964 143 -53 263 -77 -191 76 170 81 140 287 -101 76 -75 79 -91 40 149 80 32 -117 -96 100 160 -83
987 -83 13 156 -293 -125 -35 -149 -85 -134 248 66 79 80 -101 -76 8 19 25 -66 -124 303 -161 -236 -23 -23 -187 -121 -106
1014 -106 -110 -95 -198 -245 -160 -191 47 295 93 56 -253 -101 108 -195 -31 -87 123 -111 8 124 204 167 18
1037 18 43 -224 91 -75 159 100 -64 80 241 -102 -115 164 30 170 148 -61 233 -86 64 86 -46 100
1059 100 -35 -62 105 -51 -111 326 -234 -42 101 202 3 -88 -126 -79 -334 -30 170 -63 228 -93 154 -104
$$ packed form
891i4K23j94R8j53L38j47j08pl5L46Nj53j01J45K26k50j37J12J21r1n6R0R8j86
915I0R0j69J17q9o9L27j53o1J61p4N1k89m7K19j47J11J13l32J00M4j37J82j05
938f7n0J1j99l3L05r8j3J28o1j24q4JP9N7P8K44j07M8l94L39Q0o9k03K71n2N6
964A43j96L16l40j14K67R4q9N9J47l88J77j51J54j70J31J09o9m8j49K1J96O0k43
987h3R6J43m49J68R0j14O4m9L82j82J3Jj81K5Q4J1Or1n8M27m64p5K13%j64O6J5
1014a06mJ5j03m7Q5l1K38K48k02l7l09J52K09l03J64n6K10k34J19J16Q0l7j49
1037A8K5k67L15j66K34n9j64J44J61l43j3K79j34J40k2k09K94l19J50K2j32J46
1059A00j35k7J67j56o0M37n60J92J43J01j99r1l8M7k55L04K00k33K91l21K47k58
$$ plain form
1081 -104 83 14 -132 -67 -183 -281 -171 -42 -148 -24 -179 -101 -93 186 -163 -84 20 -173 12 -14 229 -169 -132
1104 -132 -45 -224 -151 -138 34 -134 -172 -478 160 -51 -112 330 65 -37 58 -89 125 110 43 60 -183 141 228
1127 228 -77 241 6 -73 -42 72 -196 23 67 -91 -22 98 -138 217 12 72 19 87 66 -141 11 -295 26
1150 26 154 78 -189 27 -97 -5 185 82 -26 167 -65 -144 42 46 29 -147 258 -278 73 -174 -150 84 -3
1173 -3 43 101 -138 54 41 -94 -116 10 -113 -74 31 -106 -253 -139 49 -99 193 176 -2 96 17 2 22 -113
1197 -113 223 -50 57 59 -81 133 -2 -107 16 141 138 189 24 235 -18 151 -188 103 -126 109 -197 66
1219 66 -35 187 124 -172 65 11 -4 29 194 -172 -86 -100 -106 -42 329 -78 2 130 -20 -225 -132 -2 48 -149
1243 -149 39 -125 -251 10 80 -124 -75 37 -109 51 20 -142 -30 -151 -270 -125 -78 -145 -86 -166 -52 -15 -217
$$ packed form
1081a04J87o9j46O5j16r8J10J29j06J24j55P8QK79l49P9J04j93J85k6K43l98L7
1104a32Q7j79P3J3J72j68l8l06O38k11o1M42k65j02R5j47K14j5o7J7k43L24Q7
1127B28l05L18k35p9L1J14k68K19M4j58O9J20k36L55k05O0n3O8k1k07J52l06L21
1150B6J28p6k67K16j24R2J90j03j08J93k32p9J86Mj7j76M05n36L51k47K4K34q7
1173cM6N8k39J92j3j35k2J26j23L9J05j37j47J14J88j48K92j7j78R8p9j5K0j35
1197a13L36k73J07Kj40K14j35j05J23J25lN1j65K11k53J69l39K91k29K35l06K63
1219F6j01K22o3k96K37n4j5L3J65l66Q6j4oO4L71m07Q0J28j50k05R3J30N0j97
1243a49J88j64j26K61P0k04M9J12j46J60l1j62J12j21j19J45M7o7N9q0J14L7k02
$$ plain form
1266 -217 -13 -146 159 -73 -202 46 129 -59 179 219 3 1 -45 138 86 -136 -82 -101 -129 -57 139 228 -96 220
1290 220 51 -99 -134 206 -20 -123 -37 226 167 80 -32 -103 87 -190 -219 -173 -25 -79 142 68 -97 77 46
1313 46 -11 -51 9 -10 -216 240 -139 109 51 -3 150 -26 25 74 -132 -90 0 -92 -158 -43 -211 -77 81 68 74
1338 74 32 33 64 -14 -143 -138 -234 -21 -158 249 -5 39 -179 -218 30 333 181 -126 204 133 -152 -171 103 -199
1362 -199 36 -46 144 -106 68 102 -220 22 -174 -62 -116 -50 -57 64 56 118 -139 -24 36 -167 -107 7 -23 -111
1386 -111 -88 -63 -443 -6 142 62 16 -132 -32 -80 179 -96 -108 110 34 41 -320 -260 53 103 -41 140 -81 33
1410 33 -43 86 -133 -185 -229 -174 355 -304 9 242 162 34 103 26 -9 23 -26 48 -278 36 20 122 -66 -15 -163
1435 -163 47 -11 -24 236 103 212 -7 -88 61 166 -7 202 -13 -105 -215 -190 -101 34 80 315 32 -29 -64
$$ packed form
1266b17K04j33L05k32j29K48Q3j88K38M0k16km6J83n2k22N4j9k8P2J96Q9l24L16
1290B20j69j50l5L40k26j03Q6K63n9q7j12p1J90k77k9M6J48n4K21p4j65J74l1
1313D6n7m0O0j9k06M56l79K48n8n4J53j76N1M9k06M2R0r2o6J15j68J34J58j3O
1338G4m2JL1p8j29Nr6K13j37M07k54M4k18l9K48L03j52l07L30p1k85j9K74l02
1362a99K35q2J90k50J74L4l22K42j96J12n4O6pJ21qO2k57J15O0k03O0J14l0q8
1386a11K3K5l80M37J48q0m6j48J00m8K59k75j2K18p6Pl61O0L13N0j44J81k21J14
1410C3p6J29k19n2m4N5N29o59L13K33q0j28O9p7l5L2m9P4l26L14j6J02j88N1j48
1435a63K10n8j3K60j33J09k19q1J49J05j73K09k15r2j10K5Q9J35M6K35k83o1l5
$$ plain form
1458 -64 274 -147 184 3 178 -167 -75 51 -265 183 -24 17 142 -130 -154 -217 121 -157 19 41 -318 -147
1480 -147 227 -116 -100 99 -48 -79 105 -144 -24 142 -50 -97 -4 165 68 90 -3 204 95 67 -64 175 84
1503 84 25 89 -77 -48 333 -34 -77 21 36 -67 -74 -76 185 25 131 182 48 -18 -135 327 -36 181 -234 79
1527 79 -25 359 -80 -33 -133 70 81 75 106 -87 -23 88 73 -8 60 57 -76 -192 34 -4 -109 -144 -15 -121 63
1552 63 7 -19 -45 99 -40 -249 93 -35 241 -39 -228 -23 71 -141 148 102 62 -37 150 -14 26 191 -120
1575 -120 -5 -49 95 175 190 30 82 -21 24 36 106 237 -33 93 98 108 133 36 -157 -155 121 37 -143 -137 303 -43
1601 -43 -148 0 -338 -80 -188 75 5 57 -51 -134 112 -248 201 33 -3 -52 15 -67 -13 -53 -97 50 72 -74
1625 -74 -8 -202 116 174 -44 0 30 64 -20 176 -151 -144 184 173 116 -91 -52 -123 77 -93 73 216 218 -146 45
$$ packed form
1458f4L38m21L31j81J75l45R2J26l16M48k07M1J25k72k4o3L38k78J76K2l59J71
1480a47L74l43J6J99j47l1J84k49J20J66j92m7R3J69r7K2r3K07j09k8j31K39r1
1503H4n9O4j66K9L81l67m3R8J5j03pkK61j60J06N1j34o6j17M62l63K17m15L13
1527G9j04L84m39M7j00K03J1oL1j93O4J11j5q1O8lj33j16K26l8j05l5J29j06J84
1552F3n6k6k6J44j39k09L42j28K76k80j89K05R4k12K89m6m0r9J87j64M0J65l11
1575a20J15m4J44Q0J5j60N2j03M5J2P0J31k70J26NJ0K5r7j93KK76q4j80OM40l46
1601d3j05J48l38K58j08K63p0N2j08q3K46l60M49j68l6m9O7q2N4m0m4J47K2j46
1625g4O6j94L18N8k18M4L0L4q4J96l27PL28j1n7k07L9p1K00j70J66J43Kl64J91
$$ plain form
1650 45 8 -22 -128 -84 4 211 148 116 -16 -193 -118 -32 -39 -46 -8 87 192 147 7 101 -78 -204 -181 -131 -262 73
1676 73 7 -33 110 253 25 93 16 81 -30 -88 -69 140 -10 -255 124 2 -33 -41 73 2 34 -47 81 -69 -106
1701 -106 -148 -68 -80 119 81 -29 173 -211 208 47 -181 -49 63 139 -47 -31 103 -40 75 -165 142 82
1723 82 -108 92 -182 76 -124 -55 64 61 -18 -23 -128 -11 -117 -57 -29 68 133 -166 5 -224 -80 196 94 123
1747 123 151 -67 -97 -124 -116 152 194 163 157 72 -295 72 -97 85 -65 -76 -89 -188 -165 -53 52 -255 -38 16 -147
1772 -147 -67 -321 13 -263 368 -138 111 240 -197 81 26 128 51 -151 -30 119 -31 -123 -49 118 53 -190
1794 -190 -118 49 200 -1 -91 233 221 58 -61 -36 163 -3 -47 9 22 18 -38 14 263 -112 -53 -169 -82 -87 -40
1819 -40 -135 58 -26 -276 -113 -72 86 219 116 236 45 -126 -151 -24 14 8 -282 86 -169 135 27 -50 144
$$ packed form
1650D5l7l0j06M4Q8K07o3l2j32j77P5Q6ppL8R5J05m5j40R4j79j26K3N0j31L35
1676G3o6m0J43J43k28O8p7O5j11n8J9K09j50k45L79j22l5qJ14p1L2q1J28j50l7
1701a06m2Q0j2J99l8j10K02l84M19j61k28J32J12P6j86J6J34j43J15k40L07o0
1723H2j90K00k74K58k00O9J19lp9nj05J17j06O0K8R7O5k99J71k29J44K76j02K9
1747A23K8k18l0k7QK68M2l1oq5l67L67j69J82j50j1j3r9K3J12J05l07K17N4j63
1772a47Q0k54L34k76O31n06K49J29m37K78n5J02p7k02J21J49j50r2P4J67o5k43
1794a90P2J67J51k01r0L24j2j63j19K5J99j66m4N6J3mn6N2K49l75N9j16Q7nM7
1819d0r5J93q4k50J63M1J58J33j03J20j91j71k5J27L8ok90L68k55L04j08p7J94
$$ plain form
1842 144 92 68 57 319 -142 185 96 47 -4 105 236 385 49 92 45 26 154 50 -128 -14 272 -21 -54
1865 -54 72 30 222 -81 -131 199 -171 -194 -42 -8 21 -96 54 -83 -110 -103 -23 64 -24 -7 -176 -61 -22 -235 -90
1890 -90 -38 31 -51 17 99 4 154 -69 -223 298 -250 -235 202 -141 160 112 -108 -21 -39 -140 -43 87 116 -287
1914 -287 153 -5 80 -51 36 224 50 -201 -39 129 45 89 55 175 61 58 49 10 -90 6 -52 94 -115 176
1938 176 160 -149 4 113 -100 -86 -30 194 55 173 -157 -24 91 -47 38 -164 128 165 -171 -226 79 59
1960 59 -229 -96 -23 161 23 78 86 -94 -65 -72 156 202 -95 -60 48 -62 133 -147 -27 -37 -242 55 107 28
1984 28 -5 35 -117 236 -217 189 84 -341 -164 -111 58 163 -280 99 -66 -49 144 -129 -136 -64 -82 -187 18
2007 18 -68 53 -215 -91 -26 68 137 -52 138 -40 -74 191 68 165 -14 48 160 226 -38 -69 -26 24 67 260
$$ packed form
1842A44n2k4j1K62m61L27q9m9n1J09J31J49l36M3m7j9J28j04j78J14K86k93l3
1865e4J26m2J92l03n0L30l70k3J52L4K9j17J50j37k7PQ0Q7q8J7j69J15L9k13J45
1890i0N2O9q2O8Q2r5J50k23j54N21n48J5M37l43L01m8k20Q7j8j01R7J30K9m03
1914b87M40j58Q5j31Q7J88j74k51J62J68q4M4l4J20j14lrl9j00R6n8J46k09K91
1938A76j6l09J53J09k13J4N6K24j39J18l30J33J15j38Q5k02K92L7l36n5L05k0
1960E9k88J33P3J84j38N5Qj80K9pK28M6k97L5J08j10J95k80J20j0k05K97N2p9
1984B8l3M0j52L53m53M06j05m25J77N3J69J05m43L79j65J7J93k73pP2j8j05K05
2007A8q6J21k68J24O5R4O9j89J90j78l4K65j23R7j79O2J12O6k64l1M3N0M3J93
$$ plain form
2031 260 326 217 131 -25 2 156 -115 -198 269 -217 -130 139 106 124 -167 -76 -258 148 279 -100 58 -54 127
2054 127 188 -51 249 -20 77 160 -48 195 31 -9 100 380 165 133 106 32 9 168 26 64 -197 -109 110
2077 110 174 121 -11 167 -85 -29 69 -146 30 122 -46 180 -137 247 -31 -177 315 18 -123 56 -34 -110
2099 -110 84 3 110 95 18 -66 52 121 -192 27 31 112 102 16 -244 36 59 -82 -67 -94 37 -106 -42 -91 4
2124 4 151 57 147 33 142 -113 92 -197 110 -32 -75 -234 147 58 -136 353 73 56 -155 -78 -70 -57 31 31 46
2149 46 -27 282 104 74 34 180 30 123 60 -173 129 -65 -168 -29 -26 177 -107 -272 47 180 -3 -5 1 190
2173 190 -56 48 298 -46 -60 149 121 -130 180 -121 110 40 95 -17 -184 24 185 -73 -123 -19 29 69
2195 69 82 80 83 204 -29 43 -140 56 111 -68 -192 -124 237 -144 -59 -213 115 37 -161 316 87 -60 64 23
$$ packed form
2031B60O6j09q6j56K7J54k71q3M67m86Q7K69l3J8k91R1j82M06J31l79J58j12J81
2054A27O1k39L00k69R7Q3k08K43j64m0J09K80k15l2k7p4k3J59j42L8k61Q8K19
2077A10O4n3j32J78k52N6R8k15J76R2j68K26l17L84k78j46M92k97j41J79r0p6
2099a10J94q1J07j5p7q4J18O9l13K19MQ1j0q6k60K80K3j41J5k7J31j43O4m9R5
2124DJ47r4R0j14J09k55K05k89L07j42m3j59L81q9j94M89k80j7k11P7QJ3Q8%J5
2149D6p3L09j78l0m0J46j50R3o3k33L02j94j03J39LK03k84j65L19J33j83kOJ89
2173A90k46J04K50l44j4K09k8k51L10l01K31p0N5j12j67K08J61k58n0J04M8M0
2195F9J3kLJ21k33P2j83J96N5j79j24O8L61l81Q5j54L28p8j98M77k29j47J24m1
$$ plain form
2219 23 94 -51 -95 216 -131 9 -4 183 -149 -19 62 -129 -56 -8 80 -153 -147 -53 3 111 37 -207 -239 231 -76
2244 -76 -6 200 4 149 -272 -107 -64 -51 -92 20 -70 -145 -97 -11 -45 -159 91 270 -285 -124 125 85 -128 -160
2268 -160 44 -141 -217 172 109 -144 102 -37 -174 8 111 -112 -6 17 260 -181 47 -69 143 233 -33
2289 -33 -45 107 251 112 -94 -122 -158 -272 -68 -89 -21 -88 -87 160 -59 59 -42 35 -192 -75 164 -168 -97 334
2313 334 176 -158 -100 76 -248 -13 -124 -93 -148 -156 166 351 -301 6 109 41 72 108 44 -144 1 239 -50
2336 -50 156 -92 -139 -76 -175 -247 -32 -117 30 -3 136 61 158 27 45 97 146 -40 -100 244 122 134 -28 1 163
2361 163 -9 -149 289 -42 67 95 -51 -104 -116 -113 -9 190 -109 -239 25 -200 123 95 -94 106 33 -1 -111
2384 -111 -60 -150 -248 -226 61 -195 71 161 74 128 40 11 -216 28 56 -179 -115 -25 188 -28 -26 -204 -36 17 3
$$ packed form
2219B3P1j45m4L11l47J40j3J87l32J30Q1j91P3M8Q8k33OR4N6J08p4k44l2M70l07
2244g6P0K06j96J45m21J65M3J3m1J12r0p5M8Q6l4j14K50J79n55J61K49m0k13l2
2268a60K04j85p6L89o3k53K46j39j37J82J03k23J06K3K43m41K28j16K12R0k66
2289c3j2J52J44j39k06k8l6j14K04k1O8o7JK47k19J18j01P7k27J17K39l32P1M31
2313C34j58l34N8J76l24K35j11L1n5qL22J85o52L07J03o8L1L6o4j88J45K38k89
2336e0K06k48m7O3r9p2K15q5J47l3J39p5R7j31J8N2M9j86o0L44j22J2j62K9J62
2361A63j72j40M38l31J09K8j46n3j2LJ04J99k99j30K64k25L23k8j89K00p3l4j10
2384a11N1r0r8K2K87k56K66R0q7N4q8k9k27K44K8k35O4R0K13k16Kj78J68N3j4
$$ plain form
2409 3 -70 -208 -156 114 129 22 9 49 -134 -26 -16 -80 -59 -43 156 -7 143 -408 -223 -11 15 136 26 -21
2433 -21 -44 -243 -107 -4 -148 -215 58 213 -5 148 -18 24 -94 -153 95 -17 39 102 -135 159 -160 63
2455 63 -40 96 147 -201 120 113 -106 -80 0 -102 98 38 -79 105 91 -34 -22 -79 36 93 -96 64 -298 13
2479 13 28 -22 -28 120 -124 -154 -32 -55 160 -33 -64 48 1 -134 16 109 173 -116 -90 323 88 -30 -79 183
2503 183 -89 19 190 -95 317 41 179 -87 -100 -23 -103 -85 -47 -58 62 213 -33 16 140 52 -105 255 147
2526 147 17 -109 119 37 -55 145 -104 116 -3 -200 -35 292 21 35 -31 -28 -52 84 122 28 -52 -85 -81 89
2550 89 135 58 -238 35 -160 -38 35 -85 41 -197 24 -227 93 4 -75 -19 -98 -23 59 143 -219 -6 63 21
2574 21 59 58 33 -6 -113 99 121 -8 2 120 165 20 -13 -62 -61 141 131 -102 -11 55 -121 -34 -77 47 -25 94
$$ packed form
2409Cp3j38N2K70J5j07j3M0j83J08J0o4K1J6J99j63J50n51J85K12K6J21j10m7
2433b1k3j99J36J03j44o7K73J55k18J53j66M2j18n9K48j12N6O3k37K94l19K23
2455F3j03J36N1l48L21pk19K6Q0j02K00o0j17J84j4j25J2n7J15N7j89J60l62L11
2479A3J5n0oJ48k44l0J22k3K15j93l1J12m7j35J50R3O4k89K6M13k35j18m9K62
2503A83k72J08J71k85M12k76J38k66j3P7q0J8L8j1J20J51k46M9J24q8j57L60j08
2526A47j30j26K28q2r2K00k49K20j19j97J65L27k71J4o6Lk4J36L8r4q0l3MJ70
2550H9M6p7k96K73j95J22P3j20J26k38K21k51L20q9p9N6p9P5Q2Q4l62K13O9m2
2574B1L8jk5l9j07K12K2j29J0J18M5j45l3m9JK02j0k33R1O6j76Q7m3J24p2J19
$$ plain form
2600 94 -251 218 236 -55 62 -162 -38 48 -3 -5 8 181 52 -154 127 70 49 -26 56 55 52 168 60 -36 -199
2625 -199 18 -72 -32 225 96 305 194 117 -32 -37 -9 159 -47 -90 72 174 -64 -68 139 -152 -201 -373 -57
2648 -57 197 -45 142 299 103 -79 15 74 -86 41 -256 68 -13 -156 51 25 55 -21 -131 -56 -60 -119 142 -1
2672 -1 -165 165 138 -30 66 129 -119 -68 134 -22 69 52 74 -136 223 23 23 -118 -294 13 -130 -253 14 -54
2696 -54 -174 -237 -142 57 -73 208 76 221 -50 72 -4 68 37 217 7 -132 -157 -44 132 229 214 -57 60
2719 60 26 -39 -35 107 125 17 -111 1 -140 215 -136 -63 -109 -46 -5 -10 6 108 47 -43 346 45 -87 288 188
2744 188 81 16 177 -99 8 237 345 60 51 277 80 109 97 160 -71 -95 -132 168 -24 -39 154 -4 -83
2767 -83 -65 -155 -75 -68 -301 88 -87 -136 62 18 -134 -5 -241 -186 93 -123 -17 109 79 216 -241 71 18 -66
$$ packed form
2600I4l45M69J8k91J17k24J24Q6n1kJ3J73j29k06K81n7k1p5Q2jlJ16j08r6j63
2625a99K17r0M0K57j29K09j11p7j49nK8J68k06m3J62J02k38mK07k91m9j72L16
2648e7K54k42J87J57j96j82R4N9j60J27k97L24q1j43K07k6L0p6j10P5mn9K61j43
2672aj64L30k7j68R6O3k48N1K02j56R1j7K2k10L59k00%j41j76L07j43j23K67o8
2696e4j20o3R5J99j30K81j32J45k71J22p6P2l1J80k10j39k5J13J76R7j5k71J17
2719F0l4o5MJ42J8j08j28J12j41L55l51P3m6O3M1nJ6J02o1r0L89l01j32L75j00
2744A88j07o5J61k76J07K29J08k85rK26j97K9j2O3k31k4l7L00j92j5J93j58p9
2767h3J8r0Q0Pk33L89j75m9J98m4j52J29k36N5K79k16J06J26l0J37m57L12n3q4
$$ plain form
2791 -66 -178 -85 48 -128 94 4 90 63 -425 -166 4 7 -111 -275 77 -40 -253 -134 340 1 -134 119
2813 119 -104 -73 -77 -62 -212 -50 -58 10 -159 -74 40 -56 -95 -118 8 -119 195 29 -89 146 128 -98 252 84
2837 84 -155 98 26 302 37 371 -167 113 157 -78 -235 -230 -130 -108 76 52 128 161 39 -243 34 -219 -240
2860 -240 100 -43 238 84 149 -74 100 203 182 -83 125 32 -110 -174 62 -26 97 21 -18 43 -13 85 -67
2883 -67 49 -177 -36 -56 -23 94 -132 93 -91 114 46 -63 99 216 -93 181 93 -194 -48 -162 -63 -81
2905 -81 70 -37 -28 96 2 -49 361 -216 67 -131 -103 86 26 -18 55 76 -27 284 -8 17 276 56 89 -105
2929 -105 31 -183 -125 204 -60 29 187 -221 -52 107 -119 -188 126 70 10 -87 89 -107 -212 117 -236 -169
2951 -169 28 219 46 -98 -108 124 -11 240 -41 78 -216 20 -179 -48 103 47 -103 144 -131 -34 82
$$ packed form
2791f6j12R3J33j76K22r0Q6k7m88K59J70Lj18j64L52j17k13J19M74l39j35K53
2813A19k23L1mJ5j50J62qO8j69Q5J14r6l9k3J26j27L14j66j18K35j8k26L50j68
2837H4k39K53p2K76k65L34n38K80M4k35j57NJ00K2J84k4P6L3j22k82K77k53k1
2860b40L40j43K81j54O5k23J74J03k1k65K08r3j42o4K36q8J23p6l9O1n6R8j52
2883f7J16k26J41k0L3J17k26K25j84K05o8j09J62J17l09K74q8k87J46j14R9j8
2905h1J51j07RJ24r4n1M10n77K83j98K8J89o0m4P3K1j03L11k92K5K59k20L3j94
2929a05J36k14N8L29k64Q9J58m08J69J59k26o9L14n6o0r7J76j96j05L29l53O7
2951a69J97J91j73j44j0K32j35K51k81J19k94K36j99J31J51n6j50K47k75R7J16
$$ plain form
2972 82 -11 -99 149 52 43 189 -84 -91 -144 -143 -192 -121 130 -79 61 -49 -39 -196 -103 -194 -92 -2 174 97 67 160 -33
2999 -33 -133 -194 167 -26 79 8 -117 63 -36 154 -60 -59 251 -100 29 294 -43 -138 -86 -98 -40 30 -178 4
3023 4 66 -74 156 45 -215 -26 -39 -188 177 -17 351 -49 12 -184 69 183 -57 172 54 193 64 -76
3045 -76 -83 -34 142 58 -82 -22 -50 -33 5 -25 -91 195 180 108 177 35 69 -154 73 -51 -38 11 -173 294 293 137
3071 137 33 -59 -59 39 -70 -60 -133 -68 199 75 -18 -124 58 70 -81 -93 78 -112 39 -217 -50 73 -261
3094 -261 -75 -88 -33 161 -23 200 204 97 38 79 75 -102 -2 12 -165 8 -142 -61 -212 -180 -6 78 -96 -114
3118 -114 3 217 32 -36 -53 -4 -319 144 -95 -12 -134 8 -159 -80 4 37 -156 -87 -296 -154 30 155 -185
3141 -185 -21 -104 -124 -124 -254 201 -198 53 -51 8 -236 -30 101 -81 131 9 142 -86 57 -149 -26 -215
$$ packed form
2972H2r3q8K48r7rJ46k73pn3Jm9P1K51k09J40j10J0j57R3r1J02R0J76p7l0R3j93
2999c3j00o1L61j93J05p1j25J80r9J90k14JL10l51J29K65l37r5N2j2N8P0k08J82
3023DO2j40K30j11k60J89j3j49L65j94L68m00O1j96K53J14k40K29j18J39j29j40
3045g6pM9J76q4j40O0k8J7L8l0o6K86j5p2O9j42L4k23K27j24J3M9j84M67jj56
3071A37j04r2%R8j09J0p3O5K67j24r3j06J82J2j51j2J71j90J51k56J67J23l34
3094b61J86j3N5J94j84K23Mj07n9M1mj77J00J4j77J73j50Q1j51L2J74Q4j74j8
3118a14J17K14j85o8j7M9l15M63k39Q3j22J42j67P9Q4L3j93O9k09J42J84J25l40
3141a85J64q3k0%j30M55l99K51j04N9k44K06J31j82K12j22J33k28J43k06J23j89
$$ plain form
3163 -215 53 -117 111 -70 153 -112 106 190 -103 161 -39 -94 267 287 112 -152 138 -119 -8 55 84 25
3185 25 -26 199 -74 -56 -45 -56 -11 -88 -172 67 19 51 -89 61 -99 -36 79 -80 36 -73 -21 -10 1 1 -185
3210 -185 -102 -104 38 0 -113 -135 -32 42 -22 153 118 78 -171 12 -105 17 -240 -4 114 -251 53 -239 190
3233 190 -24 -141 -173 54 -100 367 -28 164 -100 218 121 -64 55 26 -57 9 220 -9 83 -181 5 -162
3255 -162 -190 112 -46 123 -169 -15 180 226 59 65 15 115 180 -9 -85 72 -79 -7 282 81 87 -192 160
3278 160 70 153 -10 -36 -158 8 -214 75 -87 75 -171 -84 175 -128 140 -98 191 279 14 -238 187 -12
3300 -12 -195 -58 51 92 3 -68 -39 -225 174 74 24 -41 -20 177 -118 -3 -29 150 13 -275 -13 132 170
3323 170 160 116 84 42 100 1 29 -41 69 -72 71 18 -26 -152 255 -47 147 7 220 -30 -138 -66 19 -237
$$ packed form
3163b15K68j70K28j81K23k65K18Q4k93K64k00n5L61K0j75k64K90k57J11O3K9n9
3185B5n1K25k73J8J1j1M5p7q4K39m8L2j40J50j60O3J15j59J16j09N2J1J1%j86
3210a85Q3kJ42l8j13k2J03P4o4J75l5m0k49J83j17J22k57K36J18l65L04k92M29
3233A90k14j17l2K27j54M67l95J92k64L18r7j85J19k9q3O6K11k29R2k64J86j67
3255a62k8L02j58J69k92J54J95M6j67On0J00O5j89p6J57j51P2K89k01Ok79L52
3278A60r0Q3j63k6j22J66k22K89j62J62k46Q7K59l03K68k38K89Q8k65k52M25j99
3300a2j83J37J09M1q9p1K9j86L99j00n0o5K1J97k95J15k6J79j37k88K62J45L8
3323A70j0m4l2m2N8r9K8p0J10j41J43n3m4j26M07l02J94j40K13k50j08P2Q5k56
$$ plain form
3347 -237 -162 -342 -103 88 -148 -81 -49 -70 26 -354 -243 34 -18 -276 58 -135 137 15 -28 0 -98 -151 167
3370 167 70 49 223 -264 -14 -64 43 116 -121 -93 95 -256 66 88 -38 98 22 -94 264 -119 46 63 -259
3393 -259 148 0 -148 -82 -114 -36 125 -24 -101 -229 -27 406 1 1 -26 99 64 69 -141 -35 43 4 -63 -61 63
3418 63 98 -36 -171 158 7 -66 -97 298 37 153 -8 32 -79 -3 -49 190 153 19 -173 -260 121 -56 282
3441 282 -34 18 183 -48 -112 117 87 -175 -146 37 -119 -73 -4 54 70 -100 -70 -265 -238 1 55 -139 80 62
3465 62 -13 -12 14 55 -47 -78 122 226 -41 91 175 -72 128 -108 9 -245 128 85 -4 -382 139 -302 -31
3488 -31 -132 68 36 147 -33 -44 -224 193 -128 -135 105 112 173 55 8 97 -140 0 102 -361 -27 -50 -174 -107
3512 -107 138 264 -104 281 -142 50 254 -7 72 35 77 -154 -4 14 -48 -128 -14 -33 -34 -103 -115 -148 107 230
$$ packed form
3347b37P5j80K39J91k36O7L2k1R6l80J11K77n2k58L34j93K72j22m3K8r8n3L18
3370A67r7k1J74m87K50n0J07P3k37K8J88l51L22K2j26J36p6j16L58l83J65J7l22
3393b59M07j48j48O6l2P8J61j49p7j28K02M33m05%k7J25l5Nk10J06P8l9o7KJ24
3418F3L5j34j35L29j51p3l1L95k61J16j61M0j11P6m6K39l7j34j92q7L81j77L38
3441B82l16N2J65k31o4K29l0k62K9J83j56M6O9N8J6j70L0j95K7K39N4j94K19j8
3465F2p5JK6M1j02l1K00J04k67J32Q4k47K00k36J17k54L73m3q9l78N21m41K71
3488c1j01K00l2J11j80j1j80M17l21pK40PO1j18m7Q9k37J40J02m63L34k3j24O7
3512a07K45J26l68L85m23J92K04k61P9l7M2k31J50J8o2q0J14j9jo9j2l3K55J23
$$ plain form
3536 230 116 284 1 -89 136 -62 27 79 -135 78 109 135 1 36 -75 -63 104 -62 -14 -200 155 68 -15
3559 -15 -52 -137 63 -30 58 83 -2 -163 138 -133 -140 136 -80 37 90 56 38 -93 -127 305 24 -49 -172 -118 -206
3584 -206 -46 244 43 175 67 1 -42 0 99 104 -77 6 -12 151 62 64 83 -89 -56 -16 -234 -73 -208 -69 -45
3609 -45 93 97 -109 64 -96 60 -8 50 145 125 170 -145 75 23 -89 -74 -60 69 -28 -57 -248 50 -44 -51 65
3634 65 -37 5 -126 333 179 44 122 -119 152 133 91 142 -138 -229 -105 -49 -14 -246 -37 -113 222 -136 157
3657 157 -67 154 -191 59 39 57 -4 -270 -17 -161 -26 56 -117 178 -132 111 -116 -252 203 34 -172
3678 -172 127 -11 -161 -28 -182 175 203 116 -70 -139 -89 -62 12 55 153 7 199 -12 -182 -1 -102 51 -111
3701 -111 156 -131 -76 -29 43 10 -118 107 -32 -83 27 187 190 -129 -85 71 -42 102 -2 -88 -74 121 -31
$$ packed form
3536B30j14J68k83r0K25j98Q9N2k14K13L1K6j34L5j11J2J67j66M8j86L55q7q3
3559a5l7q5K00r3Q8K5q5j61L01k71pK76k16J17N3l4j8j31l4M32k81p3j23N4q8
3584b06J60K90k01J32j08o6m3M2R9Nj81Q3j8J63q9KJ9j72L3M0k18J61j35J39K4
3609d5J38Mk06J73j60J56o8N8R5k0M5l15K20n2j12J5J4J29r7k9j91K98r4pJ16
3634F5j02M2j31M59j54j35P8k41K71j9m2N1k80r1J24N6L5k32K09p6L35l58K93
3657A57k24K21l45K50k0J8o1k66K53j44J35Q2j73K95l10K43k27j36M55j69k06
3678a72K99j38j50J33j54L57K8q7j86o9N0K7P4M3R8j46J92k11j70J81j01J53j62
3701a11K67k87N5M7P2l3j28K25j39n1J10J60Ll19M4J56j13J44j04q6J4J95j52
$$ plain form
3724 -31 40 -103 -251 -48 94 39 146 101 -21 118 -47 236 79 63 -70 -116 33 243 -189 136 -9 322
3746 322 76 -51 -99 90 -165 -207 5 -19 98 -130 -146 402 50 -76 -48 52 -127 -74 24 44 157 -188 -16
3769 -16 22 -192 -201 -123 275 -221 -121 -117 -161 -245 -255 -73 -70 156 -53 -71 -145 304 406 93 137 27 87 -83 127
3794 127 43 37 -65 21 166 -75 -113 -182 111 10 -94 79 2 -9 27 36 8 -99 163 303 216 205 183 63 -167
3819 -167 -15 34 -178 29 -46 -27 -187 103 -169 -90 228 -6 -8 -5 -10 274 80 -245 4 -314 161 113 206 -220
3843 -220 85 -37 -132 -11 222 182 13 111 98 -2 -16 -22 48 44 -200 -18 -96 240 24 -141 -160 39 -71 13
3867 13 -11 45 115 -104 -3 48 -147 -111 4 -9 32 35 -134 -93 7 -108 172 77 -38 -46 70 75 -63 -17 -300 370
3893 370 -22 -61 -22 -106 -96 -127 -64 27 -52 302 204 -47 244 55 68 58 -142 159 -100 -205 -9 145 -41 132
$$ packed form
3724c1P1j43j48K03J42n5J07m5j22J39j65K83j57j6j33m6J49K10m32L25j45L31
3746C22k46j27m8J89k55m2K12k4J17k28j6N48l52j26K8J00j79N3R8K0J13l45J72
3769a6L8k14rP8L98m96J00Mm4q4j0J82LK26k09j8p4M49J02l13M4j10O0j70K10
3794A27q4oj02Q6J45k41l8o9K93j01j04J73p7j1L6Rk8j07K62J40q7j1k2j20k30
3819a67J52M9k12K07p5J9j60K90k72P9L18k34kLnK84j94l25K49l18M75m8R3m26
3843b20L05j22r5J21K33m0j69R8j3j00j4oP0mk44J82p8L36k16j65j9J99j10Q4
3867A3k4N6P0k19J01N1j95L6J15j3M1Lj69M1J00j15K80r5j15qJ16Nj38M6k83O70
3893C70l92l9L9q4J0l1O3R1p9L54r8k51K91j89J3j0k00L01k59j05J96J54j86J73
$$ plain form
3917 132 -79 112 -246 -134 -5 151 -79 142 166 71 107 348 -61 -148 -312 -40 33 42 131 -62 -153 -81 -64 -94
3941 -94 -71 86 26 97 202 -165 8 109 33 52 -112 -278 23 -252 51 118 123 -54 -148 -15 144 8 112
3964 112 -2 22 57 -128 92 278 -93 -25 214 215 -104 -57 -133 6 54 10 133 213 -217 9 58 -106 -44 -78
3988 -78 -127 -131 8 167 77 116 87 6 21 -222 -83 152 -175 177 91 228 57 152 268 -24 -110 -100 -85 -85 -206
4013 -206 66 73 113 87 102 -10 197 78 -30 18 2 57 -150 216 144 -92 -5 261 -73 -98 -20 155 -50 -62
4037 -62 -284 -77 273 168 -96 200 -37 -148 -93 -261 62 0 337 76 -58 -183 -81 97 97 -96 57 -134
4059 -134 62 107 139 -141 -47 -156 123 -130 -237 -32 -82 76 0 176 -51 -10 81 55 60 70 -224 192 164 91
4083 91 71 -167 149 -98 69 173 -77 -199 -71 -30 27 0 -161 9 238 99 -280 2 173 224 -187 -93
$$ packed form
3917A32k11J91l58J12J29J56k30K21K4r5L6K41m09q7j64K72P3RQ9j93r1P2J7l0
3941i4K3J57o0P1J05l67J73J01p6J9j64j66L01k75L03O7Nj77r4J33J59j36J04
3964A12j14K4L5j85K20J86l71O8K39Jl19M7p6J39M8m4J23Q0m30K26M9j64O2l4
3988g8m9mJ39J59r0L9k9q1J5k43J39K35l27L52q6J37j71R5J16k92q6J0J5%j21
4013b06K72PM0k6J5j12K07j19j08M8j6N5k07L66p2k36Q7K66l34k5P8J75k05j2
4037f2k22K07L50j05k64K96k37j11N5j68L23o2L37k61j34j25J02J78%j93J53j91
4059a34J96M5L2k80R4j09K79k53j07K05n0J58p6J76k27M1R1k6NJ0k94M16k8p3
4083I1k0k38L16k47J67J04k50j22J28M1N7k7j61J70K29j39l79K82J71N1m11R4
$$ plain form
4105 -93 305 40 84 209 3 -54 216 -137 30 -118 -21 110 49 -121 -97 81 79 -14 -167 112 -178 161 -43
4128 -43 -125 -96 -284 -113 -73 -24 -42 31 19 26 -26 -71 -12 87 -41 19 195 -199 -193 -16 -186 -171 -221 -171 -123 44 -144
4155 -144 240 2 112 62 67 313 162 51 -37 188 243 113 249 -47 50 72 -29 51 -25 -49 -100 -36 67 243
4179 243 -143 144 155 89 55 94 116 -91 17 -157 161 -228 3 111 147 -13 -41 124 -53 4 122 67 353
4202 353 41 74 39 89 422 -42 -10 69 90 8 174 71 -37 -134 -139 234 -75 -6 226 -259 -81 -7 -144 -19
4226 -19 -13 -59 131 -130 93 -111 41 -312 188 64 -83 146 4 -48 -100 115 139 107 120 -197 -233 -14 -119
4249 -119 -6 325 85 84 -198 205 -182 -194 -78 98 -206 65 218 -58 235 -19 379 48 136 -383 -129
4270 -129 -141 53 -42 50 -82 368 124 118 14 37 -88 -77 -175 -85 -221 -62 -147 156 -8 -68 13 -192 154 -69
$$ packed form
4105i3L98k65M4J25k06n7K70l53J67j48R7J31o1j70K4J78kr3j53K79k90L39k04
4128d3q2K9j88J71M0M9j8P3j2Pn2m5N9R9j28O0J76l94OJ77j70J5n0N0M8J67j88
4155a44L84k38J10n0NK46j51j11q8K25N5j30J36k96R7K2j01Q0p6k4n1O4J03J76
4179B43l86K87J1o6l4L9K2k07J08j74L18l89K31J08L6j60k8J65j77N7J18n5K86
4202C53l12L3l5N0L33m64L2P9K1q2J66j03j08r7nL73l09O9K32m85J78P4j37J25
4226a9Om6J90k61K23k04J52l53N00j24j47K29j42n2n2K15K4l2J3l17l6K19j05
4249a19J13L31k40jk82M03l87j2J16J76l04K71J53k76K93k54L98l31Q8n19K54
4270a29j2J94r5R2j32M50k44oj04K3j25J1r8R0j36J59q5L03j64o0Q1k05L46k23
$$ plain form
4294 -69 -38 29 22 -11 100 -75 258 186 -55 3 113 103 -15 104 -66 -31 48 -117 -268 -123 -38 -102 -38 -27 68
4319 68 -55 86 -165 111 158 -21 -169 84 -60 65 -75 -123 200 109 -140 12 140 16 78 201 129 -148
4341 -148 50 -36 -94 -5 -36 -102 9 -121 -121 -209 -5 24 -113 61 -312 -21 141 186 59 -10 -138 -171 179 -51
4365 -51 8 -86 46 169 -8 -130 191 -165 121 -83 -52 11 -162 46 39 14 -30 -239 -50 -17 163 -168 -45
4388 -45 141 -86 68 -119 46 77 28 -65 184 186 13 -186 132 59 78 68 273 82 34 153 89 103 -130 -85
4412 -85 147 271 -22 21 -57 3 93 3 108 -129 -258 255 -20 34 -230 -16 -100 -19 45 -60 135 168 104 181
4436 181 42 46 -46 64 -5 19 25 50 -25 -158 -8 -150 53 -2 -13 62 114 -156 -41 -1 30 10 41 81 124 77 26
4463 26 -178 153 150 10 -20 -63 -104 -28 153 -127 -167 21 -12 138 -83 -25 -29 -31 -21 128 -86 -127 84 203 -4
$$ packed form
4294f9L1O7pl3J11j75L33p2k41N8J10j0j18J19j70L5P9j65j51J45Q5o4O4J1R5
4319F8j23J41k51K76M7j79j48K53j44J25j40m8L23r1k49J52J28j24O2J23p2k77
4341a48J98q6n8Q9l1o6J11j30%q8K04K9j37J74l73K91J62M5j27o9j28l3L50k30
4365e1N9r4J32J23j77j22L21l56K86k04L1O3j73K08pk5m4k09J89L3J80l31J23
4388d5J86k27J54j87J65L1m9r3K49Kj73j99L18p3J9j0K05j91m8J19o4J4k33M5
4412h5K32J24k93M3p8O0R0r0J05k37j29N13k75N4k64K14q4Q1O4j05J95L3o4P7
4436A81j39Mr2J10o9K4OK5p5j33J50j42K03n5j1P5N2k70J15M0L1k0L1M0M3m7n1
4463B6k04L31lj40l0m3m1P6J81k80m0J88l3J50k21N8mkJ0J49k14m1K11J19k07
$$ plain form
4488 -4 -247 -21 -86 128 -59 101 139 139 166 46 -232 -16 41 165 -224 -74 -70 35 114 -213 -98 2 -14 180
4512 180 -49 211 -28 -68 136 -52 56 4 269 295 -420 140 195 -143 -90 182 -26 161 -23 -116 82 70
4534 70 56 -46 72 264 -109 124 163 -220 -95 61 -35 -141 -55 272 85 226 51 -403 10 -112 -325 -109
4556 -109 -96 116 -195 119 -281 91 -100 -176 -40 305 267 -76 41 -152 -26 -64 172 34 -56 -175 36 3
4578 3 -13 -31 58 -38 -86 -99 209 -127 6 18 77 -191 202 181 -174 -167 -225 192 -48 118 8 183 -9 -141 -25
4603 -25 -34 98 25 -247 -163 11 -117 -52 116 -147 152 -121 -7 147 35 107 90 -265 -89 122 -90 174 -73
4626 -73 -62 -2 58 283 48 -124 21 -26 -120 -299 252 35 -20 -123 -16 -160 256 -29 -245 -67 -35 172 -9
4649 -9 171 -82 124 78 108 -57 -16 152 -107 -74 46 -227 38 130 -222 -81 -193 -6 -91 29 34 -3 -20 35
$$ packed form
4488dk43K26o5K14j87J60L8%K7j20k78K16N7J24l89J50MJ05P9l27J15J00j6J94
4512A80k29K60k39m0K04j88J08n2K65K6p15N60N5l38N3K72k08J87j84r3J98j2
4534G0j4j02J18J92l73K33L9l83J25J56r6j06Q6L27j87J41j75m54M13j22k13K16
4556a09J3K12l11L14m00L72j91p6J36L45l8l43J17j93J26l8K36j38r0j19K11l3
4578Cj6j8Q9r6m8j3L08l36J33J2N9k68L93k1l55Pn8M17k40J66j10J75j92j32J16
4603b5rJ32p3k72Q4J74j28O5J68k63K99k73J14J54j12P2j7l55J76K11k12K64k47
4626g3J1O0O0K25k35j72J45m7r4j79N51k17n5j03J07j44M16k85k16J78L2K07j81
4649iJ80k53K06m6L0j65M1J68k59L3J20k73K65R2l52J41j12J87q5J20Nl7j7N5
$$ plain form
4673 35 -171 211 -93 165 -59 9 74 -32 215 81 356 -181 154 43 21 -164 -257 -321 109 234 53 -26
4695 -26 -14 224 77 -220 149 255 -183 -19 -12 -155 285 -142 37 -69 109 -212 161 76 -35 -82 101 137
4717 137 -12 -114 -223 303 67 95 94 140 26 29 -79 -207 29 130 43 43 -188 -262 178 51 112 111 82 -32 -76
4742 -76 -23 -78 135 154 168 -133 -213 7 -157 43 173 157 260 -149 260 -101 -29 -218 86 -111 -107 8 188
4765 188 159 49 -151 29 90 -136 119 94 94 -6 -46 7 217 -97 57 1 240 77 153 116 111 -40 28 -174
4789 -174 27 -118 56 79 57 -71 -132 -96 104 -57 186 -182 -21 125 92 34 -86 59 117 170 100 63 127 -91
4813 -91 150 188 -47 126 136 55 197 227 -106 201 75 -27 -155 41 148 -217 -200 162 148 -106 75 -155
4835 -155 193 -25 92 197 64 -64 -22 133 147 -17 -76 66 13 -60 14 -227 104 0 -201 54 -59 233
$$ packed form
4673C5k06L82l04K58k24O8O5j06K47j34K75n37L35j11k2j85r3o4M30J25j81p9
4695b6J2K38j47k97L69J06m38J64Pj43M40m27J79j06J78l21L73q5j11m7J83L6
4717A37j49j02j09N26k36K8jM6j14Lj08j28K36J01q7%k31p4M40j27O1jk9j14m4
4742g6N3n5K13J9J4l01q0K20j64K00J30j6J03m09M09l61P2j89L04j97MJ15J80
4765A88k9j10k00J80O1k26K55k5%j00m0N3K10l14J54n6K39j63P6l7nj51O8k02
4789a74K01j45J74K3k2j28o1L6K00j61K43l68J61J46l3n8j20J45N8N3p0l7O4k18
4813i1K41L8k35J73J0q1J42L0l33L07j26j02j28J96J07l65J7L62j4k54J81k30
4835a55L48k18J17J05j33j28M2J55J4j64n9J42n3p3P4k41L31j04k01K55j13K92
$$ plain form
4857 233 -20 71 21 -126 -30 -88 -206 -69 58 119 207 32 -266 23 -45 -124 258 25 -120 -49 223 156 117 -59
4881 -59 87 9 218 186 -173 170 54 12 -68 -60 75 -49 22 317 93 93 -79 -55 -391 92 -124 -109 35 9
4905 9 -45 -145 21 83 105 5 -91 -49 -228 152 -35 -34 32 -13 178 53 -58 -7 -89 165 62 -44 -20 137 171
4930 171 -194 -55 -31 -64 -22 -36 -359 -62 31 -145 -55 -3 -99 -88 -45 109 320 123 -18 306 -216 -87 -265
4953 -265 78 5 137 22 -115 286 -103 7 -123 -18 77 136 154 149 -35 -111 -84 143 -6 -191 156 82 -72
4976 -72 -40 14 66 58 43 -42 -139 -143 3 95 147 -63 -52 95 112 -131 102 -105 -14 47 193 45 -224 -4 3 12 -78
5003 -78 -95 -31 -221 74 -118 43 4 82 -48 39 -124 117 -215 193 30 67 -21 -158 -197 8 93 5 135 -233
5027 -233 91 -15 -133 -53 -28 217 11 -20 -32 -8 83 55 -154 -15 -42 -177 -101 131 -115 51 -16 -247 -184 19
$$ packed form
4857B33k53R1n0j47R6n8j18J37J27O1Q8j75k98K89o8p9L82k33j45P1K72o7l9j76
4881e9J46p8K09l2l59L43j16m2q0QJ35j24P1K95k24%j72K4l36M83k16J5J44k6
4905In4j00J66O2K2j00r6M2j79L80j87JO6m5J91j25j11N1q2K54j03j06K4J57L4
4930A71l65J39K4l3M2j4l23K97R3j76R0N2r6J1M3J54K11j97j41L24n22J29j78
4953b65L43p3J32j15j37M01l89J10j30J05R5N9J8nj84p6K7K27j49j85L47p4j54
4976g2L2N4N2qj5q5r7mJ46R2N2k10J1J47J7k43K33k07R1O1J46j48k69K20PRr0
5003g8j7O4j90K95j92J61l9P8j30Q7j63K41l32M08j63L7q8j37l9K05Q5q8J30l68
5027b33L24j06j18Q0K5K45k06l1j2K4R1k8k09J39k7j35P6K32k46J66o7k31O3K03
$$ plain form
5051 19 -66 -93 150 136 -118 3 -115 26 295 203 -130 125 169 26 79 -18 59 90 -4 139 -120 59 139 168
5075 168 288 -30 43 47 9 -31 162 -111 -203 -297 189 85 -17 289 -156 99 19 -42 -204 84 -91 -141 200
5098 200 72 168 -62 -266 -11 193 219 -126 152 65 -82 -110 -88 -81 157 244 82 75 -172 22 -5 -220 -225 155
5122 155 -71 -72 69 117 132 -119 149 -70 116 -163 -169 -37 70 -206 36 32 154 70 -1 141 292 30 42 -27
5146 -27 29 -106 200 137 203 114 132 -59 104 43 5 153 3 -87 -88 282 -67 -236 -99 -21 342 242 -45 -85
5170 -85 -79 -20 18 -207 -7 -212 -48 -85 222 90 31 107 39 113 159 122 -68 81 60 -69 16 -136 214 302 -31
5195 -31 -122 76 14 -36 168 -4 -108 87 -91 41 13 150 78 -144 134 23 -138 49 -59 -35 -206 80
5217 80 -145 5 -32 49 229 -71 -176 5 18 -3 -18 135 50 49 3 -153 66 46 -146 -87 201 -40 -116 84
$$ packed form
5051A9q5k7K43j4k54J21j18J41K69r2l33K55M4j43N3r7P7L1r4J43k59J79Q0K9
5075A68J20l18P3Ml8m0J93k73r2r4M86j04j02L06m45K55q0o1j62K88j75n0L41
5098B00j28R6k30k04K55K04K6l45K78q7j47k8K2PK38Q7j62pk47J94k7k15nL80
5122A55k26jJ41M8J5k51K68k19J86k79oJ32J07k76K42mJ22q4p1J42J51k62J2o9
5146b7N6j35L06o3O6q9J8j91J63o1l8J48j50r0jL70l49j69J37P8L63j00k87m0
5170h5ON9L8k25K00k05J64l7L07j32n9P6o8P4M6l7j90J49k1j29Q5j52L50Q8l33
5195c1r1J98o2n0K04j72j04J95j78J32k8J37p2k22K78j11j61J87j08K4j71K86
5217H0k25J50l7Q1J80l00j05J81J3k1j5J53q5jm6j56K19k0j92N9K88k41p6K00
$$ plain form
5241 84 223 0 219 -38 -40 305 79 117 128 -97 -24 -295 -126 148 141 -10 75 -34 120 30 76 -47 -12 -106
5265 -106 149 117 83 56 -151 109 -41 4 79 -267 -140 82 121 -60 134 -64 -316 -175 137 -110 133 -91
5287 -91 75 86 133 11 -15 -133 -107 -26 89 -19 -81 145 -67 1 36 -177 17 -181 -4 -59 55 -31 17 -17
5311 -17 12 -64 129 89 -137 50 -23 -115 -274 59 -18 75 -161 -33 101 145 -75 72 -73 77 -43 -56 131
5334 131 155 105 -7 24 -138 5 86 -124 -165 -58 -242 95 -43 -45 188 -4 -109 309 76 -125 17 -81 100
5357 100 174 16 -379 -82 9 5 108 -46 338 -116 134 135 -203 35 -75 -33 34 -208 302 50 -49 165 83
5380 83 95 30 98 -48 -87 360 72 -32 -8 -153 -31 145 65 101 -92 -12 57 -179 -106 188 -125 -243 -43 12
5404 12 181 -71 -4 29 64 -109 15 246 95 -73 -38 -182 402 -1 352 48 317 46 -103 101 56 186
$$ packed form
5241H4J39k23K19k57kL45k26L8J1k25P3k71J69K74pj51Q5j09J54r0M6j23L5r4
5265a06K55l2l4k7k07K60j50M5P5l46J27K22L9j81J94j98k52J41L12k47K43k24
5287i1J66J1M7j22k6j18K6Q1J15j08o2K26k12O8L5k13J94j98J77n5J14q6M8l4
5311a7K9p6J93m0k26J87p3r2j59L33p7R3k36J28J34M4k20J47j45J50j20j3J87
5334A31K4n0j12L1j62J43Q1k10m1J07j84L37j38kK33j92j05M18k33k01J42r8J81
5357A00P4j58l95K97R1mJ03j54L84m54K50Jl38K38j10M2O7k42N10k52r9K14q2
5380H3J2o5O8j46l9M47k88j04K4j45J22J76q0L6j93Q0O9k36P3K94l13j18K00N5
5404A2J69k52O7L3L5j73J24K31j51j68L5j44N84m03L53l04K69k71j49K04m5J30
$$ plain form
5426 186 -113 -126 -78 -211 84 24 -162 -173 1 77 127 -21 -1 17 178 255 95 167 -82 -46 -142 78 -147 40
5450 40 17 -144 -35 293 150 -181 71 171 109 -23 212 55 -114 -63 -123 123 -212 92 182 146 -55 -101 157
5473 157 -91 47 109 -188 -160 50 47 -170 111 -91 100 135 -123 11 -42 -53 31 30 48 -207 -129 -65 22 -86 -103
5498 -103 -2 -23 -237 99 -305 54 -31 -23 43 -62 -293 -59 -43 -141 217 -239 -27 -134 130 198 97 18 -124
5521 -124 85 31 -45 -34 151 -79 46 16 69 -145 6 126 -140 -2 32 10 143 -105 -19 -139 -130 -36 -233 -68
5545 -68 155 38 257 22 -227 -138 134 28 145 -249 -69 -114 -27 193 -74 123 -54 -149 -202 283 -309 6
5567 6 81 170 -265 -50 98 -52 223 40 -174 -258 -16 -45 -116 -73 102 -322 20 -229 132 -115 236 12 -15
5590 -15 210 -79 43 2 -211 15 45 -213 5 -33 -49 148 17 -77 -35 168 -267 -48 -169 -164 11 -164 -60
$$ packed form
5426A86k99j3M8j33K95o0j86j1J74P6N0j48K0J8J61P7j60P2k49L6r6K20k25J87
5450D0k3j61J09L28j43l31K52J00o2j32K35j57j69N1o0K46l35L04R0l6k01m6K58
5473A57k48J38O2k97K8K10lk17K81k02J91L5k58J34n3j1Q4jJ8k55P8O4Q7j08j7
5498a03J01k1k14L36m04L59q5QO6j05k31K34J6r8L58m56K12j07K64O8j01p9j42
5521a24K09n4p6J1J85k30J25l0N3k14J51J20k66J38L4k2J33k48Q6j20RR4j97J65
5545f8K23j17K19k35k49Q9K72j06J17l94J80m5Q7K20k67J97j77r5n3M85n92L15
5567FP5Q9m35K15J48j50K75j83k14q4K42k9p1M3J75m24L42k49L61k47L51k24k7
5590a5K25k89J22m1k13K26L0k58K18l8j6J97j31r4M2K03m35K19j21NJ75j75J04
$$ plain form
5613 -60 188 234 -68 -133 72 294 -374 -126 -111 81 -244 -33 -97 18 97 -47 82 45 217 53 160 -109
5635 -109 77 -4 -135 -100 -32 -165 -38 157 -113 -27 -188 -146 28 109 21 52 198 289 28 60 -24 -106 201 25
5659 25 268 -89 156 77 59 -56 -36 69 -113 -156 -190 -18 175 214 -283 -228 -214 -323 15 100 205 -73 203
5682 203 -91 -35 -124 30 -258 29 195 148 -75 -121 -126 -75 -153 -67 102 -10 -74 -98 64 49 180 -76 2 178
5706 178 -77 13 -19 34 46 61 -61 -70 -105 45 190 -116 -14 -23 24 193 -203 -124 -93 23 102 5 63 -201 -32
5731 -32 -96 -174 62 -1 245 103 176 20 100 -194 48 -147 -106 77 -90 45 -118 0 162 -115 42 167
5753 167 224 -21 0 -132 -252 48 -61 -158 115 -193 -36 60 -96 -46 79 101 -51 -4 22 -163 13 12 55 49
5777 49 -266 66 33 45 -132 -143 -44 -22 -126 -24 -12 -23 -132 -95 65 307 -5 70 -265 -195 -46 17 26 46 -28
$$ packed form
5613f0K48M6l02o5K05K22o68K48J5J92l25K11o4J15P9j44J29l7J72j64J07k69
5635a09J86q1j31L5O8j33J27J95k70Q6j61M2J74Q1q8L1J46R1k61L2q4q2L07j76
5659B5K43l57K45p9j8j15K0J05j82m3l4J72J93L9m97N5J4j09L38Q5J05k78K76
5682B03k94N6q9J54k88K87J66m7k23m6nN1p8Q6J69j12o4k4J62j5J31k56P8J76
5706A78k55R0l2N3J2J5j22rl5J50J45l06J02rM7J69l96P9L1J16P9r7N8k64J69
5731c2o4p8K36o3K46j42P3j56Q0k94K42j95M1J83j67J35j63J18J62k77J57J25
5753A67N7k45K1j32j20L00j09r7K73l08J57R6j56N0J25K2j52M7K6j85J76jM3o
5777D9l15L32l3J2j77j1R9K2j04J02J2j1j09L7J60K42l12P5l35P0J49O3RK0p4
$$ plain form
5802 -28 71 -65 -168 -97 -156 -60 -348 0 -285 34 -188 -83 -173 -112 -72 -32 49 71 3 139 373 119 124 -139 -98
5827 -98 -162 -143 -2 -72 -79 -80 -95 285 -268 -31 -93 16 34 72 82 2 -135 -115 -108 -232 30 -49 -51 -15 -118 -162 178
5854 178 -29 153 9 -159 -57 264 47 71 -156 184 138 9 90 -352 140 144 194 74 262 -66 3 110
5876 110 150 30 224 68 -43 172 13 13 -98 122 75 112 -29 31 -147 149 -142 -117 208 90 -43 -12 -227
5899 -227 77 -41 -58 -49 -246 15 -20 27 -198 -25 -142 213 -59 -80 -65 82 -241 -12 -96 251 -195 6 7
5922 7 -156 208 -64 -17 -12 21 184 208 -16 52 59 11 -129 130 1 89 -57 -286 127 182 -47 14 -225 42 156
5947 156 -197 -168 100 -171 186 346 92 -68 -159 -44 38 96 44 210 273 -29 -84 99 122 -79 -56 44 -196
5970 -196 -149 56 -70 -15 12 -50 -1 -12 128 -259 106 135 -7 -95 -79 88 -10 10 -44 228 198 25 226 49
$$ packed form
5802b8R9j36j03P1n9R6k88L48k85L19k22J05r0O1M0M0Q1K2o8J36K34k54Nk63M1
5827i8o4J9J41p0pjj5L80n53K37o2J09J8L8J0q0j37K0Pj24K62p9kL6j03m4L40
5854A78k07J82j44j68J02L21k17K4k27L40m6j29Q1m42M92MN0j20J88l28O9J07
5876A10M0j20J94j56j11K15j59%j11K20m7L7j41O0j78K96k91K5L25j18j33L1k15
5899b27L04j18j7Rj97K61l5M7k25J73j17L55k72k1J5J47l23K29q4L47m46K01J
5922Gj63L64k72M7NL3J63K4k24O8Pm8j40K59j29Q8j46k29M13N5k29O1k39K67J14
5947A56l53K9K68k71L57J60k54j60r1J15Q2N8n2J66O3l02n5J83K3k01K3J00k40
5970a96M7K05j26N5K7o2M9j1J40l87L65K9j42q8J6J67r8K0n4K72l0j73K01j77
$$ plain form
5994 49 -165 -179 171 29 -114 -162 50 124 139 56 123 208 50 -61 148 -51 -20 -35 -211 -93 11 -99 -147 57
6018 57 22 -128 -174 166 131 214 155 -57 -47 -265 -58 2 35 50 149 -13 -24 -134 -25 -75 -83 -141 147 11 -275
6043 -275 -227 -219 88 129 -144 115 130 298 82 -127 51 -78 -54 -151 -210 -112 -193 35 -133 -12 -82 111 216 -117
6067 -117 51 48 353 -106 -207 76 -256 89 62 31 -79 89 50 8 26 14 285 -43 105 59 -100 205 -22
6090 -22 54 173 102 -32 -124 -60 6 -115 3 -295 67 -47 54 43 101 133 -117 0 -97 206 16 100 164 -84
6114 -84 -5 169 232 -28 141 -16 10 141 -148 49 -150 90 -20 113 -241 216 253 101 195 -44 45 62 -119
6137 -119 -180 -51 27 -174 -136 167 330 118 -69 190 112 -37 63 11 119 75 163 70 17 -10 50 163 178 -312
6161 -312 83 211 29 -38 -117 54 47 174 102 191 -165 -102 77 94 144 24 -169 -44 180 -296 -152 -78 -198
$$ packed form
5994D9k14j4L50j42j43m8K12P4J5q3O7Q5j58j11K09j99L1j5j76J18J04j10m8K04
6018E7l5j50m6L40l5Q3n9k12J0k18K07O0L3J5R9j62j1j10J09n0qn8K88j36k86
6043b75M8QL07M1k73K59J5J68k16k09J78j29K4r7n9R8q1K28j68J21p0J93J05l33
6067a17J68lL05m59j01K83l32L45k7l1j10J68l9m2J8j2K71l28J48m6j59L05k27
6090b2P6J19p1j34r2O4O6j21J18k98L62j14J01j1N8L2k50J17r7L03j90Q4O4k48
6114h4P9J74O3k60J69j57K6J31k89J97j99K40j10J33l54M57L7j52R4k39Q9J7j81
6137a19o1J29P8k01L8L03J63k12j87K59p8j49J00n2J08m4Q8r3n3k7O0J13J5m90
6161c12L95J28j82o7p9J71pJ27p2Q9l56O3J79J7N0j20j93J25K24m76J44P4j20
$$ plain form
6184 -198 142 -141 -88 162 -38 -11 135 -183 -167 200 -140 0 -74 231 -131 91 99 -5 -17 -112 -69 -50 40 -118
6208 -118 -59 93 -112 -80 -11 32 105 -138 -66 -23 95 11 -164 -186 121 -131 -156 71 -163 324 -3 216 -111
6231 -111 -185 -79 -196 -14 -109 -37 124 68 -158 -121 283 -95 66 -111 -161 -54 -129 -38 4 207 364 -198 -171
6254 -171 55 -120 39 -111 54 233 -36 236 75 53 37 -90 136 104 207 36 211 13 164 -240 -107
6275 -107 -100 422 26 160 -39 72 -33 -326 303 47 19 77 52 -117 -14 1 18 7 136 -61 130 -84 44
6298 44 105 -101 84 -49 127 94 -251 39 -68 70 -47 25 35 2 -158 105 42 -137 175 -33 20 47 -184
6321 -184 116 230 3 -42 82 87 -8 99 60 136 12 -13 -270 193 193 10 79 -107 157 -274 30 -373 -162
6344 -162 -10 63 -50 2 126 7 179 -27 -27 -280 -205 -135 -214 -166 106 -122 158 43 -172 -190 51 6 -95
$$ packed form
6184a98L40k83N3K50k00K7J46l18J6L67l40J40p4L05l62K22Qj04j2r5M3J9R0j58
6208a18N9J52k05L2O9M3P3k43P2M3J18q4j75k2L07k52k5K27k34M87l27K19l27
6231a11p4J06j17J82r5P2J61n6k26L7M04l78J61j77n0J07p5R1M2K03J57n62K7
6254a71K26j75J59j50J65J79k69K72j61k2j6j27K26l2J03j71J75j98J51m04J33
6275a07PN22l96J34j99J11j05k93O29k56k8N8k5j69J03J5J7j1J29j97J91k14J28
6298D4O1k06J85j33J76l3l45K90j07J38j17P2J0l3j60K63o3j79L12k08N3K7k31
6321a84L00J14k27m5J24Nr5J07l9P6j24k5k57M63%j83O9j86K64m31L04m03K11
6344a62J52P3j13N2J24j19J72k06%k53P5P0p9M8K72k28K80j15k15j8K41m5j01
$$ plain form
6367 -95 43 -158 52 -19 -248 -127 272 49 -26 -139 6 1 -68 -13 100 -114 -139 20 -92 -100 118 111 -147 -133
6391 -133 187 -111 78 86 -76 213 -58 -91 18 -61 -53 115 142 -50 16 -13 18 -24 -279 -106 -61 -74 -127 -160 -252
6416 -252 -139 -175 -124 -10 24 -56 402 100 -48 223 56 -221 -50 -58 77 -117 -131 244 -70 31 129 -172 54
6439 54 -161 198 -32 -291 150 -65 0 -173 36 31 -7 -126 145 179 -35 -101 -21 65 47 110 -37 -53 54 -20
6463 -20 -61 21 95 111 182 -47 -295 -186 -140 3 204 -383 28 109 95 139 60 -9 -50 82 76 -108 131 -30 130
$$ packed form
6367i5J38k01K10p1k29J21L99k23p5j13J45no9N5J13k14k5J59j12qK18pk58J4
6391a33L20k98J89Qj62K89k71l3J09p9QJ68K7j92O6k9L1m2k55J73M5j3n3l3r2
6416b52J13l6N1J14L4q0M58l02j48K71j67k77J71qJ35j94j4L75l14J01R8l01K26
6439E4k15L59k30k59M41k15O5j73K09nl8j19K71L4k14o6Q0Q6j8O3j47j6J07p4
6463b0m1Q2P4J6P1k29k48J09M6J43K01n87M11Q1j4M4p9o9m1J32oj84K39j61J60
$$ [...]
8191a0
##END NTUPLES=NMR FID
##END=
