##TITLE=1H_SR20 Gly
 CDCl3, 8 sc, 
 31.8.2021
##JCAMPDX= 6.0         $$ Bruker NMR JCAMP-DX V2.0
##DATA TYPE= NMR FID
##DATA CLASS= NTUPLES
##ORIGIN= UXNMR, Bruker Analytische Messtechnik GmbH
##OWNER= root
$$ XWIN-NMR		Version 3.5
$$ Tue Aug 31 10:33:09 2021 Russian Standard Time (UT+4h)  she@DPX200
##.OBSERVE FREQUENCY= 200.131506
##.OBSERVE NUCLEUS= ^1H
##.DELAY= (6, 6)
##.ACQUISITION MODE= SIMULTANEOUS
##.ACQUISITION SCHEME= undefined
##.AVERAGES= 8
##.DIGITISER RES= 18
##SPECTROMETER/DATA SYSTEM= spect
##.PULSE SEQUENCE= zg30
##.SOLVENT NAME= CDCl3
##.SHIFT REFERENCE= (INTERNAL, CDCl3, 0, 15.7039)
##AUDIT TRAIL= $$ (NUMBER, WHEN, WHO, WHERE, WHAT)
$$ ##TITLE= Audit trail, XWIN-NMR		Version 3.5
$$ ##JCAMPDX= 5.01
$$ ##ORIGIN= Bruker BioSpin GmbH
$$ ##OWNER= she
$$ F:/spectra/data/she/nmr/H-F/1/audita.txt
$$ ##AUDIT TRAIL=  $$ (NUMBER, WHEN, WHO, WHERE, WHAT)
(   1,<2021-08-31 10:32:05.84 +0400>,<she>,<DPX200>,
      <created by zg, POWCHK disabled, PULCHK disabled
       configuration hash MD5:
       00 E9 B6 7A A2 85 ED C7 34 08 36 98 17 FE 4E 26
       data hash MD5: 16K
       C4 EC 82 C1 EE 79 DA 11 9A 98 D5 6B 43 FF E0 D4>)
$$ ##END=
$$ 
$$ hash MD5
$$ 11 CE B0 E3 4D D6 A3 D1 F7 9A 21 B7 E6 17 D6 40
##$RELAX= 
##$RELAX= 
##$RELAX= 
##$RELAX= 
##$RELAX= 
##$RELAX= 
$$ Bruker specific parameters
$$ --------------------------
##$DU= <F:/spectra>
##$EXPNO= 1
##$NAME= <H-F>
##$PROCNO= 1
##$TYPE= <nmr>
##$USER= <she>
##$AMP= (0..31)
100 100 100 100 100 100 100 100 100 100 100 100 100 100 100 100 100 100 
100 100 100 100 100 100 100 100 100 100 100 100 100 100 
##$AQSEQ= 0
##$AQ_mod= 1
##$AUNM= <au_zg>
##$AUTOPOS= <>
##$BF1= 200.13
##$BF2= 200.13
##$BF3= 200.13
##$BF4= 200.13
##$BF5= 200.13
##$BF6= 200.13
##$BF7= 200.13
##$BF8= 200.13
##$BYTORDA= 1
##$CFDGTYP= 0
##$CFRGTYP= 5
##$CHEMSTR= <none>
##$CNST= (0..31)
1 1 145 1 1 1 1 1 1 1 1 1 1 1 1 1 1 1 1 1 1 1 1 1 1 1 1 1 1 1 1 1 
##$CPDPRG= <>
##$CPDPRG1= <>
##$CPDPRG2= <>
##$CPDPRG3= <>
##$CPDPRG4= <mlev>
##$CPDPRG5= <mlev>
##$CPDPRG6= <mlev>
##$CPDPRG7= <mlev>
##$CPDPRG8= <mlev>
##$CPDPRGB= <>
##$CPDPRGT= <>
##$D= (0..31)
0 1.2 0 0 0 0 0 0 0 0.06 0 0.03 0 0 0 0 0.0002 0 0 0 0 0 0 0 0 0 0 0 0 
0 0 0 
##$DATE= 1630391525
##$DBL= (0..7)
120 120 120 120 120 120 120 120 
##$DBP= (0..7)
150 150 150 150 150 150 150 150 
##$DBP07= 0
##$DBPNAM0= <>
##$DBPNAM1= <>
##$DBPNAM2= <>
##$DBPNAM3= <>
##$DBPNAM4= <>
##$DBPNAM5= <>
##$DBPNAM6= <>
##$DBPNAM7= <>
##$DBPOAL= (0..7)
0.5 0.5 0.5 0.5 0.5 0.5 0.5 0.5 
##$DBPOFFS= (0..7)
0 0 0 0 0 0 0 0 
##$DE= 6
##$DECBNUC= <off>
##$DECIM= 32
##$DECNUC= <off>
##$DECSTAT= 4
##$DIGMOD= 1
##$DIGTYP= 9
##$DL= (0..7)
0 120 120 120 120 120 120 120 
##$DP= (0..7)
150 150 150 150 150 150 150 150 
##$DP07= 0
##$DPNAME0= <>
##$DPNAME1= <>
##$DPNAME2= <>
##$DPNAME3= <>
##$DPNAME4= <>
##$DPNAME5= <>
##$DPNAME6= <>
##$DPNAME7= <>
##$DPOAL= (0..7)
0.5 0.5 0.5 0.5 0.5 0.5 0.5 0.5 
##$DPOFFS= (0..7)
0 0 0 0 0 0 0 0 
##$DQDMODE= 0
##$DR= 18
##$DS= 0
##$DSLIST= <SSSSSSSSSSSSSSS>
$$ [...]
##$SUBNAM2= <"">
##$SUBNAM3= <"">
##$SUBNAM4= <"">
##$SUBNAM5= <"">
##$SUBNAM6= <"">
##$SUBNAM7= <"">
##$SUBNAM8= <"">
##$SUBNAM9= <"">
##$SW= 20.0188882624521
##$SWIBOX= (0..15)
0 0 2 0 0 0 0 0 0 0 0 0 0 0 0 0 
##$SW_h= 4006.41025641026
##$TD= 16384
##$TD0= 1
##$TE= 0
##$TE2= 300
##$TE3= 300
##$TEG= 300
##$TL= (0..7)
0 120 120 120 120 120 120 120 
##$TP= (0..7)
150 150 150 150 150 150 150 150 
##$TP07= 0
##$TPNAME0= <>
##$TPNAME1= <>
##$TPNAME2= <>
##$TPNAME3= <>
##$TPNAME4= <>
##$TPNAME5= <>
##$TPNAME6= <>
##$TPNAME7= <>
##$TPOAL= (0..7)
0.5 0.5 0.5 0.5 0.5 0.5 0.5 0.5 
##$TPOFFS= (0..7)
0 0 0 0 0 0 0 0 
##$TUNHIN= 0
##$TUNHOUT= 0
##$TUNXOUT= 0
##$USERA1= <user>
##$USERA2= <user>
##$USERA3= <user>
##$USERA4= <user>
##$USERA5= <user>
##$V9= 5
##$VALIST= <valist>
##$VCLIST= <CCCCCCCCCCCCCCC>
##$VD= 0
##$VDLIST= <DDDDDDDDDDDDDDD>
##$VPLIST= <PPPPPPPPPPPPPPP>
##$VTLIST= <TTTTTTTTTTTTTTT>
##$WBST= 1024
##$WBSW= 4
##$XGAIN= (0..3)
0 0 0 0 
##$XL= 0
##$YL= 0
##$YMAX_a= 297004
##$YMIN_a= -264368
##$ZGOPTNS= <>
##$ZL1= 120
##$ZL2= 120
##$ZL3= 120
##$ZL4= 120
##$ABSF1= 10
##$ABSF2= 0
##$ABSG= 5
##$ABSL= 3
##$ALPHA= 0
##$AQORDER= 0
##$ASSFAC= 0
##$ASSFACI= 0
##$ASSFACX= 0
##$ASSWID= 0
##$AUNMP= <proc_1d>
##$AZFE= 0.1
##$AZFW= 0.1
##$BCFW= 1
##$BC_mod= 2
##$BYTORDP= 1
##$COROFFS= 0
##$CY= 11.3945322036743
##$DATMOD= 1
##$DC= 2
##$DFILT= <>
##$DTYPP= 0
##$F1P= 2.36226072786647
##$F2P= -0.459571619588291
##$FCOR= 0.5
##$FTSIZE= 0
##$FT_mod= 4
##$GAMMA= 1
##$GB= 0.15
##$INTBC= 1
##$INTSCL= 1
##$ISEN= 128
##$LB= 0.24
##$LEV0= 0
##$LPBIN= 0
##$MAXI= 10000
##$MC2= 0
##$MEAN= 0
##$ME_mod= 0
##$MI= 1.114404
##$NCOEF= 0
##$NC_proc= 0
##$NLEV= 6
##$NOISF1= 3.799351
##$NOISF2= 2.8
##$NSP= 1
##$NTH_PI= 0
##$NZP= 0
##$OFFSET= 15.70392
##$PC= 1
##$PHC0= -13358.55
##$PHC1= 10.00099
##$PH_mod= 1
##$PKNL= yes
##$PPARMOD= 0
##$PSCAL= 0
##$PSIGN= 0
##$REVERSE= no
##$SF= 200.130013532006
##$SI= 16384
##$SIGF1= 3
##$SIGF2= 2
##$SINO= 400
##$SIOLD= 16384
##$SREGLST= <1H.CDCl3>
##$SSB= 0
##$STSI= 0
##$STSR= 0
##$SW_p= 3612.71676300578
##$SYMM= 0
##$S_DEV= 0
##$TDeff= 0
##$TDoff= 0
##$TI= <>
##$TILT= no
##$TM1= 0
##$TM2= 0
##$TOPLEV= 0
##$USERP1= <user>
##$USERP2= <user>
##$USERP3= <user>
##$USERP4= <user>
##$USERP5= <user>
##$WDW= 1
##$XDIM= 8192
##$YMAX_p= 0
##$YMIN_p= 0
$$ End of Bruker specific parameters
$$ ---------------------------------
##NTUPLES= NMR FID
##VAR_NAME=  TIME,          FID/REAL,        FID/IMAG
##SYMBOL=    X,             R,               I
##VAR_TYPE=  INDEPENDENT,   DEPENDENT,       DEPENDENT
##VAR_FORM=  AFFN,          ASDF,            ASDF
##VAR_DIM=   8192,          8192,            8192
##UNITS=     SECONDS,       ARBITRARY UNITS, ARBITRARY UNITS
##FACTOR=    0.0002496,     1,               1
##FIRST=     0,             0,               0
##LAST=      2.0444736,     0,               0
##MIN=       0,             -264368,         0
##MAX=       2.0444736,     297004,          0
$$ Real data points
##PAGE= N=1
##DATA TABLE= (X++(R..R)), XYDATA
$$ [...]
1931G98M4k07J97m3j29N1K74m88N24k62J17O4m8k43P7l5M1J92k07J60l72P0J37
1954G12p3Mk88N1J55l67M63l6j81l51K51N0k9Qj35k50J26j14r3J60j42p6m6J05
1978i6j07k47J57J56j00r6m7k5j77K8P9j1R0j98j02J0P9j87J30J86k26M18l47
2001f33j40K92k01l9O5m2Q8j07k0j3q2q0K01pn3M41j64rL7j54R3K04l29J74j17
2026e95L58J42n84K41j64L39K9j4J4L0O0rK6l61K70j95K08O4K40j04q7k04l3J56
2050a73k2K33j09M9L5j8K3j45J76N4M9j36K45j16n09N14o4O9j23K61j65p8J45
2073A95j41P4J5R2R4k08K00r1R3Q6Q5r5j25j0J88o1L9p9o6L07k45L19j29J48j87
2098D98j91m7J50j0n7J54R3r7on2j15K48K48l07K47l20Q5K7k1l1p6K23m7J31j46
$$ y = [798, 842, 635, 832, 789, 660, 711, 985, 497, 1021, 759, 876, 940, 892, 649, 726, 691, 732, 924, 717, 877, 505, 575, 712, 639, 643, 355, 406, 561, 194, 657, 621, 440, 89, 340, 390, 361, 369, 234, -16, 110, -4, -97, 63, -79, -155, -201, -96, -203, -450, -293, -137, -237, -333, -380, -405, -582, -554, -475, -486, -396, -594, -696, -686, -607, -794, -664, -478, -704, -286, -633, -773, -481, -682, -721, -656, -698, -610, -717, -737, -750, -832, -912, -711, -718, -771, -330, -494, -503, -466, -620, -527, -323, -652, -478, -595, -237, -95, -679, -438, -602, -263, -234, -248, -234, -204, -144, -153, -127, -488, -218, -413, -205, -141, 99, -5, -92, -296, -329, -173, -195, 38, -71, -22, 13, -5, 18, -127, 49, 103, 152, 16, 261, 145, -364, 150, 86, 155, 32, 293, 128, 50, 195, 54, 128, 143, 235, 329, 121, 321, 230, 323, 409, 494, 399, 274, 264, 452, 391, 430, 351, 285, 592, 347, 666, 537, 685, 498, 307, 260, 410, 400, 343, 497, 590, 493, 487, 435, 320, 568, 816, 509, 756, 436, 521, 548, 527, 496, 420, 643, 596, 727, 581]
2123E81l65Q3J39kR4j19O4j66j53L1J27k95K37j35K13q6j6k73L1k47l5M18l70
2146b44q3L09p9k58M4k16L20r7n5M1P9j10j37m9J18j19L24l84J12o2j21J18j15
2169f64K49m58K30L38l04l4QR5O1j54j93L41L9o20O64k90j8K7k2L53j8p7j46M0
2193e53j40J71j98K57J42n2k2K55l0n8K31j54K5M1P5j4p1N3j1j1L74q0j86K42
2217B86j64j49J77P4j38J88j06J9R1J83o55M21r4J9J44P7N6Rj65O1j15pk88M60
2241C84J72k20K63l79J39K15l14J17k27M06j53K32l98M7J63J8j00p8K35j51R1
2262D62J0j01p4J58Pn2K5Pm0j02n2l0K5J72k20L89m33K64j98J74LJ59p3k28K74
2287E26j31j12M4q1J70R2l96L35p4j32j13o6L13j42q8N5k32O0J83k00J02j00L
$$ y = [581, 216, 299, 438, 436, 530, 411, 475, 309, 156, 187, 314, 19, 256, 121, 334, 248, 232, -41, -10, -257, -292, 126, -244, -327, -18, -97, -355, -311, -527, -207, -304, -359, -318, -239, -349, -486, -535, -417, -536, -212, -596, -484, -546, -667, -549, -664, -415, -873, -643, -305, -609, -643, -635, -540, -479, -633, -826, -485, -446, -1066, -402, -692, -710, -683, -705, -352, -370, -447, -593, -553, -693, -522, -720, -463, -321, -373, -395, -140, -170, -228, 3, -151, -126, -85, -10, -24, -95, -42, -53, -64, 310, 230, 44, 286, 122, -27, 150, 224, 86, 274, 168, 187, 278, 461, -194, 227, 133, 152, 296, 373, 429, 438, 273, 334, 219, 212, -76, 384, 556, 336, 599, 220, 359, 574, 260, 377, 150, 556, 403, 635, 237, 284, 447, 465, 365, 287, 522, 371, 462, 472, 371, 297, 455, 462, 410, 435, 442, 402, 300, 248, 218, 243, 415, 195, 584, 151, 415, 217, 391, 394, 553, 480, 252, 526, 395, 283, 327, 246, 416, 508, 112, 447, 373, 241, 128, 62, 375, 233, 145, 200, -32, 28, 211, 11, 113, 13, 16]
2310A6j26K06o6j18M2k71L31M7l28P5j2j11k1j83L31j04j49J29l61J32J36k32
2332f37N5j42M3K11N4j19L4k43nM49k01K4oj19N5k46K45k33P7L37j84L9J12k13
2356f13Q5pk18J93J06J6k2L2k5Q4j61K87N3M4l45K19Q1J46m35M31j69K75n0l5
2380b8Q0k82M65l96K5K10k18K72J03n4N3n2M2r3K3k4J21j35J32N7OK36K9k59J08
2405D21j37K12J03l88R6q1R9K07mk08P5J45l09K77n0k77J48k37L29mJ2r3mq6K29
2430D75J18j65N7k58J62k7l72J02J30q3K69l44Q0K12J23k06l45J04K15N6k98j11
2452a06J00L0K06p7J01l7N8K07l46L9j10p9M12k72p0J36k86L32j59k3k6L8l2j4
2476B2J30J3j96k7J8R3j57N9q4j01j99J80J11K11k32J26j53L39k22l09M07j31
$$ y = [16, -110, 96, 30, -88, -46, -317, 14, 61, -267, -192, -204, -315, -336, -519, -188, -292, -441, -312, -673, -541, -405, -637, -582, -724, -681, -470, -416, -535, -501, -744, -749, -300, -501, -477, -483, -602, -547, -793, -548, -781, -704, -367, -551, -512, -400, -613, -528, -535, -753, -560, -454, -438, -460, -428, -453, -369, -530, -243, -190, -146, -491, -272, -191, -45, -480, -49, -218, 57, 7, -28, 52, -230, 235, -161, -136, 74, -144, 128, 231, 177, 230, 178, 220, 127, 150, 126, 247, 112, 244, 301, 307, 543, 572, 313, 421, 284, 496, 599, 211, 307, 226, 325, 532, 528, 320, 395, 540, 231, 508, 458, 181, 329, 92, 421, 417, 429, 336, 332, 246, 475, 593, 428, 485, 227, 389, 362, -10, 92, 222, 139, 408, 64, 144, 356, 479, 273, -72, 32, 247, 303, 5, -106, -6, 24, 230, 153, 254, 217, 275, 482, 136, 175, 65, -14, 398, 126, 56, 192, -94, 238, 79, 56, 30, 68, 36, 22, 152, 165, -31, -58, -40, 53, -104, -45, -129, -230, -429, -249, -138, 73, -159, -33, -186, 153, -69, -378, 29, -102]
2498a02r5l5k40K03p0j59K20r0q8Q6J4k3K04k02Q7m01K41L2k03J46O8K2J4k31
2522f02K82j48n7M69k44j41PNK60k98j23K68J31N4Mq6k29k2K37l7J23j14J74n9
2546a46K49m9j17j18J51L4J60q5J3k02K78J60l92L53l03L64l38J19K0j01P40p22
2568F8J57K10l07J41l0J81j96J35j80L20L8r1k7m8nL2P0j9r8N9j69J42jk12R9
2593B69j78L13p9J45N2m17O3J20j53L55k95J59p7k36J0M89rn45J28J64k49q5J23
2616F7j28J76J5m4pJ41q0J15R4n85K41J21j51K81j89j13J85k50N3L9J83l97J85
2639d8K2N1j39N2j77jM54l7l6l03R9Q4j34k4M0K0P0l63J33Q3k65K72j42K9K20
2664d0R8p2j19M9j53R5J3K07m13l4L18j83j09R9j23J96o9j27J15j67K73l05L66
$$ y = [-102, -197, -232, -472, -269, -339, -498, -278, -368, -456, -370, -356, -379, -175, -377, -290, -691, -450, -418, -621, -475, -407, -385, -371, -602, -320, -468, -525, -56, -300, -441, -434, -429, -169, -467, -590, -322, -191, -137, -133, -219, -448, -470, -233, -270, -147, -261, -87, -146, 103, 54, -63, -181, -30, 4, 164, 79, 92, -110, 168, 328, -64, 289, -14, 350, 12, 131, 151, 50, 790, 68, 225, 435, 128, 269, 239, 420, 224, 359, 179, 499, 537, 446, 419, 371, 366, 398, 468, 449, 351, 410, 241, 383, 382, 170, 269, 91, 404, 325, 470, 522, 105, 168, 288, 135, 490, 195, 354, 277, 41, 51, 540, 531, -14, 114, 278, 29, -56, 67, -61, 115, 130, 86, 79, 220, 140, 255, 349, -236, 5, 126, -25, 256, 67, -46, 139, -111, -58, -19, 164, -233, -48, -26, 25, -114, -62, -239, -240, 214, 177, 141, -162, -63, 21, -113, -137, -97, -77, -7, -370, -237, -154, -419, -147, -289, -260, -40, 58, -14, -133, -84, -237, -142, -129, 78, -335, -369, -51, -234, -343, -244, -367, -171, -240, -367, -252, -419, -146, -451, -85]
2687h5j75j88K41j53j24o4J02K68o9r1o7J94k30O4M3J85l39K45k82K66P9k23K85
2710a18k48K00j10J46m0JK01P1n04K97L1L5P2j19N6K86j33k55L99k63r6K94j38
2733F5J7L6RN8j38J12l3J56R2j19R6k08j52L69j77J55K38k10kM0k81L53Q1m22
2757A35L82k02K4L9J19j99J37J22k38K9q9J47j50N3Q6J00k84J41n4rJ28l11j6
2780I0M25k54k8J99k97Q2k8k5j03j05P8j33J59J04P8k09J92j79j91J25n5k1j1
2803a07Q5k25J56J09k44M2j58K84l1K8j17J50J16k89J8K59k38j0j37mM7L56L9
2826A29l68J53j32O4k07J47j88K35nQ3n2j06Q2Q5j34K41l30J91K18j75k01Mk8
2849b94L76j61m7K14m25Q5M44l35j03J69nj89J49J01j11j61r4L33m04J82J39R
$$ y = [-85, -260, -448, -207, -360, -484, -548, -446, -178, -247, -338, -405, -211, -441, -377, -334, -149, -488, -243, -525, -259, -180, -403, -118, -366, -166, -276, -130, -170, -169, 32, 103, -401, -104, -73, -38, 34, -85, -29, 257, 124, -131, 268, 5, -91, 203, 65, 82, 118, 127, 185, 47, 159, 126, 282, 374, 255, 351, 143, -9, 360, 183, 338, 576, 366, 364, 404, 123, 476, 557, 135, 517, 315, 339, 378, 497, 298, 435, 557, 319, 348, 259, 406, 256, 309, 395, 495, 211, 352, 298, 289, 417, 106, 90, 515, 261, 233, 432, 135, 217, 189, 164, 61, -44, 34, -99, 60, 164, 242, 33, 225, 46, -145, -20, -75, -96, -107, -22, -247, -91, 18, -226, -184, -342, -58, -89, -61, -178, -28, 88, -201, -183, 76, -162, -172, -309, -313, -266, 90, 129, -239, -86, -218, -154, -361, -214, -402, -167, -172, -89, -141, -247, -165, -80, -214, 27, -303, -112, 106, -69, -270, -266, -294, 82, -79, -126, 88, -337, -252, 192, -143, -246, -77, -82, -271, -122, -21, -132, -293, -387, -54, -458, -276, -137, -128]
2871a28J7j60l0K26K7j90N6K23p5J95k9k24k9k20K12J66J01R4k72k16K73l44J18
2894b09j04O26l49J44L6j77l1O7L7l8k6L50j19k45J41K36k09q0L53q3k00J96l09
2917GK03p5j07M77l96J57rj88K99j85L83m71L04m8q6P2J16pl26M06l68K4L97k08
2941C71j03j44L49o6m08J03J70j40J97p9J59l78J69k08J37j89J44K5j20Op0J41
2963F6J09k67J80k85J84j3n6J6k48J35MK04k67J10J6k19K03m1R7M9J01m81M41
2986C8j20k19KJ82J14k23J07J71o7q5j08p7L24k22lJ0J50r4q4L97j33k73M47n98
3010c64K55N4l0l8j05J58mr2J30J60j6p3j39OQ6J37m7j86K24l04Q9J81j95M7Q0
3035A4k95J74K19j51P5k92K31o6k7P9j93l0pM13k13J19j66P6j36m2L43k01j1p
$$ y = [-128, -111, -271, -301, -75, -48, -238, -182, 41, -34, 161, 132, -92, -121, -341, -129, 37, 138, 232, -40, -256, 17, -327, -209, -313, 313, -36, 108, 144, -33, -64, 3, 40, 2, -24, 326, 207, -38, 103, 339, 130, 50, 403, 320, 120, 316, 7, 210, 135, 28, 505, 109, 266, 257, 69, 368, 183, 566, 95, 399, 351, 265, 337, 453, 446, 120, 526, 158, 182, 579, 371, 268, 124, 473, 407, -1, 102, 272, 132, 329, 250, 409, 31, 200, -8, 129, -60, 84, 109, -11, -5, -75, 66, 175, -92, 88, -197, -13, -26, -82, -66, -314, -179, -175, 29, -238, -128, -112, -331, -128, -169, -72, -23, 78, -403, 38, -82, -301, -299, -117, -3, -226, -119, 52, -15, -100, -208, -285, 39, -183, -186, -176, -26, -120, -204, 193, 60, -213, 234, -364, -109, -55, -85, -123, -228, -70, -74, -166, -36, 124, 108, 35, -104, -98, -12, 125, 78, -108, 116, -188, -99, 82, -113, -66, 14, -281, -107, 112, -39, 36, -256, -25, -91, -118, -39, -232, -262, -269, 144, -69, 50, -116, -40, -176, -218, 125, -76, -87, -94]
3059i4p6J82P3q9P8k28RJ77j56j61J4N70m55l7K14K47m34J58k5L05m0Pk30O7J52
3084B28k4k74kK78k23J14m4j7qJ70K01j32m47K39N06l84j85J18Q6j09N0O1n8%
3108A44j92K92k32M51k22j73q4N50n02O9J4J21p7k27P0J10K25l48O1R2%j64M0
3131A8Q8P8Qpn4J56n28M53l03K70j09m26K54J69l1j14j15j08J94k22J31j08K27
3154g9o8J53J46k47K40m34K31O6k02R3J42o7k75K24j20L4J14j30J43K3r1J99l32
3177b37K85l3qr1P0k2p0l5K36m0k36J52j7k41Q6J6K65k63J15K89k51j58K6K05
3201D3pQ9k33L02k94q1K08J52j63P7k57M3L37j0k57o3j08L63j2r4O1l6j85O1N3
3226a1q4r8qJ91j78j71M19O8L8j19k11J77k5k41O0K39l8Oo8k2r3M86k74k38K71
$$ y = [-94, -170, 12, 85, -4, 74, -154, -145, 32, -124, -285, -271, 299, -156, -193, 21, 268, -166, -8, -33, 272, 232, 239, 9, 76, 228, 204, -70, -72, 206, -17, 97, 53, 36, 28, 198, 399, 267, -180, 59, 565, 181, -4, 114, 200, 91, 141, 202, 144, 144, -48, 244, 12, 463, 241, 68, -16, 534, 32, 101, 115, 236, 159, -68, 2, 112, 337, -11, 50, 142, 142, -22, 18, 106, 184, 192, 185, 131, 287, -241, 212, -91, 179, 70, -356, -102, 67, 36, -78, -193, -301, -107, -329, -198, -306, -79, -147, 6, 152, -95, 145, -289, -58, 8, -194, -101, 41, -26, -301, -77, -197, -163, -49, -179, -36, -13, -104, 95, -237, 48, 15, 7, -84, -14, -36, -106, -141, 95, 55, -181, -29, -46, -287, -201, -185, 80, -183, -68, 221, -30, -188, -162, 43, 36, 125, -108, 194, -100, -181, 27, 179, 16, 93, -164, -121, 216, 206, -51, -114, -222, 141, 129, 35, 96, 60, -125, -64, -11, -95, -193, -201, -10, -188, -359, 60, 128, 166, 47, -164, 13, -12, -253, -193, 46, 8, 14, -54, -76, -169, 317, 43, -195, 76]
3251G6M3l52K48J89k33k7j6j2N1K14k51Q8lJ66k6m4K11k59J67k65q7K29l7K02
3275B72l11J78n4l8L73l43K59l04q8Q1K18q1L5k1k35K60o0J55k85J18j40m7r4
3298a52J76j88L45k45N25n03J26mP9o1p5K05M2k55j60l5k55M88l46K94j58P4J05
3321B2k07J18o6J53J25k71J87J73n37K21K7j46k7j19J37K05j1j69K67j69K5o1
3343a23j68K49J2l57Q1K06L4M0k73L1K77O3k57o8M75k42p5k46M50J6k41K74n0
3366A08LJ39j68K19l60j58K14Kn1J83M0k17J76j71L28l98J33J89l08K98l84k3
3388b06L26O7j1j28p1OJ90j49j30J69j37j30L65KM1j71m4n9%K63j97j79K07L4
3412E8J88k39l9m16L90J30n7O5J04k28k14J79Q6j59L2O3q1K10o6j44L18j17K4
$$ y = [76, 119, -233, 15, 204, -29, -56, -72, -84, -33, 181, -70, 18, 15, 181, 155, 111, 322, 63, 230, -35, -122, 107, 70, 272, -39, 139, 85, 47, 420, 77, 336, 32, -56, 25, 243, 162, 197, 176, -59, 201, 141, 296, 11, 129, -11, -58, -152, 24, -164, 181, -64, 461, -42, 84, 80, 159, 98, 23, 228, 270, 15, -145, -180, -435, 53, -293, 1, -157, -83, 22, -185, -67, -133, 20, 145, -126, 61, 234, -303, -82, -55, -201, -228, -347, -210, -5, -16, -185, 82, -87, -62, -123, -291, -42, -30, -387, -306, -100, -66, -26, -299, -268, 9, 72, -185, -253, 222, -20, -95, -341, 109, 125, -116, 158, 108, 111, 250, 82, 301, -59, -217, -3, -1, -52, 131, 171, -46, 130, -41, 287, -111, 22, 211, -97, 201, -183, -206, 120, 187, 176, 48, -23, -17, 173, 24, -106, 63, -74, -204, 161, 163, 204, 33, -11, -70, -70, 193, -4, -183, 24, 58, 246, 7, -32, -448, -58, 72, 15, 80, 184, -44, -258, -79, 7, -152, -120, -57, -138, 72, 6, -138, 180, 63, 87]
3435H7k60R0J48j31R9R2k15j6J54o5J19o7j19J64j5j2J18K7j57j36k00K62p2O3
3459d2O5j1o5jj34K32P5K9O0j34r0n2K51p7L0Jm5q7n4K75l42J86k45J72j07p6
3485a86M72l13m5M9J96j54q8k33J19K07j22M7K4l8j06J21n9K11j47o0K01k68P5
3508i7r6K27ok03J01J56R3l82L22k33K16j69j28J58l43M09k87L32k85J39J42j07
3530d1j8L4q0K45O4k31M7q4P1L0o2O6J14r0Q4J35l91nM01l32q4K23q3J86j52J09
3556A56p1RR8j49J79j4M2j74L9J28k42O0mL51k57r2J36j99j9k4j02J59J49n0k98
3581a89L28M3l2l05L69j95j43M1J35K8J0L37m17k30K98j94L22k95J35J6k38K99
3603A23j09j57R7J64j81j85K26K2j71L07m76J08O1J81J89k18K49J74l24R7k79
$$ y = [87, -173, -83, 65, -66, 33, 125, -90, -106, 48, -17, 102, 35, -84, 80, 65, 53, 171, 198, 41, -95, -295, -33, -105, -42, 23, 12, -53, -54, -188, 44, 119, 148, 208, 74, -16, -68, 183, 106, 136, 137, 92, 5, -49, 226, -116, 70, -175, -3, -110, -186, 286, -27, -72, -23, 173, 19, -69, -302, -183, 24, -98, -51, -27, -65, -171, -50, -109, 102, -45, -105, 96, -172, -97, -193, 34, 28, -175, -74, 82, 175, -207, 115, -118, 98, -71, -199, -41, -384, 25, -262, 70, -215, -76, 66, -41, -59, -25, -105, 140, 204, -27, 20, -64, 7, 37, -25, 41, 155, 65, 149, 284, -107, -112, 289, -43, -127, 96, 13, 199, 47, 156, 85, 94, 192, 43, 222, 208, 250, 76, 115, 243, 1, 61, 57, 408, 151, 59, 195, -4, -23, -47, -149, 10, 159, 109, -189, 139, 182, 150, -155, 214, 19, -124, -83, 52, 80, 90, 427, 10, -220, 78, -116, 206, -89, 46, 62, -176, 123, 14, -143, -46, 118, -63, -248, -22, 0, -171, 136, -340, -232, -171, 10, 199, -19, 230, 404, 80, 177, -102]
3624a02K44j85j02L75k20J49k68m2j0K66L0O2k03k15L52K79j04j82r8Q1q4N8j52
3647g1L26k78J81j90N9J55j81m6J91k85K62k05j5k56N01k75P9K01N1Q1k26J80
3669B39l42J27k66j92P7L35K91m53k5K55k16q2L67j97q2L69k73L7j90J27K68O6
3691B40m88M59l75J58j25P2o6J73j09j95R2j06Q4K00J40k03OpK2P1Q1M6m1k66
3715a37P6r0OO0L46k54k8K8m7Q9K11J3k53q3K45R1j59N1k81K54l56Q8M07l29J56
3740A04k29J97j07J08Q2j41l5j09J84k2L4k46NJ3N00l85R4j17J10L5q4J58k36
3763h7p5O3L08j77J40K9m61K80O1j98J26l4R6o2KJ14j67n7J99Jj51J59j76R2j19
3788i4J30j59P2j84K86l18M5K25J89k1k09M0J90k81K2K62r0O1j44j34K50q6J5
$$ y = [-102, 142, -43, -145, 230, 10, 159, -109, -151, -161, 105, 135, 197, -6, -221, 131, 410, 306, 124, 26, 107, 23, 81, -71, 255, -23, 158, -32, 27, 182, 1, -45, 146, -139, 123, -82, -97, -353, 148, -127, -48, 153, 204, 285, 59, 239, -103, 24, -242, -434, -357, -22, 269, -184, -209, 46, -170, -252, 115, -82, -164, 205, -68, -31, -221, -94, 174, 240, -248, 211, -164, -6, -131, -59, -125, 48, -61, -256, -164, -270, -186, 14, 154, -49, -43, -50, -28, 43, 124, 170, 129, -137, -61, -151, -145, -85, 261, 7, -21, 7, -40, 49, 260, 273, 20, -63, 182, 273, 114, 165, -116, 138, -218, -130, 277, -52, 104, -125, 72, -35, 73, 155, 14, -21, -130, 54, 32, 66, -180, -175, -162, 338, -47, 47, -70, 40, 75, -9, 149, -87, -162, -99, 209, 32, 172, 201, -260, 20, 81, -117, 9, -25, 71, 9, 11, 125, -42, -99, 100, 101, -50, 109, -67, 25, -94, 36, -123, -51, -235, 51, -267, -222, 3, 192, 171, -38, 2, 192, -89, -67, 195, 105, 166, 22, -112, 138, 52, 67]
3811F7k89P7N05k69r0R0l80L96L7k79oK19RK17j05j58p8J53N0k18j6l85N31j22
3835d4J45k7j84o9J57l1L4L8j82L77j28o9j87J37R0M6k66J05J38J7m49K80P7O3
3859F8j86j24K86r3k35K10J34j48J3m0OL19k26J18k81j44J38L6J51j40M32m90
3881a96R9KJ05L0j8j4K48r1j47j84K04K06j47j04Lr7m8M15O2j08k0j42N6rJ94
3906B99q2k16j34K67O3k42J20J55Lj7j45Nk29L86O3j31j49J37l55K89p6L9N9M6
3930A55N1k07r9j61K71l3J97j23M5j24j73J38K65m01J20R8P9p7j41J23M6k2j78
3953a51p2K19p6J49k67K69l3j32L09l75L15k82J48q9J71j50J11l82L92r8J55p5
3975E6l42L96l4j45ok9m2K72k52j17J37R0J07l0K97n34J38J41p8K17j99J2L2j60
$$ y = [67, -222, -145, 360, 91, 1, 91, -289, 107, 144, -135, -141, 78, 87, 304, 199, 41, -37, 116, 166, -52, -68, -453, 78, -44, 101, 74, -110, -179, -22, -53, -19, 19, -163, 214, 86, 17, -170, -33, 57, 103, -163, -58, 80, 97, -352, -72, 5, 68, -118, -242, 44, -49, -284, -74, 60, -88, -75, -115, -109, 210, -16, 102, -179, -323, -185, -149, 2, -138, 294, -196, -97, -95, 10, 40, 22, 8, 256, 165, 18, -166, 38, 244, 97, -7, -4, -101, -149, 266, 328, 220, 200, 58, 114, 105, 299, 217, 1, -133, 134, 197, -45, 75, 230, 233, 216, 71, 76, -153, 233, 296, 165, 16, 153, -202, 87, 11, 50, 109, 155, 206, -1, -100, -261, 10, -23, 174, 51, 96, -28, -201, -63, 202, -199, -79, 19, 98, 21, -120, 3, 49, 27, -151, -223, -4, -80, 69, -198, 71, 38, -94, 215, -160, 155, -127, 21, -68, 103, -47, 64, -318, 74, -24, 131, 56, -286, 110, 76, -69, -75, -104, -146, 126, -126, -243, -106, -16, 91, 61, 358, -176, -38, 103, 25, 242, 43, 55, 87, -73]
3999g3m8r3M30l34K6lJ41O3l41M94l09q2J94p6P6k1k6K97k70k17J82J3j69K86
4023A40n6j81j37J86K06l07K12n3j25mK65k43L1P5m0J94j69R4j63j33K50K5j89
4046a22N2k11J64K5K1j06L3Q7K1J86l03L75l73Q8L21j32l61M89k27p8L56p5K2
4069B52k61J69k11o9K27pP7j64k02L50K01k74m7rk19K54j10N4jJ17k02M9Q9j51
4093h8J64J53j65rm3o2J11J80n29K78J47j79m6J12j07j02L02j48J9K79j86O4l20
4116a75O3J21K01j24J89l78J22J93j9l37L03l03O2J83k19j34J69J26k4j08R4k29
4138b24R5K34k75l9K41j56lJ01k70M42k83j06J74K78j07K8j88J95p1j67K12j25
4160a4J8j49K21o8m4l5J35j78J1K70k75j0K85k70L02l96J30J30k5J15l61K89j50
$$ y = [-73, -121, -214, 216, -118, -92, -95, 46, 109, -232, 262, -47, -129, 65, -11, 65, 44, 18, 315, 45, -172, 10, 23, -146, 140, 84, -97, -234, -48, 158, -149, 63, 10, -115, -119, 146, -97, -66, 9, -31, 163, -6, 88, -75, -208, 42, 67, -122, -70, -281, -117, -92, -71, -177, -144, -57, -36, 150, -153, 222, -151, -63, 258, 126, -235, 254, 27, -51, 305, 230, 252, -9, 160, -51, -120, 107, 100, 177, 13, -189, 161, 362, 88, 41, 32, -187, 67, -43, 11, 10, 127, -75, -26, 63, -88, 76, 229, 64, 55, 12, -50, 61, 241, -288, -10, 137, -42, -88, 24, -83, -185, 117, -31, -12, 267, 81, 145, -175, -112, 9, 210, 86, 275, -103, 19, 212, 193, -144, 159, -144, -82, 101, -118, -252, -83, 43, 19, -89, 5, -224, -129, 105, -170, -209, 32, -124, -127, -26, -296, 146, -137, -243, -69, 209, 102, 130, -58, 137, 66, -101, 111, -14, 4, -145, 76, 8, -36, -71, 64, -114, -103, 167, -108, -118, 167, -103, 199, -197, -67, 63, 38, 153, -208, 81, -69]
4183f9P5j35L09j78k26m8N2J73J24l36K83k12J4J70lJ32k49J97l21K37J33k28
4205a06r9M2Q2L49l08m2q5J49j15k4K69k83PJ36P4n3j78J88k87L46J3l68J10J59
4229b4K8p0J82M2k83J8k1P1k28K37k6j19J77q3j89L21k55K81k18K04j61K81j17
4252D8LJ53n41K45J36j18K5J10j30J18k16L69j21l5j06J35R1M2l09M48j44j97
4274FM7J29K5j49j48J95k65L44j99k35J51L16l65K04r3K09p5m0Q3J08k43J39k49
4297a05j60J56PJ38j6K42l86n6J42M5n2j20J95l30L14K98m40R7p4R0j17J85l7
4320A6l5J85l5j67K1P4M0p2q9jP8k32K78J0l4O8j54j06MJ67l2J04k59K02j57O6
4346f0J48k30j08L39kJ7O1j83O4J5j02lP4K0P8k45K73K04k88l7K14j84q0K3PJ24
$$ y = [-69, 6, -129, 180, 2, -224, -272, -220, -47, 77, -259, 24, -188, -174, -4, -7, 125, -124, 73, -248, -11, 122, -106, -205, -163, -81, 268, -40, -82, -167, -18, -133, -157, 112, -171, -164, -28, 46, -7, -185, 3, -284, 62, 75, -293, -183, -24, 4, -66, 116, 158, -125, -107, -128, -57, -285, -48, -74, -193, -16, -99, -288, 33, -222, 59, -159, 45, -116, 165, 48, 51, 204, -337, -92, 44, -74, -49, 61, -69, 49, -167, 202, 81, 46, -60, 75, 166, 208, -101, 347, 203, 6, 53, 182, 207, 58, -90, 105, -160, 184, -15, -250, -99, 217, -148, 56, -37, 172, 97, 57, 140, 248, 5, 144, -105, -265, -109, -102, 36, 20, 262, -124, -180, -38, 7, -45, -165, 30, -300, 14, 312, -128, -31, -105, -15, -132, 53, 16, -19, 166, 131, -36, -15, 59, 99, 27, -62, -63, 15, -217, 61, 71, 37, 105, -49, -155, -151, 16, -16, 88, -171, 31, -126, -60, 88, -142, -250, 89, 87, 104, 165, -18, 46, 61, -41, -44, 30, 50, 128, -117, 156, 360, 72, 35, 249, 65, -15, 8, 15, 139]
4372A39q6k00J41q3J76k70M64m27M5O7j85J49J21k10K87O1k17m5j47K61l5j55
4394a49O8Q5JK27p3j79J49k27J02K4K0m9r1K47j18j94M09l61J37K44m22J64M6
4417F0Np2j74O8J05J29Mk47R7q2lj8O2j51J57K3k3M8j3M0J37k35k8J62L7J43K10
4444D41m77J75l31M9L11j40J51O5m07M0J78R0k31K59P0l31j82M23k17K42j62J11
4466A27k82J80n5Q7K87m09j62J51jJ31j66J31n3q4K68l73L67M1k8k46N0J7J15
4489I3r6mN3j40o1K01nj54QP8O6k04k0K87k89J13J83l5j87Q4K23l27K47k32M32
4514C14j12k04n8K6L4M7J65n15K38J20Mj83J43M4j17J29l07L06L2J86j35R2k75
4537b6j90J7K55J30m23J82j37K07J14k4n4R6j68J21J11R2m49J3J75j23K34k35
$$ y = [139, 53, -147, -6, -89, 87, -183, 281, -146, -101, -34, -219, -70, 51, -159, 128, 189, -28, -73, -220, 41, 6, -149, -81, 4, 5, 232, 159, -20, 129, -98, 4, 28, 48, -1, -92, 155, 37, -157, 252, -109, 28, 272, -150, 14, 60, 65, -7, -181, -113, -8, 121, 125, -122, -25, -107, -110, -128, -66, -217, -60, -37, -60, -12, -25, 15, 152, -83, -111, 51, 88, 231, 441, -36, 139, -192, -143, 168, 28, 179, 244, -163, -123, 55, 145, -86, 173, 243, -88, -270, 153, -64, 178, 16, 127, -155, 25, -30, 57, 344, -65, -227, -76, -77, 54, -112, 19, -34, -118, 150, -223, 144, 185, 157, -89, -39, -22, 93, -3, -7, 46, -94, -155, 46, 41, -113, -105, -27, 39, -165, -185, 102, -187, -74, 109, 74, -113, -29, 194, -133, 114, -118, 314, 202, -2, -60, -34, 0, 47, 212, -303, -65, 55, 59, -124, 19, 63, -54, 75, -232, 74, 106, 292, 157, 249, -26, -216, -199, 56, 186, -237, -55, -192, 15, 129, 105, 51, 147, -21, 100, 211, 303, -146, -133, 42, -81, 153, -82]
4559h2p6K26N0J15P1k54j45j42J28R5J48p7oj39QK93m92N62k72P9k27P9n5o1J58
4584a6K47m2%k09j1Nl15M03q6N5p7J56k17J15J30k78N7J26j80QM1J89j41P8J67
4609B05l79l3L85k98R8lJ26j00q4K29m0Q9l05L84l78O7J26l8J23q1k42J52J00
4632A03p6J03q5j36O4p6J80j84o9K04L7Q3p0jn1k6j7m3k5J86j46m5J52k36M10
4657B36l31K06q0M0l9K0k14Q6R6o2j58p1L67j44K50k26J60k85L1q9K55j47j51
4680b50L28j27J40j55j50M6P4K21Q1l54K34l06J52N3j2J62j19J1r4K74j83j23
4702i7K33l92J65R8p5k33J94L7K96k10m7O5k8j55K83k30m5K31k50L71k65J07k4
4725B9m9n9N2Q2r3o0O0R4m8k5p5K18k33L29j18k20n8R3J60J55m50R7J5K08r6l7
$$ y = [-82, -158, 68, 118, 233, 304, 50, -95, -237, -109, -14, 134, 57, 51, -88, -80, 213, -279, 283, 11, 90, -137, -58, -113, -174, -16, 231, 189, 189, -20, -31, -26, -341, 62, -24, 31, -46, 110, -107, 8, 138, -140, -83, 43, -137, -129, -88, 101, -40, 38, 205, -174, -207, 178, -120, -22, -25, 101, 1, -83, 146, 106, 195, -110, 274, -104, -37, 89, 51, 174, 93, -149, 3, 103, 27, 130, 45, -91, -27, -103, 77, -107, -176, 28, 65, 148, 78, 77, 26, 0, -17, -60, -85, 101, -45, -90, 62, -174, 236, -95, 111, 31, 71, 32, 52, -162, -76, 20, -42, -200, -271, 96, -48, 202, -24, 136, -149, -118, -207, 48, -99, -250, 78, -49, 91, -64, -214, -168, -94, 127, 208, -146, 88, -218, -66, -13, -25, 137, 18, 29, -65, 209, 26, -97, 136, -256, -91, 7, -68, -301, -107, -70, 226, 16, -31, 34, 6, -149, 134, -96, -141, 90, -160, 211, -54, 53, 29, -20, -79, -27, 55, -38, -98, -38, 56, 8, -17, -92, 126, -107, 222, 104, -116, -174, -81, 79, 234, -216, -119, -104, 104, 8, -29]
4751b9j84K63j59k50J50L98l47j83J20L35J2r5K68k40j7N3p0r6J14j12K36m11
4773b44L71j41n0J62q9K18k18n4J08k71J34p0QK15J44k28P4K2j45m3M0L26k61
4796HJ53j51j95j51O87k26K52m44O1K7o3L6J17J54k32j02j3R3r5J6K63j0p1R7
4820B11k57L62j91k09J68j08K46k21J04o9K19k34K6j12p2j00K47P6o8L0p8Q3j71
4843a18l4K56K2k71k4K29M7k04L4o3K78k80lJ76Or1J4o9J46j75lR5j05L3J18N2
4869F6j99J08L9J65j75K77n58L58M1l23K69j93L46%k33J85j01j42K11k0J24j90
4891E5j15Q8J2J0J23l75J85k57J90QK31l68j4Q0J22K25j53j61J91%kk07J77j45
4915a00N9J56k49o5L4K35O3k71nPqJ13nq4K1K61j44J73l57P2M5J44m3N2k18P8
$$ y = [-29, -213, 50, -109, -359, -209, 189, -158, -341, -221, 114, 126, 31, 299, 59, 42, 95, 25, -71, 43, -69, 167, -244, 127, -14, -64, 98, 9, 227, 9, -45, 63, -208, -74, -144, -136, 79, 223, -5, 69, 91, -54, -97, -57, 269, 8, 161, 10, -185, -336, 351, 125, 377, -67, -6, 21, -42, -6, 111, 265, 33, -69, -82, 11, -84, -68, 195, 185, 114, 211, -46, 316, 125, -84, 84, -24, 222, 1, 105, 36, 255, 21, 47, -65, -137, -237, 10, 86, 18, 48, -30, 53, -118, -152, 104, 126, -145, -169, 60, 107, -97, -63, -126, 152, -128, -131, 45, 51, -40, -26, -95, 51, -124, -127, -32, -137, -104, 14, 66, -133, -25, 14, 179, 4, 281, -277, 81, 122, -201, 68, -125, 221, 221, -12, 173, 72, -70, 141, 121, 245, 55, -60, 28, 40, 50, 173, -202, -17, -274, -84, -76, 155, -213, -227, -147, -25, 200, 47, -114, 77, 77, 75, -132, 45, -100, -41, 115, -134, -199, -165, 70, 133, -138, -143, -136, -144, -31, -36, -120, -99, 162, 18, 191, -166, -94, -49, 95, 52, 104, -114, -36]
4941c6P4J09j69L6k58R4R1J09j20K37j30R6o0n6J15j74LL0m33K62K5NJ30R0jr3
4967b4K23m88N0N6RJ87q2L74k56n4k2K38k23k30K88j37R3K58m3o8j6j70j03K06
4991F6J05K5j53j88K29Pj53m5J06r8J25K52k73r3K67J14m30oK79l96K85J09J10
5014B44l21J79j05j39J1R2L5j59pJ24M7J28j57j25j5Q9N7p5K0j2j55q9J70K17
5038E4j54o7N55l37j39J86j25q6k0J93K24k48l1n5m7L1K18j32p5j39K1R7K50q0
5062I4mk53o8M35p1j25O2r3O5O7L4k26j70M35k75J64jr9J6P8K3o1j07J46J74k30
5088A0K00j55j90L22l08QkO3K14k12k71K66l5J01J72l01J92l76K49j75M24k92
5110i6K0R8J02j22j31j32L09j32k13J33K39k28R2j2M3N3K9j54l18M10K43k5l33
$$ y = [-36, 38, 147, -22, 14, -244, -150, -59, 50, -70, 167, 37, 133, 73, 17, 132, -42, -39, -9, -442, -180, -155, -150, -20, 70, 69, -24, 199, -289, -239, -183, -174, 13, -69, 305, 49, -5, -27, 211, -12, -242, 46, -91, 2, 260, 217, 149, 133, -37, -140, 66, 171, 196, 43, -145, 84, 91, -62, -107, -1, -99, 26, 278, 5, -88, 179, 293, -137, -143, 136, -260, 25, 134, 244, -77, 102, -3, -142, -131, -39, -4, -163, -170, -46, 1, 129, -28, -153, -168, -79, -22, -97, -77, -89, -244, -333, -163, 54, -100, -167, 388, 51, -88, 98, -27, -113, -133, 60, 284, 36, 5, -50, -97, -66, 152, 20, -55, -194, -173, -76, 174, 94, 90, -163, -231, 204, 133, 8, 70, -23, 42, 109, 143, -83, -253, 182, -93, 71, 70, -29, -13, 65, 88, 27, -80, 66, 240, 10, 210, 55, -135, 187, -121, -113, -115, -52, 162, -50, -321, -55, -90, 11, 183, -118, 74, -302, -53, -228, 196, -96, -76, 22, 124, 2, -129, -261, 48, -84, -297, -164, 75, -153, -61, -73, -30, 23, 52, -102, -420, -10, 233, 208, -125]
5133a25K2k1J54J37P5k06j11N4p9N2J10N1k90K14J75k97K77j40Ok38L18k77K09
5156G0J7L4k21l0J97l06K33qk0K83j69k56L38l41j8L46j14J41l90J37j46J30L94
5179C01l92J67p4m8j35O1K07k28J46k8j57Q8J93j53K96om45J53j33K51j18K04
5201A50oJ57m43O9K93k52k3J06j91J32j86L13k59J82k07J72qm2m0L24m71K34k19
5224b15j4J11pK03J17k8k6k33K27m7K84k18j24k0ok5k33J35lK35j27K8J14J57
5248B85m35K74o6m3n7J86j86J20K19k77q4N5J34q9j09O0J19k08R1j3K0J85j53
5271B8o4J40Qk87K65k43k13L05k10K28K14l65J66k13J59M7j44M79l32K52j93N9
5293H6Pp6K23q2j46j19LK03J0j88N0j18J04J71j07J3M7j73p8J69r7K46l26J46
$$ y = [-125, -103, -124, 30, 167, 242, 36, -75, -21, -100, -48, 62, 113, -177, 37, 212, -85, 192, 52, 58, -180, 138, -139, 70, 87, 121, -100, -130, 67, -239, -6, -14, -34, 249, 80, -176, 162, -179, -197, 149, 35, 176, -214, -77, -223, -93, 301, -91, 76, 2, -46, -181, -120, 87, -141, 5, -23, -180, -92, 101, -52, 244, 238, -207, -54, -187, 64, -54, 150, 144, 301, -142, -73, 220, -32, -55, 51, -140, -8, -194, 119, -140, 42, -165, 7, -1, -43, -83, 241, -230, 4, -215, -229, -118, -125, 78, 195, 167, 141, -92, 135, 88, 372, 154, 30, 10, 4, -21, -254, -119, -122, 113, -14, 14, 128, 285, -150, 124, 58, 15, -42, 144, -42, 78, 297, 20, -64, -9, 125, 36, -73, -13, 106, -102, -11, -24, -4, 181, 28, -36, 104, 112, -175, 90, -153, -366, -61, -271, -43, 171, -194, -28, -241, -82, -35, -179, 300, -32, 220, 27, 86, 93, 17, 240, 158, 12, -107, -104, 99, 109, -79, -29, -147, -43, 128, 21, 34, 81, -92, -170, -1, -98, 148, -178, -32]
5317c2J02o3r3L18k38J41k87K48Q6K0j06n9k0j27L30j30j79J2J50k18l8M59l50
5340g4R0q6K95j90K55k28P3j06K14j71l00K04K4q3m3R1J29l00K56j28K80k12p0
5363h0P8K79J6l57q3L17o8O7L8l9l99K88K32l68J51k87K04P7K40l60P8k84n5J53
5387a62Ql3Q1K90k66J05J49J6l06J39j14J49k24K25N5J19l79%j5K50k37K32j38
5410e6K09J72j49k57K62k79K2K47o2J20l06J3K76j74j84J8j37M49j45o7K05j48
5432B9J09n5j16K52k0j55J02l54K17J36J9j93q0o0K81m3j39J66m3K38m33K14o5
5455GJ95m04R9jN0j39Q4o5K3L68k98J51K8k11K64j4l00J29P1R5k70L56j24q8o1
5480e5j72L59K0j16k67L70q3J52r8O1j53j27K2n7K07J1J40k49j17J48n2J56j72
$$ y = [-32, 70, 7, -86, 232, -6, 135, -152, 96, 182, 202, 96, 37, 17, -110, 220, 90, -89, -77, 73, -145, -183, 276, -74, 16, -70, 225, 35, 290, 62, 135, 29, 243, 72, -228, -24, 0, -83, -126, -35, 94, -206, 50, -78, 202, -10, -80, -2, 277, 293, -64, -147, 170, 102, 169, 207, 168, -231, 57, 289, -79, 72, -215, -11, 66, 306, -54, 24, -260, -315, -162, -154, -187, -106, 184, -82, 23, 172, 188, -118, 21, -93, 56, -168, 57, 112, 231, -148, -148, -163, 87, -150, 82, -56, 153, 325, 176, -81, 181, -98, -76, 171, 109, 229, -77, -64, 212, 38, -146, -128, -265, 184, 39, -28, 177, 29, 138, 83, -33, 219, 199, 44, 146, -208, 9, 145, 164, -29, -109, -169, 112, 69, -70, 96, 53, 291, -142, 72, 7, 202, -202, -103, -104, -54, -193, -109, -174, -151, 217, -81, 70, 98, -113, 151, 137, -163, -34, 37, 132, -138, 218, 94, 6, -55, -227, 132, 152, 36, -231, 139, 56, 208, 110, 171, 18, -109, -87, -144, 63, 74, 214, -35, -152, -4, -56, 100, -72]
5503g2m5L54q2j82J34j33L10o20M50l33L65k73J29j17J57J87k74J16m0j60K42
5524A13j63n5J58Jj7k04M16l45j81M23N9l77M39l10K49q0k04o7J79j74J43J37
5546A40j78o0J76l4K7k97K79m1KK16j61P9j63J23k64j32M29q7K64J9l79l3l1k75
5570c81L84n0j80P8L74k6m2k11K39P0k30Q8k20R8j12MP2R7J6m7n4j12J30L25k03
5595A07k72K12J9Q0n8j76M1J73j66rpJ46J13m87L22j27qn7L46j96J8k7J21j91
5619h3J59k15j9K03j89J74J04L4j94K24k99L00j31r8J4O9J33k19n1J76l18K06
5641b0K20k56Q0q2P6k2K65m97L61j71p9L22j08l82K29J02K8j23J12k96M24k49
5663f6M7Q0j46oP7n0L49m93K26R6l36L31j21j26J62K78l89R0j95L83k40J20mj56
$$ y = [-72, -117, 237, 155, -27, 107, -26, 284, -336, 114, -219, 146, -127, 2, -115, 42, 229, -45, 71, 31, -129, 113, -50, -105, 53, 54, 37, -167, 249, -96, -277, 146, 205, -172, 267, -43, 206, 126, -78, -145, 34, -140, 3, 140, -38, -98, 78, 44, 71, -226, 53, 12, 14, 230, 69, 148, -15, 108, -156, -288, 141, 54, 318, 337, -42, -75, -106, -381, 3, -47, -227, -149, 225, 199, 157, -54, 185, 255, 25, 113, -107, -9, -121, -117, -45, 52, 68, 21, -33, -145, -15, 310, 107, -165, 47, 66, 146, 88, -88, -47, 126, -40, -49, -56, 90, 203, -284, 38, -89, -97, -154, 192, -4, 14, -13, 108, -83, 76, -139, -158, 45, -144, 30, 134, 168, -26, 198, -101, 199, 68, -30, -16, 53, 186, -33, -84, 92, -226, -20, 200, -56, 24, -58, 18, -4, 261, -236, 125, -46, -125, 197, 89, -293, -64, 38, 66, -57, 55, -241, 183, -66, -19, 61, -85, -91, -14, -64, 285, -208, 18, 114, -222, 109, -12, -138, 24, 302, -87, 3, -192, 191, -49, 71, 67, -89]
5687h9Q7J05k12J07lJ02j68P8l81M60l5j49J55r9m9K94K0j60k2J47k66P4l8j41
5711a83Q6J33K0j40L03j95q4L3j05J15K81k20r2J35k54J65N5j63L77l28J8J28
5733H5k12J21Q1l27K89K6P2m3R0k76K0q2O4J34L0j18RK04j66L8Q1j00k10N1J53
5758A4Rp1N0j44M86j96j45J9JN5p9n5N2O3q3J19k00j29J01L6q2J25Q8M9j01K72
5784B54l93o9P2K30k78L71l90K86l17K65K2j08L95n99K91j58J84K03j68q0o5K7
5806b5n0K87k01j26L92m41oL48l11L7j33J63J22J58k29j59J11Q3K33o9k66PJ50
5829G5k0k2j44R8J1L2j5j1m9q7j23K68j69P2J77P1k76K16m27M17k08J07P9j79
5853a07nm0J45N6J91n96K47J20n5L0j36QL84j97r9J15K6j95J27J28n5r1N1n8n4
$$ y = [-89, -2, 103, -109, -2, -5, 97, -71, 7, -374, 86, 51, -98, 57, -42, -91, 203, 223, 63, 41, 188, -78, -4, -42, -183, -97, 36, 56, -84, 219, 24, -60, -27, -132, -17, 264, 44, -48, 87, -167, -2, 53, -110, 267, -61, -43, 85, -127, -6, 75, -252, 37, 63, 135, 92, 182, -94, -74, -156, -92, 42, 72, -46, -37, 167, 1, 39, 120, 20, -190, -139, 14, 23, -48, 2, -142, 344, 148, 3, 22, 23, 78, -1, -56, -4, 59, -24, 95, -105, -234, -133, -97, -179, -54, 34, 83, -18, 254, -139, -208, -136, 94, -184, 187, -203, 83, -234, 31, 53, -55, 340, -259, 32, -126, 58, 261, 93, 13, -52, -25, -75, 212, 11, -115, 277, -164, -170, 178, -133, -96, -229, -66, 56, 214, -15, -174, -63, 20, 253, 184, -82, -75, 75, 55, 33, -111, -13, -2, 30, 15, 4, -45, -132, -255, 13, -156, -84, 93, 164, -112, 104, -323, 94, -114, -7, 72, -107, -112, -152, -7, 49, 240, -356, -109, 11, -44, -14, -150, -142, 242, 45, -54, 61, 87, -108, 19, 147, 92, 1, 52, -6, -60]
5878f0J15n4R7j59K39k00J91k48N9P4j13K23k29L24j07l94J52O1J00n5K99k93
5900B2J56j90j53K5L18k59j04K71J29j64k25K62k89J95l3l8J63O2j12j49pL61
5922B41k18qJ97l60K22j55J18j6P2m6L6k33J41R3k04K51q8j85J66N7l41J78Q4
5945BN3j27J18oj53K25r6J21k36P9J3j42L51k24j30J71M6j88LJ66J61k13K30k58
5969c4j46K91k19K19l49M95k90j7J24mM4k5j97L9K68l08L1Q4k41J74M1K29m17
5992b08J28J81k7J56l19Q0k9N9J36l04K31j70L64j84k27J2J09K9Q0o1l73M13k
6015G4j90o5M98k97o7P4j6q3L6j6K1P8K4j07k2K44j04K9j67L80j05J3k59J69m
6040A38Pr9K53j48k79J75J2J30l3j33K05k3j65l3K77n23n0L62j46K46p0j16q6
$$ y = [-60, 55, 1, 98, -61, 178, -22, 169, -79, -20, 54, -59, 164, -65, 259, 152, -242, -90, -29, 71, 16, 315, 22, 178, -12, -165, -140, 178, -81, -185, 86, 215, 51, -174, 88, -201, -6, -39, -77, 86, 148, 36, -113, -120, 241, 23, 15, 212, -148, 74, -81, 37, 21, 93, 47, 83, -150, -9, 84, -120, 131, 43, -142, 24, 81, -260, -82, 2, 55, -72, 46, 40, -113, 112, 16, 137, -99, -20, -7, -149, 202, -22, -152, 19, 65, -123, -120, 46, 207, -6, 224, -34, -180, 111, -108, 111, -238, 257, -33, -50, 74, 70, 114, 89, -108, -69, 199, -109, -78, 6, -235, -61, -20, 209, -208, -80, 101, 74, 230, -89, -9, -38, 21, 157, -147, 84, -86, 278, 94, -133, -121, -12, 17, 97, 36, -337, 76, 74, -116, -181, 317, 20, -47, 27, 11, -72, -36, -52, -31, 47, 71, -36, -58, 186, 82, 111, -56, 324, 219, 232, -27, 142, 138, 145, 46, 299, 151, -128, 47, 59, 189, 156, 23, 228, 205, 40, 7, 284, -239, -289, 73, -73, 173, 103, -13, -99]
6063i9k1j4P4J86K0j21j09K11k69L1K16m1L7qj76K24n7M7J99j63rr3k01J24n6
6088f8%r6N2q0O6J31K35k48k6O3j1K6k0k18J21N9j4j43J50J78l60O8o3K75k08
6113a31j39K01J46N6j21j36K51J3j64k34J99P8j25K02R3m48kJ41J67r8K0N1k7
6136gj03K4N9Pj31J68J34j11O4l1q7J48k41K82l07l8O6L6J91k07M14l84j02K86
6160A30J23m17L95m45J21K96J62l01N8j71J31k04Q0P8n8q2n6j63N73m65m8K78
6182A5k0P8j23j27J23K02m52J14J08K36p1j57k72K62k8r5L00k4%o7L67j51j3r4
6206A11k6j78J0o9L17k40r8J28P1Kj22J02J76k54L67k97k15J41kJ39J11o7j19
6229a2J47j73J50j82J11l71J59K82m36L78n8K13l39L4J2J6J17k52L16j42P9J41
$$ y = [-99, -120, -134, -60, 126, 146, 25, -84, 127, -142, -111, 105, 64, 101, 93, -83, 141, 84, 131, 330, 167, 158, 65, -136, -12, -68, -68, -164, -112, -192, -126, 5, 240, -8, -34, 29, 18, 44, 24, -194, -73, -14, -28, -171, -21, 157, -203, -135, -198, 77, -131, -270, -69, 77, 133, 12, -124, 127, 140, -24, -258, -59, 19, -106, 96, 189, -259, -261, -120, 47, -51, -31, 20, -7, -110, -86, -27, -20, -151, 17, 151, 40, 104, 73, -14, 134, -107, 175, -132, -170, -104, -68, 123, -84, 330, -54, -156, 130, 253, -164, 231, -214, -93, 203, 365, 64, 122, -49, 82, -122, -42, 36, -22, -104, -160, -323, 250, -215, -263, 15, -5, 73, -50, -177, -54, 148, -304, -190, -82, 154, 83, -74, -346, -84, -112, -207, 93, 69, 69, 2, 369, 218, 205, 111, 85, -93, -83, -152, 165, -75, -173, -45, 26, 28, -94, 8, 184, -70, 297, 0, -215, -74, -76, 63, 174, 107, -12, 135, -38, 112, -70, 41, -330, -171, 111, -325, 53, -5, 208, -131, -97, -85, -69, 48, -204, 112, -30, 49, 190]
6251A90k90L93m69R1J32r1j21J57K19j31j25KR6j79K49n1j44Q6j5j52j71K24R3
6274gk23J40J72k8j41N3K4LK25r3k82J10Q0J09j72N8P3j49K34l58K44j8j37K59
6298A76l31J38l0j6K05q6j54N3J51j38J64n4k05K22j87K87nr4j98J38j18M4J68
6321A30k86J27rl2l16M11LK44k05q2j84Q3R6m8Q9j83J28J03J29k17K09j98k01
6344b09J25l5J13K9L11o63M66K9l3j24p5k8p7J11J62k52M32m33L2J82O9j36n9
6367f3J48n7L63m86J71k6m5j47L5k35L80o4N1j02P9j38J41J29k88L69j99j29j57
6390b70n8K73m5J01K25k04J8l68K51j18J70j92J87J24k72K03J11j56Kj32J37J96
6412A83j72L9lQ5j59P9J01k51m1K3Q4P1k43L50j35N4K06k52l5K6k3P2K3N2k61
$$ y = [190, -100, 293, -176, -85, 47, -44, -165, -8, 211, 80, -45, -43, 53, -126, 123, 72, -72, 14, -1, -153, -324, -100, -7, -230, -90, 82, 54, -87, -34, -10, -7, 218, 125, -157, -47, 33, 142, -30, 28, 101, -48, 186, -172, 72, 54, -83, 176, -155, -17, -47, -63, 142, 56, -98, -45, 106, -32, 132, 78, -127, 95, -92, 195, 190, 96, -102, 36, -82, -38, 130, -156, -29, -38, -70, -386, 25, 28, 272, 67, -15, -199, -116, -20, -68, 21, -162, -34, 69, 198, -19, 190, -8, -209, -84, -119, -6, 23, 334, -329, 137, 166, 133, 9, -66, -94, -171, -60, 102, -150, 282, -151, -119, 63, 132, -4, -63, 85, 28, 391, -95, 76, 50, 5, -142, -107, -342, 38, -26, 25, -77, 2, -136, 5, 134, -154, 215, 16, -113, -270, -328, -55, -100, 1, 226, 22, 40, -328, -77, -195, -25, -217, -30, 94, -178, 25, 136, -20, -18, -150, -13, 183, 11, 50, 47, 132, -27, 52, 153, -98, -139, -116, -32, 39, -204, 146, 11, 65, 271, 19, -16, 10, -13, 59, 82, 134, -127]
6437a27K77p3oj98R1j70K12N1k97J51o6K66j98P0j68q3L48q1J40k9M3k5k09MK17
6462A40j14j7k59K74j15O3l8P4Q1n5mj32k9K08n6k50O7k2j09N96m48l5J57j1J49
6487A15j66j3J03Q9k71n4q2L82K9k3j88K87J48m45o8J71J11J91j92l49N14j45
6509A44j71j05J22J99j88k91P5L23l2j97J94l0l01K60L2o4pq6Q6K02r4p7j47J31
6533b2k55l8K56J3L98p08K45J79J03mq9k27K65j91K4oQ9k08K34j34l03K93L13
6556B27k93m2j09L78l7m38L89J59j0j01k44M70o52K71r8O4j19N1L62l1j08k56
6578a67rL0K14J57m3l7k40J47j18L7l5K0j5M0p7K48m70M19R5k85K95k02j67%J53
6603a0n9j60L88j80P1J93n52K77j90M41k24r2N4lR2j73L71j78O2j88L5J33j92
$$ y = [-127, 150, 77, 71, -127, -36, -206, 6, 57, -240, -89, -155, 111, -87, -17, -185, -268, 80, -1, 139, 110, 153, 128, -81, -77, 140, 26, 9, -250, 24, -91, -28, -66, 8, 89, 34, 30, -102, -131, 77, 21, -229, -162, -184, -293, 303, -145, -180, -23, -34, 115, -51, -64, 39, 128, -143, -197, -279, 103, 132, 109, -79, 208, 356, -89, -157, 14, 125, 316, 124, -225, 289, 144, -27, -132, -10, 189, 1, -290, -215, 108, 76, -121, 73, 43, -258, 2, 34, -30, -37, -123, -37, 165, 71, -6, -153, -22, -277, -315, -59, -46, 352, -356, -111, 68, 171, 167, 78, -149, 116, -75, -51, -57, 32, -176, 58, -76, -379, -86, 227, -66, -108, -217, 161, 124, -314, 75, 234, 224, 123, -121, 349, -303, -32, -130, -66, -185, -134, 228, 197, 89, -167, -176, -146, 68, 225, 182, 145, -95, 52, -66, -29, -64, -44, -59, -19, -96, 152, -318, 101, 196, -89, 206, 4, -163, -163, -10, -69, -229, 159, -21, 50, 243, -309, -32, -222, 219, -5, -97, -43, -46, 46, -127, 244, 66, 128, -60, -25, 108, -84]
6626h4O3N1l95K49P6l19O34l53P5j13k0QL4N8k54L85p4j49L16j35k52L02k66J30
6650c3K6j2M3j57K25R5l46L83P0j68L2k22J74k82K92j01L6l27K77r8N5K39k09
6673hK46k14j66M18J5j63l59K51r8Rk46J64R6K39k8j03J19j9q3j77l0K96k11K4
6697b8M5k00jK80q5j97L68k55K43j83j1P2P4j47q2J39O1Q0l17k0M1J79R1j89J04
6722F2L6L9r0N5j22J59j70l4j33K26k00L22r5mO0kj46J90k32k5J22j35L3j23K65
6747E8j60L04J09o09N01O0%l74M1K65k37L16l06J64k46L2k28L21Q3R0k74p1O38
6770D77o15J01m9K94Lm8k9k3J34m29K00L7k45L76O2k70K92k26r5L4j4K2m4K10
6794A55j08J25n31J39K30R0q9l6P8L3K14k42j41J57J50l32K15p5J94m40L98L6
$$ y = [-84, -21, 30, -365, -116, -40, -359, 275, -78, -3, -116, -136, -128, -94, -36, -290, 95, 21, -128, 188, 53, -199, 103, -163, -33, -7, -19, 24, -133, 92, 187, -159, 224, 294, 126, 158, -64, 110, -172, 120, 19, 55, -272, 5, -93, -38, 201, -8, 238, 24, -142, 276, 291, 128, -231, 20, -78, -69, -315, -151, -55, 184, 156, 53, 172, 153, 70, -107, -137, 159, -52, -28, 17, -183, -184, 96, 11, -186, 182, -73, 170, -13, -24, 48, 122, -25, -107, 32, 93, 173, -144, -164, -123, 56, 147, -42, 62, 98, 137, 47, 102, -20, 139, -31, -65, -198, 28, -172, 150, 55, 51, 111, 109, -37, 153, -79, -104, 18, -117, -84, -207, 58, -102, 202, 311, -298, 203, 263, 263, -111, -70, 195, -42, 274, -32, 132, -114, -82, -310, 11, 94, 184, -90, -161, 477, -138, -37, -86, 208, 211, 163, 134, 111, 245, -184, 16, 53, -192, 184, 246, -24, 268, 42, -53, -19, -33, -11, -55, 155, 47, 172, -359, -220, 10, 100, 11, -25, 53, 86, 300, 58, -83, 74, 224, -108, 107, 32, 226, -214, 184, 220]
6816B20k91J93j88L7Q9k61K16p3J13O8J03k60k9O15o73L8j50J48q3J43j03J46
6838A8M3P9k54N7P1P2k17N12l95K67l24Q8Q8j15J30j34J39K26m30J57k23K84P
6861A46k42L67l05M2qq7K80k65l4K7M4M12k61M7n9k45J4L5J00Q4J94L7n52K19
6885a0P0l93K53J40J17L1m31K11K84k78L7O2K4J1j73J50p5j82J75k51lK10K19
6908A98l29M7J28J18j07j42PK75m1r1p2k72L91j38o2k4J50j61L26j51J01kJ9j39
6932B9j43L18k81K79j78m3j15N9K94k41J87r7J7Ol31M89k48kK1j22P0N4j2j48
6956a38K84j06k06J07L1q9J18J08KJ60k39L1l66K78k3K14r4n2p4J24R7k50L5O
6980d2j97L06l3J74j54m9J93l8l21K4m7L5J95J43k43J84n3j0j00M8l9M4N0j63
$$ y = [220, -71, 122, -66, -29, 60, -201, 15, -58, 55, 123, 226, -34, -63, 552, -121, -83, -233, -85, -168, -25, -128, 18, 61, 140, -114, -57, 14, 86, -131, 381, -14, 253, -71, 17, 105, -10, 120, -14, 125, 351, -79, 78, -145, 139, 146, -96, 271, -34, 8, 0, -87, 193, -72, -106, -79, -35, 377, 116, 163, 104, -141, -127, -92, 8, 92, 286, 323, -229, -10, 60, -333, -80, 60, 177, 208, -223, -12, 272, -6, 31, 93, 117, 128, -45, 105, 30, -152, 23, -228, -231, -21, 198, -131, -84, 44, 162, 55, -87, -80, 195, 154, 63, -9, -281, 110, -28, -90, -114, 36, -125, 201, 50, 151, 149, 168, 29, -114, 204, -77, 202, 24, -19, -134, -75, 219, -22, 165, 68, 85, 91, -240, 249, 1, -1, 20, -102, -32, 22, 10, -138, 146, 40, -166, -59, -28, -117, 1, 109, 111, 271, 32, 63, -303, -25, -48, 166, 72, 20, -54, 70, 167, -83, -48, -42, -239, 67, 34, 208, 54, 5, 198, 160, -161, -137, -184, -149, 46, 189, -54, 130, 77, 67, -33, 15, -24, 20, 70, -93]
7004i3K59n7j29j1O7j08j18J66J12j94p8J05J77q5L3Q3l61K26J44j31k18K78J70
7027B37l91M1M3L6Q7m4k6L02j68m9j26J4J04L9P8m0p5O1o9j55Q6M6J17r4j7m6
7053io1n2K71J68k49m5l4J63j45j07N4Q4j93M84m90L23k50N6J86k65O9L8m6O1
7077A1j78K08p7J64j83K97l06n8J40j25J69l6K9k30L32J30m3N8p2k29N3N5k79
7100a70K59R8j86j27J4J67r4J0Om7K82lm25O0J30Q2M1q8J69l57K81j5l6l18Q3
7125a84L72j41l0O3k31K98l5l01L07k34J32R0j18J56j0M6J0m49Q6L12j82n0K77
7148A84k88J53Oj97M46l50J78k69k1J50m7L6J50k96M23o7k18j7m2J09l37K87J33
7171A06N6m5o4o1j99J09R4k01P0L39k60O7m4L25l75L7m3K72k35q1O2j34M3J21
$$ y = [-93, 166, 109, -20, -31, 36, -72, -190, -24, 88, -106, -184, -79, 98, 13, 46, 129, -232, -6, 138, 7, -211, 67, 237, -154, -113, -70, -34, 53, 9, -17, 285, 117, 68, -58, -44, 60, 99, 177, 137, 62, 123, 54, -101, -15, 31, 148, 54, 37, -9, -70, -122, 149, 317, 68, 23, -11, 152, 7, -100, -46, 38, -155, 329, -161, 162, -88, -32, 154, -111, -42, -4, -50, 11, -167, 41, -36, 128, -55, 242, -64, -122, 18, -107, 62, 26, 55, -175, 157, 287, 244, 302, 230, 1, 54, 109, -170, 89, 187, 1, -126, -112, 55, -39, -29, -23, -70, 212, 209, -216, -156, -26, 56, 97, 9, 178, -179, 102, 87, 51, -267, -184, 188, 47, 17, 80, -151, 147, 112, -189, 118, -116, 16, 106, -12, 144, 134, 180, 190, -259, -173, 139, -43, -93, 184, -104, 49, 55, -142, 304, -46, 132, -137, -158, -8, -55, -19, 131, -165, 258, 191, -27, -44, -86, 23, -314, -27, 106, 162, 117, 53, -8, -207, -98, -4, -205, -135, 204, -56, 11, -33, 292, -83, -46, -89, 183, -52, -133, -71, -205, -162, -41]
7195d1l3L5K6j93J07j12K01m5J73n5j68j82L96J85k13l23l5N88j06k2m63K81L6
7218C7j25o6J44j42L50l35pJ94o0p1Q2O1j89L0l5K84k23K45j52j75J22N6o3Q6
7242D8k4m4No0m5l9J53J18j00kn0K50J8m65L04K5Mj31K1q2j7J66n4J84k44j20
7268a81J64K06k28J20j04k54L65l40P9n8J80J72j09n9J77k08q7l8K58L82n50P0
7290d3K18Kl12J90J72O4o34J23L93K43n14J82q7j1P9j8j5j3oj38J6JM09l50J11
7315F2j87K60o7o0k3j1J22q4j20L13k55J12J83k17q1R5o8r9L18l29N5Q6Q0O2j64
7340a7J43q8O5k35K78j1q2K0l43K24P4k56JN56k78j70J47J10l34j06K46J67j62
7363e1j20k5J68K66l41J0R7J33n5K8j61j00K62j87Q7K8J2l2p2J6l5M2L2j1j19
$$ y = [-41, -74, -39, -13, -206, -99, -211, -10, -55, 118, 63, -105, -287, 109, 294, 81, -242, -277, 311, 205, 183, -280, 1, 37, -88, -154, -10, -152, 198, -137, -144, 50, -10, -81, 1, 62, -127, -97, -132, 152, -71, 174, 22, -153, -31, 25, -38, 48, 24, -20, -15, -75, -120, -159, -6, 112, 12, 10, -40, 210, 228, -237, 67, 92, 96, -35, -14, -96, -113, 53, -1, 183, -61, -181, -17, 189, -39, 81, -23, -277, 88, -252, -173, -231, -51, 121, 12, -47, 130, -78, -165, -203, 55, 437, -113, -43, 175, 177, -135, 55, 227, 291, -343, -220, 173, 416, -98, 84, -3, -14, 65, 47, 32, 19, 13, -125, -109, -108, 301, -49, 62, -125, 135, 68, 8, -15, -26, 96, 12, -108, 205, -50, 62, 245, 28, -53, 42, -26, -125, 193, -136, -81, 5, 85, 147, -17, 126, 38, 103, -132, 146, 135, 53, 73, -270, -46, 28, -228, -227, 329, 51, -119, 28, 138, -196, -302, -56, 111, -51, -171, -196, -28, 238, -103, -93, 4, 137, 82, 110, -51, -151, 111, -76, 11, 39, 51, 19, -53, -37, -72, -30, 2, -9, -128]
7388a28L17k38L54m44N98l20q2j22k67M52j79L25k35o2M0j02J6J77j55K02r3P3
7410A27Q9ol96O3L43k12K79l72K59j95k2K1J70r2j82J50j83lK33q5k5R2j01%l3
7435h1K25r1j74J87M6k29lJ74k86K37nj3p6j96J46L07j16k72L90k38Q7%p0L34
7459B83k69l8J46lk65J03JJ26k57L32P7n55N51m00p4K69m3K2O5j56K7J21k66K80
7483G7o3O5m02M56k47J14p5J49j57J80k61n3L1Q5L19q3k41j18n9M31l3p2q4j5
7507e6K38k41J60l12k9K26M3n9K00j46M9j76M4K35j85k6L3j63J03P4j79K52r7
7530a2j38o2N8J86oj31j83K40K19n04M40j57J66n4j64N1K76j55l8o3N7P4k37P7
7554f0L7k3J4Jn6nJ39J46n2j36j26K70k32K07l64K06N6K1l98N37j7j89l2q0N4
$$ y = [-128, 189, -49, 305, -139, 459, 139, 57, -65, -332, 120, -59, 266, 31, -31, 9, -93, -77, 100, -55, 147, 54, 127, 216, 210, -186, -123, 220, 8, 287, -85, 174, -21, -43, -22, 148, 56, -126, 24, -159, -162, 71, -14, -39, 53, -48, -48, -81, 144, 53, -121, 66, 112, -117, -120, 54, -232, 5, 0, -13, -89, -285, -139, 168, 52, -220, 170, -68, 19, 19, -51, 283, 14, -24, 122, 119, -146, -43, -42, 84, -173, 159, 236, -319, 232, -168, -242, 27, -16, 6, 71, -85, -58, 63, -203, 77, 14, 79, -323, 133, -114, 0, -75, 74, -83, 97, -164, -217, -186, -101, 218, 135, -106, -224, -283, 148, 115, 43, -41, -56, 182, -59, 101, -211, -240, -14, 29, -30, 170, 24, 73, -103, -59, 176, -9, -35, -2, -165, -62, 12, -167, 85, -12, -150, -212, -154, 32, 26, -105, -288, -48, 171, -333, 107, -50, 116, 62, -102, -51, 225, 70, 32, -31, 26, 100, -137, -60, -23, -46, -32, -31, -87, -92, 47, 193, 141, 5, -121, 149, -83, 124, -240, -34, 22, 43, -355, 182, 165, -24, -56, -136, -82]
7579h2J07j9L4m9rk7K4j02K33L9O3n97K87j4J3M8K2Q9j11rJ72r6k51P2Q5J46j99
7606a31J09k1Ln8M02l91l7L26j25K75m27K8J56k31J49J11k23K30k53N3J09m8J18
7629A24N2j91q1K1J06O2N7k86J92j35L3J46j17M6k7J03m02K14k5K79j28k31K49
7652F1o4p0o5J92N8nk02M0J93p8J99j08j08j60K01n3Kl4Q2j04j13K64k15M00k67
7677D6Mj42J18n9r9O8Mj07P5J45R4n6n9k93N73l22P7J33k5k22J69j28J40k30l2
7702a28N8j3n3O8J58k14R8q6N9J68J01m13K49m7J32k46L02k02k18M27p2j19k72
7725b63L44k09K95Q4m04K99j15k12%k1J52J44k51K74k57j95M1J60L14k17p4J94
7747H3l30L23R7r2R1n2k8k32J53j28J86J0J24j65J08j4p0JJ50q8l40J08l9K43
$$ y = [-82, 25, 6, 40, -9, -18, -45, -21, -123, 110, 149, 212, -385, -98, -112, -99, -51, -29, 60, -51, -60, 112, 16, -235, -163, -78, 68, -131, -22, -43, -40, -98, 304, -87, -124, 202, 77, 352, -75, -47, 109, -122, 27, 138, -85, 145, -108, -55, 54, 6, 124, 176, -15, -96, -75, 31, 93, 150, -136, 56, -79, -46, 100, -17, 29, 2, 105, -297, -83, -108, 171, 43, -188, 61, -3, -73, -138, 54, 112, 107, -95, -55, 138, 60, 259, 151, 43, -117, 84, 31, 33, -1, 81, -23, -136, 128, -87, 313, 46, 50, -92, 26, -33, -132, -64, -60, -167, -92, 53, 147, 91, 32, -261, 312, -10, 67, 200, 175, -47, 122, -6, 134, -96, -128, -70, -83, -136, -68, 90, -124, -26, -112, -53, 115, 216, -197, 52, 5, 137, -109, 193, -9, -227, 200, 128, 9, -263, 81, -128, 167, 251, -153, 146, 31, -181, -181, -202, -50, 94, -157, 117, -140, -335, -294, -134, 180, -37, -111, 83, -247, 76, 173, 81, 172, 120, 92, -140, 13, -115, 71, 81, 205, 40, 148, 134, 64, 65, 215, 127, -213, -105, -144, 99]
7771I9l11K91n2k43Q0J30J14k1j15J35P1j47p9M33j36k17k95J97m1n4Q5M2j0P5
7795C1j15kr9m3K48L4k19L27j41k52J03R0J51j41M0q7J87r1J95m17K43j37l1O7
7819e9o3K43m4Q0n3q7J0n7J40k3L4Q1l03N4L2m0l9M6k11K27k62K40L32k56l90
7844c68J70L11j6L87m57M36l96n6N7K24m18p5K54k21J28J78p9ormj14L30m94K12
7868b6k62J81m0p7K97r7j00J40m33L67J67j86N7N2L12n36L82l80P9J81J64k29
7890A3j44JJ75k29n3K23m0p4L29k16j7K07l9j1l87J72J09J70k43P3M0j55j83K96
7914A7J73k32L5O0j26K57j33j82K31k56J15n1J02l02N01k60J85k79p7K76j58J71
7936F7O1M4j90k7O3k13P9O6J29j67J34k15K05j49m6J36K9j03R3j79K45n82N38
$$ y = [99, -212, 79, 27, -216, -136, -6, 108, 87, -28, 107, 178, 31, -48, 385, 249, 32, -263, -66, -107, -161, -76, -34, -44, 31, -84, -86, -185, -228, 20, 54, -165, 162, 21, -231, -128, -38, 113, -28, 12, -75, 112, 21, 216, -201, 42, -95, -126, -59, -122, 121, 77, 157, 104, 17, 27, -30, 110, 87, 121, 202, -101, -47, -15, -55, -94, -48, -259, -32, -294, -54, 278, 22, -368, -198, 113, 97, 484, 27, 463, 67, 11, 68, 292, -126, -201, 53, -168, -40, 138, 59, 53, 44, 40, -74, 256, -238, -26, -288, -107, -147, -224, 73, -24, -124, 16, -417, -50, 117, -69, -12, 40, 352, -184, 198, -182, -103, 78, 242, 13, -131, -130, 45, -184, -237, -14, -54, -128, 201, -15, -32, 175, 136, 125, -262, -90, 19, 189, -54, 19, 59, -96, -279, 17, 190, -42, -7, 53, -73, 184, 51, -131, 100, -156, -41, -92, 10, -292, 209, -51, 134, -145, -222, 54, -104, 67, 128, 172, -18, -45, 18, -195, -116, -50, 79, -88, 46, -169, 36, -113, -159, -23, 6, -97, -4, -183, 62, -520, 18]
7959A8j25%K39k7l91%K5O3K14%q1k7o8J4L55l21K02pj27j10L42l51QJ80%j68o5
7986b08o5L28mm5j44n0M62m72QQ0K20j19j63JJ98J8j04P2N4Q6m62K60K63k79m4
8011a09K01j90N6j01K66j24L09k04J98j30n7n61O17K30l64j61J73j43K51J9m8
8032A28p7k82N25l59L4l7p5K28k8l12J04K34k39k1r3K61M57p50Q1J42Q9J60j87
8055a7J99j38p7O7J18j71L12l03k8J12m4p7J47j20P6J11j8J63k64j47J42%k03
8078a60P1M0KK60l6n00L37P7P5k49L76j73q1l0O1j58P0j0n3j46P8J30p4J31J69
8103B07m16j9J9J22j60J96K67pk67J08J4J4L4j20l6o9O3k70K52n1J67j01k4m3
8127a20M23l81J49pR5p3q5P8Q8k36M5nQ6q4K07K6m53L05qO8k77K55j55K10K4j99
$$ y = [18, -107, -107, 132, 105, -286, -286, -261, -198, 16, 16, -65, -92, -160, -146, 209, -112, 90, 83, -44, -154, 188, -163, -155, 25, 25, -143, -208, -273, 55, 51, 6, -138, -188, 274, -198, -190, -110, 110, -9, -172, -171, 27, 45, -59, 13, 67, 153, -309, -49, 214, -65, -109, 92, -98, -42, -143, 123, -1, 308, 104, 302, 172, 115, -446, 171, 401, 37, -124, 49, -94, 157, 176, 128, 51, -231, 294, -65, -31, -68, -143, 85, 57, -255, -151, 83, -156, -177, -270, -9, 448, -302, -221, -79, 10, 170, -17, 182, 44, -33, 34, 152, -19, 293, -10, -38, 74, 30, -47, 100, -20, 56, 167, 149, 312, 48, -99, 43, 43, -160, -89, -49, -47, 213, 177, -323, 14, 91, 166, -83, 293, 120, 39, 9, 70, -88, -18, -28, -81, -227, -149, -19, -93, 38, 207, -209, -228, -209, -87, -247, -51, 216, 209, -58, 50, 64, 78, 112, -8, -44, -113, -50, -320, -68, -119, 48, -53, -77, -120, 303, -78, 71, 64, 159, 86, 1, 79, 167, -69, -24, -29, 57, -27, 180, 206, -247, 58, 50, 118, -159, 96, -59, 151, 175, -24]
8153b4j13O4RJ69j53k7K9l2K7K23J15j27k23OJ99k53K43L4l01L57O5l46L53l17
8177b3L0O6l02K12j14K42o6J2r9o0K48l0k03R8
$$ y = [-24, -137, -73, -64, 105, -48, -75, -46, -78, -51, 172, 287, 160, -63, -57, 142, -111, 132, 166, -135, 222, 287, -59, 294, -23, 7, 73, -229, -17, -131, 111, 45, 57, -42, -102, 146, 116, -87, 11]
8191A1
$$ Imaginary data points
##PAGE= N=2
##DATA TABLE= (X++(I..I)), XYDATA
0@%%%%%%%%%%%%Nj3J6j6J6k4L2l2M0m8N6p2Q8j00J15j35J53j74K00k28K60k95
34a56L33l75M21m73N28n89O59p33Q13r01R97j103J219j344J481j631J796j980
52a038K184k409K661k946L267l634M059m556N151n877O782p949R521j1767J5257
67H706k1495L6080j34114r1238J62508l7532j03773N581J72652N5757j35368j76142
79b58378n990J17806J17979R902p9435r1809J4482R3671L8592q7128q8280J8339
91b00249R9751P8529Q25r5201j18715j8009J07786P7883m9491n7588P1431J04225
103A177l2729j37567o8641N2770R4135O6573J1341o7509r7542j4889Q5552N9820
115d7509l8969n0015L0547P3941K8900m4261p6182l6629M6262Q1476K0954m4164
$$ y = [0, 0, 0, 0, 0, 0, 0, 0, 0, 0, 0, 0, 0, 5, -8, 8, -8, 8, -16, 16, -16, 24, -24, 32, -40, 48, -52, 63, -72, 81, -93, 107, -121, 139, -156, 177, -198, 223, -250, 278, -311, 348, -385, 428, -473, 524, -579, 640, -704, 777, -854, 942, -1038, 1146, -1263, 1398, -1548, 1719, -1915, 2144, -2412, 2739, -3138, 3644, -4305, 5216, -6551, 8706, -12789, 23291, -110823, -202061, -39553, -77085, -180858, -175277, -2625, 53132, -82236, -258378, -264368, -146562, -28583, -18681, -98116, -189925, -175443, -81772, -43180, -130308, -218588, -200249, -100498, -21969, -21144, -116345, -235060, -253069, -145283, -67400, -116891, -174479, -103048, 1177, -31552, -169119, -237760, -184990, -90855, -24282, -12941, -80450, -177992, -192881, -107329, -47509, -86478, -136493, -105946, -32005, -3105, -47366, -123548, -160177, -113915, -32439, -11485, -55649]
127e5649j5075N1221L5424m0746o2099j2429M0613O7338O1649k958q7780q2736
139a03227K1372Q7798M0525k6360j6022K8921K5429j7529m0647k3837J5486N0420
151D2329M5438m548m5195k3871K3920K9205o615k8959j1127K7299N1118K9050
163A28044l0854o6822l2354L4853N6754J8646j5919j0629J820n663j8582j7505
175D1789n59K8495M5698J9877l2272n3296k0035K5234L1711L999j9134j2011R672
188F9168K0917M254k4739l2278m101K9669L0053J675k2240j9980m009N58j0301
201C8646j2641P755L0688K6019p630l7747l7423q063K3744L0046P624k0023k3882
214A7113n345Q180J341j1724q831J0388J9128N033j7614k4141r635O731M980o364
$$ y = [-55649, -70724, -19503, 15921, -24825, -86924, -99353, -58740, 8598, 70247, 67289, -20491, -103227, -81855, 5943, 46468, 20108, 4086, 33007, 58436, 40907, 260, -23577, -8091, 42329, 87767, 83219, 38024, 14153, 38073, 67278, 60663, 31704, 20577, 47876, 98994, 128044, 97190, 30368, -1986, 32867, 89621, 108267, 92348, 81719, 83539, 77876, 59294, 41789, 41230, 69725, 115423, 135300, 103028, 49732, 29697, 54931, 86642, 90641, 71507, 59496, 69168, 90085, 94339, 69600, 37322, 33221, 62890, 92943, 94618, 72378, 52398, 48389, 48947, 38646, 26005, 33760, 64448, 90467, 82837, 45090, 7667, -396, 23348, 53394, 61018, 40995, 17113, 11768, 19948, 21289, 9565, 734, 11122, 30250, 35283, 17669, -6472, -16107, -9376, -4396, -10760]
228a0760p658N758J4665O946j0432k4492k2201m88K4643K6499j50k6042k4194
241d7906j348P261j71r73Q311J1097J751j0924j7207j2775K359J4715J1067k801
255c7544j1429n547M660O862k498j2368r060O817K0138J2101r414j8782p936L871
269f0129N005M120O690P693J530n112r448r966k944J2012K0887J2388q187j7684
283d3145p357O698R466L553j464n65M859O661J507n594n103K144P872O809L183
298a0476N24J20K26j325m798m427L279J4797J6368L992j1490j3562l301P600J0873
313H400P231P53k492k697o63r78o38L477P960Q297K306m888n927j440L040K600
329B4341j272j465K941Q022O228r99q684p869j14Q054Q977L824k464n523n543
$$ y = [-10760, -18418, -12660, 2005, 8951, -1481, -25973, -48174, -48662, -24019, 2480, 2330, -23712, -47906, -49254, -41993, -42164, -43137, -34826, -23729, -21978, -32902, -50109, -62884, -60525, -45810, -34743, -37544, -48973, -54520, -49860, -42998, -45496, -57864, -66924, -60107, -39969, -27868, -37282, -56064, -64000, -60129, -55124, -51004, -44314, -36621, -35091, -40203, -49651, -59617, -62561, -50549, -29662, -17274, -25461, -43145, -50502, -43804, -34338, -30785, -32249, -32814, -27955, -21294, -19787, -25381, -30484, -28340, -20468, -13659, -10476, -9952, -9832, -9606, -10931, -15729, -20156, -16877, -2080, 14288, 18280, 6790, -6772, -10073, -2473, 8400, 15631, 16384, 13892, 11195, 10532, 9554, 8916, 12393, 20353, 28650, 30956, 26068, 20141, 18701, 21741, 24341, 23069, 21604, 24545, 32567, 38795, 37796, 29112, 21243, 21129, 29183, 38160, 41984, 39520, 33997, 28454]
344B8454l131J2K249O326Q490K861n601r120o836P43O464N695K50l952k826M29
360C0507K82j859l524j764K270M276K353j871m741m909k490r80K43K086M175K813
376B6867k537p585q580m047L768Q313M742j961o597o603l170j36Q83M96J266Q29
392E948j044l133m330l403l02J794J010k92o83m03j050l408n437l932k57M504
408a4418O068K296m126p152n315p26J295L138L111O39k621m280m032k425Q64L886
424b3798M947J265l141l352k420k40l72o27M78J636K523K496o05l526k987q92
440b8615J609L063M029K132j392l278k798j887P63L305O398N500q63n471l708
455b1213M27J875K504L114K756N65o90j446J69P45K07J145L677L866Q51j598r27
$$ y = [28454, 25323, 25335, 27584, 33910, 42400, 45261, 39660, 30540, 23704, 24447, 30911, 36606, 36856, 32904, 30078, 30507, 30789, 28930, 25406, 23642, 25912, 30188, 32541, 30670, 25929, 21020, 18530, 17550, 17793, 19879, 24054, 26867, 24330, 16745, 8165, 4118, 7886, 16199, 20941, 18980, 12383, 5780, 2610, 2474, 3357, 3853, 5119, 5948, 4904, 1771, -2559, -5962, -6264, -4470, -3460, -3752, -4435, -4838, -5888, -9296, -14733, -18665, -18922, -14418, -8350, -6054, -10180, -17332, -22647, -23373, -22078, -18940, -15829, -15190, -17811, -22091, -26123, -28548, -27684, -23798, -18851, -17586, -20727, -24079, -26499, -26739, -27111, -27738, -27260, -25624, -23101, -20605, -21210, -24736, -27723, -28615, -27006, -23943, -19914, -17782, -19174, -22452, -25250, -27137, -26374, -23069, -16671, -11171, -12034, -17505, -21213, -20786, -18911, -16407, -13293, -10537, -9972, -10662, -12108, -11939, -11194, -10987, -9842, -6165, -2299, -1448, -3046, -3973]
472c973P1k90j093K023N715M959N46l769k635j375J130K622N010M457M68l386
488A0480l654N3K053J085J179L127L702r55m265j705K632K135j354k52M074L084
504B1419k274l169Q4r8j960n53M928M762k12m216k488m77o51J50J477L392J693
521B1807j691n060l187J194K892P2n05K233J477m133m771J267K633k557l197L090
537A1564M557j608n637j209K304j649l458J976M582k7l659k845j903j285k4J683
553C362J913R58m67l303m495j085L019J016k578OL445j248o111j910L934J094
569b450m191j32M161P47m810k880K060k26l471N70M194J234k430k619q02j894
585a2939k76J932K194n57q1J09l037l310J598L212k87j430J869J525l366l167
$$ y = [-3973, -3902, -4192, -5285, -3262, 2453, 7412, 7958, 4189, 1554, 179, 1309, 3931, 8941, 13398, 13866, 10480, 6826, 6879, 8932, 10017, 11196, 14323, 18025, 17070, 12805, 11100, 13732, 15867, 14513, 14261, 18335, 21419, 19145, 15976, 16060, 15962, 14002, 13449, 18377, 23139, 22927, 18711, 16223, 15746, 15095, 15245, 16722, 20114, 21807, 20116, 15056, 11869, 13063, 15955, 16027, 15522, 17755, 19232, 15099, 10328, 11595, 14228, 11671, 8474, 11564, 16121, 14513, 8876, 7667, 9971, 8322, 4864, 6840, 11422, 11395, 7736, 4891, 2988, 1703, 1679, 3362, 5275, 6233, 5766, 2463, -2032, -3117, -98, 918, -1660, -1654, 1791, 543, -5568, -7478, -3544, -2450, -6641, -6773, -2612, -1865, -6675, -9555, -7495, -7721, -11192, -10622, -6428, -5194, -7624, -10243, -11045, -12939, -13215, -11283, -9089, -9646, -9727, -9618, -12655, -15965, -14367, -11155, -11442, -12872, -11003, -9478, -12844, -16011]
601a6011J972K907j668j455L041K619k504k988J193Q51j594R2M099J452j646n21
617a0161L45j285j597K139L814M97j332L33J63k175k57L161K512l68q78K048J00
634b941k042K86J657L96K4J503J849o44r71Q82N77q84k1L435J773j390r96J629
652D122n19k162P18M533J740j837j000J276k01j557N9K855J704r11q28J2J61j33
670H032j87M16R21J278K10j357q07J220P1k089m16K948J736j756j949P94O84j886
688G863j855K618K673r32k782q41J272j280j244P86J604Q59k071j727j98J233
704E978j004j251M78J722k3k128j231M60L11j665j341J701J800j131k068m70N81
721G19p80j673L75K281P00k487j908M59N31r51o77J064J707j003k454r84J474
$$ y = [-16011, -14039, -11132, -12800, -14255, -11214, -8595, -11099, -14087, -12894, -12043, -13637, -13545, -9446, -7994, -9640, -10161, -9816, -11101, -12698, -10559, -6745, -6248, -7580, -7247, -7084, -9259, -9516, -6355, -3843, -4211, -5089, -3041, -2941, -4983, -4697, -3040, -2644, -2620, -1117, 732, 88, -883, -1, 576, -308, -329, 3106, 4879, 3489, 2493, 4122, 3603, 1441, 2159, 6692, 8432, 6595, 5595, 6871, 6670, 5113, 5172, 8027, 9731, 8820, 7992, 8004, 8165, 8032, 7845, 8261, 9182, 10460, 10670, 9313, 8506, 9726, 9797, 7708, 7292, 10240, 11976, 10220, 8271, 9065, 9749, 7863, 6008, 8626, 11299, 10367, 7585, 6744, 8016, 6736, 5492, 6278, 7882, 8741, 6670, 4943, 4745, 5978, 4974, 3723, 4201, 5923, 5900, 3772, 2541, 3001, 3312, 1647, 306, 2007, 3807, 2676, 608, 138, 719, -61, -1734, -1359, 922, 1622, -865, -2773, -2314, -1783, -2734, -3411, -2347, -640, -1643, -4097, -5081, -3607]
738c607M0j338m27J684Q17j487j343L85M00p31j059O14J432L24j233j081NL74
756f231p90j0J468Q25k43j656j238J115N56p09M27J039P12j630j138Q74P49j99
774f079m81Q80J240n02j199J49P34l43k48O32R83N97m88m44j50K47K76L11P96
793c089M59P16o68r99P2R85N64M61P08O18n14p52K1J042J42j4O49R08M36n21l00
814I24J61N30J50Q03N72M40J63o41Q4k40K66P80O64N51J17N6r11k37O02M29M76
835E739L24N91m45l03n50K14M44L77K81j5K2l73l51m9L9N5K40O06l41o9n08n59
857E369n06k27M45L35N40l34l88p51p44l34J88N78J72k28k37p06o83l83j06J5
877B015oK75k95l80o53r79n3m32N31K32rp82q9q40o50j64J8N49M41m54l73p69
$$ y = [-3607, -3567, -4905, -5332, -3648, -2831, -4318, -5661, -5276, -4876, -5607, -6666, -6052, -4620, -4296, -5529, -6610, -6605, -6231, -7021, -7031, -5563, -4738, -4981, -6637, -7875, -6760, -6204, -6913, -6486, -5447, -4735, -6365, -7503, -6629, -5880, -6079, -6560, -5680, -4440, -4942, -6141, -5992, -5258, -5601, -5849, -5217, -4234, -3637, -4125, -4569, -4719, -4472, -4196, -3885, -3089, -2630, -1914, -2582, -3581, -3509, -2524, -1960, -1499, -791, -173, -687, -1439, -1418, -376, -234, -248, 401, 1309, 1745, 1224, 924, 1085, 1615, 1765, 2568, 3140, 3580, 3743, 3102, 3186, 2946, 3212, 3992, 4656, 5207, 5324, 5380, 4469, 4232, 4834, 5263, 5739, 6063, 6654, 6209, 5906, 5356, 5570, 6014, 6391, 6672, 6657, 6679, 6306, 5955, 5906, 5945, 6000, 6240, 6846, 6505, 6436, 5928, 5369, 4863, 4636, 5081, 5416, 5956, 5622, 5234, 4483, 3739, 3405, 3593, 4171, 4343, 4115, 3878, 3172, 2489, 2106, 2000, 2015, 2009, 2284, 1989, 1609, 956, -23, -76, -508, 23, 255, 246, -536, -625, -1465, -2115, -2279, -2261, -1712, -1271, -1725, -2098, -2867]
899b867n52j13j74K85L38J65j68o87m11m93K74k67O23J41M2k66r01L89m80k38
919e360M29M87r3O26q83k43l65Q6O6N99O37k39kj28p30l4L71M85M50L60l3o0m10
942c984l25K09K70N12L13M13q3n21j37K99m7N92L01P37J05j37m46j00J74J45K13
963a497R04M07j29J2n57J67N1K88O99N52J64P7m61p4J72R6K26O44M66j22k39j56
985A690L2n9L09N18O76J69P0n70o4jm1L88M91Q25j8m63l44M9j12L04L17M47M86
1008E099n29l54l48N2l6J56J47Q52l66j93o00j15L8Q6j43N81K57l91p84j92j26
1029C091J00J22k32P39J1n15q51k60P5k27K4j39P74k55p84n75j86k8k62J95K56
1050A073r6j93p05l61j81k77L45J5m9j45l48k91k47n51K20j4L51J98k80q44k69
$$ y = [-2867, -3419, -3532, -3706, -3421, -3083, -2918, -3086, -3773, -4184, -4677, -4403, -4670, -4047, -3906, -3864, -4130, -5031, -4642, -5122, -5360, -4931, -4444, -4537, -3911, -4794, -5037, -5402, -5316, -5250, -4651, -4014, -4253, -4255, -4383, -5113, -5147, -4776, -4291, -3841, -3481, -3514, -3574, -3984, -4309, -4100, -3830, -3318, -3005, -2592, -2675, -3196, -3333, -3034, -3081, -2489, -2188, -1451, -1346, -1483, -1929, -2029, -1855, -1710, -1497, -593, -186, -315, -303, -860, -693, -642, -354, 345, 897, 1061, 1138, 677, 603, 775, 871, 1097, 1741, 2207, 2085, 1846, 1690, 1722, 1663, 1972, 2490, 3166, 3335, 3405, 2835, 2771, 2770, 2729, 3117, 3608, 4433, 4415, 3952, 3608, 3657, 3545, 3849, 4166, 4613, 5099, 4570, 4216, 3868, 3920, 3884, 4040, 4187, 5039, 4673, 4480, 3880, 3765, 3803, 3889, 3746, 4327, 4584, 4193, 3409, 3217, 3091, 3191, 3313, 3081, 3820, 3831, 3316, 2465, 2205, 2280, 2053, 2077, 1938, 2712, 2457, 1673, 1098, 912, 884, 622, 817, 1073, 977, 784, 79, -282, -463, -740, -395, -380, -429, -574, -922, -1213, -1460, -2011, -1791, -1805, -1454, -1256, -1536, -2380, -2649]
1071b649j96o8j01M71K70l42l36m54Lk12k10P09k3q5K04j68m02j95j43M38K72
1092c217q4J34J02j69k92j66j55N71K83R0L05j82n91kj11J62J080j05j43j1j08
1113b609J46l42l62Q82M79R2m0j31O68n83m25J48Q71N2k10J98M87l16k65J4J12
1134a134Q53q9q1j79K73m8n45K26Q35K52M7l43J19M57m36l78M43R27o7k61l60
1155E11P47M7o96k43R96Q06k68n58K63M29o82j75M18N36L36N8m53K52J53l67m40
1176A670O56P09n8n46L76m2J08o13j29Q36N70m13o87M43M6l24m94O39O36o4k83
1197C036j51OLm97o1M04L43k45m96N6J38m41n10J19N63K75m62o59K23J77n27l25
1219I69j20Q68m06m44l41K19k90p31M5N58M9n14J60l30j13l67j50k11O31J45m04
$$ y = [-2649, -2845, -2913, -3014, -2543, -2273, -2615, -2951, -3405, -3402, -3614, -3824, -3115, -3138, -3223, -3019, -3187, -3589, -3784, -3927, -3489, -3217, -3301, -3167, -3065, -3234, -3526, -3692, -3847, -3276, -2993, -2903, -2598, -2780, -3371, -3373, -3484, -3322, -2242, -2347, -2490, -2501, -2609, -2463, -2805, -3167, -2285, -1806, -1714, -1754, -1885, -1217, -1800, -2225, -2077, -1206, -1154, -1364, -1166, -679, -995, -1260, -1246, -1134, -281, -370, -451, -630, -357, -405, -950, -724, 111, 363, 410, 67, 186, 643, 207, -171, 272, 1199, 1132, 871, 511, 1258, 1305, 609, 366, 1362, 2168, 1900, 1342, 1605, 2034, 1352, 1177, 1595, 2131, 2467, 2525, 2072, 2324, 2477, 2110, 1670, 2326, 3035, 2977, 2431, 2807, 2765, 2873, 2260, 2131, 2967, 3537, 3124, 2437, 2880, 2926, 2602, 2108, 2747, 3383, 3319, 3036, 2885, 2891, 2894, 2397, 2336, 2740, 3083, 2838, 2342, 2398, 2536, 2095, 1585, 1704, 2267, 2542, 2080, 1421, 1644, 1821, 1294, 969, 849, 1717, 1311, 867, 526, 745, 455, -276, -231, 327, 376, -138, 22, -308, -421, -788, -938, -1149, -518, -373, -777]
1240g77l96N6j36o21j12K36L89j69p5j77n7l69j77j08M37K54k96o1o0k02k61j93
1262b875J28N19k53j75k8j1Kk91J88N68j12J43R7l25J10k31J30J27K40k8K4MJ54
1285a895j86K26j87M2O53j34K4K79k38j89P7L01k4L09Q6J03j38k08N24m5J74j25
1307e71M54j10R5k02L6K55J86j56L99O9K62m54J9O8J28j58J6M30M9QR7m64L61
1330H17M9K08n8J72K89j21j62j96L19r2r2K26L60l5K6j54j01m4K53O7N3M22l16
1353A890j11o7o2L20j30P1J12K17J6p63K73N2K30j33J8J69lk54j19L9J70l70J09
1376A674L91l34J51j43k42j43K70j23L2Q0l12k1j90k66J44N4o9m0J71m43M6j57
1398E30k7p7J0l05R4K67n35k32p7o2j81R6k23J90P8m40Q0k08L07n17j98M03j60
$$ y = [-777, -1173, -1117, -1253, -1874, -1986, -1750, -1361, -1530, -1605, -1782, -1839, -2208, -2385, -2493, -2056, -1802, -2098, -2159, -2219, -2421, -2682, -2875, -2747, -2228, -2481, -2656, -2684, -2695, -2693, -2984, -2796, -2228, -2340, -2197, -2100, -2425, -2315, -2546, -2416, -2289, -2049, -2077, -2053, -2049, -1895, -2081, -1855, -2042, -2000, -1347, -1481, -1457, -1178, -1416, -1605, -1528, -1227, -1251, -942, -856, -753, -891, -1099, -575, -620, -446, -571, -117, -227, -132, -334, -298, -43, 143, -13, 386, 455, 717, 263, 282, 350, 478, 320, 336, 766, 815, 823, 920, 456, 817, 866, 1074, 1016, 1188, 1477, 1356, 1194, 998, 1317, 1225, 1133, 1359, 1719, 1684, 1710, 1556, 1455, 1411, 1664, 1731, 1784, 2206, 1890, 1779, 1712, 1650, 1970, 1840, 1911, 2023, 2240, 2256, 1493, 1766, 1818, 2048, 1915, 1933, 2102, 2099, 1845, 1726, 1765, 1935, 1565, 1674, 2065, 1731, 1882, 1739, 1497, 1354, 1624, 1501, 1533, 1613, 1301, 1280, 1090, 824, 968, 1022, 953, 913, 1084, 641, 687, 530, 503, 426, 436, 131, 225, 492, -43, -275, -352, -414, -595, -499, -722, -532, -454, -894, -814, -1022, -715, -1232, -1430, -1027, -1187]
1421a187qm59J79k53L66k72q4OJ11l76J25J12j26m7J96j30J84j74O3N0k61J83
1443a802k91K02R3M4L6j63K76l15J37j5J34L81k23Qj27N4J28r9Q7L30j95N5K73
1466i92m34K61J49K59j92J58K42r2k9L7K46j52mJ12K74j0o8J4M6r3K14p0K68j01
1490D3J6N37m48l20Q7L82J37O1Q5k67K52o8N9K7J27J27q4q3J5J66j48J74Nj35
1514G47l3O3M26n60L09R1j40J90k57K61L13j93j91j44K79K8q9OqL22j90J71l10
1537A091K80j75L60k2K01m36K13l76R7l8j16K19Q0k97L57j75k97j46M75j66o8
1558A061q7J29M0j11k16j25K90l6j20l94K81K5k66j0j61N12k50ok07J04J04m41
1580A16K02r0r1rk7k27K1K5l93j92K87j13K52l20J14j40l04p9p1K75j3N9l09o4
$$ y = [-1187, -1195, -1654, -1475, -1728, -1362, -1634, -1718, -1712, -1601, -1977, -1852, -1740, -1866, -1913, -1717, -1847, -1663, -1837, -1774, -1724, -1985, -1802, -2093, -1891, -1798, -1754, -1718, -1881, -1605, -1920, -1783, -1798, -1664, -1283, -1506, -1498, -1625, -1571, -1443, -1542, -1455, -1125, -1320, -1265, -992, -1426, -1165, -1016, -757, -949, -791, -549, -641, -670, -633, -387, -539, -543, -431, -157, -167, -235, -221, -175, -268, -54, -124, 144, 43, 59, 596, 148, -172, -85, 297, 434, 495, 580, 313, 565, 497, 556, 583, 710, 837, 753, 670, 685, 851, 703, 877, 882, 747, 714, 777, 1203, 643, 952, 1043, 903, 1093, 836, 1097, 1410, 1217, 1026, 882, 1161, 1189, 1100, 1106, 1098, 1420, 1230, 1401, 1091, 1371, 1196, 1556, 1534, 1735, 1299, 1512, 1136, 1233, 1195, 1079, 1298, 1378, 1081, 1438, 1263, 966, 820, 1295, 1129, 1061, 974, 1103, 1143, 1032, 816, 691, 981, 945, 825, 431, 712, 737, 471, 461, 300, 812, 562, 556, 349, 453, 557, 116, 318, 228, 137, 128, 101, -126, -105, -80, -473, -665, -378, -491, -239, -559, -445, -585, -889, -968, -1039, -764, -777, -718, -1027, -1091]
1604a091n4m1L7j11K10J76k29J75l68J26l7j13mL22j15j59J00l9n2j89M15J7J5
1627a009q2O5q5j83l9J92L47N7o1j80J87J2k07K72k56R6K69k30J09K11M9j20J22
1650d64k9L37k68J43J17l51L97k88j0J73L28j77j25J67Q9J04j63m7J33j21J61
1671A06P4k2K86m67M8N26r9j40k6o8K71n2j90n1Q6M77l28p9J21n6q2L3J23J2M3
1696E46J9k32J21O9L5k19K74j25K90m24R7M9j8jJ56j1J19j23J24Q7k96K29j47
1719F19L7J69j13j8J60j0j18q7K85l20L02J24l07O7n3K85k82o9RL3k64J03L26
1742H78n19L69p3k44K41q2k05k42L66l00L59m98J13K36j17l16Oj26l0j05J62P0
1764e7n2k34N9K50n50K91l55J75K83k87o2J03j98l64L73j63J04j60O3K44k70q4
$$ y = [-1091, -1145, -1186, -1149, -1260, -1050, -874, -1103, -928, -1296, -1170, -1207, -1320, -1324, -1002, -1117, -1276, -1176, -1215, -1267, -1456, -1041, -1024, -1009, -1091, -1026, -1111, -1294, -1333, -1141, -794, -737, -798, -978, -791, -779, -986, -714, -970, -874, -605, -835, -726, -515, -466, -586, -464, -493, -156, -424, -281, -164, -515, -118, -406, -416, -243, 85, -92, -217, -50, 39, 143, -20, -67, 66, -55, 106, 180, 158, 444, -23, 25, 551, 452, 312, 286, 218, 489, 437, 247, 196, 282, 759, 431, 352, 473, 417, 335, 368, 491, 503, 546, 565, 333, 454, 523, 558, 339, 613, 488, 778, 354, 451, 500, 482, 481, 637, 626, 745, 622, 746, 833, 537, 766, 619, 656, 825, 712, 694, 854, 844, 726, 639, 924, 604, 906, 1030, 723, 790, 737, 1022, 740, 671, 680, 713, 449, 552, 878, 359, 728, 655, 411, 652, 570, 365, 123, 489, 189, 548, 50, 163, 399, 282, -34, -28, -154, -184, -289, -127, -57, -109, -343, -284, -34, -584, -293, -648, -473, -190, -477, -539, -436, -634, -998, -625, -788, -684, -844, -781, -537, -807, -891]
1786h91K6j03j74J98R6K30m42J79l6n2l8j09M18j78o9j07J66k9J50q9o6K38K08
1809d74k70q2P4M3K54j34j71K00J45J65l50J33O3j05p4L62K80m1k5J37l19K37
1831D8k11j8M60o5N6l59K61j22P3Q2o4L63q0k36j76K57m9J29q1K66j4P1k24J52
1855E19j30R5k69J87J36N1J22l05l1J01k63K03J33M2O0p2m9j45p9R2j06K89M0
1878F21Nj87j21J98n5K11k75J81j42P3K7K02k19r3J23R4R0k37J71p2k41J50q3
1901D21R6L04k58j53J03J56k97R4J98L2q4j58n5K72m35N1J23r6L6L20m30K79k50
1924B69j33L7l0PJ36R6l72R8P1k68L56k81L4j05J45j46l30J13k6k07K07K46k65
1947c48M8k48k59L04p7j0j31L68l48R4j60L5M4j37nj87M24O1l00m3k4M9j03M9
$$ y = [-891, -865, -968, -1142, -944, -848, -618, -1060, -881, -917, -969, -1007, -1116, -698, -876, -945, -1052, -886, -915, -765, -854, -920, -682, -474, -744, -826, -752, -709, -455, -589, -760, -560, -415, -250, -600, -467, -404, -509, -583, -221, 59, 18, -7, 130, -189, 48, -163, -181, 279, 214, 270, -89, 172, 50, 123, 205, 141, 504, 424, 188, 12, 269, 220, 349, 268, 534, 520, 591, 367, 519, 389, 484, 215, 402, 538, 589, 711, 406, 375, 476, 213, 416, 549, 591, 651, 579, 530, 385, 306, 398, 292, 581, 621, 626, 439, 318, 516, 461, 672, 397, 578, 436, 509, 536, 738, 519, 426, 549, 643, 733, 496, 667, 595, 354, 504, 421, 517, 821, 563, 410, 513, 669, 372, 466, 664, 696, 612, 454, 399, 671, 236, 287, 410, 314, 350, 670, 240, 519, 269, 136, 173, 143, 150, 286, 382, 10, 108, 179, -89, 267, -14, 20, -85, 60, -86, -416, -303, -329, -536, -329, -83, -348, -300, -548, -807, -503, -580, -590, -721, -353, -701, -607, -767, -732, -688, -825, -830, -1017, -593, -532, -832, -875, -899, -850, -953, -904]
1971i04K3J90Ol9j80P3j07o1L52j3j19o4J15O7R4l86K64j5K84k31L67j80Q6j90
1995e68j42L41J27%P9JNl2k19J18K0L68k07L70l34K4oP7j2K00j83J3J66m2J38
2020C02J23l23QK76MJ08r9j39p1O4P8o7L19r0j75M5k2K8O9J2J39j63o4K30k26
2045C66R3J37p0j23K07Q8kj00NM4p2Q2j54L5j03J4J62j27J3k87K48m4L39l49l7
2070C65K47j00PJ1l8p4l5K38k43k14J20P0n3q8j12J35j77L79j2n62J56K11o9J52
2094C14J78l64J71J5l32K06k2k06L51m49K53j50j79K42n2l36M05k9p0k48j26M52
2116B4k80j12N6oJ71l35qj91k0L07K6j10J11K5j26k55J27K14o3l30J19R3j48k0
2140g31k67J13K01R8m7J18q2j22J17j66K63j69N6r2J65K5j84L52n9q4rO9M17k00
$$ y = [-904, -881, -691, -685, -724, -904, -831, -938, -999, -647, -660, -779, -843, -728, -661, -567, -953, -689, -704, -420, -651, -284, -464, -378, -568, -710, -369, -242, -242, -163, -162, -157, -189, -408, -290, -270, 98, -109, 261, -73, -49, -55, 22, 10, 210, 27, 40, 206, 164, 302, 425, 102, 110, 386, 390, 498, 399, 260, 189, 253, 331, 264, 583, 493, 318, 363, 341, 369, 438, 450, 589, 426, 362, 592, 366, 459, 596, 526, 403, 610, 698, 696, 596, 601, 645, 573, 655, 501, 536, 433, 447, 609, 482, 495, 208, 456, 412, 751, 402, 365, 612, 512, 519, 530, 492, 418, 383, 621, 378, 164, 284, 354, 301, 213, 101, 236, 59, 438, 426, -136, 20, 231, 162, 314, 492, 128, 299, 314, -18, 188, 166, -40, 311, -138, 115, -35, -214, 28, -24, -360, 45, 16, -54, -302, -428, 24, -256, -368, -312, -318, -147, -482, -490, -681, -701, -394, -368, -478, -367, -342, -468, -723, -596, -382, -445, -775, -656, -563, -711, -731, -998, -885, -684, -586, -633, -515, -597, -719, -602, -768, -505, -674, -618, -710, -545, -520, -704, -352, -411, -495, -504, -435, -18, -218]
2164b18k29M1r9L91p3J14J14m01L5PK41k08J86L42o8j4m3n3L55k19j54J79j02
2187A24M10l91L56l4k31J17n2L96n49K97J08k75L25j91J04R8j46j00L44m33J96
2208D73p0Nj23P0O6K87k04N7lk55L1R8k61K80Q3J81j29j80j16N4J43j32L4po9
2233C13Q4k02J6o8K32o8J16p6k83J05J11k80J82Q2k9Q2k92K96j68j57k02K56O8
2256A18m8j0j41K02o0p7M1o1o4L32k60l2J3mJ53j92m3K56j20k20M9O3j08N4q2
2281b41M7N9n7q0L8K64m21K6J16J95j33k18K46j22k80l7J47j08K42q2j37P6j50
2304f10r9O8n6J22Q3j54J69l1M1j98K3K33p8k13L91m71K10k58L63k36P0L89j00
2327c42o3O9l14K64J25q9o8K09J46k50p7J03J57j97L83k37L54j68Qk35J60j53
$$ y = [-218, -447, -406, -505, -114, -187, -73, 41, -360, -325, -318, -77, -285, -99, 243, 175, 161, 118, 65, 420, 201, 47, 226, 124, 534, 143, 499, 465, 234, 351, 299, 695, 146, 443, 551, 276, 601, 410, 514, 612, 466, 366, 710, 277, 473, 403, 408, 285, 355, 421, 708, 504, 561, 558, 303, 334, 432, 171, 451, 534, 715, 586, 406, 290, 344, 487, 355, 389, 382, 313, 397, 195, 211, 143, 375, 307, 423, 347, 64, 169, 280, 0, 182, 264, 235, 317, 25, 321, 153, -4, -206, 50, 118, 70, 60, -81, 121, 61, -16, 25, -36, -100, 232, -28, -60, -47, -51, 102, -90, -133, 123, 3, -217, -168, -105, -213, -159, -241, -194, -135, -192, -272, -234, 30, -391, -365, -249, -54, -187, -405, -159, -281, -561, -598, -451, -559, -317, -399, -536, -460, -610, -709, -641, -697, -575, -492, -646, -477, -508, -467, -665, -642, -409, -487, -700, -309, -780, -570, -828, -465, -701, -631, -242, -342, -405, -336, -650, -386, -261, -350, -418, -209, -63, -313, -390, -287, -130, -327, 56, -181, 173, 5, 13, -222, -62, -215]
2349b15M44q4k3j0n3J91%M7q0J21l5m9K34l09J18M38m68J80m2J71R8j20j19K1
2373D56J35m06M68j71n9L1L24j82J49j89L1M1o3k6q9N3k06K43k45N9j3n1J41k08
2397B23J01O2k04M00k74k8L38l53j30N44m90J23J2k33O4J6L9j01P2j45o3L31l38
2420c4j16L66k18K2j02P0O3J2j99J08J06j31P3k50K27q9k48K66k73J48K43l55
2442c11J11R0l5j12J00ol6q3K50l06K79j16l4K12l06j19K19J18L4j30j68m0K3
2465c66K44n11Q5K07m5J36j66K35M0j71k28J66j83K46P2j99L28j78j28K27k07
2486c96l7N1k36J92K12J27k34J1O1M2r8J29M1n9j00O3n4N5j66K81p1l58M83p3
2510a34Q5N2o3q5q0R0L46k24j8K07j10Q7j23L38l60K2K95k06O9k8K36j86J40o5
$$ y = [-215, 229, 145, 122, 112, 59, 250, 250, 297, 217, 338, 303, 254, 488, 179, 297, 735, 267, 447, 405, 576, 674, 554, 435, 456, 591, 185, 653, 482, 423, 454, 778, 596, 745, 556, 587, 628, 565, 539, 450, 503, 297, 540, 295, 354, 341, 290, 431, 223, 324, 386, 182, 582, 308, 280, 618, 265, 135, 679, 189, 312, 324, 91, 155, 171, 210, 109, 181, 36, -27, 304, -34, -150, 216, -2, 20, -82, -12, 51, 63, -136, -28, 78, -53, 20, -230, -3, -92, -340, -74, -347, -199, 44, -311, -200, -110, -145, -257, -157, -163, -199, -282, -32, -338, -59, -175, -209, 3, -303, -422, -203, -85, -51, -181, -349, -389, -366, -122, -633, -548, -341, -386, -250, -416, -181, -141, -312, -540, -374, -557, -311, -239, -438, -110, -288, -416, -189, -396, -433, -382, -618, -426, -214, -87, -321, -310, -249, -207, -305, -176, -135, -194, -294, -231, -285, -230, -396, -115, -186, -544, -61, -134, -49, 3, -60, -145, -225, -135, 211, -13, -31, 176, 66, 153, 30, 368, 8, 30, 325, 119, 188, 160, 396, 210, 350, 285]
2534B85l7j18Q0K31k38P2o1L05J98L9n09J76J05l4r3N3M0J24k20K06J18j42j04
2557D76k8q8r0J81J96l70K59k00J23p7J85o6j44K28j46k55R2J63l27J18j57l6
2579C7K7Q2L84k93k53O6J05k7P4j85p1J60j19K5k25J82j70K35k07OJ52k93J16
2602a92J85k53J62m44M28J16m6J69k35k92N03l27j14L38P5m24J45j40J03r3J12
2623b24r5l0L37k45M1k6K41j06q8M6j14n8K00K30o02K55l7N8M0j03J37r2K17o5
2647h3l69M07o4j47P4qP6k34J38p6m1J15m7nJ41j42oj8J44K7j16J4Q4K78k79K0
2673a17r9j35K65l8Q8J12L4k18N2o1k96L60n9K15L4l44j7R6J15j76J29O8K40l05
2697e7K38j35J3l8Q3j00L68o4k11l2M48k2k05j4M5N5Nk22L71k95J71j24j27L74
$$ y = [285, 248, 130, 210, 441, 203, 275, 214, 519, 717, 756, 247, 423, 528, 494, 401, 454, 494, 618, 398, 604, 722, 580, 476, 448, 360, 270, 451, 647, 277, 536, 336, 459, 382, 567, 501, 357, 585, 439, 184, 276, 439, 112, 230, 73, 37, 64, 146, 530, 237, -16, 50, 155, 128, 202, 17, -54, 106, -13, 12, -213, -31, -201, 34, -173, -167, -15, -308, -192, -7, -260, -98, -542, -114, 2, -44, 125, -110, -402, 101, -226, -340, -2, 73, -351, -206, -346, -243, -336, -224, -319, -349, -12, -257, -216, -242, -1, -107, -195, -149, -263, -321, -121, 109, -493, -238, -275, -217, -177, -280, -143, -235, -18, -83, -452, -45, -109, -256, -182, -190, -114, -348, -210, -286, -327, -212, -259, -264, -123, -265, -271, -289, -145, -118, -234, -220, -136, 142, -137, -117, -216, -351, -86, -124, -36, 76, 110, -108, -56, -117, -413, -53, -112, 103, 137, -207, -224, -128, -13, -189, -60, 8, 248, -57, 181, 46, 59, 21, 104, 4, 372, 308, 97, 65, 513, 491, 286, 272, 317, 372, 377, 155, 526, 231, 402, 278, 151, 525]
2721E25p0j42K87o03M70N8k88m2J58M46n47NK89J33l83K63n13M84l43l8K15l10
2743E4R4j64K61Q2k77J59j24l5L99j99k83J69k00L91j48j59J08j42j24R0J54O3
2765A69p3j52J06j55k65J86m5N5R4j84P4l1J65l47M88l95K85m26K38k2k8j12K11
2788a64J01j86mJ34l17J55L7PK73m25M45k35j1m8P5j81J83k8l98M08J08k3j28
2811b22J13j92k6J27MM3j32p7N7J03L36m67M02l47J55m4J48J82l86J78n5M9M7
2834dj19K4Q8rO8j03j32j57M16j56P2Q5p6L1k62J36K61k59O5J8J45j61J65k04
2858f8j17L73k14J12J94j02j88K1k29M43j46k62L94l1Q1k59L47k08l9JJ66j45
2880A24J58k40J48lO0L9L0p1J46j24q0j42n5J86j08OJ94J14j9Q6p2j02q7J3J05
$$ y = [525, 455, 313, 600, -3, 467, 525, 237, 195, 353, 799, 252, 257, 546, 679, 296, 559, 46, 530, 187, 149, 364, 54, 148, -16, 245, 327, 50, 209, 85, 50, 449, 250, -33, 136, -64, 327, 179, 20, 128, -14, -138, -48, 106, 169, 96, -56, 50, -105, -370, -184, -229, -174, -80, -264, -190, -221, -56, -403, 85, -310, -25, -451, -213, -235, -263, -375, -164, -63, -249, -253, -119, -436, -281, -244, -237, 36, -389, 56, -179, -190, -238, -163, -344, -161, -189, -587, -179, -71, -94, -222, -109, -301, -327, -200, -196, -153, -285, -362, -305, -202, 134, -333, 69, -278, -123, -167, -19, 163, -223, -45, -100, -51, -4, -123, -99, -11, -20, 48, -55, -187, -344, 72, -84, -12, 73, -3, 28, -234, -98, 163, -96, -31, -13, 132, -29, 136, -68, -185, 188, -26, 86, 280, 178, -10, 11, -218, 225, 79, -183, 211, 180, 261, 2, 349, 141, 102, 103, 269, 124, 282, 42, 190, 187, 247, 286, 316, 245, 391, 267, 187, 45, -10, 176, 68, 74, 268, 382, 363, 449, 377, 275, 188, 201, 306]
2905C06J55k25k5l10O80n43K05K22k60K79l35j1j61J82k22J82J04l5r9m5oR1P1
2928B00j05k83L45l53J60l0J0j76J12K1K10j98J1K59Rk47j61O2j74K40k82K91
2950g9j76N1J25k37K13j07J41j98K7j10L76l91m4N5J85N9l81K78j05MK9j15M70
2973G0l67M7PJ1n8J0J54k49J25J10J81j06J10l6L0J3k2j34L04j62m29N32l94J29
2997a24j2J36Lj42J63k36K19k42L58n4m21N14k72J68k51K63J10k59R6M61k67k79
3019f8K26J9k45K92j62j03K55j14j61M0j8m5kj47J18j29M78m19L16N5N7l41J67
3042F9k47J13j12Q2J04n2K5M6j37J91J11m8j33qR3j60L63m10K70o7L6m1j30K6
3066a6K96Q7l44l2L43l45J71J03k49K08j9J2K76k30l2j17l4J73l00J96J39j11
$$ y = [306, 461, 236, 211, -99, 581, 38, 243, 465, 205, 484, 149, 138, -23, 159, -63, 119, 223, 188, 89, 44, 38, 129, 200, 95, -188, 157, -196, -36, -66, -56, -232, -120, -99, 111, -87, -76, 183, 192, -55, -216, -154, -328, -88, -370, -79, -255, -204, -79, -316, -103, -210, -69, -267, -240, -350, 26, -365, -409, -354, -169, -110, -491, -213, -318, -314, -285, -400, 70, -297, -250, -243, -232, -290, -280, -126, -375, -250, -140, 41, -65, 45, 9, 39, 52, 30, -104, 200, 38, -391, 141, -253, -124, -136, 0, 3, -139, 24, -212, 7, -235, 123, 69, -352, 162, -110, 58, -193, 70, 180, -79, 17, 478, 211, -68, 158, 177, -68, 224, 62, -41, 214, 100, -61, -21, -39, -84, -86, -233, -115, -244, 234, -185, 131, 186, 243, -98, 69, -178, -65, -177, -95, 9, -43, -18, 28, -109, 82, 193, 145, 12, 4, 97, -63, 300, -110, 160, 93, 129, 88, -42, -16, 280, 367, 23, -9, 334, -11, 160, 263, 14, 222, 203, 215, 491, 261, 229, 112, 78, 251, -49, 147, 286, 175]
3088A75J89k76j25J46N4Pq8j48O9R8M6K5q8o3J5P8j54m7j18K54N7k18L87l89q7
3113b01L63j73Jj65qoj0J78n7J5j94Q3j25M49l45Q4j48K85m00J29M8j71mL72j13
3138a13p9J29p4K14m23J73k8N5K57k78K09k25R4l6o0J12j35J93K29m33L07j18
3160c0l6K93l27J41j13K7j06J33j82p7M07P3o9K55n65O2K53o5m0L0j1p7P5J77
3184B28l23K61j34K51k02J1K54l50k94J82N13m11J5o0N8j31M24q6l31Q5J54q9
3206B5j34J56j00R4j10J22K7k76O81l87K1k80J07K5M0J06j65K2J30j28k44K36
3228c2j44PJ56k6l0lL14m70L22j4p8j98L28j45J5n0Q6R7n0K16m53J89K05l30K24
3253A36Q8k81K49j65J48j20n2K62m26K02q1p2M3Q0p2J77n2Oj53p8J28K41K03l49
$$ y = [175, 364, 88, -37, 109, 163, 170, 82, -66, 3, 101, 147, 172, 84, 21, 36, 114, -40, -87, -205, 49, 106, -112, 275, -114, -201, 162, -11, -10, -175, -183, -189, -199, -21, -78, -63, -257, -174, -299, 150, -195, -111, -259, 26, -374, -245, -197, -368, -372, 0, -113, -192, -63, -137, 77, -346, -173, -201, -146, 111, -167, 42, -183, -89, -125, -185, -73, -208, -15, 214, -219, 88, -30, -66, 227, -100, 41, -72, -45, -151, -18, -200, -277, 130, 203, 134, 389, -176, -114, 139, 74, 34, 64, 53, -24, 51, 228, -95, 166, 32, 283, 81, 92, 346, -4, -298, -116, 397, -14, 1, -59, -1, -132, 292, 206, -125, -40, 114, 25, -109, 47, -53, 41, -69, 53, 80, -196, 485, 98, 119, -161, -54, -29, 11, 117, -48, -26, 104, -24, -268, -32, -176, -169, -13, -39, -69, -72, 242, -228, 94, 80, 2, -196, 132, -13, 2, -48, 38, 135, 85, 301, -152, 37, 242, -88, 136, 224, -57, 192, 27, 175, 55, 3, 265, -161, 41, -40, -112, -69, 11, -61, 116, 64, 70, -83, -161, -33, 208, 411, 62]
3277F2Q0q0j71N7J32j28o0J9Q6Rp8J72j58K68j53j14K8q6Q6llO7j14P6j4l72N69
3304A77k64j66Q5Rk41M79o8k04J12k25J02p4K39J34rK6n93L91P6r9J30K34l21
3327g0p7J94J46j90j87N0J50j28r1L01j9r8j8q6J49K19k21k45L98k33L00j90J78
3350B32l48J21J54n5r0N7K53j61m7k72M67j17N0l22L4P5K02l34L24j36O6J2j29
3373C6m3J13P0r8L8q5L1J84r8m12M11j51j02k01J74K43m0p2K05k1k31j90K09j4
3397d4K11l35K05m9L8l73J29J71K18k58j73m1L49m31O24j84k08N1j17L86k06K23
3419A86j5j31j69K0M30l84j95L00r4J16j36J78k5m7m0k15K33P0J12k91J22k1p4
3442g0kJ99k58L15j82k2K7k22K72l6j06n2lK40l32K67n8K41l10n2K21n6N3J96
$$ y = [62, 142, 62, -109, -52, 80, -48, -108, -89, -3, 6, -72, 100, -58, 210, 57, -57, -29, -115, -29, -32, -35, 32, -82, -6, -20, -392, 177, -87, -253, -168, -159, -400, 79, 11, -193, -81, -306, -204, -278, -39, 95, 86, 112, -481, -90, -14, -113, 17, 251, -70, -147, 47, 193, 3, -184, -134, 16, -112, -203, 98, 79, -19, -37, -123, 26, 245, 24, -221, 177, -56, 244, 54, 232, -116, 5, 159, 104, 14, 71, 324, 163, 116, -156, 311, 194, 244, -78, -44, 31, 233, -101, 223, 87, 153, 165, 36, -7, 106, 176, 78, 116, 31, 62, 246, 148, -264, 147, -4, -106, -307, -133, 110, 70, -2, 203, 182, -49, -239, -30, -44, 167, -168, 37, -12, 26, -347, -218, -47, 171, -87, -260, -301, 48, -383, 241, 57, -151, -100, -217, 169, -37, 186, 171, 40, -129, -109, 321, -63, -258, 42, -52, 64, -72, 106, 81, 34, -6, -221, 12, 82, 194, -97, 25, 4, -70, -72, 127, -131, 184, 2, -20, 7, -215, 57, 21, -85, -137, -140, 100, -232, 35, -23, 218, -92, -144, 77, 21, 74, 270]
3466B70j39M6k7j45k15L28j27q6K18l8j46J8j78j1J60j50K40k85L73k47J10J9
3488a2K6J3j10J9Q0K4J1k18k1M1L68k35j85M58m33OL6J08o3O4Pl58j75M79j27
3513a97J21O7K59k83P4R2j72J07j38L40l10J76J71m16K77J1m6p9o9J26J20N0j03
3536A78q9J68k55M9M9q1K2J22k01M05k82m5N1j08J28J76l36J0R9q8J57j30J90
3559A89l50J14k69J71M3K25j29k61R8J69o1j38J91J65k28l23N33l15nQ9k08L73
3581G3O4k74r0L06j72J36k24Q0p2o6J53j65J92J76j16ml8j15j1J35j32K43Jk73
3605a93L00j11J57p2j67P2l9P9M0p4n0r4L09q2j0K1n4j4j74J46K2K33k94j3K27
3630A65j50j36p9K7j8J90j50L19j77J61p9O9r8k36K88q5J40J8l27n8K85N9J62
$$ y = [270, 131, 177, 150, 5, -210, 118, -9, -95, 123, 85, -61, -43, -221, -232, -72, -222, 18, -267, 106, -141, -31, -12, 14, 27, -83, -64, 16, 40, 51, -167, -188, -147, 221, -14, -199, 259, -174, -168, -132, -24, -87, -23, -16, -374, -549, -70, -197, -76, -9, 250, -33, 41, 133, -39, 68, -70, 270, -40, 136, 307, -109, 168, 179, 133, 54, -15, 111, 231, 281, 178, 89, 257, 2, 51, 100, 19, 41, 163, -38, 367, 85, 40, 91, -17, 111, 287, -49, -39, 60, -28, 129, -1, 189, -161, -47, -316, -145, -102, 123, -6, -267, -169, 0, -61, -199, -8, 157, -71, -394, 139, -176, -181, -92, -300, 73, 137, -137, -227, 79, -93, 43, -181, -101, -173, -239, -86, -251, -59, 117, 1, -3, -41, -156, -167, -32, -164, 79, 80, -193, 107, -4, 153, 81, -86, -14, -53, 26, 66, -8, -58, -152, 157, 75, 65, 86, 32, 18, -156, -10, 12, 245, -49, -62, 165, 15, -121, -200, -173, -191, -1, -151, 168, -9, 152, 73, 142, 44, -192, 96, 11, 151, 169, -158, -216, 69, 128, 290]
3653B90j85k13m9P6J66l39L64p8r5j47q8J86j20K47L12l46M7j17p5K40k24K8K4
3676i6j92J70K65j22j37J13j32j9P1K19j36J06ql54L47j15J35k04K72j85O8o8
3698bk6P5p2J48ol12K8K05P1K4l10M05p7J29k62K86j10q5J48l52k5J15R5j39R3
3723D4J72r3K75m46k89L39J05k27L7J41J71j90k48J07K07R7k93p7K02j02Q8k27
3745b07J82j97K16O5j47J15K1j52k72M03J01j16K8m0j53K52k32J22J44m6j16o
3767c5J9k53L32l37K50l3j67K32q0J62q5j93N8j00P0J43J94j66k08K54k37K73
3789I3m9m5j23K15Q6k53K92j29j74K23l16P7J07K50k19l4J2Q2R5l5l70K53p4p6
3813a12K17K7q7m8m3N8J5j6J51J09k44k49L75j58j0J38j38M64m11K4m06N24k93
$$ y = [290, 105, -108, -157, -81, 85, -254, 110, 32, -63, -210, -298, -112, -232, 15, 327, -19, 28, -89, -164, 76, -148, -120, -96, -288, -118, 147, 25, -112, 1, -131, -150, -79, 140, 4, 110, 102, -252, 95, -20, 115, -89, 183, -2, 66, -2, -28, 47, -25, 123, 117, -195, -167, 38, 109, 133, -177, 228, 151, 280, 18, 304, 194, 109, 257, -95, -120, -5, 90, -49, 44, 216, 123, 398, -48, -337, 2, 107, -120, -83, 58, 229, 39, -209, -102, 105, 202, -91, -168, 34, -68, 20, -207, -25, -222, -6, 59, -88, 27, 48, -104, -376, 27, 128, 12, 40, 0, -153, 99, -133, -11, 133, 87, -29, -35, -16, -269, 63, -274, -24, -57, -224, 8, -72, 90, 5, -188, -130, -230, -160, -17, 177, 11, -197, 57, -180, 93, 44, -1, -124, 91, 177, -76, 216, 87, -87, 136, -180, -103, 4, 254, 35, 1, 13, 95, 190, 155, -215, 38, -36, -112, 105, 132, 45, -3, -46, 12, 27, 11, 162, 271, 27, -222, 153, -5, -15, 123, -15, 449, 38, 62, -344, 180, -113]
3836a13j3N4m7K27J07L6m72J73J13J0k57j2J34J19r9K3n4P3O1j65J76m3O9q2j72
3861a54K95o9j29O0Q6j11L19m78J60PJ28k22M1N0k5P5J14Q7m30Q6J60k09L49k78
3885h8J04K6qJ49m12K02k2J20O4N7J59k61j2j04J90l36K19J01l01K62j47O3M9
3908G4j90J65L2k08J00J04k50L33k05K74k68J92l01K86k41J04J46k05q7L14J52
3929C21l48K07l84J92j14J76r2n0j48K92k53K23j14q2J19p3J83o7n4j64K68p0
3951c2K41k30j23L23l60K58l38R1Q6l8m6J10r8L81l48K19j56j28L07j40p6P4j38
3974a61l1L10qj06j63K01o7q2K13o2R6j83M2N2o7l8J20J10k05k3O7K7n8K18o60
3999d58L80J21K0n9j37J40k27L13j53o4K91j76q5O7o9j8m1J19K09k52J13J03k62
$$ y = [-113, -126, -72, -119, 108, 215, 251, -221, -48, 65, 75, -182, -194, -60, 59, -40, -17, -71, 2, 63, -102, 74, 31, 100, 18, -154, 141, 72, -57, 3, 89, -22, 297, -181, -21, -14, 114, -108, -67, -17, -42, 33, 147, 234, -196, -110, 50, -159, 190, -88, 16, 42, 34, 183, -229, -27, -49, 71, 135, 192, 351, 90, 78, -26, 164, -172, 47, 148, -153, 109, -38, 25, 74, -116, 49, 81, -127, -27, 77, -173, 160, -45, 229, -39, 153, -148, 138, -103, 1, 147, -58, -145, 169, 321, -27, 180, -204, -12, -126, 50, -42, -92, -240, 52, -201, 22, -92, -174, -55, -128, 55, -12, -66, -230, 38, -32, 209, -21, -144, 179, -181, 77, -261, -170, -84, -122, -168, -58, -156, 225, -123, 96, -60, -188, 119, -21, -97, -23, -161, -192, 118, 110, 4, -159, 42, -25, -107, 106, 44, 140, -43, -1, 51, -16, -54, 66, 176, -29, -52, 15, 42, -16, 202, -458, -78, 43, 63, 4, -133, 7, -220, 93, -60, -124, 167, -9, -94, -27, -96, -114, -155, -36, 173, -79, 34, 137, -125]
4022a25K7K60p8k63J75J2n6K33j90J86j13J3k3k52m5K01M5K95l67p9N9J65m97
4045d17P30k04l92N39l67k2J40NJ57j90J75k18K8r0K23Rk11J62K37j99J02j16
4067H1l02K72RP6m9j52J54j96J20K42M4m97K37K50k54J82R0k38q0J25j08J31J8
4090A55k44Q8j72J7M5K36L4j74q3J71l4k07J38J72j20j45L8R2k59K35P5N5j84
4113g1J48m9j24L27m51R1Q8J31m51M7J87O3M8j49j04j34K44r7L96k78q5K95J97
4136B69l57K20j8r8R5k06J61k3O7P5nj10l1j0K6N8J15k58J19J8m04K09L5J93l7
4161A03k71J04K33q0k45L6R0M3j04K07k53J93K13k37l45L16Rr5K59r0Q8k51J82
4184A05j10Q4p9m1P3j12K44j38j55j66N31M1l54M7k5R1O5j60L7K81j4k76J07m45
$$ y = [-125, -98, 162, 84, -179, -4, 8, -48, 185, -5, 181, 68, 81, 58, -194, -239, -38, 7, 302, -65, -144, -85, 80, -417, 313, 109, -283, 256, -111, -133, 7, 12, 169, -21, 154, -64, -36, -126, 97, 106, -105, 57, 294, 95, 197, 81, -221, 51, 60, 136, 87, -65, 89, -107, 13, 255, 299, -198, 39, 289, 35, 217, 307, 69, -11, 114, 6, 137, 155, -89, -1, -173, -156, -111, 125, 159, -15, -98, 73, 39, -168, -30, 142, 22, -123, -85, 7, -252, -17, 58, 113, -71, 77, 28, -96, 231, -220, -129, -41, 90, -361, -314, -127, -64, -16, -165, -269, -403, -159, -256, 140, -138, -223, 72, 269, -88, 132, 114, 16, 111, -95, 66, 43, 110, 185, 180, 70, 39, 29, 55, 113, 228, -30, 89, 107, -297, -88, -53, 140, 103, -168, -64, 169, 89, -156, -120, -30, 13, -91, 116, -137, 56, 269, 32, -313, 3, 12, -83, 176, 86, 174, -77, 105, -5, 79, 0, -41, 32, -80, 164, 26, -129, -295, 236, 277, -77, -30, -55, 36, 101, -59, -22, 259, 245, -31, 76, -369]
4208c69M61j92K87J4l33J44p1Q5k26q3K06J11j54J83q4k14K21j0Q7k08JK3K13
4231I2k02J7K80j59k9O6R6j17rp2J90M3j18p5J68n1j90K04L9K44m66J88j37k46
4255b44L46RO2l13K57l48J72J38l9j24J18J03L8k44q5J92op8K34k05j00j5K49
4278A17q5j87K50j25P0jm0q5J99j16J16j28O8m7m1N6kj81J27j5J67o3j22J60j70
4303g8J36l1k02J79J24m14Q0N11j61j16L6j01K95o25J73J66N9k00K27J45k18J24
4325A09k30K81q3j33K82k3jj76J85m3k98K84k83L02m39K47J45j34J19j45J40R2
4347A98j08j20M7l76L48j19J53K31k22J41l03M05k07q6K2pJ34k31K85k64k6j7
4369a22n6q4K19J58k39J64m5L19m83J07J42k62J85k59j23L22K61m63O6N0K40j47
$$ y = [-369, 92, -100, 187, 201, -132, 12, -59, 26, -200, -283, -77, 34, -120, 63, -21, -235, -14, -24, 63, -145, -144, -121, 92, -110, -93, 187, 28, -1, 65, 161, 44, 35, -37, 153, 196, 78, 3, 171, 120, -70, 134, 173, 417, -49, 139, 2, -244, 102, 111, 173, -140, 117, -231, -59, 79, 40, -84, 34, 137, 175, -69, -154, 38, 32, -46, 188, -17, -117, -132, 117, 32, -155, 95, -30, 40, 39, -1, -86, 113, -3, 113, -15, 53, 6, -35, 21, 19, -162, -35, -50, 117, 54, -68, 92, -78, 58, 27, -175, 4, 128, -286, -206, 305, 144, 28, 64, -37, 258, -367, -194, -28, 31, -169, 58, 203, -15, 109, -121, 160, 77, -56, 226, 203, 202, 26, 211, 168, -130, 154, -129, 173, -266, -19, 126, -8, 111, -34, 106, 198, 90, -30, 17, -359, -11, -130, 23, 254, 32, 173, -130, 275, 68, -18, 4, -3, 131, -100, 185, -79, -105, -122, -178, -262, -43, 115, -124, 40, -5, 314, -169, -62, 80, -182, 3, -256, -379, -57, 204, -259, -193, -143, 97, -50]
4391e0J47m7J29m69M16l67J46K1M5j1n5J12j15J64l4n8k5M48n34L13K2k34J28
4414I2k10N4Q4L2P0k96K19o3Q9j68R4J66j17l8K8j2r1j8J07J44q3m3j09NO4J49
4440A49j51k7J87j63L02j40k38Q8n4j16M04j47o6J19J07j46k24j95K25K44j5j02
4462D1J36n1J14k43L4N6l43K19J68j5J9k95J21j21J16J1o7Q3k33J91m3J91KK1
4486A12k6n6K79k61N0m3J72n26K27L9O0k1j3L3RO6pJ24j43M4j12J1j4j51K79n2
4512H0J9j56P2J3M8j93j65M01O8q4m4J19k00J88r1Jj94J81M7R6q6K1k96J80R3
4537A18p0k73J60J12l59K36k4J74j26K9J00r3o3L7R9O8r0j44J62k31J64J69j92
4560c7R4j90PK97j29l6O2k01K31k40J18r3Q3J20k21R9K8K4j88M98m58J01J84j45
$$ y = [-50, 97, 50, 179, -290, 126, -241, -95, -74, -29, -40, -95, 17, -98, 66, 32, -26, -51, 397, -137, 176, 198, -36, 92, -118, -64, 20, 52, 122, -174, 45, -18, 71, -97, -3, 163, 46, 8, 36, 24, -67, -85, 22, 166, 83, 40, -69, -64, 0, 149, -2, -29, 158, -5, 297, 157, -81, 7, -47, -163, 241, 94, 28, 147, 254, 108, -116, -311, -86, 158, 143, 41, 177, 126, 240, -3, 31, 87, -256, -37, 131, 116, 135, -160, -39, -160, -44, -33, -100, -17, -250, -59, -102, 89, 91, 112, 86, 30, 309, 48, 98, 55, 227, -299, -72, -33, 27, 6, -7, 26, 35, 101, 94, 218, 75, 119, 7, 18, 4, -147, 132, 80, 99, -57, 15, 28, 76, -117, -282, 119, 187, 103, 59, 178, -22, 166, 75, 76, -118, 63, 110, 206, 120, 141, -155, 25, 118, 48, -225, -65, 47, -312, -76, -100, 74, -52, -23, 77, -16, -79, -42, 57, 125, 35, -109, 53, -178, -14, 155, -37, 57, -133, -126, 171, 42, 6, 68, -133, 98, -142, -24, -117, -34, 86, -135, -36, -8, 16, -172, 326, -132, -31, 153, 8]
4584HK90k79m6J5n7J67j22j63M62l84J06o7rl8J2J60j21K09J04m96K18j81O1J64
4608A3k3o4J28j94J7M07l08M6J39j83m6R0LJ0j96J00r2K16k0k66K37p6J75P4j84
4633Cj2K96j48m12K64q8OP1l8j30R1P3j02N2k7R3M05n16L3L9p2J72j40K00j58
4658d5J21j93K83%j61O3j52L9j67K91k5j41J24j19Qj0j8n3N3j79J90L6L0J25r7
4683CM9o5j06J31K50m68K3R7K04J21k87JK1k79L31J21r3l11K61OJ68N3k18j74
4707a61R0J06j72K08j3K14k38O6j06kJ10k87N22l64R4K62l05k87M61k52q9L79
4729B36l10R6J60k55L70l79P9j82R2L15j51m6n1k74j2K51J90L5j89r1Q8j10J02
4752c6J29J0k96K70k21J60R3lr3j12K61m88K13L04j88k22m3O08k02j79K24p3j90
$$ y = [8, 298, 19, -27, -12, -69, 98, -24, -187, 275, -109, -3, -70, -79, -117, -105, 55, -66, 143, 247, -249, -31, -212, -151, 13, -10, -74, 54, -140, -123, 284, -24, 22, 161, -22, -68, 22, 25, 35, -161, -61, -153, 63, 43, -223, 14, -62, 113, 187, 3, -9, 287, 139, -273, -9, -97, -91, -20, -58, -188, -97, -24, -126, -74, -101, -8, 397, -119, -86, -47, -119, 53, -87, 113, -45, 76, -117, 166, 166, 5, 68, -84, -45, -212, 79, 54, -87, 37, -82, -74, -84, -102, -155, -102, -281, -91, -55, -25, 100, 3, 52, -13, -119, 12, 262, -206, -183, -86, 118, 239, -48, -47, -26, -305, 26, 147, 54, -257, 4, 10, 178, 231, 13, -161, -71, 35, -137, 71, 58, 272, 34, 100, -6, -8, 102, -185, 337, -27, 67, 329, 24, -263, 198, -54, -143, 236, -74, 22, 182, -73, 297, -82, -3, -185, -93, 222, 71, 25, -26, -300, -312, -61, 129, 164, -25, -116, -28, -138, -36, 93, 103, -193, 77, -144, 16, 109, 106, 13, -99, 162, -326, -113, 191, 3, -219, -262, 346, 144, -35, 189, 116, -74]
4775g4K65j17k47M4Q2k49L46j19j02L95j76j57K89j65N0o3K14J1j9J8l12M1J14
4798F9m4k38L76k44K56j87K6NJ08k61J86j39J43j68J3L30m74o0K90j66L6jR5L54
4822C05r0k38J01j72J86k02L95l66P7j66K89M6l19L39j85n6k4L1L7L48m68M26
4844B94j49J00k56M5J32j64P9k24J76N5j68L60l66P4J1J39k04R5l3N2L2R2o9N5
4868A58m53M45k7j92p0j09L06P4k08L11l04j22J92j65J51j18L83m73K87r6k53
4889b83L64j67O2k5K22j25j1n2n2M2K23l59R0J89q9l8K52o10K49j5J79N1l7mJ03
4914A59j16K4o2k12L01m5j0K30l10j64J11L9K09j61l3j30R1J62r2P0Q8q4k2K33
4938B76k44m9o2J16l55L39Q9k85m0K99J38MK94o34j4K54l23K83j43K3J0J88k3
$$ y = [-74, 191, 74, -173, -129, -47, -296, 50, -69, -171, 224, 48, -109, 180, 15, 65, 2, 216, 227, 208, 226, -86, -45, 69, 25, -213, 163, -81, 175, -12, 14, 19, 127, -134, 52, -87, 56, -112, -99, 231, -243, -303, -13, -179, -143, -144, -49, 305, 215, -23, 78, -94, 92, -110, 285, -81, -4, -170, 119, 165, -154, 185, 0, -56, -80, -49, -12, 336, -132, 294, 145, 245, -11, 34, 166, 2, 81, -143, 33, 88, -80, 280, -86, -12, -1, 138, -66, 29, -4, 48, 80, 172, 103, 158, -295, 150, 123, -69, -139, -248, 58, 132, -76, 235, -69, -191, 1, -164, -13, -131, 252, -221, 66, -30, -283, 81, -86, -24, -49, 173, 48, 37, -15, -67, -25, 198, -161, -71, 118, 29, -9, 243, -367, -118, -133, 46, 97, 60, 56, 159, 43, 67, 5, -207, 94, 49, 39, 269, -41, -205, -94, -55, 154, -7, -40, -170, -79, 83, -9, 61, 149, 65, 43, 276, 32, -17, -79, 37, -318, 21, 110, -175, -215, 84, 222, 226, 520, -114, -128, 126, -197, 86, -57, -34, -24, 164, 141]
4961A41J1j95J24p6J45k6l2O3j07k34N6N5q3J27J17l3M9m6Q0j39j38J41J0j85
4985a75J25K29l38o0K14J9J14l88N05j1j68k61L05k21j21K08k15J11K47k01M9
5006c3J86k90J84M0q7q1J04j58R2j03L9j2P7p7k37K10oMq2K6J79O5J8J2j45N1
5032b4o0K26q5j10R1J9o6J31k13L4m7K5J79j8R6o7p9k50M94N6k70L40l87j72K11
5057E4k33P1J97P3j46m1j27R3k3j53M18j18Q9J2p4r8k20J52O5p4M6Q0k15N2J60
5082D0J55l27J35j16m3J91j22J58J40j02j59j25J73k35L69N1j06K10r9l39lO0
5104i4M6O5n0K0J18K01p40M07r5J43j23K40j51K86m50K90k57J51O9q3K00k79J21
5127C5j41K15j35L6Lj01Q0Q3P1j02J8K20l43O4l0J17q1R2k45K36p9q9K31j40P6
$$ y = [141, 152, -43, 81, 5, 150, 124, 92, 155, 48, -186, -130, -75, -158, -31, 86, 53, 102, 56, 136, -3, -141, 0, 10, -175, -50, 179, -159, -219, -5, 14, 128, -260, 245, 234, 66, -195, 110, -111, -232, -24, -239, -128, 119, -82, -33, 153, -137, 47, 87, 0, -81, 23, -135, -43, -146, -107, -119, -42, -119, -356, -146, -152, -148, -230, -204, -25, 40, 58, 70, -75, -24, -84, 142, 57, -53, 38, 57, -9, 122, -91, -57, -104, -79, 100, 82, 178, 111, 32, -218, 276, 332, 62, 402, 15, -157, 54, -179, -108, 89, 162, 16, -25, -152, -59, -82, -235, 183, 65, 154, 166, 92, -6, -226, -74, -9, -83, -37, 43, -172, -120, 40, 195, -132, 3, -113, -156, 35, -87, 71, 211, 109, -50, -175, -2, -237, 132, 183, 77, 287, 188, -151, -154, -94, -48, 17, -33, -13, 105, 306, -434, -27, -122, 21, -102, 138, -13, 273, -177, 113, -144, 7, 76, -7, 193, -86, 35, -106, 109, -26, 10, 13, -88, -8, 75, 146, 44, 62, 282, -61, 3, -27, 90, 9, 101, -144, 92, 13, -76, 155, 15, 91]
5152I1k54K19J9k13j3K10K1k5o5K45O6m28K98j44J88j33J2k22J37J42j49j89K86
5175I9k3n1J72n5k00o9K19l3j62J01k5J49oj48JJ04m1j1j8J23l33J34K65j49k16
5200a73J18J76n4j3J68k08k1L8K43l84N0m9J3J02J9k07j29L86q2J54k05m8K27
5223A21J53m86M21l89J87r7M3k4L78j23n4l40K34J27j48l2k82J93K47j80j47M34
5245B36k00O2n2k5j0J67j27K2L2Q1j06m4j4j17K87j56l2j63K48n7J29j13M8J54
5269B50m39K14r5j56K86qO4m53K93q4L9K54k39N9K50k4l15K77l03m8K53J84j06
5292A53m2l06K51l91N11j1l01K44o9m2j39L14q1P0l60O2J24j12l7K94k97L57K3
5315B15q0j80M1j48m5K73K02k54K19k85k03J88l8Q1JJ3O0l6j69R7Q6l6J49k46
$$ y = [91, -163, 56, 75, -138, -151, 59, 80, 55, -10, 235, 301, -127, 171, 27, 215, 82, 94, -128, 9, 151, 2, -187, 99, 76, 25, 197, 142, -58, -127, 92, 59, -103, -2, -27, 122, 116, -32, -31, 73, 32, 21, 3, 126, -207, -73, 192, 43, -173, -55, 121, 67, 54, 222, 14, -7, 31, 274, -110, -60, -109, -96, 6, 25, -182, -311, 75, -7, 147, -58, -106, 121, 274, -212, 209, -180, 7, -90, -47, -71, 307, 184, 130, -210, 24, 151, 3, -29, -311, -118, 129, -51, -198, 236, 36, 98, 46, 21, 11, 178, 51, 73, 105, 186, 80, 36, 22, -95, 192, 36, 4, -159, 89, 32, 161, 48, 96, 250, -189, 25, -70, -226, 60, 52, 116, -337, -44, -128, -89, 165, -74, -15, 235, 211, -104, 173, -130, -178, 75, 259, 153, 111, -195, 56, -335, 176, 165, -136, 108, 39, -3, -142, 172, 91, 161, -199, -137, -13, -125, -162, 132, -165, 192, 215, 135, -45, -4, -152, -197, 76, 278, 24, 243, -42, -245, -57, -95, -14, -13, 0, 60, 24, -145, -48, 38, 2, 151, -95]
5339i5l1Q5K14j95Q7M4n4K49m86K03j5j4L5J58n4j50M8j51oo0M8k88K26L35q0
5364E3k41J26M5p9J54j50p2j14J68J67l69J46K0J10m4P6p8q2K51j81k8L48m61
5387b35J25j74J29J5L50k50j33J52L1l1N0O2k32K13j88J66j8J17k65mK30o6K2
5410F6RK02n07L77m0q7J39K0n0m28M40l14L83j39j45j45P0O4L8k9N0J37M6r8j56
5435i7K32l23m9J82K8j70K08j71L25m18J88k55J84M01k28k06J54J69k0M2m12R3
5457a43Nm1J39j27J05P7J29k03J30j95J12j34J32l3J87l20N1l4R1Q1R4J0R3O1
5481B67k04k31K12n4M1N9r9J8j8j9K36j88k31K68lj81K72n2K08o10K66R0%qk6
5506A3J22lj33J08k9L0j95l7J39j32K61m7k06J7K49p2P2j60O3n4Q1k2j63P4J02
$$ y = [-95, -126, -41, 173, -22, 65, 109, 55, 304, -182, 21, 6, -8, 27, 185, 131, -19, 29, -122, -128, -188, -140, -428, -202, 133, 53, -188, -62, -17, -96, 58, -92, -164, -278, -110, 57, -312, -166, -146, -36, -80, -4, -82, -164, 87, -94, -122, 226, -235, -110, -284, -155, -140, 210, -40, -173, -21, 10, -21, 29, 91, -141, 72, -116, 50, 32, 149, -116, -120, 110, 44, 66, 75, 277, -230, 147, 107, 20, 159, 179, 129, -299, 141, -173, 210, 71, -74, -219, -149, -85, -47, -76, -26, 111, 157, 59, -97, 135, -188, -237, -55, -27, -197, 11, -160, 165, -253, -65, -320, -136, 265, 37, -169, -15, 154, 134, 176, -236, -143, -138, -179, -40, -167, -62, 15, 144, -59, 71, -124, -12, -146, -14, -47, 140, -180, -129, -163, -72, 9, 103, 113, 206, 267, 63, -168, 44, -10, 31, 90, -9, 9, -9, -28, 208, 20, -211, 57, 54, -127, 145, 93, 301, -309, -43, 47, 47, 39, 13, 135, 132, -1, 107, 78, 108, -87, -124, 15, -117, 144, 97, -109, -92, 157, 85, 157, -3, 60, 6, 87, 65, -98, -24, 78]
5531G8j53j06J49m4m29L01K83N4j25K4p7j46K30K5K03j31k01k43L67K8O0j65k38
5554b56L20J2j21m6N8K62n49K35K22p9P9j59J90j63O8j60m8K23k05p3K67L7n6
5577E8j74L51l23J10K3P1Q2j99j47K82k79N1j5JJ48Nj8j29K22Q9q3k48K93k69
5601i8R0p0N5J61r5o5k4M83n82J44p8Q9K77k95j39Q0J19l33K59j10M9LlM6K32
5626A95m01K89j37K74m60J10j16K23o6qJ03%n9LL22j82r3K91l39R2J47k99j18
5649b29L30j08j60k4J48P8j3J30k13J36j0k47J16k7K00oK1k17J34j60j15K98j56
5672i4J45o6J64J8k43O4P9k19K7J27R3j58J25j25J8J20m9J36j39J65l14J09r7
5695a14K57k80p7rM63l06j30J91k62L34j16j22K86k24J85j81l7K89m61J73M4J24
$$ y = [78, -75, -181, -32, -76, -505, -204, 79, 133, 8, 32, -45, -191, 39, 64, 267, 136, -65, -308, 59, 87, 147, -18, -256, 64, 76, -45, -91, -33, 229, -320, -85, 137, 58, 137, -22, 168, 5, 73, -87, -135, 88, -117, -190, 77, 114, 58, -116, 235, -88, 22, 45, 116, 198, -1, -148, 134, -145, -94, -109, -108, 40, 45, 27, -102, 120, 209, 126, -122, 171, -98, -8, -78, -23, 138, 43, -22, -46, 437, -145, -1, -79, 10, 287, -8, -147, -67, 52, -281, -22, -132, -83, -80, -83, -37, 195, -206, 83, -54, 220, -240, -130, -246, -23, -89, -97, 6, 6, -53, -50, 272, 90, -3, 288, -51, 41, 188, -111, -229, 101, -7, -167, -191, -43, 35, 22, 152, -61, 75, 65, -182, -66, -93, 107, 101, 122, -95, 39, -121, -236, 62, -94, 51, -15, 149, 167, -76, -12, 67, -152, -125, 2, 95, -63, 62, -63, -45, 75, 26, 162, 23, 188, -126, -17, -114, 143, -137, -214, -223, 240, -66, -196, -5, -267, 67, -49, -171, 115, -109, 76, -105, -142, 147, -314, -141, -97, 27]
5717B7j85J95j9p4K23k2k69L95k57j90P3j24O43n41J19M6k22K26o0NK7l1J90k12
5741c7J00j97K88r3j52Ok19M09r3q7k8L10q5j43N0J95k51n9j3P8j6q6J66k5l33
5766c15K32K08N7p3k56K78J1k7j27m17N89n37M24j80R4j72K27J37k36K55k06R3
5788E9o8k24L55k32K13q7j55j43L18j63J73n7K4L5N4K90n19Q0J65l57K42L9k55
5811b13M78l67J54k49N6J26J32q3o5L8r4K1L3k48M79l39K33j05K1N0J94k29J73
5834A96l48K50j43m0L59l42K00p0o8o4P5j04K72O2k8l02J42k51M58j67k5k06J19
5857b5o0MJ95o0m2J46Nj49K12l36Q8Qk91J09J67N1K44m04Q7j0J9K0J30j54K27
5882A81k81N4K04j49P5p0R3k13k07L37p1j87K5M1j6K29j09kK61k86O0J81j38N5
$$ y = [27, -158, 37, 18, -56, 167, 145, -124, 271, 14, -176, -103, -227, 416, -125, -6, 40, -182, 44, -16, -11, 16, -15, 175, -37, 63, -134, 154, 61, -91, -85, -304, 105, 12, -75, -103, 207, 122, -21, 29, 224, -27, -86, -99, -21, -37, -123, 43, 18, -315, -83, 125, 182, 109, -147, 131, 142, 115, -12, -429, 160, -377, 47, -133, -39, -211, 16, 153, -83, 172, -34, 59, -9, -233, 122, -110, 103, 16, -139, -282, 36, -127, 46, -11, 13, 48, 102, 392, -127, -47, 118, -239, 3, 42, -213, 265, -102, 52, -197, -141, -15, 117, 34, -31, 7, -87, -66, -33, -281, 198, -141, 92, -13, 8, 58, 252, 23, 196, -152, 98, -45, -85, 274, -68, 132, 62, -6, -70, 5, -99, 173, 235, 207, -95, 47, -204, 254, 87, 62, -144, -25, -85, -81, 114, 54, 12, 158, 163, 14, 226, -110, -22, -14, -305, -196, -29, 22, 266, -138, -51, -61, -42, -22, 108, -46, 181, -100, -46, 158, 9, 84, 14, 107, -106, -313, 24, -47, -234, -209, -168, -184, 45, -64, -66, 195, -91, -31, 150, 12, 67]
5906F7J43k63k2M9j27J37j99R1J26K14p1k26K32j82J09Q5Pm75M45k52J71k79K47
5929B7j77M68l09j26rJ08O2q0k22K3J76j28L67j22O5r9r8J82n3o0L06l58K5O8
5953C6qj38J05O8k33J60N4K37l97M2O1KJ79k29J49k2j75J59R9k21p3L27k45L0
5977c3L9j96R0R1k10j47L65J35m62L20O0k80K47n1p5j47K44p7K29l40k14K79J10
6000b3L7J0P5k39K53l39O24m45P2J47k23J25r0P9l2L3J55l64J29k7r2K66Q0k87
6024g6J08j84K70j59L5j97L39j80J92k46Q6k55J94J34j68J75o9n3K92j49j7j73
6046a01J90Q1l87M00p4j86J11j68O7J55k27K6K46l2K70m23j85M01J3k86p5M6k0
$$ y = [67, 210, -53, -75, -26, -153, -16, -215, -124, 2, 216, 145, -81, 151, -31, 78, 163, 170, -305, 140, -112, 59, -220, 27, -150, 318, 9, -117, -126, -18, 44, -36, -258, -235, -59, -187, 180, 58, 123, 24, -74, 108, 55, -5, 301, -57, -32, 36, 28, -110, -5, 63, -170, -10, 44, 281, -116, -74, -13, -11, 168, -61, 88, 66, -109, 50, 149, -72, -145, 182, -63, -33, 6, -190, -100, -9, -219, -366, -1, 134, -328, -8, 52, -228, 19, -32, -107, -254, -10, -87, 142, -198, -412, -133, -23, 14, 24, 99, -140, 113, -226, 398, -47, 25, 172, -51, 74, -16, 63, 31, 64, 219, -145, -16, -43, -135, 131, 211, -76, 32, -152, 118, -41, -6, -203, 136, -44, 148, -98, -12, -267, -73, 61, -107, 68, -1, -54, 238, 89, 72, -101, 89, 170, -217, 183, 109, -77, 34, -134, -67, 88, -139, -113, 133, 101, 371, -52, -237, 164, 177, -109, -184, -138, -158]
$$ [...]
8191i
##END NTUPLES=NMR FID
##END=
