##TITLE=1H_SR2-OMe
 CDCl3, 8 sc, 
 21.10.2019
##JCAMPDX= 6.0         $$ Bruker NMR JCAMP-DX V2.0
##DATA TYPE= NMR FID
##DATA CLASS= NTUPLES
##ORIGIN= UXNMR, Bruker Analytische Messtechnik GmbH
##OWNER= root
$$ XWIN-NMR		Version 3.5
$$ Mon Oct 21 13:57:50 2019 Russian Standard Time (UT+4h)  she@DPX200
##.OBSERVE FREQUENCY= 200.1315
##.OBSERVE NUCLEUS= ^1H
##.DELAY= (6, 6)
##.ACQUISITION MODE= SIMULTANEOUS
##.ACQUISITION SCHEME= undefined
##.AVERAGES= 8
##.DIGITISER RES= 18
##SPECTROMETER/DATA SYSTEM= spect
##.PULSE SEQUENCE= zg30
##.SOLVENT NAME= CDCl3
##.SHIFT REFERENCE= (INTERNAL, CDCl3, 0, 15.7039)
##AUDIT TRAIL= $$ (NUMBER, WHEN, WHO, WHERE, WHAT)
$$ ##TITLE= Audit trail, XWIN-NMR		Version 3.5
$$ ##JCAMPDX= 5.01
$$ ##ORIGIN= Bruker BioSpin GmbH
$$ ##OWNER= she
$$ F:/spectra/data/she/nmr/H-F/1/audita.txt
$$ ##AUDIT TRAIL=  $$ (NUMBER, WHEN, WHO, WHERE, WHAT)
(   1,<2019-10-21 13:56:37.25 +0400>,<she>,<DPX200>,
      <created by zg, POWCHK disabled, PULCHK disabled
       configuration hash MD5:
       00 E9 B6 7A A2 85 ED C7 34 08 36 98 17 FE 4E 26
       data hash MD5: 16K
       F5 FC 56 D0 A5 25 8D 15 A3 B6 5C BA 41 C1 EE 69>)
$$ ##END=
$$ 
$$ hash MD5
$$ 79 E6 82 5A 8E 0C BF 89 FD CC 80 6F B0 F4 38 54
##$RELAX= 
##$RELAX= 
##$RELAX= 
##$RELAX= 
##$RELAX= 
##$RELAX= 
$$ Bruker specific parameters
$$ --------------------------
##$DU= <F:/spectra>
##$EXPNO= 1
##$NAME= <H-F>
##$PROCNO= 1
##$TYPE= <nmr>
##$USER= <she>
##$AMP= (0..31)
100 100 100 100 100 100 100 100 100 100 100 100 100 100 100 100 100 100 
100 100 100 100 100 100 100 100 100 100 100 100 100 100 
##$AQSEQ= 0
##$AQ_mod= 1
##$AUNM= <au_zg>
##$AUTOPOS= <>
##$BF1= 200.13
##$BF2= 200.13
##$BF3= 200.13
##$BF4= 200.13
##$BF5= 200.13
##$BF6= 200.13
##$BF7= 200.13
##$BF8= 200.13
##$BYTORDA= 1
##$CFDGTYP= 0
##$CFRGTYP= 5
##$CHEMSTR= <none>
##$CNST= (0..31)
1 1 145 1 1 1 1 1 1 1 1 1 1 1 1 1 1 1 1 1 1 1 1 1 1 1 1 1 1 1 1 1 
##$CPDPRG= <>
##$CPDPRG1= <>
##$CPDPRG2= <>
##$CPDPRG3= <>
##$CPDPRG4= <mlev>
##$CPDPRG5= <mlev>
##$CPDPRG6= <mlev>
##$CPDPRG7= <mlev>
##$CPDPRG8= <mlev>
##$CPDPRGB= <>
##$CPDPRGT= <>
##$D= (0..31)
0 1.2 0 0 0 0 0 0 0 0.06 0 0.03 0 0 0 0 0.0002 0 0 0 0 0 0 0 0 0 0 0 0 
0 0 0 
##$DATE= 1571651796
##$DBL= (0..7)
120 120 120 120 120 120 120 120 
##$DBP= (0..7)
150 150 150 150 150 150 150 150 
##$DBP07= 0
##$DBPNAM0= <>
##$DBPNAM1= <>
##$DBPNAM2= <>
##$DBPNAM3= <>
##$DBPNAM4= <>
##$DBPNAM5= <>
##$DBPNAM6= <>
##$DBPNAM7= <>
##$DBPOAL= (0..7)
0.5 0.5 0.5 0.5 0.5 0.5 0.5 0.5 
##$DBPOFFS= (0..7)
0 0 0 0 0 0 0 0 
##$DE= 6
##$DECBNUC= <off>
##$DECIM= 24
##$DECNUC= <off>
##$DECSTAT= 4
##$DIGMOD= 1
##$DIGTYP= 9
##$DL= (0..7)
0 120 120 120 120 120 120 120 
##$DP= (0..7)
150 150 150 150 150 150 150 150 
##$DP07= 0
##$DPNAME0= <>
##$DPNAME1= <>
##$DPNAME2= <>
##$DPNAME3= <>
##$DPNAME4= <>
##$DPNAME5= <>
##$DPNAME6= <>
##$DPNAME7= <>
##$DPOAL= (0..7)
0.5 0.5 0.5 0.5 0.5 0.5 0.5 0.5 
##$DPOFFS= (0..7)
0 0 0 0 0 0 0 0 
##$DQDMODE= 0
##$DR= 18
##$DS= 0
##$DSLIST= <SSSSSSSSSSSSSSS>
$$ [...]
##$SUBNAM2= <"">
##$SUBNAM3= <"">
##$SUBNAM4= <"">
##$SUBNAM5= <"">
##$SUBNAM6= <"">
##$SUBNAM7= <"">
##$SUBNAM8= <"">
##$SUBNAM9= <"">
##$SW= 24.0689530833862
##$SWIBOX= (0..15)
0 0 2 0 0 0 0 0 0 0 0 0 0 0 0 0 
##$SW_h= 4816.95568400771
##$TD= 16384
##$TD0= 1
##$TE= 0
##$TE2= 300
##$TE3= 300
##$TEG= 300
##$TL= (0..7)
0 120 120 120 120 120 120 120 
##$TP= (0..7)
150 150 150 150 150 150 150 150 
##$TP07= 0
##$TPNAME0= <>
##$TPNAME1= <>
##$TPNAME2= <>
##$TPNAME3= <>
##$TPNAME4= <>
##$TPNAME5= <>
##$TPNAME6= <>
##$TPNAME7= <>
##$TPOAL= (0..7)
0.5 0.5 0.5 0.5 0.5 0.5 0.5 0.5 
##$TPOFFS= (0..7)
0 0 0 0 0 0 0 0 
##$TUNHIN= 0
##$TUNHOUT= 0
##$TUNXOUT= 0
##$USERA1= <user>
##$USERA2= <user>
##$USERA3= <user>
##$USERA4= <user>
##$USERA5= <user>
##$V9= 5
##$VALIST= <valist>
##$VCLIST= <CCCCCCCCCCCCCCC>
##$VD= 0
##$VDLIST= <DDDDDDDDDDDDDDD>
##$VPLIST= <PPPPPPPPPPPPPPP>
##$VTLIST= <TTTTTTTTTTTTTTT>
##$WBST= 1024
##$WBSW= 4
##$XGAIN= (0..3)
0 0 0 0 
##$XL= 0
##$YL= 0
##$YMAX_a= 62732
##$YMIN_a= -110774
##$ZGOPTNS= <>
##$ZL1= 120
##$ZL2= 120
##$ZL3= 120
##$ZL4= 120
##$ABSF1= 10
##$ABSF2= 0
##$ABSG= 5
##$ABSL= 3
##$ALPHA= 0
##$AQORDER= 0
##$ASSFAC= 0
##$ASSFACI= 0
##$ASSFACX= 0
##$ASSWID= 0
##$AUNMP= <proc_1d>
##$AZFE= 0.1
##$AZFW= 0.1
##$BCFW= 1
##$BC_mod= 2
##$BYTORDP= 1
##$COROFFS= 0
##$CY= 11.3945322036743
##$DATMOD= 1
##$DC= 2
##$DFILT= <>
##$DTYPP= 0
##$F1P= 20.1720416913024
##$F2P= 0.152960286110954
##$FCOR= 0.5
##$FTSIZE= 0
##$FT_mod= 4
##$GAMMA= 1
##$GB= 0.15
##$INTBC= 1
##$INTSCL= 1
##$ISEN= 128
##$LB= 0.24
##$LEV0= 0
##$LPBIN= 0
##$MAXI= 10000
##$MC2= 0
##$MEAN= 0
##$ME_mod= 0
##$MI= 1.114404
##$NCOEF= 0
##$NC_proc= 0
##$NLEV= 6
##$NOISF1= 3.799351
##$NOISF2= 2.8
##$NSP= 1
##$NTH_PI= 0
##$NZP= 0
##$OFFSET= 15.70392
##$PC= 1
##$PHC0= -9567.324
##$PHC1= 11.00089
##$PH_mod= 1
##$PKNL= yes
##$PPARMOD= 0
##$PSCAL= 0
##$PSIGN= 0
##$REVERSE= no
##$SF= 200.130013532006
##$SI= 16384
##$SIGF1= 3
##$SIGF2= 2
##$SINO= 400
##$SIOLD= 16384
##$SREGLST= <1H.CDCl3>
##$SSB= 0
##$STSI= 0
##$STSR= 0
##$SW_p= 3612.71676300578
##$SYMM= 0
##$S_DEV= 0
##$TDeff= 0
##$TDoff= 0
##$TI= <>
##$TILT= no
##$TM1= 0
##$TM2= 0
##$TOPLEV= 0
##$USERP1= <user>
##$USERP2= <user>
##$USERP3= <user>
##$USERP4= <user>
##$USERP5= <user>
##$WDW= 1
##$XDIM= 8192
##$YMAX_p= 0
##$YMIN_p= 0
$$ End of Bruker specific parameters
$$ ---------------------------------
##NTUPLES= NMR FID
##VAR_NAME=  TIME,          FID/REAL,        FID/IMAG
##SYMBOL=    X,             R,               I
##VAR_TYPE=  INDEPENDENT,   DEPENDENT,       DEPENDENT
##VAR_FORM=  AFFN,          ASDF,            ASDF
##VAR_DIM=   8192,          8192,            8192
##UNITS=     SECONDS,       ARBITRARY UNITS, ARBITRARY UNITS
##FACTOR=    0.0002076,     1,               1
##FIRST=     0,             0,               0
##LAST=      1.7004516,     0,               0
##MIN=       0,             -110774,         0
##MAX=       1.7004516,     62732,           0
$$ Real data points
##PAGE= N=1
##DATA TABLE= (X++(R..R)), XYDATA
$$ plain form
0 0 0 0 0 0 0 0 0 0 8 -8 8 -8 8 -16 16 -18 24 -29 32 -40 48 -55 64 -72 82 -95 108 -122 138 -158 177 -201
32 -201 225 -250 282 -311 349 -387 428 -475 527 -584 644 -714 792 -877 976 -1087 1213 -1362
50 -1362 1536 -1744 1997 -2318 2739 -3308 4133 -5447 7874 -13896 62732 55303 -46679 16961
64 16961 48196 13111 -8606 39504 34478 -2686 3078 38732 19358 -50 16438 13186 -31551
77 -31551 -20301 42478 57497 17920 18752 38960 12335 -16230 19311 46487 6345 -25392 10111
90 10111 40621 22166 4848 6364 -9165 -25885 -13424 -5145 -19092 -7933 24027 12340 -27757
103 -27757 -15837 27107 15697 -30529 -30954 379 7736 6353 20428 16497 -13579 -21369 -5115
116 -5115 -10130 -26714 -16417 -4359 -23356 -31137 -2624 10133 -17882 -33526 -19926 -24957 -43451
$$ packed form
0@%%%%%%%%Qj6J6j6J6k4L2l4M2n3O1p2Q8j03J19j36J54j77K03k30K60k96L35l78
32b01M26m75N32n93O60p36Q15r03J002j111J228j358J506j669J853k063K300k575
50a362K898l280L741m315N057o047P441r580J3321k1770P6628p429j01982O3640
64A6961L1235l5085k1717M8110n026l7164N764L5654j9374j9408J6488l252m4737
77c1551J1250O2779J5019l9577Q32K0208k6625k8565L5541K7176m0142l1737L5503
90A0111L0510j8455j7318J516j5529j6720J2461Q279j3947J1159L1960j1687m0097
103b7757J1920M2944j1410m6226m25L1333P357j383J4075l931l0076p790J6254
116e115n015j6584J0297J2058j8997p781K8513J2757k8015j5644J3600n031j8494
$$ plain form
129 -43451 -23146 17402 14526 -19411 -25340 -5975 -1704 -10288 -13387 -20288 -29249 -19265 -2146 -3843
143 -3843 -13018 -8535 -11351 -35404 -46855 -26021 -6347 -12480 -22237 -18250 -13170 -11878 -5583 -3463
157 -3463 -16256 -29450 -24445 -9074 117 3023 2342 -6788 -17200 -17295 -11984 -12772 -17426 -16713 -15555
172 -15555 -17214 -13091 -1321 2879 -8033 -23850 -28991 -19098 -3190 5094 1746 -4319 -5131 -2011
186 -2011 537 1673 -973 -7906 -12532 -10891 -4287 5001 11179 6537 -8039 -18471 -15126 -6604 -1855
201 -1855 -449 -613 -3867 -5209 3533 13440 9830 -2864 -7824 -4687 -411 6397 15652 16211 6279
216 6279 -564 1082 1753 1030 4257 3075 -4595 -6459 6318 16113 11344 3630 -173 -4367 -5834
231 -5834 4545 15869 14019 6994 8090 11725 9620 10732 14056 7668 -3172 -1894 10050 15944
$$ packed form
129d3451K0305M0548k876l3937n929J9365M271q584l099o901q961R984J7119j697
143c843r175M483k816k4053j1451K0834J9674o133r757L987N080J292O295K120
157c463j2793j3194N005J5371R191K906o81r130j0412r5N311p88m654P13J158
172a5555j659M123J1770M200j0912j5817n141R893J5908Q284l348o065q12L120
186b011K548J136k646o933m626J641O604R288O178m642j4576j0432L345Q522M749
201a855J406j64l254j342Q742R907l610j2694m960L137M276O808R255N59r932
216F279o843J646O71p23L227j182p670j864J2777R795m769p714l803m194j467
231e834J0379J1324j850p025J096L635k105J112L324o388j0840J278J1944N894
$$ plain form
245 15944 15009 14429 8937 -2165 -5172 5188 12201 7127 3911 7625 8835 9072 15761 19814 9906
260 9906 -1551 908 8342 11740 16477 21185 14970 3693 3762 10802 10637 5457 4651 4083 1638 5681
276 5681 16552 18977 9204 1101 314 1176 3661 11405 16102 11060 5098 8169 12611 11575 8726
291 8726 6513 193 -3701 3183 12762 14778 9186 4786 303 -3905 -2054 4663 5645 369 -1538
306 -1538 2819 6286 8409 9327 5036 -4185 -8492 -3243 4108 6915 7094 4706 -895 -4312 -1887 1463
322 1463 -1614 -6815 -8903 -7353 -3479 2604 5646 1214 -7426 -11806 -10658 -6778 -2965 -657 -2000
337 -2000 -5301 -6241 -2208 532 -2699 -8190 -12823 -14445 -11529 -4102 1040 -1467 -7369 -11478 -12640
352 -12640 -11567 -9092 -8230 -10032 -12539 -10703 -5412 -1777 -1568 -6482 -11886 -16040 -14415 -8708 -3638
$$ packed form
245A5944r35n80n492j1102l007J0360P013n074l216L714J210K37O689M053r908
260I906j1457K459P434L398M737M708o215j1277O9P040j65n180q06n68k445M043
276E681J0871K425r773q103p87Q62K485P744M697n042n962L071M442j036k849
291H726k213o320l894O884R579K016n592m400m483m208J851O717R82n276j907
306a538M357L467K123R18m291r221m307N249P351K807J79k388n601l417K425L350
322A463l077n201k088J550L874O083L042m432q640m380J148L880L813K308j343
337b000l301r40M033K740l231n491m633j622K916P427N142k507n902m109j162
352a2640J073K475Q62j802k507J836N291L635K09m914n404m154J625N707N070
$$ plain form
367 -3638 -2651 -5615 -8183 -9122 -8134 -6218 -7756 -12155 -15187 -13715 -8420 -3072 -240 -2356 -7681 -12346
383 -12346 -12606 -9423 -5353 -3583 -5094 -6778 -5854 -1917 1214 -73 -5471 -10396 -12195 -8457 -2340
398 -2340 2227 2587 -1105 -5089 -6050 -4100 -2045 -1626 -3630 -5600 -4269 905 5711 7253 4061 -1394
414 -1394 -5289 -4936 -277 4212 5368 3768 2079 1491 3370 5118 3955 510 -2630 -2601 1055 6131
430 6131 10089 9327 5429 1270 561 2690 4664 5646 4922 4157 5594 8694 10573 9116 6111 2189
446 2189 -424 781 5424 9921 9882 7131 4723 4516 5599 6689 5955 2889 596 2775 7273 10873
462 10873 11452 9467 5081 857 334 4362 7333 7486 5629 4562 4552 5749 8225 7793 3078 -1794
478 -1794 -1715 1656 5385 8887 9189 5065 831 552 2900 3294 2851 2712 2186 1113 2662 6870 7945
$$ packed form
367c638R87k964k568r39R88J916j538m399l032J472N295N348K832k116n325m665
383a2346k60L183M070J770j511j684R24L937L131j287n398m925j799L738O117
398b340M567L60l692l984r61J950K055M19k004j970J331N174M806J542l192n455
414a394l895L53M659M489J156j600j689n88J879J748j163l445l140K9L656N076
430F131L958p62l898m159p09K129J974R82p24p65J437L100J879j457l005l922
446B189k613J205M643M497l9k751k408k07J083J090p34l066k293K179M498L600
462A0873N79j985m386m224n23M028K971J53j857j067j0J197K476m32m715m872
478a794P9L371L729L502L02m124m234k79K348L94m43j39n26j073J549M208J075
$$ plain form
495 7945 4201 -902 -3090 -2818 222 4460 5186 1621 -589 1089 2562 1239 192 -462 -2485 -3722
511 -3722 -429 4569 5148 2589 -141 -2104 -4493 -2791 963 1737 -1516 -2541 -874 670 1858 2014
527 2014 -1059 -6599 -7730 -2863 1285 669 255 729 -1801 -4938 -4153 -441 -537 -3472 -4652 -3837 -2551
544 -2551 708 3895 661 -6080 -7407 -4689 -3088 -2709 -949 -201 -3165 -4352 -2173 -403 -2842 -5006
560 -5006 -4489 -5272 -5482 -1816 2428 1285 -3173 -4916 -5172 -4599 -3505 -1164 -2420 -6154 -4458 722
576 722 820 -2834 -4535 -4481 -6234 -6761 -3242 325 -232 -2375 -2886 -3713 -4119 -2787 -601 -3379 -7014 -5345
594 -5345 -724 1229 -62 -728 -2791 -6784 -6322 -2245 -99 -2290 -2337 -1007 -1920 -2619 -969 604 -2380
611 -2380 -5684 -5049 -2672 -498 2309 3149 -540 -4332 -3378 44 -257 -1988 -1209 -405 -1519 -691 3063
$$ packed form
495G945l744n103k188K72L040M238P26l565k210J678J473j323j047o54k023j237
511c722L293M998N79k559k730j963k389J702L754P74l253j025J667J544J188J56
527B014l073n540j131M867M148o16m14M74k530l137P85L712r6k935j180Q15J286
544b551L259L187l234o741j327K718J601L79J760P48k964j187K179J770k439k164
560e006N17p83k10L666M244j143m458j743k56N73J094K341j256l734J696N180
576G22R8l654j701N4j753n27L519L567n57k143n11q27m06J332K186k778l635J669
594e345M621J953j291o66k063l993M62M077K146k191m7J330r13o99J650J573k984
611b380l304O35K377K174K807Q40l689l792R54L422l01j731P79Q04j114Q28L754
$$ plain form
628 3063 2943 -636 -2351 -2000 -2319 -1686 2443 4781 1987 -675 456 2409 1897 777 1593 -180 -1688
645 -1688 1452 6589 5684 2094 1681 2183 -285 -863 3214 5245 2585 1048 3460 4830 3480 3810
661 3810 3957 866 -1398 1337 5901 6380 4875 4631 3935 1478 1552 4468 4485 1842 1179 3895 4789 4812
679 4812 5516 5893 2456 -973 597 3639 4877 5211 4425 3266 2447 3725 4910 3286 1314 941 1539
696 1539 1959 3996 6146 5469 1878 -80 796 1606 1661 2537 2362 936 1086 2906 4380 2404 691
713 691 -23 -1475 -1745 1166 4411 3094 25 -188 839 -317 -1022 217 288 -2285 -3186 364 2722
730 2722 1592 -278 -1416 -3280 -4166 -2276 707 53 -2253 -1675 -736 -1468 -1941 -578 -1272 -4941 -5670
747 -5670 -2034 382 -854 -1107 -1214 -3353 -5342 -3429 -1462 -2520 -3958 -2966 -2499 -2287 -1216 -257 -1983
$$ packed form
628C063j20l579j715L51l19O33M129K338k794k662J131J953n12j120Q16j773j508
645a688L140N137r05l590m13N02k468n78M077K031k660j537K412J370j350L30
661C810J47l091k264K735M564M79j505k44o96k457P4K916J7k643o63K716Q94K3
679D812P04L77l437l429J570L042J238L34p86j159q19J278J185j624j972l73N98
696A539M20K037K150o77l591j958Q76Q10N5Q76j75j426J50J820J474j976j713
713F91p14j452k70K911L245j317l069k13J027j156p05J239P1k573r01L550K358
730B722j130j870j138j864q86J890K983o54k306N78R39p32m73J363o94l669p29
747e670L636K416j236k53j07k139j989J913J967j058j438R92M67K12J071R59j726
$$ plain form
764 -1983 -5533 -5499 -3311 -2531 -2330 -795 -549 -3504 -4502 -2129 -1281 -3257 -4430 -3064 -3146 -3355 -374 1477
782 1477 -1208 -3866 -3316 -2771 -3822 -2543 -151 -863 -3397 -2243 264 710 -1880 -1943 -1583 -3926 -3823
799 -3823 266 2163 261 -1433 -568 -1388 -2489 -1038 1043 -1229 -2525 -656 1348 754 375 1517
815 1517 -545 -3520 -2688 1167 1664 247 1209 1402 -380 -632 1835 1805 -1070 -1941 131 793 991 2716
833 2716 3853 477 -2112 -282 1260 513 292 1975 1183 -96 1396 3643 2704 -99 -595 329 -314
850 -314 759 3497 3827 814 -30 1836 1540 232 1012 1600 -75 -640 2083 4019 2958 1219 1089
867 1089 -78 -1214 821 3152 2248 1234 1181 2085 1420 1455 2459 1225 -1459 -1287 1880 2958 2271
884 2271 2604 2026 374 -685 820 1844 1011 502 1166 1315 1052 2477 3389 1437 -889 -925 297 1341
$$ packed form
764a983l550L4K188P80K01J535K46k955r98K373Q48j976j173J366q2k09K981J851
782A477k685k658N50N45j051J279K392p12k534J154K507M46k590o3L60k343J03
799c823M089J897j902j694Q65q20j101J451K081k272j296J869K004n94l79J142
815A517k062k975Q32L855M97j417R62J93j782k52K467l0k875q71K072O62J98J725
833B716J137l376k589J830J542p47k21J683p92j279J492K247r39k803m96R24o43
850c14J073K738L30l013q44J866k96j308P80N88j675n65K723J936j061j739j30
867A089j167j136K035K331r04j014n3R04o65L5J004j234k684J72L167J078o87
884B271L33n78j652j059J505J024q33n09O64J49k63J425R12j952k326l6J222J044
$$ plain form
902 1341 1861 2447 2222 132 142 1456 1416 503 394 333 -84 570 2342 2675 1529 -44 -448 -564 -494 995
922 995 1787 669 -19 692 1416 1235 728 -44 -1014 -1209 -496 1183 1501 1074 421 -146 -737 -878 51 494
942 494 -533 -1077 -540 252 939 705 25 -1482 -2557 -1773 -703 317 -32 -354 -745 -952 -625 -312 -862
961 -862 -1605 -1885 -2000 -1237 -383 795 -65 -1654 -2774 -2422 -1726 -904 -1040 -1475 -2173 -1789 -915 -482 -907
980 -907 -1850 -2550 -3007 -2556 -1214 -249 -480 -997 -2192 -2324 -2106 -885 -1617 -2073 -2660 -2473 -1242 -202 -103
999 -103 -811 -2386 -2765 -2730 -1809 -1199 -626 -846 -1291 -1686 -952 -446 -760 -1220 -2049 -2516 -1097 118 683 333
1019 333 -575 -1988 -1539 -1139 -597 -46 -626 -750 -512 206 843 679 -158 -1052 -1487 -1116 121 1383 1364
1038 1364 891 -159 -89 568 908 625 173 -403 419 929 2027 2218 1777 314 64 89 689 1488 1466 1471
$$ packed form
902A341N20N86k25k090J0J314m0r13j09o1m17O54J772L33j146j573m04j16P0J489
922I95P92j118o88P11P24j81n07p72r70j95P13J679L18m27o53n67n91j41R29M43
942D94j027n44N37P92O87k34o80j507j075P84J070J020l49l22l91k07L27L13n50
961h62p43k80j15P63Q54J178q60j589j120L52O96Q22j36m35o98L84Q74M33m25
980i07r43p00m57M51J342R65k31n17j195j32K18J221p32m56n87J87J231J040R9
999a03p08j575l79L5R21O10N73k20m45l95P34N06l14m60q29m67J419J215N65l50
1019C33r08j413M49M00N42N51n80j24K38P18O37j64q37q94m35L71J237J262j9
1038A364m73j050P0O57L40k83m52n76Q22N10J098J91m41j463k50K5O00P99k2N
$$ plain form
1058 1471 843 1037 1416 1979 1621 1093 141 81 1154 2338 2953 2084 1449 928 822 1340 1639 1521 1189
1077 1189 934 1065 1828 2382 2378 1426 409 34 399 1534 2085 1915 1716 1259 795 1126 1560 1120 475 -8
1097 -8 491 1125 1724 2123 1627 592 -215 -140 365 901 1127 483 89 165 732 1309 769 -129 -534 -771 -363
1118 -363 743 1374 1448 300 -334 -528 -87 107 5 -272 -753 -725 328 1064 915 -57 -844 -1307 -1454 -722
1138 -722 265 495 -342 -668 -400 -264 -215 -268 -1026 -1674 -1619 -618 41 202 322 -314 -1306 -1193 -985 -580 -589
1159 -589 -688 -1036 -758 -199 -211 106 -884 -1392 -1799 -1325 -595 237 362 -759 -947 -762 -672 -918 -988 -1139 -1116
1180 -1116 -1208 -249 423 312 -232 -1220 -1461 -1610 -755 -185 -79 -740 -675 -288 -229 -299 -74 -888 -1937 -1545 -689
1201 -689 32 359 26 13 -1034 -1190 -686 -10 -353 -540 -630 -711 -438 578 435 -556 -1499 -1385 -932 -641
$$ packed form
1058A471o28J94L79N63l58n28r52o0J073J184O15q69o35n21j06N18K99j18l32
1077A189k55J31P63N54mr52j017l75L65J135N51j70j99m57m64L31M34m40o45m83
1097hM99O34N99L99m96j035q07P5N05N36K26o44l94P6N67N77n40q98m05k37M08
1118c63J106O31P4j148o34j94M41J94j02k77m81K8J053P36j49r72p87m63j47P32
1138g22R87K30q37l26K68J36M9n3p58o48N5J001O59J61J20o36r92J13K08M05r
1159e89r9l48K78N59j2L17r90n08m07M74P30Q32J25j121j88J85R0k46p0j51K3
1180a116r2R59O72j11n44r88k41j49Q55N70J06o61O5L87N9p0K25q14j049L92Q56
1201f89P21L27l33j3j047j56N04O76l43j87r0q1K73J016j43r91r43J14M53K91
$$ plain form
1221 -641 264 558 64 -664 -501 -338 -74 -553 -439 -970 -682 -255 722 698 -169 -416 -568 -832 -803 391
1241 391 645 -500 -26 218 753 -110 231 6 -992 -1022 163 956 388 450 517 -79 -853 -42 983 399
1261 399 -783 -135 798 643 947 1285 779 -430 -557 416 441 510 938 1291 342 43 783 1323 503 -97
1281 -97 823 326 331 1481 2464 1444 177 174 284 501 427 1214 1127 -5 546 1882 1331 1176 889 761 49
1302 49 223 1619 2053 1175 880 1015 582 211 571 1361 219 -17 756 1280 1175 1148 1399 493 -596 -289
1322 -289 1285 889 898 673 752 26 106 998 886 -320 -679 73 377 466 818 1261 -175 -732 -288 121 -374
1343 -374 25 154 -143 -849 137 736 458 -500 -757 -614 -1158 -397 392 204 -515 -735 -595 -587 -660 -332 -644
1364 -644 -1168 -1322 -437 184 -525 -556 -842 -1459 -1610 -884 -276 -698 -1199 -1223 -814 -1080 -697 -798 -956 -1650 -1825
$$ packed form
1221f41R05K94m94p28J63J63K64m79J14n31K88M27R77k4q67k47j52k64K9J194
1241C91K54j145M74K44N35q63L41k25r98l0J185P93n68O2O7n96p74Q11J025n84
1261C99j182O48R33j55L04L38n06j209j27R73K5O9M28L53r49k99P40N40q20o00
1281i7R20m97NJ150R83j020j267lJ10K17p4P87q7j132N51J336n51j55k87j28p12
1302D9J74J396M34q78k95J35m33l71L60P90j142k36P73N24j05k7K51r06j089L07
1322b89J574l96Rk25P9p26Q0Q92j12j206l59P52L04Q9L52M43j436n57M44M09m95
1343c74L99J29k97p06R86N99k78r58k57J43n44P61P89j88p19k20J40Qp3L28l12
1364f44n24j54Q85O21p09l1k86o17j51P26O08m22n01k4M09k66L83j01j58o94j75
$$ plain form
1385 -1825 -1167 -428 -606 -225 -478 -1184 -1394 -795 -391 -441 -1050 -1087 -671 -574 -151 -126 -549 -1507 -1394 -1052 -599
1406 -599 -322 -201 -623 -606 -479 -193 -152 -517 -514 -770 -624 -383 291 172 147 -352 -984 -767 -317 70 -63 246
1428 246 53 -246 466 674 251 -266 -439 -343 -40 367 1083 671 342 -125 -71 346 196 403 377 -93 -111
1449 -111 838 1004 1107 654 -146 -175 -340 79 913 1049 346 183 499 291 544 778 481 56 -61 792
1469 792 860 955 872 967 -26 133 213 692 684 511 360 410 702 667 1017 264 -277 -95 340 304 875 776 507 28
1493 28 480 546 612 321 213 550 125 176 828 907 220 -28 -41 241 -113 413 596 420 -148 117 704 520
1515 520 75 -51 253 -248 -315 730 767 350 112 53 -178 -277 263 243 -296 -378 75 523 502 432 -12 -110 -288
1538 -288 -182 354 259 475 552 11 -278 27 382 54 -376 -705 -805 222 160 517 480 -425 -285 -232 228
$$ packed form
1385a825O58P39j78L81k53p06k10N99M04n0o09l7M16R7M23K5m23r58J13L42M53
1406e99K77J21m22J7J27K86M1l65Lk56J46K41O74j19k5m99o32K17M50L87j33L09
1428B46j93k99P12K08m23n17j73R6L03M07P16m12l29m67N4M17j50K07k6m70j8
1449a11R49J66J03m53q00k9j65M19Q34J36p03j63L16k08K53K34k97m25j17Q53
1469G92O8R5q3R5r93J59Q0M79qj73j51N0K92l5L50p53n41J82M35l6N71r9k69m79
1493B8M52O6O6k91j08L37m25N1O52P9o87k48j3K82l54N26J83j76n68K65N87j84
1515E20m45j26L04n01o7J045L7m17k38n9k31r9N40k0n39q2M53M48k1p0m44r8j78
1538b88J06N36r5K16P7n41k89L05L55l28m30l29j00J027o2L57l7r05J40N3M60
$$ plain form
1559 228 155 75 189 -103 -224 171 555 -11 -351 -462 -305 -135 -426 361 283 -320 -186 -287 -543 -467 -101
1580 -101 -555 -556 -182 -204 193 -58 -304 -468 -856 -667 -216 20 -27 -483 -496 -713 -309 -386 -76 -780 -892 -964
1602 -964 -426 -104 -179 -222 -468 -746 -620 -717 -435 -138 -778 -207 -371 -329 -52 -507 -814 -1049 -942 -442 -376 97
1624 97 39 -474 -569 -709 -595 81 -316 -569 -267 -632 -358 386 148 -348 -571 -584 -522 -373 137 7 -59 -168
1646 -168 231 -110 -122 -77 -189 -379 -197 104 431 322 309 178 271 -25 409 240 243 -22 447 87 417 510
1668 510 295 358 -198 44 5 287 769 726 374 83 4 561 473 528 416 383 105 410 734 725 554 282 105
1691 105 108 152 758 796 293 644 373 778 890 643 278 175 381 399 746 785 726 601 310 -167 265 346 176
1714 176 468 118 461 537 777 548 640 62 -269 275 264 155 374 275 253 -38 131 451 109 -148 -37 -296
$$ packed form
1559B28p3q0J14k92j21L95L84n66l40j11J57J70k91P87p8o03J34j01k56P6L66
1580a01m54jL74k2L97k51k46j64l88J89M51K36m7m56j3k17M04p7L10p04j12p2
1602i64N38L22p5m3k46k78J26r7K82K97o40N71j64M2K77m55l07k35J07N00O6M73
1624I7n8n13r5j40J14O76l97k53L02l65K74P44k38m96k23j3O2J49N10j30o6j09
1646a68L99l41j2M5j12j90J82L01L27j09j3j31R3k96M34j69Lk65M69l60L30R3
1668E10k15O3n56K42l9K82M82m3l52k91p9N57q8N5j12l3k78L05L24rj71k72j77
1691A05LM4O06L8n03L51k71M05J12k47l65j03K06J8L47L9n9j25k91m77M32Q1j70
1714A76K92l50L43P6K40k29R2n78l31N44j1j09K19r9k2k91J69L20l42k57J11k59
$$ plain form
1736 -296 104 436 418 267 87 -512 -516 -208 -198 313 -455 -69 -226 412 -62 -163 -348 -465 -489 -457 -119 10
1758 10 -51 25 -143 -515 -665 -321 -391 -585 -425 -356 -136 277 -121 -405 -353 -590 -862 -380 -411 82 -187 -310
1780 -310 -401 32 -235 -261 -711 -482 -726 -45 163 -179 43 -321 -442 -548 -142 -184 -455 -252 -556 -248 55
1801 55 84 -70 18 -479 -567 -312 -100 153 -159 -150 -446 -261 -611 -162 -5 88 -317 -180 78 3 356 53 -195
1824 -195 -331 -312 148 -62 9 -158 159 65 -114 100 40 34 -546 -56 163 108 246 157 -1 -87 -267 -176 60
1847 60 -367 20 -190 -86 -16 231 288 -149 -177 -473 -127 14 52 232 -54 -525 309 170 -71 169 183 -152
1869 -152 -34 107 520 500 272 17 -279 -32 508 231 -22 -183 295 -78 404 -72 318 -149 -361 -7
1889 -7 -99 249 178 629 483 123 192 92 95 252 200 -166 36 232 452 514 208 76 41 234 161 290 291 309 166
$$ packed form
1736b96M00L32j8j51j80n99mL08J0N11p68L86j57O38m74j01j85j17k4L2L38J29
1758A0o1P6j68l72j50L44p0j94J60O9K20M13l98k84N2k37k72M82l1M93k69j23
1780c10r1M33k67k6m50K29k44O81K08l42K22l64j21j06M06m2k71K03l04L08L03
1801E5K9j54Q8m97q8K55K12K53l12Rk96J85l50M49J57R3m05J37K58p5L53l03k48
1824a95j36J9M60k10P1j67L17r4j79K14o0on80M90K19n5J38q9j58q6j80R1K36
1847F0m27L87k10J04P0K47N7m37k8k96L46J41L8J80k86m71Q34j39k41K40J4l35
1869a52J18J41M13k0k28k55k96K47N40k77k53j61M78l73M82m76L90m67k12L54
1889gr2L48p1M51j46l60O9j00LJ57n2l66K02J96K20O2l06j32l5J93p3J29JJ8j43
$$ plain form
1914 166 290 451 419 246 291 40 107 339 623 487 574 181 -135 33 304 547 279 223 37 49 480 456
1936 456 304 362 -159 64 138 376 499 329 197 -125 -255 111 338 192 102 -7 57 87 68 60 30 246 -17
1959 -17 -250 -22 261 264 -106 -218 45 -72 -275 -9 -444 -188 -443 -145 411 52 205 55 -347 -190 -203
1980 -203 -125 -307 -244 -356 -239 -166 -69 129 -213 -671 -731 -734 -224 -247 87 -533 -320 -377 -371 -92 -174 -571 -694 -392
2004 -392 -395 -263 -258 -242 -620 -707 -273 9 -277 -199 -395 -171 -427 -275 -193 13 -509 -373 -489 -245 -20 -204 -179
2027 -179 -230 -132 -262 45 -91 -241 73 -529 -485 63 -67 -124 190 -70 -194 -132 186 377 47 -57 159 -50
2049 -50 -62 237 -13 -345 -352 -193 297 32 198 402 329 -75 -44 313 145 177 124 362 -90 119 336 10 -2
2072 -2 0 170 -165 295 466 183 156 -7 290 244 239 380 -23 125 -188 269 680 207 259 378 -59 10 370
$$ packed form
1914A66J24J61l2j73M5k51O7K32K84j36Q7l93l16J68K71K43k68n6j86J2M31k4
1936D56j52N8n21K23P4K38J23j70j32l22j30L66K27j46r0j09O4L0j9ql0K16k63
1959a7k33K28K83Ll70j12K63j17k03K66m35K56k55K98N56l59J53j50m02J57j3
1980b03P8j82O3j12J17P3R7J98l42m58o0lN10k3L34o20K13n7OK79q2l97j23L02
2004c92lJ32NJ6l78q7M34K82k86P8j96K24k56J52Q2K06n22J36j16K44K25j84K5
2027a79n1R8j30L07j36j50L14o02M4N48j30n7L14k60j24O2L18J91l30j04K16k09
2049e0j2K99k50l32pJ59M90k65J66K04p3m04L1L57j68L2n3K38m52K09K17l26j2
2072bKJ70l35M60J71k83k7j63K97m6nJ41m03J48l13M57M11m73N2J19m37O9L60
$$ plain form
2095 370 189 223 480 164 240 295 45 224 317 80 -39 345 479 -5 78 240 115 -43 234 166 25 78
2117 78 2 234 314 409 203 -64 159 -96 -245 -109 144 346 98 -269 -227 30 -99 -80 -126 -128 -354 -49 400
2140 400 61 -2 -51 39 -199 20 -151 62 77 -348 73 -162 130 23 74 169 -364 -108 134 90 196 -46
2162 -46 -70 -277 124 26 219 -76 -12 -147 25 235 22 275 -283 -315 -329 -116 -324 69 -26 -312 -196 -8
2184 -8 107 142 -22 -222 21 122 67 356 122 -83 -295 17 52 54 -66 -115 -50 -84 -214 -128 -40 -91 -53 -52 -45 -278
2210 -278 -31 82 150 -70 -29 75 -54 -122 87 12 -98 -5 256 -45 -176 -627 56 -372 -280 14 -131 168
2232 168 36 -154 -25 -76 -109 -60 -47 -386 -283 -69 -41 -159 -290 -284 -167 -149 205 -388 39 -159 -37 -3 -41
2255 -41 38 -211 8 -203 -173 -95 258 302 -14 -203 -321 -100 -49 86 141 -230 38 -138 -360 -137 33 -175
$$ packed form
2095C70j81L4K57l16P6N5k50J79R3k37j19L84J34m84Q3J62j25j58K77o8j41N3
2117G8p6K32Q0R5k06k67K23k55j49J36K53K02k48l67M2K57j29J9m6kk26L05M49
2140D00l39o3m9R0k38K19j71K13J5m25M21k35K92j07N1R5n33K56K42m4J06k42
2162d6k4k07M01r8J93k95O4j35J72K10k13K53n58l2j4K13k08L93r5k86J16J88
2184hJ15L5j64k00K43J01n5K89k34k05k12L12L5Kj20m9O5l4j30Q6Q8n1L8JPk33
2210b78K47J13O8k20M1J04j29o8K09p5j10R3K61l01j31m51O83m28R2K94j45K99
2232A68j32j90J29n1l3M9J3l39J03K14K8j18j31OJ17J8L54n93M27j98J22L4l8
2255d1P9k49K19k11L0P8L53M4l16j89j18K21N1J35N5l71K68j76k22K23J70k08
$$ plain form
2277 -175 -103 -240 -36 149 341 -199 223 -70 147 319 73 300 70 -215 67 73 321 429 416 -80 24
2298 24 307 -231 211 276 103 457 187 518 -91 198 222 363 226 308 282 -122 21 100 248 234 226 299 24
2321 24 132 171 300 187 186 296 12 67 4 193 142 103 244 117 -218 281 149 102 14 22 289 -5 361 112
2345 112 97 -75 49 150 -83 182 -2 239 -242 168 280 73 -30 506 -160 -317 -306 -67 -48 -109 -175 225
2367 225 -129 -63 -88 -102 79 -384 -190 50 129 -51 30 -77 77 -265 138 -94 -62 -525 -183 -127 60 -173
2389 -173 -286 -98 -283 -478 -122 -56 -53 -80 -88 -203 -335 -283 -5 -299 -85 -195 -257 -213 -140 10 -90 37 91 -66
2413 -66 -233 188 -243 -29 -232 -22 -34 -82 -41 -375 -50 158 -100 62 -236 245 113 -161 -477 71 -24 130
2435 130 -99 -289 -23 -50 89 43 43 -199 -186 -353 -42 169 52 -95 201 -88 -195 162 -64 -73 -194 122
$$ packed form
2277a75P2j37K04J85J92n40M22k93K17J72k46K27k30k85K82OK48J08j3m96J04
2298B4K83n38M42O5j73L54k70L31o09K89K4J41j37Q2k6m04J43P9J48j4qP3k75
2321B4J08L9J29j13jJ10k84N5o3J89n1l9J41j27l35M99j32m7q8QK67k94L66k49
2345A12j5j72J24J01k33K65j84K41m81M10J12k07j03N36o66j57J1K39J9o1o6M00
2367B25l54O6k5j4J81m63J94K40P9j80Q1j07J54l42M03k32L2m63L42N6J87k33
2389a73j13J88j85j95L56O6Lk7qj15j32N2K78k94K14j10o2M4P3J50j00J27N4j57
2413f6j67M21m31K14k03K10j2m8M1l34L25K08k58J62k98M81j32k74l16N48r5J54
2435A30k29j90K66k7J39m6%k42J3j67L11K11j17j47K96k89j07L57k26rj21L16
$$ plain form
2457 122 9 106 116 -16 106 47 -58 -130 175 271 -48 74 80 208 249 38 334 53 -6 -202 31 167 93
2480 93 19 -239 295 -30 118 100 -456 134 206 -26 165 111 -336 -288 -46 -166 117 132 353 88 -96 340
2502 340 15 338 30 67 62 66 136 -25 167 70 -225 -220 -90 62 -128 -300 49 -164 196 100 -49 114 18 186
2526 186 -79 316 364 243 51 59 195 -16 253 -13 -250 234 -257 -41 82 64 274 -129 -189 66 46 166
2548 166 -51 302 23 -32 231 244 18 -77 55 259 -6 139 109 18 130 -13 30 -303 165 130 65 -42 -107
2571 -107 224 -90 -131 -26 -117 -222 -182 41 177 -67 -134 -16 -80 -13 80 189 -232 -16 -132 -48 153 -87 -176
2594 -176 88 -93 -164 -213 -113 -18 -141 -236 -6 -247 80 -84 36 -228 -295 -395 -248 243 -404 -144 -258 69
2616 69 -167 -96 57 -206 -289 24 106 -198 -244 -58 -140 -258 -138 -254 -27 -4 -233 -69 -150 -204 -179 -220 162 -117
$$ packed form
2457A22j13R7J0j32J22n9j05p2L05R6l19J22OJ28M1k11K96k81n9j96K33J36p4
2480I3p4k58N34l25J48j8n56N90P2k32J91n4m47M8K42j20K83J5K21k65j84M36
2502C40l25L23l08L7nMP0j61J92r7k95NJ30J52j90j72L49k13L60r6j49J63r6J68
2526A86k65L95M8j21j92QJ36k11K69k66k37M84m91K16J23j8K10m03o0K55k0J20
2548A66k17L53k79n5K63J3k26r5J32K04k65J45l0r1J12j43M3l33M68l5o5j07o5
2571a07L31l14m1J05r1j05M0K23J36k44o7J18o4O7R3J09m21K16j16Q4K01k40q9
2594a76K64j81p1m9J00R5j23r5K30k41L27j64J20k64o7j00J47M91o47K60j14L27
2616F9k36P1J53k63q3L13Q2l04m6J86q2j18J20j16K27K3k29J64q1n4K5m1L82k79
$$ plain form
2640 -117 -75 -197 -359 -170 76 -6 151 -294 -168 -132 25 -54 85 -322 17 -105 32 -93 -88 75 -247 -218
2662 -218 131 -67 -26 57 47 115 -134 -45 49 -94 -323 11 143 -29 373 135 -121 -28 297 37 -174 -45
2684 -45 95 164 58 245 -12 199 -171 349 -74 100 519 112 177 48 -95 124 -3 369 115 111 -33 68
2706 68 86 -2 7 65 288 -93 233 50 12 -84 86 124 106 230 173 74 -15 -110 130 238 90 -88 -123 -149 69
2731 69 -56 7 73 278 -29 -35 27 -10 213 191 -35 -244 6 21 258 -12 23 139 32 76 23 -355 -175 239
2755 239 -123 132 1 -246 92 -75 -59 -57 -189 18 -52 -206 -18 158 -356 43 -4 104 -284 -274 -328 -250 -112
2778 -112 -104 147 -92 159 63 227 -226 112 54 -15 -57 20 -47 195 -133 -57 -135 -84 10 115 11 57 -8 86 7
2803 7 -39 -40 289 42 -68 -26 -53 154 -10 -337 302 -204 90 -25 151 -1 62 6 25 241 185 18 -15 -193
$$ packed form
2640a17M2j22j62J89K46q2J57m45J26L6J57p9J39m07L39j22J37j25NJ63l22K9
2662b18L49j98M1Q3j0O8k49Q9R4j43k29L34J32j72M02k38k56R3L25k60k11J29
2684d5J40O9j06J87k57K11l70N20m23J74M19m07O5j29j43K19j27L72k54mj44J01
2706F8J8q8RN8K23l81L26j83l8r6J70L8j8J24n7r9q9r5K40J08j48j78l5k6K18
2731F9j25O3O6K05l07oO2l7K23k2k26k09K50J5K37k70L5J16j07M4n3l78J80M14
2755B39l62K55j31k47L38j67J6Kj32K07p0j54J88J76n14L99m7J08l88J0n4P8J38
2778a12QK51k39K51r6J64m53L38n8o9m2P7o7K42l28P6p8N1R4J05j04M6o5R4p9
2803Gm6jL29k47j10M2k7K07j64l27O39n06K94j15J76j52O3n6J9K16n6j67l3j78
$$ plain form
2827 -193 -42 59 219 175 15 174 -45 114 48 209 123 -126 -55 220 31 -220 -69 -180 -397 119 454
2848 454 210 -115 -47 -54 279 46 107 -39 -153 -198 127 53 250 134 11 -235 -137 -94 163 -211 124 -2 33
2871 33 -32 -25 -45 -448 -65 -318 -39 111 22 211 130 -372 -58 -163 24 172 16 -123 45 -63 26 -221 94
2894 94 100 139 59 -20 113 -196 -123 -194 -207 -33 -151 -9 7 29 -16 -95 41 -13 126 -57 61 -158 252 111 83
2919 83 67 -13 -235 56 24 212 -97 -144 129 44 -143 122 -16 294 -93 14 -20 156 -65 222 -151 53
2941 53 327 137 95 138 311 136 23 -171 -30 32 198 -136 102 -95 200 37 182 -152 241 86 -274
2962 -274 25 205 183 155 37 -102 34 367 -50 -42 -41 201 19 -372 295 -309 -186 -12 52 60 -5 80 -61 -52
2986 -52 340 -116 -3 99 -250 118 3 75 -76 210 83 -125 -145 101 -155 -185 299 -215 325 -299 -102
$$ packed form
2827a93J51J01J60m4j60J59k19J59o6J61q6k49P1K75j89k51J51j11k17N16L35
2848D54k44l25O8pL33k33O1j46j14m5L25p4J97j16j23k46R8M3K57l74L35j26L5
2871C3o5Pk0m03L83k53K79J50q9J89q1n02L14j05J87J48j56j39J68j08Q9k47L15
2894I4OL9q0p9J33l09P3p1j3J74j18J42J6K2m5p9J36n4J39j83J18k19M10j41k8
2919H3j6q0k22K91l2J88l09m7K73q5j87K65j38L10l87J07l4J76k21K87l73K04
2941E3K74j90m2M3J73j75j13j94J41O2J66l34K38j97K95j63J45l34L93j55l60
2962b74K99J80k2k8j18j39J36L33m17QJK42j82l91O67o04J23J74O4Qo5Q5j41R
2986e2L92m56J13J02l49L68j15P2j51K86j27k08k0K46k56l0M84n14N40o24J97
$$ plain form
3007 -102 -201 15 -15 -139 -139 211 271 -218 -106 -65 -101 -61 -79 56 -395 -69 -141 -75 -69 21 29 -47 -153 -117 12 -49
3033 -49 -20 -199 -14 53 194 52 -4 81 143 -284 -121 -28 81 54 -197 -44 -207 -156 149 -18 189 121 -33
3056 -33 -127 78 -318 -184 -59 -111 84 -303 230 -107 12 -230 77 3 36 -240 -240 187 -278 -5 22 71 334
3079 334 -22 -180 121 391 -111 -352 -122 -39 -37 135 73 -280 47 164 -32 -76 101 -115 4 134 -20 -52
3101 -52 253 46 -80 96 -28 164 -315 74 -216 187 -7 67 143 37 -3 -113 -11 107 10 13 54 436 -15
3124 -15 -199 -211 21 163 137 -72 205 -62 215 50 2 262 36 -56 176 167 113 -5 33 -107 -86 -144 -128 81
3148 81 109 387 -113 198 -56 52 46 -54 167 -228 -294 -161 -147 177 -63 -42 96 -82 256 -65 108 -27
3170 -27 -62 -313 254 -9 -392 -88 -276 -293 -51 -58 23 180 -37 -8 46 -51 -32 -7 -106 126 23 -27 -103 -45 -9
$$ packed form
3007a02r9K16l0j24%L50O0m89J12M1l6M0j8J35m51L26p2O6OR0Qp6j06L6J29o1
3033d9K9j79J85O7J41j42n6Q5O2m27J63R3J09k7k51J53j63N1L05j67K07o8j54
3056c3r4K05l96J34J25n2J95l87N33l37J19k42L07p4L3k76%M27m65K73K7M9K63
3079C34l56j58L01K70n02k41K30Q3KJ72o2l53L27J17j96m4J77k16J19J30j54l2
3101e2L05k07j26J76j24J92m79L89k90M03j94P4P6j06m0j10J02J18r7LM1L82m51
3124a5j84j2K32J42k6k09K77k67K77j65m8K60k26r2K32rn4j18L8j40K1n8J6K09
3148H1K8K78n00L11k54J08oj00K21l95o6J33J4L24k40K1J38j78L38l21J73j35
3170b7l5k51N67k63l83L04j88j7K42pQ1J57k17K9N4r7J9K5r9K32j03n0p6N8L6
$$ plain form
3195 -9 33 -204 249 -129 73 -130 18 -127 -168 395 -56 -7 -23 11 82 147 27 159 -394 -169 -52 209 114
3218 114 -206 73 83 210 -105 117 192 -67 221 168 -238 -110 -165 145 343 -108 -207 96 -75 -227 22 -49
3240 -49 -222 -10 -10 136 263 -201 -167 -24 -65 -93 9 -174 90 -65 -24 -18 -222 -123 -113 -260 -19 -17 77 -26 -8
3265 -8 -6 -64 -254 -104 241 93 -144 -176 31 -80 119 61 180 23 33 57 117 157 7 76 -10 -83 -110 -179 139
3290 139 38 -221 -18 -223 272 24 -328 -194 232 -46 84 126 38 68 -217 71 -121 177 -22 140 -82
3311 -82 67 -22 -68 72 -70 -70 -270 300 86 -78 -30 554 -60 57 17 38 -210 -189 -121 -99 55 166 -110 106
3335 106 49 -203 91 92 233 91 109 -150 117 196 175 0 -13 -198 150 177 -80 -71 -176 -219 -199 -172 -92 170 -205
3360 -205 -146 -60 31 47 -191 -33 54 -86 -78 24 -14 -78 82 114 28 109 46 146 -230 -503 14 -72 5 86 -308
$$ packed form
3195iM2k37M53l78K02k03J48j45m1N63m51M9j6L4P1O5j20J32n53K25J17K61r5
3218A14l20K79J0J27l15K22P5k59K88n3m06J28n5L10J98m51r9L03j71j52K49p1
3240d9j73K12%J46J27m64L4J43m1k8J02j83K64j55M1Ok04R9J0j47K41KR4j03J8
3265hKn8j90J50L45j48k37l2K07j11J99n8J19j57J0K4O0M0j50O9q6p3k7o9L18
3290A39j01k59K03k05M95k48l52J34M26k78J30M2q8L0k85K88j92K98j99J62k22
3311h2J49q9m6J40j42%k00N70k14j64M8N84o14J17m0K1k48K1O8K2J54J11k76K16
3335A06n7k52K94JJ41j42J8k59K67P9k1j75j3j85L48K7k57Rj05m3K0K7Q0K62l75
3360b05N9Q6R1J6k38J58Q7j40QJ02l8o4J60L2q6Q1o3J00l76k73N17q6P7Q1l94
$$ plain form
3385 -308 248 -294 131 -40 -294 -169 -310 -385 -88 -76 416 171 142 -14 -321 -201 323 -113 -42 -177 -215 -1
3407 -1 -61 -83 -34 -265 -288 -98 72 80 -42 -16 -47 40 151 -64 53 133 -264 159 70 -222 -145 151 -173 180 -65
3432 -65 -34 -110 106 -73 -197 212 -64 -126 126 84 307 -350 38 233 -382 -53 -222 155 -188 50 24 -46
3454 -46 260 29 84 -73 78 -212 -60 104 32 278 111 -58 -16 48 183 21 -135 -371 52 86 -157 -57
3476 -57 27 -108 -109 15 -87 166 336 -94 15 380 -64 6 325 187 279 117 12 128 -213 -63 -142 -56 361
3499 361 229 -54 -146 -47 -151 -431 265 -27 -55 191 412 -133 57 106 -323 -21 -307 220 -72 200 -59
3520 -59 82 -288 -225 -92 55 -66 -76 -60 18 168 236 -35 -152 192 -140 113 -49 221 -36 190 39 90
3542 90 274 97 -37 -31 70 146 -101 -27 77 340 -122 -50 163 -13 -45 -223 69 20 -90 191 11 38 -74
$$ packed form
3385c08N56n42M25j71k54J25j41p5K97J2M92k45k9j56l07J20N24m36P1j35l8K14
3407ao0k2M9k31k3J90J70Qj22K6l1Q7J11k15J17Q0l97M23q9k92P7K96l24L53k45
3432f5L1p6K16j79j24M09k76o2K52m2K23o57L88J95o15L29j69L77l43K38k6p0
3454d6L06k31N5j57J51k90J52J64p2K46j67j69M2O4J35j62j56k36M23L4k43J00
3476e7Q4j35jJ24j02K53J70m30J09L65m44P0L19j38R2j62j05J16l41J50p9Q6M17
3499C61j32k83r2R9j04k80O96k92k8K46K21n45J90M9m29L02k86N27k92K72k59
3520e9J41l70O3J33J47j21j0J6P8J50O8k71j17L44l32K53j62K70k57K26j51N1
3542I0J84j77j34OJ01P6k47P4J04K63m62P2K13j76l2j78K92m9j10K81j80K7j12
$$ plain form
3565 -74 160 19 -91 -150 143 110 116 -61 31 -171 75 -54 -174 12 -239 -160 296 215 -57 140 49 89 166 208
3589 208 -39 214 136 161 134 -446 232 -297 -217 69 -75 114 361 59 -40 123 -32 141 -108 -35 262 64
3611 64 -185 302 -246 185 -66 -84 -171 -75 86 -120 -104 -264 341 -83 63 147 63 42 -152 22 -110 102 41
3634 41 -4 4 13 139 -162 -165 64 15 -135 252 -96 -35 -261 240 115 173 33 -200 -110 159 -154 -145 62 -97 35
3659 35 -222 -134 62 -74 258 210 -252 275 31 -166 122 176 -115 -26 44 -52 20 -94 -360 -110 -248 -49 46
3682 46 -144 181 -48 -16 5 -174 -88 279 -306 -4 76 97 84 176 38 -121 -55 -15 236 62 41 73 23 -115
3706 -115 231 6 -258 155 69 -234 -220 337 -45 47 75 -205 106 94 -72 143 -235 -105 180 89 44 -97
3728 -97 107 26 -103 193 -69 -253 31 -169 189 32 12 24 52 -25 278 106 287 383 41 69 -71 -84 -163
$$ packed form
3565g4K34j41j10n9K93l3Oj77R2k02K46j29j20J86k51P9M56q1k72J97r1M0P7M2
3589B08k47K53p8K5k7n80O78n29Q0K86j44J89K47l02r9J63j55J73k49P3K97j98
3611F4k49M87n48M31k51j8q7R6J61k06J6j60O05m24J46Q4q4k1j94J74j32K12o1
3634D1m5QRJ26l01lK29m9j50L87l48O1k26N01j25N8j40k33R0K69l13RK07j59J32
3659C5k57Q8J96j36L32m8m62N27k44j97K88N4k91Q9P0r6P2j14k66K50j38J99R5
3682D6j90L25k29L2K1j79Q6L67n85L02Q0K1j3R2j38j59O6M0K51j74k1L2n0j38
3706a15L46k25k64M13q6l03J4N57l82R2K8k80L11j2j66K15l78J30K85r1m5j41
3728i7K04q1j29K96k62j84K84k00L58j57k0J2K8p7L03j72J81R6l42K8j40j3p9
$$ plain form
3751 -163 -11 130 -62 20 33 -140 -46 -25 -2 97 -28 -275 -101 34 166 -184 128 184 -159 239 184 -221 -263
3774 -263 -36 -84 65 9 9 60 256 267 -62 70 102 236 204 155 -58 6 57 5 11 -153 36 105 40 -3 12 81
3800 81 -119 -38 -203 -66 286 -124 -125 203 -182 -183 130 190 88 -19 139 21 154 554 10 18 230 -25 -74
3823 -74 192 449 40 -129 -250 -44 108 385 141 -89 147 21 -88 -80 175 384 58 -100 54 -66 -118
3844 -118 172 -195 -3 -170 139 17 -77 9 -244 -43 -28 -115 -267 -98 13 -57 -145 29 102 25 -221 -149 26
3867 26 204 130 45 177 114 315 -269 74 -23 166 153 -40 -124 -64 -47 -225 -167 -249 -57 -169 347 -14 99 -103
3891 -103 -21 -55 36 -91 -282 -174 3 159 -76 16 -171 219 -23 134 183 195 -120 23 -148 -308 39 65
3913 65 39 98 201 -336 113 -68 -44 -3 -208 -102 -55 -113 41 158 -39 125 -135 -74 118 123 480 53 2 99
$$ packed form
3751a63J52J41j92Q2J3j73R4K1K3R9j25k47J74J35J32l50L12N6l43L98n5m05m2
3774b63K27m8J49n6%N1J96J1l29J32L2J34l2m9k13O4N1n2Oj64J89O9o5m3J5O9
3800H1k00Q1j65J37L52m10jL28l85jL13O0j02j07J58j18J33M00n44QK12k55m9
3823g4K66K57m09j69j21K06J52K77k44k30K36j26j09QK55K09l26j58J54j20n2
3844a18K90l67J92j67L09j22r4Q6k53K01J5q7j52J69J11p0q8J74P3p7k46P2J75
3867B6J78p4q5J32o3K01n84L43r7J89j3j93q4O0J7j78N8q2J92j12N16l61J13k02
3891a03Q2l4R1j27j91J08J77J56k35R2j87L90k42J57M9J2l15J43j71j60L47K6
3913F5k6N9J03n37M49j81K4M1k05J06M7n8J54J17j97J64k60O1J92NL57m27n1R7
$$ plain form
3937 99 324 -42 101 19 92 16 265 112 34 -226 208 -209 207 118 140 -184 70 283 13 171 -377 5
3959 5 170 184 4 -163 -75 145 19 -170 -214 44 -283 289 -5 -35 -28 54 -174 81 -105 -147 -97 -417 204 185
3983 185 -97 244 -142 104 -256 -200 -97 83 -51 52 81 -225 -99 24 142 -93 321 54 137 154 305
4004 305 328 -66 -92 162 84 220 -77 -106 -232 -381 -163 282 -3 -105 37 201 -94 -87 206 255 4 -204
4026 -204 82 -238 323 117 -278 259 93 169 26 -35 -38 -368 -227 -188 -81 -21 174 185 54 1 -14 -349 2
4049 2 -211 -197 -10 13 199 61 -64 -209 54 -88 -108 -66 -22 -56 192 -77 277 54 -214 -140 17 53 222
4072 222 117 60 153 -85 -14 -108 -79 -132 -112 83 293 36 23 -402 237 -117 19 288 206 -174 -140 29 275
4095 275 129 -100 65 -85 -43 288 56 38 -92 -172 -13 -197 -24 -202 181 69 166 -291 193 -94 -2 -82
$$ packed form
3937I9K25l66J43q2P3p6K49j53p8k60M34m17M16q9K2l24K54K13k70J58n48L82
3959EJ65J4j80j67Q8K20j26j89m4K58l27N72k94l0PQ2k28K55j86m2N0l20O21j9
3983A85k82L41l86K46l60N6J03J80j34J03K9l06J26J23J18k35M14k67Q3J7J51
4004C05K3l94k6K54p8J36k97k9j26j49K18M45k85j02J42J64k95PK93M9k51k08
4026b04K86l20N61k06l95N37j66P6j43o1ll30J41L9J07O0J95J1j31n3j5l35L51
4049Bk13J4J87K3J86j38j25j45K63j42k0M2M4l4K48k69L54k23k68P4J57L6J69
4072B22j05n7R3k38P1r4K9n3K0J95K10k57j3m25O39l54J36K69q2l80L4J69K46
4095B75j46k29J65j50M2L31k32j8j30q0J59j84J73j78L83j12R7m57M84k87R2q0
$$ plain form
4117 -82 -162 -174 -92 187 -308 -9 159 -174 -21 -20 -72 -187 69 -16 -314 -352 -193 -30 -115 78 -45 -53 132 -254
4141 -254 236 -62 164 -36 379 146 56 -88 153 -9 18 32 -13 -262 -59 157 35 281 86 186 262 -44
4163 -44 247 222 -26 53 4 45 62 449 118 -19 -114 87 -127 -78 114 293 168 372 56 -28 169 66 -226
4186 -226 -261 67 47 -73 253 -67 255 114 42 62 -92 184 -215 -19 33 -178 -63 9 -151 165 37 -93
4208 -93 174 -90 427 45 -147 252 11 -208 -289 83 -158 -12 80 -17 -45 -50 -212 121 280 27 30 -195 -64
4231 -64 -79 158 7 99 -71 -122 -4 186 -289 -14 82 -222 82 -36 72 171 31 -128 -3 -76 143 16
4253 16 -167 191 76 129 4 73 -25 195 -250 -13 55 -328 190 -84 154 -105 -313 143 -70 -85 86 138
4275 138 -68 105 20 -189 -44 75 64 -288 -68 -4 -155 153 -29 -12 -108 -242 -169 -131 -232 -144 95 39 -194
$$ packed form
4117h2q0j2Q2K79m95K99J68l33J53Jn2j15K56q5k98l8J59J63q5J93j23qJ85l86
4141b54M90k98K26k00M15k33r0j44K41j62K7J4m5k49K03K16j22K46j95J00P6l06
4163d4K91k5k48P9m9M1J7L87l31j37r5K01k14M9J92J79j25K04l16q4J97j03k92
4186b26l5L28k0j20L26l20L22j41p2K0j54K76l99J96N2k11J15P2j60L16j28j30
4208i3K67k64N17l82j92L99k41k19q1L72k41J46R2r7k8nj62L33J59k53Lk25J31
4231f4j5K37j51R2j70n1J18J90m75K75R6l04L04j18J08R9j40j59J25p3K19j27
4253A6j83L58j15N3j25O9r8K20m45K37O8l83N18k74K38k59k08M56k13j5J71N2
4275A38k06J73q5k09J45J19j1l52K20O4j51L08j82J7r6j34P3L8j01Q8K39n6k33
$$ plain form
4298 -194 -18 127 -195 26 -96 -345 74 143 41 -110 -208 74 -187 183 324 160 152 -205 -482 -153 75
4319 75 -3 -50 -250 40 352 114 -73 189 -2 100 109 -136 -32 -16 -74 -106 -133 88 -100 197 -313 156 84
4342 84 -63 -174 -91 -51 104 59 -273 207 90 241 123 -152 24 -143 61 56 103 -141 -73 -129 -96 -73 -28 -222
4366 -222 -222 -315 155 0 -13 71 111 155 67 -123 -299 -462 -76 8 -74 -85 201 -118 -157 -76 35 -48 -171 -182 -33
4391 -33 14 105 201 -120 -102 -137 -54 76 -132 -32 -57 79 -304 39 -67 166 -62 50 -25 193 108 232 5
4414 5 -132 -170 -5 -126 -99 10 -352 167 79 -132 210 91 -15 -19 -31 -55 -168 161 -68 17 -41 185 -114 182
4438 182 -137 -55 48 93 -104 298 47 -184 -9 19 127 -99 325 144 11 -130 -148 22 86 38 212 -129
4460 -129 129 21 -8 273 -60 -272 -106 -32 123 -144 -286 -284 76 67 -100 -23 92 -198 -160 -24 -224 89 -73
$$ packed form
4298a94J76J45l22K21j22k49M19O9j02j51r8K82k61L70J41j64ql57k77L29K28
4319G5p8m7k00K90L12k38j87K62j91J02Rk45J04J6n8l2k7K21j88K97n10M69p2
4342H4j47j11Q3M0J55m5l32M80j17J51j18k75J76j67K04nM7k44O8n6L3K3M5j94
4366b22%r3M70j55j3Q4M0M4q8j90j76j63L86Q4q2j1K86l19l9Q1J11q3j23j1J49
4391c3M7R1R6l21J8l5Q3J30k08J00k5J36l83L43j06K33k28J12p5K18q5J24k27
4414Ej37l8J65j21K7J09l62N19q8k11L42j19j06mj2k4j13L29k29Q5n8K26k99K96
4438A82l19Q2J03M5j97M02k51k31J75K8J08k26M24j81j33j41j8J70O4m8J74l41
4460a29K58j08k9K81l33k12J66P4J55k67j42KL60rj67P7J15k90L8J36k00L13j62
$$ plain form
4483 -73 -192 -79 99 109 270 241 -112 -170 -277 -116 -95 94 -71 -127 137 -281 -30 -241 328 -71 -76 8 8 51
4507 51 88 10 214 -83 222 103 -227 -148 -282 -390 190 162 1 155 -137 -109 280 -200 -122 -154 209 -253 -288
4530 -288 -91 -43 -48 -289 -262 -16 -125 -14 161 -118 -6 103 -75 -121 -45 97 109 173 -9 53 112 -192 -66
4553 -66 -178 -11 99 -89 164 -129 -42 72 -87 141 189 -118 -277 -31 -140 9 -129 193 106 23 298 -261
4575 -261 53 -134 -12 -11 -205 -183 -143 -57 113 171 -115 28 -103 -287 -124 160 73 -162 -111 -111 187 -164 183
4598 183 -21 -229 -74 25 46 132 -129 -1 95 -103 7 -177 191 -120 -281 73 71 -275 -162 32 -135 101
4620 101 0 -67 -58 -19 9 -95 116 -4 -173 -74 -62 194 258 20 -46 -101 -309 -10 -19 171 -186 -232 -150 -73 -124
4645 -124 -277 24 -250 -94 204 117 -163 259 155 -47 -190 215 12 179 -39 8 92 -170 69 -324 44
$$ packed form
4483g3j19J13J78J0J61k9l53n8j07J61K1J89j65n6K64m18K51k11N69l99nQ4%M3
4507E1L7p8K04k97L05j19l30P9j34j08N80k8j61J54k92K8L89m80P8l2L63m62l5
4530b88J97M8nk41K7K46j09J11J75k79J12J09j78m6P6J42J2O4j82O2N9l04J26
4553f6j12J67J10j88K53k93Q7J14j59K28M8l07j59K46j09J49j38L22q7q3K75n59
4575b61L14j87J22Jj94K2M0Q6J70N8k86J43j31j84J63K84q7k35N1%K98l51L47
4598A83k04k08J55R9K1Q6k61J28R6j98J10j84L68l11j61L54kl46J13J94j67K36
4620A01j01o7RL9K8j04K11j20j69R9J2K56O4k38o6n5k08K99rJ90l57m6Q2P7n1
4645a24j53L01k74J56K98q7k80M22j04k02j43M05k03J67k18M7Q4k62K39l93L68
$$ plain form
4666 44 210 6 23 -90 28 71 -10 -23 80 18 159 -132 283 -127 62 -64 -132 203 83 -545 235 222 -116
4689 -116 10 307 -20 -347 76 23 -59 195 -150 337 -211 -73 -110 104 13 -45 -154 -134 54 -46 -216 -25
4711 -25 212 48 -88 -219 -76 23 63 45 -45 313 -71 -354 -111 16 -173 23 -112 -94 -34 -122 227 -183 69
4734 69 128 28 86 110 -201 33 26 -224 -41 141 -105 -36 -123 138 -160 -19 40 277 335 -45 -211 -122 262 290
4758 290 15 171 -258 213 -45 -46 35 109 97 78 -119 16 42 -38 -67 140 -178 7 182 74 22 -424 28
4781 28 24 187 -28 -69 -28 -137 56 281 -34 -81 -30 -221 -60 -146 49 -55 54 -28 -37 -156 85 193 -1 74
4805 74 -132 -24 99 76 342 -74 190 39 -264 120 -272 -96 93 -191 -24 21 -12 153 196 11 11 -94
4827 -94 -127 -178 -171 137 -193 -102 16 -239 -307 60 186 -195 14 -14 -32 53 4 57 -28 27 -124 -6 -94 -41 192
$$ packed form
4666D4J66k04J7j13J18M3q1j3J03o2J41k91M15m10J89j26o8L35j20o28P80j3l38
4689a16J26K97l27l27M23n3q2K54l45M87n48J38l7K14r1n8j09K0J88j00j70J91
4711b5K37j64j36j31J43R9M0j8r0L58l84k83K43J27j89J96j35J8O0q8L49m10K52
4734F9N9j00N8K4l11K34pk50J83J82k46O9q7K61k98J41N9K37N8l80j66Q9L84K8
4758B90k75J56m29M71k58jQ1P4j2j9j97J35K6q0k9K07l18J85J75j08n2m46M52
4781B8mJ63k15m1M1j09J93K25l15m7N1j91J61q6J95j04J09q2rj19K41J08j94P5
4805G4k06J08J23k3K66m16K64j51l03L84l92J76J89k84J67M5l3J65M3j85%j05
4827i4l3n1PL08l30R1J18k55o8L67J26l81K09k8j8Q5m9N3q5N5j51J18q8N3K33
$$ plain form
4852 192 55 -73 -192 -27 179 -164 -165 315 -328 -141 193 20 -46 113 -29 -174 -7 -8 320 35 41 -202
4874 -202 -59 -47 -436 -285 17 113 4 -392 -173 31 259 68 73 297 -46 35 -16 -65 -125 -66 279 -56 55
4897 55 -5 -136 357 2 58 290 237 34 -50 -40 -197 -44 -39 23 57 -213 -64 -120 -262 -8 184 -147 74 77
4921 77 -72 -18 167 -160 86 -250 250 -22 -183 -73 1 21 -329 -34 383 -205 27 6 -439 337 -62 -141
4943 -141 314 194 50 184 -48 -99 21 71 27 -50 111 -178 -41 -197 22 447 -56 136 -2 22 36 193
4965 193 -8 -124 -33 -116 -66 -195 -245 220 -147 -145 -120 38 68 -56 80 -282 -257 -299 42 -151 47 -371 -14
4988 -14 -24 135 -112 -291 -265 259 -17 0 146 235 125 23 232 26 20 -193 74 109 541 -113 51 160 -169
5011 -169 -127 -9 279 162 91 -68 -28 -63 138 -112 -214 130 -129 68 290 154 131 -143 74 155 -259 149
$$ packed form
4852A92j37j28j19J65K06l43jM80o43J87L34j73o6J59j42j45J67jL28k85Ok43
4874b02J43J2l89J51L02R6j09l96K19K04K28j91NK24l43Q1n1m9o0N9L45l35J11
4897E5o0j31M93l55N6K32n3k03q4J0j57J53NO2L4k70J49n6j42K54J92l31K21L
4921G7j49N4J85l27K46l36N00k72j61J10P4K0l50K95M17n88K32k1m45P76l99p9
4943a41M55j20j44J34k32n1J20N0m4p7J61k89J37j56K19M25n03J92j38K4J4J57
4965A93k01j16R1q3N0j29n0M65l67KK5J58L0j24J36l62K5m2L41j93J98m18L57
4988a4j0J59k47j79K6N24k76J7J46Q9j10j02K09k06ok13K67L5M32o54J64J09l29
5011a69M2J18K88j17p1j59M0l5K01k50j02L44k59J97K22j36k3k74K17Q1m14M08
$$ plain form
5033 149 -224 70 175 74 -15 -214 67 65 -95 -237 -135 -367 202 75 -160 81 13 -73 -204 -97 -49 -120
5055 -120 92 -220 -1 -98 185 -214 233 319 -23 55 87 88 197 -83 -133 62 212 -85 221 -48 -48 -53 -92 -130
5079 -130 100 -17 96 170 -106 -113 246 -61 -35 172 166 -91 -12 91 -158 -8 -23 229 9 155 97 -100 17
5102 17 -44 240 58 99 241 176 -318 24 -65 178 195 -304 -27 148 272 -222 -7 118 -83 -71 164 -62
5124 -62 -127 78 122 138 -125 14 220 -238 -38 40 -36 -201 -137 100 139 256 -154 -269 13 -25 2 28 -104 -226
5148 -226 -257 24 -9 -69 -24 -133 116 -50 -3 -146 -220 -107 130 -16 144 311 181 0 -41 -128 -253 -303 291
5171 291 -119 91 59 -22 -141 189 75 -159 71 61 -101 -309 373 -105 335 -58 96 117 -281 307 99
5192 99 79 40 -342 -166 136 -125 58 89 234 35 -64 -240 42 -89 -152 -335 -364 90 -153 -12 100 -21
$$ packed form
5033A49l73K94J05j01q9j99K81kj60j42J02k32N69j27k35K41o8q6j31J07M8p1
5055a20K12l12K19r7K83l99M47Q6l42P8L2JJ09k80n0J95J50k97L06k69%nl9l8
5079a30K30j17J13P4k76pL59l07K6K07ok57P9J03k49J50j5K52k20J46n8j97J17
5102A7o1K84j82M1J42o5m94L42q9K43J7m99K77J75J24m94K15J25k01J2K35k26
5124f2o5K05M4J6k63J39K06m58K00P8p6j65O4K37L9J17m10j15K82l8K7K6j32j22
5148b26l1K81l3o0M5j09K49j66M7j43p4J13K37j46J60J67j30j81m1q7j25n0N94
5171B91m10K10l2q1j19L30j14k34K30j0j62k08O82m78M40l93J54K1l98N88k08
5192I9k0l9l82J76L02k61J83L1J45j99r9j76K82j31o3j83k9M54k43J41J12j21
$$ plain form
5214 -21 136 62 -126 156 -153 -254 -26 -244 71 -55 151 169 -244 190 -209 166 -117 -153 122 37 -149 81
5236 81 106 -85 54 -109 -89 -60 -56 -14 -92 -125 -149 -16 -141 19 180 -132 -44 96 -107 -178 -125 -127 -74 -2 -65 -91
5262 -91 1 -9 233 92 385 210 -196 -42 -407 27 -100 -32 -10 137 -248 -270 -69 -152 -65 55 -151 -269 161
5285 161 -159 -22 -90 181 -58 83 -145 61 -83 177 -165 64 -9 67 435 180 52 144 186 43 -14 -197
5307 -197 108 194 -9 -107 -211 52 66 92 177 39 -105 78 -216 -29 219 -4 351 -270 369 -144 -213 145
5329 145 -55 27 65 -34 -126 70 -6 111 -200 162 26 -35 114 24 61 307 82 -109 -104 -32 56 31 111 -26 132
5354 132 -285 -10 -30 123 -20 53 -222 40 110 119 -119 85 -239 161 48 19 154 -64 -107 -42 122 58 -215
5377 -215 -321 186 -90 231 -273 59 -2 -270 209 143 -271 -12 -49 -96 -169 -275 -49 -198 22 -72 -110 -273
$$ packed form
5214b1J57p4j88K82l09j01K28k18L15j26K06J8m13M34l99L75k83l6K75q5j86K30
5236H1K5j91J39j63K0K9MM2p8l3k4J33j25J60J61l12Q8J40k03p1N3kN3P2o3k6
5262i1R2j0K42j41K93j75m06J54l65M34j27O8K2J47l85k2K01q3Q7J20k06j18M30
5285A61l20J37o8K71k39J41k28K06j44K60l42K29p3P6L68k55j28R2M2j43n7j83
5307a97L05Q6k03r8j04K63J4K6Q5j38j44J83k94J87K48k23L55o21O39n13o9L58
5329A45k00Q2L8r9r2J96p6J17l11L62j36o1J49r0L7K46k25j91NP2Q8k5Q0j37J58
5354A32m17K75k0J53j43P3k75K62P0Rk38K04l24M00j13k9J35k18m3O5J64o4k73
5377b15j06N07k76L21n04L32o1k68M79o6m14K59l7m7p3j06K26j49K20r4l8j63
$$ plain form
5399 -273 133 49 -211 -75 220 176 -85 210 79 144 -190 -38 409 158 96 96 140 -47 31 78 115 75 -147 -45
5423 -45 -23 18 252 -73 215 -39 -6 29 -187 -50 66 -242 58 -93 -166 35 82 3 156 7 -214 252 -83
5446 -83 13 157 12 59 -167 -42 -136 399 -27 -133 103 -260 -89 38 126 313 -25 -108 -156 183 155 -47 41
5469 41 -14 -57 -15 -171 43 127 -183 -112 -235 -71 150 51 115 71 33 -192 136 203 8 -87 30 196 172 -118
5493 -118 -49 12 -149 -55 82 4 -200 -61 468 128 -34 -243 19 -223 12 133 -35 164 -117 -112 -264 -83
5515 -83 13 -320 430 185 9 200 127 55 170 -103 -79 -25 104 -47 -73 77 -83 -354 74 56 35 245 67
5538 67 -196 -85 36 236 146 -195 -142 -297 -49 92 -147 122 -132 -188 199 97 -14 -7 -182 -30 69 270
5560 270 -159 107 -53 198 56 43 101 387 -51 -127 272 110 -116 -62 171 -9 25 -86 90 -301 -69 199
$$ packed form
5399b73M06q4k60J36K95m4k61K95j31O5l34J52M47k51o2%M4j87P8M7L7m0k22J02
5423d5K2M1K34l25K88k54L3L5k16J37J16l08L00j51p3K01M7p9J53j49k21M66l35
5446h3R6J44j45M7k26J25r4N35m26j06K36l63J71J27Q8J87l38q3m8L39k8k02Q8
5469D1n5m3M2j56K14Q4l10P1j23J64K21r9O4m4l8k25L28O7j95r5J17J66k4k90
5493a18O9O1j61R4J37p8k04J39N29l40j62k09K62k42K35J21j68J99k81Nj52J81
5515h3R6l33P50k45j76J91p3p2J15k73K4N4J29j51k6J50j60k71M28j8k1K10j78
5538F7k63J11J21K00r0l41N3j55K48J41k39K69k54n6L87j02j11Pj75J52R9K01
5560B70m29K66j60K51j42j3N8K86m38p6L99j62k26N4K33j80L4j11J76l91K32K68
$$ plain form
5582 199 20 -108 113 -200 120 127 40 -28 -185 -221 30 117 -27 -232 -61 -205 -83 -113 83 -183 313 -196
5604 -196 -338 -79 79 -78 -54 215 9 -47 188 250 -22 5 316 116 55 63 -62 -222 -98 38 161 33
5626 33 78 187 29 299 -86 -134 -238 110 -120 159 -46 84 214 32 -45 -40 -100 101 205 -80 -242 286
5648 286 5 -33 14 146 -310 69 364 89 -95 76 -2 197 3 116 131 -320 141 -152 -10 -458 -307
5669 -307 -32 -235 -77 -235 -8 7 249 13 245 -204 183 -134 4 175 2 173 -14 -154 104 82 -64
5690 -64 116 -112 -64 203 -210 -75 -142 102 -195 228 -28 65 36 -177 -134 95 143 -69 47 136 129 23 -206
5713 -206 -291 -70 -233 83 55 -281 -131 34 -151 124 -22 -57 -99 -130 174 219 162 -68 88 146 -151 6 -87
5736 -87 123 -14 110 -32 -292 88 -88 13 -306 217 247 -165 80 175 -19 45 -64 6 -9 170 -27 120
$$ packed form
5582A99j79j28K21l13L20Pq7o8j57l6K51Q7j44k05J71j44J22l0J96k66M96n09
5604a96j42K59J58j57K4K69k06n6K35O2k72K7L11k00o1Qj25j60J24J36J23j28
5626C3M5J09j58K70l85m8j04L48k30K79k05J30J30j82p7No0K01J04k85j62N28
5648B86k81l8M7J32m56L79K95k75j84J71p8J99j94J13J5m51M61k93J42m48J51
5669c07K75k03J58j58K27J5K42k36K32m49L87l17J38J71j73J71j87j40K58k2j46
5690f4J80k28M8K67m13J35o7K44k97M23k56R3k9k13M3K29M8k12J16Q9pj06k29
5713b06q5K21j63L16k8l36J50J65j85K75j46l5m2l1L04M5n7k30J56N8k97J57r3
5736h7K10j37J24j42k60L80j76J01l19N23L0m12K45R5j94O4j09P0j5J79j97J47
$$ plain form
5758 120 -25 286 81 -51 32 281 -227 -343 268 15 -240 -166 -25 -20 -1 7 -124 201 -257 201 -143 -155 -25
5781 -25 71 -300 -89 -90 -59 74 79 251 -7 -3 -143 -124 256 -44 3 -3 -16 119 64 174 192 -172 -13 -62 73 50
5807 50 -261 -124 -210 -165 342 107 239 389 -116 307 -128 70 -234 -76 64 -411 115 -80 -157 46 241
5828 241 -38 -69 -29 176 -286 -281 -206 -51 -297 284 -167 -10 -60 -17 231 87 -305 53 -31 -135 36 -51 11
5851 11 169 63 170 138 -362 -300 24 45 -152 6 60 197 4 46 7 -356 -75 178 -458 -152 -115 -192 118
5874 118 0 -67 103 189 172 284 -99 -23 118 57 161 43 159 -204 57 96 118 82 -191 153 351 319 78
5897 78 68 -284 -141 -200 51 -91 208 196 -112 -96 -106 -173 -127 8 -92 -220 228 -122 316 -43 -45 -77 16 129
5921 129 153 212 -184 51 -86 7 -167 53 43 10 223 4 -131 31 193 127 -68 -92 125 53 -378 194 121
$$ packed form
5758A20j45L11k05j32Q3K49n08j16O11k53k55P4J41NJ9Qj31L25m58M58l44j2J30
5781b5R6l71K11jL1J33NJ72k58Mj40J9L80l00M7oj3J35n5J10J8l64J59m9J35k3
5807E0l11J37q6M5N07k35J32J50n05M23m35J98l04J58J40m75N26j95p7K03J95
5828B41k79l1M0K05m62NP5J55k46N81m51J57n0M3K48j44l92L58q4j04J71q7O2
5851A1J58j06J07l2n00O2L24K1j97J58N4J37j93M2l9l63K81K53o36L06L7p7L10
5874A18j18o7J70Q6j7J12l83P6J41o1J04j18J16l63K61L9K2l6k73L44J98l2k41
5897G8j0l52J43n9K51j42K99j2l08J6j0o7M6J35j00j28M48l50M38l59kl2R3J13
5921A29K4N9l96K35j37R3j74K20j0l3K13k19j35J62J62o6j95k4K17p2m31N72p3
$$ plain form
5944 121 -135 170 -8 33 166 -22 -35 3 -71 10 291 91 66 104 31 72 -188 -41 140 -92 -70 273 -95
5967 -95 103 255 -125 32 -75 -218 -214 -126 -463 45 -395 41 9 10 38 -89 23 -327 -31 28 199 207 -25 -107
5991 -107 63 173 -42 -133 -25 -105 -180 376 145 216 177 252 -81 373 149 -56 -75 161 162 104 -8 220 208 -13
6015 -13 -146 -85 -96 45 -67 131 140 127 -78 -165 120 16 -72 36 26 -75 -1 -249 -99 8 20 -75 60 50
6039 50 157 153 39 -76 -56 -192 -160 -153 -99 29 -36 83 87 16 -134 55 51 29 -49 45 37 220 104 76 -46 -52 -145 173
6067 173 78 -129 -24 -165 -101 -53 -136 -228 -36 252 -46 283 -124 -91 84 -40 195 33 62 -130 101 -1
6089 -1 -21 -8 303 203 112 90 -161 32 126 40 25 115 159 197 146 5 404 23 51 225 -154 -131 206 -37 -57
6114 -57 -84 30 -180 -113 102 -335 56 -12 -32 136 -16 -234 58 109 -69 134 -56 -148 -95 -244 375 -150 128
$$ packed form
5944A21k56L05j78M1J33j88j3L8p4Q1K81k00k5L8p3M1k60J47J81k32K2L43l68
5967i5J98J52l80J57j07j43MQ8l37N08m40M36l2JK8j27J12l50K96N9J71Qk32q2
5991a07J70J10k15r1J08q0p5N56k31P1l9P5l33M54k24k05j9K36Jn8j12K28j2k21
6015a3j33O1j1J41j12J98Rj3k05q7K85j04q8J08j0j01P4k48J50J07J2r5J35j0
6039E0J07mj14j15K0j36L2PN4J28o5J19Mp1j50J89mk2p8R4qJ83j16k8j22or3L18
6067A73r5k07J05j41O4M8q3r2J92K88k98L29m07L3J75j24K35j62K9j92K31j02
6089ak0J3L11j00r1k2k51J93R4q6j5R0M4L8n1j41L99l81K8J74l79K3L37k43k0
6114e7k7J14k10O7K15m37L91o8k0J68j52k18K92N1j78K03j90r2N3j49O19n25K78
$$ plain form
6137 128 240 -96 2 -74 37 -9 -211 199 7 -235 97 120 -58 15 -21 60 -62 120 192 -322 127 466 55
6160 55 -323 -460 -132 161 -32 59 -287 -84 61 8 132 -24 173 -202 10 257 -5 -48 -275 -75 190
6181 190 -18 58 -178 -71 -212 -275 -92 58 -131 296 240 -66 59 4 -300 -189 97 -72 27 113 -2 -11 -3
6204 -3 -96 -3 164 123 118 -45 -76 6 -126 -71 -128 -338 75 171 25 -5 -76 102 219 -163 154 264 -164 -80 134
6229 134 -105 9 -72 -158 309 269 -5 -6 74 -145 26 39 -77 -176 -49 121 41 40 69 272 -154 254 -120 -332
6253 -332 -300 -183 -184 158 -19 -1 52 129 -40 -109 36 -182 -129 -408 22 84 -121 177 -22 118 -85 -36 -64 -120
6277 -120 237 215 87 -65 177 -54 -13 8 257 -1 49 47 -226 -130 -247 -271 -275 56 72 276 34 125 144 212 44
6302 44 -82 145 38 -80 189 -169 -134 -123 11 -24 -126 -62 -255 -106 27 46 472 282 -165 -78 140 -60
$$ packed form
6137A28J12l36R8p6J11m6k02M10j92k42L32K3j78P3l6Q1j22J82P2n14M49L39m11
6160E5l78j37L28K93j93R1l46K03J45n3J24j56J97l75K12K47k62m3k27K00K65
6181A90k08P6k36J07j41o3J83J50j89M27n6l06J25n5l04J11K86j69R9Q6j15rQ
6204cr3R3J67m1nj63l1Q2j32N5n7k10M13R6j46l0p1J78J17l82L17J10m28Q4K14
6229A34k39J14q1q6M67m0k74jQ0k19J71J3j16r9J27J70q0jK9K03m26M08l74k12
6253c32L2J17jL42j77J8N3P7j69o9J45k18N3k79M30O2k05K98j99J40k03M9k8n6
6277a20L57k2j28j52K42k31M1K1K49k58N0kk73R6j17k4mL31J6K04k42R1J9O8j68
6302D4j26K27j07j18K69l58L5J1J34l5j02O4j93J49J33J9M26j90m47Q7K18k00
$$ plain form
6324 -60 -149 122 -47 -29 -263 -193 -12 51 -3 82 -281 -29 6 -136 -172 90 84 -6 -231 -100 -14 36 -55 -27 198
6349 198 188 259 44 73 -84 -43 -159 -263 -61 -197 77 108 131 -126 -81 10 47 144 -137 -104 221 -65 260 -105
6373 -105 26 116 -207 -151 421 330 -110 101 -43 296 227 -15 138 -399 -63 83 222 48 -118 203 -63
6394 -63 5 2 -240 -26 -123 95 5 272 76 -148 202 -43 -77 -292 421 -73 56 103 -31 119 -118 4 41
6417 41 -174 165 32 75 156 -24 -108 16 -109 133 171 -232 12 119 -262 119 19 -238 7 424 -280 -242
6439 -242 97 -11 174 58 -152 38 218 -21 69 162 13 -9 3 98 7 220 19 -212 250 -53 81 55
6461 55 163 132 26 310 211 -9 -56 163 -3 77 171 -92 -100 227 -28 288 -331 278 -88 4 -203 -95 18
6484 18 -9 18 255 -34 -126 189 184 -268 -133 -85 -169 -59 -18 43 33 -173 -60 -61 -115 -138 -171 -132 -51 271 -154 207
$$ packed form
6324f0q9K71j69J8k34P0J81O3n4Q5l63K52L5j42l6K62or0k25J31Q6N0r1K8K25
6349A98j0P1k15K9j57M1j16j04K02j36K74L1K3k57M5R1L7R7k81L3L25k86L25l65
6373a05J31R0l23N6N72r1m40K11j44L39o9k42J53n37L36J46J39j74j66L21k66
6394f3O8lk42K14r7K18r0K67j96k24L50k45l4k15P13m94J29M7j34J50k37J22L7
6417D1k15L39j33M3Q1j80q4J24j25K42L8m03K44J07l81L81j00k57K45M17p04L8
6439b42L39j08J85j16k10J90J80k39R0R3j49k2J2R5r1K13k01k31M62l03J34k6
6461E5J08l1j06K84r9k20m7K19j66Q0R4k63qL27k55L16o19O09l66R2k07J08J13
6484A8k7K7K37k89r2L15nm52J35M8q4J10M1O1j0k06J13jn4k3l3L9Q1L22m25L61
$$ plain form
6510 207 -206 71 -183 -49 313 293 296 -477 72 -119 35 -135 44 -78 -249 -86 135 177 -56 -51 93 150
6532 150 -39 41 1 55 307 -311 -113 47 121 -240 -25 143 -47 -25 -124 -154 -290 -136 294 223 158 -320 -66
6555 -66 -287 184 148 -96 67 -151 398 -56 111 -193 -25 -130 246 137 165 86 9 -98 -139 -157 -163 18 -156
6578 -156 108 -29 -184 157 -93 236 -41 -164 193 47 -158 149 -120 98 -197 71 32 -75 -59 -162 -214
6599 -214 153 32 -178 171 -319 277 -137 -86 60 -61 -11 -205 -149 -53 -23 -270 -91 -160 -3 138 90 131 193
6622 193 332 -116 184 -55 64 -47 212 -54 49 171 88 -81 -14 131 10 12 15 16 201 148 -351 -80 153
6645 153 26 251 127 168 -37 -131 122 -198 320 63 29 -7 -93 119 -154 -11 208 -63 85 30 -276 192
6667 192 -252 -273 -121 -59 -47 19 -166 -183 -186 142 -121 -144 95 -231 -71 137 -55 -29 166 215 99 -205 208
$$ packed form
6510B07m13K77k54J34L62k0Lp73N49j91J54j70J79j22j71J63K21M2k33NJ44N7
6532A50j89Q0m0N4K52o18J98J60P4l61K15J68j90K2r9l0j36J54M30p1o5m78K54
6555f6k21M71l6k44J63k18N49m54J67l04J68j05L76j09K8p9p7j07m1j8oJ81j74
6578a56K64j37j55L41k50L29k77j23L57j46k05L07k69K18k95K68l9j07J6j03n2
6599b14L67j21k10L49m90N96m14N1J46j21N0j94N6R6L0k47J79o9J57J41m8M1O2
6622A93J39m48L00k39J19j11K59k66J03J22q3j69O7J45j21KLJJ85n3m99K71K33
6645A53j27K25j24M1k05r4K53l20N18k57l4l6q6K12k73J43K19k71J48n5l06M68
6667A92m44k1J52O2J2O6j85j7lL28k63k3K39l26J60K08j92K6J95M9j16l04M13
$$ plain form
6690 208 17 -40 76 -32 72 -128 18 42 -1 -37 12 237 -53 233 64 -202 -9 85 -188 40 -186 -20
6712 -20 237 -21 -226 130 11 -127 -84 -48 43 -9 48 -86 -172 78 -139 -74 78 43 395 190 75 63 26 155
6736 155 110 172 479 -90 14 196 -101 70 -233 68 -89 147 203 227 -58 184 -42 42 150 -245 85 97
6758 97 174 207 -29 24 170 37 17 -130 88 -156 -15 -53 -40 159 -131 -139 -98 47 58 -176 -35 -328 109 -219
6782 -219 -91 55 101 -119 -376 9 108 268 -245 4 3 72 -37 -191 -24 -133 206 93 -137 186 124 -196
6804 -196 -104 16 -352 -89 386 -182 -19 143 -130 62 121 164 199 -38 185 80 -207 -48 163 -138 -37
6825 -37 16 -22 -33 -222 67 -97 149 57 203 132 166 -59 17 32 -22 -109 -135 104 -92 157 74 122 77 -191 -92
6850 -92 -2 -129 -78 120 -168 25 -96 100 71 -50 -37 144 43 131 14 55 137 211 39 85 -47 -125 105 312
$$ packed form
6690B08j91n7J16j08J04k00J46K4m3l6M9K25k90K86j69k66J93R4k73K28k26J66
6712b0K57k58k05L56j19j38M3L6R1n2N7j34q6K50k17O5J52l5L52k05j15j2l7J29
6736A55m5O2L07n69J04J82k97J71l03L01j57K36N6K4k85K42k26Q4J08l95L30J2
6758I7P7L3k36N3J46j33k0j47K18k44J41l8J3J99k90qM1J45J1k34J41k93M37l28
6782b19J28J46M6k20k57L85R9J60n13K49jO9j09j54J67j09L39j13k30L23o2l20
6804a96R2J20l68K63M75n68J63J62k73J92N9M3L5k37K23j05k87J59K11l01J01
6825c7N3l8j1j89K89j64K46r2J46p1L4k25P6J5n4q7k6K39j96K49q3M8m5k68R9
6850i2R0j27N1J98k88J93j21J96k9j21J3J81j01Q8j17M1Q2P4j72M6j32p8K30K07
$$ plain form
6874 312 186 192 53 -191 -99 124 155 40 6 70 198 246 -8 -96 166 -219 99 -396 222 95 130 -83 -230
6897 -230 -53 72 -50 24 27 -39 -15 -139 -133 122 24 133 91 210 -221 -124 72 -141 39 166 65 33 -53 -152
6921 -152 52 81 -251 180 -284 77 -193 75 -86 249 160 -197 217 63 -102 80 -88 -131 46 103 3
6942 3 -80 -90 -93 249 200 -41 -49 -151 -342 -22 -306 148 229 152 56 -169 88 271 -240 52 80 92 -162 105 -92
6967 -92 234 54 114 -146 -34 -10 -127 39 -242 113 21 -156 13 122 88 -175 -191 -375 154 113 -65 122
6989 122 246 179 56 152 81 -129 96 263 209 86 44 4 -29 57 -78 -12 -358 -61 -74 121 -47 89 243
7012 243 -67 -18 68 215 110 308 16 4 -54 -204 335 -128 294 36 -332 115 -71 147 2 -22 99 128
7034 128 0 67 -40 -198 217 -103 145 -142 39 155 -153 15 1 151 63 117 182 253 125 44 94 106 -88
$$ packed form
6874C12j26Oj39k44R2K23L1j15l4O4J28M8k54q8K62l85L18m95O18j27L5k13j47
6897b30J77J25j22P4Lo6K4j24OK55r8J09m2J19m31R7J96k13J80J27j01l2q6r9
6921a52K04K9l32M31m64L61k70K68j61L35q9l57M14j54j65J82j68m3J77N7j00
6942Cq3j0lL42m9k41qj02j91L20k84M54Q1p7r6k25K57J83n11K92K8J2k54K67j97
6967i2L26j80O0k60J12K4j17J66k81L55r2j77J69J09l4k63j6j84N29m1j78J87
6989A22J24o7j23R6p1k10K25J67n4j23m2m0l3Q6j35O6l46K97j3J95j68J36J54
7012B43l10M9Q6J47j05J98k92j2n8j50N39m63M22k58l68M47j86K18j45k4J21K9
7034A28j28O7j07j58M15l20K48k87J81J16l08J68j4J50q8N4O5P1j28q1N0J2j94
$$ plain form
7057 -88 -149 -61 -140 -23 202 258 -133 -275 52 27 139 -81 465 -200 -262 222 59 -168 -151 -125 -374 -248 -66
7080 -66 -44 94 -173 61 122 26 -131 -119 321 -83 5 28 305 -24 -95 143 2 -102 220 38 23 14 205 9
7104 9 320 -84 185 -99 -80 -94 -95 315 -9 -82 48 -73 -151 51 88 -105 -167 222 26 68 -178 -123 307 196
7128 196 -257 60 55 188 -129 -139 104 -38 30 -146 185 267 284 -16 -20 345 -5 136 -181 -126 59 -167 8
7151 8 -96 33 -322 557 265 -157 37 -150 -357 27 77 78 139 30 -114 209 78 -114 -22 -166 38 145
7173 145 163 -62 97 -60 -61 -113 58 -68 -203 132 175 137 -52 -27 -117 -89 14 149 114 117 142 123 300 -359 89
7198 89 245 -121 70 -55 11 120 -33 -182 -84 -123 -246 3 25 -16 -30 118 62 -42 -280 -103 -69 -53 84
7221 84 -31 87 181 165 57 87 -52 -68 127 88 64 12 -33 -147 -77 -65 -242 34 -65 28 65 -148 243 154 -64
$$ packed form
7057h8o1Q8p9J17K25N6l91j42L27k5J12k20N46o65o2M84j63k27J7K6k49J26J82
7080f6K2J38k67K34O1r6j57J2M40m04Q8K3K77l29p1K38j41j04L22j82j5rJ91j96
7104IL11m04K69k84J9j4jM10l24p3J30j21p8K02L7j93o2L89j96M2k46N5M30j11
7128A96m53L17nJ33l17j0K43j42O8j76L31Q2J7l00mL65l50J41l17N5J85k26J75
7151Hj04J29l55Q79k92m22J94j87k07L84N0JO1j09j44L23j31j92R2j44K04J07
7173A45J8k25J59j57jn2J71j26j35L35M3l8j89K5r0K8J03J35l5LK5j9J77o59M48
7198H9J56l66J91j25O6J09j53j49R8l9j23K49K2m1j4J48n6j04k38J77L4J6J37
7221H4j15J18R4j6j08L0j39j6J95l9k4n2m5j14P0J2j77K76r9R3L7k13L91q9k18
$$ plain form
7246 -64 -132 158 6 -176 331 -5 67 94 -79 287 107 -6 209 129 107 -74 98 162 89 142 191 -80 -82 167
7270 167 58 87 148 125 54 -20 -403 -190 123 -116 -70 -179 0 62 -200 109 -242 -129 -278 33 -33 -311 39
7293 39 270 -184 -78 119 6 -83 51 -60 46 -180 -31 -126 156 -158 200 -110 -60 96 120 -131 -137 313
7315 313 -33 163 0 91 61 -377 -80 -109 -58 -43 -60 -115 271 103 -180 34 34 -69 315 -167 60 -251 150
7338 150 -26 44 397 35 2 -83 -83 116 80 -50 24 2 -61 -5 44 -217 63 -169 143 -204 -81 -197 190 -320
7362 -320 449 -17 -174 -42 158 37 -40 65 -210 384 155 -169 23 303 15 -100 -147 405 104 -174 130
7383 130 509 86 116 -106 -79 38 -96 -178 43 19 -325 64 12 88 -135 198 -221 -196 -304 124 394 -71
7405 -71 -282 -295 93 -180 -305 -63 194 55 -97 -319 232 45 98 -226 14 158 128 -53 -132 205 -54 -128
$$ packed form
7246f4o8K90j52j82N07l36P2K7j73L66j80j13K15q0k2j81J72O4p3N3M9k71kK49
7270A67j09K9O1k3p1p4l83K13L13k39M6j09J79O2k62L09l51J13j49L11o6k78L50
7293C9K31m54J06J97j13q9J34j11J06k26J49r5K82l14L58l10N0J56K4k51oM50
7315C13l46J96j63R1l0m38K97k9N1J5j7n5L86j68k83K14%j03L84m82K27l11M01
7338A50j76P0L53l62l3q5%J99l6j30P4k2o3N6M9k61K80k32L12l47J23j16L87n10
7362c20P69m66j57J32K00j21p7J05k75N94k29l24J92K80k88j15m7N52l01k78L04
7383A30L79m23L0k22K7J17j34q2K21k4l44L89n2P6k23L33m19K5j08M28K70m65
7405g1k11j3L88k73j25K42K57j39j52k22N51j87N3l24K40J44l0j81p9L37k59p4
$$ plain form
7427 -128 13 214 -65 -61 -259 186 2 -33 -138 390 -17 -28 -5 -27 16 -141 141 57 -28 221 18 -208 209
7450 209 -12 -140 164 -88 -143 78 -115 -166 37 -86 52 -170 -347 97 -271 52 123 -276 -203 -19 187
7471 187 64 -37 142 -173 -222 -58 126 -217 -204 -34 -45 -23 -236 -56 -117 32 -61 -22 -328 -95 -181 71 9
7494 9 -157 -187 -21 63 208 -209 56 -162 9 16 201 38 -341 37 51 59 -356 -1 133 -256 -219 5 -198
7517 -198 72 -38 -66 0 171 61 149 173 -95 34 219 116 -21 59 -22 271 325 -98 -100 -79 73 129 -116 -71
7541 -71 -116 54 201 -6 -166 -124 -226 -205 -123 -203 -86 -185 56 120 -20 70 -225 -142 192 36 -105 -20 216 30
7565 30 -126 86 -63 -25 -26 135 -191 235 82 181 -31 115 241 179 -89 -48 -156 86 209 -420 165 100 130
7588 130 -58 222 247 229 59 -131 -84 27 -168 -128 -367 -67 -305 93 -278 148 -115 -187 -82 -56 -1 -218
$$ packed form
7427a28J41K01k79Mj98M45j84l5j05N28m07j1K3k2M3j57K82q4q5K49k03k26M17
7450B09k21j28L04k52n5K21j93n1K03j23J38k22j77M44l68L23P1l99P3J84K06
7471A87j23j01J79l15m9J64J84l43J3J70j1K2k13J80o1J49r3L9l06K33q6K52o2
7494Ij66l0J66Q4J45m17K65k18J71PJ85j63l79L78J4Qm15L55J34l89L7K24k03
7517a98K70j10k8O6J71j10Q8K4k68J29J85j03j37Q0q1K93N4m23kK1J52N6k45M5
7541g1m5J70J47k07j60M2j02K1Q2q0J17r9K41O4j40R0k95Q3L34j56j41Q5K36j86
7565C0j56K12j49L8jJ61l26M26j53R9k12J46J26o2k68M1j08K42J23o29N85o5L0
7588A30j88K80K5j8j70j90M7J11j95M0k39L00k38L98l71M26k63p2J05K6N5k17
$$ plain form
7610 -218 -241 105 -13 84 130 -79 240 -128 34 179 208 151 -118 22 90 144 -38 -346 -50 -136 199 50 -35
7633 -35 219 -68 64 27 -159 83 125 145 11 -22 -182 -63 181 -72 73 114 -346 27 -155 -183 2 109
7655 109 92 61 -157 -3 -208 -289 149 -17 -122 30 12 117 -76 60 -140 10 238 -196 -98 3 -60 -116
7677 -116 -265 114 -192 -129 191 -22 306 -22 169 -197 -169 53 -365 74 -78 -42 241 126 97 88 -142 -118
7699 -118 -71 -90 -81 -27 41 -91 -39 -99 -43 118 -95 179 -147 -105 -119 -43 -71 148 43 414 -62 -223 12 -242
7723 -242 -80 -43 -44 -83 -328 32 65 -42 -193 -108 -33 -181 -35 440 -119 116 5 190 142 -73 36 244 -13
7746 -13 -15 -30 6 124 173 150 -10 -20 -192 -172 89 -176 1 -120 243 199 -75 295 124 94 -118 36 108 -106
7770 -106 107 7 -51 -72 -44 7 -23 -326 -183 118 -118 187 -197 162 -206 -53 159 -58 26 -16 -182 -47
$$ packed form
7610b18k3L46j18R7M6k09L19l68J62J45K9n7k69J40O8N4j82l08K96q6L35j49q5
7633c5K54k87J32l7j86K42M2K0j34l3j60J19K44k53J45M1m60L73j82k8J85J07
7655A09j7l1k18J54k05q1M38j66j05J52j8J05j93J36k00J50K28m34R8J01o3n6
7677a16j49L79l06O3L20k13L28l28J91l66K8K22m18M39j52L6K83j15k9rk30K4
7699a18M7j9RN4O8j32N2o0N6J61k13K74l26M2j4P6k8K19j05L71m76j61K35k54
7723b42J62L7jl9k45L60L3j07j51Q5P5j48J46M75n59K35j11J85m8k15J09K08k57
7746a3kj5L6J18M9k3j60j0j72K0K61k65J77j21L63m4k74L70j71l0k12J54P2k14
7770a06K13j00n8k1K8N1l0l03J43L01k36L05l84L59l68J53K12k17Q4m2j66J35
$$ plain form
7792 -47 -304 -11 -32 -331 121 92 21 55 10 45 73 -128 59 -42 28 6 188 -34 33 199 -261 -167 216 -379
7816 -379 -90 26 -72 58 18 49 -175 -102 -14 286 158 110 184 -117 -24 -284 72 158 -130 221 -161 -292 -78
7839 -78 297 81 -23 -205 205 45 -138 62 49 -44 4 -52 -18 168 -49 -65 9 189 379 -6 -114 87 -39
7862 -39 37 57 59 -76 -34 -124 19 31 -26 191 -35 -183 158 -200 -159 -32 -250 140 -49 49 -39 206 81 -198
7886 -198 103 -231 4 -24 -2 -180 -57 -59 94 344 -280 -162 244 -102 -308 -265 113 390 -73 -181 152 -119
7908 -119 198 202 107 178 -261 105 320 -88 -37 -104 -14 2 57 -189 150 -155 253 92 -95 155 58 -170 -7
7931 -7 68 17 265 103 93 -13 -132 -59 1 75 -25 -82 -57 -29 56 248 152 -215 52 206 -133 234 57 142 -46
7956 -46 -113 -41 -43 -245 287 13 -142 164 95 -166 40 248 256 80 -178 -26 -45 -156 -137 83 -225 -31 113
$$ packed form
7792d7k57K93k1k99M52k9p1L4m5L5K8k01J87j01P0k2J82k22O7J66m60R4L83n95
7816c79K89J16r8J30m0L1k24P3Q8L00j28m8P4l01R3k60L56Q6k88L51l82j31K14
7839g8L75k16j04j82M10j60j83K00j3r3M8n6L4J86k17j6P4J80J90l85j08K01j26
7862c9P6K0Kj35M2r0J43J2n7K17k26j48L41l58M1J27k18L90j89R8q8K45j25k79
7886a98L01l34K35k8K2j78J23kJ53K50o24J18M06l46k06M3L78K77m63j08L33k71
7908a19L17Mr5P1m39L66K15m08N1o7R0J6N5k46L39l05M08j61j87K50r7k28J63
7931gP5n1K48j62j0j06j19P3O0P4j00n7K5K8Q5J92r6l67K67J54l39L67j77Q5j88
7956d6o7P2kk02N32k74j55L06o9k61K06K08Qj76k58J52j9j11J9K20l08J94J44
$$ plain form
7979 113 118 -134 239 115 62 115 -154 -160 13 -22 -41 35 -246 -114 -235 -345 -24 -62 7 -25 108 222 226 -160 90
8004 90 -40 292 -53 -217 273 -62 -247 75 38 -17 113 232 75 184 336 -181 -129 194 11 -17 336 28
8026 28 140 -10 -3 -84 -122 -179 -187 36 -41 28 186 174 266 -157 109 43 49 118 64 8 -24 -164 -47 -251 -87 165
8052 165 -63 107 -46 16 -98 33 214 19 -6 -183 -76 222 55 124 11 -71 -18 -106 -178 177 184 -53 346
8075 346 -46 229 -93 79 -244 152 53 41 2 86 13 -88 -172 64 184 -26 -36 255 -61 -97 -180 -139 -136 -46
8099 -46 53 3 149 -137 49 -147 -301 33 -170 196 6 -107 -53 262 132 -55 7 168 -279 -147 1 5
8121 5 -49 208 12 -264 244 -38 58 72 -17 20 -48 75 81 266 101 165 5 -37 -28 246 75 25 130 136 12 357
8147 357 -93 -88 -193 280 -203 54 -50 -25 -128 -78 -48 63 -195 -115 66 -105 2 -130 -67 -200 -67 -96 -69
$$ packed form
7979A13Nk52L73j24n3N3k69oJ73l5j9P6k81J32j21j10L21l8O9l2J33J14Ml86K50
8004I0j30L32l45j64M90l35j85L22l7n5J30J19j57J09J52n17N2L23j83k8L53l08
8026B8J12j50Pq1l8n7qK23p7O9J58j2R2m23K66o6OO9n4n6l2j40J17k04J64K52
8052A65k28J70j53O2j14J31J81j95k5j77J07K98j67O9j13q2N3q8p2L55Pk37L99
8075C46l92K75l22J72l23L96r9j2l9Q4p3j01q4K36J20k10j0K91l16l6q3M1LR0
8099d6R9n0J46k86J86j96j54L34k03L66j90j13N4L15j30j87O2J61m47J32J48M
8121En4K57j96k76N08k82R6J4q9L7o8J23OJ85j65O4j60m2RK74j71n0J05Oj24L45
8147C57m50Nj05M73m83K57j04K5j03N0L0J11k58Q0J81j71J07j32O3j33J33k9K7
$$ plain form
8170 -69 199 29 -28 23 166 50 209 -32 -163 -93 244 -132 43 200 33 40 113 -84 -30 -154 30
$$ packed form
8170f9K68j70n7N1J43j16J59k41j31P0L37l76J75J57j67PP3j97N4j24J84
8191C0
$$ Imaginary data points
##PAGE= N=2
##DATA TABLE= (X++(I..I)), XYDATA
$$ plain form
0 0 0 0 0 0 0 0 0 0 0 0 0 0 0 5 -8 8 -8 8 -8 11 -16 16 -17 21 -24 28 -31 36 -39 45 -52 56 -63 71 -79 89 -98
37 -98 108 -121 133 -147 163 -182 200 -221 246 -274 307 -344 386 -439 502 -580 682 -819 1013 -1308
57 -1308 1807 -2815 5628 -26471 -110774 -36251 22397 -17865 -44989 -697 4780 -36899 -32677
70 -32677 4980 -9198 -36888 -20601 -10756 -38481 -25110 33156 36493 -19214 -32325 -8038 -24240
83 -24240 -49675 -17252 10328 -28552 -58753 -19478 11875 -17453 -45246 -38514 -39555 -47104 -28284
96 -28284 -11180 -19676 -15304 7590 -4891 -42711 -31036 10297 -2694 -47754 -41173 1044 7756
109 7756 -8826 -8086 -14241 -41063 -45385 -21416 -18230 -32569 -22581 -6508 -19098 -27629 -2741 7296
123 7296 -22632 -37628 -16091 -7603 -17974 -864 30726 17381 -23423 -27423 -1355 3644 -10688
$$ packed form
0@%%%%%%%%%%%%%Nj3J6j6J6j6J9k7L2l3L8m5N2n9O7p5Q4r7J08j19J34j50J68j87
37i8K06k29K54k80L10l45L82m21M67n20N81o51P30q25R41j082J262j501J832k321
57a308L115m622Q443l2099q4303P4523N8648m0262k7124M4292N477m1679M222
70c2677L7657j4178k7690J6287R845k7725J3371N8266L337n5707j3111K4287j6202
83b4240k5435L2423K7580l8880l0201L9275L1353k9328k7793O732j041p549J8820
96b8284J7104q496M372K2894j2481l7820J1675M1333j2991m5060O581M2217O712
109G756j6582P40o155k6822m322K3969L186j4339R988J6073j2590q531K4888J0037
123G296k9928j4996K1537Q488j0371J7110L1590j3345m0804m000K6068M999j4332
$$ plain form
136 -10688 -15363 -14543 -15956 -5582 9817 4064 -10955 -10282 -9219 -23106 -24275 3010 22140 10610
150 10610 -3300 1776 9651 8757 8879 7907 -2964 -10005 1151 18179 21432 14533 6626 -2668 -9751
165 -9751 -5147 3852 4779 1006 3073 7244 7795 11000 17779 16821 3636 -7415 -2600 13663 27403
180 27403 28070 17783 8370 8492 11746 12664 10966 7040 2445 1625 7585 15162 19775 18113 8725 -3965
196 -3965 -7450 2993 15862 18852 16143 14071 11391 10850 17317 22265 14400 865 -34 9246 15605
211 15605 18545 21034 15681 3113 -2306 2556 6397 6014 7801 8336 3083 4050 15631 21336 11199
226 11199 403 -45 2464 5289 14566 22542 15655 4722 5090 9432 6809 4796 6029 1739 -5825
241 -5825 -348 12205 15092 7334 2303 -1733 -8159 -6326 6699 12771 5639 758 4795 7381 5580
$$ packed form
136a0688m675Q20j413J0374J5399n753j5019O73J063j3887j169K7285J9130j1530
150A0610j3910N076P875q94J22r72j0871p041J1156J7028L253o899p907r294p083
165i751M604Q999R27l773K067M171N51L205O779r58j3185j1051M815J6263J3740
180B7403O67j0287r413J22L254R18j698l926m595q20N960P577M613j662r388j2690
196c965l485J0443J2869K990k709k072k680n41O467M948p865j3535q99R280O359
211A5605K940K489n353j2568n419M862L841l83J787N35n253R67J1581N705j0137
226A1199j0796m48K509K825R277P976o887j0933L68M342k623k013J233m290p564
241e825N477J2553K887p758n031m036o426J833J3025O072p132m881M037K586j801
$$ plain form
256 5580 7759 7663 -2711 -11247 -4083 6764 8317 7031 5765 -2006 -11469 -9091 255 89 -5674
271 -5674 -6411 -3773 -3441 395 7156 4637 -7345 -13977 -9409 -3812 -488 4057 4665 -2848 -9489 -6033
287 -6033 -1218 -4373 -9327 -10789 -12557 -12790 -4647 3307 184 -9527 -13922 -15042 -14504 -9699 -3187 -3133
303 -3133 -8961 -9668 -4946 -2063 -3416 -6281 -11313 -17178 -16626 -8243 -263 -1049 -5854 -9769 -14041 -15066
319 -15066 -11398 -7838 -10413 -14342 -12987 -7980 -3998 -905 -2312 -9139 -16286 -16381 -9901 -3926 -1691
334 -1691 -2144 -4888 -8333 -8189 -4847 -3737 -8027 -12901 -13108 -10127 -4483 1601 2596 -2969 -9913 -11187
350 -11187 -8713 -5229 -2073 -1135 -2364 -3527 -600 3657 4655 741 -4710 -7839 -7263 -1863 4356 7370
366 7370 4725 30 -2533 -1849 60 1558 385 -2744 -2478 2297 8042 10785 9404 4166 -1122 -2595
$$ packed form
256E580K179r6j0374q536P164J0847J553j286j266p771r463K378R346j66n763
271e674p37K638L32L836O761k519j1982o632M568N597L324M545O08p513o641L456
287f033M815l155m954j462j768k33Q143P954l123r711m395j120N38M805O512N4
303c133n828p07M722K883j353k865n032n865N52Q383P980p86m805l915m272j025
319a5066L668L560k575l929J355N007L982L093j407o827p147r5O480N975K235
334a691m53k744l445J44L342J110m290m874k07K981N644O084R95n565o944j274
350a1187K474L484L156R38j229j163K927M257R98l914n451l129N76N400O219L014
366G370k645m695k563O84J909J498j173l129K66M775N745K743j381n238n288j473
$$ plain form
382 -2595 1024 6127 9307 9061 6756 4827 6340 9022 9492 6044 700 -1828 1582 7764 12986 13839
398 13839 10132 4661 1800 3105 6418 8822 8317 6316 5457 8459 12577 14291 11519 5985 1107
413 1107 424 4529 10041 12570 11213 7441 5211 5089 6375 7288 5472 2581 1785 4211 8457 12246
429 12246 11833 7862 2870 -235 1661 4855 7014 6876 5276 4084 5211 7314 6840 3485 -837 -2644
445 -2644 -1771 1718 6324 8069 5441 1180 -1468 -481 1105 1831 425 -1430 -1899 1340 5410 6104
461 6104 2940 -1259 -5228 -6754 -4341 927 3266 1091 -1925 -2654 -2100 -1139 -592 -1974 -6238 -8696
477 -8696 -5838 -712 2597 2688 -276 -4902 -8015 -6141 -2839 -2028 -3254 -3447 -2955 -3544 -2336 47 -1127
494 -1127 -6191 -9834 -8714 -5500 -2080 410 -402 -4621 -6517 -4509 -3298 -4283 -5702 -5389 -5366 -5093 -1596
$$ packed form
382b595L619N103L180k46k305j929J513K682M70l448n344k528L410O182N222Q53
398A3839l707n471k861J305L313K404n05k001q59L002M118J714k772n534m878
413A107o83M105N512K529j357l772k230j22J286R13j816k891p96K426M246L789
429A2246m13l971m992l105J896L194K159j38j600j192J127K103m74l355m322j807
445b644Q73L489M606J745k628m261k648R87J586P26j406j855m69L239M070O94
461F104l164m199l969j526K413N268K339k175l016p29N54R61N47j382m264k458
477h696K858N126L309R1k964m626l113J874L302Q11j226j93M92n89J208K383j174
494a127n064l643J120L214L420K490q12m219j896K008J211r85j419L13K3K73L497
$$ plain form
511 -1596 1850 127 -4360 -7143 -7442 -6883 -4468 -563 -793 -4235 -5519 -2971 -1315 -2358 -3217 -5925
527 -5925 -9228 -7315 -1003 2474 -44 -2011 -2882 -4520 -6219 -4325 -596 -1139 -3897 -4447 -2195 -454
543 -454 967 1176 -2982 -8191 -7629 -2046 801 -9 -308 -331 -2945 -3813 -1350 96 -2472 -3902 -2662
560 -2662 -1201 -361 1952 4313 1391 -3860 -5027 -2569 -835 441 1748 253 -2395 -546 3452
575 3452 3033 -1898 -3313 -1357 -1395 -865 2749 5524 3127 -96 -752 63 -392 1270 2645 243 -1878
592 -1878 895 5535 5564 2260 661 -876 -2545 -608 4447 5597 2380 1626 3220 2986 1578 2944
608 2944 3926 1268 -1005 1166 4840 6468 6454 5171 1393 -1751 966 5056 4617 2287 3161 4632
624 4632 3509 3880 5577 4905 790 -496 1831 3162 3908 6719 7283 3450 698 2161 4608 3775
$$ packed form
511a596L446j723m487k783k99N59K415L905k30l442j284K548J656j043q59k708
527e925l303J913O312L477k518j967q71j638j699J894L729n43k758n50K252J741
543d54J421K09m158n209N62N583K847q10k99k3k614q68K463J446k568j430J240
560b662J461Q40K313K361k922n251j167K458J734J276J307j495k648J849L998
575C452m19m931j415J956l8N30L614K775k397l223o56Q15m55J662J375k402k121
592a878K773M640K9l304j599j537j669J937N055J150l217p54J594k34j408J366
608B944R82k658k273K171L674J628j4j283l778l144K717M090m39k330Q74J471
624D632j123L71J697o72m115j286K327J331P46K811N64l833k752J463K447q33
$$ plain form
640 3775 2211 2623 2503 1980 4606 7949 5487 222 -114 1868 1472 1054 4453 5746 2264 377 2968
657 2968 4180 2447 1325 1045 -306 -1504 2109 6029 4769 1050 126 4 -1121 -615 1838 1932 -845
674 -845 -1093 1694 2385 771 432 -238 -2874 -4548 -1410 1805 2108 551 -734 -2203 -2535 -1393 -601
691 -601 -2114 -4057 -3365 -1585 -971 -85 549 -1170 -4823 -5967 -4006 -2084 -2062 -1890 -2003 -3460 -3518 -1509
709 -1509 -797 -3608 -5433 -5139 -4604 -4155 -952 696 -1583 -5101 -5455 -3552 -3543 -4574 -3115 -2595 -4399
726 -4399 -4716 -1229 207 -2337 -5041 -4947 -5095 -4620 -2613 133 -1185 -3699 -3174 -1723 -2554 -3320 -2278
743 -2278 -2540 -4924 -4408 -229 1549 -821 -2553 -2430 -3506 -4088 -2081 386 -475 -2113 -751 504
759 504 -225 127 562 -1221 -3711 -2741 589 1544 891 1322 1129 -1411 -2007 511 1941 -412 -1468 419
$$ packed form
640C775j564M12j20n23K626L343k462n265l36J982l96m18L399J293l482j887K591
657B968J212j733j122k80j351j198L613L920j260l719r24j22j125N06K453R4k777
674h45k48K787O91j614l39o70k636j674L138L215L03j557j285j469l32J142P92
691f01j513j943O92J780O14Q86O34j719l653j144J961J922K2J72j13j457n8K009
709a509P12k811j825K94N35M49L203J648k279l518l54J903Rj031J459N20j804
726d399l17L487J436k544k704R4j48M75K007K746j318k514N25J451q31p66J042
743b278k62k384N16M179J778k370j732J23j076n82K007K467q61j638J362J255
759E04p29L52M35j783k490R70L330R55o53M31j93k540n96K518J430k353j056J887
$$ plain form
777 419 1407 1200 2896 3370 337 -2113 -918 1271 1032 1573 3948 2919 72 572 3842 2640 138
794 138 356 1072 1077 1235 4257 4986 1917 -12 1079 1269 433 2164 3503 2188 477 2620 4748 3104
812 3104 1560 1762 830 -1119 498 4315 4236 2163 1474 2025 1167 375 2311 2460 -92 -337 2430 3250
830 3250 2422 2933 2987 206 -1998 519 3069 1930 1023 2359 1985 481 1233 3028 1466 -1460 -1153
847 -1153 939 1076 1791 3577 2901 -784 -1531 611 1287 -314 31 1233 306 -388 1864 3157 1148
864 1148 -1182 -1021 -760 -1084 912 2416 1224 -394 -288 1001 370 -897 239 -266 -1725 -1217 1632
881 1632 2444 565 -190 -515 -2056 -2164 -168 1034 89 -712 8 504 -99 291 448 -1883 -3253 -2038
899 -2038 85 778 543 304 -497 -1791 -1893 -437 -420 -1461 -1762 -1045 -725 -319 796 499 -1745 -2981
$$ packed form
777D19R88k07J696M74l033k450J195K189k39N41K375j029k847N00L270j202k502
794A38K18P16NJ58L022P29l069j929J091J90q36J731J339j315j711K143K128j644
812C104j544K02r32j949J617L817p9k073o89N51q58p92J936J49k552k45K767Q20
830C250q28N11N4k781k204K517K550j139r07J336l74j504P52J795j562k926L07
847a153K092J37P15J786o76l685p47K142O76j601L45J202r27o94K252J293k009
864A148k330J61K61l24J996J504j192j618J06J289o31j267J136n05j459N08K849
881A632Q12j879p55l25j541j08J996J202r45q01P20M96o03L90J57k331j370J215
899b038K123O93k35k39q01j294j02J456J7j041l01P17L20M06J115k97k244j236
$$ plain form
917 -2981 -2318 -1789 -1183 -225 268 -894 -2167 -1442 -319 -599 -1954 -2322 -2506 -1861 -818 172 0 -1025
935 -1025 -1878 -2361 -2594 -1868 -798 -1005 -1909 -1714 -994 -284 -267 -824 -2182 -2821 -3096 -1532 -51 202 -692
954 -692 -1323 -1874 -1702 -1259 -1396 -1539 -1982 -2073 -1136 -261 292 330 -695 -2339 -2719 -1368 -395 101 -110 -992
974 -992 -1006 -508 -5 -117 -657 -1848 -1768 -992 175 1200 1566 642 -697 -1192 -720 348 866 249 -150
993 -150 -340 439 1716 1763 1293 -139 -849 -589 399 1694 2238 1827 1087 581 947 1181 1395 1411 616 274
1013 274 959 2234 2960 2814 1658 452 260 836 1694 2343 1981 1557 1521 1871 2151 2162 1798 940 541 587
1033 587 1642 2980 3115 2248 1383 729 1202 1718 1688 1706 847 837 1721 2078 2264 2307 1080 -144 5 782
1053 782 1723 2014 1613 990 877 707 1001 1187 678 40 -444 271 1449 1883 1814 493 -294 -507 -117 272
$$ packed form
917b981O63N29O06R58M93j162j273P25J123k80j355l68j84O45J043R90j72j025
935a025q53m83k33P26J070k07r04J95P20P10J7n57j358o39k75J564J481K53q94
954f92o31n51J72M43j37j43m43r1R37Q75N53L8j025j644l80J351R73M96k11q82
974i92j4M98N03j12n40j191Q0P76J167J025L66r24j339m95M72J068N18o17l99
993a50j90P79J277M7m70j432p10K60R88J295N44m11p40n06L66K34K14J6p95l42
1013B74O85J275P26j46j156j206j92N76Q58O49l62m24l6L50K80J1l64q58l99M6
1033E87J055J338J35q67q65o54M73N16l0J8q59j0Q84L57J86M3j227j224J49P77
1053G82R41K91m01o23j13j70K94J86n09o38m84P15J178M34o9j321p87k13L90L89
$$ plain form
1073 272 637 388 -11 -148 -104 948 721 -171 -1029 -1434 -1270 -325 743 956 132 -633 -967 -617 -919 -489
1093 -489 -652 -1278 -1507 -655 50 253 -203 -902 -2037 -2047 -1328 -323 -263 -470 -919 -1266 -1085 -836 -432 -1086
1113 -1086 -2286 -2365 -1484 -780 -199 65 -576 -1660 -1995 -1558 -1073 -1057 -1027 -1446 -1378 -1046 -295 -155 -666 -1453
1133 -1453 -2124 -1749 -1093 -614 280 -120 -1340 -1394 -993 -1021 -633 -730 -1364 -1505 -782 -3 140 -74 -477 -1330
1153 -1330 -1958 -1084 -200 48 -209 -591 -252 -310 40 152 -322 -991 -1120 -1137 72 516 870 274 -652 -850
1173 -850 -539 -17 165 143 -275 -137 90 487 651 788 -274 -987 -594 -387 509 1233 425 108 -89 276
1193 276 379 226 485 -338 -296 96 992 1384 661 228 130 -553 -554 587 684 319 86 178 563 327 977 868
1215 868 -132 -802 -246 749 1073 1083 1327 327 -224 113 533 468 148 373 182 541 902 1913 925 170
$$ packed form
1073B72L65k49l99j37M4J052k27q92q58m05J64R45J068K13q24p65l34L50l02M30
1093d89j63o26k29Q52P05K03m56o99j135j0P19J005O0k07m49l47J81K49M04o54
1113a086j200p9Q81P04N81K64o41j084l35M37M85J6L0m19O8L32P51J40n11p87
1133a453o71L75O56M79Q94m00j220n4M01k8L88r7o34j41P23P79J43k14m03q53
1153a330o28Q74Q84K48k57l82L39n8L50J12m74o69j29j7J209M44L54n96r26j98
1173h50L11N22J82k2m18J38K27L97J64J37j062p13L93K07Q96P24q08l17j97L65
1193B76J03j53K59q23M2L92Q96L92p23m33r8o83jJ141R7l65k33R2L85k36O50j09
1215H68j000o70N56R95L24J0K44j000n51L37M20o5l20K25j91L59L61J011r88p55
$$ plain form
1235 170 -466 -112 504 515 1175 1481 390 189 699 1067 713 462 612 116 -194 1080 1926 1582 572
1254 572 655 236 -128 526 1460 1046 103 347 1196 922 728 1193 392 -708 -337 875 1270 754 1055 877
1274 877 163 -314 821 932 106 -630 201 627 353 1247 1438 69 -916 -650 430 239 264 884 583
1293 583 17 -3 803 316 -561 -439 -65 -702 -493 811 737 -281 -918 -736 -571 -1052 -676 2 -575 -1221
1313 -1221 -38 376 -246 -520 -881 -1400 -1723 -942 479 -52 -373 -793 -373 -950 -1443 -127 -570 -1755
1331 -1755 -1790 -564 -595 -699 -410 -245 -1239 -2044 -1254 -557 -841 -894 -636 -885 -1152 -1116 -351 -447 -1548 -1700 -911
1352 -911 -823 -500 158 -239 -1114 -1336 -885 -839 -749 -927 -660 -1079 -911 -104 1 -366 -1054 -902 -1129 -1095 -297
1373 -297 656 -98 -827 -462 -20 -60 -93 59 -236 -689 -418 337 617 404 -24 -262 -409 -308 254 539 243
$$ packed form
1235A70o36L54O16J1O60L06j091k01N10L68l54k51J50m96l10J274Q46l44j010
1254E72Q3m19l64O54R34m14r43K44Q49k74j94M65q01j100L71J212L95n16L01j78
1274H77p14m77J135J11q26p36Q31M26k74Q94J91j369r85K66J080j91K5O20l01
1293E83n66k0Q06m87q77J22L74o37K09J304p4j018o37J82J65m81L76O78n77o46
1313a221J183M14o22k74l61n19l23P81J421n31l21m20M20n77m93J316m43j185
1331a755l5J226l1j04K89J65r94q05P90O97k84n3K58k49k67L6P65r6j101j52P89
1352i11Q8L23O58l97q75k22M51M6R0j78K67m19J68Q07J05l67o88J52k27L4P98
1373b97R53p54p29L65M42m0l3J52k95m53K71P55K80k13m28k38j47J01N62K85k96
$$ plain form
1394 243 -38 202 508 548 654 461 13 -662 -222 434 1152 973 914 762 196 520 829 785 336 401 260
1415 260 806 1160 1432 1300 482 183 236 201 1082 799 972 801 499 822 701 969 555 306 66 488 753
1436 753 1110 1505 767 431 350 499 579 509 689 911 338 414 959 1457 598 10 -18 212 116 611 1059 1148
1458 1148 211 247 357 781 273 425 349 -297 -105 460 695 262 131 -80 -704 -428 366 572 328 -79
1478 -79 61 222 212 65 142 -222 -682 -454 24 431 12 -265 -263 -476 -418 -77 276 -777 -301 -386 -310 -27
1500 -27 302 173 -670 -1065 -537 -564 -148 184 150 -260 -626 -313 291 88 -425 -543 -597 -693 22 647 305 -515
1522 -515 -871 -455 -355 -387 -134 190 -260 -738 -147 178 -216 -443 -348 -1122 -873 -188 464 363 -204 -337 -389
1543 -389 -652 -417 -65 -42 -698 -785 25 -146 -12 433 -501 -1035 -746 -416 -262 -278 -290 -316 -571 -452 33 -272
$$ packed form
1394B43k81K40L06M0J06j93m48o75M40O56P18j79n9j52n66L24L09m4m49O5j41
1415B60N46L54K72j32q18k99N3l5Q81k83J73j71l02L23j21K68m14k49k40M22K65
1436G53L57L95p38l36q1J49Q0p0J80K22n73P6N45M98q59n88k8K30r6M95M48Q9
1458A148r37L6J10M24n08J52p6o46J92N65K35m33j31k11o24K76P94K06k44m07
1478g9J40J61j0j47P7l64m60K28M78M07m19k77Kk13N8L41L53j053M76q5P6K83
1500b7L29j29q43l95N28k7M16L32l4m10l66L13O04k03n13j18n4r6P15O25l42q20
1522e15l56M16J00l2K53L24m50m78N91L25l94k27R5p74K49O85O52j01n67j33n2
1543c89k63K35L52K3o56q7Q10j71J34M45r34n34K89L30J54j6j2k6k55J19M85l05
$$ plain form
1565 -272 -633 -917 -546 -258 -237 44 29 -55 -883 -735 -477 -315 -38 -570 -208 -509 -228 -29 185 -220 -464
1586 -464 -642 -699 -527 21 458 340 -299 -318 -158 -47 -253 -194 -487 -330 -28 650 435 381 138 -385 -468 -278
1608 -278 55 147 238 129 -147 111 463 189 -16 -332 -66 4 488 616 890 717 115 -17 178 442 597
1629 597 444 151 401 318 565 797 658 415 203 142 458 638 693 556 592 205 458 652 745 636 472 77
1651 77 390 719 1023 698 508 28 -28 226 663 795 604 227 438 453 1091 669 467 216 -182 -46 319
1672 319 648 668 853 150 174 12 314 510 -28 401 142 433 429 624 397 -77 -447 -125 73 329 142
1693 142 360 -36 -294 -388 15 39 -100 -205 -597 -300 -385 248 79 -334 -426 -328 -401 -129 -194 -138 -308 -277 -217
1716 -217 -152 -230 -171 -712 -812 -610 -507 32 -27 -528 -549 -623 -292 -530 -75 -476 -467 -745 -376 -396 -121 -169 -514
$$ packed form
1565b72l61k84L71K88K1K81j5q4q28J48K58J62K77n32L62l01K81J99K14m05k44
1586d64j78n7J72N48M37j18o39j9J60J11k06N9k93J57L02O78k15n4k43n23q3J90
1608b78L33R2R1j09k76K58L52k74k05l16K66P0M84J28K74j73o02j32J95K64J55
1629E97j53k93K50q3K47K32j39k43k12o1L16J80N5j37L6l87K53J94R3j09j64l95
1651G7L13L29L04l25j90m80n6K54M37J32j91l77K11J5O38m22k02k51l98J36L65
1672C19L29K0J85p03K4j62L02J96n38M29k59K91mJ95k27m74l70L22J98K56j87
1693A42K18l96k58r4M03K4j39j05l92K97q5O33j69m13r2R8p3K72o5N6j70L1O0
1716b17O5p8N9n41j00K02J03N39n9n01k1p4L31k38M55m01Rk78L69k0K75m8l45
$$ plain form
1739 -514 -877 -821 -634 -302 23 -572 -452 -211 -790 -348 -145 -495 -798 -846 -491 -307 -81 -99 -214 -297 -494
1760 -494 -304 -148 -369 -260 -303 -409 -241 -55 151 -110 -101 -390 -447 -158 -2 155 -30 55 -168 -173 98 132 71
1783 71 -99 -439 -186 159 264 146 -116 -346 -245 -200 326 397 288 -16 84 80 -178 160 -39 -26 -7 -316
1805 -316 234 416 304 -62 73 -82 -36 68 303 319 223 147 443 551 446 -44 131 -264 4 12 33 473
1827 473 -65 229 277 38 242 299 408 -110 -290 210 199 516 445 51 -56 -221 177 178 352 255 275 -131 171
1850 171 174 145 348 -165 -8 141 435 295 340 176 241 -213 -192 197 245 -94 -23 32 91 445 490 180 125 -152
1874 -152 19 258 226 350 33 403 49 154 426 98 -28 21 -287 395 249 700 265 355 -8 -160 64
1895 64 335 187 248 -23 251 193 26 237 -70 37 -222 276 -51 293 233 5 198 8 319 237 -41 -77
$$ packed form
1739e14l63N6J87L32L25n95J20K41n79M42K03l50l03m8L55J84K26j8j15q3j97
1760d94J90J56k21J09m3j06J68J86K06k61Rk89n7K89J56J57j85Q5k23nK71L4o1
1783G1j70l40K53L45J05j18k62k30J01M5N26P1j09l04J00mk58L38j99J3J9l09
1805c16N50J82j12l66J35j55M6J04K35J6r6p6K96J08j05m90J75l95K68QK1M40
1827D73n38K94M8k39K04N7J09n18j80N00j1L17p1l94j07j65L98JJ74r7K0m06L02
1850A71Lk9K03n13J57J49K94j40M5j64O5m54K1L89M8l39P1N5N9L54M5l10n5k77
1874a52J71K39l2J24l17L70l54J05K72l28j26M9l08O82j46M51m35R0l63j52K24
1895F4K71j48O1k71K74n8j67K11l07J07k59M98l27L44o0k28J93j90L11q2k78l6
$$ plain form
1917 -77 -231 -267 -259 340 404 12 49 -159 -271 -162 233 191 35 -290 21 -37 69 30 -76 -381 -646 -366 135
1940 135 -69 31 42 -342 -458 -416 -169 -363 0 -521 -266 -512 -118 79 -346 -543 -548 -357 -424 -293 93 -232
1962 -232 -333 -228 -350 -247 -306 -344 -671 -520 -304 -479 -98 -204 -352 -287 -598 -573 -417 -391 -257 -479 -256 -176
1984 -176 19 -231 -52 -281 -307 -245 -221 155 -97 -336 -93 -177 -162 -34 210 -242 -114 -242 -122 67 146 228
2006 228 211 0 -176 97 280 240 78 276 -69 70 -34 561 237 182 59 64 224 486 580 196 -125 274
2028 274 104 154 108 222 327 98 479 332 494 258 241 41 193 80 470 270 59 93 383 393 311 347
2050 347 410 44 435 158 475 330 675 125 68 -35 318 556 389 232 106 155 -146 257 386 81 105
2071 105 -245 183 450 301 286 184 -180 -175 63 426 -34 100 201 -8 -281 242 487 -71 -45 -461 -172
$$ packed form
1917g7j54l6QN99O4l92L7k08j12J09L95m2j56l25L11n8J06l9j06l05k65K80N01
1940A35k04J00J1l84j16M2K47j94L63n21K55k46L94J97m25j97nJ91o7J31L86l25
1962b32j01J05j22J03n9l8l27J51K16j75L81j06j48O5l11K5J56K6J34k22K23Q0
1984a76J95k50J79k29k6O2K4L76k52k39K43q4J5J28K44m52J28j28J20J89P9Q2
2006B28j7k11j76K73J83m0j62J98l45J39j04N95l24n5j23NJ60K62R4l84l21L99
2028B74j70N0m6J14J05k29L81j47J62k36j7k00J52j13L90k00k11L4K90J0q2L6
2050C47O3l66L91k77L17j45L45n50n7j03L53K38j67j57j26M9l01M03J29l05K4
2071A05l50M28K67j49j5j02l64NK38L63m60J34J01k09k73N23K45n58K6m16K89
$$ plain form
2092 -172 13 37 360 81 -432 -99 166 264 7 -156 -105 -332 -245 74 107 -18 101 -96 -130 -184 223 -33
2114 -33 -4 -273 72 -77 40 -81 -133 -234 -342 26 -53 107 -113 -71 -229 -111 -293 -158 210 -79 -136 115
2136 115 -149 -14 202 249 -37 -528 -380 -126 -272 -206 83 18 -149 198 -81 -155 -74 -206 -168 -248 205 -166
2158 -166 184 -9 -87 -349 -89 -177 -90 -40 -288 48 85 98 128 -45 -271 -199 -222 56 -23 -4 -10 -167 -255 -56 -85
2183 -85 269 -326 -373 -59 -3 -3 166 -146 -219 22 -16 82 -50 34 244 -67 -242 -251 -3 -211 138 -144 -89 -15
2207 -15 39 265 72 -357 45 -117 -200 -26 -37 -8 -289 -234 -50 276 47 -186 -16 -343 -87 125 188 -113
2229 -113 -114 -66 144 15 166 -20 100 -10 -143 -35 382 332 -94 212 -121 138 87 55 -163 -77 66 -27 197
2252 197 151 121 382 83 -115 4 -67 -74 186 61 166 -220 24 160 370 213 168 -133 391 253 261 68 2
$$ packed form
2092a72J85K4L23k79n13L33K65R8k57j63N1k27Q7L19L3j25J19j97l4n4M07k56
2114c3K9k69L45j49J17j21n2j01j08L68p9J60k20M2j58J18j82J35L68k89n7K51
2136A15k64J35K16M7k86m91J48K54j46O6K89o5j67L47k79p4Q1j32L8q0M53l71
2158a66L50j93p8k62K60q8Q7N0k48L36L7J3L0j73k26P2k3K78p9J9oj57q8J99k9
2183h5L54n95m7L14N6%J69l12p3K41l8R8j32Q4K10l11j75rK48k08L49k82N5P4
2207a5N4K26j93m29M02j62q3J74j1K9k81N5J84L26k29k33J70l27K56K12O3l01
2229a13jM8K10j29J51j86J20j10j33J08M17n0m26L06l33K59n1l2k18Q6J43r3K24
2252A97m6l0K61k99j98J19p1pK60j25J05l86K44J36K10j57m5l01N24j38Qj93o6
$$ plain form
2275 2 161 -92 340 214 322 324 71 289 134 300 173 71 377 205 97 310 373 278 357 82 104 -20 -35
2298 -35 401 231 135 188 241 172 269 -153 -75 -15 -22 58 254 164 275 -82 32 -65 -276 -181 139 -142 258 -8 -192
2323 -192 498 65 30 57 -391 -270 3 -91 -52 -153 -219 -162 -75 -34 97 -333 -153 -328 131 81 150 2 -276
2346 -276 12 -93 -56 3 27 28 -256 -181 -307 -221 -476 -10 -553 -49 -184 -11 -236 -103 -345 -306 -239 -370 10
2369 10 -146 -293 -324 -102 86 207 -261 -147 -89 -124 -200 -335 -340 -90 55 -69 168 -44 -58 125 15 -479 -25
2392 -25 17 58 -179 112 -57 -89 174 75 -16 40 308 115 159 113 -270 -66 -529 125 65 -90 28 144 129 -135
2416 -135 -77 57 7 46 80 34 -16 -155 170 397 89 224 294 -72 112 -28 -46 -145 223 20 332 192 -19
2439 -19 81 41 -7 -11 -25 464 61 308 -77 -34 93 -172 121 114 268 -48 191 116 78 -7 41 238 374 222
$$ packed form
2275BJ59k53M32j26J08Kk53K18j55J66j27j02L06j72j08K13O3r5P9k75K2j24j5
2298c5M36j70r6N3N3o9R7m22P8O0pQ0J96r0J11l57J14r7k11R5L20k81M00k66j84
2323a92O90m33l5K7m48J21K73r4L9j01o6N7Q7M1J31m30J80j75M59n0O9j48k78
2346b76K88j05L7N9K4Jk84P5j26Q6k55M66n43N04j35J73k25J33k42L9O7j31L80
2369A0j56j47l1K22J88J21m68J14N8l5p6j35nK50J45j24K37k12j4J83j10m94M54
2392b5M2M1k37K91j69l2K63r9r1N6K68j93M4m6l83K04m63O54o0j55J18J16j5k64
2416a35N8J34n0L9L4m6n0j39L25K27l08J35P0l66J84j40j8r9L68k03L12j40k11
2439a9J00m0m8mj4M89m03K47l85M3J27k65K93pJ54l16K39p5l8q5M8J97J36j52
$$ plain form
2463 222 37 232 94 247 226 180 357 5 -55 81 -334 -196 -87 65 -53 -96 38 -270 149 -119 110
2484 110 -153 -254 -84 75 157 93 303 -23 3 -268 -133 145 41 -93 -55 -119 -104 68 77 248 135 77 -368
2507 -368 210 75 28 -59 -49 -31 -23 291 27 20 -226 -57 -270 -89 245 -104 119 -236 -52 55 -193 -67 160
2530 160 8 -72 186 427 -246 -336 -185 -94 92 39 36 250 -128 -165 212 68 -172 96 165 55 -96 -61 15
2553 15 27 93 57 -389 -228 207 222 -35 -133 -214 157 28 -67 -108 15 203 -376 -216 157 -29 -132 -121 -276
2576 -276 -38 -440 19 -77 -256 -9 45 -32 103 -139 -67 41 -261 -32 82 -13 159 106 -35 10 -60 107 167
2599 167 -77 -209 -175 -55 -65 -132 18 105 -221 -71 9 33 -234 -291 -103 19 -12 -425 -249 -278 -88 82 79 -54
2623 -54 215 0 -143 -119 -79 264 -256 76 178 172 -66 39 -150 256 79 68 24 344 149 103 151 239 -69
$$ packed form
2463B22j85J95j38J53k1m6J77l52o0J36m15J38J09J52j18m3J34l08M19k68K29
2484A10k63j01J70J59Q2o4K10l26K6k71J35K78j04j34L8o4J5J72RJ71j13n8m45
2507c68N78j35m7q7J0J8QL14k64pk46J69k13J81L34l49K23l55J84J07k48J26K27
2530A60j52q0K58K41o73r0J51R1J86n3lK14l78l7L77j44k40K68O9j10j51L5P6
2553A5J2O6l6m46J61M35J5k57r8q1L71j29r5m1J23J88n79J60L73j86j03J1j55
2576b76K38m02M59r6j79K47N4p7J35k42P2J08l02K29J14r5J72n3j41M5p0J67O0
2599A67k44j32L4J20j0o7J50Q7l26J50Q0K4k67n7J88J22l1m13J76k9J90J70lj33
2623e4K69k15j43K4M0L43n20L32J02ok38J05j89M06j77j1m4L20j95m6M8Q8l08
$$ plain form
2646 -69 181 138 149 113 271 -73 88 -107 198 148 -30 295 349 109 -153 221 317 -12 -52 124 178 -119 407
2669 407 -44 215 5 113 210 166 405 42 -258 -179 -146 274 195 283 65 306 -185 47 264 75 229 85
2691 85 227 158 -61 -58 -94 -35 152 -27 53 -264 91 -3 52 -13 138 -102 92 -326 -127 102 -291 36 -6 -59
2715 -59 -128 -174 -195 150 17 118 169 75 -51 -214 -113 -220 -199 -2 -213 -50 44 -143 57 -258 -250 11 -162
2738 -162 -317 -269 -76 -133 88 102 -95 116 61 54 -122 -493 -427 53 115 -149 -297 145 110 74 -158 -76 -363 -149
2762 -149 -105 -60 -53 -203 -270 -147 244 16 -30 -309 29 -14 -177 321 53 118 61 56 -82 -55 147 81 176 -48 7
2787 7 -93 90 25 79 -179 177 45 -84 -359 104 174 -25 -48 240 -14 164 284 -233 -137 116 56 189 232
2810 232 44 9 58 92 9 -4 -362 -284 -76 33 231 -196 -84 -305 -267 185 285 38 -116 -1 40 -77 239
$$ packed form
2646f9K50m3J1l6J58l44J61j95L05n0j78L25N4k40k62L74R6l29m0J76N4k97N26
2669D07m51K59k10J08R7m4K39l63l00P9L3M20p9Q8k18K41m91K32K17j89J54j44
2691H5J42o9k19Ll6N9J87j79Q0l17L55r4N5o5J51k40J94m18J99K29l93L27m2n3
2715e9o9m6k1L45j33J01N1r4j26j63J01j07K1J97k11J63R4j87K00l15QK61j73
2738a62j55M8J93n7K21J4j97K11n5pj76l71O6M80O2k64j48M42l5l6k32Q2k87K14
2762a49M4M5Pj50o7J23L91k28m6k79L38m3j63M98k68O5n7nj38K7K02o6R5k24N5
2787Gj00J83o5N4k58L56j32j29k75M63P0j99k3K88k54J78J20n17R6K53o0J33M3
2810B32j88l5M9L4q3j3l58P8K08J09J98m27J12k21L8M52J00k47j54J15M1j17L16
$$ plain form
2833 239 125 132 -169 103 152 20 -57 -26 -235 132 92 -325 118 180 129 114 -53 169 15 14 -43 -130 42 -180
2857 -180 66 -147 149 -74 -118 378 113 117 -29 211 -34 -2 -80 173 -17 -44 209 -2 -130 144 -97 55
2879 55 115 -233 -104 -29 135 74 241 94 64 -153 -7 -107 70 -108 96 107 -101 66 65 25 70 176 -58
2902 -58 -50 -212 -141 87 87 -26 -2 38 -224 -35 220 -83 -15 131 55 119 101 -175 -15 142 196 196 -245 -98 107
2927 107 -58 296 -53 76 290 -59 -1 79 351 92 271 98 -71 86 -166 148 2 -238 -115 -128 225
2948 225 -55 -26 -273 125 -63 93 278 -62 -166 -147 -245 -131 79 104 -22 -93 -153 48 -234 104 -58 264
2970 264 -141 -249 179 -40 -41 21 152 -170 -344 -43 -73 13 -24 137 -303 -173 44 -139 -139 -40 -165 -46 6
2993 6 -224 -203 -25 109 -81 -165 76 -109 8 142 -194 -145 -301 -52 -150 -204 -136 -187 12 52 -250 -61 12 -157
$$ packed form
2833B39j14Pl01K72M9j32p7L1k09L67m0m17M43O2n1j5j67K22j54jn7q7J72k22
2857a80K46k13K96k23m4M96k65Mj46K40k45L2p8K53j90k7K53k11j28K74k41J52
2879E5O0l48J29P5J64o1J67j47l0k17J46j00J77j78K04J1k08J67jm0M5J06k34
2902e8Qj62P1K28%j13K4M0k62J89K55l03O8J46p6O4j8k76J60J57N4%m41J47K05
2927A07j65L54l49J29K14l49N8Q0K72k59J79j73j69J57k52L14j46k40J23j3L53
2948B25k80K9k47L98j88J56J85l40j04J9r8J14K10K5j26p1o0K01k82L38j62L22
2970B64m05j08M28k19jO2J31l22j74L01l0Q6l7J61m40J30K17j83%R9j25J19N2
2993Fk30K1J78J34j90q4K41j85J17J34l36M9j56K49r8n4O8n1J99M0l02J89P3j69
$$ plain form
3017 -157 -34 -47 227 -124 358 -31 -105 114 -60 83 127 154 -162 8 248 -16 99 -144 -79 108 274 -278
3039 -278 -486 -198 190 113 249 -67 -84 -1 139 16 145 -94 340 177 7 -67 324 402 -16 271 49 36
3061 36 237 -235 168 82 89 -77 -21 403 70 24 -94 57 274 26 43 -138 -86 190 -77 -230 -2 -92 -60
3084 -60 42 162 133 230 -29 -98 101 -94 -60 -11 -59 -25 -194 -136 271 169 -82 157 -352 -76 -42 -183 49
3107 49 111 13 131 -152 -148 -110 111 20 -13 81 72 -148 -183 -253 -155 -406 -105 143 -1 -72 226 -195 -41 -338 -87
3132 -87 -183 -277 198 104 -222 -173 -181 88 -167 -90 -39 21 367 -109 10 -97 180 156 198 -100 3 -139 69 76 -134
3157 -134 -107 33 9 26 -86 12 93 -109 -224 30 10 148 66 130 -264 -48 -241 80 -42 -36 155 -30 -4 320
3181 320 -398 -26 185 -10 -113 -74 175 -61 88 29 -91 -117 -51 -75 -82 7 181 -211 -54 -239 -9 220 154
$$ packed form
3017a57J23j3K74l51M82l89p4K19j74J43M4K7l16J70K40k64J15k43O5J87J66n52
3039b78k08K88L88p7J36l16j7Q3J40j23J29k39M34j63j70p4L91P8m18K87k22j3
3061C6K01m72M03q6Pj66N6M24l33m6j18J51K17k48J7j81N2K76k67j53K28r0L2
3084f0J02J20k9R7k59o9J99j95L4M9m8L4j69N8M07j02k51K39n09K76L4j41K32
3107D9O2r8J18k83ML8K21r1l3R4rk20l5p0R8k51L01K48j44p1K98m21J54k97K51
3132h7r6r4M75r4l26M9qK69k55P7N1O0L46m76J19j07K77k4M2k98J03j42K08Pk10
3157a34K7J40k4J7j12R8Q1k02j15K54k0J38q2O4l94K16j93L21j22OJ91j85K6L24
3181C20p18L72K11j95j03L9K49k36J49n9j20k6O6k4pQ9J74l92J57j85K30K29o6
$$ plain form
3204 154 -93 -117 191 145 -42 -278 235 10 71 -48 93 53 255 235 70 -8 261 228 -51 -63 -87 9 108 182
3228 182 -63 -43 -34 182 -83 133 165 80 79 -140 -78 118 -73 -249 -3 104 61 -109 -38 348 50 -46 49 -9
3252 -9 177 81 -167 -154 18 178 -164 -80 356 22 -162 -129 20 -115 158 24 24 47 -166 437 -146 91 113
3275 113 4 -35 3 185 -81 -321 95 73 2 104 58 37 38 -20 -99 316 9 12 3 132 50 -77 114 225 -108
3300 -108 7 354 -23 155 46 -217 -97 21 -68 151 -235 112 33 71 36 -228 117 -36 172 82 351 44
3322 44 -24 66 151 92 176 -45 179 69 113 -79 -122 -83 -89 -119 -120 -102 98 25 28 83 -111 -115 28 -74 -141 -72 -76 -107 -65
3351 -65 54 -271 45 -104 -99 -76 67 107 -169 268 43 -222 -148 -31 -305 -21 -133 158 -7 172 -132 -264
3373 -264 121 29 -102 -177 -25 -258 26 -344 -236 105 -35 -437 47 -243 127 -171 38 -322 64 -7 35
$$ packed form
3204A54k47k4L08m6j87k36N13k25O1j19J41m0K02k0j65p8K69l3k79j2k4R6R9P4
3228A82k45K0RK16k65K16L2q5jk19O2J96j91j76K46J07m3j70P1L86k98r6R5n8
3252iJ86r6k48J3J72J60l42Q4M36l34j84L3J49j35K73j34%K3k13O03n83K37K2
3275A13j09l9L8J82k66k40M16k2p1J02m6k1Jn8p9M15l07LrJ29q2j27J91J11l33
3300a08J15L47l77J78j09k63J20J18q9K19l86L47p9L8l5k64L45j53K08r0K69l07
3322D4o8R0Q5n9Q4k21K24j10M4j92m3L9ol0jJ8K00p3LN5j94mJ43j02o7O9ml1M2
3351f5J19l25L16j49NK3J43M0k76M37k25k65P4J17k74K84j12K91j65J79l04j32
3373b64L85r2j31p5J52k33K84l70J08L41j40m02M84k90L70k98K09l60L86p1M2
$$ plain form
3394 35 87 248 -310 180 -183 49 2 -234 96 -124 250 -85 -122 247 -115 26 -277 -197 -115 -2 -130 266
3416 266 -57 -31 -262 -176 156 -63 193 -160 40 -153 55 -21 128 -20 -58 -106 144 73 203 156 -38 -129 -122
3439 -122 -57 96 -232 -35 -76 166 -116 193 38 257 48 98 82 -70 -98 162 -4 -132 88 211 34 73
3461 73 -204 -246 157 10 -148 105 -16 -265 -53 -132 -140 -193 104 56 49 -12 6 -163 -132 187 -136 -133 -45 110 136
3486 136 -250 -452 237 170 -161 -17 -129 58 316 79 -26 24 26 23 142 20 178 -166 -8 129 62 -112
3508 -112 -117 239 135 -134 -67 -45 -157 10 69 15 13 -84 93 144 -71 112 38 -232 -168 30 -151 29 3 183
3532 183 -9 -46 -107 -110 32 376 326 -198 263 -131 -65 -150 291 45 -195 164 118 272 215 285 32 258 39
3555 39 6 108 -60 160 361 185 -131 -180 -73 44 -38 -151 441 115 -43 43 -186 -312 -62 -90 -121 136
$$ packed form
3394C5N2J61n58M90l63K32m7k36L30k20L74l35l7L69l62J41l03Q0Q2J13j28L96
3416B66l23K6k31Q6L32k19K56l53K00j93K08p6J49j48l8m8K50p1J30m7j94r1P
3439a22O5J53l28J97m1K42k82L09j55K19k09N0j6j52k8K60j66j28K20J23j77L9
3461G3k77m2M03j47j58K53j21k49K12p9qn3K97m8po1J8j69L1L19l23LQ8J55K6
3486A36l86k02O89o7l31J44j12J87K58k37j05N0KlJ19j22J58l44J58J37o7j74
3508a12nL56j04k69O7K2j12J67N9n4kr7J77N1k15J83p4k70O4J98j81J80k6J80
3532A83j92l7o1lJ42L44n0n24M61l94O6q5M41k46k40L59m6J54n7P0k53K26k19
3555C9l3J02j68K20K01j76l16m9J07J17q2j13N92l26j58Q6k29j26K50k8l1K57
$$ plain form
3577 136 -150 96 -91 7 73 -65 95 -46 121 -16 -101 60 -106 28 -47 141 -206 60 213 -125 -104 47
3599 47 -106 -75 -222 242 62 38 -85 265 196 -236 -285 -1 -133 -113 -202 -382 2 -290 -313 -82 89 -182 -33
3622 -33 -8 126 -90 71 -226 -201 -155 -120 74 39 -271 -232 19 -10 150 -101 72 5 -249 -194 33 -48 108 -84
3646 -84 8 -133 -62 97 133 336 3 298 215 268 175 -55 -104 -105 47 40 -2 139 -292 -66 310 -67 -25 114 129
3671 129 183 -58 41 -133 285 104 96 -148 -94 -296 211 158 210 -155 -130 -42 -213 -18 127 -102 125 70 -182
$$ packed form
3577A36k86K46j87R8O6j38J60j41J67j37q5J61j66J34p5J88l47K66J53l38K1J51
3599D7j53L1j47M64j80k4j23L50o9m32m9K84j32K0q9j80L84k92k3K31J71k71J49
3622c3K5J34k16J61k97K5M6L5J94l5l10L9K51k9J60k51J73o7k54N5K27q1J56j92
3646h4R2j41P1J59L6K03l33K95q3N3r3k30m9jJ52pm2J41m31K26L76l77M2J39J5
3671A29N4k41R9j74M18j81qk44N4k02N07n3N2l65K5Q8j71J95J45k29K27n5k52
$$ [...]
8191a31
##END NTUPLES=NMR FID
##END=
