##TITLE=1H_SR2-Host
 D2O, 8 sc, 
 25.10.2019
##JCAMPDX= 6.0         $$ Bruker NMR JCAMP-DX V2.0
##DATA TYPE= NMR FID
##DATA CLASS= NTUPLES
##ORIGIN= UXNMR, Bruker Analytische Messtechnik GmbH
##OWNER= root
$$ XWIN-NMR		Version 3.5
$$ Fri Oct 25 15:15:51 2019 Russian Standard Time (UT+4h)  she@DPX200
##.OBSERVE FREQUENCY= 200.1315
##.OBSERVE NUCLEUS= ^1H
##.DELAY= (6, 6)
##.ACQUISITION MODE= SIMULTANEOUS
##.ACQUISITION SCHEME= undefined
##.AVERAGES= 8
##.DIGITISER RES= 18
##SPECTROMETER/DATA SYSTEM= spect
##.PULSE SEQUENCE= zg30
##.SOLVENT NAME= D2O
##.SHIFT REFERENCE= (INTERNAL, D2O, 0, 15.7039)
##AUDIT TRAIL= $$ (NUMBER, WHEN, WHO, WHERE, WHAT)
$$ ##TITLE= Audit trail, XWIN-NMR		Version 3.5
$$ ##JCAMPDX= 5.01
$$ ##ORIGIN= Bruker BioSpin GmbH
$$ ##OWNER= she
$$ F:/spectra/data/she/nmr/H-F/1/audita.txt
$$ ##AUDIT TRAIL=  $$ (NUMBER, WHEN, WHO, WHERE, WHAT)
(   1,<2019-10-25 15:14:36.32 +0400>,<she>,<DPX200>,
      <created by zg, POWCHK disabled, PULCHK disabled
       configuration hash MD5:
       00 E9 B6 7A A2 85 ED C7 34 08 36 98 17 FE 4E 26
       data hash MD5: 16K
       91 DD 79 9C 00 A4 CB FC 13 39 F1 A2 50 14 02 BE>)
$$ ##END=
$$ 
$$ hash MD5
$$ 39 A3 CF D2 D3 51 F5 BA 29 BB 31 DD 1F 6D 12 88
##$RELAX= 
##$RELAX= 
##$RELAX= 
##$RELAX= 
##$RELAX= 
##$RELAX= 
$$ Bruker specific parameters
$$ --------------------------
##$DU= <F:/spectra>
##$EXPNO= 1
##$NAME= <H-F>
##$PROCNO= 1
##$TYPE= <nmr>
##$USER= <she>
##$AMP= (0..31)
100 100 100 100 100 100 100 100 100 100 100 100 100 100 100 100 100 100 
100 100 100 100 100 100 100 100 100 100 100 100 100 100 
##$AQSEQ= 0
##$AQ_mod= 1
##$AUNM= <au_zg>
##$AUTOPOS= <>
##$BF1= 200.13
##$BF2= 200.13
##$BF3= 200.13
##$BF4= 200.13
##$BF5= 200.13
##$BF6= 200.13
##$BF7= 200.13
##$BF8= 200.13
##$BYTORDA= 1
##$CFDGTYP= 0
##$CFRGTYP= 5
##$CHEMSTR= <none>
##$CNST= (0..31)
1 1 145 1 1 1 1 1 1 1 1 1 1 1 1 1 1 1 1 1 1 1 1 1 1 1 1 1 1 1 1 1 
##$CPDPRG= <>
##$CPDPRG1= <>
##$CPDPRG2= <>
##$CPDPRG3= <>
##$CPDPRG4= <mlev>
##$CPDPRG5= <mlev>
##$CPDPRG6= <mlev>
##$CPDPRG7= <mlev>
##$CPDPRG8= <mlev>
##$CPDPRGB= <>
##$CPDPRGT= <>
##$D= (0..31)
0 1.2 0 0 0 0 0 0 0 0.06 0 0.03 0 0 0 0 0.0002 0 0 0 0 0 0 0 0 0 0 0 0 
0 0 0 
##$DATE= 1572002075
##$DBL= (0..7)
120 120 120 120 120 120 120 120 
##$DBP= (0..7)
150 150 150 150 150 150 150 150 
##$DBP07= 0
##$DBPNAM0= <>
##$DBPNAM1= <>
##$DBPNAM2= <>
##$DBPNAM3= <>
##$DBPNAM4= <>
##$DBPNAM5= <>
##$DBPNAM6= <>
##$DBPNAM7= <>
##$DBPOAL= (0..7)
0.5 0.5 0.5 0.5 0.5 0.5 0.5 0.5 
##$DBPOFFS= (0..7)
0 0 0 0 0 0 0 0 
##$DE= 6
##$DECBNUC= <off>
##$DECIM= 24
##$DECNUC= <off>
##$DECSTAT= 4
##$DIGMOD= 1
##$DIGTYP= 9
##$DL= (0..7)
0 120 120 120 120 120 120 120 
##$DP= (0..7)
150 150 150 150 150 150 150 150 
##$DP07= 0
##$DPNAME0= <>
##$DPNAME1= <>
##$DPNAME2= <>
##$DPNAME3= <>
##$DPNAME4= <>
##$DPNAME5= <>
##$DPNAME6= <>
##$DPNAME7= <>
##$DPOAL= (0..7)
0.5 0.5 0.5 0.5 0.5 0.5 0.5 0.5 
##$DPOFFS= (0..7)
0 0 0 0 0 0 0 0 
##$DQDMODE= 0
##$DR= 18
##$DS= 0
##$DSLIST= <SSSSSSSSSSSSSSS>
##$DSPFIRM= 0
$$ [...]
##$SUBNAM2= <"">
##$SUBNAM3= <"">
##$SUBNAM4= <"">
##$SUBNAM5= <"">
##$SUBNAM6= <"">
##$SUBNAM7= <"">
##$SUBNAM8= <"">
##$SUBNAM9= <"">
##$SW= 24.0689530833862
##$SWIBOX= (0..15)
0 0 2 0 0 0 0 0 0 0 0 0 0 0 0 0 
##$SW_h= 4816.95568400771
##$TD= 16384
##$TD0= 1
##$TE= 0
##$TE2= 300
##$TE3= 300
##$TEG= 300
##$TL= (0..7)
0 120 120 120 120 120 120 120 
##$TP= (0..7)
150 150 150 150 150 150 150 150 
##$TP07= 0
##$TPNAME0= <>
##$TPNAME1= <>
##$TPNAME2= <>
##$TPNAME3= <>
##$TPNAME4= <>
##$TPNAME5= <>
##$TPNAME6= <>
##$TPNAME7= <>
##$TPOAL= (0..7)
0.5 0.5 0.5 0.5 0.5 0.5 0.5 0.5 
##$TPOFFS= (0..7)
0 0 0 0 0 0 0 0 
##$TUNHIN= 0
##$TUNHOUT= 0
##$TUNXOUT= 0
##$USERA1= <user>
##$USERA2= <user>
##$USERA3= <user>
##$USERA4= <user>
##$USERA5= <user>
##$V9= 5
##$VALIST= <valist>
##$VCLIST= <CCCCCCCCCCCCCCC>
##$VD= 0
##$VDLIST= <DDDDDDDDDDDDDDD>
##$VPLIST= <PPPPPPPPPPPPPPP>
##$VTLIST= <TTTTTTTTTTTTTTT>
##$WBST= 1024
##$WBSW= 4
##$XGAIN= (0..3)
0 0 0 0 
##$XL= 0
##$YL= 0
##$YMAX_a= 805627
##$YMIN_a= -1112179
##$ZGOPTNS= <>
##$ZL1= 120
##$ZL2= 120
##$ZL3= 120
##$ZL4= 120
##$ABSF1= 10
##$ABSF2= 0
##$ABSG= 5
##$ABSL= 3
##$ALPHA= 0
##$AQORDER= 0
##$ASSFAC= 0
##$ASSFACI= 0
##$ASSFACX= 0
##$ASSWID= 0
##$AUNMP= <proc_1d>
##$AZFE= 0.1
##$AZFW= 0.1
##$BCFW= 1
##$BC_mod= 2
##$BYTORDP= 1
##$COROFFS= 0
##$CY= 11.3945322036743
##$DATMOD= 1
##$DC= 2
##$DFILT= <>
##$DTYPP= 0
##$F1P= 19.5091578491511
##$F2P= -0.509923556040331
##$FCOR= 0.5
##$FTSIZE= 0
##$FT_mod= 4
##$GAMMA= 1
##$GB= 0.15
##$INTBC= 1
##$INTSCL= 1
##$ISEN= 128
##$LB= 0.24
##$LEV0= 0
##$LPBIN= 0
##$MAXI= 10000
##$MC2= 0
##$MEAN= 0
##$ME_mod= 0
##$MI= 1.114404
##$NCOEF= 0
##$NC_proc= 0
##$NLEV= 6
##$NOISF1= 3.799351
##$NOISF2= 2.8
##$NSP= 1
##$NTH_PI= 0
##$NZP= 0
##$OFFSET= 15.70392
##$PC= 1
##$PHC0= -9573.508
##$PHC1= 12.20082
##$PH_mod= 1
##$PKNL= yes
##$PPARMOD= 0
##$PSCAL= 0
##$PSIGN= 0
##$REVERSE= no
##$SF= 200.130013532006
##$SI= 16384
##$SIGF1= 3
##$SIGF2= 2
##$SINO= 400
##$SIOLD= 16384
##$SREGLST= <1H.CDCl3>
##$SSB= 0
##$STSI= 0
##$STSR= 0
##$SW_p= 3612.71676300578
##$SYMM= 0
##$S_DEV= 0
##$TDeff= 0
##$TDoff= 0
##$TI= <>
##$TILT= no
##$TM1= 0
##$TM2= 0
##$TOPLEV= 0
##$USERP1= <user>
##$USERP2= <user>
##$USERP3= <user>
##$USERP4= <user>
##$USERP5= <user>
##$WDW= 1
##$XDIM= 8192
##$YMAX_p= 0
##$YMIN_p= 0
$$ End of Bruker specific parameters
$$ ---------------------------------
##NTUPLES= NMR FID
##VAR_NAME=  TIME,          FID/REAL,        FID/IMAG
##SYMBOL=    X,             R,               I
##VAR_TYPE=  INDEPENDENT,   DEPENDENT,       DEPENDENT
##VAR_FORM=  AFFN,          ASDF,            ASDF
##VAR_DIM=   8192,          8192,            8192
##UNITS=     SECONDS,       ARBITRARY UNITS, ARBITRARY UNITS
##FACTOR=    0.0002076,     1,               1
##FIRST=     0,             0,               0
##LAST=      1.7004516,     0,               0
##MIN=       0,             -1112179,        0
##MAX=       1.7004516,     805627,          0
$$ Real data points
##PAGE= N=1
##DATA TABLE= (X++(R..R)), XYDATA
0@%%%qK4l2L2m0N6q0R6j12J50j82K24k78L26l92M67n49O49p55Q79j019J170j345
26g19J535j751J991k247K538k859L209l594M011m476M986n540O153o823P559q372
42d399R267j0262J1365j2598J3987j5553J7349j9423K1844k4726K8216l2553L8110
55B0624m5518N5979p1968R9746j61551N29585j72168r76016L58525R9418k15377
66d78721K28071Q03541J48924l25155k40011k52576n16851l7207M94716L77875
76B02606J13199K62559j4079n83958n17905L8638J03333J00983M96534N28143
86G30053j81507m90282j45261j21336m13722k6948O55827N67466j9053k18772
96C36465j97792l11742k84665k2415J53012L06939M82799K48018l45127n14797
$$ plain form
0 0 0 0 0 -8 16 -16 16 -24 32 -48 48 -64 86 -96 128 -150 176 -216 251 -298 351 -404 475 -544 626 -719
26 -719 816 -935 1056 -1191 1347 -1512 1697 -1897 2114 -2362 2624 -2916 3237 -3586 3973 -4399
42 -4399 4868 -5394 5971 -6627 7360 -8193 9156 -10267 11577 -13149 15067 -17486 20624
55 20624 -24894 31085 -40883 58863 -102688 426897 254729 -721287 -362762 -263344 -478721
66 -478721 -250650 552891 701815 376660 136649 -115927 -632778 -669985 -175269 202606
76 202606 315805 578364 564285 -19673 -537578 -498940 -395607 -294624 201910 730053
86 730053 548546 58264 -86997 -208333 -622055 -649003 6824 574290 555237 336465
96 336465 138673 -173069 -457734 -480149 -327137 -20198 462601 710619 365492 -149305
106a49305j74787l2211r8506J66432N08256L36088q2050k36345k79828l65204
116d07460j84387K31044L97717K52279J26067K4306k12449m01927l09877k7224
126e11911K42137L68587K83641O7746j09317k34375l43587k82144L2158L47021
136a40044L89358J99358m0576k06217k48000k22008j73068J1768L23912M31143
146C25626J70685j30081k26191k64994k74981o9132K24926K97651K21400J63789
156D38698k4939l37864l90146j15097R8635J56683K61500L00215O8586k09835
166B46436k82972k54722j60806J05567L34163K58134Q4628L3212j05768l59311
176a01439l27772J0522K14138K13351K48543J91514j09021l17066k18562j13025
$$ plain form
106 -149305 -324092 -356303 -454809 -288377 219879 555967 473917 237572 -42256 -407460
116 -407460 -591847 -360803 36914 289193 415260 439566 227117 -174810 -484687 -511911
126 -511911 -269774 98813 382454 450200 340883 106508 -237079 -519223 -487065 -140044
136 -140044 249314 448672 408096 201879 -46121 -268129 -441197 -429429 -105517 325626
146 325626 496311 366230 140039 -124955 -399936 -469068 -244142 53509 274909 438698
156 438698 413759 75895 -314251 -429348 -330713 -174030 87470 387685 456271 246436
166 246436 -36536 -291258 -452064 -346497 -12334 245800 330428 363640 257872 -101439
176 -101439 -429211 -418689 -204551 8800 257343 448857 339836 22770 -195792 -308817
186c08817q2930J38098L89443K64036n1973j48123j59140k73052k08441J12859
196c28040K85991K07214J56569Q3590j91662l72688j90592M0937Q0998J61844
206f5839L07342J91595j26154k55038j98736j69958o2101J92884L07650J68448
216B90093K6285n1107k09173l07188j37262J13312J97110K00080J95357M5732
226C63239j93027k68103j67549o2927O0852K32479K75664J07961q1512j68503
236I8574k16569j98141l0315J74721K42715J84062P4889q2007k24805k29843j04416
247c11135L8566J56260K29042J86761K2545j46368k23556j98395p8896R1266K10422
258b3488K09738J15547k5899j65659k26012j63373k3383J21197K13723K03125
$$ plain form
186 -308817 -391747 -253649 135794 399830 347857 199734 40594 -232458 -440899 -328040
196 -328040 -42049 165165 321734 405324 213662 -159026 -349618 -308681 -227683 -65839
206 -65839 241503 433098 306944 51906 -146830 -316788 -378889 -186005 121645 290093
216 290093 316378 265271 56098 -251090 -388352 -275040 -77930 122150 317507 363239
226 363239 170212 -97891 -265440 -328367 -267515 -35036 240628 348589 267077 98574
236 98574 -117995 -316136 -346451 -171730 70985 255047 329936 247929 23124 -206719 -311135
247 -311135 -272569 -116309 112733 299494 322039 175671 -47885 -246280 -325176 -233910 -23488
258 -23488 186250 301797 275898 110239 -115773 -279146 -302529 -181332 32391 235516
268B35516P7161q5028j89612k06958j30635K5855J69841K07803J47866L7942j02449
279A87302k13851j99115o5723P5147J66268K03118J39826k4276j68448j96583
289i6335j41304m2293R7922K06119J87293O6964n9704j58610k05595j36245K5802
300b55986J51397J81342J47502N3533r6589k02289j75681o6332M8013J50375K00804
311A36089J30933k2657j39208j73618j46298n1105R3343J87135J66359P3226l8514
322B15685j47240j94805j25823J4718J25658J71374J50955N0926r1847j77703
332h102j59983p4293L4321J38946J83121J21131n778j15338j66471j47072m9933
343b49451Q2346J65639J58271P9906l2335j38096j76805j14890L642J06933J58843
$$ plain form
268 235516 312677 227649 38037 -168921 -299556 -273701 -103860 103943 251809 289751 187302
279 187302 -26549 -225664 -291387 -216240 -49972 153146 292972 268696 100248 -96335
289 -96335 -237639 -279932 -182010 24109 211402 278366 218662 60052 -145543 -281788 -255986
300 -255986 -104589 76753 224255 277788 181199 -21090 -196771 -263103 -215090 -64715 136089
311 136089 267022 244365 105157 -68461 -214759 -265864 -172521 14614 180973 254199 215685
322 215685 68445 -126360 -252183 -237465 -111807 59567 210522 261448 169601 -8102
332 -8102 -168085 -242378 -208057 -69111 114010 235141 229363 114025 -52446 -199518 -249451
343 -249451 -167105 -1466 156805 236711 204376 66280 -110525 -225415 -221773 -114840 44003
354D4003J44067N3537p4786j59238j54323p9763K7275J28557J69357J16165K259
365B17110j02211j53269j37159n2873O5606J49190J49806Q1220k3492j22049j62460
376i0581j14686p899R5766J51048J37363N1206o6138j42806j40978p7283J6203
387a88785J11138J56675J16260J1731q9771j43247j32313n5280N6421J37399J41806
398A22034P8163j8117j07926j47889j09132j4408Q2231J36396J28396N4652n0646
409A53754j28550j38163q1500J2555J05307J45363J07185J5931p7664j31898j24111
420a41791n5243M6004J22416J33663P9363j1709r6457j34390j05178k3266P0516
431a16072J29781J23489N2905m3091j15769j29313p9956R632R2981J30026J02164
$$ plain form
354 44003 188070 241607 166821 7583 -146740 -226503 -199228 -70671 98686 214851 217110
365 217110 114899 -38370 -175529 -228402 -162796 -13606 136200 217420 193928 71879 -90581
376 -90581 -205267 -213166 -117400 33648 171011 222217 156079 13273 -127705 -204988 -188785
387 -188785 -77647 79028 195288 207019 117248 -25999 -158312 -213592 -157171 -19772 122034
398 122034 200197 182080 74154 -73735 -182867 -197275 -115044 21352 149748 204400 153754
409 153754 25204 -112959 -194459 -181904 -76597 68766 175951 191882 114218 -17680 -141791
420 -141791 -197034 -151030 -28614 105049 184412 172703 76246 -58144 -163322 -186588 -116072
431 -116072 13709 137198 190103 147012 31243 -98070 -178026 -168394 -75413 54613 156777
442A56777K4233o6882j23559j17443n4255L3750J09198J30268Q1366j0079q9015
453G4359j22958j00875k6566O5050J18675J08857N3507k5804j02133j28611p8933
464a65432Q043Q0206J17833J05241K9408o7540j15557j00489n4208J8410J01272
475d2813J27782P1341q959o6405j08722j11612l5413O8789J12019R5054N5638
486A56699j5281j00350j21822o4021K170N6188J11947J14997K4551p1428r3532
497A18q5169o9661P364J08283J19738N3802J487m4507j11371j17561k1288O7668
509i1097Q4152Q6388P4054j0783j07246j08010n2505j1416M5551J15983J03213
520A28284J2658m7234o8634j03530q6701K7956J14452Q9089M2948K5030l9457
$$ plain form
442 156777 181010 114128 -9431 -126874 -181129 -147379 -38181 92087 173453 163374 74359
453 74359 -48599 -149474 -176040 -110990 7685 116542 170049 144245 42112 -86499 -165432
464 -165432 -157389 -77183 40650 145891 175299 107759 -7798 -108287 -162495 -144085 -42813
475 -42813 84969 156310 147351 80946 -27776 -139388 -174801 -106012 6007 101061 156699
486 156699 141418 41068 -80754 -144775 -142605 -86417 25530 140527 165078 93650 118
497 118 -85051 -154712 -147348 -39065 80673 134475 135962 91455 -19916 -137477 -158765 -91097
509 -91097 -6945 79443 153497 142714 35468 -72542 -125047 -136463 -90912 25071 128284
520 128284 140942 93708 25074 -78456 -165157 -137201 -22749 66340 109288 134318 94861
531I4861j18695r9639j0647L9015O6887J05781P8283k9704r5694p9638o0638l2688
543a42516N2982J19701Q2665J1257k5250o8937j10279o5290L3222P5333P1147
554C4035P5053L8855o1448j18175p5448j3750K3685O9944J00780N8786j8534o5348
566D8435q4601q0045j9531O3431R2522O6691L2634j3881p7311j00249n5148J3096
578a13957O4021R0127P2924R386n2307p7658p3748m2012K0236P8012Q9910N5234
590A20168m012o5428r1881o2916r879L6961P5627Q6436M1056l1779p5530p7130
602e8307n1288J012N8094P8760O3545K8732l4216r2176q5421k2235K9880N5028
614b8592P6989O3990l395o1377p1470o2620l5418L7669R5781P0823J6254r951
$$ plain form
531 94861 -23834 -123473 -134120 -95105 -28218 77563 155846 126142 30448 -49190 -109828 -142516
543 -142516 -89534 30167 112832 124089 98839 29902 -80377 -145667 -112445 -37112 34035
554 34035 109088 147943 86495 -31680 -107128 -120878 -97193 -27249 73531 132317 113783 48435
566 48435 -36166 -116211 -135742 -72311 20211 86902 119536 105655 28344 -71905 -127053 -113957
578 -113957 -49936 40191 113115 122501 70194 -7464 -81212 -123224 -102988 -24976 64934 120168
590 120168 116156 50728 -41153 -104069 -113948 -76987 -1360 85076 126132 94353 18823 -58307
602 -58307 -109595 -108583 -50489 28271 91816 120548 86332 -5844 -91265 -113500 -83620 -28592
614 -28592 48397 112387 108992 47615 -23855 -86475 -121893 -84224 11557 82380 98634 88683
626H8683m5961r3475o7783J8407N8639N7032O7635M1514m9290r4076m8679j5919
638h3273j4202M4373J09879O2860l0413n0450m4674p1330m5655M7672Q5476M9933
650F0196L0961J1198o2918r9977l8583J9208K4285N3901Q8807L3803n6481o8176
662c776m6440m8147n801P8363Q5426K1041l537j0714o7222r0664j5946N0288M7354
675i775N3173O0539m561q0373o5165k3450k0670J6240Q8933P8493m548l5929k9449
688B3458o2183o9452J2183P7808N6584L1190K4961k7602q6377o1441r39J8628
700f3182L8273P4306N3287k2204n8353m8047m5895k4371L9892P3251M6317J7335
712H0609m724n2531p9566l5410J9700L7647N3064O1750J4554m9319n7999l9134
$$ plain form
626 88683 42722 -50753 -118536 -100129 -41490 15542 83177 124691 75401 -18675 -67354 -83273
638 -83273 -97475 -53102 56777 119637 89224 38774 -5900 -77230 -122885 -75213 10263 60196
650 60196 91157 102355 39437 -60540 -99123 -79915 -55630 -1729 87078 120881 64400 -3776
662 -3776 -50216 -98363 -104164 -25801 59625 80666 77129 66415 -807 -91471 -107417 -57129 -9775
675 -9775 43398 103937 99376 19003 -46162 -69612 -90282 -74042 14891 93384 88836 52907 23458
688 23458 -38725 -108177 -95994 -18186 38398 69588 94549 66947 -19430 -80871 -81810 -63182
700 -63182 -24909 49397 102684 80480 22127 -25920 -71815 -96186 -56294 16957 63274 80609
712 80609 75885 23354 -56212 -91622 -71922 -34275 18789 80539 95093 45774 -12225 -51359
724e1359l3068K730O7736P3249J8495j1383k1035n9549p2125p607N4716N0767
736A1567L5671L4869n488o2745o2332k2992r77K5299O6646O1480J815m0084m3236
749e07m7309l7953J4433N9771N3535K7354M849l0708o3872n0851o422K7164M7752
762b764N5370L0140j7621m8414n2425l8641j649M2651N5234L7217J3820j5574
774E7344n2560o0317k3164K0626M0378M6441L9680N481l6105n3407m3446j7071
786g6120K2521N2349M9487K2965q282l8550n6107l8509J364L1657M7863M8947
798E9585J8828k9491n1267m0453k2724K333L9345N5500L1741l70k2638m6116n2829
811e8556j6349K9070M1450L9386L4425r6n0128n4927k2117l22J6064M6382N2765
$$ plain form
724 -51359 -84427 -81697 -13961 59288 77783 66400 45365 -14184 -86309 -93916 -39200 11567
736 11567 47238 82107 76619 13874 -48458 -71450 -72427 -47128 19518 80998 82813 42729 -507
749 -507 -47816 -85769 -71336 -11565 41970 69324 74173 43465 -20407 -71258 -77680 -50516 -2764
762 -2764 52606 82746 65125 16711 -35714 -74355 -76004 -33353 21881 59098 72918 57344
774 57344 4784 -55533 -78697 -58071 -17693 28748 68428 73909 37804 -15603 -59049 -76120
786 -76120 -53599 -1250 48237 71202 62920 24370 -31737 -70246 -68882 -37225 10638 59585
798 59585 78413 48922 -2345 -42798 -65522 -63189 -23844 31656 63397 63027 40389 -5727 -58556
811 -58556 -74905 -45835 -4385 35001 69426 69330 19202 -35725 -57842 -58164 -42100 4282 57047
824E7047J2969k6109l4495m1272l9220L670M9989M8112K2952P804j7882n2525
836h960m6653o104J8879K8753M5447L8951q903m4937l9121k7635j5774K2278N6533
849A2754M0163L175j1949k7491m9455l4799J2886L6372L2627L3448K1131k4823
861D4039n6030l6534p792P021L2977N4134K8572j7192l2000l0149l4273j6443
873f3670K6262M5817L0426J5267j315l4905n3616k5502J2567K4954L4187M0616
885E1088J4537l1438m3872k7382j4388J773L3387M7278K4267n500k2124l7743
897a0117m0678j1243K8400L9625L0031J7322n617l4780m1220k1776J188J9680
909b9185L8646L9203R235k3926l4811l2222k1382M840L6216M2646K1867m133k3198
$$ plain form
824 57047 70016 43907 9412 -31860 -71080 -67410 -17421 30691 53643 61447 43565 -8960
836 -8960 -55613 -61717 -42838 -14085 31362 70313 61410 16473 -22648 -50283 -66057 -43779 12754
849 12754 52917 56092 44143 16652 -32803 -67602 -54716 -18344 14283 47731 68862 44039
861 44039 -11991 -48525 -56317 -49296 -16319 37815 66387 49195 17195 -12954 -47227 -63670
873 -63670 -37408 8409 38835 54102 52787 17882 -35734 -61236 -48669 -23715 10472 51088
885 51088 65625 34187 -9685 -37067 -51455 -49682 -16295 30983 55250 49750 27626 -10117
897 -10117 -50795 -62038 -33638 5987 36018 53340 47723 12943 -28277 -50053 -48865 -29185
909 -29185 9461 48664 57899 33973 -838 -33060 -54442 -49602 -13386 29260 51127 46994 23796
922B3796l4227l1117j0245J5525L2034L5124K3031n757l3358m0181k4869Q92K3697
935b5655L7241L1308Q828j7815l2755l1944j8765N992K8533L6093K3840K634j9113
948B8422l4322l5224j3506J8176L6842L2189J4407p077k4319l3170k5829m086
960d7497J9504L4685L2284J1338j5329l1865l1579j8385M099K6836L4873K4385
972D3349J830j9495l2130k9231j1235J2736K8453L0757K0206j288k6079l5620
984a7747k5386j407J9944L0517K7538J1436j0600k7367l1744j9888M025K4887
996a5792L1523K2865M229j5635k9926k9769j2923J0121K8986L2032J7782m784
1008C8709k3158k8624k2756o335J4578L0025K8817J2597r419k6975l0599j7681
$$ plain form
922 23796 -10431 -41548 -51793 -36268 -4234 30890 53921 48164 14806 -25375 -50244 -49352 -25655
935 -25655 11586 42894 51722 33907 1152 -30792 -49557 -43565 -15032 21061 44901 47535 28422
948 28422 -5900 -41124 -54630 -36454 388 32577 46984 39907 15588 -17582 -43411 -47497
960 -47497 -27993 6692 38976 50314 34985 3120 -28459 -46844 -42745 -15909 18964 43349
972 43349 45179 25684 -6446 -35677 -46912 -34176 -5723 25034 45240 43952 17873 -17747
984 -17747 -43133 -44540 -24596 5921 33459 44895 34295 6928 -24816 -44704 -40679 -15792
996 -15792 15731 38596 42825 27190 -2736 -32505 -45428 -35307 -6321 25711 43493 38709
1008 38709 15551 -13073 -35829 -42164 -27586 2439 31256 43853 34434 7459 -23140 -40821
1020d0821K544K1073K8794K4998O021j6686k9179k6648j1404Q572K5137K8434
1032B0835J7890p13j8880k9354k5603o019J6415K7804K5220J2225o769k4157k8676
1045a9782j8000M62J9227K8619K3124M960j3471k4428k5742j5322O116K5228K8837
1058A9828J7183q31j8411k7742k2167m780J2263K3235K4626J5641o048k3379k6692
1071a7274j8396n91J7672K7880K1662N337j1504k2750k5529j3505O139K1242K4139
1084A4522J8339L418j6137k8204k2081o090J1371K3427K4640J2166o065j8350
1096A0956k3581j9735l659J7221K6013K0363P112q823k2863k5460j2211N948J7609
1109a1110K3115J9436L129j6100k4123k0306q295Q416K2904K4138J1105l998j6245
$$ plain form
1020 -40821 -38277 -17204 11590 36588 42609 25923 -3256 -29904 -41308 -32736 -7599 20835
1032 20835 38725 38012 19132 -10222 -35825 -41844 -25429 2375 27595 39820 33051 8894 -19782
1045 -19782 -37782 -37320 -18093 10526 33650 38610 25139 711 -25031 -40353 -34237 -9009 19828
1058 19828 37011 36180 17769 -9973 -32140 -36920 -24657 -1422 23204 38845 32797 9418 -17274
1071 -17274 -35670 -36261 -18589 9291 30953 36290 24786 2036 -23493 -36998 -30859 -9617 14522
1084 14522 32861 36279 20142 -8062 -30143 -36233 -24862 -1435 23205 35371 29306 10956
1096 10956 -12625 -32360 -36019 -18798 7215 27578 34690 25867 3004 -22456 -34667 -28719 -11110
1109 -11110 12005 31441 34570 18470 -5653 -25959 -34254 -25838 -2934 21204 32309 28311 12066
1122A2066k3002j9547k177J4305K1933K0680J0538q086k4354k3679j0078M058
1134b7343J5444K2450J7799K881j2473k0607k1568j0739Q344K2535K1845J2373
1146C0941j814j6761k4228j6709l62J1336J8655K0359J0974o991k0474k1731j3239
1159c0044O12J6596K4526J5888J169j1151j9149j9594q779O873J6591J9948J5849
1172B9335J112j7481k4071j4725k346R400J8965K1137R544q330j8012j8121j3058
1185b6651j193J4642K1235J6565M403r760j9871j9789q139N957J5978J9099J5329
1198B7805o0j5868k0437j4055m462Q107J8436K0081P983o482j4835j6971j4055
1211b4813l465J3512K2095J6328L498r094j7742j8770q545N684J4967J7541J2962
$$ plain form
1122 12066 -10936 -30483 -32660 -18355 3578 24258 34796 26710 2356 -21323 -31401 -27343
1134 -27343 -11899 10551 28350 31231 18758 -1849 -23417 -34156 -25812 -3277 18568 30941
1146 30941 29127 12366 -11862 -28571 -28933 -17597 1058 21417 32391 25400 4926 -16805 -30044
1159 -30044 -29432 -12836 11690 27578 28747 17596 -1553 -21147 -29926 -23053 -6462 13486 29335
1172 29335 30447 12966 -11105 -25830 -28176 -18776 189 21326 30870 22540 4528 -13593 -26651
1185 -26651 -27844 -13202 8033 24598 29001 19241 -630 -20419 -28558 -22601 -6623 12476 27805
1198 27805 27745 11877 -8560 -22615 -27077 -18970 -534 19547 27530 21048 6213 -10758 -24813
1211 -24813 -28278 -14766 7329 23657 27155 18061 319 -18451 -26996 -21312 -6345 11196 24158
1224B4158J110j2505j8273j4275o655N811J8504K1705P984p700j3849j6089j3326
1237b3400k341J3776J8580J1843N213l395j6425k1257r032N360J3307J7089J5763
1250B5081Q90j5325j6699j1010o400L540J7714J9362O183m353q906j6564j8455
1263b4942k150J5740J7714J0144O423l010j7705j8645n935L474R095J6231J6125
1276B2559J804j2532j4805j2470r262M713J8632J6434O072j504q903j8439j5168
1289b2869O30J1251J2703J3222R709n661j7723j4914o364O06R122J7852J2949
1302B0513J067q997j3545j5203p449O549J5040J3309Q099Q79r908j7356j2522
1315a9524j283P932J3323J4767P807o076j3682j4496r008P32J0881J5052J2121
$$ plain form
1224 24158 25268 12763 -5510 -19785 -26440 -20629 -2125 19580 27564 19864 6015 -10074 -23400
1237 -23400 -25741 -11965 6615 18458 23671 20276 3851 -17406 -26438 -21078 -7771 9318 25081
1250 25081 25971 10646 -6053 -17063 -23463 -19923 -2209 17153 23336 18983 10077 -6487 -24942
1263 -24942 -27092 -11352 6362 16506 22929 19919 2214 -16431 -22366 -18892 -9797 6434 22559
1276 22559 24363 11831 -2974 -15444 -24706 -19993 -1361 15073 21145 19641 10738 -7701 -22869
1289 -22869 -22239 -10988 1715 14937 24646 18985 1262 -13652 -20016 -19410 -10288 7564 20513
1302 20513 21580 12583 -962 -16165 -23614 -17065 -2025 11284 19383 20262 10354 -7002 -19524
1315 -19524 -20807 -12875 448 15215 23022 16946 3264 -11232 -20240 -19508 -8627 6425 18546
1328A8546J916p617j3758j3213o667L423J2652J5242R935j774j0366j3564j1836
1341a7081l564P357J3841J2661O874k573j2578j5603q504J417Q226J3380J3098
1354A6951L929q692j2735j1791p265K061J2834J5392P524n84q076j3660j2632
1367a6744k800P801J1395J1706Q212k664j2474j3208p433j736O851J5361J2605
1380A6872J357p362r217j1922q798K678J2226J1527P671L563o714j6156j2561
1393a6836r36N976R493J3836Q396m744j2618r497o655l546O042J4516J1160K076
1407A6663l952r290j3418r729L454J2026J1421P627K239p168j3574j0107j813
1420a5621L315R276J2166Q165j917r786j1540q737k571O812J3464J0894K661n009
$$ plain form
1328 18546 20462 12845 -913 -14126 -20793 -17370 -4718 10524 20459 18685 8319 -5245 -17081
1341 -17081 -20645 -13288 553 13214 20088 17515 4937 -10666 -19170 -17753 -9527 3853 16951
1354 16951 20880 12188 -547 -12338 -19603 -17542 -4708 10684 18208 17624 9548 -4112 -16744
1367 -16744 -19544 -11743 -348 11358 19570 16906 4432 -8776 -16209 -17945 -11094 4267 16872
1380 16872 18229 10867 1650 -10272 -19070 -16392 -4166 7361 15032 18595 11881 -4275 -16836
1393 -16836 -17772 -11796 -2303 11533 19929 15185 2567 -6930 -13585 -17131 -11089 3427 14587 16663
1407 16663 12711 3421 -9997 -19726 -16272 -4246 7175 14802 17041 9873 -3701 -13808 -15621
1420 -15621 -12306 -3030 9136 17301 15384 5598 -5942 -14679 -17250 -10438 3026 13920 16581 11572
1434A1572q991j1326p527J371R858J1037P602K548n296j2296j1336l864N243Q931
1448b474J0737Q311j357j0445j0953n764k610L118J1724J2509L337m828q144r867
1462f706j0004O47J1597J1164N601K207l693j2674j1027j088M886N000Q943J0903
1476A5756m18j0258r470o262m799L047J3922J1803L93m033n159j0249j0648J375
1490a5000J1172Q299N337N299l412j3040j0816n50K329M714J2045R890k653r984
1504C630o654o170o185L133J3748R878R94k177m540j1717r384K899Q432O486O637
1519I010O412m636j2369q268r72p7M575J1999R087k600o894o100q415o789N342
1534a0695J2922P897O32j40m802j1859q091L090O321N413P919N818m062j1383
$$ plain form
1434 11572 2581 -8745 -16272 -14901 -5043 5994 13596 16144 10848 -1448 -12784 -16648 -11405 -2474
1448 -2474 8263 16574 15217 4772 -6181 -11945 -14555 -11437 287 12796 16133 11305 3161 -6706
1462 -6706 -16710 -16063 -4466 6698 12299 14506 10813 -1861 -12888 -13976 -9090 -4090 4853 15756
1476 15756 15338 5080 -4390 -10652 -15451 -12404 1518 13321 13714 9681 4522 -5727 -16375 -15000
1490 -15000 -3828 4471 9808 15107 11695 -1345 -12161 -12711 -10382 -5668 6377 16267 13614 3630
1504 3630 -3024 -9194 -15379 -12246 1502 11380 12374 10197 5657 -6060 -15444 -12545 -4113 2373 9010
1519 9010 15422 10786 -1583 -9851 -10823 -10900 -6325 5674 14761 12161 5267 -833 -9248 -16037 -10695
1534 -10695 2227 10124 10756 10616 5814 -6045 -14136 -11046 -4725 688 8607 14425 10363 -1020
1548a020p014k666j319N886J2714P302l479n610m697q631o265M954J0897O001
1562G053L047K191n528j3322p111L354N322N142Q220O283n817r774n022l483k741
1577a2186N809J2639N939k716l265n004j0567n563O744R447M254L869K996o405
1591E991j2452n021K869K283M442J0444N315n858q333m175n375l048P495J1989
1605F566M185j893k045n654j0370l854O511O491L474N795L780p258j1704l807
1619i783Q60J469O058J0580L627o113o430l740n749k919P379R847L449R04r52
1634H487p129j0578l267O104N385M106O532J757p113q673l545q59O13O506J0343
1649H669L081m418n215n544o199j737P679P826L015J517o51p064r194k167L538
$$ plain form
1548 -1020 -8034 -10700 -12019 -6133 6581 13883 10404 4794 97 -8534 -14799 -9845 1052 7053
1562 7053 10100 12291 6763 -6559 -13670 -10316 -4994 148 8368 14651 8834 -940 -5962 -9445 -12186
1577 -12186 -6377 6262 12201 9485 6220 1216 -9351 -14914 -8170 1277 5531 9400 12396 5991
1591 5991 -6461 -11482 -8613 -6330 -1888 8556 13871 8013 -320 -4495 -9870 -12918 -5423 6566
1605 6566 10751 8858 6813 1159 -9211 -13065 -6554 -63 3411 9206 12986 5728 -5976 -9783
1619 -9783 -8923 -7454 -1396 9184 12811 6698 268 -3472 -9221 -12140 -4761 5086 8535 9439 8487
1634 8487 1358 -9220 -12487 -6383 -998 3108 9640 11397 4284 -4389 -7934 -8793 -8180 -1674 8669
1649 8669 11750 7332 2117 -3427 -9626 -11363 -3684 4142 7157 8674 8023 959 -8235 -10402 -6864
1664f864M366N311O785J299o332q188l455k255J130P618Q474K299l402m017n755
1679b986o541o92O179O941L842K448j519o923p798k510K738L855O225O011L84
1694I654n725o432l736k374R64P004P373K476j853m434n540o379m38N465O085
1709B110M329K121j106o630p071k238J268L850O052O133N95n590n705m014k512
1724h408J210O426O784K377j373l618n685n951l98M545N412M348K575j220o587
1739D37n913k625J035L466O141N484N12m190n738m085k753J178N827O253K412
1754G441n37l237n928n496o39M032N004M631K958j626n541n641k740M69L069N745
1770A964N571O76l901m818m669k930J483N246O026K610l83l131n598m886r60L043
$$ plain form
1664 -6864 -2498 2813 9598 10897 4565 -3623 -7078 -9333 -8203 -585 7889 10188 6786 2769 -2986
1679 -2986 -9527 -10219 -4040 2901 6743 9191 7672 749 -7049 -9559 -6821 -2966 3259 9270 9654
1694 9654 3929 -2503 -6239 -8613 -7649 -645 6728 9204 7351 2917 -2623 -9002 -9440 -3975 2110
1709 2110 6439 8560 7454 824 -6247 -8485 -7217 -3367 2685 8818 9413 3823 -1882 -5896 -8408
1724 -8408 -7198 -772 6012 8389 7016 3398 -2287 -8238 -8636 -4091 1321 5669 8244 7024 437
1739 437 -5476 -8101 -7066 -3600 2541 8025 8537 4347 -1391 -5476 -8229 -7051 -1224 5029 7441
1754 7441 6904 3667 -2261 -7757 -8396 -4364 640 5271 8229 6603 1062 -4579 -7319 -6850 -3781 1964
1770 1964 7535 8211 4310 -508 -5177 -8107 -6624 -1378 4648 7258 6875 3744 -1854 -6740 -7700 -4657
1786d657N116M563K722j069n307n431k855L56K995N086N190Q84k981m612m713
1801d713k698O98N402N320K466M6k904n134n047r48K812M661M859K909j477m679
1817A573n318k870K00K629N398M426J289k791m432m295k789P04M424N489K488
1832F125K63k359n315m927p20K662L831M146K969k49m456n272k895o3K696N028
1848A464M043R07j966l953m050l112N39M678M354K835L81k263n042m619m72J659
1864d617L745M632K909j273l699l868l534p75K742M783M168J224j752l713m651
1879c679k405P63L430M145L111J032k633m771l929r55J207L602M693K156m26k987
1895B354m534l590j91K530M417L272J394j096l382m541j897k99L009M565L411
$$ plain form
1786 -4657 459 5022 7744 6675 1368 -4063 -6918 -6562 -3567 1519 6709 7593 4612 0 -4713
1801 -4713 -7411 -6713 -1311 4009 6475 6521 3617 -1517 -6564 -7512 -4700 -39 4820 7729 6252 1573
1817 1573 -3745 -6615 -6415 -3786 1612 6038 7327 4536 104 -4191 -6980 -6276 -1852 3637 6125
1832 6125 6388 4029 -1286 -6213 -6933 -4271 -440 3706 6675 6426 1970 -3302 -6197 -6260 -3564 1464
1848 1464 5507 6414 4448 495 -3555 -6667 -6128 -1450 2904 5739 6120 3857 -1185 -5804 -6276 -4617
1864 -4617 -872 3760 6669 5396 1697 -2171 -5705 -6480 -3738 1045 5213 6437 4685 972 -3679
1879 -3679 -6084 -5321 -1891 2254 5365 6397 3764 -1007 -4936 -5891 -4684 -1082 3611 5767 5341 2354
1895 2354 -2180 -5770 -5961 -3431 986 4258 5652 4556 1174 -3367 -5264 -5563 -2554 2011 5422
1910E422K78k289l830l438k114J034M270M013K011k22k634m266l364j88J880L418
1926a9L573K380j196m141l760k025K4K566L958L790L09k039l084m100k114J502
1942d376L616L704K157Ok316m325l419j26J600L521L647J847j353l282l287k235
1958d621m92K248M212L152O44j998k981l518k118J261K975L924J936M71k282m240
1974a427k839o75J473L069L649J962n12l465l662k287l07K546L951K643R77j530
1990C566l238l614j894P31L381K763K800J24j706m138l045K3Q80K845L559J839
2006D876p96k859l129j616j438K092L497L342P54j287k676m089j820R93L051K797
2022A692K218R28j889l994k553n09N85K475L707K400j213k509k735k448r26K394
$$ plain form
1910 5422 5700 3411 -419 -3857 -5971 -4937 -667 3346 5357 5135 2501 -1765 -5129 -5317 -3437 -19
1926 -19 3554 5934 4738 597 -3163 -5188 -5164 -2598 1360 5150 5459 3420 336 -3764 -5878 -4376
1942 -4376 -760 2944 5101 5107 2791 -1534 -4953 -5079 -3479 42 3689 5536 4183 901 -2386 -4621
1958 -4621 -5113 -2865 1347 4499 5143 3145 164 -3354 -5472 -4211 -1236 2688 4624 5095 2813 -1427
1974 -1427 -4266 -4941 -3468 -399 3250 5212 4700 1235 -2427 -4714 -5021 -2475 1476 4119 5096 3566
1990 3566 328 -3286 -5180 -4449 -1068 1695 4495 4619 2913 -1225 -4270 -4247 -3367 -522 3037 4876
2006 4876 4080 1221 -1908 -3524 -4962 -2870 627 3969 4723 3436 760 -3329 -5149 -4156 -1105 1692
2022 1692 3910 4838 2949 -1045 -3598 -4107 -3522 -1047 2660 5060 3847 1338 -1397 -3845 -4771 -2377
2038b377L516K300L57l95k335l820j920J309J714K408L082J096k496l613j926
2053c100p77K54K548L993J493j281j517k471k836j021K227L167K095J299k11l000
2069H62l895j387J469J503K441K726Q93k101l169j528j628J46K418L788J142m33
2085C247j382k336l507m70K432K409J990J603j59k864l164j221J97J206K853K896
2101C730M42j755k609k346r92p1K794K847J570m36j312k384k590r30J719K485
2117A62K460J266j09k664l136j558NK079K033K538P58j186k720j885j317k8K220
2134a082K804J804j38j628k241k329j108J393K449K217J146j22k046k832j732
2149c445O4J479K274K629P18j233k776j641j059l53K425K667J442l7j270k449
$$ plain form
2038 -2377 1139 3439 3796 3401 1066 -2754 -4674 -3365 -1651 757 3839 4935 2439 -1174 -3100
2053 -3100 -3877 -3623 -1075 2918 4411 3130 1613 -858 -3694 -4715 -2488 679 2774 4073 3862 862
2069 862 -3033 -4420 -2951 -1448 993 3719 4612 2511 -658 -2186 -3814 -3668 -1250 2538 3680 3247
2085 3247 1865 -471 -3978 -4448 -2016 393 2383 3986 3827 963 -2201 -3422 -3225 -2019 834 3730
2101 3730 4172 2417 -192 -2538 -3530 -3601 -807 2040 3610 3174 1862 -522 -3112 -4042 -2323 162
2117 162 2622 3888 3779 1115 -2021 -3579 -3574 -1495 538 3076 3834 2648 -72 -1957 -3274 -3302 -1082
2134 -1082 1722 3526 3388 1760 -481 -2810 -3918 -2525 -76 2141 3287 3165 1119 -1713 -3445
2149 -3445 -3381 -1902 372 3001 3719 2486 -290 -1931 -2990 -3343 -918 1749 3191 3154 1884 -565
2165e65k185r32J109K186K140J323K70k289k640j490O3Q55K246K626P66j001k155
2182C27k002j569J09K323K572R98N61j221k428k310n57Q82J273K825J542m31j824
2199A070k158j645o03J259K436K250L55o59j706k004j694K27J864J803J710Q17
2215C322j431k147k152o98Q53J538K049J772n82j264j961j784m56J154J894J930
2231B037R06j7k177k105j719L4K064J883J620J11p58j806j814j338P34J698K233
2248A586J320l41j173k286j565k44R72J497K017J146o56j642j714j331m54J313
2264a555K448J432N55p87k007k123j122R62J774J866Q54O56j517k180j701R4K74
2281b077J522K244J072n53j244k068j255p51J669K434J035M26p07j586j856q77
$$ plain form
2165 -565 -2750 -3682 -2573 -387 1753 3076 3346 1057 -1583 -3073 -3010 -2155 91 2717 3483 2482 327
2182 327 -1675 -3244 -3135 -812 1760 2758 3319 2098 -330 -2640 -3197 -2315 -1042 1783 3325 2894 1070
2199 1070 -1088 -2733 -3336 -2077 359 2609 2964 2305 599 -1405 -3099 -2872 -1008 795 2505 3322
2215 3322 1891 -256 -2408 -3106 -2253 -715 1334 3106 2524 1260 -701 -2485 -2941 -1787 107 2037
2231 2037 2943 2926 749 -1356 -3075 -3041 -977 906 2526 2637 1879 73 -1741 -3079 -2345 -647 1586
2248 1586 2906 2565 1392 -894 -2459 -2703 -1731 -234 1783 2929 2273 631 -1083 -2414 -2868 -1555
2264 -1555 893 2325 2880 2093 86 -2037 -3159 -2197 -423 1443 2297 2953 1436 -744 -2445 -2351 -2077
2281 -2077 -555 1689 2761 2208 964 -1104 -2359 -3110 -1441 993 2028 2454 1747 161 -1695 -2572
2297b572M16J694J426J483K00j115k514j265n84R91J626J808J102n12j524j515
2313h55j419m68J294J992J712K14m28j554k334l82M81J109J286J260P19j197j693
2330b63j233q81K12J828J836J235p76j142j435j515n27J303K222J200K40n09j245
2347E50j802j120M29J093J296J662L98o46k033j420n27J34J617J891N69p4j082
2364I35j465j383m95J156J658P76P96M3j252k331r99Q12P86J213J446P46j122
2381A320j675r30p38k36J424K175J022l56j053j152j918m51J389J805P62L68J08
2398A864j203j843m97K9L67J369J710R80j432j813j180m94J39J401J800P02k19
2415A680m98j285j761m21J102J223J020J050l6j599j224j189J18P59J224J603
$$ plain form
2297 -2572 -2156 -462 964 2447 2647 1532 -982 -2247 -2831 -1840 -214 1594 2696 2184 660 -855
2313 -855 -2274 -2742 -1448 544 2256 2470 2042 488 -1846 -2228 -1747 -638 648 1908 2627 1430 -263
2330 -263 -1496 -2377 -2165 -337 1499 2734 1958 816 -619 -2134 -2661 -1358 864 2064 2304 1795 550
2347 550 -1252 -2372 -1943 -850 446 2108 2506 1860 -173 -1593 -2120 -1986 -369 1522 2091 2017 935
2364 935 -530 -1913 -2408 -1252 406 1182 1978 2021 769 -1562 -2561 -1749 -963 250 1696 2442 1320
2381 1320 -355 -1285 -2023 -2259 -835 1340 2362 2006 953 -199 -2117 -2568 -1179 626 1388 1756 1864
2398 1864 661 -1182 -1679 -1650 -1283 86 1796 2776 1344 -469 -1649 -2143 -2004 -603 1197 1899 1680
2415 1680 1182 -103 -1864 -2285 -1183 40 1060 2110 2074 475 -749 -1938 -1820 -1061 163 1766
2431A766K03q03j275j067o87q6J374J291J024J7o86j694j089m76R49J170R63R58
2449A852k13j167j208q49m91O84J463J633L05q25j250r10j016L34R70J674M69
2466A455K76o01j279j322k69M73J273J036R17r8r40k091m80j16L93J482J336N48
2484A993r75q69o81p18p76J073J773Q72p4p91p56j665j09P00Q82Q84Q26K84j213
2503F60j722n15L13K63O90J684O35p03j169r34q39m86J698J351L04N94m24j470
2521g0j392j82M34N87J150J013K77j295j242o27l11L32J241J485Q6k81j088q55
2539g38r42j82J201J033P07K92j91j144j366l31K19J019R47J306n22j125n25n66
2557i08o80P03P87J439k8J41q47j172j154J37Q70J315O63p5M4q92j530j57L07
$$ plain form
2431 1766 1969 1166 -109 -1176 -1863 -1949 -575 716 1740 1757 1071 -623 -1712 -2188 -1239 -69 894 1852
2449 1852 1639 472 -736 -1585 -2076 -1392 71 1704 2009 1184 -66 -976 -1992 -1658 -688 986 1455
2466 1455 1731 1130 -149 -1471 -1740 -1267 6 1042 1959 1861 921 -1170 -1650 -1766 -1373 109 1445 1993
2484 1993 1018 149 -532 -1250 -2026 -953 820 1692 1618 827 71 -1594 -1703 -1003 -121 763 1589 1873 660
2503 660 -1062 -1577 -1264 -1001 -311 1373 2008 1305 136 -798 -1637 -2123 -425 926 1230 1824 1400 -70
2521 -70 -1462 -1644 -1210 -623 527 1540 1817 522 -720 -1347 -1658 -1326 -85 1400 1486 1205 117 -738
2539 -738 -1680 -1862 -661 372 1079 1371 1180 36 -1330 -1661 -1442 -423 524 1830 1308 183 -342 -908
2557 -908 -1588 -885 -98 1341 1313 1454 607 -565 -1719 -1582 -712 603 1266 1191 1235 343 -1187 -1344 -1037
2576a037M75J221Q42N2o74j250q11m92L59J082J511J74n14o45p83r33N3N68Q53
2595E1J004K90j19j019j271o51N53O42J052Q11L10j219j033p51j8L06R59J210
2613A107Q1k05k04r32j401J94O02J090N83L77l72r40j228L2L01K64R85R28k0p03
2633E39p30m70q41L79J102R28L54m14k83j077r84J56N83O74P76P60j58j301q95
2652i02m1m7J72J100J109l23o46k47r40p57Q42Q08O60J31N72n54j560j109J017
2671g15k3P66J019K68l74q05p00m03k73N01J498P39o63n5l81j345p06P28O01O26
2691C03O21L81q16j109m60L06k93O16J446L22l12m79o87j146l4Q25R53O40P2K2
2711A171q85j358k57M77M96P48P36K07j242l56k74m60L2J076Q00k38J72j54j137
$$ plain form
2576 -1037 -562 659 1501 1553 879 -371 -1182 -1674 -1315 -233 1278 1452 938 293 -490 -1423 -1370 -802 51
2595 51 1055 1345 1226 207 -1064 -1715 -1162 -520 532 1343 1653 434 -599 -1350 -1368 -1062 -103 1107
2613 1107 1188 983 779 -153 -1554 -1360 -758 332 915 1292 920 -20 -1248 -1216 -915 -651 334 1262 1242 539
2633 539 -191 -661 -1502 -1123 -21 907 1261 847 564 -513 -1497 -1341 -758 -84 692 1452 1294 -7 -902
2652 -902 -943 -990 -818 282 1391 1068 422 175 -765 -1522 -680 128 788 919 1491 937 -623 -1732 -715
2671 -715 -738 28 1047 1315 941 136 -564 -967 -1240 -739 759 1498 835 780 399 -946 -1652 -924 -323 303
2691 303 924 1305 489 -620 -1080 -774 -1067 -451 995 1317 1005 526 -161 -1307 -1341 -516 437 1077 1149 1171
2711 1171 286 -1072 -1329 -852 -356 392 1128 1335 93 -263 -537 -997 -965 111 911 673 845 691 -446
2730d46n32j11N90P40M69Q11n18j281m28l29J41L75R52Q75l48l95p28n75k32K87
2750f83J015N13K71k98m57p98n99O3N06P17P78K51n48p94m94l85J05K15R01P73
2770A052J53p13n51p40p2K03N50O76K42j46j47r59n38j25R77J20K50P45j42n88
2790B47p42k24J82l85J233P34l95l98j53l60j183O33R36O43j07K15j96r69n91
2809h80K06M47j8O06R98o01r26l26j1p4r0R49P79k17n89k05n12j039N11J316K70
2830E94k17L13L45j535l08K61n0J52J013P15o98o38l97k40m11N52J096N33o83
2849C97K9m5q41p83N07O90K89M50N87q22p49m46L73k50O36P09L68n51m30m1q80
2870h03JM35P00L17J92J35r19q75p4O99J7J26P26K64m78n68l64j87p3O02N33M09
$$ plain form
2730 -446 -978 -1089 -499 241 710 1521 1003 -278 -706 -1035 -894 -519 433 1308 960 565 -163 -738 -970 -683
2750 -683 332 845 1116 818 361 -437 -1036 -973 -467 250 1028 1279 731 -63 -557 -942 -837 -622 279 1052
2770 1052 1205 492 -59 -799 -871 -668 -118 558 800 654 507 -452 -990 -1115 -138 -18 232 977 835 247
2790 247 -495 -719 -537 -922 311 1045 650 252 99 -261 -1444 -811 125 768 661 876 680 -289 -880
2809 -880 -674 -227 -245 361 1359 758 -168 -494 -505 -579 -669 280 1059 842 253 48 -464 -1503 -992 324 594
2830 594 377 690 1035 -500 -808 -547 -597 -445 568 1283 585 -53 -450 -690 -1101 -549 547 1080 397
2849 397 426 381 -460 -1243 -736 -46 243 693 1280 458 -291 -737 -364 -614 22 731 1099 548 118 77 -803
2870 -803 -802 -367 333 650 842 977 58 -817 -891 -192 -175 -49 677 941 463 -105 -469 -656 -729 -127 406 815
2892H15J83j057k79m14L27P8N74K81J75j16l48p73m57M12L64Q01J06M09k49j081
2912b49l81O8K08l7P86M61n1l10n38l92n64K29J255K18j55J33k63p78n00N48j5
2933c27N08J63Q17m87j037j47L3m19J44J217P74p68n60L35o42m59M32R18k75J29
2953C49N22j61j183m70P13K62J35K97P05q98n36j90p2k65L67O37O01l25j93m6
2973B49r07k24N41R53ON2K41n62r75j03L74l7K4Q38O49p92m73m65J87k31M47R06
2995F98M2l63l71K4q20m0M70M12J32M91J18m52n88p41M29K79o0R47M0p7l97m87
3017c14l88p3K68Q72K79l95N6k98o37m23P57L47M9O64o2m87o54j84J42L1J48P09
3039D07O64n75n47J46m78o33Q02N87K17m33P2K05r95l62Q81N03o19L60N33k66
$$ plain form
2892 815 998 -59 -338 -752 -425 -347 227 508 683 567 219 -554 -1011 -599 -235 566 672 1081 832 -249
2912 -249 -630 -562 -354 -391 395 856 805 495 -43 -435 -999 -770 485 703 548 681 418 -360 -860 -312 -327
2933 -327 181 344 1161 674 -363 -510 -477 -896 -752 465 1239 471 -89 246 -396 -855 -423 495 220 349
2953 349 871 710 -473 -943 -230 32 167 464 1169 271 -265 -455 -527 -792 -425 212 813 488 295 249
2973 249 -658 -882 -341 612 618 670 911 349 -626 -729 -355 -392 -368 470 1119 327 -146 -611 -424 -655 -208 698
2995 698 740 377 6 30 -790 -830 -360 52 184 675 793 341 -247 -988 -559 -280 -340 607 647 570 173 -314
3017 -314 -702 -775 -507 365 644 249 305 7 -630 -1053 -296 51 100 764 702 215 -439 -623 -481 -450 -302 407
3039 407 1071 496 -51 95 -383 -1016 -214 373 590 157 229 434 -561 -923 -42 461 -158 202 735 469
3059D69j068J41L64j09q4Q89L20m81m95J27n05n16O72Q30m0k2J49n36q11k81P91
3080a96J77k22R14L98p00q70r7K33k52N28R07k74p07l5J7l64j69Q95P4l80K01
3101G8M49l27j014K75L80K09J32L87L89j008j24l7j20l28O68P18q9n95R9ko65
3122e25m49R59L92j0j20L22n08p85L03J36N0K66N18n0p68K3n9j40j96K86R00k77
3144B68j07j38j49k56k54O84K39j66R1K68k82p48j69Q14k97K59N20J36p35l17
3164c39L10k22k40L11P09j78j63M39n51n13j18M98L67n0q5M72o28l31o3L67n22
3185e30M03R56m6r31nK90p51J32M19O65j55m62L98k37p89k6P75j04J03K57J13
3206D75l72o68K52J50l94M83N90l7m95Q2m9m01j47Q37O1j8j86K70m50m50k6L30
$$ plain form
3059 469 -599 -458 -94 -203 -287 602 922 441 -54 73 -432 -948 -276 554 514 492 641 105 -706 -987 -196
3080 -196 -19 -241 673 1071 371 -499 -596 -363 -615 -87 820 546 -161 -196 -179 -543 -712 183 257 -123 78
3101 78 527 200 -814 -539 -159 50 182 569 958 -50 -174 -211 -331 -659 9 727 638 43 142 140 -525
3122 -525 -974 -15 377 367 247 569 61 -724 -421 -285 -235 31 549 499 -269 -246 -305 -445 -641 -355 545 268
3144 268 161 23 -126 -382 -636 48 287 121 212 480 198 -550 -719 95 -202 57 577 713 -22 -339
3164 -339 -29 -251 -491 -180 529 351 188 627 76 -437 -555 -57 310 260 175 647 19 -312 -375 -8 -530
3185 -530 -127 829 783 -148 -153 137 -614 -482 -63 602 447 -15 383 146 -643 -669 106 2 105 362 475
3206 475 103 -565 -313 -163 -557 -74 516 479 -16 66 17 -384 -531 306 367 349 163 433 -17 -467 -493 -163
3228a63R4j56P92k4p62l18O36n31o1M01P86k05n92L31m97l06M72L07P6J1k48L73
3250D16o79k65K44N0J49L24J04q5l43j36o4k9J12O00l16K04P9m59k11l7rK56J61
3273F6L07J91l73k31n17j2N68l0J43K57J24m24j91k58M03l11L0M90%j66Onp08
3296f41M8N76O56m18K15r6o92J2K87K24l02J45L72m0n47l3R7j91J7M87M34l97
3318B13l60K53n3n62L11N55k83j24N99j57k76n79J91Q7p7O05Q0j49m12JQl80L45
3341a64J8L79j85J98L78o23n89L03L84O0J94M7l14l57k85M87k48K75L33r9J09
3362C01n33L21m14j22L61J77J2K88j26j93k63q3K54J2J32J12k26J17j07l10j87
3383d77k6j17J103l4q0k03k57k69k0J07K59K90L9j29j11R8n76O4K2M57J58k8q6
$$ plain form
3228 -163 -69 -225 567 543 -219 -537 99 -432 -493 -92 694 489 -103 228 -269 -575 -103 204 280 291 43 416
3250 416 -263 -528 -284 -234 -85 239 343 258 -85 -221 -285 -314 -202 398 82 286 365 -94 -305 -342 -351 -95 66
3273 66 373 564 191 -40 -557 -569 -1 -31 112 369 493 69 -122 -380 23 -288 -258 232 232 66 72 67 -641
3296 -641 -593 -17 639 221 436 340 -352 -340 -53 171 -131 14 386 346 -201 -234 -137 -328 -311 176 610 213
3318 213 -147 106 53 -509 -198 357 74 -50 549 392 116 -463 -272 -185 -262 343 423 274 -138 -137 -129 -509 -164
3341 -164 -146 233 48 246 624 1 -588 -285 99 159 353 400 86 -271 -556 -69 -317 -42 291 192 301
3362 301 -232 89 -325 -447 -86 91 103 391 265 72 -191 -274 -20 -8 124 236 10 127 20 -290 -477
3383 -477 -503 -620 483 449 369 166 -91 -360 -380 -273 -14 276 315 186 75 173 -403 -339 -317 140 298 270 184
3406A84m84L0K48n3j49J91J57L82m61mj72r1r5L44L92k18m3p9m46j60R5P67k8
3429C07j71M02l52o9k18PP1k24L17N04k45J6l81j50k15M23K46k79J79K5j24j56
3451h7J31j40j80M11K46l1l94j75K11n00K98L04J19n6J97q8k74k44k79M20J31
3472B0Q6K82n4n16K89j72k51Q1J90M20m58l3M08m65k54J12M29n0J0M25m53k36
3494a90k09K33n8K9N79Q0l77j11L02j41l56p3M77K22l31M21k36o06K26L10M6m56
3516b19M27P6j78pl08L30k35J26N7L02m28P8j40l12K60J88J36O0j06M96k03o93
3538b93J78j53L18o6L23p1k43j93J88j53l77M97L68j74k21L50m0o73L42J2J42
3559F1rM1L28l92l11J27l8j74j73P18J93l88J19j33j87k18M90pJ49l11K59j90
$$ plain form
3406 184 -300 -270 -22 -75 -224 -33 124 506 45 41 -131 -222 -317 27 419 201 158 79 -367 -527 -432 335 307
3429 307 136 538 186 117 -101 -94 -23 -247 70 574 329 345 -36 -186 -401 22 268 -11 168 193 69 -87
3451 -87 44 -96 -276 135 381 350 -44 -219 -8 -508 -210 94 213 157 354 266 -8 -252 -531 -111 20
3472 20 106 388 334 -182 107 -65 -316 -235 -45 375 -83 -116 292 -173 -427 -315 114 64 74 499 46 -190
3494 -190 -399 -166 -224 -195 384 464 87 -24 278 137 -219 -292 185 407 76 497 261 -345 -119 191 237 -219
3516 -219 208 284 106 99 -209 121 -114 12 69 371 -57 21 -119 -431 -171 17 153 213 107 603 400 -293
3538 -293 -115 -268 50 -16 307 236 -7 -200 -12 -165 -542 -45 323 149 -72 278 238 -435 -93 -81 61
3559 61 52 93 421 29 -282 -155 -193 -367 -540 178 371 -17 102 -31 -218 -436 54 47 196 -115 144 -46
3581d6l3o8J59J07m16J92O03l20m95Q2J48m38M01L89J33n48J25kj12l59L97L78
3603B77j10l31M01j88l79LN65m66P5O22k50p5l10J63P3m96O45L61k76m88J32L04
3625B52o86JL71M01n84L22L33n05m39K51O43n20j28M46k8k8l18J35P6m04M21N12
3647E24j49o39P76k97m01l2M41K59p26N09K54n35j76K6R8o0l7M80j95k00Q3r8
3669i5l37K45J47K51m7j64K50n3m85k53M01K39k16M32j41l28K0J5K75m49N86J67
3691D60n2o23J55K42k10m13M06M46n07R6n2L12o84R5O67l92J04L45k61R8n79J56
3713a91Q3l91M10N97k21l14l07K85L5m21N07K90k91j19K36j12k44K9M99l42q2
3734f4M34l91J92n29L97O4k47L01N04k84k57k14r4J95j49R8N1O1k01M43j78n50
$$ plain form
3581 -46 -79 -147 12 119 -297 -105 498 178 -317 -235 -87 -525 -124 265 398 -150 -25 -27 -139 -498 -101 277
3603 277 167 -164 237 49 -330 -327 238 -228 -153 469 219 144 -166 -3 70 -426 219 580 304 -184 -52 252
3625 252 -434 -433 -62 339 -245 77 410 -95 -534 -283 360 -160 -288 158 130 102 -216 -81 -5 -409 12 524
3647 524 375 -264 512 215 -186 -218 223 482 -244 265 519 -16 -192 -166 -68 -128 -165 315 120 -80 3 -95
3669 -95 -432 -187 -40 211 164 0 250 197 -288 -541 -140 99 -117 315 174 -154 -134 -119 156 -293 293 460
3691 460 408 -215 -60 182 -28 -441 -35 411 -96 0 -52 260 -424 -329 338 -54 50 395 134 232 -347 -191
3713 -191 -108 -499 -89 508 287 -27 -334 -49 -14 -435 72 362 71 -48 188 76 -168 -139 360 18 -64
3734 -64 370 -21 171 -358 39 103 -144 157 661 377 120 -94 -188 7 -142 -44 7 68 -133 310 132 -418
3756d18J24N00J8J42Nj02n99J01K58M2l28N8N23l86J66k55P1j12o9M62K5j06m44
3779c24P16l33l17L43K49k01k02J60J67n88J33L34j84j60K59L73k64k53K36k1
3799A23j66l8J93J63n03L44%O8l72N8J44k30L42L61k28k32o2p6L17m64K07L22
3821B71m21pO16j29n97m4M55L05o74M44J1k92n11P10P2m36K59K53k64j29O2K39
3843A93k39k10Q2L91p9n90L35L5n10L25P35n07k82M70O77q75l63L93nKJ31N14
3865F23n18l48J23L52m82oL59O7n16M19L39m52p42Q54p2K3j59L66O7p13j40P00
3887A44J12o49K82J65K24k95J6J05n52N19L25p3n94K19L55k7m82J55N1j37j03
3908b40M60J22m82j0j38J38l10N34K38l57m6J53j10q5j4K32J52m12K06k49K91
$$ plain form
3756 -418 -294 206 224 366 371 269 -330 -229 29 71 -257 -199 324 -62 104 -151 -80 -192 -261 201 226 120 -324
3779 -324 392 59 -258 85 334 133 -69 91 258 -330 -197 137 -47 -207 52 425 161 -92 144 123
3799 123 -43 -81 112 275 -228 116 116 184 -188 -130 14 -216 126 487 259 27 -35 -111 206 -258 -51 271
3821 271 -150 -157 459 330 -267 -311 144 449 -225 219 230 -62 -573 137 209 -227 32 285 21 -108 -46 193
3843 193 -46 -256 -174 217 138 -452 -117 -82 -592 -267 468 -39 -321 149 826 -49 -412 -19 -24 -22 109 623
3865 623 105 -243 -120 232 -250 -256 103 170 -346 73 412 -40 -782 72 0 23 -136 230 297 -416 -556 144
3887 144 256 -393 -111 54 278 -17 -1 104 -448 71 396 323 -271 -52 303 276 -206 -51 0 -137 -240
3908 -240 220 342 -140 -150 -288 -150 -460 74 312 -45 -91 62 -48 -133 -147 85 237 -175 31 -218 73
3929G3k85K50R5j56L37l54k3l9nJ16k51Q4r2J94j09J53K20j75l3o2M50k73J91
3952C06j2j40j98j41M2K52n9j05L47j61k12L99p94L01J75R9K09l74o6J07J57m62
3974c30L65Q6j45k63L71k4ok73J59J49l98L97K54Rm91j90O68k05j43K01K8m21
3996b02K32K64m27l33L00M23j3m64M73M6m96P8L67m14k53N90L11k10m23J82j6
4017A5J04l30N3L48k44p8K02K5l90J71M6j39K45k1J64j34j83K25j49m0j23K42
4039IQ6k71L94l17k0j73O15p7p4j13N6o9n01K93K99j32J21M7j2n93M15L96l87
4062hk7J31N7j20J6m2J40j63l8P6L97m90P1K4kk30K75M21m72l4K61J0j87L7J33
4087B36j89j62K58l51M18m95J98K49n58J37K86p7M29j68j09m28K02j0L18k08J46
$$ plain form
3929 73 -212 38 133 -23 314 -40 -63 -102 -107 9 -242 -158 -250 -56 -165 -12 208 33 0 -62 388 115 306
3952 306 294 154 -44 -185 -143 109 50 -55 292 131 -81 318 -476 -175 0 99 308 -66 -132 -25 132 -330
3974 -330 35 121 -24 -287 84 60 54 -219 -60 89 -309 88 342 351 -140 -330 338 133 -10 191 219 -202
3996 -202 30 294 -133 -466 -166 257 244 -220 253 299 -197 -119 248 -166 -419 171 482 272 -151 31 15
4017 15 119 -211 -158 190 -54 -132 70 95 -295 -124 -78 -217 28 7 171 37 -146 79 -70 -110 -233 9
4039 9 95 -176 218 -99 -119 -292 323 246 172 59 115 46 -455 -162 137 5 126 173 161 -432 -17 379 -8
4062 -8 -35 96 153 33 49 7 147 -16 -54 22 419 -71 0 24 22 -208 67 488 16 -18 243 253 66 103 236
4087 236 47 -115 143 -208 210 -285 -87 162 -396 -259 27 -50 379 211 102 -326 -124 -134 184 -24 122
4108A22J42k11j99j80O50o72M61K3q7k85n7O10m58q1J76K06j00p9J18j30j37k26
4130c94O35k42j08M76l14j79J19j5J08l56M75k29J07J02j98q7n7J49r4J00j11
4151a13K24o1J49l50K27O3j78K54L02l63k45j98K21j52J84J77p4j07O5L6J68j39
4173I0p4k26M2J82J28n2k07J02J03m3m19K00L77J01l67J76k66K37k81M19l38l8
4195a54k7r2L94k86L22j46j19P1L21l58P6k33J82L8o1k04K85R5RN4k25j07J99
4218C4P2k89L12J67k02K8q3q2j37K39J24j83k4Jq6L98j94k47M97k96J08M4j97
4241DJ0n17M36J41p9J32j25p8J00k44J8K21N3kO3Q4k95Q2k18K72l03L12l40L24
4265E1Oq6o0K22K74n76r6N60j62K0l15K03q7l0O8J64K62n42NJ22L2l0j8L8k68
$$ plain form
4108 122 264 53 -146 -326 324 -348 113 136 49 -236 -293 317 -141 -222 -46 160 60 -19 99 -31 -168 -394
4130 -394 241 -1 -109 367 53 -126 -7 -22 86 -270 205 -24 83 185 -13 -100 -157 -8 -102 -2 -113
4151 -113 111 50 199 -151 76 139 -39 215 517 154 -91 -289 -68 -220 -36 141 67 -40 25 61 229 90
4173 90 16 -210 -168 14 142 90 -117 -15 88 45 -374 -174 203 304 -63 113 -153 84 -197 222 -116 -154
4195 -154 -181 -273 121 -165 157 11 -108 -37 284 -74 2 -231 -49 -11 -72 -276 9 104 113 167 -58 -165 34
4218 34 106 -183 129 296 94 122 39 -43 -180 59 183 0 -24 -23 -109 289 95 -152 345 49 157 201 4
4241 4 14 -503 -67 74 -5 127 2 -76 24 -220 -202 19 72 70 133 217 -78 4 -214 58 -245 67 -273 51
4265 51 57 -29 -89 133 407 -169 -265 295 133 153 -162 41 -46 -76 -8 156 418 -124 -119 3 35 5 -13 25 -243
4290b43K06J92k55k34J07J79P7QL21k70l56M84j83k7k43J59j3M68m52L38l25k75
4312c37J07L02qK4j67K07j32k00J42L6p7J36J94J24m70K00k32J16L5l9R6l08J19
4335a32M5P0l14J78K43k97L14J95N6n33J80J6o1j61K37Q5r1l26J13L33k79%K71
4358A42J04l07J48K60Rl19k28L09k66L30j0l30N7j43K04j62l02O39J57l93J54
4379E3J05k16L30k20j87J51J27l74L44k50J08O9j08j72O5L59k16J07r3n4K8j03
4401a47M11m6r2j71j07L04k94L8L55j88M0J7K13n99L44M21l93j02l7R5R2j15k33
4424a94M15l53O1J37J15j89L5P4k35K33J54j56l3m7L29l41Q5k92K94j41o3J70
4446E8J31l07P2J63j04k10J84J30l3k87J62J94K82n21L63m14J81j10J97j24m48
$$ plain form
4290 -243 -37 155 -100 -334 -227 -48 29 37 358 88 -268 216 33 6 -237 -78 -91 377 -75 263 -62 -337
4312 -337 -230 72 64 88 -79 128 -4 -204 -62 -26 -103 33 227 351 -119 81 -151 -35 0 -39 57 -251 -132
4335 -132 -87 -17 -331 -153 90 -207 107 302 358 -175 5 21 -40 -201 36 121 30 -296 -183 150 -129 -129 142
4358 142 246 -61 87 347 356 37 -191 118 -148 182 172 -158 -101 -244 -40 -202 -504 135 292 -101 53
4379 53 158 -58 272 52 -135 16 143 -231 113 -137 -29 40 -68 -240 -175 184 -32 75 -18 -72 -44 -147
4401 -147 264 218 126 -45 -152 152 -142 -104 251 63 103 120 333 -266 78 499 106 4 -33 62 154 39 -194
4424 -194 221 -132 -71 66 181 -8 27 101 -134 99 253 97 64 17 346 5 90 -202 92 -49 -112 58
4446 58 189 -118 -46 117 13 -197 -13 117 84 -203 -41 153 435 -86 277 -137 44 -66 131 7 -441
4467d41K89M6J53n07O66l66L90l95L17n3l74rK69k43K47p7K24p8j90M21m11j1
4489a33K66n1j44J14O5j94N9j3K46P2k69J04N5j05k12K43j13k45K25j17K11Kl01
4512b35K59rj89M33pk36k48K31N4p7N1K41k33k30J62K28j69l42L11L62j29j59
4534F9rj60K0K76K2q9k30j87L89n8j73K73j08j34J26J18J56n99J71K80j97k90
4556c34M65R5%K3m3j07l69J43k2J23j24M45j93j7k90J39K18m05J38N3J64l43M13
4579A72j33j87p3M04j18n0q7N3Ok01O9K35j08K9j24L51l15j85L7L01j68M5M32
4602C85k25j50J29j37j6j54L09k37n0L38l8j93l12K66J16k9K6N9N5J08Nk38j03
4625h6J80l65K71k4J55j01Q9p4j96P6Q2j08J92l4ok31K21j54J36q3K77j00k35
$$ plain form
4467 -441 -152 -106 47 -460 206 -160 230 -165 152 99 -275 -284 -15 -258 -11 -88 136 58 -132 289 -122 -133
4489 -133 133 82 -62 52 117 -77 -18 -31 215 287 18 122 177 72 -140 103 -10 -255 -30 -147 64 66 -235
4512 -235 24 15 -174 259 252 16 -232 -1 53 -24 27 268 35 -195 -33 195 26 -316 -5 357 228 69
4534 69 60 -100 -80 196 218 129 -101 -288 101 43 -130 143 35 -99 27 145 301 -298 -127 153 -44 -334
4556 -334 131 226 226 249 206 99 -270 -127 -149 -26 -150 295 102 85 -205 -66 152 -253 -115 -62 102 -241 172
4579 172 39 -148 -221 183 65 15 -72 -19 -13 -214 -145 90 -18 11 -113 238 -77 -262 -225 76 -92 -47 385
4602 385 160 10 139 2 -14 -168 141 -96 -146 192 154 -39 -351 -85 31 2 28 87 142 250 255 17 -86
4625 -86 94 -271 0 -24 131 30 119 45 -151 -75 7 -101 91 57 51 -180 41 -113 23 -60 217 117 -118
4648a18l4P07n56N3k24N50n84J00L61L7j56l10K28j30L35j81L3k20Q1n2L67j41
4670A46n4Q4l07J01L75k63j75R7nq8J0j92L98j21l81N07K43p38K30ML79nl55N32
4694D22l60j89K1J65J46l91K42P8j15k31M68j96k56K65J30l39j46K84q7k33K11
4715a11L20j30k30L54j38j51p7L7K00k83R4J81k2q5L18l75J64k40J28j12J49j85
4737a94J08J3Q4Q2J73o31M21j72J13O6j92K56J34m97L67O4j98j05j03N02m27j16
4759b52Q4M27j55k34J32K18l26L3L2N6k00L09J44K7n16K51J6J36k91L49k26n6
4781d2J92p0J89m42K44k80j45J50M55k37L4K19j49k32N5J96k1J6j62K85m04P7
4803g2J06K6l1j5p3k0J90l25N3J99l60K07K94j16k45K26m0K09k88O1K77l04q9
$$ plain form
4648 -118 -152 555 -1 52 -172 378 -206 -106 255 292 136 -174 54 -76 259 78 111 -109 -28 -80 287 146
4670 146 92 176 -131 -30 345 82 -93 4 -1 -89 -79 -271 127 6 -375 132 375 -363 -133 -129 250 245 -110 422
4694 422 62 -127 -106 59 205 -186 56 134 19 -212 256 60 -196 69 199 -140 -286 -2 -89 -322 -111
4715 -111 209 79 -151 203 65 -86 -163 -126 74 -209 -115 66 44 -41 277 -98 66 -174 -46 -158 -9 -194
4737 -194 -86 -73 11 93 266 -365 56 -116 -3 63 -129 127 261 -236 131 195 -3 -108 -211 291 -136 -252
4759 -252 -168 259 104 -130 2 220 -106 -73 -41 15 -185 124 268 295 -221 30 46 182 -109 240 14 -42
4781 -42 150 80 269 -173 71 -209 -354 -204 251 14 48 267 118 -114 -59 137 116 132 -30 255 -149 -72
4803 -72 34 60 29 14 -59 -79 111 -214 -161 38 -322 -115 179 63 -182 44 4 213 -75 -14 263 -41 -130
4826a30L78k66j87N60j42k58q9R4j37Q4L1J49P0k54J63j90J36O5k19M12k19L9
4848I0r4p2K02k66J57K09J07j25k54Mr5K21j84J55j01p8j47L75j86k8K17j93O9
4871a7mJ1J71k35K52k14K43l70K35j00K79j22k40L2J59L16l70j26O7j04L5j65
4893b67L85j8k77L86k63L04m01K34m04K90k11J67J63q1j13r3L09k42j88P07l93
4914fL37j99J86o78L52L33k85k02q2N36q1k85j45M23j90j39N6j9M1M0M4K15k79
4937b7m9J36k51K23k06K10R1r2m4k42L40k16J5K01l8J99r6k82J11L5k42N28k52
4960E2j94K56m13K36K26ol43J57J48k93N5K86j59o3J73K3J8k53r0l6MM03j65K35
4984B57j49j56K4N8J14j88K9J38k76n4J36J44q1p0J29r1qQ2j99L17nJ2j58K1j68
$$ plain form
4826 -130 248 -18 -205 355 213 -45 -134 -40 -177 -93 -62 87 157 -97 66 -124 12 77 -142 270 51 90
4848 90 -4 -76 126 -140 17 226 333 208 -46 -42 -137 84 -100 55 -46 -124 -271 104 -82 -110 107 -86 -17
4871 -17 -21 -10 161 -74 178 -36 207 -163 72 -28 251 129 -111 -79 80 396 26 -100 -33 -137 -102 -267
4893 -267 118 100 -177 209 -54 250 -151 83 -321 -31 -242 -75 88 7 -106 -199 110 -132 -320 387 -6
4914 -6 331 132 318 -360 -8 325 40 -162 -244 292 211 -74 -219 204 14 -125 -69 -88 -47 -7 37 252 -27
4937 -27 -76 60 -191 32 -174 36 127 35 -9 -251 89 -127 -112 89 51 250 154 -128 -17 18 -224 304 52
4960 52 -142 114 -299 -63 163 157 -186 -29 119 -174 -119 167 8 -55 118 141 159 -94 -184 -220 -216 187 22 257
4984 257 108 -48 -24 34 148 -40 -11 127 -149 -203 -67 77 -4 -74 55 -36 -44 38 -161 156 151 163 5 26 -142
5009a42J4K06j68j53j8J68L71l43K13j59k04O3J1K23k32K02j1m73L46L5p1M0k93
5032c75O2J05L87m08N09l38n8P9J07Q2j72j01K94l7k31N8j84Q8L1L0J7K34NJ6
5056B00k13L03o42M12r9L18k93O4k28L21m0j82K19j2k33J57j26K24r2K21j58R7
5078B18j91J2k1O5R2j46k24o7M13p5j16l5K09j40O0m01J19J88J70k10K38m7k81
5101a70J46M7q3P3j15p5J68j95L05k90O6K4R4K0K03k02p7l0J34K06j11r6J52l28
5125a34J21o9J78j79P5j13j6K31l07J57m9J74j68q8K48j39L61o8l05M3J5J91l03
5148a44K32j44L51j48M9o92N07L60l41l08J77M2J67m1l9O6j89J08jr2Ll2R5k17
5172b31M62k03j76M60l50L2K3j93J01J24l12L63K32j98k05J92p4k0J71l36o3J98
$$ plain form
5009 -142 -128 78 -90 -243 -261 -93 278 -65 148 -11 -215 -152 -141 82 -150 52 41 -432 -86 -51 -122 -82 -375
5032 -375 -313 -208 179 -229 280 -58 -116 -37 70 152 -20 -121 173 136 -95 -37 -221 -133 -102 -72 -55 179 184 200
5056 200 -13 290 -352 60 -39 279 -14 50 -178 143 103 -79 140 128 -105 52 -74 150 58 279 121 218
5078 218 27 39 18 83 175 29 -195 -262 151 76 -40 -75 134 -6 54 -347 -228 -40 130 -80 158 111 -170
5101 -170 -24 23 -60 13 -102 -177 -9 -204 101 -189 -123 -99 -5 15 218 16 -61 -91 43 249 138 42 194 -134
5125 -134 -13 -82 96 -83 -8 -121 -137 94 -213 -56 -105 69 -99 -187 61 -78 283 215 -90 -47 -32 159 -144
5148 -144 88 -56 295 147 196 -496 11 371 30 -278 -101 -59 108 67 28 94 -95 13 12 -80 -77 -109 -14 -231
5172 -231 231 28 -148 312 -38 -6 17 -176 -75 49 -263 100 332 134 -71 121 47 27 198 -138 -201 -3
5194cj52J24K23k63L1n2R9m9J94K01l91j7l5L48j80l07J92k18K33j56J0J06k54
5217c16K9J66J21j05m5r2M99n85N74n43K34K28l21J28p2oJ8K70k10O0%j26m9L08
5241A65k54L44l64N3j35M53j33j09K1J12m79N15P6j19k86P0K6j52J6J00K69k42
5263e3J57j58K97o2j91kr7J6K25j25n5r5K46J60L4k87q3j75K66J88k35q9j40L8
5287b20L41l3j52J36j98j89J75K6k0J49K27kl35L14k89K36m23Q1Q4K36j55k14
5309b25K75j9K3K77j28l63J27K04k15j01m3J30j95J38J38K6k04J86R4J1m30J98
5331i6J97j71k6Q9J10P6k86K50q9j48O8k71L27k13P9j59J78PL3L20l96L23l98
5354a96J99n9K63k70J20N5k84O0l52M14j73K24j0j8N8J15j52p8m1J0k57M14mk41
$$ plain form
5194 -3 -155 -31 192 -71 -40 -92 7 -42 152 353 -38 -55 -90 258 78 -229 -37 -255 -22 -178 -168 -62 -316
5217 -316 -287 -121 0 -105 -150 -242 257 -328 246 -297 -63 165 -156 -28 -100 -106 -88 182 -28 32 32 -94 -143 165
5241 165 -89 255 -109 -56 -191 262 129 20 41 153 -326 189 265 146 -140 -70 -44 -196 -180 -80 189 -53
5263 -53 104 -54 243 181 -10 -12 -109 -93 132 7 -48 -143 103 263 297 10 -73 -248 18 206 -29 -118 -258 -220
5287 -220 121 88 -64 72 -126 -315 -140 -114 -134 15 242 240 -95 219 -70 166 -257 -176 -92 144 -11 -225
5309 -225 50 31 54 331 203 -160 -33 171 -44 -145 -188 -58 -253 -115 23 49 -155 31 125 136 -294 -96
5331 -96 101 -70 -96 -7 103 179 -107 143 54 -94 -26 -297 30 -183 -104 -263 -85 -78 -45 275 -121 202 -196
5354 -196 3 -56 207 -63 57 112 -172 -112 -464 -50 -223 1 -9 -27 31 146 -6 -84 -125 -115 -372 42 38 -203
5378b03J44L78m79j66L14k1L07l11N1l39M30l6k38J06j31N42l59j92j8J67p0M44
5400C20l35J02M0j13j77K84j29L3j34J04J30p9l43K15r7R0J10l36L16L41P7m05
5422A4J14j4j36k1L74k79l5j28K24l4k1k99R0P9n9nl1K26Pr3K08l99j42M88m47
5447c19M28m0j06k85J66M73o48M50k50k17K09J23j2j45J23K14r6o9J97l17K98
5468A77p9k6n9K30j1k38J86k27J51K78n55N3K12m5J86o72M04K13l57j45N45n4
5490A67j5m61M28q9j87j1J23j7j9NK69j69j1l4J45J6rj07r2R3M3J18k65jj52K54
5516B2k70K64P2J44l14J25k11M67l36j72J51j24J61J2K25k69p2Q6K77k19K18m46
5538b09J81K7P6K65m19K59m9k35R5k00L50jM4k48K34k49p4J73R6j59K94k64K5
$$ plain form
5378 -203 -59 319 -160 -326 -12 -33 274 -37 14 -325 105 69 -169 -63 -194 348 -11 -203 -221 -54 -124 320
5400 320 -15 87 127 14 -163 121 -8 25 -109 -5 125 46 -297 -82 -179 -89 21 -315 1 342 419 14
5422 14 128 114 -22 -43 331 52 17 -111 113 79 58 -241 -151 -72 -131 -136 -167 59 66 -27 181 -218 -360 128 -319
5447 -319 109 69 -37 -322 -156 317 -331 119 -131 -348 -139 -16 -28 -173 -50 164 68 -1 196 -121 177
5468 177 98 72 13 243 232 -6 180 -47 104 382 -173 -120 92 47 233 -439 -35 178 -179 -324 221 167
5490 167 152 -309 119 30 -157 -168 -45 -62 -81 -76 193 24 13 -21 124 140 131 24 -68 25 68 186 -79 -80 -232 22
5516 22 -248 16 88 232 -82 43 -168 299 -37 -209 -58 -182 -21 -9 216 -53 -125 -39 238 19 237 -209
5538 -209 -28 -1 75 340 -79 180 131 -104 -9 -209 141 140 184 -64 170 -79 -153 20 116 -43 251 -13 12
5561A2m3j49j89L79K38k03P8j81J8k34L76J95l54R5o0R3j19O7J7j86J0J45k17
5584b12K9j21M21J33m92J19K07K7L9n9P4n1m5j50k6J54J83k31L4M5k06K28j83
5607h3J58K4j22l24Q7K59k13L96o4L2o7l68P5Q0KJ81k05J94Q2J66N2k06j18l60
5631c42M57j70j19L9J9J76p3k22M62l56K10J6m27M72j69J19p2K83r7n0j6J7m9
5654A08l20L64n7k1j93J22J05P2l65J76P2j87K62Pk33J32K74n68R5R7N5j89q1
5677b73K73j46J37J06Pl67O67j17l82K68k85J26k32Q2J23K76l24n7K52k7j96J25
5699C6M0O1K13l40L9J4r1m8l90M05L5JJ58l01o6K78jK36o2l69K56L5l00K08n6
5724iK77m75J85P9nk0j64J4M0K09O2p4Mj82L1k68L55m9L44k86J3P4j79L3o7Q7
$$ plain form
5561 12 -31 -180 -369 10 248 45 123 -58 -40 -274 102 297 -57 38 -22 71 -48 19 36 -150 -140 5 -212
5584 -212 -183 -304 117 250 -242 -123 84 111 150 91 165 114 69 -81 -107 47 230 -1 33 78 -128 100 -83
5607 -83 75 99 -23 -347 -260 -1 -214 182 118 150 83 -285 -210 -130 -128 53 -152 42 124 290 342 136 18 -342
5631 -342 115 -55 -174 -135 -116 60 -13 -235 227 -129 81 97 -330 142 -27 92 20 303 206 156 140 157 108
5654 108 -212 152 95 74 -119 3 108 180 -185 -9 63 -124 138 145 -88 44 318 -250 -155 -58 -3 -192 -273
5677 -273 0 -146 -9 97 104 -263 404 287 -95 173 -112 14 -218 -136 -13 263 -61 -118 134 107 -89 36
5699 36 76 137 350 10 49 63 -28 -76 -466 -61 -26 -25 133 -168 -234 44 43 279 217 -152 104 139 -161 47 -9
5724 -9 268 -207 -22 57 52 32 -132 -118 -78 131 193 119 123 -59 -28 -296 59 10 354 68 81 155 -24 9 -58 29
5750B9j2q6l6P7k27J86P7j55J57k07M05m58K16J28j46K65l46L65j4m41L04n2n27
5773d98P50q0k49K93k14k50J72L05k12n5K46k07j16K14j51J86k42K70q6R9o3n0
5795F2J49j00j49l0K4j55L34j23L3m11N89l68J20J02J88l62K5n2q4M41k66J16
5817H3k49L79k01N2R2k68o7K26p7J74j0j35l44L98l2j94j08M30j26k41M8K42k97
5840b25J56l4K14r4M1q5K44j97J40m8K09m45j2K19J36k52L4q3l1K33k96J89r8
5863h5J66k63K33j55k9N8qJ57p5K43o2l20l9K89k35q8K46j81jm9K78n1k71L33
5887I1r4J14p1j33p6K06m74M68Kj04L3K0K52l62q6K53m01M77m2k26K19j1j81n4
5911a80J49Q8R4k95L69j60j85L54j83L49o34p6K81n8K7K2pq2Q6K4K85j46J6k78
$$ plain form
5750 29 17 -69 -105 -28 -255 -69 8 -147 10 -197 208 -250 -34 94 -52 213 -133 232 218 -223 81 29 -498
5773 -498 252 172 -77 216 2 -248 -76 229 17 -38 208 1 -115 99 -52 134 -108 162 76 175 112 62
5795 62 211 111 -38 -68 -44 -199 135 12 45 -366 223 -145 -25 77 265 -97 -72 -124 -208 233 -33 83
5817 83 -166 213 12 64 156 -112 -179 47 -30 144 134 -1 -345 53 21 -173 -281 149 23 -218 -170 72 -225
5840 -225 -69 -103 111 17 58 -27 217 20 160 112 321 -124 -136 83 219 -33 1 -82 -113 120 -176 13 -85
5863 -85 81 -182 51 -104 -133 -75 -83 74 -1 242 180 -140 -179 110 -125 -213 33 -148 -149 -198 80 29 -242 91
5887 91 -3 111 40 -93 -169 37 -437 31 33 -71 -38 -18 234 -128 -214 39 -362 115 73 -153 66 55 -126 -180
5911 -180 -31 57 151 -144 225 65 -120 234 51 400 -234 -310 -29 -87 -60 -38 -45 -127 -41 -17 268 122 138 -140
5935a40J37q7J52L3k3l5k09K11L77l48k93N61n75K80r8K8j05J52K43o8l56q0O7
5958a76M82n19J62j72K52Nk25J80J65q1k94J03r0L88nl0k29K22M8o8o4rk48L26
5982A23r2N9k19J25J34L0j33J95k27j31J54N9j94L15j36k50j73N95l62M04o09
6003c33L08K48k49j28Mj03L64JJ9j98j22p9M08m03L09Nl1k17P9J78j74Q5J1M05
6027C87m62J14j89o7L20j76lL2k46L46L64k1l87o4J69Nr3L9J02k1j85J2j98J6
6051b06N4j55L02j2j24L58k11m5pO0j7n6J68k84P9J06q9j2J37r0M08j82rj32J23
6076A64K0m0K84m56k13M06q6j01J17k82L21l3k84N4K02p7N7j78J15j2j8L15l13
6099c8q5R8J98J86k68qk78K49K20o0l00k74K68M43m41J14J10j50J30j37k50M47
$$ plain form
5935 -140 -3 -90 62 95 72 37 -172 39 416 68 -225 336 -239 41 -57 -29 -134 18 261 193 -163 -243 -176
5958 -176 306 -213 -51 -223 29 34 -191 -11 154 73 -221 -118 -208 180 175 145 -84 138 186 118 54 45 -203 123
5982 123 31 90 -129 -4 130 160 27 222 -5 -136 18 77 -117 198 62 -188 -361 234 -128 276 -333
6003 -333 -25 223 -26 -154 -150 -253 111 112 131 -67 -189 -268 140 -263 46 51 20 -197 -118 60 -114 -29 -18 387
6027 387 -75 39 -150 -217 103 -73 -76 -44 -290 56 420 399 12 -52 117 122 29 68 170 149 -36 -24 -222 -206
6051 -206 -152 -307 -5 -17 -141 217 6 -39 -46 14 -3 -59 109 -175 -96 10 -79 -91 46 -44 364 182 173 41 164
6076 164 184 144 428 -28 -241 165 79 -22 95 -187 134 101 -183 -129 73 -4 53 -125 -10 -22 -40 275 -38
6099 -38 -123 -25 173 359 91 83 -195 54 274 214 -86 -360 -92 351 -90 24 134 -16 114 -23 -273 174
6121A74j20Qo6K63m62J57L63l92j6J81k11L16r2oj30rJ02K14m62L94k58j9J72
6144A01P7j31j12Q5J54l09J25P2J30k76J94j19r4J48J38q1l00J07J12q9L48k06
6166G4p8k7k77L86Q8m17P15l99q8J49N9p5l48K06j58L36n9j56J17j14K37o23M69
6189A7k9R7k21k05M42j17J65j92P2k64J62K01j30K67l08j04J95j83M85n63L34
6210A21k8k59m2K03r6K58j94L3j6N3K69k40k83L85l54K73n6R8k51M48k85L09m19
6233g3r8L74n7q6L7oJ3k41R8l5p3m8J36K57j64j14O6o4p3jr3K49j73L32k86J19
6259dK3p1M3K68k43J77p3k37K68m9j19J14m75N26m83K86l05K36L64n34L50jj04
6282d3j57N3J31j71J44J34q4j63L93k60N4%k50M5R0J06l80J72L19q2l78M33j02
$$ plain form
6121 174 54 62 -4 259 -203 -46 317 -75 -91 90 -121 195 103 97 -33 -42 60 274 -188 206 -52 -71 101
6144 101 178 47 -65 20 174 -135 -10 62 192 -84 110 -9 -103 45 183 102 -198 -91 21 -68 280 74
6166 74 -4 -31 -308 78 166 -251 464 65 -23 126 185 110 -238 -32 -190 146 87 -69 48 -66 171 -452 17
6189 17 -12 85 -136 -341 101 -16 149 -43 29 -235 -73 128 -2 265 -43 -147 48 -135 350 -213 121
6210 121 93 -166 -208 -5 -101 157 -37 -4 -20 33 302 62 -221 164 -190 83 27 125 -126 322 37 346 -73
6233 -73 -171 203 146 60 97 91 104 -137 -39 -74 -147 -195 -59 198 34 -80 -14 -78 -151 -152 -245 4 -169 163 -123 -4
6259 -4 19 -52 -9 259 16 193 120 -117 151 102 -17 97 -378 148 -335 -49 -354 -118 246 -288 62 61 -43
6282 -43 -200 -147 -16 -187 -43 91 7 -156 237 -23 31 31 -219 -174 -84 22 -358 -186 133 51 -327 106 4
6305DOK4p0J66k62n4J40O9J43k54O9J11m92N11j73j26K48M1k17M2L28L9j66j23
6329DK20K0K2L9l26O9J20j04k84M0M04n10M50k91K86j26j82K48j2N0l02j09L86
6352A12j21K7j89K58N5l62N28n14L20j19L1j87L03j51NJ63L2k79K35j54j83N2
6374a38m1J11K74l65J96J23k27Q2j00m0J62q3j37K23l07K19J90j78j26J7j15M35
6396A75l5k99R7K13J14k80r4K51r4N2j60q1K54k80N1J34j0R7j45k49L92j52L9
6419a0J04k22J37n8K2j39K80k7j90N2l74N44j82P9j43K12j11M8R6Qjl8K9j34J76
6444A58o1j43J32j04O5k9l61Q7L3K68Q8r2k7q6O8J74k0m65L53j8k8j12q1M57m06
6469a50K13j92k5K68k53K35k06O9L3j8Q7J39k50N0K25k86K68l11L45jk0o4k54
$$ plain form
6305 4 10 34 -36 130 -132 -186 -46 23 166 -88 -19 92 -400 111 -62 -188 60 101 -116 -74 254 293 127 4
6329 4 224 244 266 305 -21 48 168 64 -220 -180 224 -286 164 -127 159 33 -149 99 87 137 -165 -274 112
6352 112 -9 18 -171 87 142 -220 308 -206 114 -5 26 -161 142 -9 -4 159 191 -88 147 -7 -190 -138
6374 -138 -179 -68 206 -159 37 160 -67 15 -85 -125 37 -46 -183 40 -267 -48 142 -36 -162 -145 -260 175
6396 175 140 -159 -62 151 265 -15 -109 142 48 100 -60 -141 113 -167 -116 18 8 105 -40 -289 103 -49 -10
6419 -10 94 -128 9 -49 -27 -166 114 87 -103 -51 -425 119 -63 16 -127 85 -26 22 118 126 125 87 116 -18 158
6444 158 97 -46 86 -18 47 18 -343 -256 -223 45 133 41 14 -72 -4 170 150 -315 38 20 -8 -120 -201 256 -150
6469 -150 63 -129 -154 114 -139 96 -110 -41 -8 -26 61 200 -50 0 225 -61 207 -104 241 240 220 156 -98
6492i8P6J09k07K28j22J83k40J57O8k41O0M27j77m36L65j36J70q4k16p1o7L19
6514F7k03J89O5j11j18J20j33P8J72k30j64Q5M65k6j66r9J41K03k46J05l86K53
6536F1M8k03N2J25J79q9j2o4l63M16l61QP8J73j45L85l78J10Q9k28J58l79N61
6559B21L9o1k45P0j1Nj2J33O8j30J30j71k02J75j10J72l83K42L8K50l8k60l59
6582d39K82P09n63Q6J79l26l6J72n1J2J93o85J73O07k74o0J5K6J75l39K68J35
6604B59l56K24l50K23l39L43M28m43J53j38k6o1J16l2q2O6Q7J07j54m2n7K01j81
6627e4j0P7q4R1k4j21J15m9P9k41K93P7j57l25L83M5l10J46K42J28k28l64L2L00
6651D1M3k03p0M77k90L3K3O1j78K42k50K28N2q6J5o7J40k14j64N33k9m62J93L07
$$ plain form
6492 -98 -22 87 -120 108 -14 169 -71 86 154 -87 -27 400 223 -213 152 16 186 102 -114 -185 -252 67
6514 67 -136 53 118 7 -111 9 -124 -46 126 -104 -268 -183 282 256 90 -9 132 335 89 194 -192 61
6536 61 109 -94 -42 83 262 173 161 97 -266 150 -211 -203 -125 48 -97 288 -90 20 109 -119 39 -340 221
6559 221 260 199 -46 24 13 18 6 139 207 77 207 36 -166 9 -101 71 -312 -70 -32 218 180 -80 -439
6582 -439 -157 552 -11 75 254 -72 -108 64 13 25 218 -467 -294 313 39 -21 -6 20 195 -144 124 259
6604 259 -97 127 -223 0 -339 4 432 -11 142 4 -22 -83 33 1 -81 -15 72 179 25 -17 -74 127 -54
6627 -54 -64 13 -71 20 -4 -125 -10 -59 20 -221 72 149 -8 -333 50 95 -215 -69 173 301 73 -291 -259 41
6651 41 84 -119 -189 288 -2 31 54 115 -63 179 -71 157 209 123 138 71 211 -3 -167 366 337 -125 68 375
6675C75l86j0J37j24J63k52j46K04p2L18k37r2N3Q7L4m1mk8J19M5k5l2r1l59J49
6700b15K47j59J6k9M35k53n4K5J72O3l64M18J29l37J62j62m3p6m3J68k80J42J36
6723I8j67n8J85K03m14K17P7k52N3j65K61J86q9n1K51j02k5M8k21k65K70J02n55
6746d13L44J66N3K2r3r1Q3l39K93q8K74l90K39k07Mkk1J25m14L99K3J31j98L03
6770B03m4N8m91M56j3j18j91L20J42k95j0J3K19m14L02P5K7j24o3k39M9K83o3
6793H2j69J86j11j11J68K3j46J92l5k32L20j46j42j6M2K15n9j28J67m32N04k67
6815i5L33n02K26j19K73Q9l36L64j16Q8k84L29j75m7l19L07J32l07R5K08j27o7
6837e0j4p4M06l37J39j85K66j42K68k43P0l6j48J19J03J39l43J36J26j48K8j80
$$ plain form
6675 375 -11 -21 116 -8 155 -97 -243 -39 -111 207 -30 -122 -69 18 52 11 7 -21 98 143 118 86 -5 -364 -215
6700 -215 32 -127 -111 -140 295 42 -12 13 185 248 -116 302 431 94 256 94 51 -25 -68 100 -180 -38 98
6723 98 -69 -127 58 261 -153 64 141 -111 -58 -223 38 224 135 84 335 233 208 256 35 -230 40 142 -413
6746 -413 -69 97 150 172 79 -12 71 -268 25 -63 211 -179 60 -147 -143 -145 -166 -41 -455 -56 -33 98 -100 203
6770 203 159 217 -274 182 169 51 -140 180 322 27 17 30 249 -165 137 212 239 115 52 -187 -138 145 82
6793 82 -87 99 -12 -123 45 68 -78 114 79 -153 167 21 -121 -137 -95 120 61 -67 100 -332 172 -95
6815 -95 238 -264 -38 -157 116 205 -131 233 117 205 -79 250 75 28 -291 16 148 -159 -64 144 17 -50
6837 -50 -64 -138 268 -69 70 -115 151 9 277 34 104 68 -80 39 142 281 -62 74 200 52 80 -100
6859a00K71l77K81l10M07k41K35jK7m67J48R1K06o4r1M8j53J12j50O7J40J7p4
6882B2l8n2J18L28l50r8o4K31P3J32j87j53n4r6K47P%o7J88l34N3o1J7L21j08
6907G5O6k68N60l91n1P1q2M58l54k62m3K99j57j7O4K70k84o0K9J85m1K1L4l3l7
6932E2r2j7m0L0n8L15l22J3j07K04J32j52K52j62n11N94j63l1O5L33l72r2R5K98
6956B64j26k98M12l22pK5K89l39n7K03J73k28J21j63N4N5J52q0rj46P3j9O3r0
6980@P2q6J27k72J7L2K03j1j52K78j96m4l5K7J34L6l80K2q4M22p0O9k93K29o4
7005a9m3r9N5O8J07j41J84kj10P8Q8j22J19M2K1k76L0m8J28n4N1J16O4j54l10
7030b27K04k41J89M0j45J99M85m69nJ73J83n85J49K7n9j50J51l5K97j7l8l1j08
$$ plain form
6859 -100 171 -206 75 -235 172 -69 166 165 192 -275 -127 -36 170 106 15 63 -90 22 -128 -61 79 96 22
6882 22 -16 -68 50 378 28 -70 -134 97 170 302 115 -38 -92 -188 59 66 66 -1 187 -147 -94 -155 -138 183 75
6907 75 141 -127 433 42 -9 62 -20 438 84 -178 -221 78 -79 -96 -32 238 -46 -106 -77 108 67 88 122 89 52
6932 52 -40 -57 -97 -67 -125 190 -132 -119 -226 -22 110 -42 210 48 -463 131 -32 -63 2 335 -37 -129 -34 264
6956 264 138 -160 252 -70 -77 -52 237 -102 -159 44 217 -11 110 -53 1 56 208 128 119 -27 46 27 90 0
6980 0 72 -14 113 -159 -142 -110 93 82 -70 208 12 -32 -67 -40 94 130 -250 -228 -312 110 40 109 -184 45 -19
7005 -19 -62 -161 -106 -38 69 -72 112 110 0 78 166 44 163 205 226 -50 -20 -68 60 6 57 173 237 83 -227
7030 -227 -23 -264 -75 -35 -180 19 504 35 30 203 386 -199 -50 -23 -82 -232 -81 -116 181 164 126 95 -13
7053a3J30j08o7ko8J78ok63M9J98K27l60L1q0Q0m7J98J9l3j52l7K3K59J6j90k15
7079b33K42p8P4j46Q1r7P0J99N9k54J47k48K33JK9k07J34P5k98N03j62k08K74
7102A90r8m7j87oK25KN3Q5k07K7K78n59K95K9j07J47j53L25n11K34K09K5l19j66
7126b36L91k0j14j97K01k7k30K2L06j34pJq4J23L4J94q6l73L11K5j99M01k74k8
7150@J81j52k44J88Qrj88K58K08o80K80m2J40r1L25m2K8r5l34L05J67l19K87j55
7174B4O4l75L66q6j13J02R1o3K37j60k2k81K24l74J53K41j35J48l63K80k3j3L45
7197B67m82K63K39m23J18k04M91n55L33Rrj43N94m47l46p5L26J80j71j10K06o2
7219ap4J09k2J18k48K00j35J60k11R6J74l0k15o5o0J76J22k51j0Q5p5M42p65K88
$$ plain form
7053 -13 117 9 -58 -60 -128 50 44 -219 -170 28 255 -105 -74 -154 -74 -121 77 96 63 -89 -126 -103 156 172 -18 -233
7079 -233 9 -69 5 -141 -60 -157 -87 112 171 -83 64 -184 49 50 79 -128 6 81 -217 286 124 -84 190
7102 190 92 45 -142 -148 77 79 132 217 10 37 315 -244 51 80 -27 120 -33 292 -219 15 224 249 -70 -236
7126 -236 155 135 21 -176 25 -2 -232 -210 96 -38 -45 -44 -128 -5 29 223 137 -236 75 100 -99 302 28 0
7150 0 181 29 -215 -27 -19 -28 -216 42 250 -430 -150 -192 -52 -143 182 140 168 73 -261 44 211 -108 179 24
7174 24 88 -287 79 -7 -120 -18 73 10 247 87 65 -216 8 -366 -213 28 -107 41 -322 -42 -65 -78 267
7197 267 -215 48 287 -136 -18 -222 269 -286 47 56 47 -96 498 51 -295 -370 -44 136 -35 -145 61 -1
7219 -1 -75 34 12 130 -118 82 -53 107 -104 -8 166 136 -79 -144 -204 -28 94 -157 -167 -82 -157 285 -480 -192
7243a92M5J31j49k7J50l4j39K67j60J58J12j3k71K7j30K64o9M4Q2n31L98J42k09
7266a04k85M48J14j6l47L03J33j29m9j43L18l78J85J31L5J50l19q7p2K51l3j57
7288e1M9p6L99k11p3j33J13J02k07J43l3q3K5Kj58N91k07l40J15J19n0k34K53
7311E5k87J93M3l27J68K76k21J88q2N4J20l04J64j00k85M38k75N7j9J93j84n1
7333a86R2N1j21L02J7m64M01j28j85j46K92O1M3r6R2K67j19n2k11J59k59L51j38
7356B3mp2L87k32q2k86K96J08k54K94j19r1j38J54n8P1P5k32J5K98k18j1N8j28
7380a46l08P05J39p64M69R1j05J29j16k66N08l09k26J52j00l34O84j25j79J4K39
7401A52m2k22j94L15J39l46n8K50r0K05P5n20L54q9j68L59j51j83J91K07r4j9
$$ plain form
7243 -192 -147 -16 -165 -192 -42 -76 -215 52 -108 50 162 149 -122 -95 -225 39 -30 14 96 -435 -37 105 -104
7266 -104 -389 59 173 157 -190 113 246 117 68 -75 243 -135 50 181 216 366 47 -40 -112 139 106 -51
7288 -51 -2 -78 321 110 37 -96 17 119 -88 55 22 -61 -36 -34 -192 399 192 -148 -33 86 36 -198 55
7311 55 -232 -39 4 -323 -155 121 -100 88 6 60 180 -124 40 -60 -345 93 -182 -125 -144 49 -135 -186
7333 -186 -94 -43 -164 138 155 -309 92 -36 -221 -367 -75 -14 29 -67 25 292 173 121 -90 69 -190 161 23
7356 23 19 -53 334 102 20 -266 30 138 -116 178 59 -32 -170 -16 -74 -3 72 -160 -145 153 -65 -76 -18 -146
7380 -146 -454 251 390 -374 95 186 81 210 94 -172 336 27 -199 -47 -147 -481 203 78 -101 -87 152
7401 152 110 -112 -306 9 148 -198 -256 -6 -96 109 184 -336 18 -71 -239 120 -31 -214 -23 184 90 71
7423G1j27J10p8n0L4J8Q3j92L56j68n8k3k20K3L87k20K44k78O9J03j72N6J54p
7447A15j24L19k66j79J39j66J07K03j91Kk26L44L3l0M5k65k3K42j1J26k20k21
7469b47n9L53J56L3k53K84j60r9J8L9j29p9L59k54k25R3J67l4j43L01k20K30k87
7492a56j7K68j23R2m47R1L21K09j65qj09M56l31N8l26K1M92o64J84K72j03N9k02
7515a28Q4J73M0l01J36J67j85O0Ql7J70k74J8K41l91K02J5l1O9J04j33J02j19
7538a0J95k50j07n2K94m0j82M3M28k21J9K6j54J96j6j15n4j70M5jo5K29k76L88
7562A50k90K51P5k30j39M15k09k36K18n9l45L14p3J03K91n72N05p4j88K35J86
7583C28j01r8p3j5j25Q0m4j22J86j9k53K03j10j07L00N5k20j58K48J08l01K95
$$ plain form
7423 71 -56 54 -24 -74 -40 -22 61 -131 225 57 -1 -24 -244 -221 166 -54 190 -88 -19 84 -88 -32 122 115
7447 115 -9 310 44 -135 4 -162 -55 148 -43 -41 -267 77 110 80 125 -140 -163 79 68 194 -26 -247
7469 -247 -306 47 203 236 -17 267 107 8 26 65 -64 -143 216 -38 -263 -170 -3 -37 -180 121 -99 131 -156
7492 -156 -173 95 -28 64 -383 -292 29 238 73 65 -44 412 81 139 -187 -166 326 -338 -154 118 15 74 -128
7515 -128 -44 129 169 -132 4 171 -14 46 54 17 187 -87 -69 172 -219 -17 -2 -33 36 140 7 109 -10
7538 -10 185 -65 -172 -224 70 30 -152 -109 319 98 117 143 -11 185 169 54 0 -170 -125 -126 -191 38 -238 150
7562 150 -140 111 186 -44 -183 232 23 -213 5 -54 -399 -85 -158 -55 236 -336 169 95 -93 142 328
7583 328 227 129 56 41 -84 -4 -48 -170 16 -3 -256 -53 -163 -270 30 85 -135 -293 -45 63 -238 57
7605E7k39RL60m23J06P1l4J09J04L3m91M95J7j21k34M10%j65K38k17j64j04K56
7628G3j07J08j28j17K30j78J07j70L01m4NK3n28O78m19R5L38m31p8J82J71P8j2
7651A77j23r2j14P7J1Ok02K61J20J13j69J26l75K41j97K31J69m37J08n4m2J7m9
7674a97K35k4J20k99J52M6k62K42j08N9J42Rm92K38J11J57j4j44K15j44J43j21
7696F4n0K04j41J7r5L91n29m5N98o24N73l73p6j33L30l31M7M8N1j11K86j87K9
7719e7J3L9K8j40J90l7O8Qm1k26L64j87J9k65M22k71K30j85Q7q7q4k40K18J56
7743B2K9O1j04l72P81m37q6J76p1J79j51l91N38j8k85kN9J84j98J95O8Nl13K03
7767G2j91J10o7l32M68Q8k20LJ41J42l85J87J22m16N32k81j08N1P9J7j83J74L48
$$ plain form
7605 57 -182 -173 187 -236 -130 -59 -93 16 120 153 -338 157 174 53 -181 229 229 64 302 85 -79 -183 73
7628 73 -34 74 -54 -171 59 -119 -12 -182 119 75 80 103 -425 253 -166 -71 267 -164 -242 -60 111 189 177
7651 177 54 -38 -152 -75 -64 -58 -260 1 121 234 65 191 -184 57 -140 91 260 -177 -69 -123 -165 -148 -197
7674 -197 38 14 134 -165 -13 33 -229 13 -95 -36 106 115 -377 -139 -28 129 115 -29 186 42 185 64
7696 64 14 218 77 94 -1 390 -139 -184 414 -210 363 -10 -86 -219 111 -220 -173 -125 -74 -185 101 -86 -57
7719 -57 -44 -5 23 -117 73 36 104 112 71 -155 209 22 41 -224 198 -73 157 -28 59 -28 -112 -352 -134 22
7743 22 51 112 8 -364 417 -20 -106 70 -1 178 27 -364 174 156 -129 -131 -72 112 -86 109 177 182 -131 72
7767 72 -119 -9 -76 -408 60 148 -72 -69 72 214 -171 16 138 -278 254 -27 -135 -84 -5 12 -171 3 351
7790C51m40R0k16L57k19J7K86l00KJ68QJ88j29q6j02R8o0N9J53m16K58k72J74
7813c1N9j38K90k32J51r3r0j19L48nl89K34O8np5pm2P8n5J40o4j16K42j60M39
7838D28l95q1j42K79j69J05l69L19L3L1k07L30J31k93j94J37J0l02J39K37o6q6
7860a25J62K46k76r6J19%J74r9j09k28j2K44K58j37n1k5O5j09q1J47n4Q9J74q4
7884A92l8o5m9j24m1j43N75n49O0J53J26R9j68j9n4p4j15O8J08n8j24L16L05n79
7908a98J00J63N%k95K77L3Q9n26L66j97J14J10j95K07k22K75j07l8J19J1N4j55
7931a0k1M09l22k75P2Q3J52j62M1j44lM5K09l93L54j71J20j61K03j08m1J46j28
7954a05M28k26R6m1j27j16J79l5L0k32j03P8J91j19N69l86o2M16k39k03rr3J05
$$ plain form
7790 351 -89 1 -215 142 -77 -60 226 -74 -72 96 104 292 163 77 -25 73 13 72 225 -191 67 -205 -31
7813 -31 28 -110 180 -52 99 6 -84 -203 145 140 -249 -15 53 48 -27 -34 -76 2 -53 87 23 -93 149 -11 428
7838 428 33 -48 -190 89 -80 25 -344 -25 8 39 -168 162 293 0 -194 -57 -47 -349 -210 27 -39 -125
7860 -125 37 283 7 -89 30 30 204 105 -4 -232 -244 0 258 121 70 45 110 1 -80 67 13 102 276 192
7884 192 154 89 40 -84 -125 -268 307 -242 -182 -29 97 196 28 9 -45 -119 -234 -166 -58 -116 -240 76 381 -198
7908 -198 -98 65 70 70 -225 52 85 174 -352 14 -183 -69 41 -154 53 -169 106 -1 -39 80 91 145 -10
7931 -10 -31 378 56 -219 -147 -64 88 -74 -33 -177 -180 -135 74 -319 35 -136 -16 -177 26 -82 -123 23 -105
7954 -105 323 97 193 152 25 -91 88 53 83 -149 -252 -174 17 -102 467 81 19 435 196 -7 -16 -109 -4
7977dj93K24N8p9R5j06j52J92P1M3j82J81l4j76N7j7N1J37k55J87P0l68N32k53
8001G9j31q4K36l07L95l40j13N24k64J41nj61k3M2K66j60k76K73l02L51j4n13
8023c86O11j14J03l31O6%m40M85j76K48l0J30j89J47j45k28M89j3k23M9p8K2K94
8046B91k70j34J87O0P4m3l15KK89j93kL35n28M31k62l3K62o8R2k58J71K53l09
8069C2O5n57L62o5O5L4J03p4NK64k26K2j78L9r8J72J69ok49m1Q4K0J6J27j56L
8095f8jo8J58Q4l02M41l9k37l3R9R7j33p6J98k05K08k11J20J08j68M9K33m0k60
8119d6J56Q8o9k5K88l48J77l34R6j68J46R4j28rJ2j18K70j22r5J63J21J4k74K09
8143I8k34J18j15J14l74N40k74k9R9%K6o1j1J00j3K92j89P5l11L49k63K52k05
$$ plain form
7977 -4 -197 27 85 6 101 -5 -157 35 106 149 -33 148 114 -62 -5 -22 29 166 -89 98 168 -200 332 79
8001 79 -52 -136 100 -207 188 -152 -265 259 -5 136 131 -30 -53 -11 255 95 -181 92 -210 141 127 -386
8023 -386 225 111 214 -117 -51 -51 -491 -6 -182 66 36 166 -23 124 -21 -249 240 227 4 53 -25 -3 291
8046 291 21 -113 74 134 208 165 -150 -148 141 -52 -54 281 -247 184 -78 -111 151 83 175 -83 88 341 32
8069 32 97 -460 -98 -163 -98 -64 39 -35 -30 234 8 30 -148 -109 -207 -35 134 128 -121 -162 -78 -58 -42 85 -71 -68
8095 -68 -69 -137 21 105 -197 244 205 -32 -65 34 131 -2 -78 120 -85 123 -88 32 140 -28 21 254 214 -46
8119 -46 110 198 129 104 392 44 221 -113 -17 -185 -39 55 -73 -82 -70 -188 82 -40 -135 28 149 163 -111 98
8143 98 -136 -18 -133 -19 -393 147 -127 -156 -57 -57 -31 -92 -103 -3 -16 276 87 162 -149 200 -63 189 -16
8166a6M8R7Q7j21j84Q0j54J62R2j11j17j65J78M4p0J16j50J77n7J64j55K46j36
8189E5Q0l27
$$ plain form
8166 -16 32 129 216 95 -89 -9 -163 -1 91 -20 -137 -302 -124 -80 -150 -34 -184 -7 -64 100 -55 191 55
8189 55 135 -192
8191a92
$$ Imaginary data points
##PAGE= N=2
##DATA TABLE= (X++(I..I)), XYDATA
0@%%%Qj6QqJ6k4L2l8N4o8Q2j02J19j43J74k02K38k78L23l77M29m93N66o45P37
28C92q29R35j057J183j325J481j654J846k047K273k523K792l094L421l786M195
44B203m645N158n732O387p149Q026r070J0330j1879J3850j6436K0010k5277L3808
58A9584m9933R0666l73436p99060O39275N56683r4807J60281N86020j11299o76026
69e2052l44370l5653j40732K22975O46900L22800j80637j28065k03106n49485
79d41425l14210L64672M32642J69226K75485K04103m46125o47924q7424J63988
89c26992o7729J80723O64842L54783l85082n11946k18850j25773l4805K38974
99b31855L47827K67951J94239r2302n41724n02491L5280K83489J45113K20821
$$ plain form
0 0 0 0 0 8 -8 0 -8 8 -16 16 -22 32 -36 46 -56 63 -80 94 -108 130 -148 175 -202 227 -266 300 -345 392
28 392 -437 498 -559 624 -701 780 -874 972 -1075 1198 -1325 1467 -1627 1794 -1992 2203
44 2203 -2442 2716 -3016 3371 -3778 4248 -4822 5508 -6371 7479 -8957 11053 -14224 19584
58 19584 -30349 60317 -313119 -1112179 -472904 83779 -11028 149253 735273 623974 -52052
69 -52052 -396422 -432075 -572807 -349832 297068 619868 439231 311166 108060 -441425
79 -441425 -755635 -390963 41679 210905 486390 690493 244368 -403556 -490980 -326992
89 -326992 -394721 -213998 450844 805627 420545 -91401 -310251 -436024 -470829 -231855
99 -231855 115972 383923 578162 485860 -55864 -558355 -523075 -239586 -94473 126348
109A26348L83403P9772l83509m11626j99743r1136J11106M18894M03629N9803
119D96941j69412k15090k89508k93126m7771K68238L95184K95766M8965k06987
129B83200l07039k59741j71447K959K86527M33557K54131p7770k93558l13691
139a62872j92362l2213Q8934K18290L53315K65943j00476l73905l11216j40793
149c87355k5770J68903L57194K74241K6459j13475k21852l54455k38141J32978
159c81273L30254K39847J52994P7350j62160l58822k63605n0615J05085K73937
169c7008L45300J28008j44945j90983j93366k68217j19847K47170L71820J88071
179C26003M7503m9889k68577l48887j06357J17331J40669K21063L07923P2546
$$ plain form
109 126348 509751 589523 206014 -205612 -405355 -496491 -385385 33509 437138 496941
119 496941 327529 112439 -177069 -470195 -517966 -249728 145456 441222 490187 283200
129 283200 -23839 -283580 -455027 -452068 -165541 268016 522147 444377 150819 -162872
139 -162872 -355234 -387447 -298513 -80223 273092 539035 438559 64654 -246562 -387355
149 -387355 -413125 -244222 112972 387213 413672 300197 78345 -276110 -514251 -381273
159 -381273 -51019 188828 341822 419172 257012 -101810 -365415 -416030 -310945 -37008
169 -37008 308292 436300 291355 100372 -92994 -361211 -481058 -233888 137932 326003
179 326003 373506 323617 55040 -293847 -400204 -282873 -142204 78859 386782 459328
189D59328k78484k98840j35447r5200Q400K76482L37942R8338p7226j31312k67473
200a03492k98566q409K61062K23984J39895J46905j6010k96953l11060q7371N2265
211b97750J33683K70821K53146P8j87922j92566j95821j62555O3298K85600K50607
222B20619R3933p679j38050k79007k23000j019J47184J93350K23063J41704q8347
233B82751k50543k19150j18628j0182J50488K68582K01469J9765j24253k08806
243h507k23502j07790Q2788K00611K07744J45758J4180j56242k43810j85532m3144
254c17446J10080K17959K15730R2975o7714j80976k15203j49938J237J51671K16425
265G4800J79814N8854j02911k14115k02922r6046M6526J75791K22336J40100r476
$$ plain form
189 459328 180844 -117996 -253443 -348643 -340243 -63761 274181 372519 295293 163981 -103492
200 -103492 -402058 -410467 -149405 74579 214474 361379 345369 48416 -262644 -350015 -297750
211 -297750 -164067 106754 359900 359978 172056 -20510 -216331 -378886 -315588 -29988 220619
222 220619 314552 306873 168823 -110184 -333184 -334203 -187019 6331 229394 371098 282751
233 282751 32208 -186942 -305570 -315752 -165264 103318 304787 324552 200299 -8507
243 -8507 -232009 -339799 -257011 -56400 151344 297102 311282 155040 -88770 -274302 -317446
254 -317446 -207366 10593 226323 319298 251584 70608 -144595 -294533 -293296 -141625 74800
265 74800 254614 313468 210557 -3558 -206480 -302526 -256000 -80209 142127 282227 272751
276B72751j31570j95054j85923o7450J05413K02494J83566R8577k7644j69865
286H5295k23555j33451J1357J21014J87052J82666O4868r9020j86268j77285j08194
297b75521K3138J68636K11531J25167K200j04509j87475j84860o1098R3921J70879
308a7991J71042J11612k0321j61879j99278j21480r081R8735J82300J74282N7367
319B65308q0292j58127j71150j13331J9261J52767J87850J24745J9435r5538j80960
330c0032j68910n5434P3576J49912J64828J09118j5441j38172j78255j25255k4783
341b38848R1190J71296J60828N9210o2590j45673j65938j06398J7093J32306J68067
352H0543J21860K7664q3158j63605j57566o2545N7506J39309J59317J05127r694
$$ plain form
276 272751 141181 -53873 -239796 -307246 -201833 661 184227 282804 255160 85295
286 85295 -138260 -271711 -260354 -139340 47712 230378 295246 196226 9958 -167327 -275521
297 -275521 -252383 -83747 127784 252951 255151 150642 -36833 -221693 -282791 -188870 -17991
308 -17991 153051 264663 244342 82463 -116815 -238295 -247376 -148641 33659 207941 265308
319 265308 185016 26889 -144261 -257592 -238331 -85564 102286 227031 246466 150928 -30032
330 -30032 -198942 -254376 -180800 -30888 133940 243058 227617 89445 -88810 -214065 -238848
341 -238848 -147658 23638 184466 243676 181086 35413 -130525 -236923 -219830 -87524 80543
352 80543 202403 230067 146909 -16696 -174262 -236807 -179301 -39992 119325 224452 214758
363B14758j22700j64444j20569k7453P8181J52943J50455O4912m9242j32679j54682
374a10520j03278N623J14622J58258J21837L1299p6594j51865j45366n9798M6850
385a68932J21714J45184J03707K050j06919j54087j19086l2920O7891J42197J43721
396A44520O5785m2347j20433j42378r7865o86R9792J44469J15485L5338o3269
407A38411j34755j37694o6563L4072J14877J41389R8310J650r4936j39943j13586
418a58768l5764N8573J28541J32647O7032l0629j09658j33814r3538o141Q4346
429i7173J32458J15556L9566n7144j24876j27367o5732K6086J05138J30882R1649
440A69043P431q0019j27895j11651l8911N1841J15103J23578P1422k1024j03348
$$ plain form
363 214758 92058 -72386 -192955 -220408 -142227 10716 161171 226083 176841 44162 -110520
374 -110520 -213798 -208175 -93553 64705 186542 217841 141247 -10618 -155984 -215782 -168932
385 -168932 -47218 97966 201673 203723 96804 -57283 -176369 -209289 -141398 799 144520
396 144520 210305 167958 47525 -94853 -192718 -193404 -93612 50857 166342 201680 138411
407 138411 3656 -134038 -200601 -166529 -51652 89737 188047 189697 94761 -45182 -158768
418 -158768 -194532 -135959 -7418 125229 192261 161632 51974 -81840 -175378 -181519 -97173
429 -97173 35285 150841 190407 133263 8387 -118980 -184712 -158626 -53488 77394 169043
440 169043 176474 96455 -31440 -143091 -182002 -130161 -15058 108520 179942 158918 55570
451E5570j28136q8018r333P3457J24134J09040L5788m8506j04596j17804p4573
462a72977J7096J00147J21233Q5069J7180o7795j26437j08815l0211M5783R5225
473b4502J16741P7435j9257r8011j09119p9918k8060N8760J28732J08586K7633
484A59020m1471q9206j16429p5843K2056R0548R7949Q4112L5223o4224j30358
495b8623r3059k1405K4173P9254J25225P9306l0490q5992q6030q5620m2598O4557
507a01302J28107Q5896K4025j5588p9448j26656p1381L0044P3786Q4146R1923
518A23552L5988o9951j09035p2851m3567Q96R5707J35822N2287l7973n6380p5081
530b0586r9106l7792P0930J01406P0291M8886k996r6331j20549m6739J8042M5959
$$ plain form
451 55570 -72566 -160584 -169917 -96460 27674 136714 172502 123996 19400 -98404 -172977
462 -172977 -155881 -55734 65499 150568 167748 99953 -26484 -135299 -165510 -119727 -24502
473 -24502 92239 169674 150417 52406 -56713 -136631 -164691 -105931 22801 131387 159020
484 159020 117549 28343 -88086 -163929 -141873 -51325 46624 130736 165959 101735 -28623
495 -28623 -121682 -143087 -118914 -39660 85565 164871 134381 48389 -37641 -123261 -165859 -101302
507 -101302 26805 112701 136726 121138 41690 -84966 -156347 -126303 -52517 31629 123552
518 123552 159540 89589 -19446 -92297 -135864 -134968 -39261 96561 148848 110875 54495 -20586
530 -20586 -119692 -157484 -86554 14852 85143 134029 131033 34702 -85847 -132586 -114544 -68585
542f8585R0031J03884K2632o9944q5090p0459n7866R644R8572J02925M0239M04
554A16387l7141j00816j05708j4685O7281P8980P1653N3583j2209q5532r3362
565f1569n4234q637N2265J02809Q2564R517m2977o8130q4848n8463J7199Q1531
577c2973Q9285O0082N879n9429r2197o8949j9156K9580P3915Q9019N0655j6793
589A08918o9765r0425o5098o98N9172P8510O7310L4074k9148q5228q5537l7618
601a15533J5873O0968Q3046N9649O008m1954p6693q4658l5671M6007Q2685O5228
613F4955L8535J771o0917r0723n4761l238L2795P7107R0545K6143n0162o3842
625H208n7117n7619q155P6163R0006L9285Q279k2798q3741r1699r339M8051L9791
$$ plain form
542 -68585 21446 125330 147962 78018 -7072 -77531 -135397 -125753 -27181 75744 115983 116387
554 116387 79246 -21570 -127278 -141963 -74682 4298 75951 129534 117325 31793 -61569
565 -61569 -115803 -124440 -72175 30634 113198 122715 79738 11608 -73240 -131703 -114504 -32973
577 -32973 56312 116394 122273 62844 -29353 -98302 -117458 -87878 -13963 75056 125711 108918
589 108918 39153 -51272 -116370 -117068 -57896 20614 87924 121998 92850 7622 -77915 -115533
601 -115533 -99660 -38692 44354 104003 110011 68057 -8636 -93294 -128965 -82958 -273 64955
613 64955 103490 105261 44344 -46379 -101140 -104378 -71583 5524 96069 122212 72050 8208
625 8208 -48909 -106528 -114683 -38520 51486 90771 99050 76252 -7489 -99188 -108527 -60476 -20685
638b0685N4817P8356P291q9561q2866k6454j4529J2770Q4476Q8796J1010l5100
650F8321m0875p2073p1139J4258P7750N6097L6122L7357k1986r6992p3722n424
662i2306J7430M1384Q7497O0864l0490o1547l8827n1143m5537L7493R3106N3851
674G1775J1707Q28m8821r4377m5631K9293L8284M2832P3999L6960n8114p9040
686b0305l3616k4151j4969N6405R6752L7603k3631l0733n2099p4587k2388N3369
698e2350O1007M0080L8541L138o6843p7622k7456N412K5514O4889O6917R019l7106
711E3140m5319n5492m8531J2521O6887N8228L1606J3191l2806p6033n4970n12
723g8090K0883L9985P0814M6359k8963n8722m0391l8724k6948L8729Q4126M6245
$$ plain form
638 -20685 34132 112488 119779 30218 -52648 -79102 -93631 -80861 3615 92411 103421 68321
650 68321 27446 -44627 -115766 -101508 -23758 32339 68461 105818 83832 -13160 -86882 -92306
662 -92306 -74876 -33492 54005 114869 84379 22832 -15995 -67138 -112675 -75182 17924 71775
674 71775 83482 84310 35489 -58888 -104519 -75226 -36942 5890 79889 116849 58735 -20305
686 -20305 -53921 -78072 -93041 -36636 60116 97719 74088 43355 -8744 -83331 -105719 -52350
698 -52350 8657 48737 87278 90416 23573 -54049 -81505 -76093 -50579 14310 81227 90246 53140
711 53140 7821 -47671 -96202 -83681 -16794 41434 73040 86231 53425 -22608 -77578 -78090
723 -78090 -57207 -17222 53592 99951 70988 12266 -28125 -66849 -93797 -55068 29058 75303
735G5303l587j5869l8784o8403l9076K3076M6744M3345M8577K0126m4379p0629
747b3556l9447j0257R964M8911O7555L0394j9233l8585m8731m9127j1507L9489
759d4130N7710M4173K1089j5610n3711n7848k8136P231L9361N9508M2686j79l1751
772D0393m3675m9670k9658K1170N6560M9365K3534j752l4137n5903m3009o389
784g3171K7288N0447N1039K0734k0468m4815m7582l4631R01M1448N2825L7104
796F1119J1749k4079n5701n1171j2205J9693L5763M7755L7343m772l9709m3766
808a7981l6384j8735K3161N7037M4391J2805q258l3927n8928l8185J4781L9304
820b0919L4897L6246K2328k4251n5119l8904j5114J796L5617O0939L3294j4042
$$ plain form
735 75303 71716 55847 17063 -51340 -90416 -67340 -20596 22749 71326 91452 47073 -23556
747 -23556 -63003 -73260 -63296 -14385 53170 83564 64331 25746 -22985 -72112 -83619 -44130
759 -44130 13580 57753 78842 63232 9521 -48327 -76463 -69232 -29871 29637 72323 72144 40393
772 40393 -3282 -52952 -82610 -61440 -4880 44485 68019 66267 32130 -23773 -66782 -73171
784 -73171 -45883 4564 55603 76337 55869 11054 -36528 -71159 -70258 -28810 24015 61119
796 61119 72868 48789 -6912 -58083 -70288 -50595 -14832 32923 70266 65494 25785 -17981
808 -17981 -54365 -73100 -49939 7098 51489 64294 56036 22109 -36819 -75004 -60223 -20919
820 -20919 13978 50224 72552 48301 -6818 -45722 -60836 -59040 -23423 37516 70810 56768
832E6768l0899l6295m3396j8140L0545M7949L1718K0937J599m0204n7382k5803
844f2603Q526K1803M0364M9315J2641l3523m0647k9258k5988r36M3495N0482K0032
857E3703l95j4747m4524n1562r913L0099L5855L4644L1142n099m7925m4833j6507
870e0062j201J5636M4242M3273O264k1151k8237l8666l4356P182M4180L9521K1185
883D7810R193j8898m9775m1114k483K0135K7004L6878L0730o616l6677l7221k6230
896d7264j0758K1324M7954L7331N504j6248k9790l9157k5237Q314L0670L4260
908A6903K8833J1566k2258m4402l4102q475J0973L0252M1886K6129q738l3574
920A4993l5308k4157n791J9138L5478L1938J5301q564l1609m0445k5462N855K9303
$$ plain form
832 56768 25869 -10426 -53822 -71962 -41417 6532 38250 59187 60786 20582 -36800 -62603
844 -62603 -54077 -32274 8090 57405 70046 36523 -4124 -33382 -59370 -60306 -16811 33671 53703
857 53703 53308 38561 -5963 -57525 -67438 -37339 -1484 33160 64302 59203 11278 -33555 -50062
870 -50062 -51263 -35627 8615 51888 58152 37001 8764 -29902 -64258 -57076 -12896 26625 47810
883 47810 57003 38105 -11670 -52784 -55267 -35132 -8128 28750 59480 52864 16187 -21034 -47264
896 -47264 -58022 -36698 11256 48587 54091 37843 8053 -31104 -56341 -48027 -17357 16903
908 16903 45736 57302 35044 -9358 -43460 -51935 -40962 -10710 31176 57305 48567 14993
920 14993 -20315 -44472 -50263 -31125 4353 36291 51592 43028 11419 -29026 -54488 -48633 -19330
933a9330L7363K8086N495k1133l6831l1351j1700J0764K9316L5437K2599l156
945D5559k5142l3406k8410j0223J6863L8034L6343J1596j4799k9425l0968k1007
957d4985N42K2514L4047K9404Q458j7583l5077l2161j3195R785K7540L4170K3119
970D6578j818k4608l3273k6130p082J5825L1457L0090J4162o264k5451l4542k4759
983d5815N89K4589L3617K5581O075j4823k9251k9735j5869O513K6441L3352K1335
996D2599j115k0329k9694k6650r825J3391K9817L1269J5979q094k6940l0933j9224
1009c9749r3J7950K9091K6552J0213j2712k8605l0178j5625O597K4740K9262K0670
1022C8113K643j8032l0603k6208p964J2953K6627K7810J5076n103k2130k8114
$$ plain form
933 -19330 18033 46119 51614 30481 -6350 -37701 -49401 -38637 -9321 26116 48715 45559
945 45559 20417 -12989 -41399 -51622 -34759 3275 39618 51214 36415 6990 -23978 -44985
957 -44985 -44443 -21929 12118 41522 49980 32397 -2680 -34841 -48036 -38251 -10711 23459 46578
970 46578 44760 20152 -13121 -39251 -46333 -30508 949 31039 45201 38937 13486 -21056 -45815
983 -45815 -45226 -20637 12980 38561 44636 29813 562 -29173 -45042 -38529 -12088 21264 42599
996 42599 41484 21155 -8539 -35189 -45014 -31623 -1806 29463 45442 37348 10408 -20525 -39749
1009 -39749 -39842 -21892 7199 33751 43964 31252 2647 -27531 -43156 -36559 -11819 17443 38113
1022 38113 40756 22724 -7879 -34087 -42051 -29098 -2471 25339 40415 35312 13182 -14932
1034a4932k1901m379J8005L0653K5111P461j0999k5315k7354j6171M208K2241
1046a3372K8246K0928L044j7634k7011k2940r800P843K4372K9280J7267n139k1791
1059A3293k7562k0298l073J6599K6073K2125J0038p495k3152k8091j6309L580
1071c4272J9985K6836K1625L406j6391k5257k2345j0416P611K3735K5759J4460
1083C4736k298j6360k6293k2725m642J5875K5245K2790R943q412k2415k3650j4473
1096c2679l7J5946K7035K1507L646j3936k2804k2952j2065P799K2959K3255J4112
1109C1786J11j5749k5871k0128m076J2345K1815K3460J1056q226k0246k1727j4937
1122c0387j728J6017K5101J8725M751r372k1919k5302j1421R847K0307K0147J4187
$$ plain form
1034 -14932 -36833 -41212 -23207 7446 32557 40018 29019 3704 -23650 -39821 -35613 -13372
1046 -13372 14874 35802 38846 21212 -5799 -28739 -38539 -30696 -6324 22956 40223 35084 13293
1059 13293 -14269 -34567 -37640 -21041 5032 27157 37195 29700 6548 -21543 -37852 -34272
1071 -34272 -14287 12549 34174 37580 21189 -4068 -26413 -36829 -29218 -5483 20276 34736
1083 34736 32438 16078 -10215 -32940 -37582 -21707 3538 26328 36271 27859 5444 -18206 -32679
1096 -32679 -32716 -16770 10265 31772 35418 21482 -1322 -24274 -36339 -28540 -5581 17674 31786
1109 31786 31897 16148 -9723 -29851 -33927 -21582 233 23693 34749 26523 6277 -15450 -30387
1122 -30387 -32115 -16098 9003 27728 32479 23107 1188 -24114 -35535 -25688 -5381 14766 28953
1135B8953J259j4988k2435j8139o596Q110K2288K4071J0657p203j7971k2029j6519
1148c0542m8J6767K1394J5627O314o100k0867k2934j1225M964J7001K2780J7509
1161C0640m74j6558k0709j6143o449Q545J9454J9808R761j133j5117k3771j7958
1174c0104Q35J5288J9109J6635Q458p478k1427k0117q853L251J4288K0548J6146
1187B6579K133j2822j9515j8823p051Q430J8929J8767J0490j379j5062k2255j4743
1200b6322k71J1869J7752J7276Q358p624j9394j7429r070J026J1627K0361J7873
1213B6032K193j2853j9269j6626p101P154J7824J8227R705j899j3015j8995j4518
1226b3141j848R225J5979J8495J0709p503k0465j7217p533M59J1506K0069J4758
$$ plain form
1135 28953 30212 15224 -7211 -25350 -31946 -23836 -1548 22523 33180 25977 8006 -14023 -30542
1148 -30542 -30590 -13823 7571 23198 29512 23412 2545 -20389 -31614 -26650 -9649 13131 30640
1161 30640 30166 13608 -7101 -23244 -29693 -21148 -1694 18114 27875 26742 11625 -12146 -30104
1174 -30104 -29269 -13981 5128 21763 30221 22743 1316 -18801 -27654 -24403 -10115 10433 26579
1187 26579 28712 15890 -3625 -22448 -29499 -21069 -2140 16627 27117 25738 10676 -11579 -26322
1200 -26322 -26593 -14724 3028 20304 28662 21038 1644 -15785 -24855 -23829 -12202 8159 26032
1213 26032 28225 15372 -3897 -20523 -27624 -20470 -2646 15581 25286 23387 10372 -8623 -23141
1226 -23141 -24989 -15764 215 18710 29419 21916 1451 -15766 -23299 -22840 -11334 8735 23493
1239B3493M2r896j3004j6225j1636M946J8687J7557R526Q53j2349k1786j3568
1252b3360J120Q354J2898J7424J0532p627j6987j2596j0143n139J1476K3287J4494
1265B3733j930q229j2043j7790j0145P462J5956J3399R858L529j1201j9992j2609
1278b0002j441N177J4121J9058Q451p484j3562j3130j2675k449J2691J8866J0761
1291A8382K297l739j4808j8851p479P049J2375J3144J1932K531j2013j6732j1541
1304a7453m412N070J6231J6504N677m775j0196j4324j2942j357J1504J4945J2009
1317A6481N275n178j5266j6028o967L953J1570J4724J1050R17r806j4489j2069
1330a5833n151N924J2672J4335R204k383j2476j4915j0030n34P800J4075J3069
$$ plain form
1239 23493 23535 13639 635 -15590 -27226 -22280 -3593 13964 23490 24343 11994 -9792 -23360
1252 -23360 -22240 -13886 -988 16436 26968 19341 2354 -10242 -20385 -25524 -14048 9239 23733
1265 23733 21803 13574 1531 -16259 -26404 -18942 -2986 10413 20271 23800 12599 -7393 -20002
1278 -20002 -21443 -16266 -2145 16913 25364 17880 4318 -8812 -21487 -23936 -11245 7621 18382
1291 18382 20679 16940 2132 -16719 -24198 -17149 -4774 8370 20302 22833 10820 -5912 -17453
1304 -17453 -21865 -16795 -564 15940 21617 16842 6646 -7678 -20620 -21977 -10473 4472 16481
1317 16481 21756 16578 1312 -14716 -21683 -17730 -6160 8564 19614 20531 10725 -3764 -15833
1330 -15833 -20984 -15060 -2388 11947 21151 18768 6292 -8623 -18653 -19187 -11387 2688 15757
1343A5757M302n256j1767j4448r266K642J2139J3437R361L011p355j5816j2625
1356a5884l165M427J1107J4765R345l091j1450j2523j0001l401Q186J4955J1013
1369A4283L669l250j0872j4740q358L022Q818J1927J2113L572r134j4638r188
1382a2776m097J614J1353J4618P179k393p324j1435j3859l543J0103J3775R092
1395A2307N733k231j2916j5023m747L366O008J0472J2388L128p936j1735r224
1408a0410p094J160J1967J4771O745k017p389j1913j1144k187P548J0819R614
1421A0470O093j373j0721j3231p484M37P575J1873J1179K587p064j1611r533n056
1435a5859J813R921J2128P505j030o740j0488j0250m646N883J2804R574M685j202
$$ plain form
1343 15757 20059 14803 3036 -11412 -20678 -18036 -5897 7540 16901 19912 12557 -3259 -15884
1356 -15884 -19049 -14622 -3515 11250 20595 17504 6054 -6469 -16470 -19871 -11685 3270 14283
1369 14283 17952 14702 3830 -10910 -19268 -16246 -7428 4499 16612 20184 11050 -3588 -12776
1382 -12776 -16873 -15259 -3906 10712 17891 15498 8174 -3261 -17120 -20663 -10560 3215 12307
1395 12307 18040 15809 2893 -12130 -16877 -13511 -7503 2969 15357 18485 10549 -1186 -10410
1408 -10410 -17504 -16344 -4377 10394 17139 15122 7733 -4180 -15324 -17511 -9963 856 10470
1421 10470 16563 15190 4469 -8762 -16246 -15809 -8234 3639 14818 17405 10341 -1270 -10803 -15859
1435 -15859 -14046 -4125 8003 15508 14478 7738 -2750 -13000 -17646 -11763 1041 10615 15300 14098
1449A4098r209j3199p404K127O813Q416J0091N763n785j2171r209m761k40Q537
1463f133J4180Q295k835o962q426j0252m979P491J0817O846M359J823p540j4427
1477g743o981J961M462Q245J2524N701q202j1222o325n219k093Q958J4112N918
1491A4096k600l491p353j2596n051P643R908O149O235K220r759j3417m454J379
1505a1091K208P787J3026M480p207q683o319p217j941R921J2251M838o59k256
1519I138q440j2356l328O865O940N751Q222J812r602j1439m183j198J458R827
1533e33J3280K475p424o802n853p622j641R698J0456L517J312q79r238j1714k820
1548a3788N196N847P328Q876P39j0285r621l182j862N69R903J1248J734n124m142
$$ plain form
1449 14098 4889 -8310 -15714 -13587 -6774 1642 11733 17496 11711 -460 -9669 -14430 -14670 -6133
1463 -6133 8047 16342 13507 6545 -1881 -12133 -17112 -9621 1196 8042 12401 14224 6684 -7743
1477 -7743 -14724 -12763 -8301 -56 12468 18169 9967 -1255 -7580 -12799 -14892 -5934 8178 14096
1491 14096 11496 8005 652 -11944 -16995 -9352 556 6705 12940 15160 5401 -8016 -12470 -11091
1505 -11091 -8883 -1096 11930 16410 9203 520 -5799 -13016 -14957 -5036 7215 12053 11394 9138
1519 9138 698 -11658 -14986 -8121 -1181 4570 12792 14604 5002 -6437 -10620 -11818 -10360 -533
1533 -533 12747 15222 7798 996 -4857 -12479 -14120 -4422 6034 9551 10863 9984 746 -10968 -13788
1548 -13788 -8592 -2745 4583 13459 14198 3913 -5708 -8890 -10752 -10183 -280 10968 12702 7578 3436
1563C436p448r514n98J0479R182K804K775j049j0174j0717o26L994L313P623R819
1578A3299l43r268p696l977l777J179J0869J0698K3l869k780p968r228O06R111
1593c121O399L535M823q78j0838r537p74K292L140Q613R736j702q807n703m230
1608g052m753K033J0944P612L42j323k056r201r346J499P934N097M820N584k407
$$ plain form
1563 3436 -4012 -13526 -14124 -3645 5537 8341 11116 10067 -107 -10824 -11450 -7456 -4143 3480 13299
1578 13299 12956 3688 -4008 -7985 -11762 -10583 286 10984 11007 7138 4358 -3610 -12838 -12232 -3121
1593 -3121 3278 6813 11636 10758 -80 -9617 -10391 -8099 -4959 3654 13390 11688 2881 -2822 -7052
1608 -7052 -11805 -9772 1172 8784 9126 7803 5747 -3454 -12800 -11301 -3367 1730 6550 12134 9727
$$ [...]
8191A31
##END NTUPLES=NMR FID
##END=
