##TITLE=1H_SR19_rm3
 D2O, 8 sc, 
 20.10.2020
##JCAMPDX= 6.0         $$ Bruker NMR JCAMP-DX V2.0
##DATA TYPE= NMR FID
##DATA CLASS= NTUPLES
##ORIGIN= UXNMR, Bruker Analytische Messtechnik GmbH
##OWNER= root
$$ XWIN-NMR		Version 3.5
$$ Tue Oct 20 11:38:33 2020 Russian Standard Time (UT+4h)  she@DPX200
##.OBSERVE FREQUENCY= 200.1315066352
##.OBSERVE NUCLEUS= ^1H
##.DELAY= (6, 6)
##.ACQUISITION MODE= SIMULTANEOUS
##.ACQUISITION SCHEME= undefined
##.AVERAGES= 8
##.DIGITISER RES= 18
##SPECTROMETER/DATA SYSTEM= spect
##.PULSE SEQUENCE= zg30
##.SOLVENT NAME= CDCl3
##.SHIFT REFERENCE= (INTERNAL, CDCl3, 0, 15.7039)
##AUDIT TRAIL= $$ (NUMBER, WHEN, WHO, WHERE, WHAT)
$$ ##TITLE= Audit trail, XWIN-NMR		Version 3.5
$$ ##JCAMPDX= 5.01
$$ ##ORIGIN= Bruker BioSpin GmbH
$$ ##OWNER= she
$$ F:/spectra/data/she/nmr/H-F/1/audita.txt
$$ ##AUDIT TRAIL=  $$ (NUMBER, WHEN, WHO, WHERE, WHAT)
(   1,<2020-10-20 11:37:26.29 +0400>,<she>,<DPX200>,
      <created by zg, POWCHK disabled, PULCHK disabled
       configuration hash MD5:
       00 E9 B6 7A A2 85 ED C7 34 08 36 98 17 FE 4E 26
       data hash MD5: 16K
       A8 76 A3 83 14 08 7D 84 18 EC 86 DB C4 2B 6C 03>)
$$ ##END=
$$ 
$$ hash MD5
$$ 47 BC 07 20 3A 6D 9B 95 34 A7 42 89 A0 7E E8 24
##$RELAX= 
##$RELAX= 
##$RELAX= 
##$RELAX= 
##$RELAX= 
##$RELAX= 
$$ Bruker specific parameters
$$ --------------------------
##$DU= <F:/spectra>
##$EXPNO= 1
##$NAME= <H-F>
##$PROCNO= 1
##$TYPE= <nmr>
##$USER= <she>
##$AMP= (0..31)
100 100 100 100 100 100 100 100 100 100 100 100 100 100 100 100 100 100 
100 100 100 100 100 100 100 100 100 100 100 100 100 100 
##$AQSEQ= 0
##$AQ_mod= 1
##$AUNM= <au_zg>
##$AUTOPOS= <>
##$BF1= 200.13
##$BF2= 200.13
##$BF3= 200.13
##$BF4= 200.13
##$BF5= 200.13
##$BF6= 200.13
##$BF7= 200.13
##$BF8= 200.13
##$BYTORDA= 1
##$CFDGTYP= 0
##$CFRGTYP= 5
##$CHEMSTR= <none>
##$CNST= (0..31)
1 1 145 1 1 1 1 1 1 1 1 1 1 1 1 1 1 1 1 1 1 1 1 1 1 1 1 1 1 1 1 1 
##$CPDPRG= <>
##$CPDPRG1= <>
##$CPDPRG2= <>
##$CPDPRG3= <>
##$CPDPRG4= <mlev>
##$CPDPRG5= <mlev>
##$CPDPRG6= <mlev>
##$CPDPRG7= <mlev>
##$CPDPRG8= <mlev>
##$CPDPRGB= <>
##$CPDPRGT= <>
##$D= (0..31)
0 1.2 0 0 0 0 0 0 0 0.06 0 0.03 0 0 0 0 0.0002 0 0 0 0 0 0 0 0 0 0 0 0 
0 0 0 
##$DATE= 1603179445
##$DBL= (0..7)
120 120 120 120 120 120 120 120 
##$DBP= (0..7)
150 150 150 150 150 150 150 150 
##$DBP07= 0
##$DBPNAM0= <>
##$DBPNAM1= <>
##$DBPNAM2= <>
##$DBPNAM3= <>
##$DBPNAM4= <>
##$DBPNAM5= <>
##$DBPNAM6= <>
##$DBPNAM7= <>
##$DBPOAL= (0..7)
0.5 0.5 0.5 0.5 0.5 0.5 0.5 0.5 
##$DBPOFFS= (0..7)
0 0 0 0 0 0 0 0 
##$DE= 6
##$DECBNUC= <off>
##$DECIM= 32
##$DECNUC= <off>
##$DECSTAT= 4
##$DIGMOD= 1
##$DIGTYP= 9
##$DL= (0..7)
0 120 120 120 120 120 120 120 
##$DP= (0..7)
150 150 150 150 150 150 150 150 
##$DP07= 0
##$DPNAME0= <>
##$DPNAME1= <>
##$DPNAME2= <>
##$DPNAME3= <>
##$DPNAME4= <>
##$DPNAME5= <>
##$DPNAME6= <>
##$DPNAME7= <>
##$DPOAL= (0..7)
0.5 0.5 0.5 0.5 0.5 0.5 0.5 0.5 
##$DPOFFS= (0..7)
0 0 0 0 0 0 0 0 
##$DQDMODE= 0
##$DR= 18
##$DS= 0
##$DSLIST= <SSSSSSSSSSSSSSS>
$$ [...]
##$SUBNAM2= <"">
##$SUBNAM3= <"">
##$SUBNAM4= <"">
##$SUBNAM5= <"">
##$SUBNAM6= <"">
##$SUBNAM7= <"">
##$SUBNAM8= <"">
##$SUBNAM9= <"">
##$SW= 16.880792210976
##$SWIBOX= (0..15)
0 0 2 0 0 0 0 0 0 0 0 0 0 0 0 0 
##$SW_h= 3378.37837837838
##$TD= 16384
##$TD0= 1
##$TE= 0
##$TE2= 300
##$TE3= 300
##$TEG= 300
##$TL= (0..7)
0 120 120 120 120 120 120 120 
##$TP= (0..7)
150 150 150 150 150 150 150 150 
##$TP07= 0
##$TPNAME0= <>
##$TPNAME1= <>
##$TPNAME2= <>
##$TPNAME3= <>
##$TPNAME4= <>
##$TPNAME5= <>
##$TPNAME6= <>
##$TPNAME7= <>
##$TPOAL= (0..7)
0.5 0.5 0.5 0.5 0.5 0.5 0.5 0.5 
##$TPOFFS= (0..7)
0 0 0 0 0 0 0 0 
##$TUNHIN= 0
##$TUNHOUT= 0
##$TUNXOUT= 0
##$USERA1= <user>
##$USERA2= <user>
##$USERA3= <user>
##$USERA4= <user>
##$USERA5= <user>
##$V9= 5
##$VALIST= <valist>
##$VCLIST= <CCCCCCCCCCCCCCC>
##$VD= 0
##$VDLIST= <DDDDDDDDDDDDDDD>
##$VPLIST= <PPPPPPPPPPPPPPP>
##$VTLIST= <TTTTTTTTTTTTTTT>
##$WBST= 1024
##$WBSW= 4
##$XGAIN= (0..3)
0 0 0 0 
##$XL= 0
##$YL= 0
##$YMAX_a= 18350
##$YMIN_a= -18212
##$ZGOPTNS= <>
##$ZL1= 120
##$ZL2= 120
##$ZL3= 120
##$ZL4= 120
##$ABSF1= 10
##$ABSF2= 0
##$ABSG= 5
##$ABSL= 3
##$ALPHA= 0
##$AQORDER= 0
##$ASSFAC= 0
##$ASSFACI= 0
##$ASSFACX= 0
##$ASSWID= 0
##$AUNMP= <proc_1d>
##$AZFE= 0.1
##$AZFW= 0.1
##$BCFW= 1
##$BC_mod= 2
##$BYTORDP= 1
##$COROFFS= 0
##$CY= 11.3945322036743
##$DATMOD= 1
##$DC= 2
##$DFILT= <>
##$DTYPP= 0
##$F1P= 16.9975609425685
##$F2P= -3.02152046262296
##$FCOR= 0.5
##$FTSIZE= 0
##$FT_mod= 4
##$GAMMA= 1
##$GB= 0.15
##$INTBC= 1
##$INTSCL= 1
##$ISEN= 128
##$LB= 0.24
##$LEV0= 0
##$LPBIN= 0
##$MAXI= 10000
##$MC2= 0
##$MEAN= 0
##$ME_mod= 0
##$MI= 1.114404
##$NCOEF= 0
##$NC_proc= 0
##$NLEV= 6
##$NOISF1= 3.799351
##$NOISF2= 2.8
##$NSP= 1
##$NTH_PI= 0
##$NZP= 0
##$OFFSET= 15.70392
##$PC= 1
##$PHC0= -10596.89
##$PHC1= 2.200892
##$PH_mod= 1
##$PKNL= yes
##$PPARMOD= 0
##$PSCAL= 0
##$PSIGN= 0
##$REVERSE= no
##$SF= 200.130013532006
##$SI= 16384
##$SIGF1= 3
##$SIGF2= 2
##$SINO= 400
##$SIOLD= 16384
##$SREGLST= <1H.CDCl3>
##$SSB= 0
##$STSI= 0
##$STSR= 0
##$SW_p= 3612.71676300578
##$SYMM= 0
##$S_DEV= 0
##$TDeff= 0
##$TDoff= 0
##$TI= <>
##$TILT= no
##$TM1= 0
##$TM2= 0
##$TOPLEV= 0
##$USERP1= <user>
##$USERP2= <user>
##$USERP3= <user>
##$USERP4= <user>
##$USERP5= <user>
##$WDW= 1
##$XDIM= 8192
##$YMAX_p= 0
##$YMIN_p= 0
$$ End of Bruker specific parameters
$$ ---------------------------------
##NTUPLES= NMR FID
##VAR_NAME=  TIME,          FID/REAL,        FID/IMAG
##SYMBOL=    X,             R,               I
##VAR_TYPE=  INDEPENDENT,   DEPENDENT,       DEPENDENT
##VAR_FORM=  AFFN,          ASDF,            ASDF
##VAR_DIM=   8192,          8192,            8192
##UNITS=     SECONDS,       ARBITRARY UNITS, ARBITRARY UNITS
##FACTOR=    0.000296,      1,               1
##FIRST=     0,             0,               0
##LAST=      2.424536,      0,               0
##MIN=       0,             -18212,          0
##MAX=       2.424536,      18350,           0
$$ Real data points
##PAGE= N=1
##DATA TABLE= (X++(R..R)), XYDATA
$$ plain form
0 0 0 0 0 0 0 0 0 0 0 0 0 0 0 0 0 0 0 0 0 0 0 -8 8 -8 8 -8 8 -8 16 -16 16 -23 24 -24 32 -32 40 -40 48 -50 56 -64
42 -64 72 -80 88 -96 104 -116 128 -143 155 -171 189 -207 231 -255 282 -314 353 -396 450 -515 598
63 598 -705 852 -1064 1398 -2009 3481 -14559 -11850 10315 1340 17097 -5668 -10561 -4113 -5403
78 -5403 13443 8924 -3583 -5635 -10657 1970 6395 8484 2852 -9873 -8462 -1292 8540 8862 950
93 950 -6516 -12613 928 9325 8467 1103 -11963 -5294 846 5661 9329 -2180 -4840 -7990 -1818
108 -1818 9673 4058 2561 -6542 -8606 2116 2161 9609 2451 -9209 -4731 -3942 8282 8736 -2591
123 -2591 -3277 -9237 -498 8649 4041 1773 -6805 -5865 707 3358 7235 799 -5072 -6319 -1528 6551
139 6551 4408 1737 -4038 -7165 -787 3911 7801 1080 -6622 -4656 -1891 5810 5560 12 -3217
$$ packed form
0@%%%%%%%%%%%%%%%%%%%%%qJ6j6J6j6J6j6K4l2L2l9M7m8N6o4P2q0Q8r8J06j20
42f4J36j52J68j84K00k20K44k71K98l26L60l96M38m86N37n96O67p49Q46r65J113
63E98j303J557j916K462l407N490j8040K709K2165q975J5757k2765m893O448j290
78e403J8846m519j2507k052n022J2627M425K089n632j2725J411P170R832L22p912
93I50p466o097J3541Q397q58p364j3066O669O140M815L668j1509k660l150O172
108a818J1491n615j497r103k064J0722M5P448p158j1660M478P89J2224M54j1327
123b591o86n960Q739R147m608k268q578R40O572K651L877o436n871j247M791Q079
139F551k143k671n775l127O378M698L890o721p702J966K765P701k50n548l229
$$ plain form
154 -3217 -7344 155 5103 3699 2428 -5207 -4659 -908 2695 6988 290 -4108 -4584 -2222 4907 4445
170 4445 1649 -3302 -6453 -549 3877 5332 1073 -4518 -4075 -1492 3866 4750 896 -3034 -5401 -552
186 -552 3406 4047 2032 -3933 -4080 -1553 2771 5578 457 -2926 -4338 -1910 3941 3763 1728 -2967
202 -2967 -5256 -346 2758 4268 1425 -3531 -3415 -1731 2757 4589 774 -2426 -4260 -1370 3066
217 3066 3621 1653 -2687 -4168 -1189 2591 4068 1190 -2594 -3896 -1396 2644 3747 1496 -2638
232 -2638 -3832 -1044 2218 3807 1184 -2390 -3463 -1641 2575 3568 1168 -1986 -3882 -1133 2270
247 2270 3270 1650 -2407 -3513 -1147 1920 3644 1265 -2152 -3270 -1389 2144 3281 1327 -1928
262 -1928 -3366 -1195 1893 3237 1388 -2026 -3129 -1264 1766 3165 1360 -1878 -3111 -1288 1779
$$ packed form
154c217m127P499M948j404j271p635N48L751L603M293o698m398m76K362P129m62
170D445k796m951l151N904M426J455m259n591M43K583N358Q84l854l930k367M849
186e52L958O41k015n965j47K527M324K807n121l383j412K428N851j78k035m695
202b967k289M910L104J510k843m956J16J684M488J832l815l200j834K890M436
217C066N55j968m340j481K979L780J477k878l784j302K500M040J103k251m134
232b638j194K788L262J589k623l574j073J822M216R93k400l154j896K749L403
247B270J000j620m057j106K366L067J724k379l417j118J881L533J137j954l255
262a928j438K171L088J344j849l414j103J865L030J399j805l238j233J823L067
$$ plain form
277 1779 3053 1277 -1756 -2983 -1350 1712 3040 1302 -1715 -2891 -1278 1548 2950 1332 -1572
292 -1572 -2861 -1370 1654 2831 1160 -1355 -2694 -1417 1472 2845 1287 -1505 -2709 -1298 1473
307 1473 2555 1246 -1148 -2775 -1418 1527 2563 1230 -1283 -2538 -1257 1181 2566 1272 -1242
322 -1242 -2526 -1303 1382 2403 1157 -958 -2492 -1388 1274 2459 1161 -1183 -2280 -1264 1066
337 1066 2316 1312 -979 -2509 -1242 1265 2135 1158 -953 -2173 -1278 885 2373 1250 -1123 -2170
353 -2170 -1161 966 2045 1211 -806 -2230 -1252 982 2120 1134 -928 -1943 -1266 785 2212 1212
369 1212 -920 -2019 -1164 922 1908 1151 -606 -2062 -1314 926 1982 1103 -832 -1852 -1087 615 1877
386 1877 1337 -799 -1957 -1129 760 1936 1016 -669 -1721 -1320 703 1938 1060 -697 -1790 -1042 627
$$ packed form
277A779J274j776l033j227J633L062J328j738l017j176J613K826J402j618k904
292a572j289J491L024J177j671k515j339J277K889J373j558k792j204J411K771
307A473J082j309k394j627J357K945J036j333k513j255J281K438J385j294k514
322a242j284J223K685J021j246k115j534J104K662J185j298k344j097J016K330
337A066J250j004k291j530J267K507Q70r77k111j220Q95K163J488j123k373j047
353b170J009K127J079q34k017j424R78K234J138r86k062j015O77K051J427j000
369A212k132j099Q55K086R86p57j757j456P48K240J056q79j935j020P65J702J262
386A877n40k136j158Q28J889J176r20j685j052M01K023J235q78j757j093P48J669
$$ plain form
403 627 1631 1226 -567 -1880 -1100 653 1732 1077 -644 -1487 -1215 450 1885 1057 -575 -1649 -1138
420 -1138 772 1458 1056 -275 -1842 -980 609 1492 1173 -720 -1412 -984 166 1744 1082 -545 -1451
437 -1451 -1215 681 1404 922 -198 -1622 -1100 521 1491 1102 -594 -1433 -859 315 1425 1050 -430
454 -430 -1364 -1038 402 1450 912 -280 -1238 -1178 445 1431 939 -246 -1533 -861 412 1026 1275 -380
472 -380 -1462 -835 164 1511 828 -556 -874 -1141 286 1290 791 -13 -1393 -959 450 1001 1119 -267
490 -267 -1294 -855 110 1307 916 -306 -1060 -968 229 1163 967 -273 -1207 -779 277 1068 788 -103 -910
509 -910 -1046 190 1114 934 -99 -1290 -749 207 915 1034 -318 -1010 -861 43 1218 751 -175 -940 -969
528 -969 307 953 778 -111 -1000 -704 63 882 899 -49 -974 -976 236 983 797 -97 -1027 -662 15 885 961
$$ packed form
403F27J004m05j793j313P80J753J079o55j721q43K72J665J435q28j632j074N11
420a138J910O86m02j331j567Q62J589Q83l19j893o92M28J150J578o62j627r06
437a451K36J896P23m82j120j424N22J621R70l89j696q39N74J174J110l75j480
454d30r34L26J440J048n38j192r58O0J623R86m92j185j287O72J273O14K49j655
472c80j082O27R99J347o83j384l18k67J427J004m99q04j380M34J409N51J18j386
490b67j027M39R65J197l91j222p54R2J197R34j96j240r34M28J056P91k80q91q07
509i10j36J236R24j80j033j191N41R56P08J19j352o92J49R04J175m67r26p65k9
528i69J276O46j75q89q89K96P67Q19J7r48r25kJ212P47j86q94r30L65O77Q70P6
$$ plain form
549 961 -244 -815 -847 82 1081 516 -15 -821 -904 251 610 818 62 -1011 -643 -89 877 941 -244 -749
569 -749 -826 64 932 582 43 -786 -869 155 786 783 -38 -882 -629 130 684 753 7 -758 -693 -89 715 847
591 847 -87 -710 -686 -48 889 592 -29 -644 -855 155 629 642 163 -887 -575 53 597 834 -155 -574
611 -574 -577 -197 784 595 85 -582 -847 76 663 657 95 -749 -559 32 565 725 -28 -609 -626 -78 679 644
633 644 -35 -589 -620 -42 593 592 81 -546 -685 -17 579 599 91 -659 -608 -4 503 687 -26 -566 -525 -112
655 -112 605 585 -26 -450 -642 5 574 516 128 -521 -599 -62 480 623 54 -512 -538 -86 526 578 55 -439
677 -439 -579 -73 506 533 83 -458 -534 -97 463 588 63 -437 -511 -68 421 539 101 -440 -551 -115 489
698 489 564 61 -414 -488 -111 415 524 112 -423 -530 -86 429 505 108 -361 -512 -90 401 496 56 -411 -488
$$ packed form
549I61j205n71l2R29R99n65n31q06q3J155L59K08p56j073L68N54R66O4j185n05
569g49p7Q90Q68l50n39q29q3J024O31lq21q44K53P59N54O9p46p65O5O04Q04J32
591H47r34o23K4O38R37k97o21o15k11J010M74J3m79j050L12O28N44K37r89m19
611e74lL80R81j89n10o67k65R23N87on62q44J90N91N33J60p53n81j7N48P57l5
633F44o79n54l1N78O35jn11o27j39O68N96K0n08p50N1O04N07J84p13n40M1M13
655a12P17k0o11m24j92O47N69n8l88o49p8N37N42J43n69n66k6M52O12N2n23m94
677d39j40N06N79K7m50n41p6M37N60J25n25n00p4M43M89J18m38n41j11M36O04
698D89P5n03m75p4L77N26J09m12n35j07M44N15P6l97m69j51M22M91R5m40m67p7
$$ plain form
720 -488 -109 380 506 110 -382 -502 -92 410 458 116 -343 -460 -110 353 501 151 -397 -471 -78 338 449
741 449 151 -331 -489 -100 363 477 124 -343 -419 -131 309 450 114 -325 -457 -67 330 393 161 -323 -445
762 -445 -114 287 443 106 -328 -386 -129 317 415 161 -311 -459 -100 291 420 134 -289 -398 -154 257 457
783 457 121 -288 -405 -103 267 385 148 -287 -411 -121 276 424 121 -243 -372 -174 265 389 132 -239
803 -239 -384 -86 249 370 168 -224 -371 -140 286 419 82 -189 -336 -127 232 332 166 -216 -389 -111
823 -111 208 347 126 -190 -309 -156 217 375 147 -234 -372 -121 218 323 158 -207 -336 -125 215 325
843 325 126 -178 -321 -139 190 331 146 -208 -326 -145 146 328 153 -163 -324 -153 185 303 147 -167
863 -167 -320 -130 162 321 152 -167 -300 -143 178 323 142 -133 -313 -146 172 297 123 -167 -286 -147
$$ packed form
720d88L79M89J26l96m92j20M10N02M8l42m59j17L50M63J48l50n48p4L93M16J11
741D49k98m82j58L89M63J14l53m67p6K88M40J41l36m39j32L90L97O3k32m84j22
762d45L31M01J56l37m34n8K57M46R8k54m72j48L59L91J29k86m23j09K44M11K00
783D57l36m09j17L02L70J18k37m35j24K90L97J48l03l64j29J98M39J24k57l71
803b39j45K98L35J21k02l92j47K31M26J33l37k71j47K09L59J00j66l82j73K78
823a11L19J39k21l16j19J53L73J58k28l81j38K51L39J05j65l65j29K11L40J10
843C25j99l04j43J82L29J41j85l54j18J81K91J82j75l16j61J71L38J18j56l14
863a67j53J90K92J59j69l19j33J57L21J45j81k75j80J67L18J25j74k90j19J39
$$ plain form
883 -147 134 306 162 -168 -297 -149 155 286 133 -137 -290 -110 134 285 145 -138 -258 -126 138 293
903 293 141 -139 -268 -143 166 257 135 -118 -261 -173 128 265 137 -146 -258 -111 117 243 137 -102 -247
924 -247 -159 98 267 125 -95 -232 -133 139 260 127 -91 -242 -85 93 230 160 -140 -225 -128 72 240 126
946 126 -130 -218 -152 71 211 135 -73 -228 -138 126 206 137 -100 -218 -83 62 232 133 -85 -196 -136 73 259
969 259 111 -73 -177 -134 137 184 132 -36 -214 -106 76 200 162 -96 -183 -85 65 238 123 -65 -173 -169 57
992 57 206 115 -54 -193 -128 82 162 112 -64 -203 -106 32 173 157 -63 -164 -126 81 210 89 -33 -170 -111
1015 -111 67 164 123 -9 -201 -98 69 165 160 -56 -149 -108 37 166 117 -45 -146 -170 27 188 107 -26 -182
1038 -182 -106 30 103 113 -20 -154 -103 16 162 132 -42 -142 -111 22 173 114 3 -123 -101 44 168 117 -11
$$ packed form
883a47K81J72j44l30j29J48L04J31j53k70j53J80K44J51j40k83j20J32K64J55
903B93j52k80j29J25L09R1j22k53j43Q8L01J37j28k83j12J47K28J26j06k39j45
924b47Q8K57J69j42k20j37R9K72J21j33k18j51J57J78J37p0l00q5R7K00J68j14
946A26k56q8O6K23J40p6k08j55R0K64Q0o9k37j18J35J45J70r9k18j11O0K09J86
969B59j48j84j04M3K71M7n2j68j78J08J82J24l8k58q7R8J50J73j15j88j08MK26
992E7J49r1j69j39O5K10Q0n0j76j39R7J38J41j6k20j01L8K07J29j21j22j37N9
1015a11J78R7m1j32j92J03J67R6nk16r3M1J45J29m9j62j01k4J97J61q1j33j56
1038a82P6J36P3J0j33j34N1J19J46l0j74j00L1J33J51n9j11j26K2J45J24n1j28
$$ plain form
1061 -11 -174 -126 45 145 111 -39 -133 -100 1 123 115 -10 -144 -120 17 110 81 -26 -133 -101 12 122 107 -7
1085 -7 -135 -108 21 131 86 -34 -120 -97 35 130 124 -21 -111 -109 3 139 114 -22 -93 -105 43 146 106 18 -119 -103
1111 -103 0 125 129 -2 -116 -112 6 96 110 -14 -97 -95 4 126 103 -7 -97 -124 34 132 104 47 -79 -72 -5 76 119
1138 119 -4 -111 -76 -19 99 96 -8 -75 -79 26 126 87 25 -87 -83 34 56 92 -10 -113 -61 -9 90 108 -20 -86
1164 -86 -86 -23 111 88 -10 -78 -113 2 76 94 43 -72 -95 -10 102 95 3 -75 -93 4 81 99 8 -55 -70 12 73 82 24 -86
1194 -86 -98 -16 86 85 30 -76 -96 -7 84 81 -1 -91 -90 3 51 91 16 -44 -82 -6 80 98 38 -55 -74 8 93 92 15 -49 -77
1225 -77 -8 76 85 -12 -64 -66 3 58 66 37 -77 -82 -22 62 91 8 -60 -88 10 65 83 6 -49 -76 -7 67 85 31 -81 -65 26
1256 26 40 62 17 -41 -67 10 40 67 20 -35 -46 -7 56 80 23 -45 -43 0 46 73 32 -58 -91 -7 43 89 21 -47 -44 -20 76
$$ packed form
1061a1j63M8J71J00l4j50r4L3J01J22qj25j34K4J37R3k9j07j07L2J13J10j5j14
1085gj28K7J29J10m5j20q6K3J32R5oj45r0KJ12J36k5j36p1j2J48J03m0q8j37J6
1111a03J03J25Mj31j14MJ18R0J4j24q3KR9J22k3j10r0k7J58R8k8n7j26PO7Q1M3
1138A19j23j07L5N7J18lj04o7mJ05J00l9o2j12MJ17K2L6j02j03N2N2R9J8j28o6
1164h6%O3J34k3r8o8l5J15P4J8n1j15k3Q5J12pr2p8j8R7P7J8r1o3j5Q2O1Rn8j10
1194h6j2Q2J02jn5j06k0Q9R1lq2r0JR3M8M0p5o0l8P6Q6J8o0r3j9Q2Q5jp7o4k8
1225g7O9Q4Rr7n2kO9N5Qk9j14nO0Q4K9q3o8k8R8N5J8p7n5k7O9P4J8n4j12J6R1
1256B6J4K2m5n8k6P7L0K7m7n5j1L9O3K4n7o8KM3M6K7m1r0l3Q4N0M6o8o8LK4R6
$$ plain form
1287 76 65 -1 -41 -64 -30 57 66 26 -40 -31 -23 75 80 19 -37 -86 -14 50 73 21 -48 -77 -26 62 71 28 -47 -67 -26 48 54 16 -42
1320 -42 -65 -38 39 56 19 -29 -55 -4 47 66 20 -48 -52 -20 48 75 32 -8 -58 -11 28 59 16 -14 -55 3 45 52 21 -8 -42
1351 -42 -31 42 41 22 -22 -42 -11 36 59 -6 -38 -55 -26 16 36 19 -34 -40 -11 26 59 29 -38 -41 -17 50 43 20 -38 -42 -11 23 43
1384 43 3 -22 -44 -19 24 58 12 -21 -36 -18 17 43 31 -32 -50 -15 18 40 9 -23 -45 -18 27 59 20 -14 -35 -7 51 19
1414 19 30 -19 -38 15 35 49 41 -16 -21 -8 26 46 2 -25 -57 -13 9 66 23 -54 -42 -43 21 34 16 -15 -56 -19 9 28 5 -10
1446 -10 -16 -21 46 22 17 0 -23 -10 12 42 9 -4 -20 -8 26 30 8 -14 -19 -4 20 64 27 14 -28 -12 6 18 21 -32 -20 -32 -1
1479 -1 20 4 -11 -36 -11 18 37 24 -34 -31 -31 0 33 39 -26 -36 0 5 46 26 -25 -16 -8 5 45 16 -23 -49 -8 31 -2 42 -6 -23
1513 -23 -5 19 34 29 -29 -35 -54 13 54 4 5 -28 -40 33 40 -11 -7 -55 -25 13 21 18 -20 -45 -18 12 27 44 -12 -30 8 -19 41 16
$$ packed form
1287G6j1o6m0k3L4Q7Rm0o6RQR8No1n6m9P2O4K3n2o9k9N1Q8Rm3p5k0M1P4Ol8n8
1320d2k3K7P7J7l7m8k6N1N1J9m6o8mL2O8K7m3m0n0M7L9L1m3l0m1N8M2Pl1k9l4
1351d2J1P3jj9m4k0L1M7K3o5l2j7K9M2K0j7n3oK9L7L3l0o7lK4O7pk3n8mL1L4K0
1384D3m0k5k2K5M3L4m6l3j5J8L5K6j2o3j8L5L3K2l1l2k2K7M5L2l9l4k1K8N8l2
1414A9J1m9j9N3K0J4qn7nJ3L4K0m4k7l2M4K2N7m3p7J2jO4J3j8l1m1L7K8J9k3j5
1446a0onO7k4nj7k3J3K2L0l3j3j6J2L4Mk2k2nJ5K4M4l7j3m2J6J8J2Ln3J2j2L1
1479aK1j6j5k5K5K9J9j3n8L%L1L3Oo5j0L6NM1k0n1RQJ3M0k9l9k6M1L9l3M4m8j7
1513b3J8K4J5nn8oj9O7M1n0Jl3j2P3Pn1Mm8L0L8Qll8k5K7L0J5J7n6j8L8k7O0k5
$$ plain form
1547 16 -29 -45 -30 12 33 29 6 -56 -28 -13 8 29 -24 -38 -15 9 55 12 -23 -17 -35 23 23 3 -24 -33 -33 -7 39 15 -21 -36 -4
1580 -4 -1 22 31 9 -28 -35 5 14 -8 -9 -23 -15 33 34 19 18 -33 -9 11 26 14 -30 -9 -3 6 -13 38 9 -35 -38 -14 63 19 1 -26 -23 -2
1617 -2 31 19 -1 -24 -11 12 5 26 22 -33 -16 22 -17 21 7 -46 -19 19 32 25 12 -31 -45 -21 24 36 -7 -10 -1 10 21 17 -9 -1
1651 -1 -1 18 23 25 -15 -14 -26 7 32 18 -8 -12 -24 22 1 15 -11 -24 16 -13 -11 6 1 -21 -14 0 4 -9 12 -24 -2 -14 8 26 -1
1686 -1 -30 -32 -14 17 20 7 -11 -13 7 -17 -1 23 15 2 18 5 7 34 -22 -16 -7 20 -4 -13 -20 8 -2 25 3 -15 -17 4 -4 33 11 -4
1722 -4 -9 -28 19 -27 1 -5 5 -21 4 26 23 17 -20 -5 -22 31 36 8 -34 2 37 9 36 8 12 -15 -16 3 6 -1 0 -3 -1 10 11 13 -12 -12
1760 -12 -6 -1 33 19 4 -12 -9 2 -7 6 7 -32 16 22 17 5 -21 6 7 14 22 -3 3 8 11 2 29 2 -16 -1 24 30 8 -7 -5 -12 9 28 25
1799 25 18 -11 -20 -11 -10 7 -6 -23 -18 27 7 11 6 -2 7 -6 6 29 12 -22 3 19 25 9 3 14 8 9 12 8 6 10 -23 17 32 9 -2 -14 -5
$$ packed form
1547A6m5j6J5M2K1mk3o2K8J5K1K1n3j4K3K4M6m3l5Oj8N8%k0k7r%K6M6k4l6j5L2
1580dLK3Rk2l7pM0Rk2jj4QM8Jj5jn1K4K0J5j2m4K1ORj9N1k9m4lK4P7m4j8k7LK1
1617bL3j2k0k3J3K3pK1mn5J7L8l9L8j4n3K7L8J3pj3m3j4K4M5J2m3lRJ1J1mk6Q
1651a%J9NKm0Jj2L3K5j4k6mj2M6k1J4k6j3M0k9KJ7nk2PJ4Mj3K1l6K2j2K2J8k7
1686ak9kJ8L1Lj3j8kK0k4J6K4qj3J6j3KK7n6ORK7k4rpK8j0K7k2j8kK1qL7k2j5
1722dnj9M7m6K8oJ0k6K5K2lol7J5j7N3Nk8m2L6L5k8K7k8Mk7jJ9LpJlKJ1JKk5%
1760a2ONL4j4j5j6LJ1rJ3Jl9M8Onj2k6K7JPQk5ONLrK7k7j8J5K5Ok2j5KpK1J9l
1799B5pk9rRJJ7j3j7NM5k0MnqRj3J2K3j7l4K5J6Oj6oJ1oJLmkMl3M0J5k3j1j2R
$$ plain form
1838 -5 -9 8 -12 25 0 -38 -15 13 19 10 19 5 -10 7 28 24 -3 26 10 20 46 8 8 -14 9 22 -3 -8 17 17 -5 13 3 -4 0 -14
1874 -14 4 -7 28 10 -17 -17 12 5 -6 -2 6 -15 -2 16 19 19 -2 6 9 5 9 8 -5 1 -30 15 39 25 -19 -7 -18 28 21 28 11 -12 -2
1911 -2 -18 3 -2 -4 -11 -16 14 28 24 14 4 -11 6 -1 29 -16 11 2 7 40 27 9 -13 16 -1 0 1 -22 1 10 17 14 1 -15 16 4 4 39
1949 39 21 -18 12 -6 4 -14 9 7 -9 -25 15 13 4 5 -11 3 34 -10 -8 -14 -34 -1 26 19 21 21 7 -8 1 -3 11 3 -6 1 18 6 -8
1986 -8 17 -10 29 -5 1 29 -15 -4 -10 -9 22 1 -19 2 9 2 -10 -3 -4 -1 -6 7 6 0 6 -10 -24 31 6 5 22 -28 12 17 17 3 8 -3 -23
2025 -23 25 30 -1 4 -10 -8 -31 -11 20 -19 3 -8 8 -2 -7 -10 -19 -12 9 -5 -21 4 -32 -35 7 -4 15 0 2 28 7 8 26 12 7 1
2061 1 -5 10 9 -1 12 -2 10 31 41 10 -5 -7 -14 20 4 -2 -9 -16 6 10 14 0 -18 -8 3 1 12 6 5 3 20 6 4 8 10 4 17 11 -7 14
2101 14 29 30 9 -2 8 -14 3 -2 4 -7 28 8 -10 -8 -3 7 9 2 25 -9 -14 -14 18 -22 -4 5 -9 7 4 9 2 -22 6 -10 -4 -19 3
$$ packed form
1838emJ7k0L7k5l8K3K8OrRj4j5J7K1mk7K9j6J0K6l8%k2K3J3k5nK5%k2J8j0pMj4
1874a4J8j1L5j8k7%K9pj1MQk1J3J8L%k1QLmMjj3Ol1M5K4j4m4J2j1M6pPj7k3J0
1911bj6K1nkpnL0J4mj0j0j5J7pL0m5K7rNL3j3j8k2K9j7JJk3K3RPlj3j6L1j2%L5
1949C9j8l9L0j8J0j8K3kj6j6M0krJj6J4L1m4Kok0L3K7pK%j4j5RmJ4qrPJ7j2j4
1986hK5k7L9l4OK8m4J1oJL1k1k0K1Ppj2PjLnJ3joOj6j4N5k5jJ7n0M0N%j4Nj1k0
2025b3M8Nl1Nj4Kk3K0L1l9K2j1J6j0nlrPK1j4j6K5l6lM2j1J9j5KK6k1JJ8j4no
2061AoJ5jj0J3j4J2K1J0l1j5kpL4j6oppK2MMj4j8J0J1kJ1ojkJ7j4kMKoJ3oj8K1
2101A4J5Jk1j1J0k2J7nOj1L5k0j8KNJ0KpK3l4n%L2m0J8Rj4J6lNpk4K8j6Oj5K2
$$ plain form
2138 3 -5 8 1 8 20 -8 15 -6 11 16 3 20 -6 2 -9 -9 11 -8 -16 7 -7 -4 0 -5 -27 4 -10 -10 14 4 3 1 -13 11 6 0 9 1 5 -9
2178 -9 1 8 7 1 8 31 5 -3 12 1 23 5 2 0 -17 -1 -19 9 -5 -31 -15 -20 2 -3 -6 -3 -1 23 -6 7 -10 -10 -7 4 12 1 27 0
2216 0 0 24 -10 36 18 0 -13 -10 22 3 23 -21 -21 40 9 -2 10 20 19 -11 -16 -13 4 6 3 5 5 -36 -11 -6 11 -25 10 -1 -45 9
2252 9 3 -8 -14 3 -11 4 19 13 16 7 -5 8 32 33 7 -2 5 1 -11 -9 15 15 -28 -11 -3 -16 -1 -8 -17 1 -35 2 -9 -1 -36 -17 20 0
2290 0 4 -1 17 2 -18 -2 4 -6 8 8 -23 3 1 29 9 20 -38 -10 27 7 5 -14 6 15 9 5 -23 -15 11 -13 12 7 -4 15 -7 21
2326 21 -17 6 -15 -21 22 -3 10 14 -13 -13 34 -9 8 26 -1 -6 29 -10 -7 21 -1 5 -2 23 26 -8 -4 -16 -18 -10 -6 15 -4 -5 0 -6 -12 5
2364 5 -18 9 -10 2 2 -3 0 9 -5 14 14 18 -4 3 21 -12 5 14 -8 -22 0 -10 -16 -4 -15 -11 7 5 -35 7 -6 -5 -8 -5 -22 -9 -25 6
2402 6 2 -1 8 -11 -25 -29 6 -19 -4 -29 -3 1 0 6 5 17 -5 30 -2 1 6 1 18 1 35 -10 -15 -3 25 10 10 -6 -6 32 12 -1 1 3 -18
$$ packed form
2138CqJ3pPJ2k8K3k1J7Nj3J7k6Qj1%K0j9qK3j4LMnk2L1j4%K4j0jkj4K4noRqMj4
2178iJ0PjoPK3k6qJ5j1K2j8lkj7J6j8K8j4k6J6nK2nlLKK4k9J3j7%LJ1Qj1K6k7
2216@%K4l4M6j8j8j3LL2j9K0m4%O1l1j1J2J0jl0nLJ7KlK%m1K5NJ7l6L5j1m4N4
2252Ioj1oJ7j4J5J5oLrj2J3K4Jk6rPmj2KK4%m3J7Qj3J5prJ8l6L7j1Ql5J9L7k0
2290@MnJ8j5k0J6Oj0J4%l1K6kK8k0J1n8K8L7k0kj9K0Romk8QK6k4K5nj1J9k2K8
2326B1l8K3k1oM3k5J3Mk7%M7m3J7J8k7nL5l9LK8k2OpK5Ll4Mj2kQMK1j9jNooJ7
2364Ek3K7j9J2%nLRj4J9%Mk2PJ8l3J7Rk2j4K2j0oJ2j1MJ8km0M2j3JlLj7J3j6L1
2402FmlRj9j4mL5k5J5k5K6MjOjJ2k2L5l2LNnJ7j7L4m5nJ2K8j5%j6%L8k0j3KKk1
$$ plain form
2441 -18 6 17 5 -16 12 -7 -19 -11 -1 -8 0 -2 4 4 2 -20 8 1 27 6 15 -5 2 11 8 5 16 20 16 -1 -8 4 1 5 5 5 5 -4 -19 -11 10 8
2483 8 -19 2 -19 -3 9 3 -19 -20 -18 -2 -7 -1 -2 -3 13 6 25 5 15 28 40 2 -19 19 15 25 6 -28 9 -3 7 -8 -8 -5 -24 -14
2519 -14 -12 -8 -11 1 -25 3 -32 14 -2 -18 2 -3 -14 -5 -2 -10 9 -5 9 -31 16 -10 3 -12 10 13 -1 1 8 2 14 -19 8 -27 -9 -6
2555 -6 -29 -7 -21 -23 4 24 -18 -7 -15 2 20 19 -6 -15 -21 -8 4 -8 19 1 1 -4 4 7 4 -6 6 12 13 -3 -9 3 7 -7 -5 -17 7 3 8
2594 8 -13 0 4 -30 15 7 7 -11 -8 -2 -18 3 9 6 -13 -21 -19 10 11 4 -14 -16 -24 -10 10 -8 14 13 13 20 0 29 16 -4 -3 -12 4 8 -16 -9 -2
2635 -2 -11 -13 5 -48 -16 -10 -19 -7 -3 1 -8 5 -2 -36 -39 -5 6 15 -12 -4 -6 -14 34 21 8 -9 -5 4 9 -1 -4 -10 -6 13 9 -12 -1 9 -12 -14 -4
2676 -4 -19 -30 7 -17 -9 -21 -21 -1 -19 10 28 6 0 -18 11 -12 1 -8 -3 7 4 -19 15 0 -9 -14 -3 4 22 -8 -9 -25 1 -21 -6 5
2712 5 -15 -16 3 -26 -8 -18 -19 -14 -6 -25 -16 2 -21 -31 2 -8 -8 -9 -18 17 1 21 -7 3 3 3 15 -14 2 11 4 8 11 5 19 5 34 -4
$$ packed form
2441a8K4J1j2k1K8j9j2QJ0pQkO%kk2K8pK6k1Rk0PRllJ1Mmj7pJ2lM%%%rj5QK1k
2483Hk7K1k1J6J2ok2jKJ6nOjjJ6pJ9k0J0J3J2l8k1L8mJ0j9l4L7j2J0j5%Lj9J0
2519a4KMlJ2k6K8l5M6j6j6K0nj1RLqJ9j4J4m0M7k6J3j5K2Lj4KPoJ2l3K7l5J8L
2555fk3K2j4kK7K0m2J1qJ7J8jk5roJ3J2j2K7j8%nQLlj0J2OJj6oJ2Mj4Kj2K4mN
2594Hk1J3Ml4M5q%j8LOj6K1Olj9qKK9Jpj8kqJ4K0j8K2j%Pk0K9j3k0JrJ6Mk4PP
2635brkJ8n3L2OrJ2MMrJ3pl4lL4J1Rk7QkqM8j3j3j7MRNj0loMJ9mk1J1J0k1kJ0
2676dj5j1L7k4Qj2%K0j8K9J8k2oj8K9k3J3rNJ0lk3L4j5rnJ1PJ8l0jj6K6k2J5J1
2712Ek0jJ9k9J8j0jNQj9RJ8k3j0L3j0%jrL5j6K0k8J0%%J2k9J6RpMLoJ4j4K9l8
$$ plain form
2750 -4 15 -10 -6 20 9 12 -12 13 12 -7 -18 12 -10 -9 8 -22 2 -12 -7 21 -6 21 9 -9 0 8 -9 13 14 2 0 42 8 14 5 -15
2786 -15 -5 -15 -2 15 6 8 1 12 19 23 -7 7 4 -7 11 -2 -14 -21 7 -4 0 -17 -18 4 -4 19 -3 12 -13 -13 -14 -5 -4 -3 -6 12 -4 15
2824 15 -7 23 23 3 16 3 30 6 9 18 14 1 -19 8 3 -2 3 11 2 17 -14 1 -10 2 -13 -12 -34 2 14 -20 30 0 -11 -21 8
2859 8 26 9 10 -11 -4 21 26 20 35 6 2 -3 17 -24 -20 -1 -3 15 -35 9 6 -14 -7 11 18 -9 -24 -11 -25 -14 14 -13 4 -6 -3 0 0 16
2897 16 4 -8 -3 52 -8 20 24 14 5 10 17 43 5 -2 30 -2 -7 3 -2 1 -4 8 -9 9 -11 -14 -2 -27 -13 -26 2 -5 17 -3 -4 9 -9
2934 -9 -3 9 -5 -1 8 10 9 5 -3 -7 15 2 18 19 4 -1 18 -2 -18 -3 2 -5 13 25 21 26 -21 -13 14 11 1 -17 -17 -47 21 -22 31 -4 2 5
2974 5 -5 -19 -12 -4 -5 -4 -1 -5 10 7 -6 29 -6 26 9 14 -7 7 8 20 -7 -18 -23 17 9 5 -9 -25 16 12 -2 31 -5 -7 -28 -28 -14 -23 -16
3013 -16 -2 15 -13 3 1 -6 15 -5 1 30 -4 3 30 16 12 16 23 -1 -24 8 23 -18 -8 9 13 -5 -2 31 -6 24 -4 12 -19 -23 -19 10
$$ packed form
2750dJ9k5MK6j1Lk4K5jj9j1L0k2JJ7l0K4j4NK8k7K7j2j8RQj7K2Jj2kM2l4Ork0
2786a5J0j0J3J7rKpJ1PMl0J4lj1J8j3j2pK8j1Mj7jK2qK3k2J5k5%jRJJlJ8j6J9
2824A5k2L0%k0J3j3K7k4LRmj3k0K7nnNQrJ5l1J5j1J2j5Jk2L6J2l4N0l0j1j0K9
2859HJ8j7Jk1PK5NoJ5k9mnK0m1MJ9kJ8n0M4lk0PJ8Pk7j5J3j4J1K8k7J7j0LL%J6
2897A6j2j2NN5o0K8Mj0rNPK6l8pL2l2nJ0nLnJ2j7J8k0lJ2k5J4j3K8pK2k0jJ3j8
2934iOJ2j4MRKjmqmK2j3J6Jj5nJ9k0j6J5NpJ8J2mNm7QK7lj0j8%l0O8m3N3l5OL
2974Ej0j4PQjJLmJ5lj3L5l5L2j7Nk1J4JJ2k7j1nM0qmj4j6M1mj4L3l6kk1%J4rP
3013a6J4J7k8J6kpK1k0OK9l4PK7j4mMPk4k3L2J5m1J0J7Mj8LL3l7L0k8J6l1mMK9
$$ plain form
3049 10 -5 5 -11 15 -7 6 5 -9 11 -1 10 -12 -2 5 16 -5 16 -27 -3 -18 -2 17 -24 -10 -5 -1 17 15 11 7 -22 -3 0 0 -8
3084 -8 3 -21 -3 -7 -22 21 0 -22 -14 -5 -2 23 25 0 7 -11 -36 -2 1 -13 2 7 17 7 16 7 12 4 -11 23 -14 -23 -18 -15 11 18 -24 13 11
3123 11 -15 -11 6 -17 -10 6 15 3 -18 26 -34 14 2 7 29 18 -3 -14 -6 1 6 16 -3 -22 -13 -4 -3 3 21 -1 -17 19 -21 8 0 -8 -22
3160 -22 11 20 17 -1 -2 13 -19 -23 0 -6 2 -17 -8 1 -13 -12 14 2 6 17 -15 39 34 -2 9 21 5 3 42 -2 23 1 -17 0 -16 -11 2
3197 2 4 -3 1 -12 -9 -18 -14 -6 21 -2 -21 -8 1 -2 -22 -18 -5 9 5 -15 14 -2 20 -12 17 4 12 1 -19 5 -3 -22 14 13 -14 5 15 -2
3235 -2 -1 0 -3 -2 -13 -13 -24 -7 -7 -2 0 -5 -5 9 14 3 -2 13 18 15 21 20 -10 -20 21 0 9 11 30 6 7 -16 36 17 -3 24 8 27 -1 4 28
3276 28 -2 -12 -2 -3 -2 -17 -10 -5 3 -26 -10 -5 1 -2 0 -16 20 8 25 -1 14 -3 8 22 -6 1 21 16 0 7 -6 34 24 8 5 26 -15
3313 -15 -13 0 -14 -9 9 17 -17 -39 3 -10 10 7 -6 35 -26 -24 -30 3 6 15 -15 -4 3 -10 18 20 4 8 12 26 2 21 9 21 12 18 24 7
$$ packed form
3049A0j5J0j6K6k2J3jj4K0j2J1k2J0PJ1k1K1m3K4j5J6J9m1J4NMJ8kmmk9J9L%q
3084hJ1k4J8mj5M3k1k2QRLK5Kk5Pj8k5L4Lj4J5NJ0j0RrNqj5L4l7rNLK6Pm2L7k
3123A1k6MJ7k3PJ6Rj2k1M4o0M8j2NK2j1k1j1QPNJ0j9j9RRJOJ8k2j6L6m0K9qqj4
3160b2L3Rlj8jJ5l2mK3oQj9RRj4JK6j2MJ1l2N4nl6J1J2j6kL9m4K5k2j8J7j6NJ3
3197BKpMj3LrMQK7k3j9J3Rlk0MJ3J4mk0K9j6K2l2K9j3Qj1k0K4qj9L6jk7J9J0j7
3235bJJlJj1%j1J7%NKn%J4Nj1nJ5NlOjl0j0M1k1RKJ9k4Jk3N2j9k0K7j6J9k8NK4
3276B8l0j0J0jJj5PNQk9J6NOlKj6L6j2J7k6J5j7J1J4k8PK0nj6Pj3M0j0j6lK1m1
3313a5KJ3j4NJ8Ql4k2M2j3K0lj3M1o1KoL3LRl0J1Pj3K8Kj6MMJ4k4J9j2J2rOOj7
$$ plain form
3351 7 1 -6 18 6 -16 11 -12 -20 6 -38 19 -18 -10 -18 -10 -7 3 -11 -6 -11 9 -1 6 24 -24 15 13 4 12 -7 -8 7 16 12 16 10 4 -5 7 24 5
3392 5 -14 -16 26 5 -11 -19 -5 -14 -18 -12 -1 1 -2 24 1 14 13 -9 -2 -5 23 -32 2 -11 39 8 5 -7 22 7 -10 10 5 -7 18 -9 16
3429 16 -18 30 24 25 5 -7 18 13 -6 -25 -15 -2 21 -16 6 5 5 5 -21 -16 -21 -1 -6 -5 6 0 -16 -25 16 -16 0 -18 10 21 13 14 4
3466 4 7 8 12 28 21 0 18 -8 -11 4 24 20 11 -22 -23 -16 -6 9 -23 -11 -16 -6 14 2 -28 5 -2 4 4 -7 -16 -6 25 15 11 28 19 25 25 21
3506 21 39 -3 38 9 8 22 -4 18 -2 10 -18 -17 12 -11 -10 13 -14 -26 -6 -22 -22 0 19 -17 12 -26 -1 8 -2 -3 -15 -15 -18 -6
3540 -6 21 -5 10 14 19 12 13 -6 7 14 11 5 1 9 6 13 -1 -7 -5 9 7 11 -10 15 0 5 -7 8 -4 14 7 10 15 19 -11 19 22 -19 18 19 12 -6
3582 -6 15 -10 26 6 -8 -3 13 7 15 1 4 -7 15 25 17 0 7 -17 0 18 -14 -29 13 -14 -28 -22 -9 14 10 -6 -34 17 3 -1 -20
3617 -20 1 -2 -8 2 4 -9 28 5 18 40 -3 7 3 -6 8 -4 19 11 12 -7 -2 9 5 0 0 -17 -7 3 -17 -3 7 -15 -3 4 4 -17 -4
$$ packed form
3351GopK4j2k2K7k3qK6m4N7l7QqQLJ0j4NnK0j0PJ8m8L9krQj9jJ5RmMoorJ2J7j9
3392Ej9kM2k1j6qJ4rmOJ1KlK6k3J3jk2PlK8n5L4j3N0l1lj2K9j5j7K0nj2K5k7K5
3429A6l4M8oJk0j2K5nj9j9J0J3K3l7K2j%%k6NnK0nJJ1oj6rM1l2J6j8K8J1qJj0
3466DLJMJ6pk1J8k6lJ5K0mrl3jPJ0J5l2J2nJ0K0j2l0L3pO%j1rJ0L1j0mJ7rO%m
3506B1J8m2M1k9jJ4k6K2k0J2k8JK9k3JK3k7j2K0j6%K2J9l6K9l8K5Rj0jj2%lJ2
3540fK7k6J5MNpJj9J3PlomQlPj4oKJ4kMk1K5j5Nj2J5j2J8pLNMl0L0Lm1L7Jpj8
3582fK1k5L6k0j4NJ6oQj4Lj1K2J0qj7Pk4J7J8l2j5M2k7j4OJ3K3mj6k8N1j4mj9
3617b0K1loJ0Kj3L7k3J3K2m3J0mrJ4j2K3qJj9NJ1mn%j7J0J0k0J4J0k2J2P%k1J3
$$ plain form
3654 -4 -8 -12 -14 16 11 -14 3 -9 -7 -5 -9 13 -1 -2 12 28 27 5 -24 -8 2 -11 20 21 21 0 -23 4 5 -6 -7 14 -5 3 1 -2 -7 -7 16 -1
3694 -1 8 -15 -17 -6 -5 21 -10 15 30 14 9 -28 -1 8 0 -12 -13 -12 -3 6 15 28 23 -22 -6 -18 -16 8 9 -27 2 -37 10 16 -33 30 13 12 13
3733 13 -10 0 14 -13 7 6 3 7 37 7 1 -5 10 27 -32 20 19 6 6 7 4 2 -6 9 -4 15 5 1 0 5 -5 3 -9 -19 17 12 10 -9 -26
3772 -26 16 13 20 10 -10 -13 7 -2 32 -8 18 -1 2 9 17 12 14 -4 20 15 -20 3 -37 3 38 15 2 -15 -19 8 -18 17 5 -2 -8 -10 15
3809 15 14 11 9 2 -13 -9 -5 28 4 -5 3 12 13 11 37 -12 28 30 14 33 27 21 0 20 20 8 -7 16 -10 10 5 10 -1 -9 -2 -13 -28 -11 -11 3
3849 3 9 8 1 11 -17 -12 -7 -28 -8 9 18 15 13 34 32 13 8 38 11 -4 4 -1 16 -13 -29 -3 10 15 11 24 -27 0 6 24 -9 12 -4 -32
3887 -32 -4 -10 -1 -8 -11 -10 4 1 -8 -24 -7 10 5 11 5 -4 -9 -13 -13 18 15 -9 24 12 17 5 -16 15 6 10 20 19 23 -15 -7 -16 3 -8 -17 -15 -6 -2 -3 -1
3931 -1 23 6 -10 7 -3 -3 3 -13 -11 -4 -12 12 8 14 -8 8 28 -13 5 -1 4 13 17 -1 -3 -15 32 9 20 -8 10 -16 -34 -6 -5 -14 4 16
$$ packed form
3654dmmkL0nk5J7j2KKmK2j4jJ4J6jk2k9J6J0j3L1J%k1k3K7Jj1jK1j9Qkln%K3j7
3694aRk3kJ1JK6l1K5J5j6nl7K7Rqj2jJRRRJ3nm5J6j2KK4Jl6K9l9M7Om9O3j7jJ
3733A3k3J0J4k7K0jlML0l0ooJ5J7n9N2jj3%JlkqJ5j3J9j0mjNj0Qj2j0L6nkj9j7
3772b6M2lPj0k0lK0rL4m0K6j9LPQnKj8K4nl5K3m0M0L5k3j3j7mK7k6L5j2pokK5
3809A5jlkpj5MML3k4rQRJkK6m9M0Kj6J9ook1K0%j2j5K3k6K0nNj1qPj1j5J7%J4
3849COjpJ0k8NNk1K0J7RlkK1kj9nL0k7j5QnJ7k9j6K6J3NmJ3n1K7OJ8l3K1j6k8
3887c2K8oRplJJ4lrj6J7J7nOornm%L1lk4L3j2Nj2k1L1rMJ0jMl8QrJ9j1rKRMjK
3931aK4j7j6J7j0%Oj6KPqK4mOk2J6K0m1J8oNRMj8kj2M7k3J1k8J8k6j8K8JrJ8J2
$$ plain form
3969 16 -26 8 -11 7 6 15 -3 38 -3 -22 24 5 14 -6 0 21 9 10 10 1 8 4 2 34 1 -7 12 16 3 16 -40 12 5 -11 14 -15 -10
4006 -10 -29 -2 0 -14 -2 -6 4 -1 -3 10 8 35 0 -5 18 17 21 1 22 -8 -2 5 -13 17 0 1 14 11 4 5 -4 5 23 28 6 -20 -14 -2 8
4045 8 -7 2 1 -26 12 16 -18 -16 3 -12 -2 4 -11 24 -2 13 -4 -11 12 8 5 2 6 15 -4 -7 -8 -7 -6 -6 7 -5 18 12 -13 -14 9 5 3 7 -12
4086 -12 20 14 -14 -5 -13 -13 -7 -3 -13 8 12 5 0 -10 15 -9 -4 7 36 6 -8 18 16 11 10 -9 2 10 12 -7 15 -1 10 -8 -8 -12 -15 -4 8
4125 8 -8 -15 2 24 28 -9 -13 -14 -14 -14 -25 1 -8 -10 -7 9 12 13 20 -2 -11 -2 4 14 15 3 1 -13 53 25 -7 6 -25 25 -8 8 5 -17 -6 -25
4165 -25 -15 -33 -3 -14 -29 16 15 23 0 -3 5 32 3 18 9 0 12 16 1 16 6 10 20 7 18 3 13 -2 4 10 0 -4 -1 -7 -10 19 10 -2
4203 -2 12 -9 12 14 -7 -1 -29 12 6 4 8 -11 -10 -20 3 6 9 -20 -11 -21 9 -11 -12 13 2 5 -12 8 7 30 3 -7 9 6 18 -2 -16
4240 -16 -19 -3 -7 -15 28 4 -20 -7 -19 -6 -15 -5 11 -3 -1 -5 32 -22 -7 20 -2 23 12 -3 7 -8 17 -3 7 30 -2 6 17 -17
$$ packed form
3969A6m2L4j9J8jRj8M1m1j9M6j9Rk0OK1j2J%rPmkL2l3qJ9Mj3J3n6N2pj6K5k9N
4006a0j9K7Kj4J2mJ0nkJ3kK7l5nK3jMk0K1l0OPj8L0j7JJ3lpJrRJ8Nk2k6OJ2J0
4045Hj5Rjk7L8Ml4KJ9j5J0Oj5L5k6J5j7pK3mllMRj9ljJJ%J3j2K3ok5jK3mkMj9
4086a2L2ok8Rq%OMj0K1Mpnj0K5k4NJ1K9l0j4K6knjj9J1QKj9K2j6J1j8%mlJ1J2
4125Hj6pJ7K2Ml7mj%%j1K6rkLJ6LJPk2rROJ0Jj2kj4O6k8l2J3l1N0l3J6lk2J1j9
4165b5J0j8L0j1j5M5jQk3lQK7k9J5rrJ2Mj5J5j0MJ0j3J1j5J0j5OOj0mLolK9rj2
4203bJ4k1K1Kk1Ok8M1okMj9Jj0K3LLk9Rj0L0k0jK5j1Lj7K0jK3k7j0J6lJ2k0j4
4240a6lJ6mqM3k4k4J3j2J3rJ0J6j4KmL7n4J5K7k2K5j1j5J0j5K5k0J0K3l2QJ1l4
$$ plain form
4274 -17 8 -15 -9 4 -4 21 -14 -15 10 14 -21 -9 -15 -4 20 -16 -13 2 12 -36 -8 26 -10 28 -7 2 18 0 -28 5 -16 -33 -5 -10
4308 -10 4 7 -22 -3 -10 -8 -17 11 18 -18 24 -3 -10 -28 -13 -10 8 26 13 -17 3 -17 -8 -9 -26 29 -7 12 -1 4 10 0 -7 21 6 30
4344 30 0 -32 -5 6 18 -6 -4 20 39 -7 6 4 -9 -26 33 -14 3 -19 -14 -2 -2 1 13 -2 -5 14 -13 -18 -1 10 9 8 27 0 -29
4379 -29 -8 18 -19 5 -12 2 12 3 16 14 -9 13 16 31 11 10 0 10 18 11 -23 20 -20 4 15 29 6 -13 -33 3 -19 4 10 17
4413 17 -22 28 -3 -15 -25 9 22 17 8 3 20 9 12 -15 -1 13 3 6 4 20 28 0 -3 8 26 -10 -12 10 -2 -8 -19 13 1 -13 -16 4
4449 4 -1 -24 20 9 -15 13 9 18 -1 1 15 -1 -6 21 18 15 12 5 11 16 -2 21 -1 11 0 3 31 -16 -12 -11 17 7 -11 -3 -15 16 -1 5 6
4488 6 9 11 -20 4 -11 -5 -17 5 32 4 21 1 8 21 -3 2 -14 -4 17 0 1 6 0 5 10 5 5 6 -10 1 2 4 21 28 27 9 -31 40 -15
4527 -15 -7 -4 -6 -1 18 -8 -15 19 4 7 9 1 -5 -3 6 19 11 1 -10 2 -11 13 1 18 -6 7 -29 12 13 -17 9 -2 0 6 35 16 -1 21
$$ packed form
4274a7K5k3OJ3qK5l5jK5Ml5J2oJ1K4l6LJ5J0m8K8L4l6L8l5RJ6j8k8L3k1j7K8n
4308a0J4Lk9J9pKrK8Pl6M2k7pj8J5LJ8J8j3l0K0k0Rjj7N5l6J9j3NOj0pK8j5K4
4344C0l0l2K7J1J2k4KK4J9m6J3kj3j7N9m7J7k2NJ2%LJ2j5lJ9k7nJ7J1jjJ9k7k9
4379b9K1K6l7K4j7J4J0rJ3kk3K2LJ5k0jj0J0Qpl4M3m0K4J1J4k3j9k0L6k2K3OP
4413A7l9N0l1j2j0L4J3nrnJ7j1Lk7J4J4j0LkJ6Qk8lJ1J8l6kK2j2oj1L2j2j4lK0
4449Dnk3M4j1k4K8mRj9KJ4j6nK7lllpONj8K3k2J2j1LK8m7MJK8j0j8Qj2L1j7OJ
4488FLKl1K4j5Oj2K2K7k8J7k0PJ3k4Nj6J0K1j7JNoNNn%Jj6J1JKJ7Pjj8m0P1n5
4527a5QLkNJ9k6pL4j5LKqoKRJ3qj0j1J2j3K4j2J7k4J3l6M1Jl0K6j1KOK9j9j7K2
$$ plain form
4565 21 22 11 -7 2 9 8 24 -5 -16 14 24 25 -20 17 7 16 -11 20 23 4 4 -8 16 27 -5 49 6 18 33 6 24 13 27 7
4599 7 -22 -7 -4 7 18 -6 6 3 34 -7 -23 -13 19 -3 10 9 2 5 13 26 4 11 -19 21 19 3 13 3 -17 20 -4 11 13 18 12 31
4635 31 10 8 13 -10 9 11 -5 11 -17 -33 10 -10 -3 -11 -4 -35 -3 -14 -9 -27 -4 10 4 6 13 12 9 -4 18 14 -17 -4 7 29 7 -5 13
4672 13 -2 -1 16 9 23 7 3 -9 -2 -5 -1 -6 -12 -8 -24 8 3 -3 1 4 2 -15 22 3 -16 -26 0 -10 -26 13 -6 17 7 3 -13 13 -14 -16
4710 -16 16 -9 4 17 19 -8 -16 -12 -5 -1 1 -26 -15 6 0 -16 10 17 -15 -2 -9 -13 -10 21 2 13 11 3 -12 9 13 3 -24 10 -12 0 0 -6
4748 -6 16 5 8 17 26 13 3 3 12 -1 -13 5 0 1 -37 -6 46 -16 -21 17 -14 7 -11 26 -17 -15 -1 -4 2 -8 14 -5 8 12 18 13 6 7 4
4787 4 10 7 -8 18 8 15 21 21 18 -3 -26 -11 -23 23 4 -9 10 -6 1 -2 -6 7 -12 5 5 -13 -6 -16 -3 21 -10 -8 -11 -8 11 29 9 -6
4825 -6 -8 1 0 2 19 -13 -12 3 -10 0 -7 11 -22 19 5 -3 4 -8 -14 -37 -8 -14 -14 -16 -10 -19 -14 1 11 6 -12 -21 -16 10 10 7 -10 -3 9 12 27 4
$$ packed form
4565B1Jj1j8RPjJ6k9j1L0J0Jm5L7j0Rk7L1Lj9%j2K4J1l2N4m3J2J5k7J8j1J4k0
4599Gk9J5LJ1J1k4J2lL1m1j6J0L2k2J3jpLQJ3k2Pl0M0kj6J0j0k0L7k4J5KNoJ9
4635C1k1kNk3J9Kj6J6k8j6M3k0PqPl1L2j1Nj8K3J4oKPjlj3K2ml1J3J1K2k2j2J8
4672A3j5JJ7pJ4j6mj2PlMnoMj6L2noMLkj7L7j9j9j0K6j0j6L9j9K3j0mj6K6k7k
4710a6L2k5J3J3Kk7qMPMKk7J1K1oj6K6Pl2J3pmLL1j9J1kqj5K1Mj0k7L4k2J2%o
4748fK2j1LRRj3j0%Rj3j2J8nJl8L1N2o2nL8l1K1j8L7m3KJ4lOj0K2j9J3MOnpJl
4787DOlj5K6j0PO%lk1k3J5j2M6j9j3J9j6PlmJ3j9J7%j8Pj0J3K4l1KlLJ9J8k0j5
4825fkRjKJ7l2JJ5j3J0pJ8l3M1j4qPj2ok3K9o%kOrNJ5J0nj8rNK6%lj7PJ2LJ5k3
$$ plain form
4867 4 10 2 18 17 2 -6 13 5 -15 18 4 -3 -7 17 -9 -16 3 -16 -37 -15 -3 -22 -2 12 -10 0 25 -13 9 13 -20 6 6 7 34 16
4903 16 -5 12 3 6 8 -3 -4 -14 11 -5 16 17 27 15 10 -8 1 24 12 -6 -9 -3 9 -16 7 33 22 8 -3 -8 32 21 4 7 3 -8
4939 -8 4 20 1 -3 19 5 -18 -2 5 5 -10 -10 16 11 5 10 6 7 -2 7 9 -6 -7 15 3 -8 7 -7 -35 -29 -12 -19 -24 2 -11 -17 18 -17 -4
4978 -4 -9 -25 3 -1 10 25 1 -11 10 -21 30 -1 -9 25 28 7 3 23 -4 28 17 18 -4 6 -11 -20 -24 -2 -11 -1 10 19 9 -18 7 -8
5014 -8 -11 -13 0 5 13 17 -24 -4 16 -3 4 -11 -8 6 34 8 14 21 14 16 1 -9 18 -7 5 -17 4 29 -2 -2 15 -12 -17 11 -15 7 1 4
5052 4 8 -12 -1 6 -12 -4 7 12 22 12 -12 10 9 5 11 -2 8 -15 1 7 -7 21 -1 13 11 -11 35 -17 -15 6 0 6 0 3 -14 16 -24 20
5090 20 10 -1 11 25 16 20 10 1 -2 3 0 21 -11 13 9 -7 -5 2 22 26 27 21 0 -11 4 8 -13 -11 -2 9 14 1 18 12 5 -21 1 11 -3
5129 -3 2 -14 -5 2 -7 2 -4 -20 -4 -1 -5 1 28 19 -10 35 -21 26 9 22 -5 -4 -11 -3 -11 -12 13 -2 -1 -22 10 5 -5 14 10 32 9 29 -15 -45
$$ packed form
4867DOqJ6jj5qJ9qk0L3j4pmK4k6pJ9j9k1K2J2j9K0J4k2J0K5l8K2Ml3K6%JK7j8
4903A6k1J7rLKj1jj0K5j6K1JJ0j2nj8RK3j2j8lOJ2k5K3K6j1j4j1nM0j1j7Lmj1
4939hJ2J6j9mK2j4k3J6P%j5%K6noNmJrRKj5jK2j2j1J5j4k8OJ7pnK6j3oL5l5J3
4978dnj6K8mJ1J5k4j2K1l1N1l1qL4Lk1mK0k7L2j1Jk2J0j7rmK2rJ0J1Rj0k7K5j5
5014hlkJ3NQMm1K0K0j9Pj5LJ4K8k6OPpKj5j0K7k5J2k2K1K5l1%J7k7nK8k6K2oL
5052DMk0J1Pj8QJ1NJ0j0k4K2jmOj3J0k3J6Oj4K8k2J4kk2M6n2KK1oOoLj7L0m0M4
5090B0j0j1J2J4rMj0rlNlK1l2K4mj6KPK0MJok1j1J5Mk1KRJ1Nj3J7opk6K2J0j4
5129cNj6RPrRoj6J6LmOK7rk9M5n6M7j7J3k7JpQqjK5j5Jk1L2nj0J9mK2k3K0m4l0
$$ plain form
5169 -45 -10 30 -22 -7 11 -11 -1 -11 -17 4 -1 22 9 -13 10 13 24 27 36 23 -2 22 20 16 9 -24 11 -4 13 10 33 7 15 8 35 -13
5205 -13 9 20 13 11 -3 -12 6 13 5 -5 -20 19 9 23 -7 15 13 3 -2 36 7 29 8 10 -4 36 14 17 3 11 13 34 28 1 7 -5 19
5242 19 -9 4 10 -4 -18 -4 4 -9 -6 5 -17 -22 2 6 12 10 -22 1 4 -27 -16 34 16 18 6 24 2 6 -5 20 26 3 28 22 8 -15
5278 -15 9 11 6 -19 -23 29 13 23 23 -10 -19 6 6 3 -20 6 -3 5 2 1 3 -1 16 10 21 -9 -5 5 0 27 38 -1 -20 9 15 21 -11 10 4 12
5318 12 13 -18 -2 -2 -7 -1 9 -1 15 -9 -5 -4 -1 13 -21 -18 21 12 6 -11 11 2 3 9 6 18 -1 28 27 0 -10 -19 -12 3 28 0 16 26 2
5357 2 4 0 -4 18 -17 5 0 34 21 -15 7 12 11 8 2 -7 -1 -3 -6 -10 4 -9 0 2 -7 -6 -3 -7 -28 2 5 15 15 20 15 12 2 -2 14 39 9 5 -7 2
5401 2 -3 19 13 11 -2 12 6 1 -13 -8 11 7 34 4 22 -11 30 7 23 -17 9 -14 -28 18 27 10 16 55 20 47 -3 -3 0 3 10 7 14 15 1
5440 1 7 -17 2 10 -3 -4 -2 19 -16 23 12 -29 -19 -8 -13 19 19 3 6 16 3 10 -19 -13 -4 -8 8 1 14 9 -4 7 23 13 8 5 0 6 7 5
$$ packed form
5169d5L5M0n2J5J8k2J0j0oK1nK3j3k2K3LJ1LRj3k5K4kmpl3L5j5J7lK3k6QpK7m8
5205a3K2J1pkj4rJ8Pqj0j5L9j0J4l0K2kj0nL8k9K2k1Kj4M0k2Lj4QKK1ok7Oj2K4
5242A9k8J3Oj4j4J4Qj3LJ1k2nK4MOkl2K3Ll1J1N0j8Kj2J8k2Mj1K5Ok3K5oj4k3
5278a5K4Knk5mN2j6J0%l3rK5%lk3K6rQljKmJ7oJ1l0MJ0nK7J1l9j9K9OOl2K1oQ
5318A2Jl1J6%nOJ0j0J6k4MJLJ4l4LL9roj7K2rJOlJ2j9K9jk7j0rPJ5K5k8J6J0k4
5357BKmmK2l5K2nL4j3l6K2NjlorOklmJ4j3RKrJLmk1L0LJ0%Nnlj0mJ6K5l0mj2R
5401BnK2okj3J4onj4NJ9mK7l0J8l3M1k3J6m0K6k3j4M6Rj7OL9l5K7n0%LLPlPJj4
5440AOk4J9Qj3jKK1l5L9j1m1J0J1nL2%j6LJ0j3Pk9ORmJ6pJ3nj3J1J6j0nlnOJk
$$ plain form
5480 5 9 14 1 26 12 -4 14 5 12 4 19 -3 1 9 -13 -10 -5 6 4 5 7 -2 23 9 7 -7 6 9 11 25 12 -5 -3 7 37 -3 -2 22 14 2
5520 2 40 3 -2 6 2 6 5 -2 -49 -11 -17 -1 9 2 -14 -15 14 4 16 10 -5 17 9 -5 6 -7 -2 -4 10 7 21 17 -10 20 11 -3 14 0 2
5559 2 -10 -1 13 8 -17 -7 13 27 21 6 19 18 16 -3 0 7 -17 3 -56 2 4 -17 14 16 28 19 24 -6 -11 -27 8 -27 21 7 -8 -15 1
5596 1 17 -14 -13 5 8 1 7 7 22 -9 -5 -15 1 22 20 15 13 -14 26 17 -17 10 25 11 -7 11 -6 5 1 -15 -6 -3 9 6 1 25 8 18
5634 18 22 14 -7 -2 1 -15 24 7 0 20 -7 -2 14 -2 4 -32 -4 -14 -13 -4 -12 9 -6 -6 -22 -8 14 8 -12 13 18 12 -17 -15 -7 -13 -22 33 8
5673 8 23 18 8 7 8 28 -10 23 -14 -6 -21 -26 15 -3 4 30 18 15 -4 5 3 -23 31 16 6 14 -16 27 21 5 25 8 12 15 2 -8 5
5710 5 4 22 4 18 25 11 0 12 24 16 19 27 0 8 1 9 -1 -7 -21 8 -13 2 4 -5 24 8 -11 -18 -6 -6 15 19 16 -7 26 34 20 20 2
5749 2 15 8 20 7 16 0 18 36 14 18 6 7 27 17 7 -12 -13 -10 -11 13 -6 2 5 -30 4 14 -5 3 -13 7 -8 -3 11 -5 -11 -4 19
$$ packed form
5480EMNj3K5j4j6J8rPqJ5k2MQk2LNJ1kJKrK5j4kj4J3LKJ4j3j7KJ0L0m0JK4qj2
5520BL8l7nQmMjpm7L8oJ6J0pj6jK9j0J2oj5K2qj4J1j3NkJ4lJ4mk7L0rj4J7j4K
5559Bj2RJ4nk5J0K0J4oj5J3jkj9LPk4K0n9N8Kk1L1KJ2rNl0nj6L5l5M8j4j5pJ6
5596AJ6l1JJ8LpO%J5l1Mj0J6K1knkk7M0rl4K7J5j4j8J8j7J1mj6RLJ2lnK4j7J0
5634A8Mqk1NLj6L9j7pK0k7NJ6j6Ol6K8j0JRqK1j5%j6J4K2ok0K5Nok9KQorN5k5
5673HJ5nj0jJK0l8L3l7Qj5nM1j8PK6j2lj9Rkk6N4j5j0Ql0M3oj6K0j7MLj3j0J3
5710EjJ8j8J4Pj4j1J2J2qLQk7QpQj0oj4K9k1J5KrK9j6j9pJ2%K1Mlk3L3Qj4%j8
5749BJ3pJ2j3Rj6J8J8k2Mj2JK0j0j0j9jLjK4j9QLl5L4J0j9Qj6K0j5NJ4j6oPK3
$$ plain form
5786 19 -17 1 10 5 29 -9 23 11 -11 -3 21 3 10 15 12 -1 6 -34 4 22 -3 9 -20 0 11 -3 -15 6 15 37 -11 -9 -17 1 -6 -14
5822 -14 -1 25 11 -9 9 10 -2 19 17 -4 -2 7 27 24 41 -2 27 19 14 -24 9 -4 -10 -3 0 4 19 12 -2 32 -11 1 7 -6 -13 13 17 1
5860 1 13 -10 16 10 -2 14 19 15 -1 15 -4 -3 25 18 -9 18 30 10 8 12 11 9 4 -16 -3 30 6 -11 1 -4 3 25 17 16 6 -1 -22 5
5898 5 16 -16 9 18 5 -4 3 15 19 -25 10 -9 9 32 13 -2 -15 -16 17 23 16 27 -14 16 8 27 14 6 -13 -7 -21 22 6 0 9 -8 7
5935 7 10 -12 -13 24 -16 2 23 -26 -19 8 12 -2 -17 3 5 24 14 14 2 -2 2 -6 -3 38 9 -11 -8 -1 7 0 -5 -7 17 -9 -3 12 -11 16 14 -1
5975 -1 -1 -14 -33 -13 5 -11 -17 -29 3 2 14 -10 -8 -20 1 14 19 -2 14 21 36 9 4 -17 -18 -16 0 -15 6 2 -4 -11 32 24 -21 10 1 9
6013 9 12 -14 -22 7 8 5 -37 9 10 13 -23 8 -5 -1 19 8 22 12 -12 -6 32 -11 13 9 0 11 8 11 20 30 8 -5 -37 -21 37 2 -4 -5
6051 -5 6 -20 9 8 -11 -20 -8 -3 -2 -10 13 18 24 21 28 -16 -1 -1 3 14 19 10 18 -3 36 18 20 14 21 18 8 0 31 8 -13 -1 -10 -20 19 -1 -19
$$ packed form
5786A9l6J8RnK4l8L2j2k2QK4j8PNlj3Pm0L8J8k5J2k9K0J1j4j2K1RK2m8KqJ8pq
5822a4J3K6j4k0J8Jj2K1kk1KRK0lJ7m3K9qnl8L3j3oPLMJ5pj4L4m3J2Oj3pK6Mj6
5860AJ2k3K6oj2J6Nmj6J6j9JK8pk7K7J2k0kMjknk0J3L3k4j7J2nPK2qjj0pk1K7
5898EJ1l2K5Rj3rPJ2Mm4L5j9J8K3j9j5j3jL3OpJ1m1L0qJ9j3qj9Oj4M3j6oRj7J5
5935GLk2jL7m0J8K1m9PK7Mj4j5K0KJ9j0%j2mMqLM1k9k0LPQpnkK4k6OJ5k3K7kj5
5975a%j3j9K0J8j6oj2L2jJ2k4Kj2K1J3Nk1J6PJ5k7nk1jKJ6j5K1mopM3qm5L1rQ
6013ILk6qK9Jlm2M6JLl6L1j3MK0j1J4j0k4OL8m3K4mrJ1lLRJ0k2j3l2J6N8l5oj
6051eJ1k6K9jj9rJ2NJqK3NOlPm4J5%MJ1NrQk1L9j8KoPlj0qL1k3k1J2rj0L9k0j8
$$ plain form
6092 -19 -13 32 8 2 -8 -10 -17 -1 8 17 0 -8 5 -6 -2 2 6 7 9 4 11 16 1 0 -8 -13 20 -3 -9 -4 11 19 13 -18 -14 -2 1 13 21 -22 4 4 -2 4
6136 4 11 8 9 5 -21 -8 10 -23 -1 6 12 36 16 12 6 17 10 -10 -3 11 30 11 22 -5 -7 -6 21 9 -21 -8 8 11 8 10 -10 -2 1 3 -14 16
6176 16 11 -15 -4 -8 10 20 -5 -11 -3 17 -8 -1 2 16 -7 4 11 15 4 3 19 6 16 10 21 2 8 16 2 -23 -6 3 -24 -8 -16 14 8 -13
6214 -13 -7 -8 4 14 -7 -16 -9 9 -7 7 9 -31 -12 12 9 17 21 33 14 2 20 7 -3 2 7 10 5 20 -5 3 2 13 -12 -44 6 -1 -6 -1 23
6253 23 19 -20 -9 -28 4 -6 5 17 -1 6 -17 15 -11 17 22 32 16 -4 13 9 -10 -2 -13 7 12 -23 13 30 12 15 19 9 20 9
6287 9 10 0 18 14 -4 23 -1 -3 27 4 -2 -5 0 -14 -9 13 -2 20 -11 14 -1 8 14 11 35 11 4 1 37 8 -21 9 31 12 -4 -9 -6 10
6325 10 -15 -4 2 -2 -12 -5 -7 8 -3 7 7 -11 3 12 8 5 -4 -1 -18 12 4 -2 -1 22 9 -28 8 -1 13 8 6 6 15 3 -8 4 15 -5 7
6364 7 15 19 14 16 -1 -2 -10 35 8 -32 6 2 -35 -4 13 23 -2 14 5 -3 14 21 14 6 21 -8 -13 4 -2 10 29 6 -20 -9 9 13 7 9 15 9
$$ packed form
6092a9OM5k4oj0kpJ6RRj7qJ3j1MMMJKnPNj5jqnL3k3oNJ5Qol1MJ2LJ2Qm3K6%oO
6136DPlJmk6J3J8l3K2POK4k0moJ1pk0PJ4J9j9J1k7kJK7j2l0J3J6LlKk0QLKj7L0
6176A6nk6J1mJ8J0k5oQK0k5PLJ4k3J1PMj1jJ6j3J0oJ1j9OQj4k5J7Rk7J6qL0ok1
6214a3OjJ2J0k1rPJ8j6J4Km0J9K4lQMJ2j9j2J8j3j0NNLnJ5k5QjJ1k5l2N0pnNK4
6253B3ml9J1j9L2j0J1J2j8Pk3L2k6K8NJ0j6k0J7mj9Qj1K0Nl5L6J7j8LMj0J1j1
6287IJj0J8mj8K7k4kL0k3olNj4NK2j5K2l1K5j5ROlK4k4plL6k9k9L0K2j9j6nLJ6
6325A0k5J1Omj0PkJ5j1J0%j8J4RmlrLj7L0qoJK3j3l7L6rJ4nk%Rj2j1J2J1k0J2
6364GQMnKj7jqM5k7m0L8ml7L1J7J0k5J6rqJ7PpqJ5k9nJ7oJ2J9k3k6J1J8MoKOo
$$ plain form
6404 9 11 0 14 34 22 18 6 -2 -16 -19 -2 -18 6 -2 33 10 -23 3 10 -10 20 10 -4 8 -13 13 15 8 0 20 21 28 25 6 6 -6 17
6441 17 19 11 -5 0 4 -20 -4 2 -20 -14 -13 -4 8 15 -12 9 19 -15 -18 8 -2 13 19 12 -5 12 -14 -8 23 3 0 5 -1 -8 -11 10 13 -2 5 7 -8
6482 -8 20 10 20 10 -8 25 23 14 -14 -7 -7 -9 -3 13 -12 -3 3 12 10 9 12 -19 -12 -13 -12 4 35 19 26 9 19 15 18 3 8 13 -26 4 2 20 1
6523 1 11 2 3 3 1 -4 -24 -20 -10 -4 -25 -5 -3 9 4 20 9 -12 41 23 2 -8 -11 11 4 4 4 -11 10 26 -2 -10 15 17 -1 8 8 24 4
6562 4 4 10 -9 13 11 -13 -9 -29 12 -8 -3 -1 4 -13 6 13 -12 5 0 -8 -34 6 5 2 3 -3 -7 23 20 11 -9 18 8 -23 19 -3 -14 18 21 33
6602 33 25 -1 -1 9 5 9 -13 -15 6 -22 -19 5 -15 -26 -9 7 -5 15 18 3 2 -7 -9 -6 15 -16 -2 -5 13 4 10 9 21 17 13 33 10 -7 -7
6641 -7 15 21 17 3 9 -2 9 -29 0 -16 17 5 -27 -13 -5 -17 -15 16 13 2 10 -22 -4 19 35 8 -4 4 -18 12 13 -6 -1 17 28 18
6677 18 -8 -18 5 0 17 16 17 11 12 1 -8 -1 -10 -1 -16 25 -10 2 -24 -1 1 -8 17 10 -9 7 31 -18 -4 4 16 20 6 9 -1 29 28 19 35
$$ packed form
6404IKj1J4K0j2mj2qj4lJ7j6K4qL5k3l3K6Pk0L0j0j4J2k1K6KpqK0JPlj9%j2K3
6441A7Kqj6NMk4J6Ok2OJRJ2Pk7K1J0l4lK6j0J5Opj7J7k6OL1k0lNoplK1Lj5PKj5
6482hK8j0J0j0j8L3krk8P%kOJ6k5RORkjLl1PjJJ6L1j6Pj7J0mLj5NNl9L0kJ8j9
6523AJ0rJ%knk0MJ0Ok1K0KJ2nJ6j1k1N3j8k1j0lK2p%%j5K1J6k8qK5Kj8R%J6k0
6562D%Oj9K2kk4Mk0M1k0NKNj7J9Pk5J7nqk6M0jlJomL0lrk0K7j0l1M2k2j1L2LJ2
6602C3qk6%J0mMk2kK1k8LK4k0j1J7J6j2K0Lj5jrkLK1l1J4lJ8rOjJ2mmK0k3j7%
6641gK2Omj4Oj1J1l8K9j6L3j2l2J4Qj2KL1lj1Ql2J8K3J6k7j2Qk2L0Jj9NJ8J1j0
6677A8k6j0K3nJ7jJoJj1rPrRj5M1l5J2k6K3KrK5pj9J6K4m9J4QJ2Mj4Lj0L0jrJ6
$$ plain form
6716 35 12 2 24 31 -3 10 -4 14 -4 -13 2 -14 -13 22 1 23 2 -2 -16 6 5 -2 -2 -18 24 4 -5 1 -11 3 16 -9 13 21 -2
6751 -2 1 -5 33 13 -3 9 4 -11 20 -8 2 6 12 4 25 -1 -9 23 -11 -6 1 -32 8 -15 -21 6 0 15 1 10 -21 22 6 5 -6 7 8 23
6789 23 4 9 12 -11 18 -3 5 -18 19 5 5 -13 5 -13 1 7 2 -23 22 -3 17 -11 -7 4 -11 35 -3 -20 -5 16 15 -1 14 20 21
6824 21 -1 3 3 25 -12 -3 5 2 -10 -5 8 25 -6 19 1 16 25 -10 -6 26 15 13 3 -17 -17 -12 -12 13 8 -3 -4 5 12 -17 -18 -1 -24 -14 -19
6863 -19 -18 -4 3 0 -21 16 -8 -10 8 -21 0 11 8 1 0 5 -5 -3 25 -5 -17 -1 -6 -12 14 26 -12 -25 -58 -25 7 4 -12 23 -1 -20
6899 -20 -24 -2 -11 -1 10 -2 18 7 13 10 -4 -5 -19 10 -4 -14 -17 9 12 -8 17 14 29 13 -4 -15 -14 8 -3 -1 -7 -13 -8 -11 -11 -25 -1 -16
6937 -16 -17 -24 -17 -28 0 -3 3 19 8 18 10 3 1 3 7 -25 15 -28 19 14 5 18 36 8 15 11 4 -8 -15 3 -9 -4 -16 -19 -2 -4 -2 -5 -12 -9 0 -3 -20
6980 -20 -8 -16 7 -8 -20 0 13 -11 -19 -20 6 -9 10 3 6 5 -7 3 21 0 -1 -7 17 30 1 -12 1 -10 14 5 -12 12 -9 14 -15
$$ packed form
6716C5k3j0K2Pl4J3j4J8j8rJ5j6JL5k1K2k1mj4K2jp%j6M2k0rOj2J4J3k5K2Qk3
6751bLoL8k0j6J2nj5L1k8J0MOqK1k6qL2l4NPl3M0k3oK7oJ5j4Rl1M3j6jj1J3JJ5
6789B3j9NLk3K9k1Qk3L7j4%j8J8j8J4Onk5M5k5K0k8MJ1j5M6l8j7J5K1jj6J5OJ
6824B1k2M%K2l7RQlj2NJ3J7l1K5j8J5Rl5ML2j1kj0k0%N%K5nj1jRPk9jJ7k3J0n
6863a9JJ4Plk1L7k4kJ8k9K1J1lpjNj0KK8l0j2J6noK6J2l8j3l3L3L2lj6L5k4j9
6899b0mK2rJ0J1j2K0j1Olj4jj4K9j4j0lK6Lk0K5lJ5j6j7j1JK2j1KooNl%j4K4j5
6937a6jpPj1K8lOJ6j1J0qpkKMl2M0m3M7nrJ3J8k8Pmpj2pJ8j2Nj2lJ7kKlpLRlj7
6980b0J2qK3j5j2K0J3k4qjK6j5J9pLjj2J0J8k1joK4J3k9j3J3j1K4rj7K4k1K3k9
$$ plain form
7015 -15 -16 -2 4 5 -2 -13 0 -11 18 13 23 10 0 -11 -6 -13 3 -16 8 25 -1 3 5 27 -2 -13 14 -3 -16 -15 4 -5 -37 12 -5 22
7051 22 -6 -8 1 3 -11 -27 -22 -21 -25 1 0 -13 9 -14 -11 -10 7 -26 2 15 -12 -12 -10 8 -12 -6 0 27 -11 6 -8 17 20 12 10 9 -2 -4 -4 13
7091 13 21 17 -15 -27 -5 -25 -8 -20 2 -4 5 -22 -18 13 11 9 -1 11 -23 0 -2 -8 -19 -16 1 11 13 20 13 -1 7 12 0 9 -17 2 6 2 -4 6
7131 6 22 -12 -17 -8 12 18 -8 8 14 -16 19 4 -6 2 -12 14 26 5 7 -2 -21 -8 23 -2 -17 -22 4 13 39 -4 9 5 4 -5 -15 -6 7
7168 7 8 -10 -8 -11 2 1 -21 5 -15 -12 -4 9 7 2 -7 1 -16 -3 -15 15 0 10 1 -14 8 -3 -5 3 -10 -30 -5 -19 15 28 12 1 11
7205 11 -6 -14 -7 -34 -23 15 -13 -1 39 -20 -7 7 -8 8 -11 -5 -2 -30 -25 -26 15 6 -12 -11 10 9 -9 10 6 10 10 24 3 11 17 -8 -20
7242 -20 -18 4 8 -14 -15 -19 -22 -26 -9 -3 -9 -9 29 -21 5 26 9 16 -6 7 1 1 -10 13 20 5 18 -19 4 -2 0 -11 17 6 9 8 7 16 3 -5
7282 -5 24 25 1 -4 11 -11 -20 11 14 -2 -7 -6 13 12 -9 -19 26 6 0 -31 -24 -13 1 -4 22 15 -13 10 7 -8 -4 9 -1 -12 -18 5 -4 10
$$ packed form
7015a5jJ4OJpj1J3j1K9nJ0j3j0j1NpJ6j9K4J7k6MKK2k9j1K7j7j3JJ9rl2M9j7K7
7051B2k8kRKj4j6NJmK6jj3K2k3LJJ7l3K8J3k7%KJ8k0OOK7l8J7j4K5Lqkjj1k%J7
7091A3Qml2j2K2k0J7j2K2oRk7ML1kkj0J2l4K3koj1LJ7J0KPpj4QNj2Rk6J9MmoJ0
7131FJ6l4nRK0Ok6J6Ol0L5j5j0Qj4K6J2k1Krj9J3L1k5j5nK6RK6m3J3mjrj0RJ3
7168GJj8KlJ3jk2K6k0LQJ3knrQj7J3j2L0j5J0rj5K2j1kQj3k0K5j4L4J3j6j1J0
7205A1j7qPk7J1L8k8J2M0n9J3J4j5J6j9OLk8NjM1rj8JK1jj8J9mM%J4k1QOk5j2
7242b0KK2Mk2jmlmJ7Oo%L8n0K6K1j7Pk2J3o%j1K3Pj5J3l7K3oKj1K8j1LjjRj3q
7282eK9Jk4nJ5k2rL1Lj6nJJ9jk1j0M5k0ol1PJ1J4nK6pk8K3lj5MJ3j0j1oK3rJ4
$$ plain form
7320 10 4 16 22 5 2 25 12 0 -16 1 10 2 -8 -17 7 5 -20 -19 -4 0 9 -3 -7 1 17 -10 23 24 20 0 26 23 12 -3 36 13 12 -10
7358 -10 10 21 21 -5 18 10 31 -12 8 9 -2 -14 14 5 -16 11 -19 -24 -17 12 13 1 1 -5 -18 10 -12 -4 -36 22 -1 -6 5 -9 6 5
7394 5 -22 11 -6 -23 26 -2 19 1 13 30 -16 -3 4 9 5 4 13 22 -14 8 5 13 12 0 32 17 -17 -18 23 -32 9 -22 2 -5 -3 3 -9
7431 -9 17 -2 -3 -25 0 7 -4 9 -9 20 21 -14 4 23 -8 4 -3 -8 16 13 11 -5 12 -2 -10 6 -21 5 14 -19 -2 -4 -1 -30 6 11 5
7468 5 1 1 -1 5 7 9 7 2 4 19 39 8 35 20 6 3 8 27 12 -6 -1 -1 26 -12 2 8 -19 2 8 7 17 -18 -15 -16 27 -32 19 -5 -5 -15
7508 -15 11 -4 8 18 -12 4 2 -5 12 3 21 6 -5 0 -9 -3 22 -5 4 -3 25 -9 -11 4 -6 -6 -1 6 12 -8 14 -14 12 -24 -8 -3 12
7545 12 -7 16 7 -5 6 40 11 -12 2 33 -4 11 20 1 14 8 -18 17 14 29 20 13 -5 -1 5 -13 17 3 16 -9 -5 3 -9 10 0
7580 0 7 6 11 -11 -6 -8 1 5 10 -3 4 -10 -14 18 18 7 1 26 0 -9 1 -13 22 25 3 12 -25 4 1 16 3 -13 19 23 4 -16 -18 18 -7 -4
$$ packed form
7320A0oJ2Oj7lK3j3j2j6J7Rqj0rK4kk5JJ5MRj2mQJ6k7L3Jmk0K6lj1j5L9k3jk2
7358a0K0J1%k6K3qK1m3K0Jj1j2K8rk1K7l0nPK9Jj2%oj3K8k2Ql2N8k3nJ1j4J5j
7394Ek7L3j7j7M9k8K1j8J2J7m6J3PNmjRRl6K2lQjj2L2j5l4jM1n5M1l1K4pKOj2
7431iK6j9jk2K5Pj1J3j8K9Jl5J8J9l1J2pnK4lkj6J7j4qJ6k7K6Rl3J7kLk9L6No
7468Em%kOKKknKJ5K0l1K7j5j4lNJ9j5j8N%K7l8J4Ok7K1OjJ0l5LjM3n9N1k4%j0
7508a5K6j5J2J0l0J6kpJ7rJ8j5j1NrOK5k7RpK8l4kJ5j0%NPOk0K2k8K6l6J6NJ5
7545A2j9K3rj2J1L4k9k3J4L1l7J5Rj9J3ok6L5lJ5rpj8MOj8L0j4J3k5MQj2J9j0
7580@PjNk2NkRMNj3Pj4mL2%j1oK5k6rJ0j4L5Lk2Rl7K9lJ5j3j6L2Mj9k0kL6k5L
$$ plain form
7620 -4 16 8 19 10 -17 -7 -2 -3 11 -1 8 6 -6 13 1 -9 11 31 -5 11 27 15 13 11 -8 -13 35 2 -19 -13 -20 8 13 -2 -14 9 11
7657 11 -20 -17 10 -1 -6 18 8 -19 12 -3 6 -9 2 10 26 -1 -1 -5 -11 4 22 14 9 10 12 23 18 -3 6 -2 22 6 23 -14 -3 12 -4
7694 -4 -28 -13 -4 -32 9 4 -13 2 -21 -7 9 14 -7 5 10 -3 -2 -19 -1 4 10 14 26 12 6 -18 0 2 -11 5 4 -14 -6 -6 26 6 5 4
7732 4 6 -18 11 -15 16 4 -1 0 0 10 -6 -22 22 10 -2 26 0 -4 7 -4 33 -1 23 27 18 -20 -31 2 5 28 4 -17 -16 8 9 27
7768 27 8 20 27 -5 10 20 13 17 -1 -12 -8 -14 7 -11 25 -3 -2 0 -29 0 -3 -12 -4 3 3 4 -6 1 29 -1 -11 1 -11 21 2 3 -11 23
7806 23 -20 -3 4 -3 10 21 31 9 22 15 -11 16 21 22 13 13 17 23 -9 17 17 -7 -13 3 -6 -3 3 8 4 23 29 5 17 18 19 8 19 7 -9 9
7846 9 7 3 14 -5 11 -4 -1 -23 -18 -19 -7 5 12 -4 12 -21 4 -22 21 9 -18 -8 -7 -13 13 -23 -22 7 7 -5 2 8 5 -7 1 4 19 -12
7884 -12 31 7 1 13 -4 -10 18 0 -11 16 -18 7 8 -12 6 -23 -12 3 -12 7 14 -10 -11 30 2 -6 10 12 11 9 0 1 6 21 -23 -11
$$ packed form
7620dK0qJ1rk7J0NjJ4j2Rkj2J9j2j0K0K0l6J6J6j2kkj9nM8l3k1OpK8Nj5j2K3K
7657A1l1LK7j1nK4j0k7L1j5Rj5J1QJ6k7%moJ5J8qnJKJ1nk1RqK4j6J7l7J1J5j6
7694dk4J5Rk8M1nj7J5k3J4J6Nk1J2Nj3Jj7J8NOMJ2j4ok4J8Kj3J6jj8Q%L2k0jj
7732DKk4K9k6L1j2nJ%J0j6j6M4j2j2K8k6mJ1j1L7l4K4Mrl8j1L3LK3k4k1JK4JJ8
7768B7j9J2Pl2J5J0pMj8j1MoK1j8L6k8JKk9K9lrQP%Jj0PK8l0j0J2j2L2j9Jj4L4
7806B3m3J7PpJ3J1J0k2J3pk6K7NJr%MOl2K6%k4oJ6rLONmJ9Ok4J2JJj1J1j2j6J8
7846IkmJ1j9J6j5Lk2NjJ2J2Pj6J6l3K5k6M3j2k7J0JoK6l6JK9%j2POlj2QLJ5l1
7884a2M3k4oJ2j7oK8j8j1K7l4K5Jk0J8k9J1J5j5J9Pk4jM1k8qJ6KjkrJNJ5m4J2
$$ plain form
7920 -11 16 -8 -11 7 10 -25 19 -28 -17 -1 -9 25 18 15 -3 -4 11 31 -7 -3 -11 -1 -5 -20 0 1 -2 13 -19 8 -3 14 17 19 -34 -19 -6
7957 -6 10 13 6 14 6 2 13 24 -2 6 -2 29 -1 4 23 19 20 8 12 -8 -24 12 -22 -18 -20 -7 2 8 11 -13 -2 9 -3 -12 18 9 7 12 -7 2 33
7998 33 36 12 5 35 1 5 -5 -13 -16 9 13 -21 11 6 24 9 31 -29 0 -4 -31 -14 -8 12 -26 -18 -10 -13 -15 11 -13 -2 6 14 1 -9 -4 8
8036 8 21 -19 -8 0 8 25 4 37 4 5 -26 19 13 4 23 10 18 18 14 23 11 -19 5 -6 -2 6 19 -6 32 -37 13 12 12 -4 -21 8 10 4
8074 4 18 14 16 8 7 -5 21 20 39 1 11 27 -13 -7 1 30 20 -8 16 0 19 3 -2 8 6 17 -14 11 0 2 5 -22 -30 10 3 -2 5 -4 3
8113 3 2 0 26 15 23 15 14 0 14 -3 1 -3 11 5 -2 -16 7 23 13 9 10 11 -23 -2 -1 -9 -5 11 -11 -7 7 -18 9 -18 -15 15 -4 11 4 4
8153 4 -34 2 30 6 10 12 29 -10 17 13 14 2 2 -6 2 10 -4 -13 18 37 -5 12 7 -18 -25 -5 -6 14 -27 -12 12 -8 9 -9 -1 2 11 5
$$ packed form
7920a1K7k4lJ8Ll5M4m7J1J6qL4plj8jJ5K0l8MqJ0mj5K0JlJ5l2K7j1J7LKn3J5J3
7957fJ6LpQqmJ1J1k6QqL1l0NJ9mJj2Mk0j6L6l4MkJ3ROLk4J1J1j2rL0rkNj9RL1
7998C3Lk4pL0l4Mj0qlK5Ml4L2nJ8j5K2o0K9mk7J7OK0l8QQlkK6k4J1QQj3j0NJ2
8036HJ3m0J1QQJ7k1L3l3Jl1M5orJ9j3Q%mRj2l0K4j1MQJ3k5L8o9N0j%j6j7K9Ko
8074DJ4mKqjj2K6jJ9l8J0J6m0OQK9j0k8K4j6J9j6nJ0kJ1l1K5j1KLk7qM0pnPrP
8113CjkK6j1Qqjj4J4j7MmJ4opj4K3J6j0mJJl4K1JqMJ6k2MJ4k5K7k7LL0j9J5p%
8153Dl8L6K8k4MKJ7l9K7mJj2%qQQj4rL1J9m2J7nk5pK0jK0m1J5K4k0J7j8QLRo
8191E
$$ Imaginary data points
##PAGE= N=2
##DATA TABLE= (X++(I..I)), XYDATA
$$ plain form
0 0 0 0 0 0 0 0 0 0 0 0 0 0 0 0 0 0 0 0 0 0 0 0 0 0 0 0 5 -8 8 -8 8 -8 8 -8 16 -16 16 -16 21 -24 24 -29 32 -34 40 -43
46 -43 48 -52 58 -64 70 -77 85 -93 104 -115 127 -142 156 -173 194 -218 246 -280 323 -378 453
67 453 -547 673 -1702 18350 5730 5055 -3099 -18212 3042 1279 10881 8695 -10740 -7287 -5026
82 -5026 4425 10654 2952 -1318 -11356 -6088 4933 9519 6405 -5048 -8468 -7803 4073 13084 3516
97 3516 -3783 -12001 -4084 7772 5595 5840 -4863 -8546 -2658 852 11020 3105 -4319 -5383 -7537
112 -7537 5829 6095 3950 905 -11836 -3317 2894 6863 8261 -7101 -6371 -3804 952 11068 1965
127 1965 -3526 -6121 -5093 4902 4891 4068 -1447 -7441 -3647 1529 7686 3504 -2988 -4606 -5628 2313
143 2313 6297 4631 -1201 -8627 -2978 2526 5855 4791 -3801 -4686 -4341 1669 7593 1672 -1163 -5232
$$ packed form
0@%%%%%%%%%%%%%%%%%%%%%%%%%%Nj3J6j6J6j6J6j6K4l2L2l2L7m5M8n3O1o6P4q3
46d3R1j00J10j22J34j47J62j78J97k19K42k69K98l29L67m12M64n26O03p01Q31
67D53j000J220k375K0052j2620o75q154j5113K1254j763R602k186j9435L453K261
82e026R451O229p702m270j0038N268J1021M586l114j1453l420O65J1876R011r568
97C516p299q218P917J1856k177K45j0703l683N888L510J0168p915p424j064k154
112g537J3366K66k145l045j2741Q519O211L969J398j5362P30K567M756J0116r103
127A965n491k595J028R995j1q23n515n994L794N176O157m182o492j618j022P941
143B313L984j666n832p426N649N504L329j064q592q85L45O010N924n921k835m069
$$ plain form
159 -5232 -4406 2931 3860 4800 -1343 -6626 -2486 699 5691 3902 -2163 -4151 -4914 1720 5920 3223
175 3223 -1295 -5894 -2930 1707 4504 3855 -1932 -4274 -3707 1320 5306 2455 -575 -4712 -3630 1638
191 1638 3733 4326 -1407 -5018 -2565 265 4988 3240 -1444 -3638 -4257 1599 4593 2566 -498 -4705
207 -4705 -2711 1081 3450 3813 -1321 -4000 -2872 460 4341 2760 -769 -3618 -3463 970 3880 3116
223 3116 -740 -3884 -2874 609 3824 2965 -689 -3628 -3134 975 3460 2824 -504 -3662 -2659 400
239 400 3480 3061 -858 -3157 -2978 473 3647 2448 -285 -3281 -3019 782 3056 2803 -368 -3402
255 -3402 -2567 383 3132 2708 -510 -2964 -2723 411 3051 2562 -292 -3054 -2597 454 2829 2605 -234
272 -234 -2949 -2577 329 2846 2543 -289 -2785 -2445 221 2677 2530 -235 -2730 -2467 226 2598 2436
$$ packed form
159e232Q26P337R29R40o143n283M140L185M992j789o065j988p63O634M200k697
175C223m518m599K964M637K797o49n787k342N67N027L986k851l030m137J082N268
191A638K095N93n733l611K453K830M723j748m684k194o19N856K994k027l064m207
207d705J994L792K369L63n134k679J128L332L881j581l529k849J55M433K910p64
223C116l856l144J010L483L215q59l654k939M94M109K485o36l328l158J003L059
239D00L080m19l919k299J79L451L174j199k733k996K62L801K274k53l171l034
255c402Q35K950K749m24l218k454K41L134K640m89k854k762M57L051K375k24k839
272b34k715L72K906K517l03k832k496L40K666K456j47k765k495K63K693K372j62
$$ plain form
289 2436 -124 -2618 -2427 120 2597 2432 -321 -2465 -2260 -52 2414 2441 -126 -2499 -2316 103 2390
306 2390 2244 -131 -2168 -2296 -142 2505 2287 -165 -2223 -2205 51 2155 2218 61 -2221 -2181 -106
323 -106 2242 2164 -147 -1954 -2137 -255 2166 2194 -60 -2084 -1974 -70 1926 2099 85 -1919 -2182
340 -2182 -185 2153 1953 -14 -1793 -1990 -174 1801 2079 235 -2011 -1960 -24 1823 1875 159 -1658
357 -1658 -2001 -242 1860 1921 128 -1779 -1798 -180 1565 2006 235 -1789 -1859 -167 1700 1774 89 -1463
375 -1463 -1853 -407 1724 1899 124 -1597 -1756 -127 1453 1687 440 -1563 -1898 -175 1551 1743 178
392 178 -1481 -1576 -372 1397 1880 206 -1479 -1663 -218 1412 1522 336 -1283 -1822 -279 1444 1609
409 1609 264 -1381 -1487 -340 1098 1803 315 -1460 -1520 -368 1392 1516 127 -979 -1704 -399 1458
$$ packed form
289B436k560k494J91K547K477j65k753k144K05K208K466K7k567k373J83K419K287
306B390j46k375k037j28K154K647k18k452k058J8K256K104O3k157k282M0K075
323a06K348p8k311j807j83J882K421K8k254k024J10J904J996J73k014k004k63
340b182J997K338k00j967j779j97J816J975K78j844k246N1J936J847N2j716j817
357a658l43J759K102O1j793j907j9J618J745M41j771k024p0J692J867P4j685j552
375a463l90J446K131J75j775j721j59J629J580K34j247k003l35J723J726J92j565
392A78j659r5J204J769M83j674j685j84J445J630J10j186j619n39J543J723J65
409A609j345j645j06J147J438P05j488j775o0J152J760J24j389j106p25J305J857
$$ plain form
426 1458 1376 414 -1259 -1513 -117 892 1586 516 -1351 -1356 -463 1235 1552 77 -923 -1472 -531 1249
444 1249 1430 380 -1204 -1518 -129 978 1327 439 -1083 -1387 -359 1019 1429 266 -1003 -1232 -541
461 -541 978 1523 220 -943 -1392 -382 1155 1083 491 -806 -1601 -165 937 1331 447 -1251 -967 -349
479 -349 644 1481 239 -750 -1239 -600 1104 1083 441 -733 -1439 -285 790 1222 458 -979 -1139 -407 738
498 738 1259 415 -831 -1271 -287 849 1052 319 -729 -982 -548 640 1292 368 -661 -1277 -385 856
516 856 956 532 -704 -1203 -279 585 1240 395 -836 -950 -508 731 1103 255 -596 -1058 -351 608 943
535 943 484 -589 -1050 -499 684 1139 295 -580 -1036 -320 613 840 589 -667 -1034 -335 502 1164 254
554 254 -608 -755 -561 681 874 309 -286 -1106 -357 536 822 654 -696 -946 -314 411 1058 278 -519 -756
$$ packed form
426A458q2r62j673k54J396J009O94j070j867nQ93J698L17j475j000n49R41J780
444A249J81j050j584l14J389J107L49q88j522l04J028J378M10j163j269k29O91
461e41J519N45j303j163m49J010J537p2n92j297p95J436J102L94q84j698K84O18
479c49R93Q37j242r89m89O39J704k1o42j174p06J154J075M32p64j437j60P32J145
498G38N21q44j246m40R84J136K03p33j048k53M34J188O52r24j029o16Q92J241
516H56J00m24j236m99R24Q64O55q45j231j14M42J239L72q48q51m62P07R59L35
535I43m59j073m61N51J183M55q44q75m56P16R33K27k51j256l67O99Q37O62r10
554B54q62j47J94J242J93n65n95q20P49Q93K86j68j350k50O32P25O47p80p97k37
$$ plain form
574 -756 -556 576 927 358 -458 -952 -323 567 769 391 -392 -843 -377 404 786 550 -484 -906 -297 371
594 371 946 396 -564 -670 -515 468 885 237 -229 -904 -433 567 609 492 -429 -829 -221 194 809 457
614 457 -469 -643 -550 375 866 314 -302 -808 -413 478 636 428 -334 -768 -279 314 749 457 -421 -698 -348
635 -348 298 717 377 -304 -634 -438 303 735 356 -272 -758 -409 390 648 402 -280 -729 -310 226 632
655 632 442 -355 -614 -383 269 717 278 -258 -577 -422 265 618 424 -231 -667 -335 245 653 421 -256
675 -256 -570 -363 246 628 338 -256 -609 -380 221 588 387 -212 -592 -332 236 549 375 -182 -582 -356
695 -356 175 577 364 -212 -562 -319 208 540 366 -193 -551 -373 197 537 352 -170 -515 -332 168 504
715 504 392 -169 -496 -336 181 496 350 -156 -492 -355 143 520 346 -192 -497 -334 106 481 353 -144
$$ packed form
574g56K00J132L51n69q16m94O29Q90K02l78p83m51M66P81L82k36j034m22O09O68
594C71N75n50r60j06J55R83M17o48m66o75M71J000M2j17r21m00O08M15O15l52
614D57r26j74R3R25M91n52o16n06L95Q91J58k08p62m34M89N93M35k92q78k77L50
635c48O46M19l40o81l30J96P41M32l79o28m86L49P99K58k46o82m49M19N36M06
655F32j90p97k59K31O52M48m39n36l19J55O87L53j94o55m36L32N80M08k32o77
675b56l14K07O09L82k90n94l53K29O01L67k01n99l80K60N68L13j74n57m00K26
695c56N31M02k13n76l50K43N27L32j74n59l58J78N70L40j85n22l45J83N00L36
715E04j12n61l27J60N17L15j46n06l36J37M98L77j74n38l05J63M40L75j28m97
$$ plain form
735 -144 -520 -337 152 449 288 -152 -457 -342 152 480 331 -114 -456 -300 117 425 352 -102 -438 -303 125
756 125 432 300 -121 -413 -339 132 423 321 -123 -420 -258 98 399 333 -108 -417 -350 94 409 286 -85
777 -85 -421 -315 67 384 313 -96 -426 -296 102 411 285 -65 -372 -308 87 388 306 -91 -396 -247 60 334
799 334 318 -112 -336 -318 88 363 282 -37 -337 -281 71 366 288 -79 -346 -251 26 342 281 -64 -335 -320 72
822 72 343 257 -53 -344 -293 23 323 311 -83 -313 -281 56 306 283 -34 -311 -276 53 330 277 -67 -277 -260
845 -260 11 304 270 16 -321 -269 46 270 286 -31 -293 -274 -35 314 251 -57 -295 -269 35 258 242 -28 -287
868 -287 -237 24 268 263 -45 -236 -260 -4 297 249 -15 -288 -263 2 235 250 0 -266 -250 -6 270 240 -20
891 -20 -258 -248 10 230 227 1 -249 -272 9 206 229 4 -251 -231 6 254 232 -15 -213 -217 -15 218 207 46
$$ packed form
735a44l76J83M89K97j61m40l05J15M94L28j49m45l42J56M17L08p3m54l36J35M28
756A25L07j32m21k92P4M71K91j02m44k97J62L56L01o6m41l09O7M44L15j23l71
777h5l36J06L82L17p1m09l30J30L98L09j26l50l07O4L95L01q2l97l05J49L07K74
799C34j6m30k24J8M06K75q1l19l00N6L52K95p8l67k67R5K77L16o1l45k71J5L92
822G2K71q6l10k91N1L16L00j2l94k30L2L37K50k3l17k77L5L29K77n3l44k10J7
845b60K71K93l4k54l37N2L15K24J6l17k62J9K39L49o3l08k38K6L04K23j6k70k59
868b87N0K61K44nl08j91k4K56L01m8k64k73K5K65K33J5k50k66J6K44K76l0k60
891b0k38J0K58K20lk26k50k3K81J97K3k25k55K0K37K48k2k47j98mK02K33j1j61
$$ plain form
915 46 -228 -251 20 241 245 22 -211 -195 -23 197 256 9 -188 -197 -33 205 221 5 -191 -238 -21 199 168 31
939 31 -205 -230 -3 182 211 44 -200 -203 -2 197 231 54 -165 -203 -54 203 214 34 -169 -246 -2 158 178 53
963 53 -184 -208 -19 151 231 30 -225 -171 -30 190 198 4 -102 -229 -56 159 164 75 -172 -216 0 127 196 20
987 20 -170 -173 -53 140 211 15 -113 -187 -55 184 157 39 -128 -178 -15 111 172 76 -146 -162 -45 123 213 20
1011 20 -147 -154 -76 151 172 37 -83 -205 -68 152 138 76 -120 -161 9 87 163 59 -103 -132 -57 108 203 36
1035 36 -127 -173 -41 132 136 78 -103 -149 -20 121 160 62 -135 -140 -23 84 145 38 -126 -132 -72 92 126 45 -99
1060 -99 -173 -57 121 159 13 -105 -148 -23 109 155 70 -111 -145 -66 82 156 38 -95 -122 -31 79 162 49 -84
1084 -84 -150 -49 119 138 44 -88 -136 -53 104 140 35 -77 -158 -78 69 170 56 -76 -146 -34 70 152 46 -77
$$ packed form
915D6k74k3K71K21Mk23k33J6J72K20N9k47j97rJ64K38J6k16j96m7K17K20l1j37
939C1k36k5K27J85K9j67k44lK01J99L4j77k19l8J49K57J1j80k03p7K44J60K0j25
963E3k37k4J89J70Q0k01k55N4J41K20Qj94j06j27J73K15Nq9k47m4K16J27O9j76
987B0j90lJ20J93P1j96j28p4J32K39k7j18j67n0J63J26O1r6k22j6J17J68R0j93
1011B0j67pP8K27K1j35j20j22J37K20j4o2j96m1J70P8P6j04j62k9P5J65R5j67
1035C6j63m6J32J73Mn8j81m6J29J41L9r8j97nJ17J07O1j07j64oO0J64L4q1j44
1060i9p4J16J78L8j46j18m3J25J32M6q5j81l4P9J48P4j18j33k7R1J10Q3j13j33
1084h4o6J01J68J9r4j32m8Q3J57L6j05j12q1Q0J47J01j14j32p0J12J04Q2j06j23
$$ plain form
1108 -77 -119 -82 87 101 53 -70 -147 -51 84 109 79 -75 -141 -44 51 121 77 -48 -104 -50 51 150 49 -36 -100 -55 84
1135 84 87 63 -46 -122 -70 67 108 43 -75 -91 -42 49 137 57 -42 -100 -54 54 106 53 -47 -112 -72 86 87 55 -60 -116
1163 -116 -31 36 100 74 -87 -119 -52 49 92 65 -49 -108 -73 38 99 49 -52 -90 -57 29 82 22 -53 -85 -50 32 89
1190 89 32 -43 -125 -50 46 108 45 -63 -88 -55 35 103 89 -41 -101 -85 54 85 49 -43 -119 -57 -2 114 55 -31 -109 -80
1218 -80 40 82 27 -31 -96 -48 47 68 59 -63 -67 -64 38 110 64 -5 -73 -66 56 80 53 -23 -77 -39 26 94 35 -43 -64 -41
1248 -41 30 63 40 -20 -97 -53 19 57 75 -29 -74 -80 -7 63 25 -19 -67 -28 23 62 38 -23 -80 -56 11 82 60 -12 -81 -39
1278 -39 20 74 70 -27 -54 -32 13 72 40 -5 -67 -57 25 33 34 -22 -86 -64 1 47 34 -26 -62 -41 13 37 64 -1 -56 -43 20 42
1310 42 34 -31 -26 -39 38 65 47 -30 -68 -46 1 74 66 -21 -45 -28 30 53 50 -2 -58 -42 20 38 36 -11 -66 -58 -15 20 23 -20 -82 -48
$$ packed form
1108g7m2L7J69J4m8j23p7R6J35K5l0j54o6R7R5P0m4j25n6N4J01R9j01q5o4M5J39
1135H4Lk4j09p6N2J37M1o5j18j6M9R1Q8q0r9n8M6J08N2n3j00o5M0J58Jl2j15n6
1163a16Q5O7O4k6j61l2O7J01M3k7j14n9L5J11O1n0j01l8L3Q6N3o0p5l2L5Q2N7
1190H9n7p5q2P5R6O2o3j08k5L3R0O8j4j30o0J6J39L1l6r2p6O2N5J16n9q6p8K9
1218h0J20M2n5n8o5M8R5K1rj22mLJ02P2m6o9o8PJ22K4k7p6n4L8O5O8n9p8k1K3
1248d1P1L3k3o0p7M4P2L8J8j04m5oP3P0l8m4m8L9N1L9k4o1n7K4O7P1k2p2o9M2
1278c9N9N4mr7k7K2M5N9l2m5o2J0Q2QJn6o4K2O5M6j3o0l6K1N4K4K7o5n5J3O3K2
1310D2qo5Nj3P7K7j8p7l8K2M7P3qq7k4J7N8K3ln2n6J6O2J8km7n5QM3L5Lm3o2L4
$$ plain form
1344 -48 1 53 78 -5 -39 -53 3 57 59 1 -43 -36 34 57 40 13 -33 -6 2 48 63 21 -18 -25 12 49 46 -10 -45 -63 -4 34 16
1377 16 -13 -41 -51 -2 27 54 -12 -61 -58 31 83 33 -19 -43 -32 22 60 37 -10 -46 -37 29 35 55 4 -42 -12 -24 27 25 5 -47
1409 -47 -28 -1 6 30 -5 -40 -32 14 18 8 -26 -71 -77 12 25 67 -20 -45 -39 -7 32 27 -1 -34 -32 26 45 31 -8 -25 -31 16 53 38
1443 38 3 -28 -38 11 41 51 -6 -42 -27 6 29 6 -26 -49 -35 -6 26 45 -9 -43 -48 -3 36 40 2 -38 -32 8 40 21 0 -10
1475 -10 -26 -6 19 56 -22 -11 -18 -5 47 42 -10 -28 -19 4 29 13 2 -23 -39 -16 15 36 9 -35 -34 -26 29 22 -5 -41 -24 -8 41
1508 41 34 26 -15 -13 21 38 28 16 -4 -10 -5 -4 21 -17 -24 -5 4 41 43 7 -8 -33 7 10 16 3 2 -45 -27 24 14 10 -15 -21 -5 -8 13 -15
1546 -15 -29 -14 -21 13 32 7 -28 -23 -12 25 24 25 -3 -23 -20 41 34 6 -15 -38 -14 19 29 15 4 -20 -10 51 11 17 -5 -23 -19 1
1580 1 0 17 1 -5 -17 17 11 -16 -19 -35 -1 26 17 -5 3 -25 -2 1 20 19 -9 -15 -11 11 29 4 -30 -27 -24 10 30 -10 -33 -53 -12 24 0
$$ packed form
1344d8M9N2K5q3l4j4N6N4Kn8m4PP0K3j7k7m6K7QM6J5m2l9pL7L7ln6l5j8N9L8j8
1377A6k9k8j0M9K9K7o6m9LQ9N2n0n2k4J1N4L8k3m7l6RO6OK0n1m6L0j2N1kk0n2
1409d7J9K7PK4l5l5QM6Mj0l4m5oQ9J3M2q7k5OL2L9nk8l3KN8J9j4l9j7oM7L7j5
1443C8l5l1j0M9L0J0n7l6J5L3K3k3l2k3J4K9L2J9n4l4nM5L9Ml8m0OM0L2j9k1j0
1475a0j6K0K5L7p8J1pJ3N2nn2j8RK3K5j6j1k5j6K3L1K1k7m4JQN5pk7l6J7J6M9
1508D1pqm1KL4J7j0j2k0oNJK5l8pJ9RL7Kl6j5k5M0LOj3jm7J8N1j0mk5oJ6lK1k8
1546a5j4J5pL4J9k5l5NJ1L7jJk8k0LO1pk8k1k3K4L3J0j4j1k4J0O1m0Ok2j8MK0
1580AjJ7j6oj2L4ok7lj6L4K7rk2Qk8K3LJ9jk8oMK2J8k5l4LLL4K0m0k3k0M1L6k4
$$ plain form
1617 0 -16 -24 -13 -8 9 20 -8 -30 -29 -13 11 -3 -13 -10 -4 -10 -9 41 6 -3 -5 12 4 60 12 4 -12 -9 7 12 10 -14 -9 -8 16 23 26 -20 -10 -15
1657 -15 -3 7 -2 -36 -26 -13 14 21 15 -25 -10 -5 0 40 -1 -1 -15 -19 59 14 28 22 -5 20 3 -2 15 -10 -1 -16 15 18 19 7 -12 4
1693 4 -19 13 16 -27 -20 -9 22 33 -2 -27 -2 -11 7 5 10 2 9 -9 4 19 -1 7 -22 6 6 14 16 -12 -36 -1 16 13 0 -13 -22 -7 -5 -6
1731 -6 33 0 -13 3 2 -2 -6 -10 -14 11 -5 15 5 -31 -14 -30 -13 -2 -2 -22 -12 15 25 20 9 7 1 10 19 39 11 19 -12 -5 14 22 -1 -5
1769 -5 -20 -10 -23 31 17 -22 -11 -10 -19 12 -3 0 -25 -21 -8 -27 20 -32 -4 -19 -14 11 11 -25 6 -16 18 29 19 -11 11 -11 17 0
1803 0 1 -7 3 10 9 33 -1 -26 -7 -6 6 10 -3 1 -34 -23 -25 3 -16 -15 2 -18 12 7 49 -13 -14 -11 -10 9 -1 14 -13 -15 12 17 21 25 11
1842 11 12 8 34 -12 9 1 6 -8 -9 33 -5 -19 -29 4 -15 2 -4 -26 -22 -21 -6 8 -8 -23 -2 -17 28 22 6 -11 -10 -5 13 -18 12 1
1878 1 4 -4 -10 0 -7 -21 -6 11 11 -7 5 -2 -8 -7 14 -2 -7 -29 -7 -9 -22 14 -3 -6 -13 -18 11 -7 -10 10 -8 11 11 -14 6 -3 14 14 22 6
$$ packed form
1617@j6qJ1NJ7J1k8k2JJ6K4j4j0LOoJN0l5rkJ7qN6m8qj6LJ6Nkk4NJK4PLm6J0n
1657a5J2J0rl4J0J3K7Pom0J5NNM0m1%j4mP8m5J4ok7K5j7nJ7k5Rj5L1LJj2j9J6
1693Dk3L2Lm3PJ1L1J1l5k5K5rJ8kNqPj8J3J5k0Qk9K8%QKk8k4L5J7lj3j3rJ5Kj
1731fL9l3j3J6jmmmmK5j6K0j0l6J7j6J7J1%k0J0K7J0nj1koRRK0k8Ql1PJ9Qk3m
1769ej5J0j3N4j4l9J1JrL1j5Lk5MJ3j9M7n2K8j5NK5%l6L1k2L4J1j0l0K2k2K8j7
1803@JqJ0PjK4l4k5J9JJ2Mj3Ml5J1kK8j9JJ7k0L0nM2o2jLJJ9j0J5k7kK7NMMj4
1842A1JmK6m6K1qNj4jM2l8j4j0L3j9J7ok2MJJ5J4j6j5K1j5M5oj6j7JNJ8l1L0j1
1878ALqoJ0pj4J5J7%j8J2poJK1j6nk2K2kj3L6j7lpnK9j8lK0j8J9%k5K0rJ7%Qj6
$$ plain form
1918 6 -20 23 -21 15 21 16 20 0 -7 6 2 15 4 -6 -24 34 -23 -11 7 -13 2 0 -12 -5 -3 8 -8 -15 -4 10 -20 -17 9 6 -2 9 8
1955 8 8 -13 -15 29 32 15 -11 14 16 6 -1 16 2 -3 13 -1 18 9 0 -7 -4 6 -14 -24 -27 -9 2 6 12 0 1 -2 4 1 22 -17 -25 -6 7 12
1995 12 -11 -14 16 12 7 15 6 13 10 44 9 0 -9 -1 -1 -31 -20 -12 -14 6 11 -13 -19 11 -7 2 3 -19 3 13 21 17 1 -28 17 -9 10 7 -4 -5 23
2036 23 3 17 17 -24 -3 -1 14 -9 4 15 10 11 28 3 8 -9 3 -15 -9 10 -4 -13 6 -13 -3 -11 -32 -21 16 -5 -2 2 -21 5 9 -3
2072 -3 1 33 -3 12 -8 -2 -4 -7 5 -7 -25 9 -4 7 -6 1 -2 -4 25 19 -6 -5 -18 -10 7 1 -7 -3 -2 -18 3 18 -20 -33 -17 -2 15 21
2110 21 -15 -1 21 22 26 11 16 10 -6 -2 19 11 -6 2 -2 1 -17 4 4 19 7 2 6 -5 17 -26 8 -5 0 -23 6 -1 -7 -8 -29 -14 -29 -31 -6
2149 -6 14 5 7 2 -5 -20 -1 26 -14 17 14 -25 3 3 16 14 8 -5 23 -5 21 1 -6 10 27 -10 17 17 -37 -10 -24 3 6 -9 -19 -15 -13
2186 -13 -13 -27 -3 -24 -17 -1 7 16 -10 -22 -20 7 2 4 -5 20 20 -5 9 3 -30 -18 6 3 23 -1 6 19 -3 -23 1 -13 -27 -28 -16 -13 -3
$$ packed form
1918Fk6M3m4L6OnMk0pJ3mJ3j1j0j8N8n7J2J8k0J5kj2PKJ1j6pJ1J4l0LK6lqJ1j
1955H%k1kM4Lj7k6K5Kj0pJ7j4nJ6j4J9rrpLJ0k0j0lJ8J1MOj2JlOlK1l9qJ9J3N
1995A2k3lL0mnQrPlL4l5rrQ%l0J1QkK0Nk4oL0j8RJk2K2J0Qmj6k9M5k6J9lj1jK8
2036B3k0J4%m1K1KJ5k3J3J1nJJ7k5Nj7J2j8OJ9j4rJ9j9J0qk1J1L7k1LMk3K6Mj2
2072cML2l6J5k0OklJ2j2j8L4j3J1j3PlkK9ok5Jj3QJ7oqMJj6K1J5l8j3J6J5J7O
2110B1l6J4K2JMj5Noj6MK1qj7QmLj8K1%J5j2nMj1K2m3L4j3Nk3K9pojk1J5j5kK5
2149fK0rKnpj5J9K7m0L1ll9K8%J3koj3K8k8K6k0pJ6J7l7K7%n4K7j4K7Lj5j0MK
2186a3%j4K4k1PJ6QRk6j2KK7nKrK5%k5J4ol3J2K4lK0k4PJ3k2k0K4j4j4jJ2LJ0
$$ plain form
2223 -3 2 -8 -18 3 10 8 19 12 28 -24 5 7 23 -5 25 25 27 32 18 -3 23 -6 -30 -6 21 -18 4 -5 -15 5 12 2 -13 -6 0 -8 -28
2260 -28 -11 -16 -28 2 -6 6 -26 -2 -4 -12 -11 -14 27 6 11 -2 -12 8 21 -25 -3 -3 20 4 -10 2 -8 9 22 -18 -17 -14 -7 18 15 -14
2296 -14 -11 -4 -17 -12 1 -18 -7 -36 -9 -13 -20 10 -22 -10 -16 2 -4 -1 -8 7 -3 9 16 -9 -10 8 10 9 -21 15 22 10 15 10 6 0 8 -30 -17 -9
2336 -9 -8 -26 14 14 -6 7 -18 16 -15 -22 11 -6 27 3 -6 6 13 -18 -6 11 19 -10 -2 -7 -6 28 -8 4 20 6 20 12 42 -8 11 -12
2372 -12 1 10 -15 -4 -14 -32 -14 -2 14 -8 23 11 -14 -2 -8 16 -10 -15 6 25 0 -18 5 -13 -3 13 20 -15 12 1 -16 3
2404 3 11 -2 -11 35 14 3 -4 -2 3 12 -15 -1 -5 -8 12 -24 -42 -2 -8 -9 -22 11 -7 -24 -3 1 12 -21 6 3 4 23 -18 -1 27 -1 -23
2441 -23 -23 19 -11 18 2 -14 1 -7 16 13 -3 9 20 -32 -10 -1 1 5 -17 -14 -10 11 -5 -6 2 -4 5 8 7 -4 0 -13 2 19 -10 19 24 20 3
2480 3 33 -7 -9 7 -3 -8 4 -1 7 4 -2 -1 6 14 10 9 17 -14 13 -2 -24 2 -5 5 7 -13 8 -38 1 4 -34 11 -19 -25 1 6 -2 15 -3 -7
$$ packed form
2223cNj0j0K1PkJ1pJ6n2K9KJ6k8L0%KNj4k1K6k9k4K4K7l9K2rj0K0Pj0j5POqk0
2260b8J7nj2L0qJ2l2K4kqJlM1k1Nj3j0K0J3m6K2%K3j6j4J2j0J7J3m0JLPK5lk9
2296a4LPj3NJ3j9J1k9K7mpL0l2J2oJ8oLpJ5j0J2Pk5jJ8Kjl0L6Pj2NnmoQl8J3Q
2336iJj8M0%k0J3k5L4l1pL3j7L3k4rJ2Pl1J2J7Qk9QnJL4l6J2J6j4J4qL0n0J9k3
2372a2J3Rk5J1j0j8J8J2J6k2L1j2k5J2oK4k6nK1J9k5j8K3j8J0J6Pl5K7j1j7J9
2404CQj3rM6k1j1pKNRk7J4mlK0l6j8M0ojj3L3j8j7K1MJ1l3K7lJJ9m1J7K8k8k2
2441b3%M2l0K9j6j6J5qK3lj6J2J1n2K2RKMk2LMK1j6jQoRLjj1Mj3J5J7k9K9Nmj7
2480CL0m0kJ6j0nJ2nQloJPQmjQl1K7j5k2K6pJ0Kk0K1m6L9Ll8M5l0oK6NqJ7j8m
$$ plain form
2520 -7 2 -3 34 -5 43 -3 -18 -11 -5 3 8 -1 -4 -11 -3 5 0 -18 10 -5 3 -3 -28 -2 -7 -9 7 16 -15 1 -20 -17 -31 10 -19 8 4 16 1 22
2560 22 -15 -15 -8 -21 18 12 16 -2 -7 -7 -8 5 -10 3 -6 -18 -23 3 -21 7 -4 -4 3 4 11 -17 -18 -19 1 11 4 21 0 4 -4 11 18 22 26 -5 12
2601 12 33 7 30 -1 -7 10 -3 8 23 17 15 -26 3 10 -18 25 9 0 -36 -2 5 -7 -33 -4 10 -8 16 5 -5 -3 -8 9 22 13 5
2636 5 -6 -27 7 -6 -2 25 12 -11 2 28 5 8 -12 25 13 -29 -8 17 -8 -9 12 16 -15 -6 -2 -15 12 3 -23 1 5 -32 0 -3 4 -6
2672 -6 -1 -2 12 -17 2 19 9 11 8 -3 8 21 16 6 9 -3 -22 18 13 -15 33 -6 3 13 -9 -9 0 -18 -24 -3 -22 0 8 -16 -4 -12 11
2709 11 -15 7 -8 -28 -2 19 3 1 -24 -5 5 11 -12 29 13 -3 27 14 -6 -3 24 8 -4 7 0 -16 -12 -8 3 -3 7 -5 9 -8
2743 -8 19 -4 -12 20 16 3 18 8 -14 40 -10 3 -1 -8 -15 20 26 -2 15 2 -6 20 -2 -8 -31 18 -2 -26 31 17 20 -13 22 -1 24
2778 24 -2 -4 -1 -1 -36 -37 2 6 -35 0 -6 0 -7 3 -10 15 4 1 14 -13 2 1 -5 -1 -5 16 16 -11 -18 14 -14 -2 10 -13 6 4 -1 23 25
$$ packed form
2520gRnL7l9M8m6j5POQNrlpQQnj8K8j5Qok5K6nkJ6Rl1J6k1Lj4M1k9K7mJ2j5K1
2560B2l7%Pj3L9oMj8n%jJ3j5J3rj2nK6k4K8j1%PJPk8jjK0J0pJ7k1MqJ5PMMl1J7
2601A2K1k6K3l1oJ7j3J1J5okm1K9Pk8M3j6rl6L4Pj2k6K9J4j8K4j1j0KnJ7J3rq
2636Ej1k1L4j3MK7j3k3J3K6k3Lk0L7j2m2K1K5k5jK1Ml1RMj3K7rk6K4Ml7L2lPj0
2672fNjJ4k9J9J7j0Klj1J1J3nj0Lj2j9M0nk8M8l9RJ0k2%Rj8oK1j9K2Qk4J2qK3
2709A1k6K2j5k0K6K1j6kk5J9J0Ok3M1j6j6L0j3k0LK7j6j2J1pj6MMJ1oJ0j2J4j7
2743hK7k3qL2mj3J5j0k2N4n0J3mppL5Ok8J7j3qK6k2ok3M9k0k4N7j4Ll3L5k3K5
2778B4k6kL%l5jL9Mm1L5oOpJ0j3K5j1lJ3k7J5joMmK1%k7pL2k8J2J2k3J9knK4K
$$ plain form
2817 25 1 -2 -23 -4 -18 -2 -28 15 -28 -33 -3 -2 -18 -8 21 -21 -2 -11 -14 -12 15 -11 18 7 6 7 10 3 -6 -15 2 -1 7 0 -28 -5 -21 8
2855 8 -1 0 -7 -19 -10 -18 -13 -19 -7 -6 22 -22 15 23 -30 -16 -7 -3 11 -2 -8 20 -12 4 -11 4 6 5 29 22 1 12 -1 2 20 -1 11 9 5 15
2895 15 22 -11 -18 -37 2 -3 2 -4 -3 -29 -8 3 0 -13 -11 -9 3 -2 -24 -7 28 -15 -28 17 9 -31 -7 23 20 -12 -8 -36 23 20 17 11 11 16 -13
2934 -13 -9 -2 1 -26 -23 -5 3 -18 -8 5 -13 8 4 -13 -20 -17 -21 1 9 -14 -10 8 -1 11 -3 -14 9 -28 9 16 12 4 5 -2 20 3 14 6 -13
2973 -13 16 10 -16 7 12 9 -24 -26 -21 -1 -1 -4 -9 -16 1 -22 -1 -15 -14 -7 -4 -28 10 2 7 -5 6 28 9 -21 9 5 -16 8 26 5 9 -15
3011 -15 -5 -8 4 -23 -4 11 18 14 2 16 -15 -6 -18 -33 -9 5 -31 18 -24 -35 6 7 -23 -6 4 -25 5 -14 -3 -8 -16 -4 -7 2 -6
3046 -6 3 -9 -18 -5 8 6 0 -19 -12 -10 -23 0 -5 5 -17 -11 -21 -3 -9 -10 -18 -10 -4 6 5 -4 -15 -11 -1 1 -3 11 3 7 -9 5 24 -4 12 -4 -7
3087 -7 9 -9 0 18 -23 -2 -25 18 11 4 -14 -17 -7 -1 -10 -6 -10 -5 -32 -7 0 -7 13 5 -9 12 -5 -13 6 -6 1 2 -2 -10 19 3 5 9 5 21 -3
$$ packed form
2817B5k4lk1J9j4J6k6M3m3nL0Jj6J0K9m2J9rlKK7k6K9j1jJLprrJ7lQpk8K3j6K9
2855HrJpj2RqNoJ2JK8m4L7Qn3J4RMJ4j3oK8l2J6j5J5KjK4pk1J1j3LJ8k1J2kmJ0
2895A5Pl3pj9L9nNoJk6K1J1lj3KKJ2nk2J7L5m3j3M5qm0K4L0ll2Mk8N9llo%Nk9
2934a3MPLk7LJ8Qk1J0J3j8K1mj7pLmK2Qk3MJ8rJ2j4j1K3l7L7PmqJpK2j7J1qj9
2973a3K9ok6K3Nll3kNK0%lnpJ7k3K1j4JPLk4L8qNj2J1K2j9l0L0mk1K4J8k1Mk4
3011a5J0lJ2k7J9J5Pmj2J4l1Rj2j5K4J4l6M9m2j1M1Jl0J7J0k9L0j9J1nqJ2lRq
3046fRj2rJ3J3koj9PKj3K3nJ0k2Oj0J8ojqQOJ0jrj1MJ0KmJ4qMj6J4J9k8J6j6l
3087gJ6j8RJ8m1K1k3M3ppj8lJ0OrMmNk7K5PpK0qj4K1j7qJ9j2PJmqK9j6KMmJ6k4
$$ plain form
3128 -3 -22 2 12 13 -12 1 -18 30 -17 -10 20 -9 -8 -31 10 3 -5 -29 -16 -7 3 1 -34 1 -16 0 -4 13 10 21 24 3 -10 -12 15 -6
3164 -6 -18 -12 41 5 -6 14 8 1 26 -10 34 33 -25 13 -1 11 3 16 -4 5 -6 10 -5 3 -7 10 17 -20 22 -14 9 -6 27 2 21
3199 21 12 5 5 -4 8 15 5 4 7 24 28 -11 -31 -16 19 12 20 6 12 5 -5 -49 1 -24 -2 8 6 6 8 23 -16 -15 0 -18 -30 35 14 27
3237 27 7 20 22 1 -7 30 33 -21 17 1 -6 15 -3 -11 -6 4 0 8 -54 2 -1 8 -18 7 -13 -15 12 0 -11 -4 -10 18 -24 3 -6 14 14 24
3275 24 1 -4 -9 -11 2 -5 8 0 -4 -17 23 17 13 2 20 -4 4 23 -5 0 -18 -17 -23 2 -2 -19 -8 7 -27 -27 6 18 5 -8 -1 -2 -21 17
3313 17 26 16 -12 6 3 -7 -23 -36 8 13 -6 7 17 -3 2 -13 -8 -6 7 7 -9 10 -2 -10 -22 24 -19 -25 -20 10 -7 2 2 -13 9 -1
3349 -1 1 -1 6 -4 -4 0 -25 20 -2 -6 24 14 28 33 -8 12 17 18 7 7 26 -4 22 17 10 13 -11 23 -1 -15 -21 -25 -20 -12 -2 -12 6 -12 -37
3388 -37 -5 -11 -22 -7 4 -9 -4 8 0 2 19 -9 27 13 10 -11 -20 -2 3 25 31 10 11 1 -6 28 16 -11 -15 -38 2 29 -14 -5 -13 0 -1
$$ packed form
3128cj9K4J0Jk5J3j9M8m7PL0k9Jk3M1pqk4J3RJ0kl5L5j7J6mJ7lJ1Lk1j3kK7k1
3164fj2ON3l6j1K0opK5l6M4jn8L8j4J2qJ3k0Rj1J6j5Qj0J7Pl7M2l6K3j5L3k5J9
3199B1rp%rJ2Pj0jLJ7Ml9k0J5L5pQj4Opj0m4N0k5K2J0k%KJ5l9JJ5j8j2O5k1J3
3237B7k0J3Kk1qL7Ln4L8j6pK1j8qNJ0mQo2N6lRk6K5k0kK7j2j1PoK8m2K7rK0%J0
3275B4k3nnkJ3pJ3qmj3M0omj1J8k4QJ9k8Nj8JoK5mj7J1J5l4%L3J2j3j3Pjj9L8
3313A7Rj0k8J8lj0j6j3M4Nj9J3J0k0Nj5NKJ3%j6J9j2qj2M6m3oNL0j7R%j5K2j0
3349aKkPj0%Mk5M5k2mL0j0J4Nm1K0NJj1%J9l0K6npLk4L4k4j4omNQJ0j0J8j8k5
3388c7L2oj1J5J1j3NJ2qKJ7k8L6j4lk1rJ8NK2Ok1Jj0pL4j2k7mk3M0K7m3RqJ3j
$$ plain form
3425 -1 -13 -14 -2 1 1 -24 -12 29 -8 -4 -20 -6 2 -21 18 22 18 6 27 25 11 8 12 -2 15 0 5 -20 -28 -2 -1 10 -1 4 -12 2 1 5 5
3464 5 -14 -14 -4 -8 -8 -4 -13 -5 24 21 -22 -10 -8 11 2 5 28 -5 6 -1 -13 -9 6 -3 25 6 -6 13 -4 18 -12 0 -22 -1 -17 -15 6 -8
3502 -8 -22 10 2 -10 -13 5 -23 0 -1 -13 -6 -10 -8 -3 -25 -4 19 -18 11 20 -15 18 5 11 13 14 -16 6 8 2 15 -12 0 -5 19 4 -22 -4
3540 -4 -7 0 -10 -6 -10 17 -21 -17 -25 -6 -11 -17 -1 3 2 -9 6 -10 8 10 8 6 -11 19 4 -8 23 -8 3 2 12 14 -3 16 15 11 8 -1 14 -1
3580 -1 -4 -34 -11 9 6 4 -22 22 -31 -6 12 14 -26 3 -22 -5 14 4 -3 11 4 2 5 -14 16 -13 12 5 3 7 -6 -19 -2 -4 -7 5 -24
3617 -24 -6 -18 -10 0 -9 -4 1 1 20 -12 28 -23 -13 19 -26 -6 -32 0 27 3 -14 19 -7 17 16 16 15 -14 -4 13 17 2 -14 -14 3
3652 3 -17 28 7 8 11 -2 -5 -23 2 -16 12 7 15 5 -6 4 1 -1 11 11 9 15 -19 2 -24 23 -10 -26 -13 13 18 2 16 -3 -9 12 -3
3689 -3 -4 -9 -4 18 -3 -1 0 -2 7 7 6 5 -1 -15 -4 -6 -8 9 -2 -10 -24 -36 2 -20 -11 6 19 -1 11 15 -10 -12 22 -22 -1 5 1 2 10 4 16 15
$$ packed form
3425aj2jJ2L%k5J2M1l7Mj6J4Qk3L9Mmj2K1kj4lMj4J7j5Nk5qK6JJ1j1Nj6J4jM%
3464Ej9%J0m%MrQK9lm3J2KJ9rLK3l3J1pj2MJ5rK8j9j2J9j7K2l0J2k2K1j6KK1j4
3502hj4L2qj2lJ8k8K3jj2PmKNk2K1K3l7K9Rl5L3j3OKJl0K2KoJ3k7J2nK4j5k6J8
3540dlPj0MmK7l8MqJ9noJ6Mjj1J5j6J8Kkkj7L0j5j2L1l1J1jJ0Kj7J9jmlrJ5j5
3580all0K3K0lkk6M4n3K5J8Km0K9k5J7J9j0pJ4pkLj9L0k9K5pkMj3j3J7klJ2k9
3617b4J8j2QJ0rNN%J9l2M0n1J0L2m5K0k6L2K7k4j7L3k6K4j%jk9J0J7Mj5j6%J7
3652Ck0M5k1JLj3lj8K5j8K8nQj0j1J0lkJ2%kOl4K1k6M7l3j6J3K6Nj6J4j9oK1j5
3689cjnNK2k1KJkR%jjoj4J1kkJ7j1qj4j2L8k2RJ7J3k0J2Mk5kL4m4K1OmJQoJ2j
$$ plain form
3731 15 -15 4 2 -20 -12 -12 10 9 18 -3 9 -6 -30 14 -17 -11 6 -20 -33 3 14 -13 -15 -26 -4 -2 -18 26 9 -1 -15 -6 -8 -8 5 28
3767 28 -6 -1 2 2 -8 13 6 -3 -18 8 9 -9 -9 -6 -5 -2 -5 -11 -39 -13 -8 -20 -2 11 0 -22 -5 13 -23 -3 -2 -11 -20 19 23 24 19 -6 3 4 0
3808 0 31 -5 2 10 23 15 -24 -30 -2 -3 -1 -15 -31 6 -14 4 -12 -16 -4 -12 -16 -5 11 -4 -9 -11 8 14 2 14 -11 21 23 26 26 -18 1 -15
3846 -15 -17 2 22 -1 1 11 13 13 -5 -11 -15 0 -21 -32 -7 -9 -2 -12 12 -4 -7 -10 -11 14 -11 -12 -2 10 -17 -6 7 3 4 22 5 8 18 -23
3884 -23 -22 -6 13 0 -16 -12 17 -4 8 6 -6 7 -11 -11 1 -43 -41 7 9 0 2 -5 2 -20 -8 -23 -23 4 4 -22 -2 -11 0 -16 -18 -34 9
3921 9 21 17 -3 -2 -3 -21 5 -25 -14 10 -4 -1 -24 -3 -8 17 7 23 21 -28 4 11 -4 -11 -40 5 -20 2 -23 -11 14 -17 -8 11 -19
3956 -19 -2 13 -16 -1 1 4 -21 -2 9 22 -3 10 -22 6 9 11 10 21 -13 6 0 4 10 -23 -2 -3 -6 -7 -8 2 -6 8 13 -4 -19 -4 3 -19
3994 -19 14 -2 28 33 -13 15 18 -13 -11 -6 -2 25 11 17 0 5 0 -2 9 23 14 -5 -36 4 5 -18 -18 0 -10 -24 15 -7 -4 -4 -5 -10 -23 -19 1
$$ packed form
3731A5l0J9kk2Q%K2jRk1J2j5k4M4l1OJ7k6j3L6J1k7kj1K2Kj6M4j7j0j4Rk%J3K3
3767B8l4NL%j0K1prj5K6Jj8%LJLlok8K6Nj2J8J3j1k2J7J8l6K0JrrL9MJnk5RJm
3808@L1l6PQJ3ql9oK8jKj4j6L7k0J8j6mJ2qmJ1J6j5nkJ9Oj2J2k5L2KL%m4J9j6
3846a5kJ9K0k3KJ0K%j8omJ5k1j1K5kPj0K4j6lljK5k5jJ0J2k7J1J3mJJ8j7LJ0m1
3884b3JJ6J9j3j6MK9k1J2kj2J3j8%J2m4KM8KrKpPk2J2j5%K7%k6K0rJ1j6kj6M3
3921IJ2mk0Jjj8K6l0J1K4j4Lk3K1nK5j0J6km9L2Pj5pk9M5k5K2k5J2K5l1RJ9l0
3956a9J7J5k9J5KLk5J9J1J3k5J3l2K8LKjJ1l4J9oMOl3K1jljjJ0qJ4Nj7j5J5Pk2
3994a9L3j6L0Nm6K8Ll1KNMK7j4Oj7NnkJ1J4rj9l1M0Jk3%J8j0j4L9k2L%jnj3MK0
$$ plain form
4033 1 13 -14 11 -15 6 3 -12 -11 8 9 7 20 27 -18 8 23 12 -14 7 -3 15 6 12 -4 2 -10 18 22 -16 -11 0 16 -12 15 0 -18
4069 -18 -24 -17 -33 -18 4 12 -11 21 -17 7 -5 1 23 -31 -23 -22 17 -20 -9 -5 -24 -11 9 -8 -10 4 -3 -20 2 0 18 17 -3 8 -13 -12
4105 -12 -12 -21 -20 -4 12 5 -21 -12 -8 -7 12 -15 11 -6 -3 14 -17 29 14 8 -1 -5 -12 -24 1 -4 10 16 -3 16 -9 10 2 -10 -13 31 -9 -39
4143 -39 0 -8 -13 -8 11 -1 -2 -9 -11 -22 -12 -9 -32 -3 -12 -8 -6 -5 -15 8 13 13 33 -2 -8 8 -1 -27 -12 -12 9 1 -14 8 9 -5 -10 7 12 -3
4183 -3 15 -30 -9 3 -5 -25 1 -11 -20 -6 29 14 -25 3 0 -25 25 -10 -44 -28 -1 -21 7 4 16 -17 -2 17 11 13 -27 -13 23 -4
4217 -4 -1 -14 -9 -11 -17 6 4 0 -8 -15 7 -4 -2 -14 25 -21 -28 8 -33 -20 -28 -44 -20 -17 -7 -20 3 2 -19 6 -14 32 4 -12 29 16 -5
4254 -5 25 1 25 -18 0 1 -3 -19 -17 -8 -23 -14 1 -22 -23 9 -8 -2 -3 -12 -10 -6 16 -12 8 23 -4 5 -3 -16 32 -18 -38 -7 -8 -21 16 3
4292 3 33 7 -10 32 -7 -2 -3 12 -3 27 -2 14 -5 0 -6 1 -4 -16 22 18 13 -21 -16 -10 -24 -11 -19 1 -3 -14 6 -8 17 -1 4 7 1 -2 32
$$ packed form
4033AJ2k7K5k6K1lj5JJ9JkJ3Pm5K6J5j1k6K1j0J8rOj6Oj2K8Ml8NJ1J6k8K7j5j8
4069a8oPj6J5K2Qk3L2l8K4j2OK2n4QJL9l7J1Mj9J3K0j7kJ4pj7K2kJ8jk0J1k1J
4105a2%rJJ6J6pk6RMJJ9k7K6j7LJ7l1M6j5ormpj2K5nJ4Oj9J9k5J9qj2lM4m0l0
4143c9L9qnNJ9j2jpkj1J0Lk3K9rMKJj0K3N%K0l5oJ6rk6J5%K1qj5K2Jj4nJ7Nj5
4183cJ8m5K1J2qk0K6j2rJ4L5j5l9K8lk5N0l5l4J6K7k0K8lJ2l3J5J9oKm0J4L6k7
4217dLj3NkoK3kmqpK2j1Kj2L9m6pL6m1J3qj6K4LJ0j3K3jk1K5k0M6k8j6M1j3k1
4254eL0k4K4m3J8Jmj6KRj5RJ5k3jL2j7OjrKMK2k8K0J5k7Rqj3M8n0k0L1jj3L7j3
4292CL0k6j7M2l9NjJ5j5L0k9J6j9NoPnj2L8mnl4NOj4J3qK0mj1K0j4K5j8NLolL4
$$ plain form
4331 32 11 9 -3 -2 16 2 1 4 13 -2 -4 19 -3 -25 -15 -9 0 14 -27 -15 -12 20 -18 0 -23 -14 5 -8 3 5 -20 21 9 10 -16 20
4367 20 8 6 -6 7 15 19 17 5 1 -4 9 19 16 0 -17 -17 -12 -25 -21 -2 -16 -7 -2 6 -19 0 -5 -35 23 15 8 -15 -13 -8 -5 -33 -14 1 12 10
4407 10 6 -3 -6 -2 16 5 16 10 3 -14 -6 -22 7 -1 -9 -41 -19 2 -15 3 -9 -14 -10 -33 -3 -22 9 -1 -24 4 -25 22 -17 8 -1 -9 18
4444 18 6 10 2 4 50 -8 9 -15 4 3 -9 12 10 17 7 4 6 14 19 -10 5 -29 -2 -10 -5 -6 -3 -16 10 -24 16 9 -19 14 -5 3 10 18 -8
4483 -8 17 -16 -1 26 19 -1 39 -6 15 -11 -9 15 -17 -15 19 25 26 -26 7 15 -11 -5 1 -3 -7 -6 -2 1 -13 11 -20 -14 -22 -2 -29 -4 -7 -11 -19 16
4523 16 -1 18 16 22 -18 -16 0 7 6 7 19 -13 5 -11 3 -8 13 -5 -12 -12 -2 -7 -11 -18 -7 -11 3 -9 -17 -20 4 23 -6 6 5 -3 -30 9
4561 9 10 20 -27 6 -7 8 5 -18 -18 12 -1 14 20 19 -5 13 -1 11 -10 -5 -33 -13 7 8 -6 6 -7 12 -10 -3 -19 -19 14 21 5 -26
4597 -26 -5 20 -17 -4 12 -4 25 10 2 16 5 5 21 8 13 28 17 -21 28 11 7 9 0 7 24 7 14 4 -26 -16 11 2 -13 -14 -8 -21
$$ packed form
4331C2k1kj2JJ8j4jLRj5kK3k2k2J0ORJ4m1J2LL2l8J8k3RJ9j3J1Kk5M1j2Jk6L6
4367B0j2kj2J3QMkj2mnJ3J0lj6j7%Nj3MJ9j4RNQk5J9nl0N8qpk3KNLk8J9J5J1k
4407A0mrlMJ8j1J1opj7Qj6K9qql2K2K1j7J8j2nMk3L0j9L1j0k3K8k9M7l9K5rqK7
4444A8j2MqKM6n8J7k4J9jj2K1kPj0lKQNk9J5l4K7qNjLj3K6l4M0pk8L3j9QPQk6
4483hK5l3J5K7pk0M0m5K1k6KK4l2KL4OJn2L3Qk6OOmmJMLj4K4l1OqK0k7K5lmqL5
4523A6j7J9kOm0KJ6PjJJ2l2J8j6J4j1K1j8p%J0nmpJ1mJ4j2qlK4J9k9J2jqk7L9
4561IJJ0m7L3j3J5lk3%L0j3J5Ojk4J8j4J2k1Nk8K0K0Jj4J2j3J9k2Pj6%L3Pj6l1
4597b6K1K5l7J3J6j6K9j5qJ4j1%J6j3NJ5j1l8M9j7mKrPJ7j7Pj0l0J0K7rj5jOj3
$$ plain form
4633 -21 5 7 6 -32 -15 30 0 -6 7 -17 -1 11 9 3 22 -19 -5 9 1 24 16 -14 10 21 7 10 -10 14 -30 -8 -1 7 1 -12 4 -4
4669 -4 -13 -13 2 -2 15 -23 -37 25 -2 -24 11 5 3 -5 -3 30 -5 19 -15 -5 1 7 30 -3 -24 1 -8 -6 -2 12 -5 4 2 9 -16 18 -8 0 -14
4708 -14 0 1 -9 -5 8 4 -7 8 -6 -27 -15 14 -10 11 -13 -6 30 7 -29 1 20 11 0 27 -8 9 8 12 3 -4 -18 -18 22 1 -5 8
4744 8 22 10 -5 14 -10 3 6 18 -14 -14 2 0 5 4 -4 -1 6 4 16 19 -2 -23 -21 19 20 -14 36 6 24 17 38 14 -8 14 14 23 5 14 -31
4783 -31 -23 -28 4 -4 -11 -27 -30 -5 -22 -1 -3 -7 -1 -16 22 2 -8 12 -2 -8 -2 6 -9 -4 -3 6 19 5 11 3 -14 22 5 8 23 19 3 4 8 3 11
4824 11 4 -7 -6 -12 -40 11 -20 -13 -5 -14 4 -39 -1 -18 7 9 -9 8 1 16 21 16 21 4 -7 14 -4 -24 13 0 23 24 1 -15 -13 33 -6
4861 -6 -14 -4 -13 19 -23 28 -1 -10 -6 -6 -10 -18 -43 -8 3 12 -13 1 29 0 26 1 17 43 -1 5 -2 -3 5 4 21 18 38 -10 6 9 10 -12 10
4900 10 -20 3 3 -23 -16 13 -15 5 -12 -26 -15 -7 1 5 -3 8 0 20 -10 -15 -16 -1 18 10 -11 -2 -3 -1 -14 -6 9 6 4 -2 -11 15 -3 32 23 2
$$ packed form
4633b1K6Kjl8J7M5l0oJ3k4J6J2koJ9m1J4J4qK3ql0K4J1j4Lk0K4m4K2PQoj3J6q
4669dr%J5mJ7l8j4O2k7k2L5okqKL3l5K4l4J0OOK3l3k1K5rKMJ4j7RkPk5L4k6Qj4
4708a4J4Jj0MJ3mj1J5j4k1J2K9k4K1k4PL6k3l6L0J9rj1K7l5J7jMrpj4%M0k1oJ3
4744HJ4j2j5J9k4J3LJ2l2%J6kNjqLPkJ2Lk1k1KM0Jl4N0l0J8pK1k4k2K2%Rj8Rm5
4783c1QnL2qpj6lK5j7K1kmOj5L8k0j0K0j4oOQj5NJRJ3j4Oqj7L6j7LJ5mj6JMnQ
4824A1pj1Jok8N1l1PQrJ8m3L8j7K5Kj8J7pJ5NnNj7j1K1j8k0L7j3K3Jk3j6KM6l9
4861fqJ0rL2m2N1k9rM%mqk5L5J1Rk5J4K8k9K6k5J6K6m4OpjQjJ7lK0m8J6LJk2K2
4900A0l0K3%k6PK9k8K0j7j4J1QQMqJ1qK0l0njJ5J9qk1RjKj3QJ5lkorK6j8L5rk1
$$ plain form
4940 2 -28 14 25 6 9 9 -9 -4 -3 -10 9 -11 -30 -24 12 -1 -21 4 17 -5 -28 16 -1 -16 1 7 3 -10 8 11 4 28 -19 -5 -1 14
4976 14 18 -20 20 -10 8 -9 10 6 -19 -4 16 -10 -12 -14 -7 10 -26 -17 -24 -20 -23 -7 -7 -3 18 3 -4 5 2 13 3 12 -18 16 -6 10 23 -4
5014 -4 -1 8 22 -2 -3 -9 10 9 -24 0 17 -4 -3 14 -14 -8 22 -6 -3 -16 -13 -8 11 5 1 -1 6 24 -14 4 6 32 14 23 -2 -10 20 11 19 3
5054 3 20 18 17 2 6 -8 -13 2 -6 2 -8 -3 -23 -4 -13 -16 6 -1 -18 -27 -17 -7 -1 -2 -15 0 -4 -18 0 15 21 -5 9 11 2 25 22 20 35 23
5094 23 22 3 7 1 -4 -13 5 13 -8 -6 7 6 -13 -6 -17 2 -2 12 0 -10 -14 -2 23 19 -10 -24 -10 -18 9 1 12 7 4 33 13 -11 26 -3
5132 -3 17 1 -18 4 22 -4 -5 -23 12 -7 -21 -13 -12 -2 -3 -1 -22 6 -10 2 -2 10 -32 13 21 22 3 22 -18 -11 -19 0 0 -6 -9 9 10 11
5170 11 -19 -14 -3 9 0 0 4 14 4 11 8 -1 6 -10 6 7 0 13 3 -35 -19 -33 -22 -6 -12 -3 -10 5 -16 -19 -21 8 13 1 33 17 -1 -23
5208 -23 -16 -20 -17 -17 30 4 -39 -17 -7 -27 -23 -5 9 6 -1 10 9 5 -37 20 -15 10 10 -27 -3 -21 -3 3 -4 7 -25 -1 -14 -8 1 -3 1 -16
$$ packed form
4940Bl0M2J1j9L%j8NJpJ9k0j9OL6j3k0K5J3k2k3M4j7j5J7Omj3J8LpK4m7J4MJ5
4976A4Ml8M0l0J8j7J9mk5J5K0k6kkPJ7l6RpMlJ6%MK1j5pRlJ1j0Rl0L4k2J6J3k7
5014dLRJ4k4joJ9jl3K4J7k1JJ7k8OL0k8Lj3LNJ9omkPJ8l8J8KK6j8Rk5qL0rQj6
5054CJ7kjj5Mj4nJ5qQj0Nk0J9rlK2pj7rJ0J0Ojj3J5mj4J8J5Ok6J4KrK3lkJ5j2
5094B3jj9MonrJ8Qk1KJ3jj9Pj1J9mJ4j2j0mJ2K5mk9j4J4qK7qJ1nlK9k0k4L7k9
5132cK0j6j9K2J8k6jj8L5j9j4QJJ0jKk1K8j6J2mJ2m2M5QJj9J9m0PqJ9%olJ8JJ
5170A1l0NJ1J2r%MJ0j0PlrPj6J6JpJ3j0l8J6j4J1J6oRpJ5k1lkK9Nj2L2j6j8k2
5208b3PmL%M7k6m3K2J0k0MJ8J4lpJ1jmm2N7l5K5%l7K4j8J8OpJ1l2K4j3ORmMj7
$$ plain form
5246 -16 35 -17 27 -8 23 1 -14 0 17 7 4 -15 1 -22 -17 0 1 0 -18 8 14 30 3 -9 0 -17 9 -23 -16 -4 -38 13 -9 19
5280 19 5 12 6 2 23 -7 14 7 5 7 17 18 6 19 18 -7 10 -1 -11 4 5 2 -5 -1 -3 -16 7 20 -14 -14 -13 5 17 -14 7 2 -4 -7 -20
5319 -20 -28 -16 7 -2 13 0 -5 20 -6 5 -21 -10 8 29 21 22 -8 14 -3 13 3 -6 1 -11 15 19 -2 4 2 3 -18 -24 -16 -4 -16 -7 -3 2
5357 2 -12 14 -9 -6 -9 -2 1 -8 19 -26 1 15 2 -3 3 45 4 9 10 18 -18 -2 -7 3 29 18 5 -8 7 -6 18 -12 -13 -13 -18 4 -23 17
5395 17 8 0 -5 -6 0 8 11 -20 1 -8 12 24 -2 -1 3 -13 26 -14 3 27 22 10 3 0 -8 7 -1 14 13 2 15 -15 -3 4 22 -4 0 5 13 -6
5435 -6 -4 0 -23 12 -12 -7 -29 -7 -10 -17 -16 -16 5 -8 -10 5 34 1 0 30 18 -9 21 -3 -2 16 8 1 -13 -16 10 -21 9 -29 -13 -5 10 21
5473 21 -21 8 0 6 -12 -4 -24 -12 16 14 7 20 -9 -4 -6 24 21 21 4 15 7 19 4 24 6 -12 18 -16 -4 29 -10 2 -3 -6 -5 -21 -6
5510 -6 -6 -1 9 16 5 -22 -15 -8 -9 -2 1 -13 -12 5 15 -1 -1 -4 3 3 11 -22 11 15 16 8 -1 14 -8 17 -11 -5 4 20 11 18 -15 14 6 -18 -16 -2 -11
$$ packed form
5246a6N1n2M4l5L1k2j5J4J7j0lj9J6k3NJ7Jjj8K6OJ6k7j2Rj7K6l2PJ2l4N1k2K8
5280A9j4PomK1l0K1pkKJ0Jj2J3jk5J7j1j0J5JlpMkj3K3J3l4%JJ8J2l1K1nolj3
5319b0qJ2K3rJ5j3nK5k6J1k6J1J8K1qJl0K2j7J6j0rPj2K6Mk1OkJk1oQJ2j2RMN
5357Bj4K6k3LlPLrK7m5K7J4j3nOM2m1NJQl6J6nJ0K6j1j3j3J5j3K4l0j%nK2k7M0
5395A7rqnjOQLl1K1rK0J2k6JMj6L9m0J7K4nj2plqJ5qJ5jj1J3l0J2PJ8k6MNQj9
5435fKMk3L5k4Nk2K2lpJ%K1j3kJ5K9l3jL0j2k7L0k4JJ8qpj4lK6l1L0l8J6QJ5J1
5473B1m2K9qOj8Qk0J2K8kpJ3k9NkL0l%j7J1qJ2j5K0j8j8L0l4J2L3l9J2nlJj6J5
5510f%NJ0Pj1k7PPjPLj4JJ7J0j6%lP%Ql3L3MJqrJ5k2K5k8ORJ6rPl3K9qk4KJ4r
$$ plain form
5553 -11 -22 -25 6 8 23 -27 2 21 -19 -14 2 24 -2 -14 16 10 -14 14 26 6 -5 19 -8 11 18 -1 -19 21 14 -6 -9 12 -13 3
5587 3 -5 -7 -18 -4 -20 3 5 -21 18 8 12 2 -16 -9 -5 -14 -12 -13 25 7 24 -13 2 -7 5 6 0 5 5 4 12 -12 0 0 -19 -9 1 0 -12 -20
5627 -20 5 21 -14 10 -14 -10 8 -16 -31 5 22 -5 -29 -26 -11 1 0 9 2 2 10 0 8 6 2 -17 10 17 25 -8 -21 21 -2 -21 23 6
5663 6 6 -5 -10 -2 -10 4 -18 -23 -3 4 4 7 7 -5 -22 -20 -4 -28 11 4 -4 6 6 24 -13 1 15 5 16 5 -5 -3 6 18 -4 11 -1 7 19
5702 19 16 -21 -12 -3 5 -8 -2 2 -5 -4 -15 -2 -18 -9 13 6 -4 1 -19 -7 -11 9 20 1 -3 -14 7 -4 -12 9 10 16 21 21 21 0 21 -13 -16 4
5742 4 -4 -17 1 10 20 -11 -6 -5 -37 -11 9 -4 -12 -13 -1 11 25 -33 31 -4 1 12 7 4 5 -1 -5 4 13 -1 -6 -1 -17 -10 4 6 23 23 30 -21 10
5783 10 7 21 -17 15 8 -3 -26 -26 2 -31 -12 19 -20 -10 10 1 15 -19 11 -1 -7 -43 7 -12 -22 -16 -15 9 18 1 16 13 14 -7 -13 1
5819 1 -3 -7 10 14 -13 -15 -7 -9 7 -5 -12 -9 3 -18 10 -31 -17 9 11 -11 -14 6 -8 -5 11 22 -14 -1 34 7 23 18 0 8 -7 13 -6
$$ packed form
5553a1j1lL1KJ5n0K9J9m0NJ6K2k6j2L0ok4K8J2k0j1K4k7J9Pj9j8M0pk0lK1k5J6
5587Cqkj1J4j6K3Kk6L9j0Mj0j8PMrKjL8j8J7l7J5rJ2JoN%jQk4J2%j9J0J0jj2q
5627b0K5J6l5K4k4MJ8k4j5L6J7k7k4LJ5J2jRp%Qj0Qkmj9K7PQl3j3M2k3j9M4j7
5663F%j1nQqJ4k2nK0P%L%j2j7KJ6k4L9pqJ0%J8l7J4J4j0J1j1j0KRJ2k2J5j2QJ2
5702A9ll7RRQj3OMpJj1J3j6RK2pj0Nk0J2mK0J1j9mj1K1j1qK1JON%%k1K1l4lK0
5742Dqj3J8RJ0l1NJl2K6K0j3qjJ2J2J4n8O4l5NJ1nlJomRRj4nNj6PJ4KJ7%Pn1L1
5783A0lJ4l8L2pj1k3%K8l3J9L1l9J0K0rJ4l4L0j2ol6N0j9j0OJK4Rj7J5lJk1oJ4
5819AmmJ7Mk7kQkJ6j2pLJ2k1K8m1J4K6Kk2lK0j4LJ6J1l6J3L5k7J6nj8Qj5K0j9
$$ plain form
5856 -6 -2 12 3 -21 -13 -7 0 -15 -1 -11 2 -7 4 -22 -18 -9 -21 0 -15 -16 -22 -15 -1 25 -19 -7 -16 -2 2 -15 -3 4 4 11 13 9 -1 24 -7 14
5896 14 -10 4 -15 12 8 -2 -2 21 -11 -10 7 -16 10 -10 -14 -26 -17 -17 -11 -13 11 -19 -17 -3 5 -7 -2 -4 -18 -10 11 17 2 -5 4 -13 -7 0 -9 5
5936 5 7 -9 8 13 -10 9 -14 -20 5 -3 4 -19 7 -2 -8 17 -24 -6 8 -3 -15 -7 4 4 -11 -2 1 28 -7 5 -10 24 4 7 37 -13 10
5973 10 -23 4 -8 18 -4 7 4 -3 1 11 -24 -6 -11 17 -2 -11 2 -23 10 13 4 4 -34 -11 -2 0 -20 -8 12 -2 18 1 -2 -6 19 13 -7
6010 -7 -4 28 -7 3 -16 10 13 33 10 5 21 27 -22 2 -18 -4 -23 -3 6 -13 6 -7 12 24 -3 4 -10 -7 11 1 6 19 23 8 0 -4
6046 -4 -25 7 -5 -24 1 -13 13 2 20 -9 -11 -12 7 22 7 -7 12 -2 10 1 -6 -19 -8 -13 1 -19 -10 -8 -20 -30 8 7 25 11 0
6081 0 -11 -9 -1 -13 -24 13 -3 -6 -18 0 -5 9 7 -11 2 -11 11 9 -27 -25 11 3 -12 -7 27 -9 6 4 -8 16 -12 -37 -23 -24 -16 -22 -17 -24
6119 -24 -2 -32 1 -13 -3 -4 5 5 -6 23 -2 14 -22 -20 27 10 -4 5 -15 24 -18 -30 2 -9 10 -8 8 11 0 -14 -6 -8 11 -19
$$ packed form
5856fMJ4rk4QOPj5J4j0J3rJ1k6MRj2K1j5joPJ4K6m4J2rJ4Mj7J2P%PKmj0K5l1K1
5896A4k4J4j9K7mj0%K3l2JJ7k3K6k0mj2R%OkK4l0KJ4Qj2Nkj4QK1Oj5pRj7OPrJ4
5936EKj6J7Nk3J9k3oK5qPk3K6roK5m1J8J4j1j2QJ1%j5RLK7l5J2j5L4k0LL0n0K3
5973A0l3K7j2K6k2J1lpMJ0l5J8nK8j9rJ3k5L3Lr%l8K3RKk0J2K0j4K0j7lmK5ok0
6010gLL2l5J0j9K6LK0k3nJ6Om9K4k0J4j9K0Rj9J9j3J9J2k7Pj4LJ8j0NJ3Mj5qm
6046dk1L2j2j9K5j4K6j1J8k9kjJ9J5j5j4J9j4J2rpj3J1nJ4k0RKj2j0L8jJ8j4j1
6081@j1KQj2j1L7j6lj2J8nJ4kj8J3j3K2kl6KL6qj5NL4l6J5kj2K4k8k5J4jQoNp
6119b4K2l0L3j4J0jR%j1K9k5J6l6KM7j7j4Rk0L9m2j2L2j1J9j8J6Lj1j4QkJ9l0
$$ plain form
6153 -19 -9 4 -17 -27 -9 -8 10 -23 -2 -17 -13 1 -3 13 6 -5 15 10 1 -9 41 12 14 -1 -9 22 -4 -24 -14 15 -14 5 -29 -20 -7
6188 -7 11 9 4 0 15 -9 3 -8 1 0 15 -9 -1 6 -19 -18 -4 -13 -10 -8 -1 18 12 18 9 37 -22 -22 19 7 -26 -19 -13 8 11 8 -2 -29 -11 -25 -32
6229 -32 -38 -18 -21 -11 -3 -19 -11 -6 -16 -23 3 7 -26 -34 -2 4 8 -11 2 5 14 -11 9 -21 -5 3 20 32 -1 8 14 22 11 13 7 4 12 -4 -16 -11 -12
6270 -12 16 -15 -16 5 -10 -37 -13 -26 4 -12 1 -13 7 -16 -23 -7 -5 -17 -41 0 8 14 9 15 -5 18 19 11 -11 5 -3 2 -7 -22 13 19 12
6307 12 -19 -33 17 -18 13 -7 6 10 -15 -25 4 -8 -27 -42 1 13 -11 13 34 -14 -2 -10 -11 13 -19 -5 24 -5 -18 12 20 13 -31
6340 -31 -2 -10 -11 -13 4 3 -1 -6 1 -3 -4 2 13 -9 -1 -11 10 -2 -13 9 -2 11 -15 1 -21 13 -9 -2 -22 1 7 -5 -7 2 0 17 -7 -4 -1
6379 -1 -10 4 -16 4 9 23 -19 -1 -14 16 -3 -5 -7 17 1 3 -35 -12 -13 -6 -9 -4 -6 -7 -4 17 -6 -8 -13 17 12 4 -2 -4 -14 -21 11 5 11 -11 3
6420 3 18 -16 -7 -7 -9 3 5 -20 -27 -2 16 -7 -6 -9 -17 19 -10 -34 -16 9 -15 -11 32 -28 6 -15 14 7 26 -1 -6 -4 25 11 -8 24 -7
$$ packed form
6153a9J0J3k1j0J8JJ8l3K1j5MJ4mJ6pj1K0nrj0N0k9Kj5qL1k6k0J0K9k9J9l4RJ3
6188gJ8knmJ5k4J2j1RjJ5k4QPk5JJ4rLKPJ9oOrK8n9%M1j2l3POK1Llj0k7J8j4p
6229c2oK0lJ0Qj6QNj0pK6Ml3qL2OMj9J3LRk5K0l0J6QJ7J2l3ROQj1KolQj6j2Nj
6270a2K8l1jK1j5k7K4j3L0j6J3j4K0k3pJ6Kj2k4M1QOnOk0K3Jqk2J6qNrj5L5Op
6307A2l1j4N0l5L1k0J3Mk5j0K9j2j9j5M3J2k4K4K1m8J2qjK4l2J4K9k9j3L0Qpm4
6340c1K9qjkJ7jmnPmjOJ1k2Qj0K1j2j1K2j1J3k6J6k2L4k2Pk0K3Oj2kRkJ7k4LL
6379arJ4k0K0NJ4m2J8j3L0j9kkK4j6Kl8K3jPlNkjLK1k3knL0nqokj0pL2oOk2J4
6420CJ5l4R%kJ2Kk5pK5J8k3JlqL6k9k4J8K5k4MM3o0L4k1K9pJ9k7nKK9j4j9L2l1
$$ plain form
6457 -7 -2 9 17 9 -12 -23 -9 -30 -8 -5 -7 4 2 -13 -11 -5 -17 -15 -15 -17 0 27 -14 -9 -11 -17 -8 -6 18 15 9 -6 9 18 20 -4 8 -11 -2 -3 1 -10
6499 -10 4 -15 16 10 -21 14 -10 -14 -19 1 -5 -17 -2 3 -22 -15 -6 -29 -4 -31 -7 -25 -7 -11 -7 7 21 22 1 -2 -21 12 -4 -25 -13 -10
6535 -10 -27 -11 22 -4 1 6 3 -8 31 6 6 -18 -5 0 -10 -11 4 -7 -15 -10 -2 9 -1 3 -12 -19 -13 8 0 -21 3 -4 8 7 -1 8 17 23 30 11
6575 11 -7 -8 8 -14 -2 18 -6 -2 -8 -2 -14 27 -8 6 -4 -1 -17 -15 24 4 4 3 -42 -17 -18 -4 -10 -12 13 -17 -15 -13 5 24 -29 -6 7
6612 7 -6 17 -18 8 25 3 -6 11 12 2 0 7 2 12 -4 -18 -8 -17 -15 -7 -8 -21 -14 19 -17 1 -20 -9 10 9 -2 -2 1 -32 3 -1 20 -7
6650 -7 5 3 8 16 15 -6 4 2 32 1 -16 16 -9 19 -24 16 10 6 11 20 -19 5 -16 3 -7 -5 9 -23 -26 -13 -8 -5 -12 -11 -24 -12 1 8 -6
6689 -6 0 -8 -13 -18 -3 25 -3 11 -3 26 11 -4 12 -3 -4 -12 -8 1 25 15 -8 5 -3 -25 -2 -9 4 16 10 -21 5 8 -20 -25 -7 -13 -13 4
6727 4 1 10 -1 -15 25 -2 0 1 -10 -18 -5 0 2 -11 -17 -19 6 4 -17 -4 -17 -31 -14 3 4 -14 -11 -15 0 -11 -31 -11 -4 3 -29 -9 6 -21
$$ packed form
6457gNJ1Qqk1j1J4k1K2LkJ1kj5KOj2K%kJ7K7m1NkoRKK4loj5J5RKk4J2j9RjMj1
6499a0J4j9L1ol1L5k4mnK0oj2J5Nk5PRk3K5k7K4j8J8mMJ4J4Jk1lj9L3j6k1J2L
6535a0j7J6L3k6NNlj1L9k5%k4J3Nj0jJ5j1qNQJ1j0Mj5pOK1qk1K4pJ2jqRROPj9
6575A1j8jJ6k2J2K0k4MoOj2M1l5J4j0Lj6KL9k0%jm5K5jJ4okK5l0KKJ8J9n3K3J3
6612Gj3K3l5K6J7k2rJ7Jj0kPnJ0j6j4J0rKQjj3PL3l6J8k1J1J9jj1%Ll3L5mK1k7
6650gJ2kNQjk1J0kL0l1j7L2k5K8m3M0omNRl9K4k1J9j0KJ4l2lJ3NLpJj3J2J3Pj4
6689fOqnnJ5K8k8J4j4K9j5j5J6j5jqMRK4j0k3J3qk2K3pJ3J2ol1K6Lk8nJ8o%J7
6727DlRj1j4M0k7KJj1qJ3NKj3okK5kk1J3j3j4J7J7Jj8LmJ5j1k0K0PPl2K0J5k7
$$ plain form
6765 -21 -16 -35 7 -28 -5 -17 2 13 10 -5 -3 20 -18 17 3 19 -4 10 -3 -6 -8 4 -10 -1 -11 13 -18 -11 -8 -25 -6 16 11 -11 -8
6800 -8 12 -9 17 -17 -13 -4 12 5 11 -10 21 3 -22 13 -4 -13 11 4 10 -5 -3 -16 -13 -10 19 4 6 3 1 0 6 -25 -29 -24 -15 5 -18 -2 -7 -10 -23
6841 -23 -11 5 -19 -17 19 -6 20 4 -12 4 -8 1 -8 -14 -10 -2 0 13 0 3 -7 -11 31 2 -6 -22 10 20 3 17 -18 13 -29 -18 -1
6876 -1 -16 -15 -12 -2 -25 15 -1 -5 3 4 -19 -34 6 9 11 4 -5 -5 11 13 -6 21 5 0 -18 7 -10 34 -4 3 7 37 4 -13 1 4 6 24 3
6915 3 -14 10 10 -16 0 1 -8 -2 -26 -4 -20 -3 -15 8 0 -7 6 10 -8 -10 -9 -3 2 -5 18 34 7 0 13 11 10 -21 10 -18 -17 -16 -9 -8 -25 4
6955 4 -17 -39 4 -9 -15 13 23 -10 -22 6 -23 -12 -15 -2 5 -1 1 -21 17 32 -4 -8 7 27 4 -2 12 -1 -7 -17 0 11 12 -4 0 -11
6991 -11 -23 -21 -7 -10 -17 -19 -33 4 20 -23 -33 -36 -6 -8 -15 -27 3 14 -3 -18 -42 6 2 -9 -22 -2 -13 -31 -20 -21 -8 7 -9 14 25
7026 25 16 -28 4 3 -22 16 7 -14 -6 -12 -35 9 -5 -20 0 0 -18 -2 -25 1 18 -13 0 -3 -15 -7 -6 9 6 5 -2 7 -3 -14 -3 0 6 29
$$ packed form
6765b1Nj9M2l5K3j2J9J1lj5KK3l8L5j4J6k3J4j3lkJ2j4Rj0K4l1PLj7J9K2nk2L
6800hK0k1K6l4MRJ6pOk1L1j8k5L5j7rK4pOj5Kj3LLK9j5KlkjOl1mNRK0k3J6nlj3
6841b3J2J6k4KL6k5K6j6j6J6j2RroMQKJ3j3Lj0mM2k9qj6L2J0j7J4l5L1m2J1J7
6876aj5JLJ0k3M0j6mQJk3j5M0LKpr%J6Kj9K7j6nj8K5j7M4l8PML0l3j7J4LKJ8k1
6915Cj7K4%k6J6JrOk4K2j6J7j2K3qpJ3Mj8kJONpK3J6k7pJ3kjl1L1k8JJPJj7K9
6955Dk1k2M3j3oK8J0l3j2K8k9J1lJ3PoKk2L8J5l6mJ5K0k3oJ4j3oj0J7J1Jj6Mj1
6991a1j2KJ4lpkj4L7J6m3j0lL0kpj2L0J1j7j5k4M8mj1j3K0j1j8J1jJ3J5j6K3J1
7026B5rm4L2jk5L8rk1Qok3M4j4j5K0%j8J6k3K6J7l1J3lj2QJJ5ljpRj0j1J1LOK3
$$ plain form
7064 29 16 13 -5 -9 4 -2 -1 -15 -34 -16 -15 1 2 -1 -6 24 -12 -30 -15 -21 -13 -15 -22 24 4 -6 -25 4 17 16 -33 -4 -3 1 -9 4 1 -8 -2
7103 -2 -28 9 -6 2 -12 3 -5 -7 -16 -1 -13 7 -1 -6 -21 -27 9 -5 -13 -1 4 -16 -27 -19 -27 -24 -18 1 -13 -5 24 1 -4 6 6 -22 -23 7 24
7142 24 10 6 25 5 15 13 3 -10 3 -11 -1 -15 -29 -35 -6 -6 -7 -17 -21 -7 8 -4 -13 -17 -35 -9 -15 -22 -12 2 1 -12 7 -24 -3 -12
7178 -12 -13 17 -24 -8 5 3 11 -25 1 -4 8 2 -37 -24 -1 -31 -4 -22 -23 -22 -6 -22 -23 -19 1 -12 -8 -10 -19 -18 4 -14 14 3 -6 5 -18
7215 -18 6 11 -10 -27 -14 -3 -10 19 -2 16 6 6 16 5 -7 13 -5 -4 24 -24 7 -9 -17 -6 -41 -30 -30 2 -14 -7 2 -13 13 -22
7249 -22 -10 -3 -6 17 -26 -3 9 5 3 -18 5 6 3 2 -4 7 -19 14 2 -8 -5 19 -30 -4 -11 -17 -3 -7 -23 2 -2 -28 -7 -23 -29 -28 -26 10
7287 10 -17 -21 0 5 13 6 6 -17 17 -22 -18 21 12 -11 15 28 -6 5 -15 -18 -6 -14 1 -4 -34 -16 -2 -9 -7 -3 -14 -7 25 4 -29 -36 -26 -13
7325 -13 -21 -17 2 -11 -24 4 1 8 7 -15 -2 -9 5 11 24 16 1 -17 10 -21 -7 -2 -14 -9 10 -3 13 -1 -42 0 -14 3 0 -19 -20 -14 18
$$ packed form
7064B9j3lj8mJ3oJj4j9J8JJ6JlnL0l6j8J5oQkpM6k0j0j9K9J3jm9K9JMj0J3lrO
7103bk6L7j5Qj4J5qkrJ5j2K0qnj5oL6j4qJ2Nk0j1QqLOJ9j4QK9k3nJ0%k8jL0J7
7142B4j4mJ9k0J0kj0j3J3j4J0j4j4oK9%jj0mJ4J5j2rmj8K6opJ0J4jj3J9l1K1r
7178a2jL0m1J6J3kQl6K6nJ2ol9J3K3l0K7j8jJJ6j6jMK0j3MkrJK2j8K8j1rJ1k3
7215a8K4Nk1j7J3J1pK9k1J8j0%J0j1j2K0j8JK8m8L1j6qJ1l5J1%L2j6PRj5K6l5
7249b2J2PlK3m3K3J2mkk1K3JljoJ1k6L3j2j0LK4m9K6poJ4mj6K5mk6K1j6oJKL6
7287A0k7mK1NQp%k3L4l9ML9rk3K6J3l4J1k0lJ2qJ5nl0J8J4pKMj1PL2k1l3pJ0J3
7325a3qMJ9j3j3K8lPjk2J3pJ4OJ3qj5j8K7l1J4Nj2NJ9j3J6j4m1M2j4J7lj9jOL2
$$ plain form
7362 18 -9 -19 -5 -40 -32 -4 4 1 10 -11 -31 -8 -20 10 7 -15 8 -11 25 -11 -4 -13 6 7 -20 8 -25 -11 -13 -9 -34 -14 -18 -21 -44 2
7398 2 -19 -1 -11 9 6 -13 -13 16 21 -11 17 -10 -13 2 -20 13 -15 3 5 4 -3 -16 3 -5 -12 -7 12 -2 3 13 -19 0 13 20 -11 -13 -4 -30
7436 -30 -13 -8 3 6 -25 -28 15 -8 -18 9 -5 0 -8 -22 -1 2 -30 -11 -30 7 9 16 -2 -9 -4 -2 -19 0 -17 -22 -19 0 -9 -6 -26 -26 12 -7
7474 -7 -5 -5 -4 15 -2 -24 -7 -13 -6 -18 -12 10 7 -36 -5 -7 -18 -12 -15 3 8 -7 0 32 -4 -7 -1 3 -13 -12 -22 -9 5 -4 6 5 5 14 7 1 -5 -16
7516 -16 -26 -11 -12 -14 -13 8 -14 -2 -1 -2 -1 22 -20 -3 -16 -19 5 2 5 -31 9 14 -3 11 -4 2 0 6 12 -1 7 17 24 -20 11 -16 -9 5 -8
7555 -8 12 3 0 -10 -28 -28 -15 -15 -7 -10 -5 -9 -20 -9 14 -11 7 2 3 8 4 -3 -10 6 -10 6 -6 -29 2 -5 -33 11 -15 -17 -7 -21 22 -28 2
7594 2 -2 -10 -10 7 1 -23 -10 -17 -22 -24 -23 -24 -20 -5 -27 1 0 -17 -19 -19 4 15 3 8 -1 16 -16 12 5 31 25 -1 -1 -9 -20 8 5 -7 6 7 13 -15
7636 -15 10 12 -14 -17 1 9 -8 6 13 -1 -33 0 13 -4 14 -21 -23 -9 -11 -4 -11 26 11 3 11 14 18 12 -11 -6 -14 -2 1 -36 -13 -3 11 -10
$$ packed form
7362A8k7j0J4l5QK8QlRk1k0K3j2L0lk2K3j9L6l6PrJ9Jk7K8l3J4kMk5K0mlk3M6
7398Bk1J8j0K0lj9%K9Nl2K8k7lJ5k2L3k8J8Kjpj3J9qpNJ9j4NJ0l2J9J3Pl1kRk6
7436c0J7NJ1Ll1lM3k3j0K7j4Nqj4K1Ll2J9j9L7KPj8pNKj7J9j7nLJ9rLk0%L8j9
7474gK%JJ9j7k2J7oPj2OK2lm3L1kj1OlJ8Nj5PL2l6lOMj6Jj0J3J4rJ0j%Rpooj1
7516a6j0J5jkJK1k2J2JjJK3m2J7j3lK4lLl6M0Nj7J4j5OkOOj3QJ0Pm4L1k7PJ4j3
7555hK0rlj0j8%J3%QlNmj1J1K3k5J8nJNmppJ6j6J6j2k3L1pk8M4k6kJ0j4M3n0L0
7594Bmq%J7ok4J3pnkJjMJ5k2K8jj7k%K3J1j2NrJ7l2K8pK6ok6%qj1K8lj2J3JOk8
7636a5K5Kk6lJ8Qj7J4Pj4l2L3J3j7J8l5kJ4kPpL7j5qQLMok3NqJ2Ll7K3J0J4k1
$$ plain form
7674 -10 0 -20 1 15 19 -14 -15 24 2 1 -11 -2 -14 -36 17 -31 -1 -5 5 -6 -24 -22 4 -13 -16 -17 10 0 -21 -2 -9 -7 18 15 -39 -11
7710 -11 -18 -16 -17 -23 -3 -28 -34 -23 -7 -6 1 -4 0 11 -1 -4 0 26 -13 13 -16 1 16 17 -13 -9 -3 0 -15 1 2 -11 6 2 11 13 6 6 -7 6 10
7751 10 25 -22 14 -7 -16 -24 -22 -14 6 -26 -8 -7 -12 -11 -14 -14 5 13 -1 17 -6 -1 -10 -10 5 4 8 -25 -14 12 13 -20 -2 -7 -10 10 6 -14 -10 5
7791 5 -2 11 -5 -3 6 -9 -20 -24 -9 -8 -25 7 -17 -27 -18 -27 20 -35 6 27 3 -3 -3 2 12 6 -7 -5 21 14 -12 4 1 2 0 11 11 14 -1 1
7831 1 15 3 -1 8 -33 -3 3 -25 7 -33 -5 17 -25 -39 -26 -4 -10 -19 -18 2 14 -11 5 9 9 20 -3 -27 26 20 25 -6 -17 -9 -16 -7 -11 -5
7869 -5 -28 -14 -5 -10 0 -27 1 10 -5 -1 12 -14 -8 -12 -47 -15 -6 -18 -2 -9 -27 -22 -18 -23 8 -13 -12 -23 -26 11 -12 2 -13 4 13 4 -24 -9
7907 -9 2 -28 20 -8 -15 -6 -17 2 22 9 -14 -5 -20 8 13 -32 16 2 2 -19 -12 -8 -10 -8 5 -13 1 -10 0 -10 21 -6 2 15 2 -10
7943 -10 15 -7 11 -19 9 12 5 -7 7 -15 5 19 -21 -9 -26 4 10 -8 -1 -2 -15 -8 -9 6 -16 15 -16 8 9 0 -4 -11 -7 5 -14 -15 -11
$$ packed form
7674a0J0k0K1J4Ml3jL9k2jj2Rj2k2N3m8L0mJ0j1j8KK6j7ljK7j0k1J9pKK5ln4K8
7710a1pKjoK0k5oJ1J6JPnMJ1j2lMK6l9K6k9J7J5Jl0MOLj5J6Jj3J7mRKp%j3J3M
7751A0J5m7L6k1rqKQK0l2J8JnJl%J9Qj4J8k3Nr%J5jMl3J1K6Jl3J8nlK0mk0MJ5
7791EpJ3j6KRj5j1mJ5Jj7L2k4j0RrM7n5M1K1k4o%NJ0oj3KK6pk6J6lJkJ1%Lj5K
7831AJ4j2mRm1L0Ok8L2m0K8K2m2j4J3K2orJK0J2k5J6M%J1k3k4N3oNl1j1QpRmO
7869ek3J4RnJ0k7K8Rj5MJ3k6Oml5L2Rj2J6pj8NMnL1k1Jj1lL7k3J4j5J7Rrk8J5
7907iJ1l0M8k8pRj1J9K0j3k3Rj5K8Nm5M8j4%k1PMkKJ3j8J4j1J0j0L1k7QJ3j3j2
7943a0K5k2J8l0K8Lpj2J4k2K0J4m0J2j7L0Oj8Pjj3PjJ5k2L1l1K4JrmpMJ2j9jM
$$ plain form
7980 -11 2 0 -14 12 -3 24 21 -11 3 -10 13 12 -8 -23 -8 -30 -16 11 -4 7 -7 4 -7 -18 1 -12 -8 1 3 12 0 -41 -13 -6
8014 -6 15 -2 -17 -4 8 36 -2 0 14 -18 -17 13 25 13 -3 20 -4 -14 17 -3 -22 -13 -18 -14 12 -8 -22 7 -15 -39 -5 -17 -5
8047 -5 -13 0 -9 -22 -17 -18 3 -1 15 18 -4 -16 18 21 -18 5 21 -23 22 2 -19 -13 -15 -20 3 0 -10 5 -22 -7 -4 13 -8 12 12 -22 -1
8084 -1 -6 2 5 -9 19 -38 -4 -15 -6 -19 -13 -34 -17 -23 -15 -4 11 19 -15 11 23 0 -12 17 -4 -12 8 9 -2 -15 -26 3 -4 -8 21 -13 -9
8121 -9 -9 4 -15 17 10 -5 -1 6 2 -2 -8 4 -10 6 9 18 4 -17 12 -4 12 -12 3 -28 18 -23 5 -9 4 1 21 21 22 26 -3 -1 -16 -1
8159 -1 -9 -5 -21 -1 -7 -6 -19 -4 12 -15 -14 11 -15 -4 -4 -1 -24 2 21 11 0 16 -13 -18 -11 -3 -5 -30 12 2 14 -4
$$ packed form
7980a1J3kj4K6j5K7ll2J4j3K3jk0j5J5k2J4K7j5J1j4J1j1j1J9j3MRKRj2m1K8P
8014fK1j7j5J3J2K8l8KJ4l2JL0J2j2j6K3k4j0L1k0j9RnMK6k0j4K9k2k4L4j2J2
8047eqJ3rj3NjK1mJ6Lk2j2L4Ll9K3J6m4M5k0k1OknK3lj0J5k7J5LJ7k1K0%l4K1
8084anQLj4K8n7L4j1Rj3Ok1J7oQJ1J5Ql4K6J2k3j2K9k1qK0Jj1j3j1K9pmK9l4M
8121i%J3j9L2pj5MPmmoJ2j4J6LRj4k1K9j6J6k4J5l1M6m1K8j4J3lK0%JMk9Kj5J5
8159aqMj6K0oJj3J5J6k7JK5k6J1%Lk3K6J9j0j1J6k9nPQkk5M2j0J2j8
8191d
##END NTUPLES=NMR FID
##END=
