##TITLE=1H_SR19_rm2
 D2O, 8 sc, 
 2.10.2020
##JCAMPDX= 6.0         $$ Bruker NMR JCAMP-DX V2.0
##DATA TYPE= NMR FID
##DATA CLASS= NTUPLES
##ORIGIN= UXNMR, Bruker Analytische Messtechnik GmbH
##OWNER= root
$$ XWIN-NMR		Version 3.5
$$ Fri Oct  2 11:51:43 2020 Russian Standard Time (UT+4h)  she@DPX200
##.OBSERVE FREQUENCY= 200.1315066352
##.OBSERVE NUCLEUS= ^1H
##.DELAY= (6, 6)
##.ACQUISITION MODE= SIMULTANEOUS
##.ACQUISITION SCHEME= undefined
##.AVERAGES= 8
##.DIGITISER RES= 18
##SPECTROMETER/DATA SYSTEM= spect
##.PULSE SEQUENCE= zg30
##.SOLVENT NAME= D2O
##.SHIFT REFERENCE= (INTERNAL, D2O, 0, 15.7039)
##AUDIT TRAIL= $$ (NUMBER, WHEN, WHO, WHERE, WHAT)
$$ ##TITLE= Audit trail, XWIN-NMR		Version 3.5
$$ ##JCAMPDX= 5.01
$$ ##ORIGIN= Bruker BioSpin GmbH
$$ ##OWNER= she
$$ F:/spectra/data/she/nmr/H-F/1/audita.txt
$$ ##AUDIT TRAIL=  $$ (NUMBER, WHEN, WHO, WHERE, WHAT)
(   1,<2020-10-02 11:50:16.95 +0400>,<she>,<DPX200>,
      <created by zg, POWCHK disabled, PULCHK disabled
       configuration hash MD5:
       00 E9 B6 7A A2 85 ED C7 34 08 36 98 17 FE 4E 26
       data hash MD5: 16K
       2D 08 70 53 DA 66 90 ED 5B ED 9F 91 B8 BB 1B 64>)
$$ ##END=
$$ 
$$ hash MD5
$$ 62 22 C4 7E 4B 95 DD 26 5B 0E 85 1D 84 F5 7D 6F
##$RELAX= 
##$RELAX= 
##$RELAX= 
##$RELAX= 
##$RELAX= 
##$RELAX= 
$$ Bruker specific parameters
$$ --------------------------
##$DU= <F:/spectra>
##$EXPNO= 1
##$NAME= <H-F>
##$PROCNO= 1
##$TYPE= <nmr>
##$USER= <she>
##$AMP= (0..31)
100 100 100 100 100 100 100 100 100 100 100 100 100 100 100 100 100 100 
100 100 100 100 100 100 100 100 100 100 100 100 100 100 
##$AQSEQ= 0
##$AQ_mod= 1
##$AUNM= <au_zg>
##$AUTOPOS= <>
##$BF1= 200.13
##$BF2= 200.13
##$BF3= 200.13
##$BF4= 200.13
##$BF5= 200.13
##$BF6= 200.13
##$BF7= 200.13
##$BF8= 200.13
##$BYTORDA= 1
##$CFDGTYP= 0
##$CFRGTYP= 5
##$CHEMSTR= <none>
##$CNST= (0..31)
1 1 145 1 1 1 1 1 1 1 1 1 1 1 1 1 1 1 1 1 1 1 1 1 1 1 1 1 1 1 1 1 
##$CPDPRG= <>
##$CPDPRG1= <>
##$CPDPRG2= <>
##$CPDPRG3= <>
##$CPDPRG4= <mlev>
##$CPDPRG5= <mlev>
##$CPDPRG6= <mlev>
##$CPDPRG7= <mlev>
##$CPDPRG8= <mlev>
##$CPDPRGB= <>
##$CPDPRGT= <>
##$D= (0..31)
0 1.2 0 0 0 0 0 0 0 0.06 0 0.03 0 0 0 0 0.0002 0 0 0 0 0 0 0 0 0 0 0 0 
0 0 0 
##$DATE= 1601625016
##$DBL= (0..7)
120 120 120 120 120 120 120 120 
##$DBP= (0..7)
150 150 150 150 150 150 150 150 
##$DBP07= 0
##$DBPNAM0= <>
##$DBPNAM1= <>
##$DBPNAM2= <>
##$DBPNAM3= <>
##$DBPNAM4= <>
##$DBPNAM5= <>
##$DBPNAM6= <>
##$DBPNAM7= <>
##$DBPOAL= (0..7)
0.5 0.5 0.5 0.5 0.5 0.5 0.5 0.5 
##$DBPOFFS= (0..7)
0 0 0 0 0 0 0 0 
##$DE= 6
##$DECBNUC= <off>
##$DECIM= 32
##$DECNUC= <off>
##$DECSTAT= 4
##$DIGMOD= 1
##$DIGTYP= 9
##$DL= (0..7)
0 120 120 120 120 120 120 120 
##$DP= (0..7)
150 150 150 150 150 150 150 150 
##$DP07= 0
##$DPNAME0= <>
##$DPNAME1= <>
##$DPNAME2= <>
##$DPNAME3= <>
##$DPNAME4= <>
##$DPNAME5= <>
##$DPNAME6= <>
##$DPNAME7= <>
##$DPOAL= (0..7)
0.5 0.5 0.5 0.5 0.5 0.5 0.5 0.5 
##$DPOFFS= (0..7)
0 0 0 0 0 0 0 0 
##$DQDMODE= 0
##$DR= 18
##$DS= 0
##$DSLIST= <SSSSSSSSSSSSSSS>
$$ [...]
##$SUBNAM2= <"">
##$SUBNAM3= <"">
##$SUBNAM4= <"">
##$SUBNAM5= <"">
##$SUBNAM6= <"">
##$SUBNAM7= <"">
##$SUBNAM8= <"">
##$SUBNAM9= <"">
##$SW= 16.880792210976
##$SWIBOX= (0..15)
0 0 2 0 0 0 0 0 0 0 0 0 0 0 0 0 
##$SW_h= 3378.37837837838
##$TD= 16384
##$TD0= 1
##$TE= 0
##$TE2= 300
##$TE3= 300
##$TEG= 300
##$TL= (0..7)
0 120 120 120 120 120 120 120 
##$TP= (0..7)
150 150 150 150 150 150 150 150 
##$TP07= 0
##$TPNAME0= <>
##$TPNAME1= <>
##$TPNAME2= <>
##$TPNAME3= <>
##$TPNAME4= <>
##$TPNAME5= <>
##$TPNAME6= <>
##$TPNAME7= <>
##$TPOAL= (0..7)
0.5 0.5 0.5 0.5 0.5 0.5 0.5 0.5 
##$TPOFFS= (0..7)
0 0 0 0 0 0 0 0 
##$TUNHIN= 0
##$TUNHOUT= 0
##$TUNXOUT= 0
##$USERA1= <user>
##$USERA2= <user>
##$USERA3= <user>
##$USERA4= <user>
##$USERA5= <user>
##$V9= 5
##$VALIST= <valist>
##$VCLIST= <CCCCCCCCCCCCCCC>
##$VD= 0
##$VDLIST= <DDDDDDDDDDDDDDD>
##$VPLIST= <PPPPPPPPPPPPPPP>
##$VTLIST= <TTTTTTTTTTTTTTT>
##$WBST= 1024
##$WBSW= 4
##$XGAIN= (0..3)
0 0 0 0 
##$XL= 0
##$YL= 0
##$YMAX_a= 194498
##$YMIN_a= -189029
##$ZGOPTNS= <>
##$ZL1= 120
##$ZL2= 120
##$ZL3= 120
##$ZL4= 120
##$ABSF1= 10
##$ABSF2= 0
##$ABSG= 5
##$ABSL= 3
##$ALPHA= 0
##$AQORDER= 0
##$ASSFAC= 0
##$ASSFACI= 0
##$ASSFACX= 0
##$ASSWID= 0
##$AUNMP= <proc_1d>
##$AZFE= 0.1
##$AZFW= 0.1
##$BCFW= 1
##$BC_mod= 2
##$BYTORDP= 1
##$COROFFS= 0
##$CY= 11.3945322036743
##$DATMOD= 1
##$DC= 2
##$DFILT= <>
##$DTYPP= 0
##$F1P= 16.9975609425685
##$F2P= -3.02152046262296
##$FCOR= 0.5
##$FTSIZE= 0
##$FT_mod= 4
##$GAMMA= 1
##$GB= 0.15
##$INTBC= 1
##$INTSCL= 1
##$ISEN= 128
##$LB= 0.24
##$LEV0= 0
##$LPBIN= 0
##$MAXI= 10000
##$MC2= 0
##$MEAN= 0
##$ME_mod= 0
##$MI= 1.114404
##$NCOEF= 0
##$NC_proc= 0
##$NLEV= 6
##$NOISF1= 3.799351
##$NOISF2= 2.8
##$NSP= 1
##$NTH_PI= 0
##$NZP= 0
##$OFFSET= 15.70392
##$PC= 1
##$PHC0= -10334.71
##$PHC1= 13.80089
##$PH_mod= 1
##$PKNL= yes
##$PPARMOD= 0
##$PSCAL= 0
##$PSIGN= 0
##$REVERSE= no
##$SF= 200.130013532006
##$SI= 16384
##$SIGF1= 3
##$SIGF2= 2
##$SINO= 400
##$SIOLD= 16384
##$SREGLST= <1H.CDCl3>
##$SSB= 0
##$STSI= 0
##$STSR= 0
##$SW_p= 3612.71676300578
##$SYMM= 0
##$S_DEV= 0
##$TDeff= 0
##$TDoff= 0
##$TI= <>
##$TILT= no
##$TM1= 0
##$TM2= 0
##$TOPLEV= 0
##$USERP1= <user>
##$USERP2= <user>
##$USERP3= <user>
##$USERP4= <user>
##$USERP5= <user>
##$WDW= 1
##$XDIM= 8192
##$YMAX_p= 0
##$YMIN_p= 0
$$ End of Bruker specific parameters
$$ ---------------------------------
##NTUPLES= NMR FID
##VAR_NAME=  TIME,          FID/REAL,        FID/IMAG
##SYMBOL=    X,             R,               I
##VAR_TYPE=  INDEPENDENT,   DEPENDENT,       DEPENDENT
##VAR_FORM=  AFFN,          ASDF,            ASDF
##VAR_DIM=   8192,          8192,            8192
##UNITS=     SECONDS,       ARBITRARY UNITS, ARBITRARY UNITS
##FACTOR=    0.000296,      1,               1
##FIRST=     0,             0,               0
##LAST=      2.424536,      0,               0
##MIN=       0,             -189029,         0
##MAX=       2.424536,      194498,          0
$$ Real data points
##PAGE= N=1
##DATA TABLE= (X++(R..R)), XYDATA
$$ [...]
1789c4q7L9Q6j81L00j90K72l05rK45k4Ol23R6K51k26J79n8K8l00L38j38j36K03
$$ -34 -121 -82 4 -177 123 -67 205 -100 -109 136 112 118 -205 -109 142 -84 95 37 65 -235 103 -35 -171 32
1813C2r7o8J6J14L51j61k12q0N6k11J87L32%l40K22n31M65o0j99P1J21KQ6j42
$$ 32 -65 -133 -117 -3 348 187 -25 -105 -49 -260 -73 259 259 -81 141 -390 75 15 -184 -113 8 10 96 -46
1837d6J88l40J52L1j60JL4K53k02O1M2O5L6k05K12m7R2k46K01J2j34km7N0q5R2
$$ -46 142 -198 -46 -15 -175 -174 -140 113 -89 -28 14 79 115 -90 122 75 167 -79 122 134 0 -2 -49 1 -84 8
1863Hj5K7K5q9J84l08J14R1j41J21M2K11m99j68P40l01K9k9k14K07m6l4J63k44
$$ 8 -7 20 45 -44 140 -168 -54 37 -104 17 59 270 -229 -397 343 42 71 42 -172 35 -11 -45 118 -126
1887a26K73k57J67R0n4j95J7J62Q7l01J68J43r5k50J63J68l2j35k5l6P8k2o0K03
$$ -126 147 -110 57 147 93 -102 -85 77 164 -137 31 174 79 -171 -8 160 128 -7 -32 -68 10 -12 -72 131
1911A31N2k44N82o42q8P84o67p3M64m7l14M5K98j50o86P01l65K90l73Q5M45k45
$$ 131 183 -61 521 -121 -209 575 -92 -165 299 252 -62 -17 281 131 -555 146 -219 71 -302 -217 228 -17
1933a7N1k01K18o9N8j4K44j77Q3Qk34l71M32J80p56J109l88k07J83P8k00N5J03
$$ -17 34 -167 51 -18 40 26 270 93 176 184 -50 -421 11 191 -565 544 156 -51 132 210 10 65 168
1956A68l11r3M63k65J31l1j92N61p34L75Q3O29o95Q7q0j8M54m30j05K89m05K09
$$ 168 -143 -236 227 -38 93 62 -130 431 -303 72 155 784 89 176 96 78 532 102 -3 286 -119 90
1978I0N42m18L0n62O50j57m28k49M76L91l07l34O43j10m00mK55l71L7K06l6lR9
$$ 90 632 214 244 -318 332 175 -253 -502 -26 365 58 -276 367 257 -143 -147 108 -263 -226 -20 -56 -59 40
2001D0O9j13j23j50L38N0j42J5M9R8p4p0l1q1J82J18m17L21n4q7J4qm5N9J42j35
$$ 40 109 -4 -127 -277 61 111 -31 -16 33 131 57 -13 -44 -125 57 175 -242 79 25 -62 -48 -56 -101 -42 100 -35
2027c5L49l85N9J02j55O7K83m7k17J12j66j07j55N50j68n10L93J82n3o1l7j48
$$ -35 314 -71 -12 90 -65 2 285 238 21 133 -33 -140 -295 255 87 -423 -30 152 99 38 1 -147
2049a47L08j67k94K45J03j09J27r4O3l7j81J93J20l5M2j21L0o5n7Q9K32j14k28
$$ -147 161 -6 -300 -55 48 -61 66 -28 35 -2 -183 10 130 95 137 16 46 -19 -76 13 245 131 -97
2072i7j25K15m5R2K4l57M92p3j12N1p5m9j50J68n2K06n7j64J41j34J53j71O4J47
$$ -97 -222 -7 -52 40 64 -293 199 126 14 65 -10 -59 -209 -41 -93 113 56 -108 33 -101 52 -119 -55 92
2096I2j9k30m6P2J09r3j66L84j09K57j72n2j83J53L5L3q8j37K9q6K36J19k74R5
$$ 92 73 -157 -203 -131 -22 -115 -281 103 -6 251 79 27 -156 -3 32 65 -23 -160 -131 -217 19 138 -136 -41
2120d1j10L27j26J33j90j10j86L38l91L1L43k01R8l9K30l6O6NJ40l15m8K80k26
$$ -41 -151 176 50 183 -7 -117 -303 35 -356 -325 18 -183 -85 -124 106 70 136 141 281 -34 -82 198 -28
2143b8K7K68k17j82K16j12j10O2J25l3r1K44j83j66K89p6N0P8l86K77j56j09k34
$$ -28 -1 267 50 -132 84 -28 -138 -76 49 16 -75 169 -14 -180 109 33 83 161 -225 52 -104 -213 -447
2166d47M76K78m72oK62k6l51q1K14J92L9J2j38M5j75LK61J34l29j05J38o5K51
$$ -447 29 307 -165 -171 91 65 -286 -367 -153 39 78 90 -48 -3 -178 -175 86 220 -109 -214 -76 -141 110
2189A10k28J62k5j16J70R4q2k3l24J25K29k74J63J46p4k09K69L32K0j384P47J0
$$ 110 -118 44 19 -97 73 167 85 62 -262 -137 92 -182 -19 127 53 -156 113 445 465 -919 -172 -162
2211a62Q24n07k13q3j53P07P8p55n25R85l36o3m15R11J75n52Q6L58k56K35l25
$$ -162 662 155 -58 -141 -294 413 491 -264 -789 196 -140 -203 -618 293 468 -84 2 360 104 339 14
2232A4O1o70N86l75K06L11k11j70M31N84q37j84M38l09M27j31p2j12j5m1j07J52
$$ 14 75 -595 -9 -384 -178 133 -78 -248 183 767 -70 -254 184 -125 302 171 99 -13 -28 -69 -176 -24
2254b4K28K46m77p69N90P36m09L34l78K40k24j09k9Q2k81L14j68j01J77R2j5j89
$$ -24 204 450 -27 -796 -206 530 121 455 77 317 93 -16 -45 37 -244 70 -98 -199 -22 70 55 -134
2276a34j68M14j45K0M4P1r8J89j31J75j94N1j31J2J92k61k0P1J54R7q5o3r7J00
$$ -134 -302 112 -33 -13 31 102 4 193 62 237 43 94 -37 -25 167 -94 -114 -43 111 208 123 60 -37 63
2300F3J25q1l85M13k09k2R7l7J54p9r6OJ18j88J38j23L21k09n8j67P7K9L56l02
$$ 63 188 107 -278 135 -74 -96 1 -36 118 39 -57 -51 67 -121 17 -106 215 6 -52 -219 -142 -113 243 -59
2324e9j10N95j57j28r1n11Q05q18j62R16m73K1K7K23J63o7l3K21k10n6K9j35O1
$$ -59 -169 426 269 141 50 -461 344 -474 -636 280 -193 -172 -145 78 241 174 141 362 152 96 125 -10 51
2347E1M0r5m37p7O19kK23l06L07k01rK96n11P4O55q5o49O01k64j24k48J60Q3J93
$$ 51 91 -4 -441 -518 101 99 322 16 323 122 113 409 -102 -28 627 542 -107 494 230 106 -142 18 101 294
2371B94l47J95J82j55k69L21j19M8j19Q8l43M22m20p9L07K27J91n84j35K77K90
$$ 294 -53 142 324 169 -100 221 102 150 31 119 -224 198 -222 -301 6 233 424 -160 -295 -18 272
2392B72n21R8N38j00n25J57j10R9j31j03Q2K87L2J20O7k83J51jj24J4k37M12m3
$$ 272 -249 -151 387 287 -238 -81 -191 -92 -223 -326 -244 43 75 195 262 -21 130 129 5 19 -218 194 151
2415A51Rj5j03m96L60L24m37O15p00M52R5j86M8N7L34o1m60j94J10K35j37K53
$$ 151 160 145 42 -454 -94 230 -207 408 -292 160 255 69 117 174 508 447 -13 -207 -97 138 1 254
2437B54r0j2M05n46k93L18K6L26p83M73nN75l22o62O49p8k41K45k71K53k58M03
$$ 254 164 152 557 11 -282 36 62 388 -395 78 73 648 326 -336 313 235 -6 239 -32 221 -37 366
2459C66K5n34O8O24K09l34p12j70L47K62k70qk86J71J36Q8p8L3L96l88o1J95q9
$$ 366 391 -143 -75 549 758 424 -288 -458 -111 151 -119 -127 -413 -242 -106 -18 -96 -63 333 -55 -116 79 -10
2482a0J47p7k57L91l92K60m4j89J81J5J25k24R8k9M1Lp5j09J38o7K5J22p2K44
$$ -10 137 60 -197 194 -198 62 18 -171 10 25 150 -74 24 -5 36 39 -36 -145 -7 -74 -49 73 1 245
2506B45k03J26k31J39k13J30k28K93k71L43n8j16J74q1o6rJ03q1o3j1j05K72j1
$$ 245 42 168 -63 76 -137 -7 -235 58 -213 130 72 -44 130 49 -17 -26 77 -4 -67 -78 -183 89 78
2529G8j08p5K53j08j1p1N0n7k22K71n5J95k16n7J92K08j43n12L75o3r2L42l26
$$ 78 -30 -105 148 40 29 -42 8 -49 -271 0 -55 140 -76 -133 59 267 124 -388 -13 -76 -168 174 -152
2552a52J48n1J32%j06j8R2o0j33K75o1k21k28K29N5M65l35J06M1m26N2K05o5R2
$$ -152 -4 -55 77 77 -29 -47 45 -15 -148 127 66 -155 -383 -154 -99 366 31 137 178 -248 -196 9 -56 36
2576C6J99l91K21k05N7mJ35j15R2j79J61r3J56o8J88o1j31k30L95l15K39o9Lo
$$ 36 235 -156 65 -140 -83 -87 48 -67 25 -154 7 -86 70 2 190 129 -2 -232 163 -152 87 18 21 15
2600A5j98J13R4R7k33K89L9l36K0J95l19K95r3J28j52K27q3k76J37O4J68k74J40
$$ 15 -183 -70 24 121 -112 177 216 -120 -100 95 -224 71 -22 106 -46 181 98 -178 -41 23 191 -83 57
2623E7k4M0J01j60pL7p0r6O1j89K80J34p4j12MJ27Q3n7k23P9lo0Q1M9R1j33K41
$$ 57 33 73 174 14 7 44 -26 -122 -61 -250 30 164 90 -22 -18 109 192 135 -88 -9 -12 -72 9 58 149 16 257
2650B57l75L65j70k22J38J26o7n2J90j48k74Q1p1L26J06k46J24j98o1L41k35p9
$$ 257 -118 247 77 -145 -7 119 52 0 190 42 -232 -151 -222 104 210 -36 88 -110 -171 170 -65 -144
2672a44J50l5k8n4O1K74l44R4j30K12J87m17j12J65k0J88k4rn4k34m7M60k81J14
$$ -144 6 -29 -57 -111 -50 224 -120 -26 -156 56 243 -174 -286 -121 -141 47 23 14 -40 -274 -321 139 -142 -28
2696b8j16n2K74L5j09qJ00Mp6j30PJ47L3l83J49J10m8K09J63k50J67l23p9J69
$$ -28 -144 -196 78 113 4 -4 96 100 24 -106 -99 48 81 -302 -153 -43 -91 118 281 31 198 -125 -204 -35
2720c5K16l08NJ93l01K07m5O3ro3J13P5j70N3R0j85J33P2p0l3k56J76K19o6J28
$$ -35 181 -127 -122 71 -230 -23 -68 -5 -14 -77 36 111 -59 -6 84 -101 32 104 34 1 -255 -79 140 74 202
2745B02M7j86J20l44L69k35J51p4j78m6J30M51n03j5P8o1j54rK01K5L4n7K9K34
$$ 202 249 63 183 -161 208 -27 124 50 -128 -174 -44 407 -96 -111 -33 -94 -248 -257 -56 -31 3 -54 -25 209
2769B09o0k73jK7J62l13M92j69M8J7j99J69k2M7k18R8j52J56J06j57K66k37J53
$$ 209 149 -124 -125 -98 64 -249 243 74 122 139 -60 109 87 134 -84 14 -138 18 124 -33 233 -4 149
2792A49n03N88L2l41J5m8m7P2J14Q1k85J19m93K54J10o22J514o51n97Q11l61J73
$$ 149 -354 234 266 -75 -60 -108 -155 -83 31 112 -173 -54 -547 -293 -183 -805 709 58 -539 272 -89 84
2814H4RO8j75O0j47K09j63K4j72K12k57M23k70j10N49j98p53Q27l10L04K20L63
$$ 84 93 161 -14 46 -101 108 -55 -31 -203 9 -248 175 -95 -205 344 146 -607 220 -90 214 434 797
2836G97o83k46J91K00k97R3O7o1p7J29O5j98l4Q4p1r8R8j14J45L84l74j97P3p4
$$ 797 114 -132 59 259 -38 55 122 61 -16 113 178 -20 -54 30 -41 -139 -41 -155 -10 374 0 -197 -124 -198
2860a98K08K16k30K43l41J78kj26J25J80j29M5J87k66j38JML23n67K72L50l30
$$ -198 10 226 -4 239 -102 76 74 -52 73 253 124 169 356 90 -48 -47 -43 280 -287 -15 335 5
2882Ej61PK93j5K01m98L33l01L81m03K73o6j69J49j40p6K15j98L87j15k05k0K65
$$ 5 -156 -149 144 129 330 -168 165 -136 245 -158 115 49 -120 29 -111 -187 28 -170 217 102 -103 -123 142
2905A42k04P4k9m5L20m27J81k4M1j10K40k06L01n4j42N6J2m10K29P5k5o5j5K5
$$ 142 -62 12 -17 -62 258 -169 12 -12 29 -81 159 -47 254 200 58 114 126 -284 -55 20 -5 -70 -85 -60
2929f0L3R1j66L10j76k68K51J59l01M71n51K14LL09k29j49K07n9j90K84J52l91
$$ -60 -27 64 -102 208 32 -236 15 174 -127 344 -207 7 10 319 90 -59 148 89 -101 183 335 -56
2951e6J04j07O3P9m4j60J89q9K4k5P5j36J14k28J41P9j20K25k53o6L10pO5p0j39
$$ -56 48 -59 4 83 39 -121 68 -21 3 -22 53 -83 31 -197 -56 23 -97 128 -125 -191 119 112 177 107 -32
2976c2J20O9n2k88J6J95L9k16K81Q8j49R1j82J08j36J16M6k69J4J74M8j06m0J03
$$ -32 88 157 105 -183 -167 28 67 -149 132 220 71 162 -20 88 -48 68 114 -155 -141 33 81 -25 -65 38
3000C8J13j56K2J63k45j73J6J29R4j39K15J00l5j29KJ41P6j17q2q2J4j33J36o6
$$ 38 151 -5 17 180 -65 -238 -222 -93 1 -138 77 177 142 13 15 156 232 115 33 -49 -35 -168 -32 -98
3024i8J3J96l38L27q1Nk18J31q6L17k21M9K59l35k94M89J6k58K61j46j77N8L64
$$ -98 -85 111 -227 100 19 24 -194 -63 -149 168 -53 -4 255 -80 -374 115 131 -127 134 -12 -189 -131 233
3047B33l93L13q0j70R8r7J12J11k15O9P5O6j3M3k8k34L59m84M40k97J75k5j06
$$ 233 -160 153 73 -97 1 -96 16 127 -88 -19 56 122 109 152 124 -110 249 -235 205 -92 83 58 -48
3070d8M8J2K24r6j81j07K39l5k13K75R3N8n19K90M92n90J84j37l38j14L94L8J21
$$ -48 0 12 236 140 -41 -148 91 56 -157 118 211 269 -250 40 532 -58 126 -11 -349 -463 -69 -31 90
3093I0n6r3L2j59K4P19k60L30n84j93J00K56j58m37P79l69m2j04K4P9o0R72j210
$$ 90 34 -59 -27 -186 -162 557 297 627 43 -150 -50 206 48 -389 390 21 -21 -125 -101 -22 -82 890 -320
3116c20N13J05l12J2K5K9p9O0j16o0J31K8r9pJ63j52K95m19J26J76n6j5j99K23
$$ -320 193 298 -14 -2 23 52 -27 33 -83 -143 -12 16 -83 -90 73 -79 216 -203 -77 99 43 28 -171 52
3140E2l20L45J65k27n3M7k05mJ16L68k07k8nk31K0L36j39R7k84J39J26J85p16
$$ 52 -268 77 242 15 -38 9 -196 -200 -84 284 77 49 44 -187 -167 169 30 127 -157 -18 108 293 -423
3163d23M40j89M31m9k90pR3n3J9Q3J9k17K11J55j70R4l55K99j20oJ57j58o9L15
$$ -423 17 -172 259 210 -80 -87 6 -47 -28 55 74 -143 68 223 53 147 -208 91 -29 -35 122 -36 -105 210
3187B10o0q7K8m5M6j19N1P2J7k02j47P4K39J15k18J55j19jm3J4n2J16Q1k82Q2
$$ 210 150 63 91 46 92 -27 24 96 113 -89 -236 -162 77 192 -26 129 10 9 -34 -20 -72 44 125 -157 -75
3212g5N7j8Q3J82l38L01j54KL4k83M11k82K78m93L32J15j99l7j35N7J56J03m51
$$ -75 -18 -36 47 229 -109 192 38 40 74 -209 202 -80 198 -295 37 152 -47 -84 -219 -162 -6 97 -354
3235c54K10K22k19j6K14j26o3R5K5l1L8r3L49l27P1J33N0j54J9n0P5m31M33K24
$$ -354 -144 78 -141 -157 57 -69 -132 -37 -12 -43 -5 -98 251 -76 -5 128 178 24 43 -7 68 -363 70 294
3259B94l65J76Jj38J02l07J91O6Jj01k0K00K44l52M9k90K21q6L53k49M7kk08K82
$$ 294 -71 105 106 -32 70 -237 -46 20 21 -80 -100 100 344 -8 41 -249 -28 -114 239 -10 37 35 -173 109
3283A09K58m83K71k62J85p1k22J39j52K14J45j24k84M00j41K85l59k46O11r0K
$$ 109 367 -116 155 -107 78 7 -215 -76 -228 -14 131 7 -277 123 -18 267 -92 -338 273 183 185
3304A85j09j4J81k70J5l5M5k4K65j90k6J68r9m9j45J89R6j78k4q4J9j87Q7Q5l4
$$ 185 76 62 243 -27 -12 -47 -2 -26 239 49 23 191 92 43 -102 87 183 5 -19 -103 -84 -271 -184 -99 -133
3329a33j74K99N8j55J32j14R9J40m6j35Rk3q1J78j60r5L46l34K87P4j22j77Q0
$$ -133 -307 -8 50 -105 27 -87 12 152 106 -29 -20 -43 -124 54 -106 -201 145 -189 98 172 50 -127 -47
3352d7N0Oj77R2J58j53K60j70N0q2k92O8Q5J76j00j10M44l23J45J7q3M6J86k00
$$ -47 3 9 -168 -76 82 -71 189 19 69 -13 -305 -237 -152 24 -76 -186 258 -65 80 97 14 60 246 46
3376D6P4l09K45J90l82J51k7O4M9j53j3K32k91J30L0M4k41K12k8m3M1o3R7j14
$$ 46 120 -189 56 246 -136 15 -12 52 101 -52 -65 167 -124 6 36 80 -161 51 23 -20 21 -42 55 -59
3400e9J34j89M38m95K61J49m37K71o1m7LO5j13J06n7k1J04M2m2p6n0J12j17J69
$$ -59 75 -114 324 -171 90 239 -198 73 12 -35 -32 33 -80 26 -31 -52 52 94 52 -24 -74 38 -79 90
3424I0j11j90J61Q4J39M4k92J5J76j18k24K97J63j60J67p4k83k0K70j21K4K37
$$ 90 -21 -211 -50 34 173 217 -75 -60 116 -2 -226 71 234 74 241 167 -116 -136 134 13 37 274
3446B74j54j92K0J40j94L17j08k04J32J40j88j01J63P2m8j38q5R3R9r8Mk4j10
$$ 274 120 -72 -52 88 -106 211 103 -101 31 171 -17 -118 45 117 69 -69 -154 -61 38 -60 -56 -80 -190
3469a90J09N1l50K67K96L8j65j50K18O4km0l76L14J7J46k80L29j2k84K7j52R1
$$ -190 -81 -30 -380 -113 183 221 56 -94 124 188 186 146 -230 84 101 247 -33 296 284 0 27 -125 -34
3492c4j30J36j86J01J16R3l22o3L01k8j51P2J18q4k4K87l52K04O1r0J0j38l05
$$ -34 -164 -28 -214 -113 3 96 -226 -289 12 -16 -167 -95 23 -61 -85 202 -150 54 115 25 35 -103 -408
3515d08L36K95r1j33mP0k57R0j07J14J3O1k2K50n8j34L52l71Q1r3K30j60k64J69
$$ -408 -72 223 132 -1 -5 65 -192 -102 -209 -95 -82 -21 -43 207 149 15 367 -4 77 -16 214 54 -210 -41
3539d1L8k69L61m4m2j3J34p7k27K5L52m83K40n9K41J3k79J4J94J28r4J30k68l06
$$ -41 -3 -272 89 45 3 -10 124 47 -180 -155 197 -286 -46 -105 136 149 -130 -116 78 206 112 242 -26 -332
3563c32J14K33Q8k92J01K84k06J44j6o6j08O2j17J35j00RM4P4j67K7J32nj09O0
$$ -332 -218 15 103 -189 -88 196 -10 134 118 52 -56 6 -111 24 -76 -67 -23 51 -116 -89 43 38 -71 -11
3587a1o0K70j69K07j99Kn5k6l0K47j51J6O1r2L0j18J65Om28J74K20j65K45k89
$$ -11 -71 199 30 237 38 40 -15 -41 -71 176 25 41 102 10 40 -78 87 93 -335 -161 59 -106 139 -150
3611a50L67k35k8M0J70q8p1k25J09j42K90O0p1N3j56J79P3j1k32j48J41P1j26
$$ -150 217 -18 -46 -6 164 76 5 -220 -111 -253 37 97 26 79 -77 102 175 164 -68 -216 -75 -4 -130
3634a30K94j23J07j45J13j54l1J07R2k44L95l14O7j77K09P1j20J24o8j97J03j58
$$ -130 164 41 148 3 116 -38 -69 38 130 -114 281 -33 34 -143 66 137 17 141 73 -124 -21 -179
3656a79J81j18k28L35j99PL46l68K75k11L20j53p6J53j47j4K4J27J03o1j08l7
$$ -179 2 -116 -344 -9 -208 -201 145 -223 52 -159 161 8 -68 85 -62 -76 -52 75 178 117 9 -28
3678b8K10k56J63L0J27j88j21J48k51m5K26o4k11K33J26J25m1j39o3n6J62N0l89
$$ -28 182 -74 89 119 246 58 -63 85 -166 -211 15 -49 -260 -27 99 224 183 44 -19 -75 87 137 -252
3701b52L37k23J22o5L79m56p8K21J92l05n2L09k57K3J47Q3k31j0J36J06k35Q8
$$ -252 85 -138 -16 -81 298 -158 -236 -15 177 -128 -180 129 -128 -105 42 125 -106 -116 20 126 -109 -21
3723b1L11k24k11K04J35j77m6j46K2J66j29M5K61j79k27R7K48j65j3J0q7R4k3
$$ -21 290 66 -145 59 194 17 -29 -175 -153 13 -116 -71 190 11 -216 -119 129 -36 -49 -39 -126 -32 -55
3746e5J89qk86O2J12j68K03L45p19L54m1j49J79j95K82j17K17m49J76J5P5P7j97
$$ -55 134 126 -160 -98 14 -154 49 394 -325 29 -12 -161 18 -177 105 -12 205 -244 -68 -53 22 99 -98
3769i8K78l07nJ72j6l6J16l3r5L0k45L30j6j90K16k10p5J39ljk13K26J57j12M3
$$ -98 180 -127 -132 40 24 -12 104 71 -24 6 -239 91 75 -115 101 -109 -184 -45 -48 -49 -262 -36 121 9 52
3794E2J34j50k86L84JO6Jj03l17M47l47p2M49j85J03j44N0R0n7K9k85K70j58j72
$$ 52 186 36 -250 134 135 201 202 99 -218 229 -118 -190 259 74 177 33 83 173 116 145 -140 130 -28 -200
3818b00K20OJ00j06n2J90k88L16j14J10R6m71J38J68J12m3l18L24m8l8j88M3J12
$$ -200 20 26 126 20 -32 158 -130 186 72 182 278 -193 -55 113 225 182 -136 188 140 102 -86 -43 69
3841F9r3M3k14O0K60K6k69LJ16o4r4J51K50j45o8J01J04k42%j47J46J21j60J58
$$ 69 -24 19 -195 -135 125 151 -118 -115 1 -63 -157 -6 244 99 31 132 236 -6 -6 -153 -7 114 -46 112
3865A12j19O8q9M8j74L8j41L39j03k3j04n8K00N7j22J32p7R8j18K96k91K09Lk75
$$ 112 -7 61 -28 20 -154 -116 -257 82 -21 -44 -148 -206 -6 51 -71 61 -16 82 -36 260 -31 178 181 -94
3889i4L18k19k5l0O5j25J49L74n29o4J36q7K10j3m9L4J12j39k2N1j40P5OJ13j63
$$ -94 224 5 -20 -50 15 -110 39 413 -116 -180 -44 -131 79 66 17 51 163 24 2 53 -87 -12 -6 107 -56
3914e6Q3j51j46K78j75N5J68p6J14j77K80K5k58P0O1j79J23j70K72m5j39K00R
$$ -56 27 -124 -270 8 -167 -112 56 -20 94 -83 197 222 -36 34 95 -84 39 -131 141 96 -43 157 166
3937A66l64J18J86j62O9K8J04j01M2J70l21m4j22J27J36R8m48N04k13J79l1k28
$$ 166 -198 -80 106 -56 13 41 145 44 86 256 -65 -109 -231 -104 32 130 -318 186 -27 152 121 -107
3959a07J87j40O6J09j48J4J30M6o4K9k23K47j71j6j88R3L74k1l76Q6O8p0K7J63
$$ -107 80 -60 6 115 -33 -19 111 157 93 122 -101 146 -25 -41 -229 -136 238 217 -159 -73 -5 -75 -48 115
3983A15k21K59j62M4k7l7l8r1M41k71k19K32k87L67Kj36l8R4j19J09k0k4J86l19
$$ 115 -106 153 -9 35 8 -29 -67 -158 283 12 -207 25 -262 105 107 -29 -67 27 -92 17 -3 -27 159 -160
4007a60J83j40O4J29Pj53N9K12k18L5l5o4j77M60o7k0k85K65j15j72J57j12M7
$$ -160 23 -117 -53 76 83 -70 -11 201 -17 18 -17 -81 -258 202 135 115 -170 95 -20 -192 -35 -147 -100
4030a00J93l05J90j05L6J42j14K32k90m3J29j30J0M37j72k01J3k8L9J74l48P6
$$ -100 93 -212 -22 -127 -91 51 -63 169 -121 -164 -35 -165 -155 282 110 -91 -78 -106 -67 107 -241 -165
4052a65J23N4n1K29k08J40j49k0J18o1k00jJ45n0m8K3M3o7K95j52Q6j83N5k98
$$ -165 -42 12 -39 190 -18 122 -27 -47 71 10 -190 -191 -46 -96 -144 -121 -78 -145 150 -2 84 -99 -44 -342
4076c42K52K03n3m2J7P7pJ24k47m7j9P7J27M1p2m0j43j51mJ37N5j75K92j62l6
$$ -342 -90 113 60 18 35 112 105 229 -18 -65 -84 -7 120 161 89 49 -94 -245 -249 -112 -57 -232 60 -102 -138
4101a38K6O5J39k18J83J01l82L37k44K64j66m3K2r4J46J1K4K5J83k71J7j26K17
$$ -138 -112 -47 92 -126 57 158 -224 113 -131 133 -33 -76 -54 -148 -2 9 33 58 241 -30 -13 -139 78
4124G8j23M4J18j49J20p7L3p5k12L79j11k94K24p4J2L60p8k98K9j52K97Mr9q7
$$ 78 -45 -1 117 -32 88 11 44 -31 -243 136 25 -269 -45 -119 -107 253 175 -123 -94 -246 51 55 -44 -131
4148a31m1J33O5J7k09L28k23L5N9Nm6Rj19K62K57k48j56J02k8M5J7k0M9k6k4k3
$$ -131 -172 -39 26 43 -166 162 -61 -26 33 38 -8 1 -118 144 401 153 -3 99 71 116 133 113 162 136 112 89
4174H9P8j02j74J07L5n6j6j18R6J00j64q1K02p2P6k12J95p8J14j05J83p8K22l41
$$ 89 167 65 -109 -2 33 -23 -39 -157 -61 39 -125 -206 -4 -76 0 -212 -17 -95 19 -86 97 19 241 -100
4198a00J91K1j63R4k7R6j42N9J43r4l0o47N20j68J68K0L92l61k68N04p57P17j48
$$ -100 91 112 -51 43 16 112 -30 29 172 78 48 -599 -79 -247 -79 -59 333 -28 -296 208 -549 168 20
4221B0m4P7Kk00K90j19J44Pr7K16j16k5M7k93J53J27k60j35J37N1j27L16j25j30
$$ 20 -24 53 55 -145 145 26 170 177 80 296 180 155 202 -91 62 189 -71 -206 -69 -18 -145 171 46 -84
4245h4K7J54Pj20j35K16j33K7m9L32q3l5k38J17L4j8j95M00m85N59n1k94L5Q4
$$ -84 -57 97 104 -16 -151 65 -68 -41 -90 242 159 124 -114 3 37 19 -176 224 -261 298 247 -47 -12 72
4269G2o6j70k3R4o0K64k79K08p4k52J02K93j64K61m55J80K48l93L49m03L33k77
$$ 72 6 -164 -187 -93 -153 111 -168 40 -34 -286 -184 109 -55 206 -249 -69 179 -214 135 -268 65 -212
4291b12P1R3lj85Q1j4L9j29L07q9M7M2J33k67L92l73k9J68l24J52J16J9j47Q3
$$ -212 -141 -48 -51 -236 -155 -169 -130 -259 48 -41 6 48 181 -86 306 -67 -96 72 -252 -100 16 35 -112 -29
4315b9O5l83M79j52R9j07k06K45p6lJ46nL1J58l67J74j15j81P2k8L77k65j30K45
$$ -29 36 -347 132 -20 79 -28 -234 11 -65 -68 78 73 104 262 -105 69 -46 -227 -155 -183 194 -71 -201 44
4339D4k48P8j44L13o4J52p06M82K03M8q1J45k81j24K11lN2J62j04k05L58l54n8
$$ 44 -204 -126 -270 43 -21 131 -575 -93 110 158 77 222 -59 -183 28 25 77 239 135 -70 288 -66 -124
4362a24K51j14K1j13J25J10j94Q3J04j74O6K8n9o6L2L04m20J61l3l2q4N8rL1k51
$$ -124 127 13 34 -79 46 156 -38 45 149 -25 41 69 10 -56 -24 280 -140 21 -12 -44 -128 -70 -79 -48 -299
4387b99L86k82J96j81k2L94r8j31N9J52j28l69J06Q0J19J49j32o4J44j81O1J48
$$ -299 87 -195 1 -180 -202 192 94 -37 22 174 46 -323 -217 -137 -18 131 -1 -65 79 -102 -41 107
4409A07m9j42K25j01k30J89K11k58N6J94k77P0P4L3r4j42K10k31K88m9j84q6L08
$$ 107 58 -84 141 40 -190 -1 210 -48 8 202 -75 -5 69 102 8 -134 76 -155 133 84 -100 -186 122
4432A22l27J38P3J2k37L92m92J26J5K49j08J00k80K23P7j60J53qJ09j02l8j71
$$ 122 -205 -67 6 18 -219 173 -319 -193 -178 71 -37 63 -217 6 83 -77 76 68 177 75 37 -134
4454a34J24O4j16N8l1P9K4k22J45q9K67l3k34J97n4r8L1M2o4l5K31q8Rk39K88
$$ -134 -10 54 -62 -4 -35 44 68 -154 -9 -98 169 136 -98 99 45 -53 -22 20 -44 -79 152 64 73 -166 122
4479A22j74P7J40j23j56r9J94n4QN0J40j52Q6K5J68l03m3K32k48O4K24j58N1P0
$$ 122 -52 25 165 42 -114 -213 -19 -73 -65 -15 125 -27 59 84 252 -51 -94 138 -110 -46 178 20 71 141
4503A41j61rj4L5L78n59K75rq2L08j71j16j91J47j6J17R7k32J41j12J15PJ06k54
$$ 141 -20 -29 -43 -8 370 -189 86 77 -5 303 132 16 -175 -28 -44 73 170 -62 79 -33 82 89 195 -59
4527e9K39j70m3R8j36MJ38o6j45n9J90r0M7J8l9J33J50j96K1n8j77K06lR1j72
$$ -59 180 10 -33 65 -71 -67 71 5 -140 -199 -9 -99 -52 -34 -73 60 210 14 35 -23 -200 6 3 94 -78
4552g8j18j29L89J31ko7J57k51J7m1o3j67K94k1o9k3J34P4K5l11J35P0J20j52
$$ -78 -196 -325 64 195 193 126 283 32 49 8 -55 -222 72 51 -18 -41 93 167 192 -119 16 86 206 54
4576E4j25n4L14j44M7j39M7j22J11J96l28M9j61J36J0J58j93j41O6K33j67L07
$$ 54 -71 -125 189 45 92 -47 0 -122 -11 185 -143 -94 -255 -119 -109 49 -144 -285 -219 14 -153 154
4598A54j80L7J7j65K43N5j59oo2O0p8P0J60k36J02J16K2q2N3k44K99j06R3j65
$$ 154 -26 11 28 -137 106 161 2 -4 -66 -6 -84 -14 146 -90 12 128 150 68 121 -123 176 70 163 -2
4622bk91L55j08j43j0J89l0M9m9K3Q8N5j02J8nm8J70j24n2K45j80N9jk04N9J0
$$ -2 -293 62 -46 -189 -199 -10 -40 9 -40 -17 71 126 24 42 37 -11 159 35 -17 228 48 107 106 -98 -39 -29
4648b9Q4P8o5j92N1o6J31m2j59n4K02q2kL59k69N5K01j52K4j75j18Q7K9J53J45
$$ -29 55 133 68 -124 -73 -139 -8 -50 -209 -263 -61 -143 -145 214 -55 0 201 49 73 -102 -220 -133 -104 49 194
4673A94j33j13o5J55J6j68o7J21J25j51P5J94J45k65l5K5m6J9nr8p1P1J5J19N5
$$ 194 61 -52 -117 38 54 -114 -181 -60 65 -86 -11 183 328 63 28 53 7 26 21 -77 -148 -77 -62 57 112
4698A12J1m81M36l19J15K3l6QL05k83K38l76J69L7L5j12J65J11k62l3K19j28j3
$$ 112 123 -358 78 -241 -126 -103 -139 -131 174 -109 129 -247 -78 -41 -6 -118 47 158 -104 -137 82 -46 -59
4721e9K41k09J03j77K39m19kK69J16k48J28l2j58N8K74j69P5j10NM6R0l00L09
$$ -59 182 -27 76 -101 138 -281 -283 -14 102 -146 -18 -50 -208 -150 124 -45 30 -80 -75 -29 61 -239 70
4744G0n2J21n4j17l2R0j63j18J13Q8J40j60M9L70j63J43k58J23j40q7J42j27J18
$$ 70 18 139 85 -32 -64 26 -137 -255 -142 -54 86 -74 -25 345 182 325 67 190 50 -37 105 -22 96
4767I6J3n8k87K17p9K53q8j4k29k4N5P3j36M45n10J54K21k07P5K20j17Jj96L3
$$ 96 109 51 -236 -19 -98 155 67 53 -176 -200 -145 -72 -208 237 -273 -119 102 -105 -30 190 73 74 -122 -89
4791h9l6J53j27q8L41j6k75p2L31m27J79J06K22%p1j04j54K95N6j01j91n6j69
$$ -89 -125 28 -99 -187 154 138 -137 -209 122 -305 -126 -20 202 202 131 27 -127 168 224 123 -68 -124 -293
4814b93K94l6J68q0M5j39K64m74M34m95L61kj83L43k30o3j7jl6K78k04j86oJ14
$$ -293 1 -35 133 53 98 -41 223 -251 183 -312 49 47 -136 207 -23 -86 -103 -104 -140 138 -66 -252 -258 -144
4838a44K76R2k38N7J93j17k1l0O1K2r8O4o8p5k26M11l38J68j04PK86j88o2J11
$$ -144 132 224 -14 43 236 119 98 68 129 151 53 117 49 -26 -252 159 -179 -11 -115 -108 178 -10 -72 39
4862C9j49J13Q3R0j44o6J49j92m2K84j10Q5p1J5j78Q3R0j94K43j91j28K88j89
$$ 39 -110 3 86 176 32 -34 115 -77 -119 165 55 140 69 84 -94 -11 79 -115 128 -63 -191 97 -92
4885i2M3J57l60L71k64j3K1K59l03Q5%J70J86l94J90j98K82l32J86M6J29j15J8
$$ -92 -49 108 -252 119 -145 -158 -137 122 -181 -96 -96 74 260 -134 56 -142 140 -192 -6 40 169 54 72
4908G2j53m6r9J83j62K31j18rJ60k78J13J42R7k43L8j6O6R9p9K41j32j76j50L02
$$ 72 -81 -127 -226 -43 -205 26 -92 -101 59 -219 -106 36 133 -110 -72 -88 -22 77 -2 239 107 -69 -219 83
4932H3j79n3K45j75J24j1O9J49k72K8o2q6K36l85L27j43M6J95m01K97l3J49j05
$$ 83 -96 -149 96 -79 45 34 103 252 -20 8 -54 -140 96 -289 38 -105 -59 136 -265 32 -1 148 43
4955D3K11m12K79k36j1P1j19O1J97k14J84r0n0q7K35k33O3n3K95k87N1O7j35L47
$$ 43 254 -158 121 -115 -126 -55 -174 -113 84 -130 54 -36 -86 -173 62 -171 -108 -161 134 -153 -102 -35 -170 177
4979A77k51P0J44N5l52L90j28j41M7n6J24k8J8N1m5r9K61j53l0j56K27r9q3J04
$$ 177 -74 -4 140 195 -157 233 105 -36 11 -45 79 51 69 120 75 -24 237 84 54 -102 125 26 -57 47
5003D7j9k1J46J40l24QP0M2j46K08j1k23J73R7k17K56j13j27n8j46K62M1lr3K7
$$ 47 28 7 153 293 -31 -23 47 89 -57 151 140 -83 90 187 -30 226 113 -14 -72 -218 44 85 82 -11 16
5028A6j01n0L2M8L03l50M6j69M64k67K35r3j49j5J85k8J22j86j13J35j16K64l46
$$ 16 -85 -135 -103 -55 248 -102 -56 -225 239 -28 207 114 -35 -50 135 107 229 43 -70 65 -51 213 -133
5051a33L15J96l48J6J73k75R8m3N3Q4N9k24M2O5j74l9J07k8k0j52K83J09j69Q2
$$ -133 182 378 30 46 219 -56 42 -1 52 136 195 -29 13 78 -96 -135 -28 -56 -76 -228 55 164 -5 77
5075G7R0o6j30JJ6m2K46r1K1l6m3N3o5M5j60K22j37lq3K13l77L08J11k23l06M00
$$ 77 167 101 -29 -28 -12 -54 192 101 122 86 43 96 31 76 -84 138 1 -2 -85 128 -249 59 170 -53 -359 41
5101D1j07l6K94j46k23L3L23k38J33l11L84j55J11k94M01r7RJ7O7k62NJ69j28
$$ 41 -66 -102 192 46 -177 -144 179 -59 74 -237 147 -8 103 -191 210 113 122 139 206 -56 -51 118 -10
5124a0kJ15j35q8l5L99k9n17K69m2J83o5mo3P3k1J14l30J20J97j85R4M2Q8j62
$$ -10 -12 103 -32 -120 -155 244 215 -302 -33 -75 108 43 39 -24 49 28 142 -188 -68 129 -56 38 80 168 6
5149FR3oj66j57J56k4j61L16j42K29j34J91k19q7K26j04K61k60o4o4M1J18n8J97
$$ 6 99 93 -73 -230 -74 -98 -259 57 -85 144 10 201 -18 -105 121 17 278 18 -46 -110 -69 49 -9 188
5173A88l07j21M43l48l4M71k97N5j61j66R4j9K00l54M79Ll57K37n1O2Q1l8k23
$$ 188 -119 -240 203 -145 -179 292 -5 50 -111 -277 -183 -202 -2 -356 123 126 -231 6 -45 17 98 60 -163
5196a63J50j71K23J9q1R9o5q3pK32j38O0q7J81k48J03J76j50k13M3O1j77J6K91
$$ -163 -13 -184 39 58 -23 76 11 -72 -79 153 15 75 -12 169 -79 24 200 50 -163 -120 -59 -236 -220 71
5220G1k58J64K01j73q1J1R5M9k94P9L76k25q5k11J17N9L1R8j68L92l12j39J28
$$ 71 -187 -23 178 5 -76 -65 30 79 -215 -136 240 15 -70 -281 -164 -105 -74 24 -144 248 -64 -203 -75
5243g5l6J29j82K65j34L52l21qL7q4P1pJ9kk89L81n3K6k22J13P8j47K02j70J12
$$ -75 -111 18 -164 101 -33 319 -2 -10 27 -57 14 7 26 24 -265 116 63 89 -133 -20 58 -89 113 -57 55
5268E5l6R3j22o5M0J0k33O14j74j63J80j68O4j62j13M24j97o3oM9m2n1J62k93
$$ 55 19 112 -10 -75 -35 -25 -258 356 182 19 199 31 95 -67 -180 244 47 -16 -22 27 -15 -66 96 -197
5292a97Q7m4J59K84l96L2n1J92p4J04k10O0j60Q7J64J07j00j6q6J37k26Q0j98
$$ -197 -110 -154 5 289 -107 -75 -126 66 -8 96 -114 -54 -214 -127 37 144 44 28 -58 79 -147 -67 -265
5315b65L23nj96K13r3j07K09j27K9q7j7J45P7j47n2J65n7j04K24p2o7O7K7K9k23
$$ -265 58 53 -143 70 -23 -130 79 -48 -19 -106 -123 22 99 -48 -100 65 8 -96 128 56 -11 56 83 112 -111
5340a11J06J83m60L01k4q5M8oR1K22j38j62M3k3J7p6L44l54J38K1j3J70r8L2k6
$$ -111 -5 178 -282 19 -5 -90 -42 -48 43 265 127 -35 8 -15 2 -74 270 -84 54 75 62 232 134 166 140
5365A40q6n6P7RK07l68J90o9k38J16J62l11J41J00R1j43QJ68j35J36k6l94M70
$$ 140 54 -2 75 84 291 -77 113 44 -194 -78 84 -227 -86 14 105 -38 -30 138 3 139 113 -281 189
5388A89l54Q6K27N2k25n3M4K23j34O5N6q2k96J72J34k78K64j09L9j98K41P3M9
$$ 189 -165 -79 148 200 -25 -78 -34 189 55 120 176 94 -202 -30 104 -174 90 -19 20 -178 63 136 185
5411A85j64k37K43L4j98J81N4p8J80j90m0R5j27N2p5J44O1k07R0J19j61n8J22
$$ 185 21 -216 27 61 -137 44 98 20 200 10 -30 65 -62 -10 -85 59 120 -87 3 122 -39 -97 25
5434B5q3n3L28l30J59o8j03L49O3j58j07l3J40k29J51j89P7Q3pJ00p7N5lj60K14
$$ 25 -58 -111 217 -113 46 -22 -125 224 287 129 22 -11 129 -100 51 -138 -61 22 15 115 38 93 90 -70 144
5459A44j38N2M2k17R9j3p3J7J55k61O0M4J31j75J85k24J23J6K06l33N5m4K73j85
$$ 144 6 58 100 -117 -18 -31 -104 -87 68 -193 -133 -89 42 -133 52 -172 -49 -33 173 -160 -105 -149 124 -61
5483f1K26j1k24o8K37K8k18R6l4j15J94k5J70k48J02j1L05m42J59j59J60K04k75
$$ -61 165 154 -70 -138 99 127 -91 5 -29 -144 50 25 195 -53 49 38 343 -99 60 -99 61 265 -10
5506a0M25n04J42lr1o6LK64n3j04l1L3M8j69k1P3O8j1l2K11l32K18j26J77k13
$$ -10 415 -89 53 50 -41 -107 -104 160 107 3 -28 5 53 -116 -137 -64 4 -7 -39 172 -160 58 -68 109 -104
5531a04l5J02J19J54k21J74k23J57J2j97K10n3l24O3L53j71j58J28J15p1k13K08
$$ -104 -139 -37 82 236 15 189 -34 123 135 -62 148 95 -229 -166 187 16 -142 -14 101 30 -183 25
5553B5Q1j45J8P1l7P5j3K4k29KK37l18L04j58M2N6j48L84k60p7P9l5P9J79j86
$$ 25 106 -39 -21 50 13 88 75 99 -130 -128 109 -209 95 -63 -21 35 -113 271 11 -66 13 -22 57 236 50
5578E0j04L5N3p3J63J3Qo2k17L21k03l4M9Q3k06J2J63JJ16j36j22J57j12j94N1
$$ 50 -54 -19 34 -39 124 137 145 83 -134 187 -16 -50 -1 82 -124 -112 51 52 168 32 -90 67 -45 -239 -188
5603a88K44k22L32m1l18L06l8K1P4l83J38m8J20l9M2q6Q7N7j63L53k30J71j32
$$ -188 56 -166 166 125 -193 113 75 96 170 -213 -75 -123 -3 -42 0 -86 1 58 -105 248 18 189 57
5626E7j38K25l46K56k38J19P5j61K59p6Q0j05K51k23k8o9j22K15J46r5j81J49
$$ 57 -81 144 -202 54 -184 -65 10 -151 108 32 112 7 258 35 7 -62 -184 31 177 82 -99 50
5648E0p4j00NK9Q3o7J96n2K4q4r8J26m6L6k04M13k25j73l7J53j30j03K64O9M5
$$ 50 -24 -124 -119 -90 -7 -74 122 70 94 10 -88 38 -8 28 -176 237 12 -161 -198 -45 -175 -278 -14 55 100
5673A00q6K8k4O1j30K32k57K17j31K10k79J86n68M41Rr4p3K62k11N9l9J23M0J38
$$ 100 14 42 18 79 -51 181 -76 141 10 220 -59 127 -441 0 9 -85 -158 104 -107 -48 -87 36 76 214
5697B14j86k31K07j84q4J54J07K03j47m3J9N6j63P5j10J01K05k74p7K38j86O7
$$ 214 28 -203 4 -180 -264 -110 -3 200 53 10 29 85 -78 -3 -113 -12 193 -81 -158 80 -106 -39
5719c9J89l11P6Q8J22j64n7l3M2R7p2J12J7q5j58L02j84R3K33k99L31l33J72l63
$$ -39 150 -161 -85 3 125 -39 -96 -129 -87 10 -62 50 67 -18 -176 126 -58 35 268 -31 300 -33 139 -224
5743b24K72P4k60Q7p0L15j63k00K54j73J35J36o3l02J48J26k77K77k80L40l18
$$ -224 48 122 -138 -51 -121 194 31 -169 85 -88 47 183 120 -182 -34 92 -185 92 -188 152 -166
5764a66R1K41j82M1M2J78m43K04N3j40j9J97J36m4j72l3n6K02J92m43J93O2p8
$$ -166 -75 166 -16 25 67 245 -198 6 59 -81 -100 97 233 189 17 -16 -72 130 322 -121 72 134 56
5787E6n1j63J07N4M5j71J93o5k2J94j96J53M1j37j13m5j6rK84j63j71K07j31k45
$$ 56 5 -158 -51 3 48 -123 70 5 -17 177 -19 134 175 38 -75 -120 -136 -145 139 -24 -195 12 -119 -364
5811c64L59n1K28k56J44L0r2J51l76K36Q2k02J26j54L01q3KJ12k96K15Q2J07j36
$$ -364 -5 -56 172 -84 60 90 -2 149 -227 9 91 -111 15 -139 162 79 81 193 -103 112 194 301 165
5834A65k39M9oJ44lk08o0J78m5j06n0J30j01K85k62P1q5L01k99m7J56J14j66J27
$$ 165 -74 -25 -31 113 110 -98 -158 20 -25 -131 -181 -51 -152 133 -129 -58 -143 158 -141 -188 -32 82 -84 43
5858D3n8L1J80k45J96j22M2j59N0j48J03J92j23K9k8r1P7O5J38m6j32p8K53k79
$$ 43 -15 16 196 -49 147 25 67 -92 -42 -190 -87 105 -18 11 -17 -108 -31 34 172 126 -6 -84 169 -110
5882a10Q7j11K06j5o1K90l99J83kl0k1j42J46j41L13k59j60M16k89M5r4J95j36
$$ -110 -23 -134 72 57 -4 286 -113 70 68 38 17 -125 21 -120 193 -66 -226 190 -99 -54 -148 47 -89
5905h9J94k12P4K5N3l84N86j28j84J21lnj51J67j37Q6M7M7l16l8L48p8j79K59
$$ -89 105 -107 -33 -8 45 -339 247 119 -65 56 53 48 -103 64 -73 13 60 107 -209 -247 101 23 -156 103
5929A03k89j17K84P3J15k62L9J42J50k71p0J01K16l32J96J10k18q2J77k7k14N2
$$ 103 -186 -303 -19 54 169 -93 -54 88 238 -33 -103 -2 214 -118 78 188 -30 -112 65 38 -176 -124
5951a24K45m8P9k89J26J19k52J05O4jj40J57k54K25q3K53j92j11l9Q5O5L80l90
$$ -124 121 73 152 -137 -11 108 -144 -39 25 24 -116 41 -213 12 -71 182 -10 -121 -160 -75 -10 370 -20
5974b0k93L88r0PJ53k43N9K32k03Q9j40lL7Ok8J44j8n5l07L79Q2j15P0k73R9J13
$$ -20 -313 75 -15 -8 145 -98 -39 193 -10 79 -61 -64 -27 -21 -49 95 77 22 -285 94 176 61 131 -142 -43 70
6000G0l12K12p3J63r9k6J80j75Q3J21j06q0R3J31j58J7K7Q2k57L4K07j37k84M36
$$ 70 -242 -30 -103 60 -39 -65 115 -60 23 144 38 -42 51 182 24 41 68 150 -107 -73 134 -3 -287 149
6024A49m7j07j79M22Pl73j4J20Q4mJ19j30j42J40L3j61P4J14M7j81N2j16J74j65
$$ 149 102 -5 -184 238 245 -128 -142 -22 62 58 177 47 -95 45 78 -83 -9 105 152 -29 23 -93 81 -84
6048h4N6P4k41M5J99j3J61k2l03O5P7n0p9k33K69K1J09j90k1j24J4L15j06L5k6
$$ -84 -28 46 -195 -150 49 36 197 175 -128 -63 14 -36 -115 -348 -79 -58 51 -139 -160 -284 -270 45 -61 -26 -52
6073e2K91r8k81J02L5k3J97k69pj00N9K19m6J0j49J17j50K69k67M3J06j08J88
$$ -52 239 141 -140 -38 -3 -26 171 -98 -105 -205 -146 73 27 37 -112 5 -145 124 -143 -100 6 -102 86
6096H6j83K39k1j84J84o3L5n8qJ43k82K9Qj2K79j24j83J52J5J08k55K29j50j61
$$ 86 -97 142 121 -63 121 58 93 35 27 170 -112 -83 -75 -87 192 68 -115 37 52 160 -95 134 -16 -177
6120a77K84j56J77j39jJ26j29O8j66N6J40J89m14L52j12L4J72l24J88l66m6K94
$$ -177 107 -49 128 -11 -12 114 -15 53 -113 -57 83 272 -142 210 98 132 304 -20 168 -198 -244 50
6142E0j42j02K12P7k01J40J76j44j39J07k27L47M5k8j84j54L14m8k77J51N5j6
$$ 50 -92 -194 18 95 -106 34 210 66 -73 34 -193 154 199 171 -13 -167 147 99 -178 -27 28 12
6164A2R1j75J40p3m5j90K19P5j95J94n0N9P9q0j13K59j75l09K45n0M3j38N00k69
$$ 12 103 -72 68 -5 -50 -240 -21 54 -141 53 3 62 141 61 -52 207 32 -277 -32 -82 -39 -177 323 54
6188E4j22J10j52l8J86J01j93Q8q6K1q8J15k5p0N0o6K66j86K39j70k13K14N5k0
$$ 54 -68 42 -110 -148 38 139 -54 34 -52 -31 -119 -4 -29 -99 -49 -115 151 -35 204 34 -179 35 90 70
6212G0P8j55q7o1K82k72K08k55K05r3K80k07j7r7J55J70r9j22P7j04l5Q2k40r1
$$ 70 148 -7 -94 -155 127 -145 63 -192 13 -80 200 -7 -24 -121 34 204 105 -17 60 -44 -79 3 -237 -328
6236c28R5R3J27P1m2r1J10j55P4N7j22j72J87L0j67L75k69J02j64J15J78k04J41
$$ -328 -233 -140 -13 58 16 -75 35 -120 -46 11 -111 -283 -96 -66 -233 142 -127 -25 -189 -74 104 -100 41
6259D1J2K6J10j82J13N8j14r1rK8R8M1O0n1j86K88k49K03k73P6j28K38k80J99
$$ 41 53 79 189 7 120 178 64 -27 -36 -8 90 131 191 140 -46 242 -7 196 -77 -1 -129 109 -171 28
6283B8k18K94j36k0qK03p7Q9l7k40J79n0o6K76j41P5o6O0q0N0l16K21j05j91J15
$$ 28 -190 104 -32 -52 -60 143 66 155 118 -122 57 7 -59 217 76 151 85 145 65 115 -201 20 -85 -276 -161
6308a61q0J83n9L45k89K52r2k22L93j48l27L17r5mk13L45l05K26k69K08J43m04
$$ -161 -241 -58 -117 228 -61 191 99 -123 270 122 -205 112 17 13 -200 145 -160 66 -203 5 148 -256
6330b56L41j20J34J8k11J49J3j1k1j22j33L78j29k1l8J42L0q1r2j78K18r1P2J8
$$ -256 85 -35 99 117 -94 55 68 57 36 -86 -219 159 30 9 -29 113 143 62 -30 -208 10 -81 -9 9
6354Ik26J60j7n2o7K31N3j68L5J92j83m0Q3J4m3M1M8k54L17j24o9n7L48j69q4
$$ 9 -217 -57 -74 -126 -193 38 91 -77 -42 150 -33 -73 10 24 -19 22 70 -184 133 9 -60 -117 231 62 -22
6379b2M2l9J52j86K13j70J07o3j03j54J38L89k51j10J48M7n3j7j03L8j05K04j74
$$ -22 20 -19 133 -53 160 -10 97 34 -69 -223 -85 304 53 -57 91 138 85 68 -35 3 -102 102 -72
6402g2M0K3K35j37o0m1mNnm7P1R4j32L6l2J65j2k1j78K78m00K45j65%K52k68J70
$$ -72 -32 -9 226 89 29 -12 -16 -11 -16 -63 8 102 -30 6 -26 139 127 106 -72 206 -194 51 -114 -114 138 -130 40
6429D0n2J40k57K00j08j3k6J11j96J21K66l15q5J34N3p5l8J64pL9L7j0k16nP0
$$ 40 -12 128 -129 71 -37 -50 -76 35 -161 -40 226 -89 -174 -40 13 -62 -100 64 57 96 133 123 -93 -98 -28
6454b8k3j31P8K65k44L0K4n5j04K72N2L7j72J0j4J75j14j64J97k13j34L04J3j49
$$ -28 -51 -182 -104 161 -83 -53 -29 -84 -188 84 136 173 1 11 -3 172 58 -106 91 -122 -256 48 61 -88
6478h8J77k0l09L29j55K9J85r0J49j70J40k79j95L04M3j65J89K8r0l1N1j26P9
$$ -88 89 69 -240 89 -66 -37 148 58 207 37 177 -102 -297 7 50 -115 74 102 12 -19 32 -94 -15
6501a5r7K03j22J15q8rL15l60o7Q2Q8l7r7J44j13J60j34p4J07j11J1J65J31k90
$$ -15 -112 91 -31 84 -4 -13 302 -58 -125 -43 45 8 -89 55 -58 102 -32 -106 1 -110 -99 66 197 -93
6525i3k24L09J64L0j25p5j51o2L83p9o0j44J1K75k14j16M14j25j28k2p0m9K76
$$ -93 -317 -8 156 186 61 -14 -165 -227 156 77 17 -127 -116 159 -55 -171 243 118 -10 -32 -102 -151 125
6548A25R1k8k09O8J50k80K3J7J62j54J02j47RJ26LJ07j59j9R4l7MJ30j20j2k08
$$ 125 216 188 -21 47 197 -83 -60 -43 119 -35 67 -80 -71 55 58 165 6 -13 81 44 48 178 58 46 -162
6573a62L35k04O5J08k25N8J73l53N11j71j40K07j57k63J82j26J88K54l35r2O0
$$ -162 173 -31 34 142 -83 -25 148 -205 306 135 -5 202 45 -218 -36 -162 26 280 -55 -147 -87
6594h7N2k46K54J84j56m5o1J28J4Q5k17j02L79N2k52L8j05J64p5Nj48LL02L1j54
$$ -87 -35 -281 -27 157 1 -44 -105 23 37 122 -95 -197 182 234 -18 20 -85 79 4 9 -139 -136 166 197 43
6619D3j8o4J39J73j92J52l55K37k24K57m21L38j69rl2K21o9K53j12j11r1RL2J53
$$ 43 25 -39 100 273 81 233 -122 115 -109 148 -273 65 -104 -113 -145 76 7 260 148 37 -54 -45 -13 140
6643A40l3j97M8k08L03k25j6K66k20K62j19Q1M6j16Kk46q4P3J04k0P2L8J02l18
$$ 140 107 -90 -42 -250 53 -172 -188 78 -142 120 1 82 128 12 14 -232 -316 -243 -139 -159 -87 -49 53 -265
6667b65K01J44J4q8q3J41q6Qj59P6L15l63L09k92L15k29L6k48K06J54K05o6l71
$$ -265 -64 80 94 6 -77 64 -22 -14 -173 -97 218 -145 164 -128 187 -42 -6 -254 -48 106 311 245 -126
6690a26M2J68r6J97k45j96M63l78K6M0J61l13J56K29k27j03L09j92L2k6J02J72
$$ -126 -84 84 -12 185 -60 -256 207 -171 -145 -105 56 -257 -101 128 -99 -202 107 -85 -53 -79 23 195
6712A95j35j56L19k02n8L1j68J4J26p4K87l43N4K17Ll89M01o8o7j41J20K56j29
$$ 195 60 -96 223 21 -37 -6 -174 -160 -34 -108 179 -164 -110 107 110 -279 122 54 -13 -154 -34 222 93
6735I3k15K5J78k43K38r6N3Q2kk4j00k36K18j06L36k64J01j54J32j82L63k47J90
$$ 93 -122 -97 81 -162 76 -20 33 115 113 89 -11 -247 -29 -135 201 -63 38 -116 16 -166 197 -50 140
6758A40kj88O9o1j34qL81k98K05k12n7K30j24J18J27m44J53N4k2K90l87J73R2
$$ 140 138 -50 19 -42 -176 -184 197 -101 104 -108 -165 65 -59 59 186 -258 -105 -51 -73 217 -170 3 95
6781I5k00N1J51j70J62qj73K56l15L13j71L49m33J05r9O2J22j31J88l41J54N5
$$ 95 -105 -54 97 -73 89 81 -92 164 -151 162 -9 340 -93 12 -87 -25 97 -34 154 -187 -33 22
6803B2j86J78n5n7J78j21J94j93K15l02J40M5j09j0l5J65j53J73j95K92k03P7
$$ 22 -164 14 -41 -98 80 -41 153 -40 175 -127 13 58 -51 -61 -96 69 -84 89 -106 186 -17 60
6825F0k21j7K02N8j11J80k87K26l3Q4Nl06J85l3n7l5p8K69j90j21K94k9J62L8
$$ 60 -161 -178 24 82 -29 151 -136 90 57 141 146 -160 25 -8 -65 -100 -178 91 -99 -220 74 45 207 245
6849B45j84o7J11J01j23q0Q9k4o3k38J91J0PP0J83j27l7j1J10M4j52j88L15j7
$$ 245 61 -6 105 206 83 3 92 68 5 -233 -42 -32 -25 45 228 101 64 53 163 207 55 -133 182 165
6873A65k35J24j00K1J14k16R0nJ82Q0k22JJ32j73J06L9q9J7K7N7L0j37J52m5j39
$$ 165 -70 54 -46 -25 89 -127 -37 -42 140 220 -2 -1 131 -42 64 103 14 31 58 115 145 8 160 115 -24
6898b4J81m0j28q0J92j33J46q3J56q5j62K15l14K95j85M0k6k4J07k25pK45j97
$$ -24 157 117 -11 -91 101 -32 114 31 187 102 -60 155 -159 136 -49 -9 -35 -59 48 -177 -184 61 -136
6921a36J71K85k67k62Q6L39m45J48K16j6J15l71K29j89N6n5J3j34K72o7M5Q8m4
$$ -136 35 320 53 -209 -123 216 -229 -81 135 119 234 -137 92 -97 -41 -96 -83 -217 55 -12 33 121 77
6944G7j73J1J70o6P5L0n3M8j15j02K42l44K36r8Q5j73J32o9M38m69J9K8O2r6k17
$$ 77 -96 -85 85 19 94 124 71 119 4 -98 144 -200 36 -62 23 -150 -18 -87 351 -118 -99 -71 -9 -105 -322
6969c22P6K99M2k68L6K49k18J52j7kk8j66M44m53K59j83k57M13m0N0J27j50O8
$$ -322 -246 53 95 -173 -137 112 -106 46 29 27 -1 -167 277 -176 83 -100 -357 56 16 66 193 43 111
6992A11j42j4L76l30j0o1J6l8J10p6K14%l08R3m6%j5n4K47j56L00j20n0j37J57
$$ 111 -31 -45 331 1 -9 -70 -54 -92 18 -58 156 156 -152 -59 -105 -105 -120 -174 73 -83 217 97 47 -90 67
7017F7k35J11k54K67Q4j56J30J1N1ok0rm10K78R1J13k71O8K19j12M2k23J31k3
$$ 67 -168 -57 -311 -44 40 -116 14 25 76 70 50 41 -369 -91 0 113 -158 -90 129 17 59 -164 -33 -56
7041e6J44j79N0K1L4K0p8R3n3j8kn7N3J70N6k20j99M3J73j22l1M6J86Q2k33N5
$$ -56 88 -91 -41 -20 14 34 -44 49 -4 -22 -24 -81 -28 142 198 -22 -221 -178 -5 -127 -158 -112 74 156 -77 -22
7067b2j36M09k5l17K73l25K02k57M70j28k12O1q9J94P4K10l13j50J92j39j37m1
$$ -22 -158 251 226 -91 182 -143 59 -198 272 144 -68 -7 -96 98 172 382 69 -81 111 -28 -165 -206
7089b06K53j2M4j74j12K28J18o5j11J6RO1p0k2J78J95k81j7J78l01K73P7J47k08
$$ -206 47 35 79 -95 -207 21 139 74 -37 -21 -12 49 -21 -43 135 330 49 32 210 -91 182 259 406 198
7113A98k24K9o2m6K22j17rj95K49P0q9Q7k96Q1N3Q6q2j9l5L31m91M21L6k24%r7
$$ 198 -26 3 -59 -105 117 0 -9 -204 45 115 26 113 -183 -102 -49 37 -45 -64 -99 232 -259 162 198 -26 -26 -123
7139a23K46j58J13L8j36j94L34k90J06K08l15K01l11N54j36k16l0J27j06K03J22
$$ -123 123 -35 78 116 -20 -214 120 -170 -64 144 -171 30 -281 273 137 -79 -109 18 -88 115 237
7160B37J7k28j51P3km1J94j80j9J85n4j31J68K32m84q7K57J36j66j49L96m76L35
$$ 237 254 26 -125 -52 -54 -95 99 -81 -100 85 31 -100 68 300 -184 -271 -14 122 -44 -193 203 -273 62
7183F2n0O2p9J25l9R1l23K29o1j78J66q9J79J0l57Q0J11M3L6Q5j20L41m67M3R4
$$ 62 12 74 -5 120 81 172 -151 78 17 -161 5 -84 95 105 -252 -172 -61 -18 18 103 -17 324 -143 -100 -6
7208fk4K37j94J74j83N6j15M3R8J3k69K50l4j70K64j52j5N8K0k17M9J20j26K18
$$ -6 -30 207 13 187 4 60 -55 -12 86 99 -170 80 46 -124 140 -12 -27 31 51 -166 -117 3 -123 95
7232I5j37L6JO6r1J76j50j3k39L79j72l0K95k27nn9J43j74P6P5n7M0J19K3J35
$$ 95 -42 -6 -5 61 -30 146 -4 -17 -256 123 -49 -79 216 -11 -16 -75 68 -106 -30 45 -12 28 147 170 305
7257C05l66M8J30k11M6K38l74m9R5J6L6J6J08p2K32k61K30k11p7kn3J36J57j50
$$ 305 -61 -13 117 -94 -48 190 -184 -233 -138 -122 -86 -70 38 -34 198 -63 167 -44 -121 -123 -176 -40 117 -33
7281c3O6J33m04L80o8k0lj51K24l51J62j09L00K6j37m4Q5M1mk77L4R7P7j22K14
$$ -33 33 166 -238 142 74 54 51 -100 124 -227 -65 -174 126 152 15 -29 56 97 93 -184 -150 -53 24 -98 116
7306A16j65l4J14m9R2q8J28j4rk10O6m4j60M84P7n67J99p5L9L32k65J92j94m2
$$ 116 -49 -83 31 -18 74 -14 114 100 91 -119 -53 -97 -257 227 304 -263 -64 -139 -100 232 -33 159 -35 -77
7330g7p6L09j56j03K73k01O1l3m9R6k84J12K8K28j57J19q3K07o2k15k53M35j89
$$ -77 -153 156 0 -103 170 -31 30 -3 -52 44 -240 -128 -100 128 -29 90 7 214 152 -63 -316 119 -70
7353g0J10PJ09J27k68P1k6O7k10J72j52K84k93pK14j13k13R6K33m7j7n5J21k46
$$ -70 40 47 156 283 15 86 60 127 -83 89 -63 221 -72 -79 135 22 -191 -95 138 91 74 19 140 -106
7377a06K76l90K59k64K62k0M9k55J53n0n1J93j61M45l97J82l08L50k60Q1J64j94
$$ -106 170 -220 39 -225 37 17 66 -189 -36 -86 -137 56 -105 340 -57 125 -183 167 -93 -12 152 -42
7399d2j9j1J90j67Rl8K23r2R6j32j1K97l87M3p7K32r9J0j05l8K41j11m2j04K21
$$ -42 -61 -72 118 -49 -40 -78 145 53 149 17 6 303 -84 -41 -118 114 15 25 -80 -118 123 12 -30 -134 87
7424H7j64r4J44j81J36R5J0j02L4LlJ91j09P1j27O4%l6j44M49l26o0N6K89l3l43
$$ 87 -77 -171 -27 -208 -72 23 33 -69 -35 -32 -35 156 47 118 -9 55 55 19 -125 324 -2 -62 -6 283 250 -93
7450i3q5L5K31Q6k69j4J27J42J83m89M0M1Q2j11J59J51k85J19J0m1N5J30j45N7
$$ -93 -178 -143 88 174 -95 -109 18 160 343 -146 -106 -65 17 -94 65 216 -69 50 60 19 74 204 59 116
7474A16k29J56K5k28J43l9j01J0J75J58k53o4L14p2l24L80o0j46K7k00M00k75
$$ 116 -113 43 68 -160 -17 -56 -157 -147 28 186 -67 -131 183 111 -213 167 107 -39 -12 -212 188 -87
7496h7J95P1k72qj85L15j47K6r6Q5j63K66j40K79j60J81j03j16L7J9L8N4k44n8
$$ -87 108 179 -93 -101 -286 29 -118 -92 -188 -103 -266 0 -140 139 -21 160 57 -59 -22 -3 35 89 -155 -213
7520b13P4L68J77l84l8l0J16j92K2K57k49J39n8L8l5p4J6L1l4k00J62q2J58J20
$$ -213 -139 229 406 22 -16 -46 70 -122 -100 157 -92 47 -11 27 -8 -82 -66 -35 -69 -269 -107 -189 -31 89
7544H9q3j00%j7J10N2ll44L27J58k82j88M94k72J11j71Q3J68r7j98J11o2J50k87
$$ 89 6 -94 -94 -111 -1 51 48 -296 31 189 -93 -281 213 -59 52 -119 -36 132 35 -163 -52 -114 36 -251
7568b51L79j00k7O8k47J81R7j15L8o3K8oJ64oj01J9k15oK01J43k96K24j84J68
$$ -251 128 28 1 69 -178 3 100 -15 23 -40 -12 -18 146 140 39 58 -157 -163 38 181 -115 109 -75 93
7592I3j26M1J90l07K36j45m7J38o7Q0k11J51n4J23j41J75k99K05Q8k75J65l6J75
$$ 93 -33 8 198 -109 127 -18 -65 73 6 86 -125 26 -28 95 -46 129 -170 35 123 -152 13 -23 152
7615A52j75k2n8k1J52j3k05K50j96K40k68J61l6K82m27L79k78j49L47j19P8p4
$$ 152 -23 -45 -103 -124 28 15 -190 60 -136 104 -164 -3 -39 243 -184 195 -83 -232 115 -4 74 0
7637@J19m5j28J14j4R1Qq1o3o5K72k27K25k17j39J6K98k21m8j2L05l9j92J5L02
$$ 0 119 74 -54 60 46 137 145 64 1 -64 208 -19 206 -11 -150 -134 164 -57 -105 -117 188 149 -43 -28 274
7662B74k09j71M6j2J61J7k21O3K10o6j60J51J94k79k28J9J2j1J25q1J54J67l30
$$ 274 65 -106 -60 -72 89 106 -115 -52 158 92 -68 83 277 -2 -230 -211 -199 -210 -85 -166 -12 155 -175
7685a75M8J99J45k43j55K94p9J06j27l3K7J35j19j31K46M1j89J08O3k41KJ27k89
$$ -175 -127 72 217 -26 -181 113 34 140 13 -20 7 142 23 -108 138 179 -10 98 161 -80 -78 49 -240
7708b40J65M1kj56n5L11k29K4rj2K83j36K14l14n5K18J05j25o1K20j35j08m8R8
$$ -240 -75 -34 -36 -192 -247 64 -165 -141 -150 -162 121 -15 199 -115 -170 48 153 28 -33 187 52 -56 -104 -6
7732fj19J90j91K1J94Mk18K35j91K31k74R6K87j60R9k2j21l5m3J77k77J19pm1
$$ -6 -125 65 -126 -105 89 93 -125 110 -81 150 -124 -28 259 99 198 176 55 20 -23 154 -123 -4 -11 -52
7756e2J22n4j16K05k53K60p2k6Q0j50J08L3K7J23L5l24N4J42n3jk27J89J06k97
$$ -52 70 16 -100 105 -148 112 40 14 94 -56 52 85 112 235 270 -54 0 142 89 88 -139 50 156 -141
7780a41J03o0K24k6j07J0J42Mj9j15J99j88o4K90p7l34j41M18j91J23k73l2M18
$$ -141 -38 -98 126 100 -7 3 145 149 130 15 214 26 -38 252 175 -159 -300 118 -73 50 -223 -255 163
7803A63j8m45J03J92j68r0K16J47J07k85J24J45j11j22M6r0m2l6J7K00n7j08J03
$$ 163 145 -300 -197 -5 -173 -263 -47 100 207 -78 46 191 80 -42 4 -86 -128 -164 -147 53 -4 -112 -9
7826iR8l46J42K13kQ5q7M7q8j9J42j56J80k24KJ44J22l47J44K3k17M19m54J10
$$ -9 89 -257 -115 98 96 181 94 141 53 34 176 20 200 -24 -22 122 244 -103 41 64 -153 266 -188 -78
7850g8J87k49L6O9Q1j00J02m6K6k16K25p8J63j91P7q6Q3o9j06O8JJ23P1r3J30
$$ -78 109 -140 -104 -35 46 -54 48 2 28 -188 37 -41 122 -69 8 -78 5 -64 -170 -102 -101 22 93 0 130
7875A30o9r3M0Q8j64q8J00j01J66J08k0l2p5k31L39q9k21m9L67j20j11J54l9L14
$$ 130 61 -32 8 96 -68 -156 -56 -157 9 117 97 65 -10 -241 98 9 -212 -261 106 -14 -125 29 -10 304
7899C04l59J17p0P7J09j61k00J98J2J22j14K33l14L58l02J29P3l59M9N5Q7j51
$$ 304 -55 62 -8 69 178 17 -183 15 27 149 35 268 -46 312 10 139 212 -147 -98 -43 44 -107
7921a07J51k27J31K10j76K13j10j34L6J45j78J66o1j03Q0j09L0J86k23j2K6N4
$$ -107 44 -183 -52 158 -18 195 85 -49 -13 132 -46 120 59 -44 36 -73 -43 143 -80 -92 -66 -12
7943a2j56L65M4j25n6k5J5j09K26l59R7N3l7J18j6J64j90J94l78J64k7M4j53L72
$$ -12 -168 197 241 116 60 35 50 -59 167 -192 -95 -42 -79 39 23 187 -3 191 -187 -23 -50 -6 -159 213
7967B13j19j42J33k48J27L72k17L9k98m7K13L3J5l60K00O5J1L82l69K9l42J00
$$ 213 94 -48 85 -163 -36 336 119 158 -140 -187 26 59 74 -286 -86 -21 -10 372 3 32 -310 -210
7989b10L57L1j81Q5k84L32j37Q7k30J21k46J83Q6J03k52L6K73j84J83m56M54j43
$$ -210 147 178 -3 82 -202 130 -7 80 -150 -29 -275 -92 -6 97 -155 -119 154 -30 153 -303 151 8
8011Hl3M8p5j9K93k94J40O7j92J16J5j98L22l26Q6o8L06%k14L17m01J44J43l54
$$ 8 -25 23 -52 -71 222 -72 68 135 -57 59 74 -124 198 -128 -42 -110 196 196 -18 299 -102 42 185 -169
8035a69R9K27K4r5j29J6o6j70L20K19k85J66r2J03l35J71k46K54N9r0o1M7j86
$$ -169 -70 157 181 86 -43 -27 -93 -263 57 276 -9 157 65 168 -167 4 -242 12 71 -19 -80 -33 -219
8058b19K10J84j15k84L81j30K86j89k21M01m19J80j67J18L42m39j71J61K17k62
$$ -219 -9 175 60 -224 157 27 313 124 -97 304 -115 65 -102 16 358 -81 -252 -91 126 -136
8078a36L29l27j9LL40l51L08j20K17k60P7j06K09j50j71J63k44J52P8Mk41L07
$$ -136 193 -134 -153 -150 190 -161 147 27 244 -16 61 -45 164 14 -157 6 -238 -86 -8 -4 -245 62
8100F2k1j87Q6L23Ok20r9Q4K20j04p8l3k21J94K86m70J21K54p2j22M3m3j75n5
$$ 62 41 -146 -60 263 269 49 -50 34 254 150 72 39 -182 12 298 -172 -51 203 131 9 52 9 -166 -221
8124b21K5K09k48L61k49K5J49L5l17K16k77L18k02J52J82n4k75J78J19m79L72
$$ -221 -196 13 -235 126 -123 -98 51 86 -231 -15 -292 26 -176 -24 158 104 -171 7 126 -353 19
8145A9J75r2P0P6j50j40P4J34O2m12J39L8J09p2j29PJ17j15jj2M6N2J75k67K01
$$ 19 194 102 172 248 98 -42 32 166 228 -184 -45 -7 102 30 -99 -92 25 -90 -91 -103 -57 -5 170 -97 104
8170A04k75Q4N2%j0j43Q7m9M83k12p8j90k9P7J43m8N5j61J07k4J68
$$ 104 -171 -87 -35 -35 -45 -188 -101 -150 333 121 43 -147 -176 -99 44 -4 51 -110 -3 -27 141
8191A41
$$ Imaginary data points
##PAGE= N=2
##DATA TABLE= (X++(I..I)), XYDATA
0@%%%%%%%%%%qJ6j6J6j6K4l2M0n6O4p2Q8j04J25j49J76k05K37k72L11l58M07m60
$$ 0 0 0 0 0 0 0 0 0 0 0 -8 8 -8 8 -8 16 -16 24 -32 32 -40 48 -56 69 -80 96 -109 128 -144 167 -191 216 -244
33b44N21n90O64p46Q37r34J042j162J293j434J587j756J940k140K359k602K866
$$ -244 277 -313 351 -395 442 -492 550 -612 681 -753 834 -922 1018 -1122 1237 -1365 1501
50A501l155L474l826M220m660N156n718O360p105P978r018J0284j1862J3887j6596
$$ 1501 -1654 1820 -2006 2214 -2446 2710 -3008 3352 -3753 4225 -4793 5491 -6371 7516 -9080
65i080K0424k6267L6353n8475J88678l3198k30861J14721j79985K36591M8402
$$ -9080 11344 -14923 21430 -37045 151633 118435 -112426 2295 -177690 58901 107303
76A07303o9930J7722j95970O1244J21480R521M5460j16504k7702m6374O1618J32537
$$ 107303 37373 55095 -140875 -79631 41849 51370 96830 -19674 -47376 -93750 -32132 100405
88A00405j3255o7804j21267K0144P5122P1043P4632j68631n9284O932O7131J53297
$$ 100405 87150 19346 -101921 -81777 -6655 64388 139020 -29611 -88895 -81963 -14832 138465
100A38465j01986m4230m9230m4548J43733j909M1255o7152j19358P9623j1290
$$ 138465 36479 -7751 -56981 -101529 42204 40295 81550 14398 -104960 -25337 -36627
111c6627J09333J6770j16127J1120j03040J07452J18841o5977l075j44285L1405
$$ -36627 72706 89476 -26651 -15531 -118571 -11119 107722 41745 38670 -105615 -74210
122g4210J11396r844P6289j15322p9185N4163K3914R4214l3494n7793k8091l3941
$$ -74210 37186 27342 103631 -11691 -90876 -36713 -12799 81415 47921 -9872 -37963 -71904
134g1904P1383N1084K2270p0734p1104K7125J7176Q8032O646o9520n0688m0257
$$ -71904 -521 50563 72833 2099 -69005 -41880 -24704 63328 69974 454 -50234 -90491
146i0491J11183M4642k3673k5622r3825L9586L5089M4078M3225j15040j2816L508
$$ -90491 20692 65334 41661 16039 -77786 -38200 -3111 40967 84192 -30848 -43664 -40156
158d0156K0625Q9852m0553j3779n4531m0200R5732K1290J8610m4930p9656L1808
$$ -40156 -19531 70321 29768 15989 -38542 -78742 16990 38280 56890 11960 -67696 -35888
170c5888K1608O6020J2547p7967k9385j0770N8085M7074j3879k9145n8301O075
$$ -35888 -14280 51740 64287 -13680 -43065 -53835 4250 51324 37445 8300 -50001 -43926
182d3926M0972M6807Q047o0864k5937j1547L9488N4711r154k3719o5260j021O0704
$$ -43926 -2954 43853 51900 -8964 -34901 -46448 -6960 47751 38597 14878 -50382 -51403 9301
195I301K4751J8408n5570m2789J2276J9818O5476r709m8911k4735j8156N5914
$$ 9301 34052 52460 -3110 -45899 -33623 -13805 51671 41962 -6949 -31684 -49840 6074
207F074L1554l617k0870o0772R975L7893L2465J4802n1665l0813l022K9487N1871
$$ 6074 37628 34011 13141 -47631 -37656 237 32702 47504 -4161 -34974 -37996 -8509 43362
220D3362n299l6341l9557k665M2896L1573M762l7326l7797j64L3052M2250m017
$$ 43362 38063 1722 -37835 -40500 2396 33969 38731 1405 -36392 -36556 -3504 38746 34729
233C4729l3712l4093n037L8721L0413O494l4164m0789N519K7076L8883L357m0217
$$ 34729 1017 -33076 -38113 608 31021 37515 3351 -37438 -31919 -4843 34040 37397 -2820
246b820k6142p537L2986L9683n244k7624l5156l070L5099K9737L911l2310l2650
$$ -2820 -28962 -36499 -3513 36170 30926 3302 -31854 -34924 175 29912 33823 1513 -31137
259c1137l77K7696L5572M40l0687l0485m261L2019L1446k91k6858l1628l679L0373
$$ -31137 -31514 -3818 31754 32194 1507 -28978 -33239 -1220 30226 29935 3077 -28551 -32230 -1857
273a857L1441Q20k8915k9347k146K8103K9155K376k6654l0857k206K9006K8594
$$ -1857 29584 30404 1489 -27858 -30004 -1901 27254 29630 2976 -27881 -30087 -1081 27513
286B7513M20k5295k8833k879K7244K7732L145k7239k9205J441K3997K5668M782
$$ 27513 27933 2638 -26195 -29074 -1830 25902 29047 1808 -27397 -25956 -1959 23709 28491
299B8491k5441k9707r77K6620K5512J731k4658k5944j59K0445K7455N718k9023
$$ 28491 3050 -26657 -27634 -1014 24498 26229 1571 -24373 -24532 -4087 23368 29086 63
312F3k5080P57K2851K4113J555k0850k6621k267K3904K3877L895k6268k3310K592
$$ 63 -25017 -24260 -1409 22704 24259 3409 -23212 -25479 -1575 22302 26197 -71 -23381 -20789
326b0789J6603K4983N963k5532k4353M39K1560K1504K973k1156k3109j918J9034
$$ -20789 -4186 20797 26760 1228 -23125 -22686 -1126 20378 23351 2195 -20914 -22832 -3798
339c798K6205J597k5229j8545p82J7933K1567L611j8325k5983q24K2937J9447
$$ -3798 22407 24004 -1225 -19770 -20552 -2619 18948 22559 4234 -21749 -22573 364 19811
352A9811M98j8882j9348l210J7020K4268J731k0739k1323J90J9903J6440L786
$$ 19811 20309 1427 -17921 -21131 -4111 20157 21888 1149 -20174 -19984 -81 16359 20145
365B0145j6142k3782l98J8647J9563K029k0053j6444j649J3501K2370K846j9593
$$ 20145 4003 -19779 -20177 -1530 18033 20062 9 -16435 -18084 -4583 17787 20633 1040
378A040j8825q87J7800J6707J622j3372k0266m678J9684J8758O90j7548j7281
$$ 1040 -17785 -18672 -872 15835 17457 4085 -16181 -20859 -1175 17583 18273 725 -16556
391a6556J342J2685J6427N937j7558j9048j092J6948J6794o59j2807j5737m938
$$ -16556 -15214 -2529 13898 19835 2277 -16771 -17863 -915 15879 15220 2413 -13324 -18262
404a8262J5539J8475J448j5624j7226j4J4357J4348M631j4994j8936Q25J4278
$$ -18262 -2723 15752 17200 1576 -15650 -15664 -1307 13041 17672 2678 -16258 -15433 -1155
417a155J5778R41j6054j0396m574J0687K0626o55j3799j4728k802J7207R462L638
$$ -1155 14623 15564 -490 -10886 -15460 -4773 15853 15198 1399 -13329 -16131 1076 10538 14176
431A4176q788k0870Q39J2805J5220L121j8099j0045j148R195J7079O97j2395j4489
$$ 14176 5388 -15482 -14643 -1838 13382 16503 -1596 -11641 -12789 -3594 13485 14182 1787 -12702
445a2702j948J4737J0575K222r701j4804k873J1838J5301J024j2246j3334k58
$$ -12702 -14650 87 10662 12884 3183 -11621 -14494 -2656 12645 13669 1423 -11911 -12169
458a2169R892J2379N546j4592j3720K91J0282J5453l007r632p867q576J4845J2233
$$ -12169 -2277 10102 15648 1056 -12664 -12373 -2091 13362 10355 723 -7144 -15720 -875 11358
472A1358o66o306j7883L187R897O229R858j4032j2826n5O721J8327k480j1862
$$ 11358 10692 4386 -13497 -10310 -413 5816 15674 1642 -11184 -11239 -4518 13809 11329 -533
486e33p038n837J2616J1156J40q352j3264O18R536Q868K805p736j1904l338J1126
$$ -533 -7571 -13408 -792 10364 10504 2152 -11112 -10494 -958 7910 10715 2979 -8925 -12263 -1137
501a137J0197K233r644j1352P41M907J3255M114j4010p234m065J1214J2450n910
$$ -1137 9060 11293 1649 -9703 -8962 -4055 9200 13314 -696 -7930 -11995 -781 11669 5759
515E759k089j2084l593J3272M413N594r414j2527M862J643J1720M385j2226n782
$$ 5759 3670 -8414 -12007 1265 5678 11272 1858 -10669 -5807 -4164 7556 11941 -285 -6067
529f067n133R202J2108k304m755j0950k773R820R510J257r285q847k2P671P200
$$ -6067 -11200 -1998 10110 7806 3051 -7899 -10672 -852 8658 9915 630 -8217 -8239 -568 6632
544F632K136n981j0946j77O737P690M401j0231o317j911L426J3811j224o460p782
$$ 6632 8768 2787 -8159 -8336 -1599 6091 10492 261 -6056 -7967 -4541 9270 8046 1586 -6196
559f196n015J2343N430J138m263j3286L224N119P292M475j1649l748j839L413
$$ -6196 -11211 1132 6562 7700 3437 -9849 -6625 -1506 5786 10261 -1388 -5136 -6975 -3562
573c562J1634j567m662o986m708R422O193J960n032r736q12O444Q043J196o637
$$ -3562 8072 6505 1843 -5143 -9851 -429 5764 7724 2692 -7044 -7856 -1412 6631 7827 1190
588A190p695n52O358N988K516o997p378M27L681Q849N77o283m643m678P172P514
$$ 1190 -6505 -7057 -699 5289 7805 808 -6570 -6143 -2462 6387 6964 681 -3962 -8640 -1468 6046
604F046k49k319j0563k31P113M290M363p975o556M90L090Q959j64n663m926l253
$$ 6046 5797 3478 -7085 -7316 -203 4087 8450 475 -6081 -5591 -2501 6458 6294 631 -4295 -7548
620g548O894N736N92l347p786q15M819O009K561o028o005j142M413O660J465m955
$$ -7548 -654 5082 5674 2327 -5459 -6274 -1455 4554 7115 1087 -4918 -6060 -1647 5013 6478 1523
636A523o612r70M705O442Q94n470m627j954M733O483k06l167o650j181N867L555
$$ 1523 -5089 -6059 -1354 5088 5982 512 -4115 -6069 -1336 5147 4941 1774 -4876 -6057 -190 3365
652C365K615m276o908K23L060O221J896n692m224j686M220O058J70l607n585j433
$$ 3365 5980 1704 -5204 -4981 -1921 4300 6196 504 -3720 -5406 -1186 4872 5042 1435 -4150 -5583
668e583M936M367J226l720n376p58L404N498J443m368n291o49L742M751J747m275
$$ -5583 -647 3720 4946 1226 -4150 -4908 -1504 3994 5437 1069 -4222 -4871 -1129 3622 5369 1094
684A094n101j039L864N188Q85l993m745j173M095M408J437l743n022p54L651M157
$$ 1094 -4007 -5046 -1182 4006 4891 898 -3847 -5020 -925 3483 4920 1177 -3845 -4599 -948 3209
700C209J600l506m557j538L832M766N55l427m117j376L461M330J159k715n482
$$ 3209 4809 1303 -3254 -4792 -960 3806 4361 934 -3183 -4559 -1098 3232 4391 1676 -3806
715c806q74M355L720J118l206m258n99K080N478M80l221l783j859L269M605Q36
$$ -3806 -4680 -325 3395 4513 1307 -2951 -3550 -1470 4008 4488 1267 -2516 -4375 -1106 3499 4335
731D335k640n283k43L313L261J123l360k924j575K373M705L4k621l689l52L355
$$ 4335 1695 -3588 -3831 -518 2743 3866 506 -2418 -3993 -1620 3085 3119 498 -3191 -3543 -188
747a88K601J427l732k333q51K358L701k13k238l231j028K735M007N38k522m173
$$ -188 2413 3840 108 -2225 -3076 -718 2983 2770 532 -2699 -3727 -992 3015 3553 1031 -3142
763c142m14K658L385J031k901l084j079K562L937J20k240l394r63K801L167J159
$$ -3142 -3556 -898 2487 3518 617 -2467 -3546 -984 2953 3073 833 -2561 -3524 -723 2444 3603
779C603k678l625n32K756K862O38k120l050j227K677L348O42k280l755j03K116
$$ 3603 925 -2700 -3232 -476 2386 3024 904 -2146 -3373 -696 2652 3294 1014 -2741 -2844 -728
795g28K700J279k653k883r11K459L194K59j673k946j225K499K860R59k586k957
$$ -728 1972 3251 598 -2285 -3196 -737 2457 2716 1043 -1903 -3128 -629 2231 3190 604 -2353
811b353k45J518L114P27j829k910j281K762K623M18j940k837k63J556L014J141
$$ -2353 -2598 -1080 2034 2761 932 -1978 -3259 -497 2126 2544 604 -2233 -2496 -940 2074 3215
827C215k799k583l30K025K432K40j252k585j224K393K409Q14k310k150n81J337
$$ 3215 416 -2167 -2497 -472 1960 2200 948 -1637 -2861 -468 1941 2755 445 -1705 -2286 -949
843i49K917O20j819k812o29K088K361N18j454k488o49J392K721R15k454j833p40
$$ -949 1968 2588 769 -2043 -2672 -584 1777 2295 841 -1647 -2296 -904 1817 2732 278 -1555 -2295
860b295J671K353O56j391k809p28K220J854N89j539k452j44J308K393O93k065
$$ -2295 -624 1729 2385 994 -1815 -2543 -323 1531 2120 581 -1871 -2015 -707 1686 2379 314
876C14j997m87J570K050P03j456k046p62J510K168O88j724j891p57J435K196L11
$$ 314 -1683 -2170 -600 1450 2153 697 -1349 -2111 -601 1567 2255 531 -1360 -2117 -682 1514 1825
893A825j160j994n44J315J960Q59j943j477r16J606J946L18j549j589o77J510
$$ 1825 665 -1329 -1873 -558 1402 2261 318 -1159 -2075 -469 1477 1795 246 -1343 -2020 -510
909e10J940P61j683k000m74J394J854P17j396j885m37J310K314K29j781j448l49
$$ -510 1430 2191 508 -1492 -1966 -572 1282 1999 603 -1282 -1719 -409 1905 2134 353 -1095 -1444
926a444Q76K229n1j058j880m12J371J545P21j325j905l96J200J618Q09j685j365
$$ -1444 -568 1661 1610 552 -1328 -1740 -369 1176 1897 572 -1333 -1729 -529 1089 1898 213 -1152
943a152n13J044J939K80j451j247j004J661J687J97p93j978m12J418J417P37j331
$$ -1152 -1665 -621 1318 1598 147 -1100 -2104 -443 1244 1441 648 -1330 -1742 -324 1093 1830 499
960D99j884n7J046J400P67j404j136r94J342J394M85q41j724n05J327J125Q19
$$ 499 -1385 -1442 -396 1004 1771 367 -769 -1763 -421 973 1458 617 -1107 -1612 -285 840 1659
977A659j122j714J1O72J337R17j527j293l03O37J782K03j096r75p86J044J550
$$ 1659 537 -1177 -1166 -494 843 1760 233 -1060 -1363 -726 1056 1259 163 -812 -1598 -554 996
994I96K52q10j578j17P25J510M13r33j436j61P54J041Q58j241r97m04P85J423
$$ 996 1248 438 -1140 -1257 -532 978 1391 458 -978 -1139 -385 656 1514 273 -724 -1128 -343 1080
1012A080K04q41j244o97J215R27L85n86j626j35Q97J030P56r68j056k86L44J627
$$ 1080 1284 443 -801 -1498 -283 644 1029 443 -1183 -1318 -421 609 1365 397 -659 -945 -601 1026
1030A026K21j214o44p79J094J129K64k96j587n94J215P42N91r97j125p5P63J010
$$ 1026 1247 33 -611 -1390 -296 833 1097 801 -786 -1380 -165 577 1168 171 -954 -1029 -266 744
1048G44M62p57j065k58L76J326J98q91o86q46J079J059J97o03j111l53R39N88
$$ 744 1206 449 -616 -874 -498 828 1026 135 -551 -1397 -318 741 938 335 -776 -1129 -190 398
1066C98P95j047r39L0K46R80P10j199l49o19O78J020L15o46r83l53P77O42O82
$$ 398 1193 146 -793 -763 -517 463 1173 -26 -375 -994 -316 704 1019 373 -610 -963 -186 456 1138
1085A138p04j319j86R14O80N00p07j000kL91R57J02o06o01n08Q52Q88l1m83r13
$$ 1138 434 -885 -1071 -157 523 1023 316 -684 -686 -295 662 764 158 -443 -951 -99 789 758 275 -638
1105f38l38O65Q75L31n20j091K43L38O72O02j038p72k45L59R54L14m99o36n80
$$ -638 -976 -311 564 895 375 -716 -473 -135 537 1139 101 -671 -916 -557 397 711 212 -424 -1004
1124a004R00Q21j61k74p77l51N78P17L75l77r08j31K78Q34K58n61p77k09L17J117
$$ -1004 -104 717 556 282 -495 -846 -268 449 824 447 -461 -592 -314 520 778 217 -560 -769 -452 665
1144F65k4n52o13k64N25M91O15m72p89n79J073N18J56n65p49r7J67J091J11n85
$$ 665 641 89 -524 -788 -263 228 843 371 -418 -997 76 594 750 185 -564 -661 -494 597 708 123
1164A23q93K44K66P89M6k27r48k11N13N75M23m21r39L7L18N25M74n61m77m47N59
$$ 123 -770 -526 -260 529 575 348 -600 -811 -298 277 700 279 -660 -623 -305 220 694 133 -344 -791 -232
1185b32P48K7j99o63k67L54O20K46n59n40j68K81R13M7n04k42m47M10M40L01l96
$$ -232 516 543 344 -319 -586 -232 388 634 75 -465 -633 -352 561 608 104 -138 -585 -175 265 566 170
1206A70m57k05K80P06k9l27o36j16O49K28P6j82o20O6K09L94L93j43p94j27L41
$$ 170 -287 -492 -212 494 465 138 -498 -614 35 263 339 157 -463 -397 -188 206 599 456 -338 -465 -124
1227a24N80J7J7r01j76M54M24J71k94n61K7k3P82P8j45n25l97L18O60J88k90r73
$$ -124 456 473 490 -411 -587 -133 291 462 168 -393 -366 -389 393 471 326 -199 -596 -278 382 570 280 -693
1249f93Q7L72N01K94o57N2l57M42M95J62n06o26j70L48N71J09l03m52M3Q1M34
$$ -693 -606 -234 267 561 -96 -44 -401 41 536 698 192 -434 -604 -256 315 424 121 -331 -288 -207 227
1270B27K39l56j43m06L33L64K07j12o58l05N59K16L70n21j25l03K64N35l5k71
$$ 227 466 110 -33 -439 -106 258 465 353 -305 -610 -51 165 535 14 -111 -414 -150 385 350 79
1290G9j57l4Q7L24J02l45m84L37j09L66l2L3m52j97M83J77L33m25j04m74K89K68
$$ 79 -78 -112 -25 299 401 56 -428 -91 -200 166 134 167 -285 -482 1 178 511 86 -18 -492 -203 65
1312F5L41j94o40k7J01Q35j34k19n05r5J37M57J38j9o43K53O2M17K2r4o04l6K69
$$ 65 406 212 -428 -455 -354 481 347 128 -377 -472 -335 122 260 241 -402 -149 -87 330 352 258 -346 -382 -113
1335a13J08M83n6p4j007J93P94J11j76n91L36j68L48Q2j1n85P1J1M86K77l86k15
$$ -113 -5 478 422 348 -659 -466 328 439 263 -328 8 -160 188 270 259 -326 -255 -244 242 519 133 -82
1357h2j64o7N60r4j2m20J9L16J41K77l01k35j21Q7K97K19k47n36J04L51K7K28
$$ -82 -246 -313 247 153 141 -279 -260 56 197 474 173 -62 -183 -96 201 420 173 -363 -259 92 119 347
1379C47l76l19Q0J0O52l42M7j15j99M7M58k9j89l46j83M74K16j87J04q9r0j93
$$ 347 -29 -348 -268 -258 394 52 99 -16 -215 -168 290 261 72 -274 -457 17 233 46 150 61 -29 -222
1401b22L03L77k13l71j28M99k62J79l24k5r5K74rL71k64l12J35J30K60K3k90n
$$ -222 81 458 245 -126 -254 245 -17 162 -162 -187 -282 -8 -17 354 90 -222 -87 43 303 326 36 31
1423C1j77j21N02j49j75K46n23O3O70M8n72K38m58L51K80Lk70k60J92M9L72J04
$$ 31 -146 -267 235 86 -89 157 -366 -303 367 415 -157 81 -377 -26 254 257 -13 -273 -81 -32 340 444
1445D44l72k87j3m0J66M77n4m43J50r2NL57k84l16k3P4K50L77m01l16R2lP40l02
$$ 444 72 -215 -228 -268 -102 375 321 -122 28 -64 -59 298 14 -302 -325 -251 -1 376 -25 -341 -249 -252 488 186
1469A86M9k89K4j55M04o2j00j44l14J36N94m3k2n09J78J85O4q5P2k10k20K09N4
$$ 186 235 -54 -30 -185 219 157 57 -87 -401 -265 329 286 264 -245 -67 118 182 97 169 -41 -261 -52 2
1492BJ98j81k53J46j02L02m4j10o6n13K11J88N52m4n68R3L93m1k08O2l22j69N14
$$ 2 200 19 -234 -88 -190 112 68 -42 -108 -621 -410 -222 330 286 -282 -189 204 163 -45 17 -305 -474 40
1515D0J71m2m30M01m85j5Q39k52j31l18K65n30Q65l15L68m52k28p5p7N30m50O7
$$ 40 211 169 -261 140 -345 -360 479 227 96 -222 43 -487 378 63 431 -21 -249 -324 -401 129 -321 -254
1537b54N5M89l4l33m7k23J98N1J07K68J3p66J63N58J63L21o35k94k91R43q4k43
$$ -254 -199 290 256 -77 -124 -347 -149 -98 9 277 290 -476 -313 245 408 729 94 -200 -491 452 368 125
1559A25r2L77r99K95Q64k84k93J8n00N92J57q9j20k44j12K41K41q2j62R0j00K06
$$ 125 33 410 -589 -294 570 286 -7 11 -489 103 260 171 51 -193 -305 -64 177 95 -67 23 -77 129
1581A29j32L50l37o1q2K32j58R5j59q8J10j39K86J39j25n5q8k1R6J61j61l8j4
$$ 129 -3 347 10 -51 -133 99 -59 36 -123 -211 -101 -240 46 185 60 5 -83 -104 -8 153 -8 -46 -60
1604f0Q8j04J56J2jk02P0L6J02K6j50r9P8k19M77j32l16m8Q0K27J6j86j00P3K2
$$ -60 28 -76 80 92 91 -111 -41 -5 97 123 -27 -126 -48 -267 210 78 -238 -286 -206 21 37 -149 -249 -176 -154
1629a54K3K67q0k46J24P0j54J97n2o7j64M8K79q9O9Q5n03K99K27r1M2j85L53j7
$$ -154 -131 136 56 -190 -66 4 -150 47 -5 -72 -236 -188 91 2 71 156 -347 -48 179 88 130 -55 298 281
1653B81l23L83m65P0j01L38K5k78N0P6j44k8qK90o8o6k71K27K85l45K94l06P7
$$ 281 -42 341 -124 -54 -155 183 208 -70 -20 56 -88 -116 -124 166 98 32 -239 -12 273 -72 222 -84 -7
1676gk49O04j17n78M18l01L71n20J69L00j39k25N24r8k18M31p27J10J70J93K73
$$ -7 -256 348 231 -347 71 -230 141 -379 -210 90 -49 -274 250 152 -66 365 -362 -252 -82 111 384
1697C84k56L36j356Q01J90p66P32m19N30j82N01o71K31K61P3j08r93J025J27j016
$$ 384 128 464 -892 -91 99 -667 65 -354 176 -6 495 -176 55 316 389 281 -712 313 440 -576
1717e76O37K47n56R2m80J091n67L01m40K01R4l47L09K5J20l96M18N23q68j64M16
$$ -576 61 308 -248 -156 -636 455 -112 189 -251 -50 44 -303 6 31 151 -245 173 696 -172 -336 80
1738H0l35J56K28M9l20k1M08p06M12L03k23k12QN72l19p02J94O59M6k74K10p48
$$ 80 -255 -99 129 178 -142 -163 245 -461 -49 254 31 -181 -173 399 80 -622 -428 231 277 3 213 -535
1760e35j78R47k86q3R3j01l46M76r6O55lj545J048K03k18O17m82m95m9j91J204
$$ -535 -713 234 -52 -135 -42 -143 -489 -13 -109 546 543 -1002 46 249 31 648 166 -329 -378 -569 635
1781F35j449J325k79k37P43m18j12m26J57K47k44J93k64K72j56k71N56l30k8K61
$$ 635 -814 511 232 -5 738 320 208 -218 -61 186 -58 135 -129 143 -13 -284 272 -58 -86 175
1801A75j33j72K94j49R8ol92P7J65n6kJ73j50MM30j53J01n14J47J33J19k21Q1
$$ 175 42 -130 164 15 113 107 -285 -208 -43 -99 -101 72 -78 -74 356 203 304 -210 -63 70 189 -32 49
1824D9j18j60J73m8mM8N8Q2J93j95l09Q4J3M5M7l9J01n8L21j79j71J06j70J1k9
$$ 49 -69 -229 -56 -104 -108 -60 -2 80 273 78 -231 -147 -134 -89 -42 -81 20 -38 283 104 -67 39 -131 -120 -149
1849a49L23p3j24o1J08P0J5J44l45K20o1R2j18j47q2J75L49k49k40J48%K04l22
$$ -149 174 101 -23 -84 24 94 109 253 -92 128 67 159 41 -106 -188 -13 336 87 -153 -5 -5 199 -123
1872a23K58j42l2L1J12n8K9k26L7RK09O6k22q5k3K47k0j28J27J94j4k01J1O3j29
$$ -123 135 -7 -39 -8 104 46 75 -151 -114 -105 104 170 -52 -137 -160 87 67 -61 66 260 246 45 56 119 -10
1897a0j82j21N26k58J77l28J30K47l24J24L39k40k89k57J99j59O3O56l18R1M10
$$ -10 -192 -313 213 -45 132 -196 -66 181 -143 -19 320 80 -209 -466 -267 -426 -363 293 -25 66 476
1918D76l29J8K11n04K29R8o31J43P72j67k23n88M99J38m06K16K44k40L26k99j62
$$ 476 147 165 376 -128 101 199 -432 -289 483 316 93 -495 4 142 -264 -48 196 -44 282 -17 -179
1939a79N88n32J15M53r9o3n32M66J54k61l32j34Q84K5m46l60L80j00r1q0M16K55
$$ -179 409 -123 -8 445 346 283 -249 217 371 110 -222 -356 528 553 107 -253 127 27 -64 -144 272 527
1961E27m63J34m25J30L43m29K67m0K07p8k03M38o71N90l91O3L77k93k67j1j99
$$ 527 64 198 -227 -97 246 -183 84 44 251 173 -30 408 -263 327 -64 -1 376 83 -184 -195 -394
1982c94M90k90m97O01N54o18J33p8K29o6jr6O9j75M4k94N47j14j26J56j60N4m3
$$ -394 96 -194 -691 -90 464 -154 -21 -99 130 64 63 -33 36 -139 -95 -389 158 44 -82 74 -86 -32 -75
2005g5j44J57k8K17o4j59J29j42N1l0j6j6M6J26M6r4M2m0N6k29J97J14j58J37
$$ -75 -219 -62 -90 127 63 -96 33 -109 -58 -88 -104 -120 -74 52 98 4 46 6 62 -167 30 144 -14 123
2029A23n3p7j40J39m2J47j3j56k66K94K67j77p4J06r2Q7k22K09J94j88j9k79L1
$$ 123 70 -7 -147 -8 -50 97 84 -72 -338 -44 223 46 -28 78 -14 73 -149 60 254 66 47 -232 -201
2052b01L02k15k2L25M8k85j74N2N0J2L75k69O4p5j66K32K6pj36J26q0L0j98K87
$$ -201 101 -114 -136 189 237 -48 -222 -170 -120 -108 267 -2 62 -13 -179 53 79 72 -64 62 -18 12 -186 101
2076A01j14pj33J58J50k25j31K54j62K55j33K99l18J11j76K09j1o6l09K51mj01
$$ 101 -13 -20 -153 5 155 -70 -201 53 -109 146 13 312 -6 105 -71 138 127 61 -248 3 -1 -102
2098a02L35o8l75rK30JK0K25k03k76M11m2j36l16K00oJ13R6j66J18r2K9q7J95
$$ -102 233 165 -210 -219 11 12 32 257 54 -222 189 147 11 -305 -105 -111 2 98 -68 50 -42 -13 -100 95
2122I5J69j86k07K22j42q9K25l10J21k54L02n1L55j19Jj05j70N9K2k73K14R2j5
$$ 95 264 78 -129 93 -49 -138 87 -223 -102 -356 -54 -105 250 131 132 27 -143 -84 -62 -335 -121 -29 -44
2145d4M4O6m6j15o7J46j09K15j89J89on3R7o6Q8M2oj21o5J1j87j82K00J07P0J35
$$ -44 0 66 20 -95 -162 -16 -125 90 -99 90 84 31 128 62 150 192 186 65 0 11 -176 -358 -158 -51 19 154
2171A54o8P7J7k43L03k76K14q9q3r6O9O6m1J93l17K38m2lq8J9o4R9J22j66J97
$$ 154 86 163 180 -63 240 -36 178 89 6 -90 -21 45 4 197 -120 118 76 73 -15 4 -60 39 161 -5 192
2196A92j50J0j80N32j19j24l0L97j067M48J28N61j103K06K07k83Q87l06j238N13
$$ 192 42 52 -128 404 285 161 131 528 -539 -91 37 598 -505 -299 -92 -375 512 206 -1032 -519
2216e19O59j025R56O2Q1k67P7M41j020J424n94K47L47p83k12n74N90L5O1M12p50
$$ -519 140 -885 71 133 214 -53 24 465 -555 869 275 522 869 86 -126 -700 -110 -75 -14 398 -352
2237c52M8M38k13L41P3l5k32R3L4P74j230K6O19j073R77j005M02Q20p22L07m53
$$ -352 -304 134 -79 262 335 300 68 161 195 969 -261 -235 384 -689 288 -717 -315 505 -217 90 -363
2258c63J99l86N95j08J08j24K01J26l79K55k22N7J14j48N2j53J90K5m7J72k35
$$ -363 -164 -550 45 -63 45 -79 122 248 -131 124 -98 -41 73 -75 -23 -176 14 39 -8 164 -71
2279g1R0K9l2n1mKL9j25L04j07J31k93MP0L01k31P6j05L5j41K59k23N51k78L0
$$ -71 19 48 16 -35 -39 -37 2 -123 181 74 205 -88 -84 -14 287 56 132 27 62 -79 180 -43 508 230 260
2304B60k36M6K62m28N62m07r2K79k0j92k05L29l27K19j80J02j20L46k53j17K63
$$ 260 24 70 332 -96 466 59 -33 246 226 34 -171 158 -169 50 -130 -28 -148 198 -55 -172 91
2325I1j51l54J23j69O37J070j548N36k09J57L0l88M87j11j64L44k31j93k17L13
$$ 91 -60 -414 -291 -460 177 1247 -301 235 26 183 213 -175 312 201 37 381 150 -43 -260 53
2345E3L7M0l34J19j72K56L4l8j54K38j67K48P55j083j1J4L1p85P23k96J124m79
$$ 53 90 130 -204 -85 -257 -1 33 -5 -159 79 -88 160 915 -168 -179 -165 -134 -919 -196 -492 632 153
2367A53m54O54p62K89L3k34N49k79k44M89l47P15p13L53J95m91j21K1M77K24p95
$$ 153 -301 353 -409 -120 -87 -321 228 -51 -295 194 -153 562 -151 202 397 -94 -215 -194 283 507 -288
2388b88L46r0j62L26J88k2k32K22k29j67K88Kk12Kj3Kj42L46M46p89L59K4j89
$$ -288 58 -32 -194 132 320 298 66 288 59 -108 180 182 -30 -28 -41 -39 -181 165 611 -178 181 205 16
2411A6L18j35r4J15l38J52K73l01K7k7j72L31J91k02o23J34L10j74L94j95Q3P5
$$ 16 334 199 105 220 -118 34 307 6 33 6 -166 165 356 154 -469 -335 -25 -199 195 0 83 158
2433A58n0k83J27j83K83J61j18n59R3P41m30P3j61K13k95K21O7r3M52p25j7O05
$$ 158 108 -175 -48 -231 52 213 95 -464 -371 370 -60 13 -148 65 -230 -9 58 -35 417 -308 -325 280
2455B80o05M49L68m64l74Q15q96M56l16J012j076k63R61m12K88J28m15L1K2N79
$$ 280 -325 124 492 28 -346 469 -427 29 -287 725 -351 -614 347 -65 223 351 -64 -33 -11 568
2475E68l48j30k9k40K19l75L08j80K25P1j11k24K67n3K46Mk23o3L2J69K4k38P5
$$ 568 220 90 61 -179 40 -335 -27 -207 18 89 -22 -246 21 -32 214 218 -5 -68 -36 133 157 -81 -6
2498fk41J80J37L5k13K8M0l6J97k11l2Jj90L33k41K28k0J28j97J61N6r5q1K10
$$ -6 -247 -67 70 105 -108 -80 -40 -76 121 -90 -122 -121 -311 22 -219 9 -11 117 -80 81 137 42 -39 171
2522A71k12Q7J9k68L14l31J71n0J95Nl14N63m05Q6j24M12k03j84lJ38P5j07O3
$$ 171 -41 46 65 -203 111 -220 -49 -99 96 101 -213 350 -55 31 -93 319 116 -68 -71 67 142 35 98
2545I8k88L1L51k0J58n47J10J79j49N7k4k8Q0J77j41n8N2p8j42K19j00P5R8K34
$$ 98 -190 -159 192 172 330 -217 -107 72 -77 -20 -44 -72 8 185 44 -14 38 -40 -182 37 -63 12 110 344
2569C44l78k3J89J72l70J3r8J71P1k30K53P1k14K18n6J25j35j17j89K34J31k95
$$ 344 -34 -57 132 304 -66 -53 -151 20 91 -139 114 185 -29 189 133 258 123 6 -183 51 182 -113
2591a13J71k27J48K49j90Lj24R9J85j69J19j94j02K5K51n9j68J57L2k85J81J27
$$ -113 58 -169 -21 228 38 41 -83 16 201 32 151 -43 -145 -120 131 72 -96 61 93 -192 -11 116
2613A16o3r1NJ4J78j33K02J0m11K11K1k32K06rj34L3K05o6j61J43m1O6O7j61J4
$$ 116 53 -38 -33 -19 159 26 228 238 -173 38 59 -173 33 24 -110 -77 128 62 -99 44 3 69 136 -25 -11
2638a1J6p0M4o5J13j17r7K11m4NK1k72M04l38M0J76N1j51l2J19k4j08J28j47K77
$$ -11 5 -65 -21 -86 27 -90 -187 24 -20 -15 6 -266 138 -200 -160 16 67 -84 -116 3 -21 -129 -1 -148 129
2663A29k73L32k00j3r4K14j5r9p2j3%J27j51o1J42J08k36J86P1q2j13M5k3J4r2
$$ 129 -144 188 -12 -25 -119 95 80 -19 -91 -104 -104 23 -128 -189 -47 61 -175 11 82 0 -113 -68 -91 -77 -169
2688a69K30q2J36n0oj9m5j6J76l0l07Q0R4o6L43l60j23K78l4N8o5j6J12j03j41
$$ -169 61 -21 115 65 59 40 -5 -21 155 125 -182 -102 -8 -74 269 -91 -214 64 30 88 23 7 119 16 -125
2713a25K08n6l67K45L2r4K46l75N04k96J15J11k24p9J39J41j71L47l03r0J83k4
$$ -125 83 27 -340 -95 -63 -157 89 -286 218 -78 37 148 -76 -155 -16 125 -46 301 -2 -92 91 67
2735F7j61o8O9J61r0K28j82K44k70j08j32K22k16K92N6j23K32k84j42K22n3O7
$$ 67 -94 -162 -93 68 -22 206 24 268 -2 -110 -242 -20 -236 56 112 -11 221 -63 -205 17 -36 31
2757C1k00q2M26l52j0K90P4l88J82j59M43k99lL74l86Q9R7j33Q1K9m8N3j67j68
$$ 31 -169 -251 175 -177 -187 103 177 -211 -29 -188 255 -44 -47 327 -59 30 127 -6 75 104 56 109 -58 -226
2781b26L83O1j96J2j8j1o7lj64K24NJ22l60J99l92M17l44P17o55r1Q67j059K35
$$ -226 157 218 22 34 16 5 -62 -65 -229 -5 0 122 -238 -39 -431 -14 -358 359 -296 -387 480 -579 -344
2804c44L48n2K94k82k3L74o4r0n9k87K97k06K92P6m42J18J63L7o6l51N23k42j24
$$ -344 4 -48 246 -36 -59 315 251 161 102 -185 112 -94 198 274 -168 -50 113 150 84 -267 256 14 -110
2827a10J65J38o89N19O15r60L25K80j226J007m83N47k51J82l9k44N9M3q2J19K27
$$ -110 55 193 -496 23 638 -322 3 283 -943 64 -419 128 -123 59 20 -224 -165 -122 -204 -85 142
2848A42Mj55J0L2n5K9j0J09j73QR4J51o6n6J9p5J06k48J2J85O8N1j90K63m64L34
$$ 142 146 -9 1 33 -22 7 -3 106 -67 -59 35 186 120 64 83 8 114 -134 -122 63 131 182 -8 255 -209 125
2874A25l04O8J1J30J14j46K20j31R2r9p4j22K06l5n5q9R7M1J9j38L0k84M34m5
$$ 125 -179 -111 -100 30 144 -2 218 87 179 80 6 -116 90 55 0 -89 8 49 68 -70 -40 -324 110 65
2898F5k21K46m5q3J64j85r3M17q1j88n4P0J2q4r2J03J15q3K8L6o5n5j21O9k3p3
$$ 65 -156 90 45 -38 126 -59 -152 265 184 -4 -58 12 24 -60 -152 -49 66 -17 11 47 -18 -73 -194 -125 -148 -221
2924b21K09j1k1J7P6k6j80J22K3j53N94o80O1M84n6k54L46l23k06O0O9O4k83K8
$$ -221 -12 -23 -44 -27 49 23 -157 -35 -12 -165 429 -251 -190 294 238 -16 330 7 -199 -139 -70 -6 -289 -261
2948b61K20l8J87j44M0K78k65rj23J1R5O5K5j79O2J71j77K7m7P5M0q0j09J91m7
$$ -261 -41 -79 108 -36 4 282 17 8 -115 -104 -9 56 81 -98 -36 135 -42 -15 -62 13 53 -27 -136 55 8
2973Hn9KL04l13P4J40k29R1M4M8r6N4j80n6P2K4K29k06J09Q5q2J35l01J91l10
$$ 8 -51 -49 255 -58 16 156 -73 18 62 110 14 68 -112 -168 -96 -72 157 -49 60 145 63 198 -103 88 -222
2998b22N57k25n3J44j60P9k17J58p3j93J94k62Q5L84k99k08L20J73k60J42j76
$$ -222 335 110 57 201 41 120 -97 61 -12 -205 -11 -273 -188 196 -103 -311 9 182 -78 64 -112
3019a12K00Nl6k61J95l9J11J0l7m3o2Q8J07j41K9k37L49k84J45K16q9k61K48r7
$$ -112 88 93 57 -204 -9 -48 63 73 36 -7 -69 19 126 -15 14 -223 126 -158 -13 203 114 -147 101 4
3043Dq9K06k11J87r0J10k26K35J71j71J7k49J6M2o9j4Q1K7K23k82o0m2K58k80
$$ 4 -85 121 -90 97 7 117 -109 126 297 126 143 -106 -90 -48 -117 -131 -50 -23 200 -82 -142 -184 74 -206
3067b06J40n8J11j36J50K70k64j37J45j65J38L8o5R1J3l20O65p13j70O96o16P25
$$ -206 -66 -124 -13 -149 1 271 7 -130 15 -150 -12 26 -39 52 65 -255 410 -303 -473 223 -393 332
3089C32J67p19j90K30r2N15N2l60Lk86J27Q73n77j54j83kN91k05m88J07N24R1
$$ 332 499 -220 -410 -180 -272 243 295 -65 -62 -348 -221 652 75 -79 -262 -264 327 122 -366 -259 265 356
3111C56o71K90K09k81L52m09J20J37l34R4q1Q7K11j40j86K55J00r8M2NO9j69J67
$$ 356 -315 -25 184 -97 255 -154 -34 103 -231 -137 -218 -131 80 -60 -246 9 109 11 53 58 127 -42 125
3134A25j03L8o3j57J90J86L4k72j16L51K5k58jj84o6K27L5l1M7K05l18K20j9L29
$$ 125 22 60 -3 -160 30 216 250 -22 -138 213 238 -20 -21 -205 -271 -44 -9 -40 7 212 -106 114 95 424
3158D24m70J1O9r1j10k34q4O81n3k08r5K27L3j13M9J10Q1l04J90j38L5M5j24J52
$$ 424 -46 -35 34 -57 -167 -401 -485 196 143 -65 -160 67 100 -13 36 146 227 -77 113 -25 10 55 -69 83
3182H3r8j8K24j86m1n9L33J70n31N9j3R9r1K3k98L73J05N5k8j65M5q7J23k08P9
$$ 83 -15 -33 191 5 -36 -95 238 408 -123 -64 -77 22 -69 -46 -344 29 134 189 161 -4 41 -46 77 -131 -52
3207e2N9j73j3K60o4J40k78K5K10J25m95K94o9jq9J65J12j10q7J32n1J34q8n4
$$ -52 7 -166 -179 81 17 157 -121 -96 114 239 -256 38 -31 -32 -121 44 156 46 -41 91 40 174 86 32
3231C2m4Q1l83M29k4l4l05K27J51j57L00l45L39k76l1MJ41m27K59O6j76L6K25
$$ 32 -12 69 -314 115 91 57 -248 -21 130 -27 273 -72 267 -9 -40 -36 105 -322 -63 3 -173 -137 88
3254H8j60K29k92p3L82J34l24j2K72m05K03j24J2n7m7J22L1K3J54j15N9k46J5
$$ 88 -72 157 -135 -208 174 308 -16 -28 244 -161 42 -82 -70 -127 -174 -52 -21 2 156 41 100 -146 -131
3277a31K73k24L03j66r9p0J39N2O1m3L3k93J19L1K12l35M1k3K75n6K8j83N1r7
$$ -131 142 -82 221 55 -44 -114 25 77 138 95 128 -165 -46 -15 197 -138 -97 -120 155 99 127 -56 -5 -102
3301a02R0L1pj12J21l47L01r7p6K85R2k1j60J3k1q8J71j26O1O0j57k7J54k49J40
$$ -102 -12 19 12 -100 21 -326 -25 -122 -198 87 179 158 -2 11 -10 -98 73 -53 8 68 -89 -116 38 -211 -71
3326g1OJ91j57J82J23k9k14j36J30j32J66R9j74N7Mk27J32j33N1J95j52j98L65
$$ -71 -65 126 -31 151 274 245 31 -105 25 -107 59 158 -16 41 45 -182 -50 -183 -132 63 -89 -287 78
3349G8n3K0k16P8J52j20M6L8J6J08k24m3J44J6p7J34L18m81K1N8J06j13j72L9
$$ 78 25 45 -171 -93 59 -61 -15 23 39 147 -77 -120 24 40 -37 97 415 -66 -45 13 119 6 -166 -127
3373a27K68Q7l43n2O5j39J91J03O4j31m0J59r8J33j22j37K36j51J28k22L7o2K92
$$ -127 141 228 -115 -167 -102 -241 -50 53 117 -14 -54 105 7 140 18 -119 117 -34 94 -128 -91 -153 139
3396A39k25M39m72R4l69L51j12j56L83P3j76m9J89j89j00j5J80K3k55K27n9J47
$$ 139 -86 353 -119 -25 -394 -43 -155 -311 72 145 -31 -80 109 -80 -180 -195 -15 8 -247 -20 -79 68
3418F8J76k63L8r4k5K37L3n7J32m09K68j9LN4j90P4J45j10j36R9k60J52m5M44
$$ 68 244 -19 19 -75 -100 137 170 113 245 -164 104 85 88 142 -48 26 171 61 -75 24 -236 -84 -129 315
3442C15n81K53M4j40K58m1k48J62J61j9J20k44p9Nk5J22m4m2O2j42O5k15Q7J53
$$ 315 -266 -13 31 -109 149 108 -140 22 183 164 284 40 -39 -34 -59 63 19 -23 39 -103 -38 -253 -166 -13
3466a3j83K49Q3kl71j12N52K04k54l07J63j59N8Q4K3J94l59JJ12J42l04K90k36
$$ -13 -196 53 136 134 -237 -349 203 407 153 -154 9 -150 -92 -8 15 209 -150 -149 -37 105 -199 91 -145
3489a45J54p4J41N7l5o8Q7l77J48J27k55M36j83j01o7K32MK20j83r3j06j57J24
$$ -145 9 -65 76 133 98 30 117 -260 -112 15 -240 196 13 -88 -155 77 81 301 118 25 -81 -238 -114
3512a14LJ23l6j4pJ05j59P1K81q2j51MK60k74j2Oj72L39j16J66k85j38K79L9j53
$$ -114 -111 12 -24 -38 -45 60 -99 -28 253 171 20 24 284 10 -2 4 -168 171 55 221 -64 -202 77 116 -37
3537c7j30K19j01J7J81k7k47L8j07K88j17K17J70l63P5O3j54j43J51J40k99J23
$$ -37 -167 52 -49 -32 149 122 -125 -87 -194 94 -23 194 364 1 76 139 -15 -158 -7 133 -166 -43
3559d3J24r4j56J23O1j29L29j38J1j50K63k99j02J59qO0K0l9K2j82J04K60k58
$$ -43 81 -13 -169 -46 15 -114 215 77 88 -62 201 -98 -200 -41 -49 11 31 -8 14 -168 -64 196 -62
3582f2j03J95n0k1o0j07K33N0L35m92L35r9k41K11k42J34K02k36K69p7l18J33
$$ -62 -165 30 -20 -41 -101 -208 25 75 410 -82 253 154 -87 124 -118 16 218 -18 251 174 -144 -11
3604a1O7o2L3pJ47R2l87L05j65j93J04J92J3k26J92O5k45M8m9K04l27J02K04k04
$$ -11 56 -6 27 20 167 259 -128 177 12 -181 -77 115 128 -98 94 159 -86 -38 -87 117 -210 -108 96 -108
3628a08Q2K05j14K3l22N02m6l06K7J78M3l26l1J98M6m7j46J31M2qL0K7j90L75
$$ -108 -26 179 65 88 -234 268 222 -84 -57 121 164 -162 -193 5 51 4 -142 -11 31 23 53 80 -110 265
3652B65l03o7L31k8l35K14k29J07J04K1k16R7L7J48o9j09l4N3p1q4L35qj42j26
$$ 265 -38 -105 226 198 -137 77 -152 -45 59 80 -136 -39 -2 146 77 -32 -66 -13 -84 -168 167 159 17 -109
3676a09K30j83j4J23k9q7j68J01N0K69m03J48k3J2R6NJ68m93M43q3j82J11r1j27
$$ -109 121 -62 -76 47 18 -69 -237 -136 -86 183 -220 -72 -95 -83 13 18 186 -307 136 53 -129 -18 -109 -236
3700b36K75j83J89j11L7J26k76K32J25k03q6K97k77L61l97K04o3l50L65r6Lj39
$$ -236 39 -144 45 -66 -29 97 -179 53 178 -25 -111 186 -91 270 -127 77 14 -336 29 -67 -64 -203
3722b03L19n9J13J5l11K61l70K78N1l6J34l87K91j44Q8n6o7n1L03l45J32M7J81
$$ -203 116 57 170 185 -126 135 -235 43 94 58 192 -195 96 -48 40 -16 -83 -134 169 -176 -44 3 184
3745A84p9q9j3J4j1n8J43j8J94o6l38k09K05ML00J0l28M0M9J02J09k70L8KN2J40
$$ 184 105 16 3 17 6 -52 91 73 267 201 -137 -346 -141 -137 163 173 -155 -115 -66 36 145 -125 -87 -85 -33 107
3771A07l57L13M6j72J41k65K16j00pJ85j34K4N7O2Oj43L9o7o7K71j12j37r3L42
$$ 107 -250 63 109 -63 78 -187 29 -71 -78 107 -27 -3 54 116 122 -21 18 -49 -116 155 43 -94 -187 155
3795A55k89K03L9k53L83j15o9k57J90M2j48J27j51j22J82J24j00j1L97k92N8m2
$$ 155 -134 69 108 -145 238 123 54 -203 -13 29 -119 8 -143 -265 -83 41 -59 -70 327 35 93 51
3817E1k6r8J14j4Q6k11j28K86j32K19k45J70k53N0K09Lj49M9j8P6q7J39j25J27
$$ 51 25 -73 41 27 113 -98 -226 60 -72 147 -98 72 -181 -131 78 81 -68 -19 -37 39 -48 91 -34 93
3841I3J5k79j03J44K37j22J76p5j83j0J87j97l3J32K3j58J21j76L13Q9m01J99
$$ 93 108 -171 -274 -130 107 -15 161 86 -97 -107 80 -117 -150 -18 5 -153 -32 -208 105 194 -207 -8
3863hp0q0J35p9N8K37q4j54K20k32N2J07j44R8l30o4M07P1j67Nq3K08r8oJ24l2
$$ -8 -78 -158 -23 -102 -44 193 109 -45 175 -57 -5 102 -42 56 -274 -338 69 140 -27 -22 -105 103 5 -1 123 91
3889I1k87P4J81l9k60K95J8J34k63J5L3J29j66nJ69j79J4K0K8N1Pj06L78k54k03
$$ 91 -196 -122 59 20 -240 55 73 207 -56 -41 -8 121 -45 -50 119 -60 -46 -26 2 53 60 -46 332 78 -125
3914a25J99M9M0J18p5l78L36O5j40j88O4K16k75j6K56J15p1j17k01L00k74K4P2
$$ -125 74 123 163 281 206 -172 164 229 89 -99 -35 181 -94 -110 146 261 190 73 -128 172 -102 -78 -6
3937fk5P9j90P6q6K89k24l4j04O04k57k3n7j49K37k48j54L49o1j76K81p7p1Q0
$$ -6 -31 48 -142 -66 -152 137 -87 -121 -225 379 122 99 42 -107 130 -118 -272 77 16 -160 121 44 -27 53
3961E3j31P6M0Q9j39l2k7J22L05m49K68r4o3JJ19j64q6L20k14MK2o7P3K4K4j14
$$ 53 -78 -2 38 127 -12 -44 -71 51 356 -93 175 81 18 19 138 -26 -112 208 -6 -2 20 -47 26 50 74 -40
3987d0K45l29K86R5k52q1L10k50K65j19j0j75Q0J58j72m3LJ12O8pk23P5n1M2J87
$$ -40 205 -124 162 257 5 -76 234 -16 249 130 120 -55 25 183 11 -32 -29 83 151 144 -79 -4 -55 -13 174
4012A74k83r9R5J48j37N6K20n26J97J83K78m79M81j76j87j6Q9j7J27r6KK11m45
$$ 174 -109 -208 -113 35 -102 -46 174 -352 -155 28 306 -173 308 132 -55 -71 18 1 128 32 34 245 -200
4035b00M1L84k97K21k99K48j62j90L58k25K36l43L5L46j67L5j94M07k73j37K71
$$ -200 -159 225 -72 149 -150 98 -64 -254 104 -121 115 -228 -193 153 -14 21 -173 234 -39 -176 95
4056I5j07J27L1j36n7J88k29j2J60p0j58M21r2k39p3Q5q0K35j50J57q0KL3j7k8
$$ 95 -12 115 146 10 -47 141 -88 -100 60 -10 -168 253 161 -78 -151 -66 -146 89 -61 96 16 18 51 34 6
4081FJ9q1M9J7J24j87j53M58k76m3J53q2QMR6j49r8P7J99k29R7j3J44l52J97J20
$$ 6 25 -56 -7 10 134 -53 -206 252 -24 -67 86 4 12 16 112 -37 -135 -58 141 -88 9 -4 140 -212 -15 105
4107A05o1J24k13M35n54K41k08J97K6Q3L7j8j93r3j36M89l73K20k51L55k23J97
$$ 105 44 168 -45 390 -164 77 -131 66 92 175 212 194 1 -92 -228 261 -112 108 -143 212 -11 186
4129A86p5q3P6P3k14n6O5j09j32M57l16N2M9J25K2l6k90K84l2k8K12j51M8J2k35
$$ 186 111 28 104 177 -37 -93 -28 -137 -269 188 -128 -76 -27 98 120 84 -206 78 46 18 230 79 127 139 -96
4154i6R0o5K36k35k1O1O4j04L8n7J5J76r5R6j3l6j59K48j82K52j61Mr2n3O2K67
$$ -96 -6 -71 165 -70 -91 -30 34 -70 -32 -89 -74 102 7 103 90 54 -105 143 -39 213 52 56 -36 -89 -27 240
4180B40m02K18k92J97p0J1Q8O7n5k31K32J74j57R1j8j55K95l58J12j87K74Q7p3
$$ 240 -162 56 -236 -39 -109 -98 -10 57 2 -229 3 177 20 111 93 -62 233 -125 -13 -200 74 161 88
4203H8o0O6O9O6l27K06j12J80l15J71K8J02j39K37Pk66O3j77o9K73P0l26j23J81
$$ 88 28 94 163 229 -98 108 -4 176 -139 32 60 162 23 260 267 1 64 -113 -182 91 161 -165 -288 -107
4227a07L71l49K10k88q0K74K03n53L42j5l8n8L85l23J94k59J13j8q3K51n4j90
$$ -107 264 -85 125 -163 -243 31 234 -319 23 8 -30 -88 297 -26 168 -91 22 4 -79 172 118 -72
4249g2J20j3K31l88J8K94k07Q5J08k15K16p1r8j66K78K01l06j54K33k5J33k07
$$ -72 48 35 266 -122 -104 190 -17 68 176 -39 177 106 8 -158 120 321 15 -139 94 69 202 -5
4271eOm2j6K97R0m66j15K70j40K06l28M4J20J93J4r3n5m4n7J99j37K8j04K06m8
$$ -5 1 -41 -57 240 330 -136 -251 19 -121 85 -243 -199 -79 114 128 35 -20 -64 -121 78 -59 -31 -135 71 23
4296B3J43j06k27K97k58n9L26l52j2L04m1J38p5K19l10rj53J13P2j77J18kj9J54
$$ 23 166 60 -167 130 -128 -187 139 -213 -225 79 38 176 101 320 10 1 -152 -39 33 -144 -26 -28 -47 107
4320A07j15m5J73p5n3P0J20k39N6N4J67k36j28Qp6J95J42j66R4k32jJ58j23R9
$$ 107 -8 -53 120 45 -8 62 182 -57 -1 53 220 -16 -144 -136 -212 -17 125 -41 53 -179 -180 -22 -145 -46
4344d6R1j76p9K97j27l6J72j57o6J43J51J1m8J66m41J36K42l27r5L90j14r6N8
$$ -46 45 -131 -210 87 -40 -76 96 -61 -127 16 167 178 130 296 -145 -9 233 -94 -189 201 87 -9 49
4367D9K7j18j45Q5J28L9k24J15J51j12q5K47J3j05j60r4K66j36Q8l19K74M0j09
$$ 49 76 -42 -187 -102 26 65 -159 -44 107 -5 -90 157 170 65 -95 -189 77 -59 29 -290 -16 24 -85
4390h5J48j31K17J54j73l13L79l9k09N9P8l2P1K0r5k57N5J41K4M8k2Kp7j40L00
$$ -85 63 -68 149 303 130 -183 196 157 -52 7 85 53 124 144 49 -208 -153 -12 12 60 38 40 -37 -177 123
4415A23k36L61l67O4L80k59J8O0K01j96l52O5J11q3j00M38k11p2mJ96k28k00M72
$$ 123 -113 248 -119 -55 325 66 84 144 345 149 -203 -138 -27 -110 -210 228 17 -55 -59 137 -91 -291 181
4438A81j92q6j91L57j03j06K31O0j84J36p9J5j82K69j96L05n57N15k2j11j48J35
$$ 181 -11 -97 -288 69 -34 -140 91 151 -33 103 24 39 -143 126 -70 235 -322 193 171 60 -88 47
4460D7J37J20k71mk3o9N8m8k64J53L22N1k66O2l1Q5j0r6j46P8J00J42J29k85k44
$$ 47 184 304 33 29 6 -63 -5 -53 -317 -164 158 209 -57 5 -26 59 49 -47 -193 -115 -15 127 256 -29 -273
4485b73J43J6K25k07J73k52K48q4O8M0J21q1k59Q0j08k6J91r0J26p0r2rL28k00
$$ -273 -130 -114 111 -96 77 -175 73 -11 57 97 218 137 -122 -42 -150 -176 15 -75 51 -19 -111 -120 208 8
4509HP6l1r6Q4J45j43k26J53Jj19j9J33k18M37k2k78J61j36l9qK88j50J77n0p0
$$ 8 84 53 -43 41 186 43 -183 -30 -29 -148 -167 -34 -252 185 163 -115 46 -90 -129 -137 151 1 178 128 58
4534E8L7q8L4J15J66k95j03P0O0k04k4o8J2M28k36j29J11l9J78l52K91J52l55
$$ 58 95 7 41 156 322 27 -76 -6 54 -150 -174 -242 -230 198 -38 -167 -56 -95 83 -269 22 174 -181
4557a81L15J1j25L0J82J46m18J34Mj21L69k02j19j21n4J13R2k52K32j72M6m3J64
$$ -181 134 145 20 50 232 378 -40 94 98 -23 346 144 25 -96 -150 -37 55 -197 35 -137 -91 -134 30
4580C0j51L96j52j38J87p0j89J10Q6q8j06J61r1K8J11k64K20m1j34N3k8j30K67
$$ 30 -121 275 123 -15 172 102 -87 23 109 21 -85 76 -15 13 124 -140 80 39 -95 -42 -70 -200 67
4603F7N2k7j51J65k10O3p9Q7N4o3J77l7M0r8K26k70j8j81K10K30j79j26K30l84
$$ 67 119 92 -59 106 -104 -41 -120 -33 21 -42 135 98 138 40 266 -4 -22 -203 7 237 58 -68 162 -222
4627b22J93J69m30L36k66j1R8J29p0J37J3p4p3K68l01R2J84J0j01J6j88M9L7M8
$$ -222 -29 140 -290 46 -220 -231 -133 -4 -74 63 76 2 -71 197 -104 -12 172 182 81 97 -91 -42 -5 43
4651D3j04J40k6n4m7M8R2j65J26j36M9n3K67j52j02P6P0PJ64k24K12j69rK3LR
$$ 43 -61 79 53 -1 -48 0 92 -73 53 -83 -34 -87 180 28 -74 2 72 79 243 19 231 62 53 76 79 88
4677H8p0j46N7L45m87J36r4L46n5K3J2j90R5l97L88k49Q5M6j34L35j49l23K42
$$ 88 18 -128 -71 274 -213 -77 -171 175 120 143 155 -35 60 -337 51 -198 -113 -67 -201 134 -15 -338 -96
4700i6J45j08j52r4L29j74K41l32M9J13J82n2k51Q1J20J73l44J61J53k59J56m6
$$ -96 49 -59 -211 -305 24 -150 91 -241 -192 -79 103 51 -200 -119 1 174 -170 -9 144 -115 41 -5
4722eJ58k11j05J03J02J24K2j84j52J05O7K8J48k82j38j5M50j57j33K43m6k05
$$ -5 153 -58 -163 -60 42 166 188 4 -148 -43 24 52 200 -82 -220 -235 215 58 -75 168 122 -83
4744h3K47k48q0K93j09Q9j11K91l16J19k49L40j61j1J78j74O4j76j01J99q1k45
$$ -83 164 -84 -164 129 20 109 -2 289 -27 92 -157 183 22 11 189 15 79 -97 -198 1 -80 -325
4766c25J07J90J56j77J25j59K5M4r9J60j16p1R8J37r7j07K74j96o9P7k3R7O7j53
$$ -325 -218 -28 128 -49 76 -83 -58 -14 -113 47 -69 -140 -42 95 -2 -109 165 -31 -100 -23 -46 51 118 -35
4790c5RJ08r7k2J71r1o8J18k58J28N5M6r1J95q5j93R7j99L06p9J71o9j46J2O5
$$ -35 -26 82 -15 -37 134 43 -25 93 -165 -37 18 64 -27 168 83 -110 -13 -212 94 15 186 117 -29 -17 48
4815D8k04N9K35j88J93j52l0J23QL0p9j32j46L40p7J14N2j05j10QJ69l55P9j08
$$ 48 -156 -97 138 -50 143 -9 -39 84 92 122 43 -89 -235 105 28 142 194 89 -21 -13 156 -199 -120 -228
4839b28K68j62oJ37j19J9m0Q6K38k31n1n7J31r5JL60j8k99J80j79J00m9r2k11
$$ -228 40 -122 -128 9 -110 -91 -131 -45 193 -38 -89 -146 -15 -110 -109 251 233 -66 114 -65 35 -14 -106 -317
4863c17K30n6K32J53l22p3K7O9N4J31j69p8K82j30j78K04m6l4J76k13j02K83j40
$$ -317 -87 -143 89 242 -80 -153 -126 -57 -3 128 -41 -119 163 33 -145 59 13 -21 155 -58 -160 123 -17
4886a7J04j88J20j45Q1j2J49k96K74q9p6QP3K20l18O4o8K55k29O2q2N8Q2j15N0
$$ -17 87 -101 19 -126 -45 -57 92 -204 70 -19 -95 -87 -14 206 -112 -48 -116 139 -90 -28 -110 -52 30 -85 -35
4911c5R9j03L27j20l6j45j92L36j61j55K60j88J86P9k15P2q8N7J12k15KK02l37
$$ -35 64 -39 288 168 132 -13 -205 131 -30 -185 75 -113 73 152 -63 9 -79 -22 90 -125 -123 79 -258
4934b58J93%K56l75J42j8P9k06J58j19P8l7J56p3j46O9k28K15J96j01j91M39k32
$$ -258 -65 -65 191 -184 -42 -60 19 -187 -29 -148 -70 -107 49 -24 -170 -101 -329 -114 82 -19 -210 229 -3
4957cp4r4K97q1jO0k21M0N0q5J98m30L47Pk8J48k70R5j72J31M4K04k59J42k00
$$ -3 -77 -171 126 45 44 104 -117 -77 -27 -112 86 -344 3 10 -18 130 -140 -45 -217 -86 -42 162 -97 45 -155
4982a55k7J56K36j67Q5k2j72m5j6P1J57j63K40k63J07p5l2R9j42L57j51j4m1j3
$$ -155 -182 -26 210 43 128 106 -66 -111 -127 -56 101 -62 178 -85 22 -53 -85 14 -128 229 78 64 23 10
5006A0J00r5P7L4k12J67P6l19N7J40j94j80K54R4j90l6K35oR0k83K07J79o4j1
$$ 10 110 15 92 126 -86 81 157 -162 -105 35 -159 -339 -85 9 -181 -217 18 12 102 -181 26 205 141 130
5030A30k83K83Ll4j28J3K1K5q0K2j8j44M42q9k05Q0N6q9n2L6n9K42j74O1j10K61
$$ 130 -153 130 133 99 -29 -16 5 30 -50 -28 -46 -190 252 163 -42 38 94 5 -47 -11 -70 172 -2 59 -51 210
5056B10l66K7L0K01p7Q6k26M9j4K55m21J45M9J42j02J41pj37Oq8N5Q3Q3k92L59
$$ 210 -156 -129 -99 102 25 111 -115 -66 -80 175 -246 -101 -52 90 -12 129 122 -15 -9 -97 -42 41 124 -168 191
5081A91j03k16p9K82r3J29l06J62J27l97Q6Q8M38k40j5p0J9k4j51J43J4J27P5
$$ 191 88 -128 -207 75 -18 111 -195 -33 94 -303 -217 -129 309 69 54 -16 3 -21 -172 -29 -15 112 187
5104A87j4J4r3k16k0J48J43j25J13k84R8N2k0L56l13Q1l5O2j13j35J23J79k49
$$ 187 173 187 94 -122 -142 6 149 24 137 -147 -49 3 -17 339 26 107 72 134 21 -114 9 188 -61
5127f1J9j12Q5K78k17L6q6j02K56k03R1K45m6k52J74n5j42J14J41j67l00L56J51
$$ -61 -42 -154 -69 209 -8 28 -58 -160 96 -107 -16 229 183 -69 105 50 -92 22 163 -4 -304 52 203
5150B03m90J21J21q7N9R3J75k30k49L89P7k23J86q0r4QJ12J58l77R1P5k19P8Q4
$$ 203 -287 -166 -45 -132 -73 20 195 -35 -284 105 182 -41 145 65 -29 -21 91 249 -128 -37 38 -181 -103 -19
5174a9Q1o1k41K75j45J16r5O9L17l02j02k29K23J57L9K1j22P9j23M4J51l4k18
$$ -19 62 1 -240 35 -110 6 -89 -20 297 -5 -107 -336 -113 44 83 104 -18 61 -62 -18 133 99 -119
5197a19J45k07R5K56r0O8j83P6j61J13j66K68k23J57J29O3l66K34k14k0P4LN7
$$ -119 26 -181 -86 170 80 148 -35 41 -120 -7 -173 95 -128 29 158 221 -145 89 -125 -145 -71 -68 -11
5220a1j06j8K50o2N4j59j55K67j27K00k48K10L6n7L2M6p7j50J62j93J07P8K6o3
$$ -11 -117 -135 115 53 107 -52 -207 60 -67 133 -115 95 131 74 106 152 75 -75 87 -106 1 79 105 42
5244D2M8J44l87R1jK62j96j96J74j32K28L2j22J26k95RL15l8m7N4k25K19k43J65
$$ 42 90 234 -153 -62 -63 199 3 -193 -19 -151 77 109 -13 113 -182 -173 142 104 57 111 -114 105 -138 27
5268B7j54J55J6n5Q0J09j54j4j46K64j22j54K64l2Q1r0o0Q0L12l47L36m60M1J53
$$ 27 -127 28 44 -11 69 178 24 10 -136 128 6 -148 116 84 165 75 15 95 407 60 396 -64 -23 130
5292A30k12J08O7r3J19l0j72J11j84o9J77q4L42k87n9L45J37k75n7O7K0l90L32
$$ 130 -82 26 93 0 119 89 -83 28 -156 -225 -48 -132 210 -77 -136 209 346 71 14 81 101 -289 43
5315D3k75L09j12KK45l31L67k92J94Ko0j50J36r5j28L09k28J1K26l71J95N2j93
$$ 43 -232 77 -35 -33 212 -119 248 -44 150 152 92 -58 78 -17 -145 164 -64 -53 173 -198 -3 49 -144
5338a44R0Q1O7j22P9k55K12k11KK69l03K78m8J44j74j61K74k63J22Q2p1K66k18
$$ -144 -54 27 94 -28 51 -204 8 -203 -201 68 -235 43 -5 139 -35 -196 78 -185 -63 19 -52 214 -4
5361dN8j36K22k20K56j93J54j15l7Q4k84K26j67J46q8J76J84k91J06K5j35Q0q8
$$ -4 54 -82 140 -80 176 -17 137 22 -15 69 -215 11 -156 -10 -98 78 262 -29 77 102 -33 47 -41
5384d1K05k11J4l86N62j66j04K1j40K14K0L9j11j57M28k96K66q7k4j78J4J21J60
$$ -41 164 -47 -33 -419 143 -23 -127 -106 -246 -32 -12 27 -84 -241 187 -109 157 70 46 -132 -118 3 163
5407A63k53K46k28J65J72k43J08k14J0N1k2j27K60j49L09m35J41J64j18J04j45
$$ 163 -90 156 -72 93 265 22 130 -84 -74 -23 -45 -172 88 -61 248 -187 -46 118 0 104 -41
5428d1J93j09p0j89K24j84L12j26J3k23p9J72J22J81k13J18Rq6p8m1N9l0O4K4
$$ -41 152 43 -27 -216 8 -176 136 10 23 -200 -279 -107 15 196 -17 101 110 24 -54 -95 -36 -66 -2 22
5452B2O3L4J4j12Jnr0K43k58PnJ87l16L61Q2k58J72K0n7mk58Q2KJ00J31j46R2
$$ 22 85 119 133 21 22 17 -73 170 -88 -81 -86 101 -215 146 228 -30 142 162 105 101 -157 -75 -73 27 158 12 104
5479A04k9m9J22j68n2k75L55PK9j43J06l4M8N0M4j97j07Q4J14k55R3J94kJ1j80
$$ 104 75 26 148 -20 -72 -347 8 15 44 -99 7 -27 21 71 115 -82 -189 -105 9 -246 -153 41 39 50 -130
5504a30J6Q2J41l89N44k35K7J41l79J28M2M3j1j34J55l3j90M8P9r6J67J38j17
$$ -130 -114 -32 109 -280 264 29 56 197 -182 -54 -12 31 20 -114 41 8 -182 -134 -55 -151 16 154 37
5527C7k25J35M6L3K24l36j95L68k2o4Mo6L4K08k30J15j15r3L23l50L11m51K34
$$ 37 -188 -53 -7 26 250 -86 -281 87 65 1 5 -61 -27 181 -49 66 -49 -142 181 -169 142 -309 -75
5550g5M7j6q3K18j10q7%n1L29m62L95k65K09J69k08J8r6K37j44r8J72O1k68J77
$$ -75 -28 -44 -127 91 -19 -106 -106 -157 172 -290 105 -160 49 218 10 28 -68 169 25 -73 99 160 -108 69
5574F9l01K32M8N3j23J4J10K09k18k42L54m32K57m4J14J62k57k1k4J89j70j19
$$ 69 -232 0 48 101 -22 -8 102 311 93 -149 205 -227 30 -14 100 262 5 -16 -40 149 -21 -140
5596a40J3K59j48j9j69L09O6k12P0N8r1J03k85K89j45r4K01k47K38K7J28k58P5
$$ -140 -127 132 -16 -35 -204 105 171 -41 29 87 -4 99 -186 103 -42 -136 65 -182 56 83 211 -47 28
5619B8j3q4K55p6j41j51m4K26k1j59K62k74J63j15K18j47NL7R7k89J45J21J3m4
$$ 28 15 -69 186 110 -31 -182 -226 0 -21 -180 82 -192 -29 -144 74 -73 -68 -31 66 -223 -78 43 56 12
5643A2J23j70O3j62J55J00k34j97N25l05J7K99l15R8j01J83r9l56J65J64K02k40
$$ 12 135 -35 28 -134 21 121 -113 -310 215 -90 -73 226 -89 9 -92 91 -8 -364 -199 -35 167 -73
5665g3J12r5j27L15l56J34q2K38J25j2l8l21K99k64J32J37l61OK66p4K54l0j82
$$ -73 39 -56 -183 132 -224 -90 -172 66 191 179 141 -180 119 -145 -13 124 -237 -231 35 -39 215 185 3
5688Cq4J08j44J61P9j17J15k11l11K60L60j05q3J88k16K5J59k03K37k09p0P1k00
$$ 3 -81 27 -117 44 123 6 121 -90 -401 -141 219 114 31 219 3 28 187 -16 221 12 -58 13 -187
5711a87J08j05L81m0K1j05l21K91J76m8k36J95j69K39N4j76j5j78K12j41P7m2
$$ -187 -79 -184 197 157 178 73 -248 43 219 171 -65 130 -39 200 254 78 63 -115 97 -44 33 -9
5733iJ64j66j18J54MR7j05p7P8J58j96j8j18L53k79k8J44j71J15n6J95j42L30
$$ -9 155 -11 -129 25 29 126 21 -56 22 180 -16 -34 -152 201 -78 -106 38 -133 -18 -74 121 -21 309
5756C09n53J19J74J27k21K42j27l94K20J47lK0l9o1K87k69J44Qj93R0M4m2%J84
$$ 309 -244 -125 49 176 -45 197 70 -324 -104 43 40 60 21 -40 247 -22 122 130 -63 27 71 29 29 213
5780B13p7l98L28K43Lk87K0k23L25pk49M7J36k99K40r0R0K22l69J21PJ9J73m96
$$ 213 136 -262 66 309 312 25 45 -178 147 140 -109 -62 74 -225 15 -75 15 237 -132 -11 -4 15 188 -308
5804c08K87O4k79J76j08oJ98r0q4K13N1q5K7l11K13j63L44o4j8M02m23L5j98j12
$$ -308 -21 43 -236 -60 -168 -174 24 -66 -150 63 114 29 56 -255 -42 -205 139 75 57 459 36 71 -127 -239
5828b39K30O4k3Q8j8R6m60J16L1M6l6M24l31LJ39l32K95j83o2K00r7J09o9j5p9
$$ -239 -9 55 32 120 102 198 -262 -146 -115 -69 -105 319 -12 -9 130 -202 93 -90 -152 48 -49 60 -9 -24 -103
5853a03L68J7j97p9j73kK97k43N3K76q7P2j99K1P1p4j51N6M8P1j19q8K55p5j06
$$ -103 265 282 85 6 -167 -169 128 -115 -62 214 127 199 0 21 92 18 -133 -77 -29 42 -77 -165 90 15 -91
5878i1K97l14R9j8m1J03J6j12J65m2j70K67k59M11k72p6j01K2K68N0k53J77M6
$$ -91 206 -108 -9 -27 -68 35 51 -61 104 62 -108 159 -100 311 39 -37 -138 -116 152 202 -51 126 172
5901A72k93k7J08O1k76J98O3L2K15p4K2j03R6j52J88k24J97k64j35J31J59J47
$$ 172 -121 -148 -40 21 -255 -57 6 38 253 179 201 98 194 42 230 6 203 -61 -196 -65 94 241
5923B41j93O8k33K19j07J92j47j2M9j26J98j94kK65l90k1J84J0K38k87k87L61
$$ 241 48 116 -117 102 -5 187 40 28 77 -49 149 -45 -47 218 -172 -193 -9 1 239 -48 -335 26
5945B6J00k05k93L20k2K4K99k60P8J49q1r3J05j97r2J06J27Nk97J91J64M2j96
$$ 26 126 -79 -372 -52 -74 -50 249 -11 67 216 135 42 147 -50 -142 -36 91 96 -201 -10 154 196 0
5968@K06k38k32J23J30R7L2k15J33l9j47J49J11j62j19l2L10j22l2J20j2j34Q9
$$ 0 206 -32 -264 -141 -11 86 118 -97 36 -3 -150 -1 110 -52 -171 -203 107 -15 -47 73 61 -73 16
5991A6K38m33J80j49j32K69J37m3K2j80L4k5J55N3J30n9Q5k17J20p9K4j05n7p4
$$ 16 254 -179 1 -148 -280 -11 126 83 105 -75 -41 -66 89 142 272 213 298 81 201 122 146 41 -16 -90
6015i0K89j57l00K10n8P9J2Q9j48j20J81j90M26k01o8K14k59K24j61J6k1k23L42
$$ -90 199 42 -258 -48 -106 -27 -15 74 -74 -194 -13 -203 223 22 -46 168 -91 133 -28 -12 -33 -256 86
6038H6k32o6L60J6j73N3j30J03l0R7Kj26l18K35Q3J19j46j07L48k17J60k43J38
$$ 86 -146 -212 148 164 -9 44 -86 17 -13 84 86 -40 -358 -123 -40 79 -67 -174 174 -43 117 -126 12
6061A2o2Q0N3r0J10l04K56j77K19J79k38K27n89M37L6k42J39n0M7m5j49K07m7
$$ 12 -50 30 83 -7 103 -201 55 -122 97 276 38 265 -324 113 149 -93 46 -4 43 -2 -151 56 9
$$ [...]
8191A83
##END NTUPLES=NMR FID
##END=
