##TITLE=1H_SR19_K
 CDCl3, 8 sc, 
 30.10.2020
##JCAMPDX= 6.0         $$ Bruker NMR JCAMP-DX V2.0
##DATA TYPE= NMR FID
##DATA CLASS= NTUPLES
##ORIGIN= UXNMR, Bruker Analytische Messtechnik GmbH
##OWNER= root
$$ XWIN-NMR		Version 3.5
$$ Fri Oct 30 12:38:16 2020 Russian Standard Time (UT+4h)  she@DPX200
##.OBSERVE FREQUENCY= 200.1315066352
##.OBSERVE NUCLEUS= ^1H
##.DELAY= (6, 6)
##.ACQUISITION MODE= SIMULTANEOUS
##.ACQUISITION SCHEME= undefined
##.AVERAGES= 8
##.DIGITISER RES= 18
##SPECTROMETER/DATA SYSTEM= spect
##.PULSE SEQUENCE= zg30
##.SOLVENT NAME= CDCl3
##.SHIFT REFERENCE= (INTERNAL, CDCl3, 0, 15.7039)
##AUDIT TRAIL= $$ (NUMBER, WHEN, WHO, WHERE, WHAT)
$$ ##TITLE= Audit trail, XWIN-NMR		Version 3.5
$$ ##JCAMPDX= 5.01
$$ ##ORIGIN= Bruker BioSpin GmbH
$$ ##OWNER= she
$$ F:/spectra/data/she/nmr/H-F/1/audita.txt
$$ ##AUDIT TRAIL=  $$ (NUMBER, WHEN, WHO, WHERE, WHAT)
(   1,<2020-10-30 12:37:26.89 +0400>,<she>,<DPX200>,
      <created by zg, POWCHK disabled, PULCHK disabled
       configuration hash MD5:
       00 E9 B6 7A A2 85 ED C7 34 08 36 98 17 FE 4E 26
       data hash MD5: 16K
       18 54 1D 8E 05 62 D7 09 62 09 1B 35 74 E2 FA 87>)
$$ ##END=
$$ 
$$ hash MD5
$$ 6D FA C6 84 3D B6 4C 8A 64 8C 8C 90 F9 16 D7 B9
##$RELAX= 
##$RELAX= 
##$RELAX= 
##$RELAX= 
##$RELAX= 
##$RELAX= 
$$ Bruker specific parameters
$$ --------------------------
##$DU= <F:/spectra>
##$EXPNO= 1
##$NAME= <H-F>
##$PROCNO= 1
##$TYPE= <nmr>
##$USER= <she>
##$AMP= (0..31)
100 100 100 100 100 100 100 100 100 100 100 100 100 100 100 100 100 100 
100 100 100 100 100 100 100 100 100 100 100 100 100 100 
##$AQSEQ= 0
##$AQ_mod= 1
##$AUNM= <au_zg>
##$AUTOPOS= <>
##$BF1= 200.13
##$BF2= 200.13
##$BF3= 200.13
##$BF4= 200.13
##$BF5= 200.13
##$BF6= 200.13
##$BF7= 200.13
##$BF8= 200.13
##$BYTORDA= 1
##$CFDGTYP= 0
##$CFRGTYP= 5
##$CHEMSTR= <none>
##$CNST= (0..31)
1 1 145 1 1 1 1 1 1 1 1 1 1 1 1 1 1 1 1 1 1 1 1 1 1 1 1 1 1 1 1 1 
##$CPDPRG= <>
##$CPDPRG1= <>
##$CPDPRG2= <>
##$CPDPRG3= <>
##$CPDPRG4= <mlev>
##$CPDPRG5= <mlev>
##$CPDPRG6= <mlev>
##$CPDPRG7= <mlev>
##$CPDPRG8= <mlev>
##$CPDPRGB= <>
##$CPDPRGT= <>
##$D= (0..31)
0 1.2 0 0 0 0 0 0 0 0.06 0 0.03 0 0 0 0 0.0002 0 0 0 0 0 0 0 0 0 0 0 0 
0 0 0 
##$DATE= 1604047046
##$DBL= (0..7)
120 120 120 120 120 120 120 120 
##$DBP= (0..7)
150 150 150 150 150 150 150 150 
##$DBP07= 0
##$DBPNAM0= <>
##$DBPNAM1= <>
##$DBPNAM2= <>
##$DBPNAM3= <>
##$DBPNAM4= <>
##$DBPNAM5= <>
##$DBPNAM6= <>
##$DBPNAM7= <>
##$DBPOAL= (0..7)
0.5 0.5 0.5 0.5 0.5 0.5 0.5 0.5 
##$DBPOFFS= (0..7)
0 0 0 0 0 0 0 0 
##$DE= 6
##$DECBNUC= <off>
##$DECIM= 32
##$DECNUC= <off>
##$DECSTAT= 4
##$DIGMOD= 1
##$DIGTYP= 9
##$DL= (0..7)
0 120 120 120 120 120 120 120 
##$DP= (0..7)
150 150 150 150 150 150 150 150 
##$DP07= 0
##$DPNAME0= <>
##$DPNAME1= <>
##$DPNAME2= <>
##$DPNAME3= <>
##$DPNAME4= <>
##$DPNAME5= <>
##$DPNAME6= <>
##$DPNAME7= <>
##$DPOAL= (0..7)
0.5 0.5 0.5 0.5 0.5 0.5 0.5 0.5 
##$DPOFFS= (0..7)
0 0 0 0 0 0 0 0 
##$DQDMODE= 0
##$DR= 18
##$DS= 0
##$DSLIST= <SSSSSSSSSSSSSSS>
$$ [...]
##$SUBNAM2= <"">
##$SUBNAM3= <"">
##$SUBNAM4= <"">
##$SUBNAM5= <"">
##$SUBNAM6= <"">
##$SUBNAM7= <"">
##$SUBNAM8= <"">
##$SUBNAM9= <"">
##$SW= 16.9725356469052
##$SWIBOX= (0..15)
0 0 2 0 0 0 0 0 0 0 0 0 0 0 0 0 
##$SW_h= 3396.73913043478
##$TD= 16384
##$TD0= 1
##$TE= 0
##$TE2= 300
##$TE3= 300
##$TEG= 300
##$TL= (0..7)
0 120 120 120 120 120 120 120 
##$TP= (0..7)
150 150 150 150 150 150 150 150 
##$TP07= 0
##$TPNAME0= <>
##$TPNAME1= <>
##$TPNAME2= <>
##$TPNAME3= <>
##$TPNAME4= <>
##$TPNAME5= <>
##$TPNAME6= <>
##$TPNAME7= <>
##$TPOAL= (0..7)
0.5 0.5 0.5 0.5 0.5 0.5 0.5 0.5 
##$TPOFFS= (0..7)
0 0 0 0 0 0 0 0 
##$TUNHIN= 0
##$TUNHOUT= 0
##$TUNXOUT= 0
##$USERA1= <user>
##$USERA2= <user>
##$USERA3= <user>
##$USERA4= <user>
##$USERA5= <user>
##$V9= 5
##$VALIST= <valist>
##$VCLIST= <CCCCCCCCCCCCCCC>
##$VD= 0
##$VDLIST= <DDDDDDDDDDDDDDD>
##$VPLIST= <PPPPPPPPPPPPPPP>
##$VTLIST= <TTTTTTTTTTTTTTT>
##$WBST= 1024
##$WBSW= 4
##$XGAIN= (0..3)
0 0 0 0 
##$XL= 0
##$YL= 0
##$YMAX_a= 50356
##$YMIN_a= -41029
##$ZGOPTNS= <>
##$ZL1= 120
##$ZL2= 120
##$ZL3= 120
##$ZL4= 120
##$ABSF1= 10
##$ABSF2= 0
##$ABSG= 5
##$ABSL= 3
##$ALPHA= 0
##$AQORDER= 0
##$ASSFAC= 0
##$ASSFACI= 0
##$ASSFACX= 0
##$ASSWID= 0
##$AUNMP= <proc_1d>
##$AZFE= 0.1
##$AZFW= 0.1
##$BCFW= 1
##$BC_mod= 2
##$BYTORDP= 1
##$COROFFS= 0
##$CY= 11.3945322036743
##$DATMOD= 1
##$DC= 2
##$DFILT= <>
##$DTYPP= 0
##$F1P= 15.9154993809931
##$F2P= -4.1035820241983
##$FCOR= 0.5
##$FTSIZE= 0
##$FT_mod= 4
##$GAMMA= 1
##$GB= 0.15
##$INTBC= 1
##$INTSCL= 1
##$ISEN= 128
##$LB= 0.24
##$LEV0= 0
##$LPBIN= 0
##$MAXI= 10000
##$MC2= 0
##$MEAN= 0
##$ME_mod= 0
##$MI= 1.114404
##$NCOEF= 0
##$NC_proc= 0
##$NLEV= 6
##$NOISF1= 3.799351
##$NOISF2= 2.8
##$NSP= 1
##$NTH_PI= 0
##$NZP= 0
##$OFFSET= 15.70392
##$PC= 1
##$PHC0= -11050.66
##$PHC1= 15.40088
##$PH_mod= 1
##$PKNL= yes
##$PPARMOD= 0
##$PSCAL= 0
##$PSIGN= 0
##$REVERSE= no
##$SF= 200.130013532006
##$SI= 16384
##$SIGF1= 3
##$SIGF2= 2
##$SINO= 400
##$SIOLD= 16384
##$SREGLST= <1H.CDCl3>
##$SSB= 0
##$STSI= 0
##$STSR= 0
##$SW_p= 3612.71676300578
##$SYMM= 0
##$S_DEV= 0
##$TDeff= 0
##$TDoff= 0
##$TI= <>
##$TILT= no
##$TM1= 0
##$TM2= 0
##$TOPLEV= 0
##$USERP1= <user>
##$USERP2= <user>
##$USERP3= <user>
##$USERP4= <user>
##$USERP5= <user>
##$WDW= 1
##$XDIM= 8192
##$YMAX_p= 0
##$YMIN_p= 0
$$ End of Bruker specific parameters
$$ ---------------------------------
##NTUPLES= NMR FID
##VAR_NAME=  TIME,          FID/REAL,        FID/IMAG
##SYMBOL=    X,             R,               I
##VAR_TYPE=  INDEPENDENT,   DEPENDENT,       DEPENDENT
##VAR_FORM=  AFFN,          ASDF,            ASDF
##VAR_DIM=   8192,          8192,            8192
##UNITS=     SECONDS,       ARBITRARY UNITS, ARBITRARY UNITS
##FACTOR=    0.0002944,     1,               1
##FIRST=     0,             0,               0
##LAST=      2.4114304,     0,               0
##MIN=       0,             -41029,          0
##MAX=       2.4114304,     50356,           0
$$ Real data points
##PAGE= N=1
##DATA TABLE= (X++(R..R)), XYDATA
$$ [...]
1785a93J95j28O4j94J97k28K14l57N2M7J93k38L0P7J17M04j90l24J61k50J71M9
$$ -193 2 -126 -62 -256 -59 -287 -73 -430 -378 -331 -138 -376 -346 -269 -152 252 62 -262 -101 -351 -180 -131
1807a31L1p6J45k31K72J0k8j77l4J18K93j36m8K81J04k73L0k7j28L11l72K69r5
$$ -131 -100 -176 -31 -262 10 20 -8 -185 -219 -101 192 56 8 289 393 120 150 123 -5 306 -66 203 108
1830A08J16r2pM4J27J12m95J85P2l6M9Q0r0j24L41k48J64k38J10j82J23P9l4J09
$$ 108 224 132 125 169 296 408 -87 98 170 134 183 263 173 49 390 142 306 68 178 -4 119 198 164 273
1854B73l47k57L69o9k35m4k8J59o6k76K80P1j11k6pL54p3j42J92n25O38k67J21
$$ 273 -74 -331 38 -31 -266 -310 -338 -179 -245 -521 -241 -170 -281 -307 -314 40 -33 -175 17 -508 130 -137 -16
1877a6o1j33k9J97j94J44m5k42L15n2m5L1M74j86J58k22O9k6j22K05j82L66k47
$$ -16 -77 -210 -239 -42 -236 -92 -137 -379 -64 -116 -161 -130 344 158 316 94 163 137 15 220 38 404 157
1900A57r5J02O3J44k63Q5K5j13J0R4j4q3J93k02qj00K66O0n2k6k1Pk59j84K85
$$ 157 62 164 227 371 108 193 218 105 115 209 195 112 305 103 95 -5 261 321 269 243 222 229 -30 -214 71
1925G1k91M03k23j06K52k85k1J04J1j31J59O8j89j66K78k13J89k38L48l3m45K82
$$ 71 -220 183 -40 -146 106 -179 -200 -96 -85 -216 -57 11 -178 -344 -66 -279 -90 -328 20 -13 -458 -176
1947a76k39K43K09L8k48J11l0k05J09Q2n0L8k4K06j08q5J76K77k05k54K01R2K1
$$ -176 -415 -172 37 75 -173 -62 -92 -297 -188 -106 -156 -118 -142 64 -44 -129 47 324 119 -135 66 158 179
1970A79o1l6j99M68N7k87K73j49k24Pj17L32m0J6P1L2J20j01k91J02R5%k89K08
$$ 179 118 82 -117 351 408 121 394 245 21 28 -89 243 203 219 290 322 442 341 50 152 247 247 -42 166
1994A66j28K69k2l27P6OK5J9j38J72k05K15p6N8k37j66j4K79j3n0j5J78j47k30
$$ 166 38 307 285 -42 34 40 65 84 -54 118 -87 128 52 110 -127 -293 -307 -28 -41 -91 -106 72 -75 -305
2018c05J35J14k25J13N8j07P1Q6o7k40J57J86n6j44K87l66K90j0J60O9n63M40
$$ -305 -170 -56 -281 -168 -110 -217 -146 -60 -127 -367 -210 -24 -80 -224 63 -303 -13 -23 137 206 -357 83
2040H3j8J27p9n2J10j28n9K48k26J13K08k61O7o6j37L00j20j13J97p3j75N6L57
$$ 83 65 192 113 61 171 43 -16 232 6 119 327 66 133 67 -70 230 110 -3 194 121 -54 2 359
2063C59k94P7P4j90K2O9J54m55K60k2j44L8j03K60L1o0l14L34p7k51J05m8p0J43
$$ 359 65 142 216 26 48 117 271 -184 76 54 -90 -52 -155 105 136 76 -238 96 19 -232 -127 -175 -245 -102
2087a02j04n4J14P1k97J27j30J58LO0j84M30j50O5k17K42j73o6R9K5j05o0J59
$$ -102 -206 -260 -146 -75 -372 -245 -375 -217 -214 -154 -338 92 -58 7 -210 32 -141 -207 -108 -83 -188 -248 -89
2110h9j7n9Q2Q8j39J20j31J95N6p6J62Oq6J72l39K00O7j33N1R5m2J49m42K57J17
$$ -89 -106 -165 -83 5 -134 -14 -145 50 106 30 192 198 112 284 -55 145 212 79 130 225 183 332 -110 147 264
2135B64p5J79k29j4J78j35K5q9M1J00k96K93k09j69K67j85j0J45j89r7J40k86
$$ 264 189 368 139 125 303 168 193 104 145 245 -51 242 33 -136 131 -54 -64 81 -108 -205 -65 -351
2157c51K27m4J87j24k52K37j46J37l2P0j13m5J57J55k08j30R5o2Pn0J52j43OJ58
$$ -351 -124 -168 19 -105 -357 -120 -266 -129 -161 -91 -204 -249 -92 63 -145 -275 -180 -242 -235 -285 -133 -276 -270 -112
2181a12mn6L5R4j70L24M9l45J9J70J50L6q2j66J60q2J34J75j7m16K01K16l2j72
$$ -112 -116 -172 -137 -43 -213 111 160 -185 -166 4 154 190 108 -58 102 20 154 329 312 -104 97 313 281 109
2205A09J1J90k38K2J83j32Q0l3O7p8R1j52J71j45J99j35p0j15R2%O4J71n63L24
$$ 109 120 310 72 94 277 145 225 192 259 181 272 120 291 146 345 210 140 25 117 117 181 352 -211 113
2229A13l27K34q1l15J13n5l9K47k59K50n3l3J70r8j13J11O8j04Q1r0J67j41j60
$$ 113 -214 20 -61 -376 -263 -318 -357 -110 -369 -119 -172 -205 -35 -133 -246 -135 -67 -171 -90 -180 -13 -154 -314
2252c14P1Q3j15J62r5M6o7p5M23j26R7r6J7J04j64J38l3j29NK60q2J02j02r7J30
$$ -314 -243 -160 -275 -113 -208 -162 -229 -304 119 -7 90 -6 11 115 -49 89 56 -73 -68 192 110 212 110 13 143
2277A43p4J36qr6J6j13J38J75k06L3o9o1M7j45M51l87K02q6kK23l10J00P5j89
$$ 143 69 205 197 101 117 4 142 317 111 144 75 14 61 -84 367 -20 182 96 94 317 7 107 182 -7
2301gP7k42L54l83L25l67J44K40l53J59n6L6L8j64k08L49l80J96R0J23k48J88
$$ -7 70 -172 182 -201 124 -243 -99 141 -212 -53 -109 -73 -35 -199 -407 -58 -438 -242 -152 -29 -277 -89
2323h9k11J39k61R0J57K32O4p8J0p4j40J03J30q3K55m39L50Q3l28K8N4J31j14
$$ -89 -300 -161 -422 -332 -175 57 121 43 53 -21 -161 -58 72 -11 244 -195 155 238 -90 -62 -8 123 9
2346IL23l07O3J8K63j30j41K05l36J84N2k6mj3K13Jl24J42J70p3k26K38l57J53
$$ 9 332 25 88 106 369 239 98 303 -33 151 203 177 173 160 373 374 50 192 362 289 63 301 -56 97
2370I7n0Mj25j28J72P4l4k07q5K55J60l20J51j13J0L6p9L5j68J29J62J8k71K77
$$ 97 47 51 -74 -202 -30 44 10 -197 -282 -27 133 -187 -36 -149 -139 -103 -182 -147 -315 -186 -24 -6 -277 0
2394@k83R4m3K93j79j96J82Qr9J8n5K17N8k41J64o2J81k40J84k7J33n2J16n4R3
$$ 0 -283 -189 -232 61 -118 -314 -132 -124 -223 -205 -260 -43 15 -226 -62 -124 57 -183 1 -26 107 55 171 117 210
2419B10m9l8o8q7j6j33K52J2J90j58l7r5J16j94j5J92N5J72k81K89k39J1O3P0
$$ 210 161 123 55 -32 -48 -181 71 83 273 115 78 -17 99 -95 -110 82 137 309 28 317 78 89 152 222
2443B22kq2q8J46k46J0L55k75jp3P7j56k44M82k60P5J2K36k48J8j11Q7qk7L9n8
$$ 222 220 138 50 196 -50 -40 315 40 39 -34 43 -113 -357 125 -135 -60 -48 188 -60 -42 -153 -66 -74 -101 -62 -120
2469a20J15j33L9O3J9j05j7j04J90Kp6K25j01O8r3M9p5j37K29K0j83J06P8L1j00
$$ -120 -5 -138 -99 -36 -17 -122 -139 -243 -53 -51 -127 98 -3 65 -28 21 -54 -191 38 58 -125 -19 59 90 -10
2494a0K18n1M9j63j8R0pJ0k9L49l62j75L16j1r0p1M03k33N4p4N2q3j03J33j6p1
$$ -10 208 157 206 43 25 115 108 118 89 438 76 -99 217 206 116 45 448 215 269 195 247 164 61 194 178 107
2520A07j10L17l06J0J52O1q6l86L42k17M0oK9j53K52O3k91n3K76j80K11L8l78
$$ 107 -3 314 8 18 170 231 145 -241 101 -116 -76 -82 -53 -206 46 109 -182 -235 41 -139 72 110 -268
2543b68J2k05M14k82L50o9k79J44M90n89j01K66J75l28O8J56l4J72K4k13k47L73
$$ -268 -256 -461 -47 -329 21 -48 -327 -183 307 -282 -383 -117 58 -270 -202 -46 -80 92 116 -97 -344 29
2565B9J4p3L0O8k63L78j26Q3L5K9r7J85q6j97j64L03j92K29j84J68k0j50K55p9
$$ 29 43 -30 0 68 -195 183 57 140 175 204 107 292 206 9 -155 148 -44 185 1 169 149 -1 254 175
2589A75M1j43j9L7O8o9n0J12j23J7K1j52P2j47O0K29j46p1N8k43Q0J34JO3O0m3
$$ 175 216 73 54 91 159 90 40 152 29 46 67 -85 -13 -160 -100 129 -17 -88 -30 -273 -193 -59 -58 5 65 22
2615B2k93L98p2k54p9J50k93N54j90k11J88J1j38J4Q9j16R8n1K63j01J60J81m92
$$ 22 -271 127 55 -199 -278 -128 -421 133 -57 -268 -80 -69 -207 -193 -104 -220 -122 -173 90 -11 149 330 -162
2638a62J98j17MN5Q3M7P7p2no2J2n7M9L9o9K1K26j48L4Qk80M4K76k46L62j05P4
$$ -162 36 -81 -77 -22 61 108 185 113 108 46 58 1 50 89 20 41 267 119 153 161 -119 -75 201 -45 317 212 286
2665B86l10J99p0j67P8j78L71j95Q0q0L09l35P2N1K3j6j60N8k29K24k54K48k41
$$ 286 -24 175 105 -62 16 -162 209 14 94 14 323 -12 60 111 134 118 -42 16 -213 11 -243 5 -236
2688b36Jj58K07J16r8j06K84k57K12j74J62j45K09r0j85J40P4K4J15J30k96Q9
$$ -236 -235 -393 -186 -70 -168 -274 10 -247 -35 -209 -47 -192 17 -73 -258 -118 -44 -20 95 225 -71 18
2710A8l8K8j85K59l9Lk3Nj26j14J31K96j43O0r6J83j61J42K9j58j48O3L25l60
$$ 18 -20 8 -177 82 43 46 23 28 -98 -212 -81 215 72 132 36 219 58 200 229 71 -77 -14 311 -49
2734d9J18r2J39mM2J49l08J9mP1k4k46L22j42P0j96j6K22k84K24P2p7k05K18l17
$$ -49 69 -23 116 112 154 303 -5 14 10 81 57 -189 133 -9 61 -135 -151 71 -213 11 83 6 -199 19 -298
2759b98M42k69K75r2m2P5o5j33k87L25L3J05k50j5pJ40R2k82O2j4J51r9Q2j9O3
$$ -298 144 -125 150 58 16 91 26 -107 -394 -69 -36 69 -181 -196 -203 -63 29 -253 -191 -205 -54 -153 -71 -90 -27
2784b7M1Jjk70O8L43l42Q1L4M5j35O6n0J31J06Q7ol03K06k3K31o1j93R8K55o8
$$ -27 14 15 14 -256 -188 155 -187 -106 -72 -27 -162 -96 -146 -15 91 178 172 -131 75 52 283 222 29 127 382 314
2810C14j81K77l38p3M3j23n8N12j33l83J78J35l84J06L36k43K3j30J83J52j09
$$ 314 133 410 72 -1 42 -81 -139 373 240 -143 35 170 -214 -108 228 -15 8 -122 61 213 104
2831A04j05J01r1m6J65k24j14O2K7J2k20J38QJ50j18O6m6R6J89m74K32K5n3j38
$$ 104 -1 100 9 -37 128 -96 -210 -148 -121 -109 -329 -191 -183 -33 -151 -85 -131 -35 154 -320 -88 -63 -116 -254
2855b54K48k3l0J19j30J02oK25j69p7Q8o8j19k0P7J45o7K04n02L63j12l1J17J37
$$ -254 -6 -29 -59 60 -70 32 26 251 82 5 93 25 -94 -114 -37 108 41 245 -257 106 -6 -37 80 217
2879B17k66j18L82M5n5j75K64j64m24L32o3K22j26L2KQm3j53L52n8k2k66J61M6
$$ 217 -49 -167 215 260 205 30 294 130 -294 38 -25 197 71 103 105 113 70 -83 269 211 189 -77 84 130
2903A30J7j65K02j30j44L4j04J7k3R7j43K1J2J37l7k72P0kL14nj52J87j87J05
$$ 130 147 -18 184 54 -90 -56 -160 -143 -166 -69 -212 -191 -179 -42 -79 -351 -281 -283 31 26 -126 61 -126 -21
2927b1j39L14l69nj27K46J86l42K20k17J59Q6m9J01J36l65K21J6J31j58r1M7o9
$$ -21 -160 154 -215 -220 -347 -101 85 -257 -37 -254 -95 -9 -58 43 179 -186 35 51 182 24 -67 -20 -89
2950h9K35m25M90K0n1j85K12k36J5N2q0J91L4M1M8j73m1p6Q3J50k13p1P0J51j43
$$ -89 146 -279 211 231 180 -5 207 -29 -14 38 -42 149 183 224 272 99 58 -18 65 215 2 -69 1 152 9
2975IK4M3k42J36j70J6K55o5J60m35L70k07j7K39l32J27m1J98k26K45m50L47j13
$$ 9 33 76 -166 -30 -200 -184 71 6 166 -269 101 -106 -123 116 -216 -89 -130 68 -158 87 -363 -16 -129
2998a29J01P2n8j9n8OM4J23r3J14j83J06J21j4l90L21j85J32m2l50N47m3q8o1
$$ -129 -28 44 -14 -33 -91 -85 -41 82 -11 103 -80 26 147 133 -257 64 -121 11 -31 -381 166 123 35 -26
3022b6L0J69M7j07m3K31L3k15O1k87L8K64l24J84Q9k72L16jk06J5J23o5R1j6l60
$$ -26 4 173 220 113 70 301 334 119 180 -107 -69 195 -129 55 144 -128 188 187 -19 -4 119 54 145 129 -231
3047b31L99q6K85n14N2J45j15k53L73j73L6Q7R9j84J75j0j71j88K45r1P2j4l32
$$ -231 168 82 367 -147 -95 50 -65 -318 55 -118 -82 5 104 -80 95 85 -86 -274 -29 -120 -48 -62 -394
3070c94M06j49J86j56J39j17J7Q9p0l0p8O6n2J09j10K81m7k19J36J93J24k56j4
$$ -394 12 -137 49 -107 32 -85 -68 21 -49 -79 -157 -91 -143 -34 -144 137 90 -129 7 200 324 68 54
3093E4j65L54j25j32j82M72l80K27r6J69M6lm0k09J63l7j41J31r9K15j22o2J02
$$ 54 -111 243 118 -14 -196 276 -104 123 27 196 242 239 199 -10 153 116 -25 106 7 222 100 38 140
3116A40pq1L14k27q8j00K33j46J72J0M2j67j37l0J64J09l96J31J14j72J39j5n3
$$ 140 133 52 366 139 51 -49 184 38 210 220 262 95 -42 -72 92 201 -195 -64 50 -122 17 2 -51
3139e1R2j13n8q6L4J00J81k3l5j01j27J66j77j6K61k4l35K03k6R2n7J89Q9j77
$$ -51 41 -72 -130 -216 -182 -82 99 76 41 -60 -187 -21 -198 -214 47 23 -312 -109 -135 -43 -100 89 178 1
3163Aj1l4J48J9%j20rm5J72L1k52J54j18J74j44j55M3J27N9o2K79m59J33K55L8
$$ 1 -10 -44 104 123 123 3 -6 -51 121 152 -100 54 -64 110 -34 -189 -146 -19 40 -22 257 -202 -69 186 224
3188B24Q7k48J53j64l2J74Q8k88j38L12O4M2N7k84q6Q5Q5k84q1L25r0j93J21P7
$$ 224 311 63 216 52 20 194 282 -6 -144 168 232 274 331 47 -39 46 131 -153 -234 91 1 -192 -71 6
3212FR2L9j81K74m27L33k05J0J16l07J47L1J28j43K07k69K71R7j26k74J06m0p
$$ 6 98 137 -44 230 -197 136 -69 -59 57 -250 -103 -72 56 -87 120 -149 122 219 93 -181 -75 -115 -122
3235a22n2J2J39j66N47l87J23o7j40J81j77o5r6K37J59L3j06j64j0J86K48l63
$$ -122 -174 -162 -23 -189 358 -29 94 27 -113 68 -109 -174 -270 -33 126 159 53 -111 -121 65 313 -50
3257e0N4J%J72l08O6K26j35J6M7L96l18k66Q9J22J1k9K66n09q0L75m47M27k6k10
$$ -50 4 5 5 177 -131 -65 161 26 42 89 485 167 -99 -10 112 123 94 360 -149 -229 146 -301 126 100 -110
3282a10M2%Q4j16M18l82m1J01J76j69l4k23N2J35j63K47L6q1K0M4j27j55r6K25
$$ -110 -68 -68 16 -100 318 -64 -105 -4 172 3 -31 -254 -202 -67 -230 17 53 -28 -8 36 -91 -246 -342 -117
3306a17R5p5K52k94P1oJ32o0K2L2R4j87L0J30l16L42j98K57k81OJ64m3k07J13
$$ -117 -22 -97 155 -139 -68 -74 58 -2 20 52 146 -41 -11 119 -197 145 -53 204 -77 -71 93 50 -157 -44
3330d4K02L0m46K18L15k74P5N9J09Q9n4l04J78k56n2J82L1J0P0r6p1O1J11q2M7
$$ -44 158 188 -258 -40 275 1 76 135 244 333 279 -25 153 -103 -155 27 58 68 138 42 -29 32 143 61 108
3355A08j44j23J66l1Q7k7j96K90l95K80M7Q5j2j70J3J6J57k67J97O8j57o1j52
$$ 108 -36 -159 7 -24 63 36 -160 130 -265 15 62 147 135 -35 -22 -6 151 -116 81 149 -8 -69 -221
3378b21J71j91J6j28R3L47k73J03L7m3K6Lm4k77K87J52k90J82k1J5J24k06J20
$$ -221 -50 -241 -225 -353 -260 87 -186 -83 -46 -89 -63 -60 -104 -381 -94 58 -232 -50 -71 -56 68 -138 -18
3401a8N5k84K37L38m74J32pK74q9J2L7K9l6R1k06j0K83m3k59l3l4J14O6k74J78
$$ -18 37 -247 -10 328 -146 -14 -21 253 164 176 213 242 206 297 91 81 364 321 62 29 -5 109 175 -99 79
3426G9J9k46J09k01K39j15L6J50j41p5M7J79Q1k94L0j40M40k53K4J57k82L5J46
$$ 79 98 -148 -39 -240 -1 -116 -80 70 -71 -146 -99 80 161 -133 -103 -243 197 -56 -32 125 -157 -122 24
3449B4j54J08P5k20p5K85%p9O8J6O5j36j19M20m74K18M1j7j7J02j26J20K06m43
$$ 24 -130 -22 53 -167 -242 43 43 -36 32 48 113 -23 -142 278 -196 22 63 46 29 131 5 125 331 -112
3473a12J49l5J35J13j39m5m1Mq5K37Q4p6L2k3j44K9J56k4k45r9J36lJ68j71J10
$$ -112 37 2 137 250 111 66 25 29 -56 181 265 189 221 198 54 83 239 215 -30 -129 7 4 172 1 111
3498A11j67L34k59k50L48P1j99L32m53J86J22j40J08j50j1J14k45K19j65j7J61
$$ 111 -56 278 19 -231 117 188 -11 321 -132 54 176 36 144 -6 -17 97 -148 71 -94 -111 50
3519E0j60J1o6N7N7LJ77j95K22j68k80J13L4R9j86J60J61o6p6p8N5j3L4J13%j87
$$ 50 -110 -99 -165 -108 -51 -48 129 -66 156 -12 -292 -179 -145 -46 -232 -72 89 23 -53 -131 -76 -89 -55 58 58 -129
3545a29J40p4J87j87J15k0K63k6j13r1Qj67j40K49n2K89l96J87K1K00k18J3M2
$$ -129 11 -63 124 -63 52 32 295 269 156 65 73 -94 -234 15 -37 252 -144 43 64 264 46 59 101
3568A01r5K82l74M63k10k33j68K08P2r1Q0j16N8j2J22lJ03N8j68k23K96n0j26
$$ 101 6 288 -86 377 167 -66 -234 -26 46 -45 35 -81 -23 -35 87 84 187 245 77 -146 150 100 -26
3591b6L4K8j24j85J95L56l56p7J24J52k27M8q1K23j26J61j33o1Q1k63K12r5jJ15
$$ -26 8 36 -88 -273 -78 278 -78 -155 -31 121 -106 -58 -139 84 -42 119 -14 -75 6 -257 -45 -140 -141 -26
3615b6k76L85o1J57k66Q4r5K7K68k36K0Q7J24l03N05k87m2J65k48N5J00j97j22
$$ -26 -302 83 22 179 -87 -3 -98 -71 197 -39 -19 68 192 -111 394 107 65 230 -18 37 137 -60 -182
3638a82M10j22J35J21k88j02M5k51L58j37L2O4J66j23l09L74j73N1n2p8q4m3N8
$$ -182 228 106 241 362 74 -28 17 -234 124 -13 19 83 249 126 -183 191 18 69 17 -61 -145 -188 -130
3661a30K85k92J42rQ3k25J43p6J54J60j03J7L69n01J21q3J85k51L36k41l23L56
$$ -130 155 -137 5 -4 79 -146 -3 -79 75 235 132 149 518 17 138 55 240 -11 325 84 -239 117
3683A17j55J40j13j47J60l3o1Nj71lP1K10J75J15m39K33k13J12K1r1J35k56L60
$$ 117 -38 102 -11 -158 2 -31 -92 -87 -258 -261 -190 20 195 310 -129 104 -109 3 24 -67 68 -188 172
3706A72lkj27J00j60p7P7J25n7J05q2M2K1j73J8P8m5J16j28M16n56L24k90L0O8
$$ 172 169 167 40 140 -20 -97 -20 105 48 153 71 113 134 -39 -21 57 12 128 0 416 -140 184 -106 -76 -8
3731hj88K49l1J02J79k39j33o1M6L08l54J85j40nn0J38k12L10j46J89m2l19K72
$$ -8 -196 53 22 124 303 64 -69 -130 -84 224 -130 55 -85 -90 -140 -2 -214 96 -50 139 97 -222 50
3754E0l8j39P1J24p3q2J08j77K32j79r6L21l14J2J77L0j24m6K05k01O8M1K25j99
$$ 50 12 -127 -56 68 -5 -87 21 -156 76 -103 -199 122 -192 -180 -3 27 -97 -143 62 -139 -71 -30 195 -4
3778dL03l26p7n2M04k48O4Qj04Q3K61O1m42O0o2K6j53M10j01J9J19o7j25j45J41
$$ -4 299 -27 -104 -156 248 0 64 72 -32 51 312 373 -69 -9 -71 -45 -198 212 111 130 249 182 57 -88 53
3803E3J9j14J35l3n0l4j5K5J93j47j00r1j34J58j34K68l7L1k38K02l3j36J04j34
$$ 53 72 -42 93 60 10 -24 -39 -14 179 32 -68 -159 -293 -135 -269 -1 -38 -7 -245 -43 -76 -212 -108 -242
3827b42J9M85l55j34L52j23k8J64k7m4Q4j96r2l2P5R6j37K68k40Q7n4l3K46j4
$$ -242 -223 262 -93 -227 125 2 -26 138 111 67 151 -45 -137 -169 -94 2 -135 133 -107 -20 -74 -107 139 125
3851A25q4J75j15j55J65K54k22p0j03o7J76%J80k85k3j4K47j43J56l12L7K43m38
$$ 125 41 216 101 -54 111 365 143 73 -30 -97 79 79 259 -26 -49 -63 184 41 197 -115 -78 165 -273
3874b73M32o9j28K20j71N0q1j13K14kJ23j46J66l85J77j97J42o6j12M07p9l54
$$ -273 159 90 -38 182 11 61 -20 -133 81 79 202 56 222 -163 14 -183 -41 -107 -219 188 109 -245
3896b45K77J21k16j57n1K26j95M6J06J82l94J23K14n5K6n9l41L02PJ35j39J05
$$ -245 32 153 -63 -220 -271 -45 -240 -194 -88 94 -300 -177 37 -18 8 -51 -392 -90 -83 52 -87 18
3918A8M5k70L09k82K95j36J05K8J85j65r0N3j03l1m7J56j15L6J30j65kN2n4J64
$$ 18 63 -207 102 -180 115 -21 84 112 297 132 42 95 -8 -39 -86 70 -45 -9 121 -44 -46 6 -48 116
3942A16J29j57O9J66j30j73P0m7j13J04N4q2lO2k40J40J8M6j15K2N6K9j11p7m3
$$ 116 245 88 157 323 193 20 90 43 -70 34 88 6 3 65 -175 -35 -17 29 -86 -64 -8 21 -90 -167 -210
3967b10L10l61M03j67j29J4R3oJ19K3k9j20rO8m3j56L9Q2PJ63j95J02R8j3K19
$$ -210 100 -261 142 -25 -154 -140 -47 -53 66 89 60 -60 -69 -1 -44 -200 -161 -79 -72 91 -104 -2 96 83 302
3992C02j96j97J87k63L6O2K06j07J12l48K24M0j12J22R0l7l5J49k62K54l52k50
$$ 302 106 -91 96 -167 -131 -69 137 30 142 -206 18 58 -54 68 158 121 86 235 -27 227 -125 -375
4014c75N39k43R9p3K9J63q8k21J00J49j75K55J51j82k11o4K99L9K1j89P8r3j63
$$ -375 164 -79 20 -53 -24 139 51 -170 -70 79 -96 159 310 128 -83 -147 152 191 212 23 101 8 -155
4037a55J16K25k05j62L36r0j1l12J22K31o7j00K90k46J32j30l52K70J01q9qM6
$$ -155 -39 186 -19 -181 155 65 54 -258 -136 95 28 -72 218 -28 104 -26 -378 -108 -7 -96 -104 -58
4059e8k42M10m0l41L09k48P8q4J87J86j13k40K04j84Q7L0K85%j56j1L07m38j46
$$ -58 -300 110 70 -271 38 -210 -132 -216 -29 157 44 -196 8 -176 -89 -59 226 226 70 59 366 -72 -218
4082b18L43k46k3J31J4J02K46j99n2J41k49k31M01L9r0j23O7n4QnJ45k78L30j67
$$ -218 125 -121 -144 -13 1 103 349 150 98 239 -10 -241 160 199 109 -14 53 -1 7 2 147 -131 199 32
4106C2no0K14r2n6J07l68J42J60j16j13rp2K17j03J22j98P7k89K95J19n7j98J94
$$ 32 27 -33 181 89 33 140 -228 -86 74 -42 -155 -164 -236 -19 -122 0 -198 -121 -410 -115 4 -53 -251 -57
4130e7lq5L35k7j81J2O9k90j6L42q5R8m5q7J29j92K01k69K17P8k05K2k8J64j95
$$ -57 -60 -145 190 163 -18 -6 63 -227 -243 99 14 112 67 -20 109 -83 118 -151 66 144 -61 -39 -67 97 -98
4155i8L27k1k40l5J89J40k41l1J38j07J54j93K67k20j30J21O6j24P8j70L17L9
$$ -98 229 208 -32 -67 122 262 21 -10 128 21 175 -18 249 29 -101 20 86 -38 40 -130 187 226
4177B26J57k59j30K18l06p3J04K8J43l23o4N81k23o3K09j30k07K23n7n5k43L49
$$ 226 383 124 -6 212 -94 -167 -63 -35 108 -215 -279 302 79 16 225 95 -112 111 54 -1 -244 105
4199A05k11O0N2p5K58j81k13J33pR4m0k77K87J77p4j13J61j85J00N6j48M8L5j0
$$ 105 -106 -46 6 -69 189 8 -205 -72 -79 15 -25 -302 -15 162 88 -25 136 -49 51 107 -41 7 42 32
4223C2r8p0K10p3K39l04J82k86K53k04m7M93l88J05O6l66R7K00n8O1k51J68P9
$$ 32 -66 -136 74 1 240 -64 118 -168 85 -119 -166 327 -61 44 110 -256 -159 41 -17 44 -207 -39 40
4246D0j0jK22k96O2p8K7L7p2J39j28kO5J5k1m1j37L1J56L0L60l74M0q2O1j53j49
$$ 40 30 29 251 -45 17 -61 -34 3 -69 70 -58 -60 5 20 -1 -42 -179 -148 8 38 398 24 64 -18 43 -110 -259
4273b59R9J07L49k49R9k69k4j63M03j07j36N3K35l74Q0P6rJ18K49r1m72J42J31
$$ -259 -160 -53 296 47 146 -123 -147 -310 93 -14 -150 -97 138 -236 -156 -80 -89 29 278 187 -285 -143 -12
4296a2j4J65j95j73M07k70J89j57J94k50J44J1J57r5r5pm0J0j73K78K6L6k18k
$$ -12 -26 139 -56 -229 178 -92 97 -60 134 -116 28 39 196 101 6 -1 -41 -31 -204 74 100 136 -82 -84
4320h4J83k19j63K13M7J63pM2j97k16L6M87k88j84J13j6K35l28K09j21O5n1J44
$$ -84 99 -120 -283 -70 -23 140 133 175 -22 -238 -202 285 -3 -187 -74 -90 145 -183 26 -95 -30 -81 63
4343F3j58NP1j7J2r7J43L5j87K10Jj50PqL16m03L09j78k7k22J86RK22j42o2L92
$$ 63 -95 -90 -19 -36 -24 -121 22 57 -130 80 81 -69 -62 -70 246 -157 152 -26 -53 -275 -89 -80 142 0 -62 330
4369C30m85J52p8k62O57k71J04j98kJ19j21O4P0M6k51J73j70K33J36k26q1N9l8
$$ 330 -155 -3 -81 -343 314 43 147 -51 -53 66 -55 9 79 125 -126 47 -123 110 246 20 -61 -2 -40
4392d0r6J54P9r8K06O2k27p4L61k46Q7p1m7N1k03n9LJ18j43K34J6l3n2O2j7QP7
$$ -40 -136 18 97 -1 205 267 40 -34 327 81 168 97 50 101 -102 -161 -158 -40 -183 51 67 34 -18 44 27 35 112
4419A12k85J48K03k50p4nQ8J15m0q6K77j56jj69J76j07j24N9O3L9J00j0j62P5
$$ 112 -173 -25 178 -72 -146 -151 -63 52 12 -74 203 47 46 -123 53 -54 -178 -119 -56 -17 83 73 -89 -14
4443a4o4J84q5J26j76j54L23l2j17J55k43J46p1L7j51Q5R4o9k4m1lL26j25k22
$$ -14 -78 106 21 147 -29 -183 140 108 -9 146 -97 49 -22 15 -136 -51 43 -26 -50 -91 -94 232 107 -115
4467a15J20j1j8M3k32L21k7j78L67j34L6j99O5P8p6k23k9K78j6k39J10J99k24
$$ -115 5 -6 -24 19 -213 108 81 -97 270 136 172 -27 38 116 40 -183 -212 66 50 -189 -79 120 -104
4490a04J28p2k4j12kK00k0K12p3l85L26j22J9N5M5l1L0j38j0J23N8m2l05M10j33
$$ -104 24 -48 -72 -184 -186 14 -6 206 133 -252 74 -48 -29 26 71 40 70 -68 -78 45 103 61 -244 166 33
4515C3RJ48l04K4K19q5l46L23k31J98n3J09J13j07j19L77k16l13L15j96j45J57
$$ 33 42 190 -114 -90 129 44 -302 21 -210 -12 -65 44 157 50 -69 308 92 -221 94 -102 -247 -90
4537i0m4L66j39k01K14Lq0oJ7J89qk80qK10r5l13K92P0j50J95j06j85l1J98n8
$$ -90 -134 232 93 -108 106 109 29 23 40 229 221 -59 -67 143 48 -265 27 97 -53 142 36 -149 -180 18 -40
4562d0K05l97K3L44l24J98j13l89M01J73M5k30N1l3L5l0J3K52m82J21L85j50J04
$$ -40 165 -232 -209 135 -189 9 -104 -493 -92 81 126 -104 -53 -86 -51 -81 -68 184 -298 -177 208 58 162
4585A62j63m8R3M3R1j47j8M1L3mq6k9j8q8K86j62r4P8J26n3j62J45L00l27lj45
$$ 162 -1 -49 44 87 178 31 13 54 87 83 -3 -32 -50 -138 148 -14 -108 -30 96 43 -119 26 326 -1 -4 -149
4611a49M52j65j76R4J4o4j94M11r4k33K56j13p2j96P4k3L58q0N7j8j43J55j46
$$ -149 303 138 -38 56 70 6 -188 223 129 -104 152 39 -33 -229 -155 -178 180 100 157 139 -4 151 5
4634EJ97k90K12j22M1m1p0K28j7n9j10q4Nl7P9J6J75rj65K9j46J21J05j41J40
$$ 5 202 -88 124 2 43 2 -68 160 143 84 -26 -110 -105 -142 -63 -47 128 119 -46 -17 -163 -42 63 -78 62
4659F2j13J36m2j19J5J69r2m3j18m6kM36k93oJJ15pmR3l30n4K51r3J55N9k00K43
$$ 62 -51 85 43 -76 -61 108 16 -27 -145 -191 -193 243 -50 -56 -55 60 53 49 142 -188 -242 9 -84 71 130 -70 173
4686A73j84J84l04J30j93J75N9K03m1k15N9j82J49n0J43l9r2j10J43J38K29m55
$$ 173 -11 173 -131 -1 -194 -19 40 243 202 -13 46 -136 13 -37 106 67 -25 -135 8 146 375 -80
4708h0L80r8q2p1m10L01J6L16k80K47l68L68j95j0r7M2J01J27n8l17L48l14K50
$$ -80 300 202 120 49 -361 -60 -44 272 -8 239 -129 239 44 34 -63 -21 80 207 149 -168 180 -134 116
4731A16j65M9r2Q1J43k98J78J05j97m8N3J97q6M4k62J44o7j0K12k18J29P5N0j
$$ 116 -49 0 -92 -11 132 -166 12 117 -80 -128 -75 122 36 80 -182 -38 -105 -115 97 -121 8 83 133 132
4755A32L1j25k5kj30L70n52L99P5l17J86JQ8j52J63k51J67j25L5j16K99j0K65
$$ 132 163 38 13 11 -119 251 -301 98 173 -144 42 43 131 -21 142 -109 58 -67 -32 -148 151 141 406
4778D06n02L0lJ40K78k74J02j59l23M18m64L34j9Q9j78N1K28k46K31m28K73m3
$$ 406 -96 -66 -69 71 349 75 177 18 -305 113 -351 -17 -36 53 -125 -74 154 -92 139 -289 -16 -59
4800e9J1j31J23J2j21R5j68l8J26K52j38k95J56N0N3R9n7j5j94M26k33MK70m06
$$ -59 -48 -179 -56 -44 -165 -70 -238 -276 -150 102 -36 -331 -175 -125 -72 27 -30 -45 -239 187 -46 -42 228 -178
4824a78J21N1Lj66J26K7r1Q7nK14j97J8J70J7l02l4L6K27j44P4p9K11q0j66J89
$$ -178 -57 -6 -3 -169 -43 -16 -107 -20 -25 189 -8 10 180 197 -105 -139 -103 124 -20 54 -25 186 106 -60 129
4849A29o4j33K28j32N4N9j81lk5P5j23K09j42J09J01j23j0Q3j17p0R8P1o2M3k20
$$ 129 65 -68 160 28 82 141 -40 -43 -68 7 -116 93 -49 60 161 38 28 111 -6 -76 22 93 31 74 -146
4874a46K06j7p2L7L50m70M2k3K2o3J62l9J03l0k4o4Nr5j6J05R1K35k70M3j54Q2
$$ -146 60 43 -29 8 358 -112 -70 -93 -71 -134 28 -11 92 62 38 -26 -21 -116 -132 -27 64 299 29 72 -82 0
4900@J25j17K17j39l54K72J41ln3r4J98m8j62P1j02m8L00l50K64r9Q3k9L2j05
$$ 0 125 8 225 86 -268 4 145 142 89 -5 193 145 -17 54 -48 -96 204 -146 118 19 102 73 105 0
4924@J67r1r7L4O1M3l14K45k05J01J46l4O7j59j46K69j90K01k09L19k21j31J2
$$ 0 167 76 -21 13 74 117 -197 48 -157 -56 90 56 123 -36 -182 87 -103 98 -111 208 -13 -144 -132
4947a32M2L21l83K88Ro7j6k97J58k0l8J93r1j36J31J4j41K22n1j55R4K1J69J77
$$ -132 -90 231 -152 136 145 78 62 -235 -77 -97 -135 58 -33 -169 -38 -24 -165 57 6 -149 -55 -34 135 312
4971C12m60Q7J71k93J73J59j1j01nj86%J92j68K98q6j56r1L43k46j15j02K72J58
$$ 312 -148 -61 110 -183 -10 149 138 37 32 -154 -154 38 -130 168 82 -74 -165 178 -68 -183 -285 -13 145
4994A45l28L81K9j11Q7k56k1L55k87K44l95M5K06J55j33j70K03l53K24k6j7J08
$$ 145 -183 198 227 116 203 -53 -74 281 -6 238 -157 -112 94 249 116 -54 149 -204 20 -6 -23 85
5016H5l3J06m14L60r9n5O3M3Q4o7q9K4M3j01o4J19l55K67J85j68J02lKm5r8J40
$$ 85 52 158 -256 104 5 -50 13 56 140 73 -16 8 51 -50 -114 5 -350 -83 102 -66 36 33 35 -10 -108 32
5042C2j12J4r7J00J29j99M8K71k49o1P1j3J12k2j35K5j2J75j08K1Nk0K70k98J3
$$ 32 -80 -66 -163 -63 66 -133 -85 186 -63 -124 -53 -66 46 24 -111 -86 -98 77 -31 -10 -5 -25 245 -53 -40
5067d0K7K50m25L90k95J84KJ22l24Q3K29j15J3j85J28n1j82L8K15n0k1k15K25
$$ -40 -13 237 -188 202 -93 91 93 215 -109 -26 203 88 101 -84 44 -7 -189 -151 64 14 -7 -222 3
5090CJ36l7K4k56J83p5j78K52l15L39J63l07l1j74P8L4J09J72j33l9l4J5J22r3
$$ 3 139 102 126 -130 53 -22 -200 52 -263 76 239 -68 -99 -273 -195 -161 -52 120 -13 -52 -86 -71 51 -42
5114d2Q1j02P8n7k07K59j33O6n7J60j42J28J94J4k47L1m58N30j25Q3k52p5M00
$$ -42 39 -63 15 -42 -249 10 -123 -57 -114 46 -96 32 226 240 -7 24 -434 96 -29 54 -198 -273 127
5137A27O0Q8k98M4k1j40J69j94L12j76J15o5Q9j34o3K9J42n1o2J27p2O1k92N6
$$ 127 187 275 -23 21 0 -140 29 -165 147 -29 86 21 110 -24 -87 -58 84 33 -29 98 26 87 -205 -149
5161a49P8J74j36j33n3M6r7K64j15J47L55m25J69l61J63O6O6j65J12k57L38O4
$$ -149 -71 103 -33 -166 -219 -173 -270 -6 -121 26 381 -44 125 -236 -73 -7 59 -106 6 -251 87 151
5183A51j28J20lL2k27nJ04o9J7O1k63J09q1M58j31j72M78n75K9J40o7J10j1N4
$$ 151 23 143 140 172 -55 -60 44 -25 -8 53 -210 -101 -182 276 145 -27 451 -124 -95 45 -22 88 77 131
5207A31q3k28K13qK25k04q7N8j49J29P8k14L13j30j43L51k75J17J39j8l15M8L88
$$ 131 48 -180 33 25 250 46 -41 17 -132 -3 75 -139 174 44 -99 252 -23 94 233 215 -100 -52 336
5230C36k74lP4j49n2J36j29KK6R5q3j63M09m16K83p4L4jK9k9j46Q0n9K0j22M54
$$ 336 62 59 133 -16 -68 68 -61 -59 -33 62 -21 -184 225 -191 92 18 52 51 80 51 -95 -15 -74 -54 -176 278
5256B78k21M8k39Q1M9J22o5O3j62K90j56k02R4k2K15m05L72o0K12k64J67j90o4
$$ 278 57 105 -134 -53 -4 118 53 116 -46 244 88 -114 -20 -42 173 -232 140 80 292 28 195 5 -59
5279e9k2k4K9K07K5k46J19J15j12k5k4lJ74J4j87M0Mj24l5K65Rj2k17j68K68j76
$$ -59 -81 -105 -76 131 156 -90 29 144 32 7 -17 -20 154 168 -19 21 25 -99 -134 131 140 128 -89 -257 11 -165
5305a65k3K94j20M4j7l8J99k29L9j07m4L05%l15J01M5R1o0q7O6n6J79j92J0r8
$$ -165 -188 106 -14 30 13 -25 174 -55 -16 -123 -167 138 138 -177 -76 -31 60 0 -87 -21 -77 102 -90 -80 -178
5330a78l3L00l49L84l13j0J92N0K7l5K10k38k3J7J11k60K60p5P9l38M18j53k50
$$ -178 -211 89 -260 124 -189 -199 -7 43 70 35 245 7 -16 1 112 -148 112 37 116 -222 196 43 -207
5353b07K87J02j23j11j13q8J68J45K0k32R4P3Ok06K17r1J69R0k64K19p2k00K22
$$ -207 80 182 59 -52 -165 -253 -85 60 80 -152 -58 15 21 -185 32 -59 110 200 -64 155 83 -117 105
5376A05q6m7K1l9J89k28K6P7p6j03R9N8j60K17j03j7k02J93J03j11L04k74J59
$$ 105 19 -28 -7 -46 143 -85 -59 18 -58 -161 -62 -4 -164 53 -50 -67 -269 -76 27 -84 220 -54 105
5399A05Q1o9o3j25R8J87l93L53m0k23j3o5J91j52n0L27K3l83J88k29K99j23k7
$$ 105 186 117 54 -71 27 214 -179 174 134 -89 -102 -167 24 -128 -178 149 172 -211 -23 -252 47 -76 -103
5422a03J33O3j06o7J28k09J14n5R7j12L23j33j00lK76l47J3Q4q8K73o1k05K38
$$ -103 30 93 -13 -80 48 -161 -47 -102 -5 -117 206 73 -27 -30 246 -101 -88 -4 -92 181 120 -85 153
5445A53k26o1K41l6k72K55J64Jk09j42m4J45l62K35N5m4J6JL62k56J3K7O2j29
$$ 153 -73 -134 107 71 -201 54 218 219 10 -132 -176 -31 -393 -158 -103 -147 -131 -130 232 -24 -11 16 78 -51
5469e1Q6l1j76L05q6J62j11J29l53J24j51j72L85o2p3omj09k5K36J35Ll33mk3
$$ -51 35 4 -172 133 47 209 98 227 -126 -2 -153 -325 60 -2 -75 -81 -85 -194 -219 17 152 155 -178 -182 -205
5494b05l6O7L23qk73q1J28L22m64J41J37j59K30j04n0K21j77R5j96K36k13K6K08
$$ -205 -241 -174 149 141 -132 -213 -85 237 -227 -86 51 -108 122 18 -32 189 12 107 -89 147 -66 -40 168
5517A68k16L32m69J27Oj22L10p5rq9p0K17k6j76J92N5m19L27m5j08K9j4J93l07
$$ 168 -48 284 -185 -58 -52 -174 136 61 52 -37 -107 110 84 -92 100 155 -264 63 18 -90 -61 -75 118 -189
5541a89K20l6o7K18r2j28QJ14j59J95K9l93K96J53j72R6j86K2M7J36ok4J94j35
$$ -189 31 -5 -72 146 54 -74 -66 48 -111 84 113 -280 16 169 -3 93 -93 -71 -24 112 106 82 276 141
5565A41q4K51pm14J4J82k42K20j61k20L85j36J37j55J89k56L54j19r5J33j62j52
$$ 141 57 308 301 -113 -99 83 -159 61 -100 -320 65 -71 66 -89 100 -156 198 79 -16 117 -45 -197
5587a97M51k58j68K21k50J97Q5j4j59K20kl29L97k62O3%k3J49l42J34Jo1K97j76
$$ -197 254 -4 -172 49 -201 -4 81 67 -92 128 126 -203 194 -68 -5 -5 -28 121 -221 -87 -86 -147 150 -26
5611b6N1J6k91K65j61J76j93J49j94K02k26K21qN9k19K60l7mj18L56k56r0n2K15
$$ -26 25 41 -250 15 -146 30 -163 -14 -208 -6 -232 -11 -19 40 -179 81 44 40 -78 278 22 -68 -120 95
5635I5j04N1j81O3r4j06K15L18k67P0J64m37K63R0j07j28j32K50j61j24L30j06
$$ 95 -9 42 -139 -76 -170 -276 -61 257 -10 60 224 -213 50 140 33 -95 -227 23 -138 -262 68 -38
5657c8K06k58rJ33K49n37L73k35K56m12L84q6k41J83K91m08J77o3J42j18o8J39
$$ -38 168 -90 -99 34 283 -254 119 -116 140 -272 112 26 -215 -32 259 -149 28 -35 107 -11 -79 60
5679F0L4R3k57K6Q9o9K3j15K02j62p8K60J01p8k34L41j20j42l6J02m5j08k5M6
$$ 60 94 187 -70 -44 45 -24 -1 -116 86 -76 -154 106 207 129 -105 236 116 -26 -62 40 -5 -113 -138 -92
5703i2K98m17R1j3m0J08j88K45j37J67K9QR3J19k38r4J55Q7M1l89K32q3J43m1
$$ -92 206 -211 -120 -133 -173 -65 -253 -8 -145 22 51 59 152 271 33 -61 94 181 222 -167 65 -18 125 84
5727H4j03L4l7J02j30rm6J97l05K03J78j22l2k1o7J35rO6q8j11K52l82M60k62
$$ 84 -19 15 -22 80 -50 -59 -105 92 -213 -10 168 46 14 -7 -74 61 52 118 30 -81 171 -211 249 -13
5751a3J73k39J41m3j84J79Q6k29O6K13QJ4l64L10Qn7J02J29l85K11K3k23J38j64
$$ -13 160 -79 62 19 -165 14 100 -129 -63 150 158 172 -192 118 126 69 171 300 -85 126 149 -74 64 -100
5775a00o7K29Q1j88J3nk0j69K08L88k66o9m2Nj96K97o2O8k35L6k0n3j48L63L5
$$ -100 -167 62 143 -45 -32 -37 -57 -226 -18 370 104 35 -7 -2 -198 99 37 105 -130 -94 -114 -167 -315 48 83
5800H3q3N9k17J17j6L33m55K68j52k48R4K46q5J59M1j75j58L72j97J19j05o2J38
$$ 83 0 59 -158 -41 -57 276 -179 89 -63 -311 -217 29 -56 103 144 -31 -189 183 -14 105 0 -62 76
5823G6J64l58L15m19L28n0j90K15m13L75J20J84m17K3j0j05K66Jm7j39l71N03
$$ 76 240 -118 197 -222 106 56 -134 81 -332 43 163 347 -70 -47 -57 -162 104 105 58 -81 -452 51
5845E1n8o4J61n6N4Oj54K32o3P3l09L18k85k7N5p7L9J00J31j26j33n3K18J1N1
$$ 51 -7 -71 90 34 88 94 -60 172 109 182 -127 191 -94 -121 -66 -143 -104 -4 127 1 -132 -185 33 44 95
5870I5j63Q2N4J35o4J02l44J55Rj17J8K6J76k84J67j76J71j09N9J5j66Q8J02j86
$$ 95 -68 14 68 203 139 241 -103 52 61 -56 -38 -12 164 -120 47 -129 42 -67 -8 7 -159 -71 31 -155
5894a55L8J17M1L1N6r3N0mQ0l89J33K56p4r2j14J16k50K97J09j18o2J0o5N2J34
$$ -155 -117 0 41 72 128 35 85 81 161 -228 -95 161 87 -5 -119 -3 -253 44 153 35 -27 -17 -82 -30 104
5919A04k6k53K57j02N7k52J69j50J12Q0J1K73k61j83K35n7q7O0j36K62j16j45
$$ 104 78 -175 82 -20 37 -215 -46 -196 -84 -4 7 280 19 -164 71 14 -73 -13 -149 113 -3 -148
5941a48N4P9l7j40J58J37qL2l37L08j45j06NL28j27j02p7J78k18L23l7k67J79
$$ -148 -94 -15 -52 -192 -34 103 95 127 -210 98 -47 -153 -148 180 53 -49 -126 52 -166 157 120 -147 32
5964C2p1J71j79o0K49l11J21J31l66J28J40j10nO1J62j00o1k9R4N2L8m4q2J25
$$ 32 -39 132 -47 -107 142 -169 -48 83 -283 -155 -15 -125 -130 -69 93 -7 -68 -97 -3 49 87 43 -39 86
5988H6r2k2P8J21o3m2n6k84K40Q5l16K64j42J72n4L5j0L0K15j50n1k16K47m12
$$ 86 -6 -28 50 171 108 66 10 -274 -34 51 -265 -1 -143 29 -25 10 0 30 245 95 44 -172 75 -337
6012c37M92j08j20LJ69q9j06m0K45n5k53K25j31O8O3J58k64Lj9OQ4j0j7R9MOj64
$$ -337 155 47 -73 -70 99 10 -96 -136 109 54 -199 26 -105 -37 26 184 -80 -77 -96 -90 -6 -16 -33 66 70 76 -88
6039h8J68J6k5jj96R0K43q1j79LQ4J2R7j68J6L1J76k40j83K16l3K31j90N1q9P1
$$ -88 80 96 71 70 -126 -36 207 126 -53 -50 34 46 143 -25 -9 22 198 -42 -225 -9 -42 189 -1 50 -39 32
6065C2q0j47L60l2K50l88J44k72J00R2j82k03K33J40mo4J39j89j23M3o2J33j0
$$ 32 -48 -195 165 133 383 -5 139 -133 -33 59 -123 -326 -93 47 43 -21 118 -71 -194 -151 -213 -80 -90
6088i0N4n5k7K04j85j26J47N7j26O0j57M64o3j64o6p2NJ07J18j73O4J28j19k28
$$ -90 -36 -91 -118 86 -99 -225 -78 -21 -147 -87 -244 220 157 -7 -73 -145 -140 -33 85 -88 -24 104 -15 -243
6112b43L11l5j77J67q8j67L74J41r1l07L58l30j6K69j62k29K35l4n2J41o3Q9m6
$$ -243 68 33 -144 23 -65 -232 142 283 192 -115 243 -87 -103 166 4 -225 10 -24 -76 65 2 91 45
6135D5l8q3K17j15K13l00k66L64j00K6K55k38J32N7j12j11P3j9M0n7m4K34k40
$$ 45 7 -76 141 26 239 -61 -327 37 -63 -37 218 -20 112 169 57 -54 19 0 40 -17 -61 173 -67
6158f7J3J39M7j24kk18K78k21J20r6j48J61J25OM7Jk11O6J13M7k03K59j69M4K27
$$ -67 -54 85 132 8 6 -212 66 -155 -35 -131 -279 -118 7 13 60 61 -150 -84 29 76 -127 132 -37 7 234
6183B34m08p7L40j24K09l2j23pJ60o2N4j67k10K97j5j03n4M4J14k73K06n3K47
$$ 234 -174 -251 89 -35 174 142 19 12 172 110 164 -3 -213 84 69 -34 -88 -44 70 -203 3 -50 197
6206A97j06k64L29n7o1J8k8QPk30K8K20k02K24L6j53P7j91J38k2M1l3rq2R7J19
$$ 197 91 -173 156 99 38 56 28 36 43 -187 -159 61 -141 83 119 -34 43 -148 -10 -32 9 -24 -33 -115 -18 101
6232A01M1l67K12k8r6J07j99L82j0Q4m28K22R7o7n3q0K11l25J17J7j55K83K70
$$ 101 142 -225 -13 -41 -137 -30 -229 153 143 227 -201 21 118 51 -2 -82 129 -196 -79 -62 -217 66 336
6255C36k30j60K71j91k46J22p4K68j28o1r7K27J00l2k58l8J80K88l02n3J86j4
$$ 336 106 -54 217 26 -220 -98 -172 96 -32 -93 -190 37 137 105 -153 -191 -11 277 -25 -78 108 94
6277I4m3k67J21M1Q9l3j03J16j51lL02j04p0M07m03l19L02rN6j52L04k51K94m2
$$ 94 51 -216 -95 -54 35 2 -101 15 -136 -139 163 59 -11 396 -7 -326 -24 -33 23 -129 175 -76 218 176
6301A76j85k26J36K41l24J10J24N6R8o3m89L79MR3K2lr3O4l08M10k71J57j37M7
$$ 176 -9 -235 -99 142 -182 -72 52 108 206 143 -346 33 37 130 152 149 56 120 -188 222 -49 108 -29 18
6325A8Q6j56l5r2J57j80J84o8r3J70J52j73k18K42K07r7m8n3K19k41p5L54j17
$$ 18 104 -52 -87 -179 -22 -202 -18 -86 -179 -9 143 -30 -248 -6 201 104 56 3 222 -19 -94 260 143
6348A43j37J19j76O6J64J5L5j33n2j10Rp4LJ09K5k15J65K6J14j24j21M94l94P5
$$ 143 6 125 -51 15 179 194 229 96 44 -66 -57 -131 -128 -19 6 -209 -44 -18 96 -28 -149 345 -49 26
6372B6R1P7j04r9j13N5K0j24J13j52M46j42M9Mm8l35K82J08j00r8Q5Q9p7o6k3
$$ 26 117 194 90 -9 -122 -67 -47 -171 -58 -210 236 94 143 147 99 -236 46 154 54 -44 41 130 53 -13 -36
6397c6J9r4J20K5k94N05k17l4p5J78L3o4l7l5j33K41j89NP4j58J99O2r2k62J63
$$ -36 -17 -111 9 34 -260 245 28 -6 -81 97 130 66 29 -6 -139 102 -87 -82 -8 -166 33 95 3 -259 -96
6422i6R6P9k16J66k6p1j04J88j81J37K06j00k9j3J02k77J69j13K10K32l30o0J66
$$ -96 0 79 -137 29 3 -68 -172 16 -165 -28 178 78 49 36 138 -139 30 -83 127 359 29 -31 135
6445A35jl33K94k20Q9m03M57q8J01J89l63J10P2L0m20L65M0K9k10L2J94j23K40
$$ 135 134 -199 95 -125 -36 -439 18 -70 31 220 -143 -33 39 69 -351 14 54 83 -127 -95 99 -24 216
6468B16k82Q2n6J08O4j80J4J2p0J85j26j27J67j24J01Q9r6P1r8K02lQ6j49j14
$$ 216 -66 16 -40 68 132 -48 -34 -22 -92 93 -33 -160 7 -117 -16 73 -23 48 -50 152 149 235 86 -28
6492b8MM3j14J58m5N2L3j28p2J13J14j74O7j27J71mj43K41j16Mn8J84k19L7j64
$$ -28 -24 19 -95 63 18 70 103 -25 -97 16 130 -44 23 -104 67 63 -80 161 45 49 -9 175 -44 -7 -171
6517a71rj16K88J89k80J34l15K43J59l15J47j12L3K01r8q0J33o0k24K53O5o5K68
$$ -171 -180 -296 -8 181 -99 35 -280 -37 122 -193 -46 -158 -125 76 -22 -102 31 -29 -253 0 65 0 268
6540B68k16j36J11o3n2n1J97O6m2k16J85j42KJ43Q8j11j94J49M4k61J2J11j24
$$ 268 52 -84 27 -36 -88 -139 58 124 82 -134 51 -91 -89 54 142 31 -163 -14 30 -231 -219 -108 -232
6563b32M44k33k07M36k00oJ98q6q8j5n4M3k35N37k60j02J06k43M58j82K7j02j32
$$ -232 212 -21 -228 208 8 2 200 114 26 11 -43 0 -235 302 42 -60 46 -197 261 79 106 4 -128
6586a28K69K0K74m40J68k16k80M34j05j07j64J77K11j30Q9p7j01L22k87R4j30
$$ -128 141 161 435 -5 163 -53 -333 101 -4 -111 -275 -98 113 -17 72 -5 -106 216 -71 23 -107
6607a07P7Qrj9M1J96l72J00L40j93k03J98k01J17j23n5J21Q7J12j98j57O0L28
$$ -107 -30 -22 -31 -50 -9 187 -185 -85 255 62 -141 57 -144 -27 -150 -205 -84 3 115 -83 -240 -180 148
6630A48j48K54n33J61J99J31j35k31P1o9J62j52Q0J18m6J4R4l24n0L13j24O7J34
$$ 148 0 254 -279 -118 81 212 77 -154 -83 -152 10 -142 -62 56 10 24 118 -206 -256 57 -67 0 134
6653A34k93Q0P8j41J76j71P7K20l05K38k90L03J9q9j06L31m43K02J3jr3K3q1J69
$$ 134 -159 -79 -1 -142 34 -137 -60 160 -145 93 -197 106 125 36 -70 261 -182 20 33 32 -61 -38 -119 50
6677E0j96K83j33p2Q4K14k28k29J05l39N09M9k80M37r8k59J9J96m7J82k7k52J71
$$ 50 -146 137 4 -68 16 230 2 -227 -122 -461 48 97 -183 254 156 -103 -84 112 65 247 220 -32 139
6700A39o3r8J85q0j04K74l64J88j32N3J7m9MO4k8m1n4j27Q4M26k87l27L47N7j35
$$ 139 76 -22 163 83 -21 253 -111 77 -55 -2 15 -34 -30 34 6 -35 -89 -216 -132 294 7 -320 27 84 -51
6725e1J88j40Q3l65K88l7n7J10j53J06J49j67K73m03J52ll2L60n11M98l52q4K06
$$ -51 137 -3 80 -285 3 -34 -91 19 -134 -28 121 -46 227 -176 -24 -27 -59 301 -210 288 -64 -148 58
6748E8q0o3Q0K77m22J84j19J97k77J37J29j83K99q9p9L4j03j26J73j9J14q1m9
$$ 58 -22 -85 -5 272 -150 34 -85 112 -165 -28 101 -82 217 128 49 83 -20 -146 27 8 122 41 -8
6771hK1J59L7k05N3k8m0k08K44k7J8j16R4K24k55J92l8j08K30m80K68P2l07M45
$$ -8 13 172 209 4 57 29 -11 -219 25 -2 16 -100 -6 218 -37 155 117 9 239 -241 27 99 -208 237
6795B37k95R5L8J72l94K94m32M41j93K9M6J36j26j8r0J63j86J22m2k2m8J11M5
$$ 237 -58 37 75 247 -147 147 -285 156 -37 -8 38 174 48 30 -60 103 -83 39 -3 -25 -73 38 83
6818H3K7k83J73J31K9M7l29J52N5k82P3J58oL25k97j27k49L91m5J17J35k99k09
$$ 83 110 -173 0 131 160 207 -122 30 85 -197 -124 34 28 353 56 -71 -320 71 26 143 278 -21 -230
6841b30K27j02J08L3M3j01j93L93j91N3N3j6LN7j67M1N6K1k27L00k20ljQ2J13
$$ -230 -3 -105 3 36 79 -22 -215 178 -13 40 93 77 80 137 -30 11 67 88 -139 161 -59 -62 -63 19 132
6866A32n2k31l6L14k02J77j71L5m2j06J68J81o5k14J65m5N4mp2r3K62m10J78j39
$$ 132 80 -151 -187 127 -75 102 -69 -34 -76 -182 -14 167 102 -112 53 8 62 58 -14 -107 155 -255 -77 -216
6890b16P8J60M0j80L70l01j13J71j49J15R4k31J86L6l7j38J64p3MM4k40K61J62
$$ -216 -138 22 62 -118 252 -49 -162 9 -140 -25 69 -162 24 60 23 -115 49 -24 -20 24 -216 45 207
6913B07P3l19K15j14l5k20J35j26K85k08o2J87R3k37K72M2k00m5M2N9j28o6J84
$$ 207 280 -39 176 62 27 -193 -58 -184 101 -107 -169 18 111 -126 146 188 -12 -57 -15 44 -84 -150 34
6936C4O6k75J51J10j0J41j51j70M7P9P5j25J40K55k68j39QJ43j14N5p6k7J74j10
$$ 34 100 -175 -24 86 76 217 66 -104 -57 22 97 -28 112 367 99 -40 -32 111 -3 52 -24 -51 123 13
6960A3kk32K92o0LK04m16J4O6J33k11P9J80m1r0jL17j65l83K79J83j20k47L24
$$ 13 11 -221 71 11 14 218 -198 -184 -118 15 -196 -117 63 22 -68 -69 248 83 -300 -21 162 42 -205 119
6984A19n8o1M0k41L22n03N57k86J75p3K08l18Q0o1j47P4N5L11l31R6j17J25J32
$$ 119 61 0 40 -201 121 -382 175 -111 64 -9 199 -119 -39 -100 -247 -173 -118 193 -138 -42 -159 -34 98
7007I8p0o7O9k9m3P4O6k26QJ07j12r6J05M1J44m9k8j24J08J75k90R0J78pn1k12
$$ 98 28 -39 30 1 -42 32 98 -128 -120 -13 -125 -221 -116 -75 69 20 -8 -132 -24 151 -139 -49 129 122 71 -141
7033a41Q2K51j56J05q6k14K67k97J50j8p4K32j90p4R1K05l03J72K08m49K02Rj84
$$ -141 -59 192 36 141 55 -159 108 -189 -39 -57 -131 101 -89 -163 -72 133 -170 2 210 -239 -37 -28 -212
7056b12J19R5J78j51J61j15R4l88L9L29j19j24Q8J46j64PR0j45j6L6J25J31k56
$$ -212 -93 2 180 29 190 75 169 -219 -180 149 30 -94 -6 140 -24 -17 73 -72 -88 -52 73 204 -52
7079e2NP3P1N4j86J93m63K16j14Q1K49k06Q1m7j75K26R4j52K25j90K30k22p1L91
$$ -52 -47 26 97 151 -35 158 -305 -89 -203 -122 127 -79 2 -45 -220 6 100 -52 173 -17 213 -9 -80 311
7103C11j65J84l27j17J75K8J37k18p5K36j30R3m8k39J68J4j84P3J64l5j15J46
$$ 311 146 330 3 -114 61 89 226 8 -67 169 39 132 84 -155 13 27 -157 -84 80 45 -70 76
7125G6m28M01J80k3Jl16Q8q8K43j64N3k4J0o9l7Q5k85J12Q2PL3J11n5M6j0j44
$$ 76 -352 49 229 206 207 -109 -21 -109 134 -30 23 -1 9 -60 -97 -12 -297 -185 -103 -96 -63 48 -7 39 29 -115
7151a15L8M3j65K80J97j33L8k98J42l0pp5Q1N3kj10O7J35l57J87J59p4n5j21L7
$$ -115 -77 -34 -199 81 278 145 183 -115 27 -3 -10 -85 -4 49 47 -63 4 139 -218 -31 128 54 -1 -122 -85
7176h5K58m9l46J12J42l6J06Q1j67m1o2j0j29K19J15J1k04J94j44J05L2O1k98
$$ -85 173 124 -222 -110 32 -4 102 183 16 -25 -87 -97 -226 -7 108 119 -85 109 -35 70 102 163 -135
7199a35O3J97r4n1K3J24j53p2k5K88k86L9J20K24k84J84j69N2n6J16L6k87J77
$$ -135 -72 125 31 -20 3 127 -26 -98 -123 165 -121 -82 38 262 -22 162 -7 45 -11 105 141 -146 31
7222C1k25L30N0m9l2j06m3L11l71J93r7J41p4J63k27o4n2J3J60L7J51l73K0R9
$$ 31 -194 136 186 137 105 -1 -44 267 -104 89 -8 133 59 222 -5 -69 -121 -108 52 89 240 -133 -113 -14
7246a4k5K37j88J36j21j8M1j22L2n3J03lr4mM4J07m12K81o0J68K00k32q1J12j46
$$ -14 -39 198 10 146 25 7 48 -74 -42 -95 8 5 -89 -93 -49 58 -354 -73 -133 35 235 3 -78 34 -112
7271a12J57N6k7j79K67j18J23l32J87j31K42P7%l10J72j17l8P8J14j73k83N62
$$ -112 45 101 74 -105 162 44 167 -165 22 -109 133 210 210 -100 72 -45 -83 -5 109 -64 -347 215
7293B15k28k5p4J79j0j90L98l36l3J10q8J24k0N9R6k71J15R2j38J58Pj09j49L04
$$ 215 -13 -38 -112 67 57 -133 265 -71 -104 6 -82 42 22 81 177 -94 21 113 -25 133 140 31 -118 186
7317A86J4k54m4N9M6n0M3R1O0l13l1R8J89N9k34K58k47K75k92R4j40L09j99j75
$$ 186 200 -54 -98 -39 7 -43 0 91 151 -162 -193 -95 94 153 -81 177 -70 205 -87 7 -133 176 -23 -198
7341a98K25M1m52O30l15r5l5J06j13J54J43k11P2L0j51L48o3k25o9Q6J04N7q0
$$ -198 27 68 -384 246 -69 -164 -199 -93 -206 -52 91 -120 -48 -18 -169 179 116 -109 -178 -92 12 69 -11
7364a1n6L0j28M21m21RJ32j8K26j56K85k45l17M92q5ql11J32k9J65j57N6j10Q3
$$ -11 -67 -37 -165 256 -165 -156 -24 -42 184 28 313 68 -249 243 158 150 -161 -29 -58 107 -50 6 -104 -21
7388b1K3m4K62j85J00k41m7N02r8l58L03j6l36K72k53q1K01m0K09k19J76q0J5
$$ -21 2 -42 220 35 135 -106 -153 349 251 -107 196 180 -156 116 -137 -218 -17 -57 152 -67 109 29 44
7411D4Kp7J60k0j72K38j47J21J34l54P0M9j54K47n2r2Nk0R7j21K00l49P2K07k7
$$ 44 46 -31 129 109 -63 175 28 149 283 -71 -1 48 -106 141 89 -3 2 -18 79 -42 158 -191 -119 88 61
7436F1q1K37k44K49o0k19K50j36j05J74j65N4j72r8R6J90M0k8j2j23J24P0L3k26
$$ 61 -20 217 -27 222 162 -57 193 57 -48 126 -39 15 -157 -255 -159 31 71 43 31 -92 32 102 135 -91
7460i1N2m3K46n8j17j1j16P4J65j36L4k0O6o7P5r2J74j67J32q0l9pnQ1j58K45
$$ -91 -39 -82 164 106 -11 -22 -138 -64 101 -35 -1 -21 45 -22 53 -39 135 -32 100 20 -19 -26 -31 50 -108 137
7486A37k75J73on3K00J52m81J26p1L3K85j45k3m1j31K34m0j16Q8K60k61p5K8P7
$$ 137 -138 35 29 -24 176 328 -153 -27 -98 -65 220 75 52 11 -120 114 74 -42 46 306 45 -30 -2 75
7510G5lp6J34l29L78j3j35j73J11J09m3J33k14k7p0K55p1j20J74j61o3K01N1N9
$$ 75 72 -4 130 -199 179 166 31 -142 -31 78 35 168 -46 -73 -143 112 41 -79 95 -66 -129 72 123 182
7534A82Jk29r0O5K76K94m95J65k85L55m57K11j61J65R9N7l43L77k10L4r8l8J86
$$ 182 183 -46 -136 -71 205 499 4 169 -116 239 -218 -7 -168 -3 96 153 -190 187 -23 11 -87 -125 61
7557F1k9Q2o5P1j64n0j8K81j52K5k2L33k49k12k9J22j44J55k17K39Lj70n1J41
$$ 61 32 114 49 120 -44 -94 -112 169 17 42 20 353 104 -108 -137 -15 -159 -4 -221 18 21 -149 -200 -59
7581e9L0K6j33q0K01j1K13k50l0J16q6P1r5J55M3m7k2j87L4PR5K29m69J31J13
$$ -59 -29 -3 -136 -216 -15 -26 187 -63 -93 23 -63 8 -87 68 111 64 42 -145 -111 -104 -9 220 -249 -118 -5
7606en6j06J02J71m21M03l2O0J1j64O4M8o1j07j91K47m6ok1L6J01j18J49k37N3
$$ -5 -61 -167 -65 106 -315 88 56 116 127 -37 27 75 14 -93 -284 -37 -83 -89 -110 -74 27 -91 58 -179 -126
7631a26J48k65J35j27M64k14L5q4RQ7j95j00L8Q1L3P3J49j31l9k32M96k17J07
$$ -126 22 -243 -108 -235 229 15 50 -34 -25 62 -133 -233 -195 -114 -81 -8 141 10 -29 -261 235 18 125
7654A25j80JJ40R0j62J72j29l0K4k35K56l48K60M8M0J29j85j42P0L3r9Km2N3J58
$$ 125 -55 -54 86 176 14 186 57 27 51 -184 72 -276 -16 32 72 201 16 -126 -56 -23 -122 -120 -162 -109 49
7679D9q3O6Oj66J44n2J67j84J61q4P9r9o4o3J13j7m9J85j36L0L7J31k27j70K45
$$ 49 -34 32 38 -128 16 -36 131 -53 108 24 103 4 -60 -123 -10 -27 -76 109 -27 3 40 171 -56 -226 19
7704A9j39L45k03j51K50k38K58j30J06j83J24j43J03J18k85j5J93j77L83j73j77
$$ 19 -120 225 22 -129 121 -117 141 11 117 -66 58 -85 18 136 -149 -164 29 -148 235 62 -115
7725a15N7l12N18j70J87M6k15J86k08P6K0j06j1L54r4L4k75L3k7j20K04j29j98
$$ -115 -58 -370 148 -22 165 211 -4 182 -26 50 70 -36 -47 307 213 247 -28 5 -22 -142 62 -67 -265
7748b65N04k72j78K33j29J88M2j61j57n8J84K08m2K0k41N9j66J96O9J29p5k6M7
$$ -265 239 -33 -211 22 -107 81 123 -38 -195 -253 -69 139 97 117 -124 -65 -231 -35 34 163 88 62 109
7771A09j85J56L2k84L5L93j60j45QJ68j58N8J5P1m9n7J15k52j1L0j39J21L16j6
$$ 109 -76 80 112 -172 -137 256 96 -49 -41 127 -31 27 42 113 64 7 122 -130 -141 -111 -250 -129 187 171
7795A71l23m4J90j40Q2l4L41n60K33K19j75J26J87k06q1q2J25k41L96k61rO5K19
$$ 171 -152 -196 -6 -146 -64 -98 243 -317 -84 135 -40 86 273 67 -14 -96 29 -212 184 -77 -86 -21 198
7818A98l97J76J10o3J22p9K71k74m9j50J62m3oQ6j86J32O7k16M0J27n7j76K15
$$ 198 -199 -23 87 24 146 67 338 64 15 -135 27 -16 -22 64 -122 10 77 -139 -99 28 -29 -205 10
7841A0M0o1j31R7k0jJ07j8j02K02n4k46J79K6j77K37l14M52k2p1k12J04q6K17
$$ 10 50 -11 -142 -45 -65 -66 41 23 -79 123 69 -177 2 28 -149 88 -226 226 204 133 -79 25 -61 156
7865A56j17J18P8j83pj5q4J05p2m0J26o5J69k82N2k2P4K9r9J79j51L6k74L53k48
$$ 156 39 157 235 52 45 30 -54 51 -21 -61 65 0 169 -113 -61 -83 -9 20 -79 100 -51 -15 -289 64 -184
7890a84R5JN0K24l03J69L3J38j96J04l0L0j52q6j17M07k51J94j68q2J3K75k46
$$ -184 -89 -88 -38 186 -117 52 85 223 27 131 101 131 -21 -107 -224 183 -68 126 -42 -124 -111 164 -82
7913h2Q4m9L7j59RO7K7j46K84k22J22K44l25L6J53p6k99L03j4K0J27j05l47M37
$$ -82 2 -47 -10 -169 -160 -93 -66 -212 72 -150 -28 216 -109 -73 80 4 -295 8 -6 14 141 36 -311 126
7937A26Lk27J40m1K42m05M7J90J49j04j10P6J44m31K15j30n9K5M2J32j09J20l05
$$ 126 129 -98 42 1 243 -162 -115 75 224 120 10 86 230 -201 14 -116 -175 -150 -108 24 -85 35 -270
7960b70J13K56n2p7L47j31q3j91K80k88R7j41J83J81O1n84L21J32m4L7o0k3o1
$$ -270 -157 99 47 -30 317 186 103 -88 192 -96 1 -140 43 224 285 -299 22 154 110 147 87 64 3
7983Co4K35j04J66j50r7P1j53N5j49L83j38r5r3J37Q4n9j91n5J32k7J49k28N42
$$ 3 -61 174 70 236 86 -11 60 -93 -38 -187 196 58 -37 -130 7 91 32 -159 -214 -82 -109 40 -188 354
8007C54m86K29L2o9J7o3K70l18k4j08k2L74k01r0j35N65l68j75M9K33j55l0L18
$$ 354 -132 97 129 60 77 14 284 -34 -58 -166 -188 186 -15 -105 -240 325 -43 -218 -169 64 -91 -121 197
8030A97%l50L62k13q7J85k56q6M97m47M0N0J79P6J4j0k41K95q7J3k46K43k80K79
$$ 197 197 -153 209 -4 -91 94 -162 -248 249 -198 -158 -108 71 147 161 151 -90 205 118 131 -115 128 -152 127
8054A27K4j04R9j55n3J50q9NK08n6o3j68J70r8J41j24j52J74J10m63N26l3m69
$$ 127 151 47 146 -9 -62 88 -1 4 212 156 93 -75 95 -3 138 14 -138 36 146 -317 209 176 -293
8077b93L03N9j91j4J86k49k2N29m13K20j09j67J93r8J36j07j29O2K58k48km5P6
$$ -293 10 69 -122 -136 50 -199 -221 308 -105 115 6 -161 32 -66 70 -37 -166 -104 154 -94 -96 -141 -65
8100f5M3r0J42k05L51j60Pj20J48j78J76R6k5k06L9K3l4J68k92L07j92J44j26
$$ -65 -22 -112 30 -175 176 16 23 -97 51 -127 49 145 120 -86 -47 -24 -58 110 -182 125 -67 77 -49
8123d9P7k47M31m55L63K1J2m64O01l76K4M8J14q4O7j91J41k14K55M3k5N7m03K94
$$ -49 28 -219 212 -243 120 141 153 -311 290 -86 -62 -14 100 16 83 -108 33 -181 74 117 92 149 -254 40
8147D0J80r7L4j50j41K9J43j43o0j0Q2M6J25k41K17q6m0J00L7m8j97J61jQ2j15
$$ 40 220 123 157 7 -134 -105 38 -105 -165 -175 -93 -47 78 -163 54 -32 -72 28 65 17 -180 -19 -20 62 -53
8172e3M47l38L9J26n27M07nK9Mj88J44p4J04k60J23K6k06L32r2
$$ -53 394 56 95 221 -306 101 96 125 129 -59 85 11 115 -145 -22 4 -202 130 38
8191C8
$$ Imaginary data points
##PAGE= N=2
##DATA TABLE= (X++(I..I)), XYDATA
0@%%%%%%%%%%%%%%%Qj6J6j6J6k4L2l2M0m8N6o4P2q7R7j07J23j40J62j84K05k31
$$ 0 0 0 0 0 0 0 0 0 0 0 0 0 0 0 0 8 -8 8 -8 8 -16 16 -16 24 -24 32 -32 40 -47 50 -57 66 -74 88 -96 109 -122
37a22K59k90L23l59L99m43M91n43N98o59P29q05Q86r75J072j180J302j439J595
$$ -122 137 -153 170 -189 210 -233 258 -285 313 -346 383 -422 464 -511 561 -619 683 -756 839
56H39j768J966k196K466k792L187l677M310n162O369q224J1447j8581O2172j2583
$$ 839 -929 1037 -1159 1307 -1485 1702 -1975 2335 -2827 3542 -4682 6765 -11816 50356 37773
71C7773p1877P1279o3859K8497J0972m8729M5306j2074n487L0329m1319J8859
$$ 37773 -34104 37175 -26684 1813 12785 -35944 9362 -2712 -8199 22130 -19189 -330
83c30L01q153K1057j0012P671n457l027J6109j8554P427j5193j483L1084k7522
$$ -330 -29 -8182 12875 2863 10534 5077 2050 18159 -395 7032 -8161 -9644 21440 -6082
97f082N37L940j1806K5453k3768J453J3780j9699K7632j1927p867J8059k5998
$$ -6082 -5545 -1605 -13411 12042 -11726 -10273 3507 -16192 11440 -487 -8354 9705 -16293
110a6293K7079n718k2043L5260l1050P283K4162l7495K3323q326j2151L3380l0086
$$ -16293 10786 5068 -16975 18285 -12765 -5482 18680 -18815 4508 -3818 -15969 17411 -12675
123a2675N159J3779j9838K3154j1197p862J6458j3047J0625m39q675Q670o375
$$ -12675 -7516 6263 -13575 9579 -1618 -9480 6978 -6069 4556 4117 -4558 4112 -2263
136b263P547l244m999Q250r757Q067J12p634R079r655P044M309j2183J1214o998
$$ -2263 5284 2040 -2959 5291 -4466 3601 3713 -3921 5158 -4497 2547 6856 -5327 5887 -1111
151a111K196Q192j4193J0665m285l894J3905j5961O400L741j2390J6459j1209
$$ -1111 1085 9277 -4916 5749 1464 -2430 11475 -4486 1914 5655 -6735 9724 -1485
164a485k379J1850j5177J0874K12j1181J2935q811J873O969j1962P520q25l750
$$ -1485 -3864 7986 -7191 3683 3895 -7286 5649 -3162 -1289 5680 -6282 1238 413 -3337
178c337O410o409J884J287k551L451l580J159k44o89K974m270K737m96j763M645
$$ -3337 3073 -3336 -1452 -165 -2716 735 -2845 -1686 -1930 -2619 355 -3915 -1178 -1674 -3437 1208
194A208m914K359J167l948O128m054o89M935o402N586q20m036O348m950J739L391
$$ 1208 -3706 -1347 -180 -4128 2000 -2054 -2743 2192 -4210 1376 556 -3480 2868 -2082 -343 3048
210C048o430N388j579j588M995n158K316J924l845L987k030j042K767k156J175
$$ 3048 -3382 2006 427 -1161 3834 -1324 992 2916 -929 3058 1028 -14 2753 597 1772
225A772M41j607J585p20J54J80m93j56L0P33q27M0J17j132J349q80n18J349j674
$$ 1772 2213 606 2191 1471 1625 1805 1312 1156 1186 1919 1092 1132 1249 117 1466 586 68 1417 -257
244b57R63J24j905K006j632j32J357k148J221k51p84J510j402L3Q00j211N88J0
$$ -257 706 830 -1075 931 -701 -833 524 -1624 -403 -654 -1438 72 -1330 -1297 -497 -1708 -1120 -1110
262a110q24J089p85K23K29n02Q5N71n54M34L26o44L53K41l81Q32j74k27Q16n20
$$ -1110 -1934 -845 -1630 -1407 -1178 -1680 -1595 -1024 -1578 -1144 -818 -1462 -1109 -868 -1249 -417 -591 -818 -2 -522
282e22M87R9m43P74l46j28R68p92O50K99m79N60n87O21Q7m12N80k88K22J70l29
$$ -522 -35 64 -379 395 49 -79 889 97 747 1046 567 1127 540 1161 1248 836 1416 1128 1350 1520 1191
303A191R2n9q1k1j53M98n23qL26n15M93o39k04M49p31L84j64o40N69n46K93L01
$$ 1191 1283 1224 1143 1122 969 1467 944 936 1262 747 1240 601 397 846 115 499 335 -305 264 -282 11 312
325C12j119O06k60o67Q58m01k9J29q75Q23n73J4J84n08N16j96k70M99n03M21l0
$$ 312 -807 -201 -461 -1128 -270 -671 -700 -571 -1446 -623 -1196 -1182 -998 -1506 -990 -1186 -1456 -957 -1460 -1039 -1069
346a069k98O84o47M05J21j57O30m95J51M14k94P50l12J4K40j16M73k89q6Q96q45
$$ -1069 -1367 -683 -1330 -925 -804 -961 -331 -826 -675 -261 -555 195 -117 -103 137 21 494 205 119 1015 170
367A70M88N47o41P02l96j01P99r98P74k01k74N47l09P3K51m13L30m93J92L42o26
$$ 170 658 1205 564 1266 870 769 1568 570 1344 1143 869 1416 1107 1180 1431 1018 1348 855 1047 1389 763
388G63K42l61j21L85p16K86lk90M46p60J3N9m98N94l83q3q1k41L10l03l02O34
$$ 763 1005 644 523 908 192 478 475 185 631 -129 -116 -57 -555 39 -344 -427 -508 -749 -439 -742 -1044 -410
410d10q17L82j77l85N00q5M5K90n01K28j14Q8K28l03L27M8k49L20j15K76q0J86
$$ -410 -1227 -845 -1022 -1407 -907 -992 -947 -657 -1158 -930 -1044 -956 -728 -1031 -704 -656 -905 -585 -700 -424 -504 -318
432c18j62M40J15k24J14J98j24K28J35k8Q3P6J5J95k33K32Q9P9L1O4J45j44m11
$$ -318 -480 -40 75 -149 -35 163 39 267 402 374 457 533 548 743 510 742 831 910 941 1005 1150 1006 595
455E95M95Q2l03K52m70N5L74l27L1j42j03J04m35M13j94q2j96OJ11l74J55k89
$$ 595 1090 1172 869 1121 651 706 1080 753 784 642 539 643 208 621 427 345 149 155 266 -108 47 -242
477b42o6j08j39N4j55J46j85J7m5l0K60k53k31k46N61l08O9r2m8M50n37K33J59
$$ -242 -308 -416 -555 -501 -656 -510 -695 -678 -723 -753 -493 -746 -977 -1223 -662 -970 -901 -993 -1041 -591 -1128 -895 -736
500g36m53L66J77J36J03j86M8J45J97N%o2M73m3J85R8r5J75m7j83M57J59m1q9
$$ -736 -1189 -823 -646 -510 -407 -593 -545 -400 -203 -198 -198 -260 213 170 355 453 358 533 486 303 760 919 878 789
524G89K43k10mJ76j77L0M1K08M1m80L13j89k42K91k24j8L9p5k5m6l36K25k21R
$$ 789 1032 822 818 994 817 847 888 1096 1137 657 970 781 539 830 606 588 627 552 527 481 145 370 149 158
548A58O2k63j35K98n68J25O4l98K15M6l20k1r8pm3j53K96r5l5J8J66l89L37l18
$$ 158 220 -43 -178 120 -448 -323 -259 -657 -442 -396 -716 -737 -835 -842 -885 -1038 -742 -837 -872 -854 -688 -1077 -740 -1058
572a058J76m8N9L97k97K11Q1j05K25J59l14L82jn1K99J66m4l2j13J70k5k5M51
$$ -1058 -882 -930 -871 -474 -771 -560 -479 -584 -359 -200 -514 -132 -133 -184 115 281 237 205 92 262 237 212 663
595F63o8p1J03Q9j95J37n6K0L7n6L41j43l80L57Po3m4K2q8J60k16J46j58l30J89
$$ 663 595 524 627 716 521 658 602 622 659 603 944 801 421 778 785 722 678 700 612 772 556 702 544 214 403
620D03l47K25K9l59k2O0q2R2m00J95j41q8K3j84J7Rj10L4l0n8L10l97J1K0k19
$$ 403 56 281 310 -49 -71 -11 -93 -1 -401 -206 -347 -435 -412 -596 -579 -570 -680 -646 -676 -734 -424 -821 -810 -790 -1009
645a009L01j26K3J17N3j88J02L55j53J23j68L00n4j44K36K93q8O5j08K62l3r0
$$ -1009 -708 -834 -811 -694 -641 -829 -727 -372 -525 -402 -570 -270 -324 -468 -232 61 -27 38 -70 192 159 69
667F9K70kL70l71K55p9J05N3k24L77l6J60m5N2m31J79J10Q8k50J35p8J1K8j2k04
$$ 69 339 337 707 336 591 512 617 670 446 823 787 947 902 954 523 702 812 900 650 785 707 718 746 734 530
692E30j61qo0p8O9k36r1l7Q5L2Rk44j3l18J81J5O3k92j05N1N8J5o9j37j35J99
$$ 530 369 361 301 223 292 56 -35 -72 13 45 54 -190 -203 -521 -340 -325 -262 -554 -659 -608 -550 -535 -604 -741 -876 -677
718f77l9q7J43q7%K79k40N0P8K3J02R4N4j15P2l2K42K4%J93r9O3J96J60j42J23
$$ -677 -716 -803 -660 -747 -747 -468 -708 -658 -580 -557 -455 -361 -307 -422 -350 -382 -140 -116 -116 77 -22 41 237 397 255 378
744C78j06J07K00mj35N5j6K30L4j72J89p3L8J33o3j96K74j28j70j92K44m4k07
$$ 378 272 379 579 575 440 495 479 709 743 571 760 687 725 858 795 599 873 745 575 383 627 583 376
767C76K20l18K04j49k6p3k78J56n6%n3k95K3m9k5p5Q4L0l49K69j82L3M2k83L38
$$ 376 596 278 482 333 307 234 -44 112 56 56 3 -292 -269 -318 -343 -418 -334 -304 -653 -384 -566 -533 -491 -774 -436
792d36j96J18j06k35K72p1j7q3J57J03P7K90k96l3J51K8n3K18R8j88P3O8J65j20
$$ -436 -632 -514 -620 -855 -583 -654 -671 -754 -597 -494 -417 -127 -423 -456 -305 -277 -330 -112 -14 -202 -129 -61 104 -16
816a6P8P2K42j12m1J84LL6l6M7Q0o2Q6N6N2k42K76k69L38k63L5J02k52q8K16N2
$$ -16 62 134 376 264 223 407 410 446 410 457 537 475 561 617 669 427 703 434 772 509 544 646 394 306 522 574
842E74j64J0k37P4n5M7K1j66j6j01M8j79j29J21J01j69J3k30Q6j08k79K02o7K02
$$ 574 410 420 183 257 202 249 270 104 88 -13 35 -144 -273 -152 -51 -220 -207 -437 -351 -459 -738 -536 -603 -401
866d01k54J88j94J23l1j52J74Nj66Q1K47n0j06k0J50j72J36J08j9N5L38m11L62
$$ -401 -655 -467 -661 -538 -569 -721 -547 -542 -708 -627 -380 -430 -536 -556 -406 -578 -442 -334 -353 -298 40 -371 -9
889iK3q2K64j78L06o3J27k2J11j90K44J51k53k88K89K21m6j20N0K24j15q4P6l00
$$ -9 14 -68 196 18 324 261 388 366 477 287 531 682 429 141 430 651 605 485 535 759 644 560 636 336
913C36J62J83j68k39j12J21j02K7R6o7Q2n3q0j08J09k72j92R9k14K19m8j98K21
$$ 336 498 681 513 274 162 283 181 208 304 237 319 266 186 78 187 -85 -277 -178 -392 -173 -221 -419 -198
936a98l67Q6R0L7j34j75J13p1K28j89P7k40K15k6l8J43n5J6Q3J24j24m4L39l80
$$ -198 -565 -479 -389 -352 -486 -661 -548 -619 -391 -580 -503 -743 -528 -554 -592 -449 -504 -488 -405 -281 -405 -449 -110 -490
960d90J42J74L26l84K37R7j09O3J65J97j09J04l9j2m1m1J06J41o1O4K9K02j50
$$ -490 -348 -174 152 -232 5 102 -7 56 221 418 309 413 374 362 321 280 386 527 466 530 559 761 611
983F11r1pO3k53N1Q6J85l15M2O1q7J6K17r4j98k78M8r8L01N3n08J65nl9k14J3
$$ 611 520 513 576 323 374 460 645 330 372 433 346 362 579 485 287 9 57 -41 260 313 -195 -30 -35 -74 -288 -275
1009b75Q7j09K04j59j4k3n03M72l4l7j98o1l1J10n8J57M9J8K9Lj20Q8qK0J25J75
$$ -275 -188 -297 -93 -252 -266 -289 -792 -320 -354 -391 -589 -650 -681 -571 -629 -472 -423 -405 -376 -373 -493 -405 -413 -393 -268 -93
1035i3l5m1J75K62k97N5j0j25J84l3J2j2R4J15J97P9Mj87J65J37m22K23q7J69
$$ -93 -128 -169 6 268 -29 26 16 -109 75 42 54 42 136 251 448 527 531 344 509 646 224 447 360 529
1059E29mj26J81m78M84j89J74j37o7r1O2q9J89j46k2k23j10M62k83j6j33k72R8
$$ 529 525 399 580 102 586 397 571 434 367 276 338 249 438 292 270 47 -63 399 116 100 -33 -305 -207
1082b07r0j42K15r7J71o6k38J6J96k0m12J55Q7q8MN1K33l86L80O4l79J46R3l01
$$ -207 -297 -439 -224 -321 -150 -216 -454 -438 -242 -262 -674 -519 -432 -520 -516 -465 -232 -618 -238 -174 -553 -407 -314 -615
1106f15N29p9j33L95k55K4j23J48j07K25k26J96J48K45j70L5K41n0j06J13r1P1
$$ -615 -86 -165 -298 97 -158 -134 -257 -109 -216 9 -217 -21 127 372 202 237 478 428 322 435 344 415
1128D15R5j51L54k76M7p7P4k5J74k96J34j09J08L1j0j48n3l3M5k57J46r5k9K12
$$ 415 510 359 713 437 484 407 481 456 630 334 468 359 467 498 488 340 287 254 299 42 188 93 64 276
1152B76k40j04r3k04Q6K31r8j88J10k6j18j39l2K58m3M8j84L75j94k60m5J90Q4
$$ 276 36 -68 -161 -365 -279 -48 -146 -334 -224 -250 -368 -507 -539 -281 -324 -276 -460 -85 -279 -539 -584 -394 -310
1175c10k18J57L6j78J34J2L2J80m6r2J09k52M87J0j52j93J26M12k29Q3N4o9K96
$$ -310 -528 -371 -335 -513 -379 -367 -335 -155 -201 -293 -184 -436 51 61 -91 -284 -158 254 25 108 162 93 389
1198C89k7n1K98n11J29K81j20J65o1j46J47j78J10j04K49l7j1l9k02J13m0j79
$$ 389 362 311 609 98 227 508 388 553 492 346 493 315 425 321 570 533 522 483 281 394 354 175
1220A75R6k13K15k22J56J6j52j38J85j14J46j07L7k82j1J36l92K48k08J23M2k7
$$ 175 271 58 273 51 207 223 71 -67 118 4 150 43 80 -202 -213 -77 -469 -221 -429 -306 -264 -291
1242b91j42M95n14J1n1K15m11L61l1K1k4%J27p8R9N9n3k37K15j59K94%L5O3N5
$$ -291 -433 62 -452 -441 -492 -277 -688 -327 -358 -337 -361 -361 -234 -312 -213 -154 -207 -444 -229 -388 -94 -94 -59 4 59
1267E9j92M26J4k88Q2n7K2R1O5K54k72J07p2J94K3k22O3J83j05Q5N5m7M1j93j91
$$ 59 -133 293 307 19 101 44 66 157 222 476 204 311 239 433 456 234 297 480 375 460 515 468 509 316 125
1292A25J84p7K36j04j22q8m1p7r7J69jk92K75L0j55k71R2j09K9K61j00K3k22J34
$$ 125 309 232 468 364 242 154 113 36 -61 108 107 -185 90 120 -35 -306 -214 -323 -294 -33 -133 -110 -332 -198
1316a98k92K22j60l7J93O9k68J88j25R3p7k94M30J73j38o4k10J62M0J57j90L3
$$ -198 -490 -268 -428 -465 -272 -203 -471 -283 -408 -315 -392 -686 -256 -83 -221 -285 -495 -333 -293 -136 -326 -293
1338b93K6J74Mj27J12R5J18q3J42j31K50j43k31J53J79l7K01j59J06L4l0KM8k43
$$ -293 -267 -93 -89 -216 -104 -9 109 26 168 37 287 144 -87 66 245 208 409 250 356 390 360 362 410 167
1362A67K27K35k14L9k10J85p2k19j1M5O0po7R8l74K65k53o8K20m8q0O9k10Q9J77
$$ 167 394 629 415 454 244 429 357 138 127 172 232 225 158 256 -118 147 -106 -174 46 -2 -82 -13 -223 -134 43
1387D3l18j09Q8Kk7J74J62n15rJ77o0j58K61J27j42j40J36J81q5k07J26Q7q5L02
$$ 43 -275 -384 -296 -294 -321 -147 15 -500 -509 -332 -392 -550 -289 -162 -304 -444 -308 -127 -212 -419 -293 -206 -291 11
1411A1k09j4J13k01J42M35l05O4P2Pj45K37J01l86J16L50k09N3O8k89L43o2K3
$$ 11 -198 -212 -99 -300 -158 277 -28 36 108 115 -30 207 308 -78 38 388 179 232 300 11 354 292 315
1434C15K07l19J59J89k94K6q6P5N9q2k62L42n1j8l3q4P8j62j02K53k98K25j07
$$ 315 522 203 362 551 257 283 197 272 331 249 -13 329 278 260 227 143 221 59 -43 210 -88 137 30
1457C0n9r7j15J86J7m7j53j65J09M0J14j43p4J21n2j28J91l33j3L37j47K90k26
$$ 30 -29 -126 -241 -55 -38 -85 -238 -403 -294 -254 -140 -283 -357 -236 -288 -416 -225 -558 -571 -234 -381 -91 -317
1480c17p6L34j05k45J27K82j86J65K6r3R5J50n6k39M99k29j76J04n6K69k11K07
$$ -317 -393 -59 -164 -409 -282 0 -186 -21 5 -88 7 157 101 -138 361 132 -44 60 4 273 62 269
1502B69j08K20j89k4k46L13J56Jo4k07K84k8j19p6Q2j4r7J3K01j05l26L44k8m2
$$ 269 161 381 192 168 -78 235 391 392 328 121 405 377 258 182 264 250 153 166 367 262 -64 280 252 210
1526B10k41K08q5p7k0q1J58k29l2m3J43J15j39J16k03L01k88j80J34j97J90j40
$$ 210 -31 177 92 15 -5 -86 72 -157 -189 -232 -89 26 -113 3 -200 101 -187 -367 -233 -430 -240 -380
1548c80r7L31p4m2m0K3j91J71j32J83J1J88k75K29L7J70m07P16l09n4p3p9K23
$$ -380 -477 -146 -220 -262 -302 -279 -470 -299 -431 -248 -237 -49 -324 -95 -58 112 -295 421 112 58 -15 -94 129
1571A29O4k4j61J7n1M71k13n0j31L41q3j01o1q8J79N1J08k46J65J02M7j06M3R
$$ 129 193 169 8 25 -26 445 232 182 51 392 309 208 147 59 238 289 397 151 316 418 465 359 402 411
1595D11k32k6K28j11j67J12j49j23J02k4J44l93J71l1J5j66k0K99k22j97J37J86
$$ 411 179 153 381 270 103 215 66 -57 45 21 165 -228 -57 -88 -73 -239 -259 40 -182 -379 -242 -56
1617e6k49j2K29j63k8j40L75o8K2k82L66ok61j5J64l00R9K07J95k22J8J26j92
$$ -56 -305 -317 -88 -251 -279 -419 -44 -112 -90 -372 -6 -12 -273 -288 -124 -424 -325 -118 77 -145 -127 -1 -193
1640a93R9M8j98L01j77K22L8MJ22k8o4J07N3j63O2j8J23k87K59m8J86k92n1L15
$$ -193 -94 -46 -244 57 -120 102 140 144 266 238 174 281 334 171 233 215 338 51 310 262 448 156 105 420
1664D20j80m6K00l98L18q9Oj03O1K40k99Q5k87J39j9o3M82l97k07K67rj9j17j58
$$ 420 240 194 394 -4 314 225 231 128 189 429 130 215 -72 67 48 -15 467 70 -137 130 121 102 -15 -173
1688a73j23J19j34K75k70J12n3J46k07k4J63k30r2L21p4P8k11K22j28n8J35K8
$$ -173 -296 -177 -311 -36 -306 -194 -247 -101 -308 -332 -169 -399 -491 -170 -244 -166 -377 -155 -283 -341 -206 -178
1710a78p8J47r1K89J40m53K38J58J43m47R6K30k35M43Mm36L44k13Q0j7P7K19k7
$$ -178 -256 -109 -200 89 229 -224 14 172 315 -132 -36 194 -41 402 406 -30 314 101 181 164 241 460 433
1733D33j20q8n0j55J78J21p1j35P7%R3j44L0o9L19k92Q9k89J43j87N11k22l6k34
$$ 433 313 225 175 20 198 319 248 113 190 190 283 139 169 100 419 127 216 -73 70 -117 394 172 136 -98
1757i8R3P6j57p9l8J78j98J78J82o46J75P5J1J24p4o9or6j02J52K38j74j49J50
$$ -98 -5 71 -86 -165 -203 -25 -223 -45 137 -509 -334 -259 -248 -124 -198 -267 -273 -369 -471 -319 -81 -255 -404 -254
1781b54L11m11J19K5jJ62m3k1p5pR0J22n9O4r3J80m7j49J52j73M36j89M7J55j84
$$ -254 57 -354 -235 -210 -211 -49 -92 -113 -188 -195 -105 17 -42 22 -71 109 62 -87 65 -108 328 139 186 341 157
1806A57j66L01M9J1j70O7p0Q0k4J62Rk23j9k20K43r7J02j34j36K29j01Q4P3j42
$$ 157 -9 292 341 352 182 249 179 259 235 397 406 183 164 -56 187 90 192 58 -78 151 50 134 207 65
1830F5k4oj18n9K53j21l7k73J54J80n9n5l5n8O4j94K87o4r3j18R4O2K2K15m65
$$ 65 41 35 -83 -142 111 -10 -47 -320 -166 14 -45 -100 -135 -193 -129 -323 -36 -100 -193 -311 -217 -155 -133 82 -383
1855c83P0J90J06k53P7J24j39k0J92j30J05J23M3K3k11K92Jk03L6j08P1K08j75
$$ -383 -313 -123 -17 -270 -193 -69 -208 -228 -36 -166 -61 62 105 128 -83 209 210 7 43 -65 6 214 39
1878C9J38M7J42j77J26l0j95L67l20Q4M2k59L18N1j88J8j2M8P1m55M59j75K9k23
$$ 39 177 224 366 189 315 285 90 457 137 221 263 4 322 373 185 203 191 239 310 -145 314 139 168 -55
1902e5j07L56k21n2K04nk31l3M9q7J25mk92L50j09O0j42Q0n1O3Q1l03K50k54L10
$$ -55 -162 194 -27 -79 125 120 -111 -144 -95 -182 -57 -61 -353 -3 -112 -52 -194 -114 -165 -102 -21 -324 -74 -328 -18
1927a8k3m86K49n8J24K25n1k15K0L2J17j51L92l01M0M1Q6mo6Q2Q2j33J13J87j12
$$ -18 -41 -527 -278 -336 -212 13 -38 -253 -233 -201 -84 -235 157 -144 -104 -63 23 19 -47 35 117 -16 97 284 172
1952A72l72L25J43k56N3J75j74K42k05K61j50R5J1O1k32j54J25K71k44P8j13j9
$$ 172 -200 125 268 12 65 240 66 308 103 364 214 309 320 381 149 -5 120 391 147 225 112 93
1974I3k03MJ75J3J70l75N75k90j31M7p7J28J0O4k41n9OJ56l42K1K0L64l15P2j19
$$ 93 -110 -106 69 82 252 -123 452 162 31 78 1 129 139 203 -38 -97 -91 65 -277 -256 -236 128 -187 -115 -234
1999b34l86K87J78n1J08j02j67R0O7L1k7R5k3J13k94L16k17J47M2k23K39j01Q9
$$ -234 -620 -333 -155 -206 -98 -200 -367 -277 -210 -179 -206 -111 -134 -21 -315 1 -216 -69 -27 -250 -11 -112 -23
2022b3M8O5k26K03j69J02J12m12L14J29j49K27j64K30j68J0L04k47j56K23r9J9
$$ -23 25 90 -136 67 -102 0 112 -300 14 143 -6 221 57 287 119 129 433 186 30 253 154 173
2044A73j68K66k0l7J22j05L7q3j41L3J44l20M7J99l20m0RJ37J59k8n1Ok71K78
$$ 173 5 271 251 214 336 231 268 185 44 77 221 -99 -52 147 -173 -213 -204 -67 92 64 13 19 -252 26
2068B6l70K56j80J20j21J13p4K87j66j94K47rj85k6K36k37K00j02j6jJ20n6n7
$$ 26 -344 -88 -268 -148 -269 -156 -230 57 -109 -303 -56 -65 -250 -276 -40 -277 -77 -179 -195 -196 -76 -132 -189
2091a89K56n7j84K17j80K14J62nk26K50k14q4M4P6m2j55N54m14K11o8j16M76l08
$$ -189 67 10 -174 43 -137 77 239 234 8 258 44 -40 4 80 38 -117 437 23 234 166 50 526 218
2114B18j28RK06k66K18K50k95mR7l96K11J75j14j10J21Q7k16q5K9J60k95k9K28
$$ 218 90 99 305 39 257 507 212 208 305 -91 120 295 181 71 192 279 63 -22 7 167 -128 -157 71
2137G1P7Q5l80p7L99l07K43j08l41K14J57j13j34L07j54P9l21L36l74K28l07K60
$$ 71 148 233 -147 -224 175 -132 111 3 -338 -124 33 -80 -214 93 -61 18 -303 33 -341 -113 -420 -160
2159a60K24k15n6O0J58J18k89Q5J60j4p8j24K83l85J88k03K72J70k1Qm2j25O1
$$ -160 64 -151 -207 -147 11 129 -160 -75 85 71 -7 -131 152 -233 -45 -248 24 194 173 181 139 14 75
2182G5J39J17K0j65k99M74o8J4j94J07R6l86K48k7N0j85M4n2J04L5j1K58n42J1
$$ 75 214 331 351 186 -113 361 293 307 113 220 316 -70 178 151 201 16 60 8 112 147 136 394 -148 -137
2206a37J21k8J38N9m35K71J06j78K00l05R8k8N0QJ3k13J50P3M0j43j56O3l1J2
$$ -137 -16 -44 94 153 -282 -11 95 -83 117 -188 -90 -118 -68 -60 -47 -260 -110 -37 3 -140 -296 -233 -264 -252
2230b52m9J62J21j41JP1j21Q0J08n7k66L31lRJ21m0r1O2L21l84J40Q3o5j11K14
$$ -252 -301 -139 -18 -159 -158 -87 -208 -128 -20 -77 -343 -12 -15 -6 115 75 -16 46 367 -17 123 206 141 30 244
2255B44r0o7J3p3M25j83l59K82J69o5k01P8J5K9o1L7r7R5J35l16J9K8p9M28m02
$$ 244 154 87 100 27 452 269 -90 192 361 296 95 173 188 217 156 193 96 191 326 10 29 57 -22 406 4
2280DP5N3j26r2M6J64k89J53K33l86K52l15J28R8k42J23J54p0j62J68k1j5k47
$$ 4 79 132 6 -86 -40 124 -165 -12 221 -165 87 -228 -100 -2 -244 -121 33 -37 -199 -31 -52 -67 -314
2303c14J57j10J76j28q2J48Q7J19k12K44k62p7Q3J33m3KJ91j42n3M2J12M3j98
$$ -314 -157 -267 -91 -219 -301 -153 -66 53 -159 85 -177 -254 -171 -38 -81 -79 112 -30 -83 -41 71 114 -84
2326h4K94J8j74K73m34N03r9k73J23j65R0Q2K0L1j77Q0O0K70k72m7J21k43K50
$$ -84 210 228 54 327 -107 396 297 24 147 -18 72 154 174 205 28 108 168 438 166 119 240 -3 247
2349B47p8j62r5K68k79J05j14%M3L81m09L22k15L8j75J60J6k97K4j2K15L8j64
$$ 247 169 7 -88 180 -99 6 -108 -108 -65 316 -93 229 14 52 -123 37 53 -244 -220 -232 -17 21 -143
2372a43J55j62k0o3q9j87K30K04k6j7l0l3J4p7J55Kj07J52J3O7j54J94l41K45
$$ -143 12 -150 -170 -233 -322 -509 -279 -75 -101 -118 -148 -181 -167 -244 -89 -87 -194 -42 -29 38 -116 78 -263 -18
2396a8o7jK50k71J93J11J23k38J01m9k15L97n16M92j99J30K9k87K85pj40j95N3
$$ -18 -85 -86 164 -107 86 197 320 82 183 134 -81 316 -200 292 93 223 252 -35 250 243 103 -92 -39
2419c9j20K31r9J08J42j53j35RJ83m3q0m7K75j72k6m6q5O3P8o0j16K22k69Q9j02
$$ -39 -159 72 -27 81 223 70 -65 -56 127 84 4 -43 232 60 34 -12 -97 -34 44 -16 -132 90 -179 -90 -192
2444a92R9q8NJ29Q9m28J77J79k87K34J13k2j01n5J8J49j42j2J41j00K16k69N4
$$ -192 -93 -181 -176 -47 42 -386 -209 -30 -317 -83 30 8 -93 -148 -130 19 -123 -135 6 -94 122 -147 -93
2467i3N1q1L1J55j46K48j78j71M18r9Qk08K37k91L14r3k2o4pM2L41l08P3qJ87
$$ -93 -42 -123 -92 63 -83 165 -13 -184 234 135 143 -65 172 -119 195 102 80 16 9 51 392 84 157 149 336
2492C36k73L6M3K06p3l01o9K84k33MJ47j78L39o3j86R3R5k44j62J36mL0K2J2n4
$$ 336 63 99 142 348 275 -26 -95 189 -44 -40 107 -71 268 205 19 112 207 -37 -199 -63 -67 -37 -15 -3 -57
2517e7K9j83J42o5K3J39k76M22j18m66L03n7J11L5K49l12j33J49Kj93L52k95m3
$$ -57 -28 -211 -69 -134 -111 28 -248 174 56 -410 -107 -164 -53 -18 231 -81 -214 -65 -63 -256 96 -199 -242
2540b42m8K64q0j2J16j44K28k02K77J9j96J95m6K77l17L4l9J10k14nJ08k29L15
$$ -242 -290 -26 -106 -118 -2 -146 82 -120 157 176 -20 175 129 406 89 123 84 194 -20 -25 83 -146 169
2563A69K2M9k14O1k19L47Q2j05k74R2j73J81k80K82O0L5Oj51L61m10r0R6l6J01
$$ 169 191 240 26 87 -132 215 297 192 -82 10 -163 18 -262 20 80 115 121 -30 331 -79 -169 -73 -109 -8
2587hN5k42R8J50P0j88R5j63R0m0J34K2j75J56Kj54K21k56J61r0q0N4j62J51m3
$$ -8 47 -195 -97 53 123 -65 30 -133 -43 -83 51 73 -102 54 56 -98 123 -133 28 -62 -142 -88 -250 -99 -142
2612a42m8m1K13j08R4Q5j91K7l2K99j31p6J93q8P9j91L30j8J06j08M7j11m2K09
$$ -142 -190 -231 -18 -126 -32 53 -138 -111 -143 156 25 -51 142 54 133 -58 272 254 360 252 299 188 146 355
2636C55k33J17k30nM35l01N8J29o0j90o8m5p0J32n9J16k76L93mk89K45j8k69N5
$$ 355 122 239 9 4 439 138 196 325 265 75 7 -38 -108 24 -35 81 -195 198 194 -95 150 132 -137 -82
2660h2p5J33j82L22n8k83J00Nj31L88j16J3j61n3K33l11J10r8r8P6K13o9m8RM10
$$ -82 -157 -24 -206 116 58 -225 -125 -120 -251 137 21 34 -127 -180 53 -258 -148 -246 -344 -268 -55 -124 -172 -163 247
2685B47j47j23M8J42l59L76k49j57J86j77L1j76M24l2m6r0K06j05J02Nk69M08
$$ 247 100 -23 25 167 -192 184 -65 -222 -36 -213 -182 -358 66 34 -12 -102 104 -1 101 106 -163 245
2707B45k21N6R6m5n9j8l0M06k34j11K56k62L72p2l54K38k57m7M8L05j19r1K7j83
$$ 245 24 80 176 131 72 54 24 430 196 85 341 79 451 379 25 263 6 -41 7 312 193 102 129 -54
2731e4K32k52K19j74k9J43J94m86K95r5m7j87K01jk7j85J86Q5n6J58l50K22m29
$$ -54 178 -74 145 -29 -58 85 279 -207 88 -7 -54 -241 -40 -41 -68 -253 -67 18 -38 120 -230 -8 -437
2754d37N29P2n34L56J7O2p8Lrj71O0J6r2L28j69r9J20P8j02KJ18j56j22J47m6
$$ -437 92 164 -370 -14 3 65 -13 -10 -19 -190 -130 -114 -206 122 -47 -146 -26 52 -50 -48 70 -86 -208 -61 -107
2779a07J37J36j20J72k75K11j66k45L94jj50Lq1L36N3l63Q6K85j39P0k50k01K92
$$ -107 30 166 46 218 -57 154 -12 -257 137 136 -14 -11 -92 244 297 -66 20 305 166 236 -14 -215 77
2802G7Kj74K37M3o9p1J96m23L49j48r0n4J12j5j21K46o0k4m3j23J46J40j05l55
$$ 77 79 -95 142 185 116 45 241 -182 167 19 -71 -125 -13 -28 -149 97 37 13 -30 -153 -7 133 28 -327
2826c27J68J37j09L21j82k12L10l14J08O6k0k20q8K70K98p6j4p9o9k8J22k3j19
$$ -327 -159 -22 -131 190 8 -204 106 -208 -100 -34 -54 -274 -362 -92 206 130 116 37 -32 -60 62 39 -80
2849h0J43j25J56o9j24P3L27j23k2k19J78J19l23K27J60k83O8J41O9l33P1L04
$$ -80 63 -62 94 25 -99 -26 301 178 156 -63 115 234 -89 138 298 15 83 224 293 -40 31 335
2871C35k71q6k3K89n0L1j95Q5r7K3NK0J56l03N9Mp1K13l7j25j89Q5K48k08j06
$$ 335 64 -22 -45 244 194 225 30 115 18 41 46 66 222 -81 -22 -18 -89 124 87 -38 -227 -142 106 -102 -208
2896b08J78j51M9n5j44L60k27J01k26J00K18l0J70lk21K0p8R7q2LPj34K39P5r0
$$ -208 -30 -181 -132 -187 -331 29 -198 -97 -323 -223 -5 -35 135 132 -89 -69 -147 -50 -132 -129 -122 -256 -17 58 -32
2921c2pJ11K2R7l00k2Q3n7j2K76n9N6j06L8Q7j98J52K4Jk3K67k96k31K38L2j19
$$ -32 -39 72 94 191 -109 -131 -48 -105 -117 159 100 156 50 88 175 -23 129 153 154 131 398 102 -129 109 141 22
2947B2J2O8P8r7j68K28l29K38j11J99O4k96J45J36m04L93r8j56J86j83r0J55k59
$$ 22 34 102 180 83 -85 143 -186 52 -59 140 204 -92 53 189 -215 178 80 -76 110 -73 -163 -8 -267
2970b67K84Q7k51P7K41l47P3K04m84K23n8L3K6K78k82m2QL26k66M9K6M0j35L29
$$ -267 17 104 -147 -70 171 -176 -103 101 -383 -160 -218 -185 -159 119 -163 -205 -197 129 -137 -88 -62 -22 -157 172
2994A72l41O9J19o7k2K79m34N5K80L80m39r5j64K80j43J04P1k43K71k66K13qj61
$$ 172 -169 -100 19 -48 -70 209 -225 -170 110 490 51 -44 -208 72 -71 33 104 -139 132 -134 79 71 -90
3017i0K47J24j75j5J39j25k65L58j65qm2Q1rJ79j84L44l04j7o8Q2j23l2j7R6l35
$$ -90 157 281 106 91 230 105 -160 198 33 25 -17 64 55 234 50 394 90 73 5 87 -36 -68 -85 11 -324
3042c24J66K16K14l53N7p4Q4k30M7R1q3J81j85J09j8K9r8J52kj4m5N4j35N4k6
$$ -324 -158 58 272 -81 -24 -98 -14 -244 -197 -106 -189 -8 -193 -84 -102 -73 -171 -19 -21 -35 -80 -26 -161 -107 -133
3067a33M9Q9J00K7l48L25k01J58R9k92N8J14J42k83K11J20k17O0r8K19l40K80
$$ -133 -84 5 105 132 -216 109 -92 66 165 -127 -69 45 187 -96 115 235 18 78 -20 199 -141 139
3089A39N4j65J10j86N4L4P3j00J52n5l6Jj20j55L62K23j53j25j4r0l8lj20J14
$$ 139 193 28 138 -48 6 40 113 13 165 110 74 75 -45 -200 162 385 232 107 93 3 -35 -38 -158 -44
3113d4k3k25L76j9p5r0MK5J29j64N7J76j21o6M0J7j13j5K2J74l62J18L01k74K26
$$ -44 -67 -292 84 65 -10 -100 -96 -71 58 -106 -49 127 6 -60 -20 -3 -116 -131 -109 65 -297 -179 122 -152 74
3138G4k80J66J28j61K5j81K23r5j97L37j93J80k60K51Q0N6j34J6k06K75j34J50
$$ 74 -206 -40 88 -73 -48 -229 -6 -101 -298 39 -154 26 -234 17 97 153 19 35 -171 104 -30 120
3160A20j45L8K96k17j05J91p5O8j48K73k44l3J63j63j00Q1q0Kk8J06O6l1K5O7
$$ 120 -25 13 309 92 -13 178 103 171 23 296 52 19 182 19 -81 0 -80 -78 -106 0 66 35 60 127
3184A27J24k45k01L3K6J57j00L6Q6j58p9K18n5j29n5l9K17K50j18j37o8K45m27
$$ 127 251 6 -195 -162 -136 21 -79 -43 43 -115 -194 24 -31 -160 -215 -254 -37 213 95 -42 -110 135 -292
3207b92J8Om5M47j63k88J77J36l31L20O4J29j81P1l04J04q4K7R9K76j38L6J86
$$ -292 -274 -268 -313 134 -29 -317 -140 -4 -335 -15 49 178 -3 68 -236 -132 -216 -189 -90 186 48 84 270
3230B70k38Q9o7j5R0O0m32J95K43j41o0j2k9L97k49K0j52P1J30K0j94M8K22k6
$$ 270 32 121 54 39 129 189 -243 -48 195 54 -6 -18 -47 350 101 121 -31 40 170 190 -4 44 266 240
3254B40j69rJ33q1l8j19J21n0J94l75J50j02N5K37l48L57k87Kj24l2O5J28j81
$$ 240 71 62 195 114 76 -43 78 28 222 -153 -3 -105 -50 187 -161 196 -91 -89 -213 -245 -180 -52 -233
3277b33J19j4K2j7q7K93k41J94j57R8k84L33j21J49K82m04M8j33lL33m07J38N3
$$ -233 -114 -128 -106 -123 -210 83 -158 36 -121 -23 -307 26 -95 54 336 -68 -20 -153 -156 177 -230 -92 -39
3300c9j8R4pk8J12M9l4p9J58o6J87k99j14J16K02j36p3Q0j07O4j47J24J23j89
$$ -39 -57 37 30 2 114 163 129 50 208 142 329 30 -84 32 234 98 25 105 -2 62 -85 39 162 -27
3324b7j10K01j41M6J54j38M2P2j60L00k11M6j15M5J07j59j59J46k0J49k02J04
$$ -27 -137 64 -77 -31 123 -15 27 99 -61 239 28 74 -41 4 111 -48 -207 -61 -81 68 -134 -30
3346c0K9k67Q4J94J09k06R3j57P9q4P8q9J74K2k5K16l20J91l2j60K13j76J08k60
$$ -30 -1 -268 -184 10 119 -87 6 -151 -72 -156 -78 -167 7 29 4 220 -100 91 59 -101 112 -64 44 -216
3370b16J85J14j83q9L76m10R0P4J21p5q1K58Q8k03J22j48j25L28j75m7J30J30
$$ -216 -31 83 -100 -189 187 -223 -133 -59 62 -13 -94 164 252 49 171 23 -102 226 51 4 134 264
3392B64K1j64k62K10r3M1K93n8j33P4n8j24K3l2m6J41k07M37Jl99J71j47M1N8
$$ 264 285 121 -141 69 -24 17 310 252 119 193 135 11 34 2 -44 97 -110 327 328 -71 100 -47 -6 52
3416E2n9R2j40J62j12K7KP5k00J90Q0l08PK02N3k6lj49lk5O0j61P2R2o9K57k61
$$ 52 -7 85 -55 107 -5 22 24 99 -101 89 169 -139 -132 70 123 97 94 -55 -58 -83 -23 -184 -112 -20 -89 168 -93
3443i3o1J55p1K04j99J60l43L75j04j56R7O2J5J10j92J26Q4k93L83J0k40k26L81
$$ -93 -154 1 -70 134 -65 95 -248 127 23 -133 -36 26 41 151 -41 85 169 -124 259 269 29 -197 184
3466A84k42J17n3J07r5p3L0L02k74J49o9j62Q3J30l15J80K09k78L55k20j75P5
$$ 184 -58 59 6 113 18 -55 -25 277 3 152 83 -79 4 134 -181 -1 208 -70 285 65 -110 -35
3488c5p8K90j35j05J00J66k22K6j37J08L1j37m8R4O2O3j5q2J31j3r1j9l8J92m0
$$ -35 -113 177 42 -63 37 203 -19 7 -130 -22 9 -128 -176 -82 -20 43 28 -54 77 64 -27 -46 -84 108 68
3513F8j26j07J01N7j10M21p73O25j48K3n6j61J60k30J20J42L7j15J90p2L4J3k00
$$ 68 -58 -165 -64 -7 -117 304 -469 156 8 31 -25 -186 -26 -256 -136 6 43 -72 118 46 80 93 -107
3536a07J70k44J38K23J0k01j00K97p3J1K4k10L85j61k14J42k00J54j66Q8J43k91
$$ -107 63 -181 -43 180 190 -11 -111 186 113 124 148 -62 323 162 -52 90 -110 44 -122 -34 109 -182
3558a82J98J36J26k26l1j64l7P0L02l09J43k62L00j80P7j62Q0J27J88k86l4J56
$$ -182 16 152 278 52 21 -143 -180 -110 192 -117 26 -236 64 -116 -39 -201 -121 6 194 -92 -126 30
3580C0k27K23K8j12p2M7l4K08q4j07L04k98P5O1k59L76J64%n62M59l96J23K82
$$ 30 -197 26 54 -58 -130 -83 -117 91 7 -100 204 -94 -19 42 -217 159 323 323 -239 220 -176 -53 229
3603B29k29K76l35KMR3K9k05J01R6k3j91J42J32J4K17k93J45j82M4J50k76k2J71
$$ 229 0 276 -59 -57 -53 40 69 -136 -35 61 38 -153 -11 121 135 352 59 204 22 66 216 -60 -82 89
3627H9j71R2J69r2j22P6M8r8j39L90j24j34n5j00J03Q1Q5q5j86K46j68j0J91k91
$$ 89 -82 10 179 87 -35 41 89 -9 -148 242 118 -16 -71 -171 -68 13 98 13 -173 73 -95 -105 86 -205
3651b05L73j41j69K27k58J43k86J60J20o0L12k70j05K52q6k6%m1Q3k0p6j9rN5
$$ -205 168 27 -142 85 -173 -30 -316 -156 -36 -96 216 -54 -159 93 7 -19 -19 -60 23 3 -73 -92 -101 -46
3675d6k4K35j71K83k01K01j76l42K07K06o8nn6K6J05j29N3j00l1l3%J26k63M56
$$ -46 -70 165 -6 277 76 277 101 -241 -34 172 104 99 43 69 174 45 98 -2 -33 -66 -66 60 -203 253
3699B53k28M2j75J06K32k52K33l63K79J1j91O4J50j76QK58Pm47K12j82J5J69j02
$$ 253 25 67 -108 -2 230 -22 211 -152 127 138 -53 11 161 -15 -7 251 258 -189 23 -159 -144 25 -77
3722g7K73l30K3J37l14K18K4J51j94L3M5j06R8k93M31k96K21j28O3Q8j42J69k54
$$ -77 196 -134 -111 26 -288 -70 -46 105 -89 -56 -11 -117 -19 -312 119 -177 44 -84 -21 67 -75 94 -160
3745a60M3J31k85L93j09k20o6M09P7l15J84o0R5j34J15j54J34n0J20j72K49l26
$$ -160 -117 14 -271 122 13 -207 -273 136 213 -102 82 22 117 -17 98 -56 78 28 148 -24 225 -101
3767a01M0J05L2n3K75o7j83P3N4j46K6J55Ol03j2N1L80K7l64k12O4L19k43J88
$$ -101 -61 44 76 23 298 231 48 121 175 29 55 210 216 -87 -99 -48 332 359 -5 -217 -153 166 -77 111
3791A11j61j88K55j61L6J0J01P2L7l44J20J9j69J85j61K95j22j03J99j80J81M4
$$ 111 -50 -238 17 -144 -108 -98 3 75 112 -232 -112 -93 -262 -77 -238 57 -65 -168 31 -149 32 76
3813G6r3j01L14n8p0j57JJ04r0l8j75M27n6k49J80n2J62k02J52M1o8q0J1k8q2
$$ 76 -17 -118 196 138 68 -89 -88 16 -74 -112 -287 140 84 -165 15 -37 125 -77 75 116 48 -32 -21 -49 -131
3838a31K48J6P9m7L9k74l6P8n6J85j35L5j1O8r7J05K3j84oK17k64J38K66l33J45
$$ -131 117 133 212 165 204 -70 -106 -28 -84 101 -34 1 -10 58 -39 66 89 -95 -101 116 -148 -10 256 -77 68
3863F8j8j61P7K68m55R3J39j69J50q0Mj79K64l4J11P9m31M14J66k81P3k18K20
$$ 68 50 -111 -34 234 -221 -128 11 -158 -8 -88 -84 -263 1 -33 78 157 -274 140 306 25 98 -120 100
3886A00j37n9K46l75L39j17M0k50k0K31L3q9q4J78j77j55L10R3k60J89l1Mr0J37
$$ 100 -37 -96 150 -225 114 -3 37 -213 -233 -2 31 -58 -142 36 -141 -296 14 107 -153 36 5 9 -81 56
3910E6l36L21p5J32Oj27J23j88K82j09j43J63m7Q9q8L13m60K77oL6l40K03R9j79
$$ 56 -280 41 -34 98 104 -23 100 -88 194 85 -58 105 58 147 59 372 -88 189 183 219 -121 82 181 2
3934BK51j95j25K07j66K07k66Q0K40k67o1pL5K58r9j40L9J83k28l4J87k93J23
$$ 2 253 58 -67 140 -26 181 -85 -5 235 -32 -93 -100 -65 193 94 -46 -7 176 -52 -86 101 -192 -69
3957f9J57j76n5L18m67J23L44k42r9Q9L7j58J31N7k12K05j12J83r7n1l8K15r3
$$ -69 88 -88 -143 175 -292 -169 175 -67 -166 -77 -40 -198 -67 -10 -222 -17 -129 54 -43 -94 -132 83 -10
3980a0J33M3j87J04P1m4K4j1p2j73Q0K11k46J25k01L50j37j04N2J22j58R9L0K8
$$ -10 123 166 -21 83 154 110 134 123 51 -122 -42 169 -77 48 -153 197 60 -44 8 130 -28 71 101 129
4004A29k05j0J2j26M27j35k00p9L18j31N4K78m60K56m1j16O4l21M85j95J02m9
$$ 129 -76 -86 -74 -200 227 92 -108 -187 131 0 54 332 -128 128 87 -29 35 -286 199 4 106 57
4026E7m35K64J27r3J59j69O9K5Q4M4j73m0q1J73O9j39o4J82k03l4r1J86K0j18
$$ 57 -378 -114 13 -80 79 -90 -21 4 88 132 -41 -81 -162 11 80 -59 -123 59 -144 -178 -269 -83 -63 -181
4050a81J7M17p3l06J14J76j67k0j00n8M5K13k30J03L04m62L41k01J28m7J78j04
$$ -181 -164 253 180 -126 -12 164 -3 -23 -123 -181 -136 77 -153 -50 254 -208 133 -68 60 13 191 87
4072H7J8J35l90K01k36K44J9n3O5n2J8k16K55J8p9P8o8k05K63k85N7L12l81L34
$$ 87 105 240 -150 51 -185 59 78 25 90 38 56 -160 95 113 34 112 44 -161 102 -183 -126 186 -195 139
4096A39p2k02J37q5P1J8J06J36k31J16l53K99P4q4j22j80J74M5J8j04L0K76k87
$$ 139 67 -135 2 -83 -12 6 112 248 17 133 -220 79 153 69 -53 -233 -59 -14 4 -100 -70 206 -81
4119h1K6O6o4l0K80k10r4O1j33J97k97L98j7l21N4o5N3K91k25J7J65j4k2N3N8
$$ -81 -55 11 -53 -83 197 -13 -107 -46 -179 18 -279 119 102 -219 -165 -230 -177 114 -111 -94 71 57 35 88 146
4144A46j06Q8NJ41k05J30m02L28j95J59j10j26K97r7L4J04J55j56k32OO4j54L64
$$ 146 40 128 133 274 69 199 -203 125 -70 89 -21 -147 150 53 87 191 346 190 -42 -36 28 -126 238
4167B38m8j50k91L63j34K2nk2l7j09J0R3J1P9J11m19K18J09J67k93J32k5m9J17
$$ 238 190 40 -251 112 -22 0 -5 -27 -64 -173 -163 -70 -59 20 131 -288 -70 39 206 -87 45 20 -29 88
4191H8j64k7J36o7J46j61J23j75P3L8J10J07l60j21P6K19M0k35L01l67J3K47j69
$$ 88 -76 -103 33 -34 112 -49 74 -101 -28 10 120 227 -133 -254 -178 41 81 -154 147 -220 -207 40 -129
4214a29J59k3P3j02P5J1k43K13N5r8K24nj03J13k16QK06j58J51k58J69p5O0k98
$$ -129 30 7 80 -22 53 64 -179 34 89 -9 215 210 107 220 4 12 218 60 211 -47 122 47 107 -191
4238a91J22O7j76O5N1k3m7J87J66k28j40J90l6J78j17k28J44J36k82J0R6K9K39
$$ -191 -69 -2 -178 -113 -62 -85 -132 55 221 -7 -147 43 7 185 68 -160 -16 120 -162 -152 -56 -27 212
4261B12j39k12J31L2N9j19Q9k64l2J88K63k23p4J83j45J31k00n1K25k5O6j16K49
$$ 212 73 -139 -8 24 83 -36 53 -211 -243 -55 208 -15 -89 94 -51 80 -120 -171 54 29 95 -21 228
4284B28l10J25k9l7k0k7R3J38k38OJ07r9K84j48M5j57K73k01K3R6j33k9J88j8
$$ 228 -82 43 14 -23 -43 -70 23 161 -77 -71 36 -63 221 73 118 -39 234 33 56 152 19 -10 178 160
4308A60k6j19J71l5k26J01P7k03J04Q3j51j33M92m44J37L8j14j11P0J96j00k51
$$ 160 134 15 186 151 -75 26 103 -100 4 87 -64 -197 295 -149 -12 26 -88 -199 -129 67 -33 -284
4330b84L00k9l9k3m6J46J82j03l53J70j18M6J63l7O7R3r4L8Np6j14J08l5P6q7
$$ -284 16 -13 -52 -75 -121 25 207 104 -249 -79 -197 -151 12 -25 42 135 41 79 84 8 -106 2 -33 43 -44
4355d4K36k00P9k04L7pL3K68j94q5M5P7r9R6K24l00N3J16p2K9n9J88p5k06J98
$$ -44 192 -8 71 -133 -96 -103 -70 198 4 -81 -36 41 -58 38 262 -38 15 131 59 88 29 217 142 -64 134
4380A34m0J2q0Q7o8k0r6M0R4j52J65k32l9K18M9J35j94k71K03j48M01j81j8mM8
$$ 134 94 106 26 113 45 25 -71 -31 63 -89 76 -156 -195 23 72 207 13 -258 -55 -203 198 17 -1 -5 43
4405D3j69K09j8k55J34L9k46J90K77m33K66j11K8K68j94k52p8L04J58j03k24R8
$$ 43 -126 83 65 -190 -56 -17 -263 -73 204 -229 37 -74 -46 222 28 -224 -302 2 160 57 -167 -69
4427f9m6jJj3J03J04J3q7M9n1m2N9j2R4N0m5j16R7k00K12j49K05j03j38K23k99
$$ -69 -115 -116 -115 -128 -25 79 92 5 54 3 -39 20 8 102 152 107 -9 88 -112 100 -49 156 53 -85 138 -161
4453a61L36j63P1P7o2j23P7J66j27p1QL6k22O3J35k61J08j33K01j46L68J1k13
$$ -161 175 12 83 160 98 -25 52 218 91 20 28 64 -158 -95 40 -221 -113 -246 -45 -191 177 188 -25
4476b5m1j08K63n9j72nLJ54m9o6m6j12M07j57j7r0K82j40k22J39K4Pj44R0K19
$$ -25 -66 -174 89 30 -142 -147 -144 10 -39 -105 -151 -263 144 -13 -30 -120 162 22 -200 -61 -37 -30 -174 -84 135
4501A35k18o6m0K86l42K46N9K9j08J68L5R7k44Lq7K34l14J36O7Q0O0j68OJ84j94
$$ 135 -83 -149 -189 97 -245 1 60 89 -19 149 184 281 37 40 -47 187 -127 9 76 156 216 48 54 238 44
4526D4k73K71K3j49n4L05m9q5m1J47k31j3L9J02n2L7P4q0j67j89N10l09J05q0
$$ 44 -229 42 65 -84 -138 167 118 33 -8 139 -92 -105 -66 36 -16 21 95 15 -152 -341 169 -140 -35 -115
4550a15J32n6j01K93j74J14p3m2K02k40L76k64o0J23k34J12Q5o8p0j46K57j26
$$ -115 17 -39 -140 153 -21 93 20 -22 180 -60 316 52 -8 115 -119 -7 78 10 -60 -206 51 -75
4572g5J00N8k58J03j02J02K30j23o4K0Q1m1J95l24K23l54Q3K23r1Lj69K11M2j42
$$ -75 25 83 -175 -72 -174 -72 158 35 -29 -9 72 31 226 -98 125 -229 -146 77 -14 -11 -180 31 73 -69
4596f9j7m3J39J39r6%R6l6l36K3K37k1k6J86l79M36k62J10j1l33K14Q7p0J70m15
$$ -69 -86 -129 10 149 53 53 149 113 -223 -200 37 16 -10 176 -203 233 -29 81 70 -263 -49 38 -32 138 -277
4621b77O12j07k96m1J50q7O0l3j73P7m8J23j86K7O0K57j45j58M1p2P8J94k74L12
$$ -277 335 228 -68 -109 41 -46 14 -19 -192 -115 -163 -40 -226 -199 -139 118 -27 -185 -144 -216 -138 56 -218 94
4645I4j68K53k33J14j26O0m4l5J35J86k24K22k6k84J44k00K18m6K7K1q2j31J50
$$ 94 -74 179 -54 60 -66 -6 -50 -85 50 236 12 234 208 -76 68 -132 86 40 67 88 6 -125 25
4668B5J51j17j94J6N07j92p0r6J79k57R1k5k7K68l60n5QJ57r1J85k50K3RJ93j89
$$ 25 176 59 -135 -119 388 196 126 30 209 -48 43 18 -9 259 -101 -156 -148 9 -82 103 -147 -124 -115 78 -111
4693a11K5K30j75j29K34j9j28J02pn5Pk7K06m15K95p5J93k0Rpj21j43L59m90J31
$$ -111 -86 144 -31 -160 74 55 -73 29 22 -33 -26 -53 153 -262 33 -42 151 131 140 133 12 -131 228 -262 -131
4718a31mK2J28j98L37j12j79J84j81K07m9QJ9k2j18N3K22n8l28L38m8o6L1j26
$$ -131 -135 -113 15 -183 154 42 -137 47 -134 73 24 32 51 29 -89 -36 186 128 -200 138 90 24 55 -71
4742g1K62k15J84j00J83k89J87j42P1q6J05j29N7N9J2J42m01J67R3l14K59r9l
$$ -71 191 -24 160 60 243 -46 141 -1 70 -16 89 -40 17 76 88 230 -171 -4 89 -225 34 -65 -68
4765f8j0J05p5m5L20l74L77k77J48k43K78l01K25j79o9L3K19M7j60J33k09M39
$$ -68 -78 27 -48 -93 227 -147 230 -47 101 -142 136 -165 60 -119 -188 -155 64 111 -49 84 -125 314
4787C14n57K94j70K38j19Q9k10m7PK34j49l5P4JO5r7P0j81K27j01M0R2O5q2j87
$$ 314 -243 51 -119 119 0 89 -121 -168 -161 73 -76 -111 -37 -36 29 -68 2 -179 48 -53 -13 79 144 62 -125
4812a25N0M6j14L31m3Lj46j52L40k7j44j01J10Q5l6j38m8K20j59K65L1j34p0K0
$$ -125 -75 -29 -143 188 145 148 2 -150 190 163 19 -82 28 113 77 -61 -109 111 -48 217 248 114 44 64
4836F4k10K55l01L40r9j25K18k20J09M8M9m04J7L86k82J16q0K30j6k20K44j8l4
$$ 64 -146 109 -192 148 49 -76 142 -78 31 79 128 -276 -259 127 -155 -39 -119 111 95 -125 119 101 67
4859F7O7k03Q6M6o0j12N2K2j55K09J35r2l79L68O8Q6l05L16p1k65J12L5j5J29
$$ 67 134 -69 17 63 3 -109 -57 -35 -190 19 154 62 -317 51 119 205 -100 216 145 -120 -8 27 12 141
4883A41o8P0j60J45k97Q3K20k28KK79k53K0L01n3k95K16K2j63K7j87J43l7j40
$$ 141 73 143 -17 128 -169 -86 134 -94 -92 187 -66 -46 255 202 -93 123 145 -18 9 -178 -35 -72 -212
4906b12L77K4j8k44K47j95n2J03O0nJ6j62Qk8J37m6j9j58K96m5j12R9r0R2j71
$$ -212 165 189 171 -73 174 -21 -73 30 90 85 101 -61 -53 -81 56 10 -9 -167 129 84 -28 71 -19 73 -98
4931i8J29j08J4K22o3j6k69K70l02K76Ok28K07J34j25Q9j52R7k8n9q7j60K79o2
$$ -98 31 -77 -63 159 96 80 -189 81 -221 55 61 -167 40 174 49 138 -14 83 55 -4 -91 -251 28 -34
4955c4Q7j5K9J00k48J51j85K36j35j43K73j18n9K07LR2k55Q7j53j26Q3P2j49K84
$$ -34 53 38 67 167 -81 70 -115 121 -14 -157 116 -2 -61 146 149 241 -14 73 -80 -206 -123 -51 -200 84
4979H4J31l1o8p5j18K2K10o2j2k4L2J1m0J5L4j92K4p1J52r6R4p4L2oJ02n5j13
$$ 84 215 184 116 41 -77 -55 155 93 81 57 89 100 60 75 109 -83 -59 -130 22 -74 20 -54 -22 -28 74 19 -94
5006i4j7P8J56k95kL37q2p1j37K44k10m3K41j42J32k67L83m0j13pk2o4J68r3k53
$$ -94 -111 -33 123 -172 -174 163 81 10 -127 117 -93 -136 105 -37 95 -172 211 171 58 51 29 -35 133 40 -213
5031b13J18J29Q4R0k07N9j63P4j1L3k26j6K91R1j5J34m62K42J54j05Q2j06J49
$$ -213 -95 34 118 208 1 60 -103 -29 -40 -7 -233 -249 42 133 118 252 -210 32 186 81 163 57 206
5054B06k57k29J78J76l6r8K03k35K08q6m7j1K24l19K51k97P4K82j98p0K8L5m8
$$ 206 -51 -280 -102 74 38 -60 143 -92 116 30 -17 -28 196 -123 128 -169 -95 187 -11 -81 -53 -18 -66
5077f6J05j42J07l6n9j40o2N01j82O1n2r0m2jJ24j41j84J52L36m07K92k25q5M16
$$ -66 39 -103 4 -32 -91 -231 -293 208 26 87 35 -55 -97 -98 26 -115 -299 -147 189 -218 74 -151 -236 180
5101A80j59O8M6j03j8r4K30m6k29j37J56N6j40K87J6j45J12K03n64K85J76K50
$$ 180 21 89 135 32 14 -80 150 104 -125 -262 -106 -50 -190 97 113 -32 80 283 -281 4 180 430
5123D30l75k36J58J88j02k96J09K6K35O9l5k95J30K97k37l24J48m7J66Q0p6m3
$$ 430 55 -181 -23 165 63 -233 -124 -98 137 206 171 -124 6 303 66 -258 -110 -157 9 89 13 -30
5145c0j31P0j4O6K11r7j22N3L5j73K00J74l88J82j54j19L14j47m4J73j94L0R7
$$ -30 -161 -91 -105 -39 172 75 -47 6 41 -132 68 242 -146 36 -118 -237 77 -70 -114 59 -135 -105 -8
5168hj44M20l78J65j18pM9J61J0j66j29J80k0R9N8j99Q9m0J56o4q4m0K41j21j40
$$ -8 -152 268 -110 55 -63 -70 -21 140 150 -16 -145 35 15 114 172 -27 62 22 178 114 30 -10 231 110 -30
5193c0O7J9K45k74j9L0J25N1l4k84L26k69P2M4j07R0j6N5k60J70o0K61j03j18
$$ -30 37 56 301 27 8 38 163 214 180 -104 222 -47 25 69 -38 52 36 91 -169 1 -59 202 99 -19
5217a9J97j36m2n7M1K24l00K67j66j34K53l22K15j29K53j89j0k93K46K20oOj40
$$ -19 178 42 0 -57 -16 208 -92 175 9 -125 128 -194 21 -108 145 -44 -54 -347 -101 119 113 119 -21
5240b1L7N6l22J28L16l0m30K60K07k04O7r8J02j26M7n3O0j96K41j32N1j6j25L59
$$ -21 16 72 -250 -122 194 164 -266 -6 201 -3 64 -34 68 -58 -11 -64 -4 -200 41 -91 -40 -56 -181 178
5264A78j04L3j3K1j05k95J70K4j07K34R0J11k70K22j06j55k24Q5L29j76K02q7
$$ 178 74 107 94 115 10 -285 -115 -91 -198 36 126 237 -33 189 83 -72 -296 -211 118 -58 144 57
5286E7k6L8j33K39j66q3L18l28l6Q6qJ62j40n2o1J07R7p8j91L79n5l16L17M7k66
$$ 57 31 69 -64 175 9 -74 244 -84 -120 -34 -42 120 -20 -72 -133 -26 71 -7 -198 181 126 -190 127 174 -92
5311i2K87k8l68J49J55m8m2P1j82K31j10r1P9p4K34k33j6P2M2j23p1M15l25J49
$$ -92 195 167 -201 -52 103 55 13 84 -98 133 23 -68 11 -63 171 -62 -78 -6 36 -87 -158 257 -68 81
5335H1J48j38L7j95j35J54J61j62J8j0m6j31K11r2K09M6m3n8j4P2j01k6J7J56
$$ 81 229 91 128 -67 -202 -48 113 -49 -31 -41 -87 -218 -7 -99 110 156 113 55 41 113 12 -14 3 159
5359A59k24j02ll2L61q9m07K41K06J27k25k44K69N3j13J50n7n0r6K33n17M08k03
$$ 159 -65 -167 -170 -202 159 70 -337 -96 110 237 12 -232 37 90 -23 127 70 20 -76 157 -360 48 -155
5382a55J83L9j83J06O5J37l5j36j00o2J76k4K7M0j27R0l97L83q7R3l1l7J9l4p5
$$ -155 28 67 -116 -10 55 192 157 21 -79 -141 35 11 38 78 -49 41 -356 27 -60 33 2 -35 -16 -50 -125
5407a25J58M6K8k24n7K24m9J12k86K2K89r0n3K73k70NK18k62L7J6Q8pj52k8L31
$$ -125 33 79 107 -117 -174 50 1 113 -173 -151 138 48 -5 268 -2 3 221 -41 -4 12 100 93 -59 -87 244
5432B44j86j52K00j44L19m64K27O1Oj0p4n8O3J35q2M5j64j44L2N8O3L5j67N7P1
$$ 244 58 -94 106 -38 281 -183 44 105 111 101 27 -31 32 167 85 130 -34 -178 -146 -88 -25 10 -157 -100 -29
5457b9o1J72j69K83k83K57k64L8l3j7J52j04rP4n5N7l0J22k12R2n1j05N7K3K22
$$ -29 -90 82 -87 196 -87 170 -94 -56 -89 -106 46 -58 -67 7 -48 9 -21 101 -111 -19 -70 -175 -118 -95 127
5482A27k52K67k09P1j34ol3m3N75j00l27L1P5N2r7K6n3J24J7p6k5r2k52K97j39
$$ 127 -125 142 -67 4 -130 -136 -169 -212 363 263 -64 -33 42 94 -3 23 -30 94 111 35 10 -82 -334 -37 -176
5507a76K36j28nPJ90L9K9j03j50n3P4J50j32J01N9k15P2k5Q0k93L59k24J73q7
$$ -176 60 -68 -73 -66 124 163 192 89 -61 -114 -40 110 -22 79 138 -77 -5 -30 50 -243 116 -108 65 -22
5531b2N7J59k60j9m5J1J2J05r9p1M76l63p8P9q9L77k24J14j07r0P4K07l60P7p2
$$ -22 35 194 -66 -85 -130 -119 -107 -2 -101 -172 304 -59 -137 -58 -147 230 6 120 13 -77 -3 204 -156 -79 -151
5556a51j24N67l77P4J37k32L09j98J31j13o1Qj8K66k00O4j69J84j20l2J22j82
$$ -151 -275 292 -85 -11 126 -106 203 5 136 23 -38 -30 -48 218 18 82 -87 97 -23 -55 67 -115
5578a15l5L28j03j02J31k15J97J4k17J74J07k30n0K46Q6j3J10n03L42k98L1j6
$$ -115 -150 178 75 -27 104 -111 86 100 -117 57 164 -66 -116 130 216 203 313 -190 152 -146 -115 -131
5600a31K26q8l8m7p4j37K10R0j39O4n1J15j17k07K73k2K19k04lJ33j90J70K2j34
$$ -131 95 7 -31 -78 -152 -289 -79 11 -128 -64 -115 0 -117 -324 -51 -73 146 -58 -61 72 -118 52 74 -60
5624f0J11L1j82j58M97l65m3J21J78k92K93j24p8l8J53k43K27J8K25l26N4J48
$$ -60 51 82 -100 -258 239 -126 -169 -48 130 -162 131 7 -71 -109 44 -199 28 46 271 -55 -1 147
5646A47N2q2Mp7J1j9M6j73J87j32O5M1M3j4l0Q5p3K38l53R4k7J91l17J18k25l9
$$ 147 199 117 121 44 55 36 82 -91 96 -36 29 70 113 99 69 154 81 319 -34 60 33 224 -93 25 -200 -239
5672b39K63L6q4n4j09J65oQK25o2n04K83KJ74J15l00J4N6N9J24q8r6r1Q6Q6j42
$$ -239 24 60 -24 -78 -187 -22 -28 -20 205 143 -361 -78 -76 98 213 -87 -73 -17 42 166 78 -18 -109 -23 63 -79
5698g9n5K33q3l52K94r1L98k62J41N6k26j25J20j12J75J9r8j28R3J53j29o1J54
$$ -79 -134 99 16 -336 -42 -133 265 3 144 200 -26 -151 -31 -143 32 51 -47 -175 -82 71 -58 -119 35
5721C5Q6k98L9Q6o9J0K34J36j97o6L44j77j63O1qp1k1K06k72R7j59L17q3l5k5
$$ 35 121 -177 -138 -52 -121 -111 123 259 62 -4 340 163 0 61 53 -18 -39 167 -105 -8 -167 150 67 32 7
5746GK19j98j88K48o4Q9l6q2m1J38j71kNRR8qk06K66J05r4j28K72J65m83L25k96
$$ 7 226 28 -160 88 24 113 77 -5 -46 92 -79 -81 -76 -67 31 23 -183 83 188 94 -34 238 403 -80 245 -51
5772e1j05j1Q6k2K5N8q4j32K32J3o9N8J95o9j66K45j83l2K93j24j64J95j18Lk20
$$ -51 -156 -167 -81 -103 -78 -20 -104 -236 -4 9 -60 -2 193 124 -42 203 20 -12 281 157 -7 188 70 73 -147
5797a47K63K5k06Q6Rj5K61k51j55M0j8K95l57P7J91k13q0K37J1J56k80O6R0j88
$$ -147 116 141 -65 21 30 15 276 25 -130 -90 -108 187 -170 -93 98 -115 -195 42 53 209 -71 -5 85 -103
5821a03K19p9k85K79j13J27m5j32R7P2O8K9k43J12J75M5l74K62l07J98K15j79
$$ -103 116 37 -248 31 -82 45 0 -132 -35 37 105 134 -109 3 178 223 -151 111 -196 2 217 38
5843C8j74J5K46k08qK16k20q4L07j10n2N2j13J14k37L07k35Q9P6J75m4j03q3L6
$$ 38 -136 -121 125 -83 -91 125 -95 -179 128 18 -34 18 -95 19 -218 89 -146 -57 19 194 150 47 -36 0
5867@M6k21O9P5J0PL3R3m4j1j02K71k63K67J07l28mP8k57K86r4j78N9J44k31J60
$$ 0 46 -175 -106 -31 -21 -14 19 112 68 57 -45 226 -37 230 337 9 5 83 -174 112 18 -160 -101 43 -188 -28
5893b8O9K2M8p7q2K04N3j55j12L6l9KJ18j85J17m5J1k9n2p5J28K47j54j22oJ62
$$ -28 41 63 111 34 -48 156 209 54 -58 -22 -61 -59 59 -126 -9 -54 -43 -72 -124 -199 -71 176 22 -100 -106 56
5919E6NL0J22j64Q8k29K00q7j01j67K06J10j41Q7j11Q8M7j02L02j81O1k13O9J85
$$ 56 61 91 213 49 137 -92 108 21 -80 -247 -41 69 -72 15 -96 -8 39 -63 239 58 119 -94 -25 160
5943A60k63L02Mp7m2j5K3r6P5j26O7J57k16n7R9l6n3L9R4M3lL7oK1J03j62P9j63
$$ 160 -103 199 203 126 84 69 92 -4 71 -55 12 169 -47 -104 -5 -41 -94 -55 39 82 79 116 110 131 234 72 151 -12
5971a2m6k9R0J04O2r9n6n6J31k13L3J21o8j4Kj02J46j88K25k7L6P4k28J73J32
$$ -12 -58 -87 3 107 169 70 14 -42 89 -124 -91 30 -38 -52 -50 -152 -6 -194 31 4 40 114 -114 59 191
5996A91k65Q3Q9l74M40k66K44l88J71r4L8kL0p5J29k47O22m37L11j30j06k6J07
$$ 191 -74 9 98 -276 164 -102 142 -246 -75 -169 -131 -133 -103 -178 -49 -296 326 -111 200 70 -36 -62 45
6019D5j57jJ22p4J74N2l7l21M03j14m8j68R9J09k1l8M6j07m9o5J87Ml31R5K40
$$ 45 -112 -113 9 -65 109 161 124 -197 206 92 44 -124 -25 84 63 25 71 -36 -85 -150 37 41 -290 -195 45
6044D5P1o3j32O5L43m62K70K4n0k57J27P1k73K28k27N15k99j27J66O4o0K19l92
$$ 45 116 53 -79 -14 329 -133 137 161 111 -146 -19 52 -221 7 -220 295 -4 -131 35 99 39 258 -134
6067a34Q2J45k21K18l85N27k53J35J0j42M1J8J75k91K24j74J5L6J76j08k80L35
$$ -134 -52 93 -128 90 -295 232 -21 114 124 -18 23 41 216 -75 149 -25 -10 26 202 94 -186 149
6089A49j62o6K01J07m11J90k11L15o0j03K69p2k5k92K51o9J15j21J07J85k05N6
$$ 149 -13 -79 122 229 -182 8 -203 112 52 -51 218 146 121 -171 80 11 126 5 112 297 92 148
6111A48j00l59J04O9L43l83K35L5k13J82j40L43l04Q9K7J8j42M9r0J42L63q27
$$ 148 48 -311 -207 -138 205 -178 57 92 -121 61 -79 264 -40 49 76 94 -48 1 -89 53 416 -411
6133d11M13q5K22l65K93L3J00k24o1j66K21qL76l89j11J51l7J62MP2j44k08J46
$$ -411 2 -83 139 -226 67 100 200 -24 -85 -251 -30 -38 338 -51 -162 -11 -48 114 118 190 46 -162 -16
6156a6J16J73r6m39L25j53J46n1m6J91r3j07m1l4J96j25j82M43k01j87J42R9j25
$$ -16 100 273 177 -262 63 -90 56 5 -41 150 57 -50 -91 -125 71 -54 -236 207 6 -181 -39 60 -65
6179f5O4o0K09k33L05j27k08K74l4j31R3rk01J40qm3J39m50K22R3K7j70J41K83
$$ -65 -1 -61 148 -85 220 93 -115 159 125 -6 87 78 -123 17 9 -34 105 -345 -123 -30 -3 -173 -32 251
6203B51k86j18L48m64M2K52n1j09J69k3K36j83J74m81M28j14k87M3J36M5m9j47
$$ 251 -35 -153 195 -269 -227 25 -26 -135 34 11 247 64 238 -243 185 71 -216 -173 -37 8 -41 -188
6225a88K50m4j16J06q5J34qL3N3j07l0J6k8k35km2L58j59N4J66j81L88k59r5O
$$ -188 62 18 -98 8 -77 57 49 82 135 28 -2 14 -14 -249 -251 -293 65 -94 -40 126 -55 333 74 -21 -15
6250a5p5J63J68k74j59J68J01R5J03k19m3QK43j89l0p4O2oQJ25p1J03l53K36o
$$ -15 -90 73 241 -33 -192 -24 77 172 275 56 13 21 264 75 45 -29 33 27 35 160 89 192 -161 75 69
6275F9j32L4J68n2k76kN4Q2J1K11j56M4n8j62RJ83R8j84J76l70J80r0L13J59p6
$$ 69 -63 -29 139 87 -189 -191 -137 -55 -44 167 11 55 -3 -165 -156 27 125 -59 117 -253 -73 -163 150 309 233
6300B33j52R0l37K68Mp7j66R4O3J70j54J11r0q5L62l67j16K71k02Q1N6j25O7k5
$$ 233 81 171 -166 102 106 29 -137 -43 20 190 36 147 57 -28 334 -33 -149 122 -80 1 57 -68 -1 -26
6324b6j21n0K60k63K29j02N0P5l1j22n1R4J76k13K46j74K57j79o%r8j43K65m9
$$ -26 -147 -197 63 -200 29 -73 -23 52 21 -101 -152 -58 118 -95 151 -23 234 55 49 49 -49 -192 73 24
6348B4O0k52K69r3J58k85L58p7l8k09J0J98p2k26M16j71j60Q4J04j20K9k46K99
$$ 24 84 -168 101 8 166 -119 239 162 124 -85 -75 123 51 -175 241 70 -90 -6 98 -22 7 -239 60
6371F0j55M3n1K47k44K28J7k73K33m6Mj42M7j40j1J38M8J8k1n4R1K5j77o6J37
$$ 60 -95 -52 -103 144 -100 128 145 -128 105 59 63 -79 -32 -172 -183 -45 3 21 0 -54 37 62 -115 -181 -44
6396d4K15k67l6J9J31K12l19J79j8j05N2J07k22l4O0J66r1j0Q6J0M0k09k68J60
$$ -44 171 -96 -132 -113 18 230 -89 90 72 -33 19 126 -96 -130 -70 96 5 -5 81 91 131 -78 -346 -186
6420a86K0L23j86J9j40K18j19J44j99K90k26N9Q4J83n53M97k03o4J89j36r2J62
$$ -186 -166 157 -29 -10 -150 68 -51 93 -106 184 -42 17 101 284 -269 228 25 -39 150 14 -78 84
6442H4r7j20J41L0n8J49k85R4m9j16L88l81j2R8J87j71L59P5l57J75n0Q0o0J12
$$ 84 -13 -133 8 38 -20 129 -156 -62 -111 -227 161 -220 -232 -134 53 -118 241 316 -41 134 84 164 104 216
6466B16Ok24J61o0j45j51J70j6R5m1j3J18k47J32P0K05k44J11p2k5Jl1L1J7r6
$$ 216 222 -2 159 99 -46 -197 -27 -43 52 11 -2 116 -131 1 71 276 32 143 71 46 47 16 47 64 -32
6491c2J83J23m36K51j24LQ8j95J2K76j06r4J80j66J21q2J09k17J14J1j87J42k3
$$ -32 151 274 -162 89 -35 -32 56 -139 -127 149 43 -51 129 -37 84 2 111 -106 8 19 -168 -26 -49
6514d9KJ42j69j28M7L0q5J92k70M31j43Mk68K64J16r0jP0J03m45L0M2J62k4K68
$$ -49 -47 95 -74 -202 -155 -125 -210 -18 -288 143 0 4 -264 0 116 26 25 95 198 -247 -217 -175 -13 -37 231
$$ [...]
8191a2
##END NTUPLES=NMR FID
##END=
