##TITLE=1H_SR18_ost
 D2O, 8 sc, 
 2.9.2020
##JCAMPDX= 6.0         $$ Bruker NMR JCAMP-DX V2.0
##DATA TYPE= NMR FID
##DATA CLASS= NTUPLES
##ORIGIN= UXNMR, Bruker Analytische Messtechnik GmbH
##OWNER= root
$$ XWIN-NMR		Version 3.5
$$ Wed Sep  2 13:43:04 2020 Russian Standard Time (UT+4h)  she@DPX200
##.OBSERVE FREQUENCY= 200.1315066352
##.OBSERVE NUCLEUS= ^1H
##.DELAY= (6, 6)
##.ACQUISITION MODE= SIMULTANEOUS
##.ACQUISITION SCHEME= undefined
##.AVERAGES= 8
##.DIGITISER RES= 18
##SPECTROMETER/DATA SYSTEM= spect
##.PULSE SEQUENCE= zg30
##.SOLVENT NAME= D2O
##.SHIFT REFERENCE= (INTERNAL, D2O, 0, 15.7039)
##AUDIT TRAIL= $$ (NUMBER, WHEN, WHO, WHERE, WHAT)
$$ ##TITLE= Audit trail, XWIN-NMR		Version 3.5
$$ ##JCAMPDX= 5.01
$$ ##ORIGIN= Bruker BioSpin GmbH
$$ ##OWNER= she
$$ F:/spectra/data/she/nmr/H-F/1/audita.txt
$$ ##AUDIT TRAIL=  $$ (NUMBER, WHEN, WHO, WHERE, WHAT)
(   1,<2020-09-02 13:42:06.12 +0400>,<she>,<DPX200>,
      <created by zg, POWCHK disabled, PULCHK disabled
       configuration hash MD5:
       00 E9 B6 7A A2 85 ED C7 34 08 36 98 17 FE 4E 26
       data hash MD5: 16K
       21 F0 D0 65 78 63 4D 6F 9E 93 C4 C1 25 FB AD C2>)
$$ ##END=
$$ 
$$ hash MD5
$$ A8 D2 32 EC 7B 54 6D 7C FD 53 C7 6F 57 2C 1D 81
##$RELAX= 
##$RELAX= 
##$RELAX= 
##$RELAX= 
##$RELAX= 
##$RELAX= 
$$ Bruker specific parameters
$$ --------------------------
##$DU= <F:/spectra>
##$EXPNO= 1
##$NAME= <H-F>
##$PROCNO= 1
##$TYPE= <nmr>
##$USER= <she>
##$AMP= (0..31)
100 100 100 100 100 100 100 100 100 100 100 100 100 100 100 100 100 100 
100 100 100 100 100 100 100 100 100 100 100 100 100 100 
##$AQSEQ= 0
##$AQ_mod= 1
##$AUNM= <au_zg>
##$AUTOPOS= <>
##$BF1= 200.13
##$BF2= 200.13
##$BF3= 200.13
##$BF4= 200.13
##$BF5= 200.13
##$BF6= 200.13
##$BF7= 200.13
##$BF8= 200.13
##$BYTORDA= 1
##$CFDGTYP= 0
##$CFRGTYP= 5
##$CHEMSTR= <none>
##$CNST= (0..31)
1 1 145 1 1 1 1 1 1 1 1 1 1 1 1 1 1 1 1 1 1 1 1 1 1 1 1 1 1 1 1 1 
##$CPDPRG= <>
##$CPDPRG1= <>
##$CPDPRG2= <>
##$CPDPRG3= <>
##$CPDPRG4= <mlev>
##$CPDPRG5= <mlev>
##$CPDPRG6= <mlev>
##$CPDPRG7= <mlev>
##$CPDPRG8= <mlev>
##$CPDPRGB= <>
##$CPDPRGT= <>
##$D= (0..31)
0 1.2 0 0 0 0 0 0 0 0.06 0 0.03 0 0 0 0 0.0002 0 0 0 0 0 0 0 0 0 0 0 0 
0 0 0 
##$DATE= 1599039725
##$DBL= (0..7)
120 120 120 120 120 120 120 120 
##$DBP= (0..7)
150 150 150 150 150 150 150 150 
##$DBP07= 0
##$DBPNAM0= <>
##$DBPNAM1= <>
##$DBPNAM2= <>
##$DBPNAM3= <>
##$DBPNAM4= <>
##$DBPNAM5= <>
##$DBPNAM6= <>
##$DBPNAM7= <>
##$DBPOAL= (0..7)
0.5 0.5 0.5 0.5 0.5 0.5 0.5 0.5 
##$DBPOFFS= (0..7)
0 0 0 0 0 0 0 0 
##$DE= 6
##$DECBNUC= <off>
##$DECIM= 32
##$DECNUC= <off>
##$DECSTAT= 4
##$DIGMOD= 1
##$DIGTYP= 9
##$DL= (0..7)
0 120 120 120 120 120 120 120 
##$DP= (0..7)
150 150 150 150 150 150 150 150 
##$DP07= 0
##$DPNAME0= <>
##$DPNAME1= <>
##$DPNAME2= <>
##$DPNAME3= <>
##$DPNAME4= <>
##$DPNAME5= <>
##$DPNAME6= <>
##$DPNAME7= <>
##$DPOAL= (0..7)
0.5 0.5 0.5 0.5 0.5 0.5 0.5 0.5 
##$DPOFFS= (0..7)
0 0 0 0 0 0 0 0 
##$DQDMODE= 0
##$DR= 18
##$DS= 0
##$DSLIST= <SSSSSSSSSSSSSSS>
$$ [...]
##$SUBNAM2= <"">
##$SUBNAM3= <"">
##$SUBNAM4= <"">
##$SUBNAM5= <"">
##$SUBNAM6= <"">
##$SUBNAM7= <"">
##$SUBNAM8= <"">
##$SUBNAM9= <"">
##$SW= 16.880792210976
##$SWIBOX= (0..15)
0 0 2 0 0 0 0 0 0 0 0 0 0 0 0 0 
##$SW_h= 3378.37837837838
##$TD= 16384
##$TD0= 1
##$TE= 0
##$TE2= 300
##$TE3= 300
##$TEG= 300
##$TL= (0..7)
0 120 120 120 120 120 120 120 
##$TP= (0..7)
150 150 150 150 150 150 150 150 
##$TP07= 0
##$TPNAME0= <>
##$TPNAME1= <>
##$TPNAME2= <>
##$TPNAME3= <>
##$TPNAME4= <>
##$TPNAME5= <>
##$TPNAME6= <>
##$TPNAME7= <>
##$TPOAL= (0..7)
0.5 0.5 0.5 0.5 0.5 0.5 0.5 0.5 
##$TPOFFS= (0..7)
0 0 0 0 0 0 0 0 
##$TUNHIN= 0
##$TUNHOUT= 0
##$TUNXOUT= 0
##$USERA1= <user>
##$USERA2= <user>
##$USERA3= <user>
##$USERA4= <user>
##$USERA5= <user>
##$V9= 5
##$VALIST= <valist>
##$VCLIST= <CCCCCCCCCCCCCCC>
##$VD= 0
##$VDLIST= <DDDDDDDDDDDDDDD>
##$VPLIST= <PPPPPPPPPPPPPPP>
##$VTLIST= <TTTTTTTTTTTTTTT>
##$WBST= 1024
##$WBSW= 4
##$XGAIN= (0..3)
0 0 0 0 
##$XL= 0
##$YL= 0
##$YMAX_a= 55236
##$YMIN_a= -50433
##$ZGOPTNS= <>
##$ZL1= 120
##$ZL2= 120
##$ZL3= 120
##$ZL4= 120
##$ABSF1= 10
##$ABSF2= 0
##$ABSG= 5
##$ABSL= 3
##$ALPHA= 0
##$AQORDER= 0
##$ASSFAC= 0
##$ASSFACI= 0
##$ASSFACX= 0
##$ASSWID= 0
##$AUNMP= <proc_1d>
##$AZFE= 0.1
##$AZFW= 0.1
##$BCFW= 1
##$BC_mod= 2
##$BYTORDP= 1
##$COROFFS= 0
##$CY= 11.3945322036743
##$DATMOD= 1
##$DC= 2
##$DFILT= <>
##$DTYPP= 0
##$F1P= 16.9975609425685
##$F2P= -3.02152046262296
##$FCOR= 0.5
##$FTSIZE= 0
##$FT_mod= 4
##$GAMMA= 1
##$GB= 0.15
##$INTBC= 1
##$INTSCL= 1
##$ISEN= 128
##$LB= 0.24
##$LEV0= 0
##$LPBIN= 0
##$MAXI= 10000
##$MC2= 0
##$MEAN= 0
##$ME_mod= 0
##$MI= 1.114404
##$NCOEF= 0
##$NC_proc= 0
##$NLEV= 6
##$NOISF1= 3.799351
##$NOISF2= 2.8
##$NSP= 1
##$NTH_PI= 0
##$NZP= 0
##$OFFSET= 15.70392
##$PC= 1
##$PHC0= -10132.09
##$PHC1= 8.200904
##$PH_mod= 1
##$PKNL= yes
##$PPARMOD= 0
##$PSCAL= 0
##$PSIGN= 0
##$REVERSE= no
##$SF= 200.130013532006
##$SI= 16384
##$SIGF1= 3
##$SIGF2= 2
##$SINO= 400
##$SIOLD= 16384
##$SREGLST= <1H.CDCl3>
##$SSB= 0
##$STSI= 0
##$STSR= 0
##$SW_p= 3612.71676300578
##$SYMM= 0
##$S_DEV= 0
##$TDeff= 0
##$TDoff= 0
##$TI= <>
##$TILT= no
##$TM1= 0
##$TM2= 0
##$TOPLEV= 0
##$USERP1= <user>
##$USERP2= <user>
##$USERP3= <user>
##$USERP4= <user>
##$USERP5= <user>
##$WDW= 1
##$XDIM= 8192
##$YMAX_p= 0
##$YMIN_p= 0
$$ End of Bruker specific parameters
$$ ---------------------------------
##NTUPLES= NMR FID
##VAR_NAME=  TIME,          FID/REAL,        FID/IMAG
##SYMBOL=    X,             R,               I
##VAR_TYPE=  INDEPENDENT,   DEPENDENT,       DEPENDENT
##VAR_FORM=  AFFN,          ASDF,            ASDF
##VAR_DIM=   8192,          8192,            8192
##UNITS=     SECONDS,       ARBITRARY UNITS, ARBITRARY UNITS
##FACTOR=    0.000296,      1,               1
##FIRST=     0,             0,               0
##LAST=      2.424536,      0,               0
##MIN=       0,             -50433,          0
##MAX=       2.424536,      55236,           0
$$ Real data points
##PAGE= N=1
##DATA TABLE= (X++(R..R)), XYDATA
0@%%%%%%%%%%%%%%%%%%qJ6j6J6j6J7k5L2l2M0m8N6o4P2q1R0j05J20j36J53j70
$$ 0 0 0 0 0 0 0 0 0 0 0 0 0 0 0 0 0 0 0 -8 8 -8 8 -8 9 -16 16 -16 24 -24 32 -32 40 -41 49 -56 64 -72 81 -89
39h9J89k13K37k61K90l22L57l94M34m80N30n81O38p05P77q57R48j048J161j292
$$ -89 100 -113 124 -137 153 -169 188 -206 228 -252 278 -303 335 -370 407 -450 498 -550 611 -681
59f81J442j619J832k087K408k824L382m184N450p891K1945n0622M082J1475J1738
$$ -681 761 -858 974 -1113 1295 -1529 1853 -2331 3119 -4772 17173 -33449 -29367 -17892 -6154
74f154O1390m4758j2365k9696n503N8660Q739r119k7542k4340J1043J4246M3367
$$ -6154 55236 10478 -1887 -31583 -37086 21574 30313 21194 -6348 -30688 -19645 -5399 37968
87C7968r528l6446k3244O28M2512J4559L386l0560m3798K5714K1913L3219o928
$$ 37968 28440 -8006 -31250 -30622 11890 26449 29835 -725 -44523 -18809 3104 36323 29395
100B9395n0784P2n004L1885L1067k3058j2316l5906J2580L4973L946J5342m1003
$$ 29395 -21389 -21317 -26321 5564 36631 13573 1257 -34649 -22069 12904 16850 32192 -8811
113h811j9755J1441Q483M9193j8389l2295j1060j3241M9276J2342r416j3107m5467
$$ -8811 -28566 -17125 -8642 40551 22162 -10133 -21193 -34434 14842 27184 17768 4661 -40806
126d0806K2807K9077J0993L935l8390j0560M567J8383K9076r211k3365k4904R384
$$ -40806 -17999 11078 22071 26006 -12384 -22944 -18377 6 29082 19871 -3494 -28398 -19014
139a9014K4842J3185Q654l2987k1718N724K2084L3189j8181k1488j5698n331L7467
$$ -19014 5828 19013 27667 -5320 -27038 -21314 770 33959 15778 -5710 -21408 -26739 10728
152A0728J1463p99k3968l1173K4048J2059J7520N409l5867p081m354K2910L0108
$$ 10728 22191 21392 -2576 -33749 -9701 2358 19878 25287 -10580 -17661 -22015 895 31003
165C1003j8828j2547k1632j732L1584J1568M034k7443k4454J3653J7379K1423
$$ 31003 12175 -372 -22004 -23736 7848 19416 23450 -3993 -28447 -14794 2585 24008
177B4008n395k4274j5111k26K7085J6386n136k1001j9693Q547J5623K0630r64
$$ 24008 18613 -5661 -20772 -20998 6087 22473 17337 -3664 -23357 -14810 813 21443 20479
190B0479k6329j3132j847K4810J9687r354j3517k3972L777K5247J2610L151k7021
$$ 20479 -5850 -18982 -20829 3981 23668 14314 797 -23175 -19398 5849 18459 21610 -5411
203e411j7095Q832J3335K3082n298k1731j3436k926K5548J5489n246j4995k1565
$$ -5411 -22506 -13674 -339 22743 17445 -4286 -17722 -20648 4900 20389 15143 148 -21417
216b1417M602J8885J6554J356k3958j5569K854J7843J9154l499j8179j8349J935
$$ -21417 -16815 2070 18624 19980 -3978 -19547 -16693 1150 20304 16805 -1374 -19723 -17788
229a7788K0631J5920j087k0564j5570K220J6495J9931l845j8427j5532m49K0742
$$ -17788 2843 18763 17676 -2888 -18458 -16238 257 20188 16343 -2084 -17616 -18065 2677
242B677J5340j545j7042j8826L426J7181J6946n99k0392j4324M02J7679J8434
$$ 2677 18017 16472 -570 -19396 -15970 1211 18157 17558 -2834 -17158 -16756 923 19357
255A9357m046j6676j5896P7J9285J5618j758j7267j6533J832J7532J5977j864
$$ 19357 15311 -1365 -17261 -17184 2101 17719 15961 -1306 -17839 -16007 1525 17502 15638
268A5638j6922j5949O38J8600J5547k424j6303j5888J235J7462J5265j057j7124
$$ 15638 -1284 -17233 -16595 2005 17552 15128 -1175 -17063 -15828 1634 16899 15842 -1282
281a282j6303K411J7056J4296p03j6452j6011J556J6864J5352j589j6887j4790
$$ -1282 -17585 -15174 1882 16178 15475 -977 -16988 -15432 1432 16784 15195 -1692 -16482
294a6482J888J5546J4789K65j7276j5923K944J5579J4321n81j6280j4467Q18J5495
$$ -16482 -14594 952 15741 16006 -1270 -17193 -14249 1330 15651 15070 -1210 -15677 -14859 636
308F36J5576q10j7311j4207K942J3290J4625J524j7871j4282J760J4566J5661
$$ 636 16212 15402 -1909 -16116 -13174 116 14741 16265 -1606 -15888 -14128 438 16099
321A6099k163j5240j2687r42J4865J5894q38j6557j3775K149J3318J4099N31j5003
$$ 16099 13936 -1304 -13991 -14933 -68 15826 14988 -1569 -15344 -13195 123 14222 14753 -250
335b50j4749K43J5799J4008j480j4115j3685N51J3177J4920R87j6888j3373K024
$$ -250 -14999 -14756 1043 15051 13571 -544 -14229 -13678 -501 14419 15406 -1482 -14855 -12831
349a2831J3146J3468l1j3493j4487j59J5125J3650q93j4420j2473O40J1721J4974
$$ -12831 315 13783 13752 259 -14228 -14387 738 14388 13495 -925 -13398 -12758 -1037 13937
363A3937P02j5421j3340O86J4293J2556j008j1517j4441q14J5251J2750m01j3854
$$ 13937 14639 -782 -14122 -13436 857 13413 12405 888 -13553 -14367 884 13634 13233 -621
377f21j3156K020J1333J2424K675j4923j3842J823J2310J3008m86j2667j1597
$$ -621 -13777 -11757 -424 12000 14675 -248 -14090 -12267 43 13051 12565 -102 -11699
390a1699k222J3277J4923j466j3386j2311O79J2392J1531J743j2775j4434J280
$$ -11699 -13921 -644 14279 12813 -573 -12884 -12205 187 11718 13461 686 -13748 -12468
403a2468J3167J1616l22j2115j1128j242J0834J4640J50j3765j1141n61J1807
$$ -12468 699 12315 11993 -122 -11250 -12492 -1658 12982 13132 -633 -11774 -12335 -528
416e28J2434O3j0013j4733j081J5263J0178M89j1693j2870K074Q628J3380K440
$$ -528 11906 11969 1956 -12777 -13858 1405 11583 12072 379 -12491 -10417 -1789 11591 14031
430A4031j5862r048k20R768J3469j605q615j2320l781J4524J1166J35j0482j2902
$$ 14031 -1831 -10879 -11099 -1331 12138 10533 1918 -10402 -14183 341 11507 11642 1160 -11742
444a1742L81R854J2471K490j3482j2142Q86J1220J0816L40j0386j1042j432J0218
$$ -11742 -11361 -1507 10964 13454 -28 -12170 -11284 -64 10752 11092 706 -10336 -11768 -1550
458a550J3487j095j0911q921l228J1243J0951J243p866j6209J254J2102Q208M605
$$ -1550 11937 10842 -69 -8990 -12218 -975 9976 11219 3353 -12856 -11602 500 8708 13313
472A3313j3345j0788P38O547J6783k038j2917o256m440J2419J0240j183n355j5085
$$ 13313 -32 -10820 -10082 -3535 13248 11210 -1707 -7963 -12403 16 10256 9073 3718 -11367
486a1367l31J2461P481L274r909j1663o88Q012J3134K047j2172j1070M63R096
$$ -11367 -11698 763 8244 11518 1609 -10054 -10742 -2730 10404 12451 279 -10791 -10328 -1232
500a232J0912J902j1344r638k065J0513J2584l526o573r834l716J2388P090L909
$$ -1232 9680 11582 238 -9400 -11465 -952 11632 8106 1533 -8301 -12017 371 7461 11370
514A1370q483j5089M111N719J0501N238j4098p031l815Q576J6065m645p264r420
$$ 11370 2887 -12202 -8091 -2372 8129 13367 -731 -7762 -11577 -3001 13064 8419 1155 -8265
528h265m050J3189P366J821p784j3165J923Q052Q737K620r229r295k392Q107J1458
$$ -8265 -12315 874 8240 10061 2277 -10888 -8965 -913 7824 10444 1215 -8080 -10472 -2365 9093
543I093J867r904r738j277P086J2785O44r800q521m384J2165R721k065m309j2959
$$ 9093 10960 1056 -8682 -9959 -2873 9912 10556 756 -7765 -12149 16 9737 7672 3363 -9596
558i596m06J0194N989N547j1049r494J301L323J3438Q43r115o993o494J1452J0363
$$ -9596 -10002 192 6181 11728 679 -8815 -7514 -4191 9247 10090 975 -6018 -12512 -1060 9303
573I303j079m382j3262j081J0123P360M003r806j0373Q57O415R576K186q490q950
$$ 9303 8224 3842 -9420 -10501 -378 6982 10985 1179 -9194 -8337 -1922 7654 9840 1350 -7600
588g600j446O663J0061K214q633p809l427P012J1992l72n909j0264l664J1210
$$ -7600 -9046 -2383 7678 9892 1259 -6550 -9977 -2965 9027 8655 2746 -7518 -11182 28
602B8O672K953o679j2802K131N615Q885M191j1226o202k195N421J1929o42n841
$$ 28 6700 9653 2974 -9828 -7697 -2082 6803 10994 -232 -6434 -8629 -3208 8721 8079 2238
617B238q685m010R351P736K584o307j1126p00O801R132K854q486q783j492O794
$$ 2238 -6447 -10457 -1106 6630 9214 2907 -8219 -8919 -2118 7014 9868 1382 -7401 -8893 -2099
632b099R541J619p723q169j862O390R769J056o764p918l509Q133Q309J490m959
$$ -2099 7442 9061 1338 -6831 -8693 -2303 7466 8522 1758 -6160 -9669 -1536 6773 8263 3304
647C304j0961j288P331P533M202q712q691m27M385J0723J792q236o743l441P126
$$ 3304 -7657 -8945 -1614 5919 10121 1409 -7282 -7709 -3324 7399 9191 955 -5788 -9229 -2103
662b103R438K16n048q621l155P482Q100K239o144r123j536O028Q144L155o893
$$ -2103 7335 7551 2503 -6118 -9273 -1791 6309 8548 2404 -6719 -8255 -2227 5917 9072 2179
677B179q931j574O023Q830J940o638p679k701O042R129J732o400q148j873N859
$$ 2179 -6752 -8326 -2303 6527 8467 1829 -5850 -8551 -2509 6620 8352 1952 -6196 -8069 -2210
692b210P941K833o197q605k050O018Q526J887o182p612k621N653Q866K087o435
$$ -2210 5731 8564 2367 -6238 -8288 -2270 6256 8143 1961 -5651 -8272 -2619 6247 8334 1899
707A899p831k154O043P947J883n219q519k444O572P537K334o026p903j590M732
$$ 1899 -5932 -8086 -2043 5904 7787 2568 -5951 -8395 -1823 5714 8048 2022 -5881 -7471 -2739
722b739Q508K589o537p421k568O234P789J273m363q460k548O350P423K557o193
$$ -2739 5769 8358 1821 -5600 -8168 -1934 5855 7128 2765 -5695 -8243 -1893 5530 8087 1894
737A894p718j269M571P759K813n558q401j963O269O738K309m970p858k046M505
$$ 1894 -5824 -7093 -2522 5237 8050 2492 -5909 -7872 -1603 5135 7444 2474 -5384 -7430 -2925
752b925Q646K290o646o341k336M892P431K457m459q797j860N963O536K707n458
$$ -2925 5721 8011 1365 -4976 -7312 -2420 5011 7468 3009 -5788 -7648 -1685 4851 7558 2100
767B100o783k549M044Q987J715n644o709k523N243O523L006m573q320j777M762
$$ 2100 -4683 -7232 -3188 5799 7514 1870 -4839 -7362 -2119 4404 7410 2837 -5483 -7260 -2498
782b498P669K002n297n884l561M800Q070J664m401p655k108N194O317K973m868
$$ -2498 5171 7173 1876 -4008 -7569 -2769 5301 6965 2564 -5091 -7199 -2005 4312 7285 2417
797B417o959k813M667Q190J069m266o550l216N359O406K858m361q148j312M409
$$ 2417 -4542 -7355 -2688 5502 6571 2305 -4245 -7461 -2102 4304 7162 2801 -5347 -6659 -2250
812b250O748K343m656o145l591N116P537J375l936p329j859M553N840L592m865
$$ -2250 4498 6841 2185 -3960 -7551 -2435 5102 6477 2541 -4788 -6647 -2094 3746 7338 2473
827B473p459j696M444O968J567l912o301l217M744O969K358m788o784j512L606
$$ 2473 -4986 -6682 -2238 4730 6297 2385 -3916 -7133 -2389 4580 6938 2150 -4634 -6146 -2540
842b540O612K692m241o725k998N278O295J599l137p179k181M132O162L501n291
$$ -2540 4072 6764 2523 -4202 -7200 -1922 4373 5972 2835 -4344 -6525 -2393 3769 7270 1979
857A979o314j641L175O982K106l715o362l329N181O061J944l330o866k062L674
$$ 1979 -4335 -5976 -2801 4181 6287 2572 -3790 -7119 -1938 4123 6067 2737 -4129 -6191 -2517
872b517O075L377m571o643j753L543O193K691l871o190k740L782O786K067m101
$$ -2517 3558 6935 2364 -4279 -6032 -2489 3704 6395 2524 -3666 -6406 -2624 4162 6229 2128
887B128n556k901L749O486K044l000p004k323M557M982L019l534o564j921K942
$$ 2128 -3428 -6329 -2580 3906 5950 2950 -4054 -6377 -1820 3162 6181 2647 -3917 -5838 -2896
902b896O691K670m693m907k886L204O757J684k869o200l166M816N178K144k479
$$ -2896 3795 6465 1772 -3135 -6021 -2817 3940 5624 2755 -3445 -6611 -1795 3383 5527 3048
917C048o898j990L526N429L385m375n859j485K245O525K555m010n023l325L794
$$ 3048 -3850 -5840 -2314 3115 6500 2125 -3734 -5219 -2974 3551 6106 2096 -2927 -6252 -2458
932b458O383J208k448n801l154M241N135K672k917o801j399L048N100L426m159
$$ -2458 3925 5133 2685 -3116 -6270 -2029 3106 5778 2861 -3940 -5339 -2291 2809 6235 2076
947B076n434j961K450O579J907l705m440l496L485O126J386k043o219k757M317
$$ 2076 -3358 -5319 -2869 3710 5617 1912 -2528 -6024 -2539 3587 4973 2930 -3289 -6046 -1729
962a729M316L063k775o708j136K240N618L344m636m338k486K219O745J194k596
$$ -1729 2587 5650 2875 -3833 -4969 -2729 2889 6233 1597 -2741 -5227 -3008 3737 4931 2335
977B335m779l618M163M797J931j686o544j943L191M421L645l390n917j432J984
$$ 2335 -2444 -6062 -1899 2898 4829 3143 -3401 -5344 -2153 2268 5913 2523 -3394 -4826 -2842
992b842N702K959l982m495k509K325O263J470k657m534l479L894M634J825j340
$$ -2842 2860 5819 1837 -2658 -5167 -2842 3421 4891 2234 -2300 -5779 -1885 2749 4574 3234
1007C234o449j870L037L889M073l629n355j288J091O316K493l818l791l511L184
$$ 3234 -3215 -5085 -2048 1841 5914 2285 -3070 -4358 -3267 3049 5542 1724 -2067 -5578 -2394
1022b394N759Q67j502n311k787L577M010K703k322n608j380J898M520L391l185
$$ -2394 3365 4232 2730 -2581 -5368 -1791 2219 4922 2600 -3008 -4388 -2490 2030 5421 2236
1037B236m727k224J723N892K147l061l970l350K837N693J069j568n270k683L799
$$ 2236 -2491 -4715 -2992 2900 5047 1986 -1984 -5334 -2497 3196 4265 2697 -2573 -5256 -1457
1052a457L346K782j857n914j020J635M481L283l494l748k556J333O055J746k308
$$ -1457 1889 4671 2814 -3100 -4120 -2485 1996 5279 1785 -1963 -4519 -3186 2869 4615 2307
1067B307m292l370L303M555J782j428n521k165K993L955K609k470m804j518J553
$$ 2307 -1985 -5355 -2052 2503 4285 2857 -2664 -4829 -1836 2119 4728 2258 -2546 -4064 -2511
1082b511M500K891k777m107k424J746N177J706j631m264l445K950M462K046j574
$$ -2511 1989 4880 2103 -2004 -4428 -2682 2495 4201 2570 -1694 -5139 -2189 2273 4319 2745
1097B745n345j753K319L679L236k586m789j577J580M751K041k278l524l078K000
$$ 2745 -2600 -4353 -2034 1645 4881 2295 -2494 -4071 -2491 2260 4301 2023 -1501 -4579 -2579
1112b579M906J744j531m477k648K518L789K571j423n232k072K343L903K701k400
$$ -2579 2327 4071 2540 -1937 -4585 -2067 1722 4293 2870 -2362 -4434 -2091 1812 4513 2113
1127B113m093k048J316M844K195k233l738k711K200M053J879r82m707k609K460
$$ 2113 -1980 -4028 -2712 2132 4327 2094 -1644 -4355 -2155 1898 3777 2795 -1912 -4521 -2061
1142b061L729K551j770m435j990J514M260K572k141m176k182J911M070K090j571
$$ -2061 1668 4219 2449 -1986 -3976 -2462 1798 4370 2229 -1947 -4129 -2218 1852 3942 2371
1157B371l953k749K043M317J793j412m135k421K027L588K620j469m717j786J631
$$ 2371 -1582 -4331 -2288 2029 3822 2410 -1725 -4146 -2119 1469 4089 2620 -2097 -3883 -2252
1172b252L913K360j884l527k757J663M548J608j326l925k427J935L446K557j384
$$ -2252 1661 4021 2137 -1390 -4147 -2484 2064 3672 2346 -1579 -4006 -2071 1375 3932 2548
1187B548m354k124J686L907K109j528l627k621J699L938K267j629l991j914J235
$$ 2548 -1806 -3930 -2244 1663 3772 2244 -1383 -4004 -2305 1633 3900 2271 -1720 -3634 -2399
1202b399L865K389j630l583k727J795M048J699j010l903k336J592L466K714j742
$$ -2399 1466 3855 2225 -1358 -4085 -2290 1758 3457 2447 -1456 -3792 -2200 1266 3980 2238
1217B238l861j949J172L989J990j290l522k763J915L505K174j294l878j919J053
$$ 2238 -1623 -3572 -2400 1589 3579 2289 -1233 -3996 -2081 1424 3598 2304 -1574 -3493 -2440
1232b440L756K541j826l319k433J514L688J859q70l824k369J552L475K466j663
$$ -2440 1316 3857 2031 -1288 -3721 -2207 1481 3340 2470 -1354 -3723 -2171 1304 3770 2107
1247B107l482j998R63L869K067j230l559k462J783L145K203r98l888j893J028
$$ 2107 -1375 -3373 -2410 1459 3526 2296 -1263 -3725 -1942 1203 3406 2408 -1480 -3373 -2345
1262b345L624K413j754l070k392J284L610J869q08l812k177J585L084K400j384
$$ -2345 1279 3692 1938 -1132 -3524 -2240 1370 3239 2431 -1381 -3558 -1973 1111 3511 2127
1277B127l432j933Q43L712K064j311l209k339J508L041K271j022l640j925J006
$$ 2127 -1305 -3238 -2395 1317 3381 2070 -1139 -3478 -1970 1071 3342 2320 -1320 -3245 -2239
1292b239L489K183j416k943k502J269L374J876o84l752j977J360K738K654j359
$$ -2239 1250 3433 2017 -926 -3428 -2159 1215 3091 2407 -1345 -3322 -1962 776 3430 2071
1307B071l239j922O87L727J828j179k837k550J317L104K151p93l633j840J054
$$ 2071 -1168 -3090 -2403 1324 3152 1973 -864 -3414 -2097 1007 3158 2365 -1268 -3108 -2054
1322b054K977K346j243l016k114Q65L281K066r01l197k072R26L021K373j208k948
$$ -2054 923 3269 2026 -990 -3104 -2239 1042 3108 2207 -990 -3062 -2136 885 3258 2050 -898
1338h98k266R15L389J845p59l207k274J389K647K302r34l369j532N77L045K300
$$ -898 -3164 -2249 1140 2985 2226 -981 -3255 -1866 781 3083 2149 -1220 -2752 -2175 870 3170
1354C170j393k400k397P59L407J573m59l019k526J388K737K078o45l370j865R94
$$ 3170 1777 -623 -3020 -2261 1146 2719 2260 -759 -3285 -1897 840 2918 2273 -1097 -2962 -1968
1370a968K855K147r87l064j797Q51K809K063j070k548k093P31K974J730n29k682
$$ -1968 887 3034 2047 -1017 -2814 -1963 846 2909 1839 -709 -2802 -2071 903 2633 2104 -578
1386e78k591J269K629K088l64l612j733R65K599K513j369k861j515L63L290J650
$$ -578 -3169 -1900 729 2817 2453 -1159 -2892 -1927 672 3185 1816 -1045 -2560 -2197 1093 2743
1402B743j066k076k513J004K793J438j7k992k187J061K193K429m87l250j760N59
$$ 2743 1677 -399 -2912 -1908 885 2323 2306 -686 -2873 -1812 381 2810 2323 -927 -2687 -2128
1418b128K782K432j271k596j810L66L262J622j011k078k436J095K670J204J64
$$ -2128 654 3086 1815 -781 -2591 -2225 1037 2659 1648 -430 -2866 -1771 899 2103 2267
1433B267k857k180J070J905K487m37l038j548K8K834K538j290k333k147N25L351
$$ 2267 -590 -2770 -1700 205 2692 2255 -783 -2331 -2303 531 3069 1779 -554 -2701 -2176 1175
1449A175J150m53k368k396J345K177J543n8k913j559O45J758K612o56k695j519
$$ 1175 2325 1872 -496 -2892 -1547 630 2173 2115 -798 -2357 -1712 46 2658 2002 -693 -2212
1465b212j39K922K256j112k037k430N43L306J209m00k425k308J375K065J574j56
$$ -2212 -2351 571 2827 1715 -322 -2752 -2209 1097 2306 1906 -519 -2827 -1452 613 2187 2031
1481B031k916j372N65J844K458q95k182j588k29K885J945p27k014k528O63K909
$$ 2031 -885 -2257 -1692 152 2610 1715 -467 -2055 -2284 601 2546 1819 -195 -2723 -2060 849
1497H49J376j57k678k163J297J867K006n03k751j181L05J923K350r50j984j604
$$ 849 2225 2068 -610 -2773 -1476 391 2397 1894 -857 -2038 -1733 190 2540 1590 -394 -1998
1513a998j75K734J638l98j826k676P14K651J448M9k788j874R77J798K166n44k753
$$ -1998 -2173 561 2199 1801 -25 -2701 -1987 664 2112 2161 -627 -2501 -1524 274 2440 1896 -857
1530h57j096J28K172K039q72j680j853K3K576J432j16j957k331O42K059J783J34
$$ -857 -1953 -1825 347 2386 1514 -166 -2019 -1996 580 2012 1896 -61 -2392 -1750 309 2092 2226
1547B226k818j738O46J938K178o90k418j355J11K320J841q05j664j808J67K355
$$ 2226 -592 -2330 -1684 254 2432 1742 -676 -2031 -1920 400 2241 1436 -228 -2036 -1869 486
1563D86J381%j959k219N94J931J843L8k623j512K73J864K335p48k148j439pK437
$$ 486 1867 1867 -92 -2311 -1717 214 2057 2095 -528 -2040 -1767 97 2432 1684 -464 -1903 -1910 527
1581E27J571o28j598k043M70K137J355l1j955j885L93J781J949j79k222j638K23
$$ 527 2098 1470 -128 -2171 -1701 436 1791 1760 -195 -2080 -1687 94 2043 1864 -358 -1996 -1773
1598a773J944K025m49k016j722J31K231J642m22j754j866L25K120J361j1j951
$$ -1773 171 2196 1747 -269 -1991 -1860 371 2013 1591 -163 -2029 -1704 416 1777 1766 -185
1614a85j826M77J592J830k6k228j487MJ984J930m46j728j863J56K174J438m5j932
$$ -185 -2011 -1534 58 1888 1862 -366 -1853 -1849 135 2065 1619 -109 -1972 -1816 358 1796 1751 -181
1632a81j846N16J712J631j48j970j523J45J782J692j57j833j658J62J777J776
$$ -181 -2027 -1511 201 1832 1684 -286 -1809 -1664 118 1810 1653 -180 -1838 -1676 101 1877
1648A877j90j904j572k5K043J625k73j622j856K51J836J534R0k075j516K44J474
$$ 1877 1687 -217 -1789 -1814 229 1854 1581 -41 -1897 -1646 190 1724 1814 -261 -1777 -1533 -59
1665e9J942k63j752j532j02J917J575j63j611j823K95J719J571j5j940j451O2
$$ -59 1883 1620 -132 -1664 -1766 151 1726 1563 -48 -1871 -1576 143 1714 1699 -241 -1692 -1630
1682a630J702J706j84j620j733Q0J818J504N1j753j604O6J608J754j80j650j559
$$ -1630 72 1778 1594 -26 -1759 -1679 139 1643 1694 -59 -1663 -1597 11 1765 1585 -65 -1624
1699a624o0J833J438j1j553j783L06J454J601O9j870j382m4J638J734l04j353
$$ -1624 -1684 149 1587 1576 23 -1760 -1454 0 1601 1670 -200 -1582 -1626 12 1746 1442 89
1716H9j720jJ770J355J53j661j656K11J374J704m8j620j418j50J694J487jj503
$$ 89 -1631 -1632 138 1493 1646 -15 -1671 -1460 -86 1618 1570 -50 -1468 -1618 76 1563 1562 59
1734E9j666J43J496J531O2j712j379j67J641J626k38j258j716P2J615J288K42
$$ 59 -1607 -1464 32 1563 1625 -87 -1466 -1633 8 1634 1396 138 -1578 -1506 109 1397 1639
1751A639j649j537J66J259J694q4j493j423j77J645J404Lj296j743J42J426J452
$$ 1639 -10 -1547 -1381 -122 1572 1488 -5 -1428 -1605 40 1444 1447 151 -1592 -1450 -24 1428
1768A428J62j590j470j2J438J549m9j381j562k8J525J308J38j455j460O7J270
$$ 1428 1590 0 -1470 -1482 -44 1505 1456 75 -1487 -1515 10 1318 1456 1 -1459 -1392 -122
1785a22J570j1j401j433j53J531J330J78j422j614J45J237J564J20j651j108k32
$$ -122 1448 1437 36 -1397 -1550 -19 1311 1489 67 -1547 -1402 -165 1399 1519 -132 -1240 -1472
1802a472J304J645j66j215j451j45J475J211K53j293j662K11J169J503J75j472
$$ -1472 -168 1477 1311 96 -1355 -1500 -25 1186 1439 146 -1516 -1305 -136 1367 1542 70
1818G0j373j23J270J545L9j421j366q1J392J433q1j266j304k04J463J241J10j128
$$ 70 -1303 -1426 -156 1389 1428 7 -1359 -1440 -48 1385 1304 38 -1266 -1470 -7 1234 1344 216
1836B16j612L5J164J335M39j530j360r0J123J658L1j375j207m13J607J332r3j034
$$ 216 -1396 -1361 -197 1138 1577 47 -1313 -1403 -280 1378 1409 34 -1173 -1586 21 1353 1260 226
1854B26j539k5J387J021L35j263j435R9R35J423K52j342j233l05J216J606L4j250
$$ 226 -1313 -1338 49 1070 1405 142 -1293 -1194 -259 1164 1416 74 -1159 -1464 -248 1358 1392 142
1872A42j310l73J473J317m9r65j559m0J402R78L68j242j390J38P80J483K45j375
$$ 142 -1168 -1541 -68 1249 1200 235 -1324 -1364 38 1016 1384 142 -1248 -1110 -330 1153 1398 23
1890B3j034m03J061J702j34q74j499m02J587J149R5j045j609J66J167J050L94
$$ 23 -1011 -1414 -353 1349 1215 341 -1158 -1560 27 1176 1271 226 -1383 -1217 -50 1000 1394
1907A394j363j210L8P98J431J62j136r40n72J118J438O1q09j548l95J488J100
$$ 1394 31 -1179 -1141 -343 1088 1250 114 -826 -1398 -280 1158 1219 410 -1138 -1533 -45 1055
1924A055L22j089j702K74J000J189L91j415j041k5O99J500J7j057r40n87J180
$$ 1055 1377 288 -1414 -1140 -140 1049 1440 25 -1016 -1041 -342 1158 1175 118 -822 -1409 -229
1941b29J303J24p45j579l13J338J065M34j109j604J60R10J323K72j404r77j31
$$ -229 1074 1198 453 -1126 -1439 -101 964 1398 289 -1315 -1155 -245 1078 1350 -54 -1031 -1162
1958a162Q80J431j00q99r25o07J203J116J35n84j534k56J093R96P00j214j427
$$ -1162 -282 1149 1049 150 -775 -1382 -179 937 1072 488 -1046 -1302 -209 787 1487 273 -1154
1975a154mQ22J422L01j409q59l40R56J415j50p86j028m61J151R41K95o78j569
$$ -1154 -1158 -336 1086 1387 -22 -881 -1221 -265 1150 1000 214 -814 -1275 -124 817 1112 434 -1135
1993a135k9Q68J084N73j100j317r1P02J518K57j243r32l98R79J323p0p16j149
$$ -1135 -1164 -296 788 1361 261 -1056 -1147 -445 1073 1330 87 -845 -1243 -264 1059 989 273 -876
2011h76l18J108Q68L46p23j415o7P82R99O27j130j077k47O83J475J39j018r40
$$ -876 -1194 -86 782 1128 405 -1010 -1077 -295 704 1331 201 -876 -1123 -440 1035 1174 156 -784
2029g84n45J137J189M6p13j241k53J072Q48L66q13j238p8P03J096M01r48j080
$$ -784 -1329 -192 997 1043 330 -911 -1164 -92 756 1122 309 -929 -1007 -304 792 1193 245 -835
2047h35k57P11J320J27p94j035m56R99J108J76o91j265k42R84Q85M36q68j218
$$ -835 -1092 -381 939 1066 272 -763 -1219 -220 888 1064 373 -892 -1134 -150 735 1171 303 -915
2065i15p6O49J097M37j007q80m03O87J230K34p03j105m19R05J046L04p65j206
$$ -915 -991 -342 755 1192 185 -695 -1098 -411 819 1053 350 -755 -1174 -269 777 1081 316 -890
2083h90j68P48J067L30p99j105k41P29J067L66q24j064k65P20J151K44p36j080
$$ -890 -1058 -310 757 1087 288 -817 -1058 -329 738 1104 280 -784 -1049 -329 822 1066 330 -750
2101g50m01Q59J056K84o92j152j76P20R48L81p92r98k54N62J180K34p49r46m34
$$ -750 -1151 -292 764 1048 356 -796 -972 -252 696 1077 285 -713 -967 -405 775 1009 260 -686 -1120
2120a120Q14J051K56o07j180k67P99Q91M53p51j024l40O35J119K77p48r08l60
$$ -1120 -306 745 1001 394 -786 -1053 -254 637 1090 339 -685 -1025 -390 729 1006 258 -650 -1010
2138a010O50J092L04o85r92l35O16J050L12o66r83m06Q01R19L24o24j042l07O27
$$ -1010 -360 732 1036 351 -641 -976 -360 690 1002 336 -647 -1053 -252 667 991 367 -675 -982 -355
2157c55J001M01q00q88l37N81J101K09n15j066l28O79Q66M35o03j072k79N97J052
$$ -355 646 1047 247 -641 -978 -397 704 913 398 -668 -996 -317 549 984 381 -691 -970 -373 679
2176F79K74o28r10l99O54R73L07n47r77l32N12J065L10o31r09m15N91J006L08
$$ 679 953 325 -585 -984 -330 643 950 403 -574 -906 -394 671 981 350 -559 -974 -383 623 931
2195I31n73r96l74O84Q44M74o68r10l88N54J043L31o37q69m62O60R58K84m99j020
$$ 931 358 -638 -1012 -328 516 990 322 -588 -976 -422 621 952 315 -554 -1016 -356 602 886 387 -633
2215f33l17N69R45L67o24q66l45N28R34L80o11q74l86N99Q90L40n52r25k99M44
$$ -633 -950 -381 564 931 307 -559 -904 -376 558 938 327 -547 -933 -334 556 896 344 -581 -880 -436
2235d36J047K91n51q56l92N64Q35L73m79r15l06M45Q50M81o43q10l48M58R93K76
$$ -436 611 902 351 -505 -897 -333 502 875 396 -519 -825 -380 470 951 308 -502 -850 -392 601 877
2255H77n45p90m44N56Q61K96m49r38k51M79Q00M04n17q37l68M63R55K50m00q51
$$ 877 332 -458 -902 -346 515 811 362 -576 -827 -348 452 856 339 -498 -866 -403 552 802 402 -449
2275d49m66M90R24L55m69q45m66N70Q06L20l68q87l58M92P27N09n16q41l11L25
$$ -449 -915 -425 499 854 385 -460 -926 -356 450 770 402 -485 -843 -351 376 885 369 -472 -783 -458
2295d58Q97L68m43p72m93N21Q90K50l29q14m62N18P02M65m71q40k71L56P76N21
$$ -458 439 807 364 -408 -901 -380 510 760 431 -383 -845 -327 375 840 369 -471 -742 -386 390 911
2315I11n58p59l40K66Q90M21m78o90m90M48Q01L10k86r25l52M96O32N32m13r08
$$ 911 353 -406 -746 -480 410 831 353 -337 -827 -379 422 732 446 -479 -831 -335 297 829 416 -492
2335d92k22K97Q23M52n75o28m31L81R04K24l15p28n65O29O23L16k21r22k66M27
$$ -492 -714 -417 406 858 283 -345 -776 -395 509 733 418 -310 -875 -246 377 693 472 -450 -716 -289
2355b89O46M51m43p84k50K25Q45L81n09n41n29L65Q52K35k40p47n11N28O89L62
$$ -289 357 808 365 -419 -669 -444 401 782 273 -268 -797 -432 420 655 415 -332 -843 -315 374 736
2375G36k68q89k77L57O37N17m92p12k56J78R12K86m49n31n00L55Q19K48j95q20
$$ 736 468 -421 -698 -341 296 813 321 -391 -647 -469 443 729 280 -251 -751 -396 423 671 476 -344
2395c44m69N07N25N27k67r18j46J46P02N68n61n65k89J16R06K32l32n35n77M20
$$ -344 -813 -306 219 746 479 -439 -585 -439 263 831 270 -295 -584 -468 438 670 338 -197 -774 -354
2415c54O94K69j00q30m19M36N32N31l42q24j65J20P61M65m82n38m29K06Q57K55
$$ -354 340 609 509 -321 -740 -304 228 759 417 -407 -572 -452 309 774 292 -246 -675 -469 388 643
2435F43k27o41n62M61O39K51j04q21k79L22N14N32l79p11k40J10P98L91l48o09
$$ 643 416 -225 -787 -326 313 564 460 -361 -640 -318 196 728 349 -362 -602 -492 306 697 349 -260
2455b60m04K12P34L38j99n91n35M02N62L57j34q12l22K75N12O08m51n35l05Q0
$$ -260 -664 -452 282 620 421 -170 -705 -303 259 616 482 -330 -652 -377 135 743 292 -243 -548 -468
2475d68P74L45k96n27n58L46P31K33j88o66l85L50N02M38k20p67k10J70N49N31
$$ -468 306 651 355 -172 -730 -384 347 580 392 -274 -659 -309 193 631 411 -356 -566 -396 153 684
2495F84l56n61l76J05P68L44k65m89n25L19O51J90n7o84l57K54N22M78j93p17
$$ 684 328 -233 -609 -504 264 608 343 -146 -671 -352 299 489 432 -252 -609 -355 167 645 452 -265
2515b65k37J13N96M28l21n15m28J57P32L17k47n38l96K75N66K97j25o81l25K81
$$ -265 -502 -389 207 635 314 -201 -629 -472 260 577 330 -208 -604 -329 237 534 409 -272 -597 -316
2535c16M46M40k13o19k75J23O05L99l08m34m49K12N95L34j59m96n12L02N06L44
$$ -316 130 570 357 -262 -537 -414 191 590 282 -152 -601 -389 206 540 381 -115 -627 -325 181 525
2555E25j03o39l66K17N20L95k29n16l73J71N89L81k59m50m36K32N50K54k5o38
$$ 525 422 -217 -583 -366 154 549 320 -196 -569 -398 191 572 313 -137 -573 -341 209 463 438 -200
2575b00l41K74M12L86j40o13l47K09N17M29k73m91l25J53N33L17j32m80m30J31
$$ -200 -541 -267 145 531 391 -222 -569 -360 157 586 313 -178 -503 -350 183 500 368 -112 -542 -411
2595d11N23L68p6n30l63J55M35M41j44n70l11N3N28L99j58n02l08R0M76L98j61
$$ -411 112 480 404 -126 -489 -334 101 542 398 -172 -483 -430 98 497 339 -163 -471 -381 95 493 332
2616C32n00l58K10M77L26p7n60l49J24M90L93j62m99k53O9M91L52j23n37l09J37
$$ 332 -168 -526 -316 161 487 410 -150 -499 -375 115 508 346 -153 -406 -337 154 506 383 -154 -463 -326
2637c26N02L24j73m29l79J11M81L03o9m38m11J89L83M41j95m13l48P5N03L20j06
$$ -326 176 500 327 -102 -481 -370 111 414 345 -93 -504 -315 68 509 314 -99 -447 -372 131 451 345
2658C45m57l73J25N27L08j27m48l33J51L33L76p9m68l28J04M06M09j76l69l63
$$ 345 -112 -485 -360 167 475 348 -100 -433 -282 51 427 348 -120 -448 -344 62 471 295 -74 -437
2678d37O4M79L70j28m32l28M8M28L50n2n36k76J04M54L38j23m29l32J18M50L34
$$ -437 -373 106 476 348 -84 -412 -364 64 414 362 -174 -450 -346 108 446 323 -106 -438 -320 130 464
2699D64j53m28k96O5M48L44j51l48l82J52M23K72p1m47l15N8M06L81q8m01l48
$$ 464 311 -117 -413 -348 100 444 293 -55 -437 -285 138 410 339 -108 -423 -365 41 422 334 -67 -415
2720d15J15L52L03m5l99k73K7M09K63M7m52l36Q9L31L53rm46l45J57L41L62j36
$$ -415 -300 52 355 310 -89 -362 -335 74 337 384 -68 -404 -315 16 369 360 -86 -431 -274 67 429 293
2742B93l32l36J3M43L62j41l75k65N8L51L05k2l89l60J42L06L00J0m51k43J4L05
$$ 293 -39 -375 -362 81 443 302 -73 -338 -280 71 376 354 -35 -395 -253 53 353 363 -88 -331 -317 -12
2764a2L74j30k83k68k6M24L29r4l75l35Q1M15K17J2l21l49R2K92L53J5m69l09
$$ -12 362 232 -51 -319 -345 79 408 314 -61 -396 -315 100 317 329 8 -341 -249 43 396 411 -58 -367
2786c67J2L20M08r5k71l71LM17K63l4l10l12M3L85K56j5l88k77Q7K20L59l5l56
$$ -367 -355 -35 373 278 7 -364 -361 56 319 285 -25 -337 -294 91 347 332 -56 -333 -246 -26 333 298 -58
2809e8k65J5L58L17j20k72l83jN41J77J5l68l39J29K63K46L8l85k04M6K53L27
$$ -58 -323 -308 50 367 247 -25 -408 -409 132 309 324 -44 -383 -254 9 255 293 -92 -296 -250 3 330
2831C30o6l37j59j20L90L30j10k53l70N2L38K56L6l57k99P3K63L09M0m14k62M8
$$ 330 264 -73 -232 -352 38 368 258 5 -365 -313 25 281 317 -40 -339 -266 -3 306 346 -68 -330 -282
2853b82K26M30j12l17k40o2L96K66p4k13l75P3L35J80J52m25k93P9J73M21j2m17
$$ -282 -56 374 262 -55 -295 -357 39 305 231 18 -357 -284 51 231 383 -42 -335 -256 -83 338 326 -91
2875i1j24lK16L27r4k59k40m9L56J76P2k75l37N0K78K39J17l70l18O9K39L33K1
$$ -91 -215 -218 -2 325 231 -28 -268 -317 39 215 287 12 -325 -275 3 242 359 -11 -329 -260 -21 312 333
2898C33m22j51o3K90L38r9k16k88j9L32J98j4j70l49Q9K30K23J22m03k58P5J47
$$ 333 -89 -240 -303 -13 325 226 10 -278 -297 35 233 219 49 -300 -211 19 242 364 -39 -297 -222 -75
2920g5L99n7k73j98q8L07K72o1j90l67O6L74O6N5k04l08P1J27L22K3l08k11K0
$$ -75 324 267 -6 -204 -292 15 287 226 36 -331 -265 109 175 230 26 -282 -211 -84 238 261 -47 -258 -238
2943b38K01L54p3k10k65p0L60K35p5j57l28OL07J17J11k56k95N8J96K40J1k45
$$ -238 -37 317 244 34 -231 -301 59 294 219 62 -266 -260 47 164 275 19 -276 -218 -22 218 229 -16
2965a6k08k3J99L09j7k22k90m5L56K05j6k15l00M8L05J13J03l21j91pJ94K81l
$$ -16 -224 -247 -48 261 244 22 -268 -313 43 248 232 17 -283 -235 70 183 286 -35 -226 -233 -39 242 239
2988B39j93k60m8K68K85r5j35k59j14L20J98K4j34l44QK64J48J09k79j98m8K49
$$ 239 46 -214 -262 6 291 196 61 -198 -312 8 206 230 96 -248 -240 24 172 281 2 -196 -244 5
3010EK10N3k57k18n4K34K71m5j40k58k5K17J82R8k71k45K7J72K95J3k43j72r2
$$ 5 215 268 11 -207 -261 -27 244 199 59 -199 -224 -7 175 273 2 -243 -216 -44 251 264 21 -151 -243
3033b43K21L20p1j89k16j8J84K41L1k18k62m4K50J82M7k21k35m3K06K62Q9k72
$$ -243 -22 298 227 38 -178 -196 -12 229 260 42 -220 -264 -14 168 215 -6 -241 -284 -78 184 273 1
3055Aj98j9J99K87q3j45j93p1J84J94N2j81k57M8J80J81Q9k45k23M1J58J66L4
$$ 1 -197 -216 -17 270 187 42 -151 -222 -38 156 208 27 -230 -182 -2 179 268 23 -200 -159 -1 165 199
3078A99j84j82k8J81K66n7j56j99o1J83J75J18k34k14m9K11K00P1k34j65l8J59
$$ 199 15 -167 -195 -14 252 195 39 -160 -221 -38 137 255 21 -193 -242 -31 169 240 6 -159 -197 -38
3100c8J82O1j80k55j3K42J66O3k02k13rK05J56L3j42k13l5J20K75j0j34k50n2
$$ -38 144 205 25 -230 -243 -1 165 228 26 -187 -196 9 165 198 56 -157 -192 -72 203 193 59 -191 -243
3123b43J54K38K0j41k58jJ96J61Q0k11j90J9J58J75M4j53k00l9J15K45K2k06j45
$$ -243 -89 149 169 28 -230 -231 -35 126 206 -5 -195 -176 -18 157 201 48 -152 -191 -76 169 191 -15 -160
3146a60J1J34J75L4j44k01o1K06J70Oj30k23k0K10J64lk11j71L2J73J50P2k04
$$ -160 -149 -15 160 194 50 -151 -212 -6 164 170 40 -183 -203 7 171 168 -43 -214 -182 -9 141 213 9
3169Ij46j13J99K18k2j01j84o3K02J74K9j04l02M5J57J51j9q5k00j7J29J69L5
$$ 9 -137 -250 -51 167 145 44 -140 -203 -1 173 202 98 -204 -159 -2 149 130 45 -155 -172 -43 126 161
3192A61q3j42j10J46J70L1j52j63k7J26J94L8j43k09nJ24J77N8j55j43j30J88
$$ 161 78 -64 -174 -28 142 173 21 -142 -169 -43 151 189 46 -163 -168 -44 133 191 36 -107 -237 -49
3214d9K41j7j48j64p0J77J90k7n5k88N1J12J93Lj16j82M5Q5J42N2r5k33rJ09K02
$$ -49 192 175 27 -137 -207 -30 160 133 78 -210 -159 -47 146 149 33 -149 -104 -19 123 175 80 -153 -162 -53 149
3239A49K4j36j96k9J60J55N6j10k65J2J71J01R2k23j59jJ37K02j7r3j69k5J41
$$ 149 173 37 -159 -188 -28 127 183 73 -192 -180 -9 92 184 -39 -198 -199 -62 140 123 30 -139 -164 -23
3262b3J44On8k00l8J57R7J00j72j73L6Q5J62R1k21k0r2J23J54M2k34j05l7J38
$$ -23 121 127 69 -131 -169 -12 85 185 13 -160 -124 -39 123 214 -7 -27 -119 4 158 200 -34 -139 -176 -38
3286c8J53j0p1j53j8J15J19O4j40j58%P5K08N2j63r5p3L9K29lj35r5o8J83J03
$$ -38 115 105 34 -119 -137 -22 97 161 21 -137 -137 -62 146 198 35 -60 -133 -94 135 132 -3 -98 -166 17 120
3311A20J0q2j59n7J23J09N3p7j36jqK14P6k05o5k2P2J72K0j17j45p2J30J76l3
$$ 120 130 48 -111 -168 -45 64 117 40 -96 -97 -105 109 185 -20 -85 -107 -35 137 157 40 -105 -177 -47 129 96
3336I6p2j93nJ52J07Q2k02n8q8J12J58Qr1p1j08J30J58l2o7j19l6J49J21np0k04
$$ 96 24 -169 -174 -22 85 167 -35 -93 -181 -69 89 97 6 -65 -173 -43 115 83 16 -103 -139 10 131 126 56 -148
3362a48L2J5J72Q6j62j21%P3J80oj23r1q4R1K09j9o9k04nJ61M5R5r2j98Q6L1J61
$$ -148 -116 -101 71 157 -5 -126 -126 -53 127 121 -2 -93 -177 -86 123 104 35 -169 -174 -13 32 127 35 -163 -77 -46 115
3389A15L2j57j06kK7K13n0j3j60p5J64J37m4lj95k0J32O7L3j31j30N8Q6J03M2
$$ 115 147 -10 -116 -118 -91 122 72 59 -101 -176 -12 125 81 78 -117 -137 -5 62 95 -36 -166 -108 -22 81 123
3414A23j33p3k0K4J32Q2j29r4q5J24J00P0q8j52j9J12J18kq7j32O6kJ71N3j52
$$ 123 -10 -83 -103 -79 53 135 6 -88 -173 -49 51 121 33 -119 -138 -26 92 90 3 -129 -63 -65 106 159 7
3439Gk5j47R3J46J5p5j36kJ34O6L9l7j70J2K0J29L4p6j23LM7J35J4j29m3l7J25
$$ 7 -18 -165 -72 74 89 14 -122 -124 10 76 115 78 -92 -80 -60 69 103 27 -96 -93 -46 89 103 -26 -69 -106 19
3466A9L4K3j6j52JO9P0J16j57j09nQ8J09J7j88k8M6L9J27po4q2l1M7J27K9o6j74
$$ 19 53 76 60 -92 -91 -22 48 164 7 -102 -107 -19 90 107 -81 -109 -63 -24 103 96 32 -50 -81 -34 93 122 56 -118
3494a18L4O1P7N4o2j55k1R3J05J3o6j01j5N7J39Rr1j04J0J17L7L3p4j00pM9Q1
$$ -118 -84 -23 54 108 46 -109 -130 -37 68 81 15 -86 -101 -44 95 104 13 -91 -81 36 73 106 32 -68 -75 -26 55
3521E5P0r0j05o2R2J24J3o9q6n0J34O7ro5j04q7J46R2n6K8j02n6J08O8M0q8q1
$$ 55 125 35 -70 -132 -40 84 97 28 -58 -108 26 93 84 19 -85 -172 -26 66 10 38 -64 -120 -12 56 96 8 -73
3548g3n1R7N5Q4n7j75J0N9J35L7r9r1K2NR0N6o5j40J3Q8O8J6m6q2j00J16P2M5
$$ -73 -124 -27 28 112 55 -120 -110 -51 84 121 22 -69 -47 -42 48 104 39 -101 -88 0 68 84 38 -44 -144 -28 44 89
3576H9j01n6J8L2Q8qn4j18j8J16O9L9o8p9l0P5L9L5q3k7m8Q9M8L1r4j3j3j2J06
$$ 89 -12 -68 -50 -18 70 62 8 -110 -128 -12 57 96 28 -51 -81 -6 33 68 -15 -42 -90 -1 47 78 -16 -29 -42 -54 52
3605E2P7j48k6k4O4N0mn3o5jN5Q7J5r9q5N5K1J02k3n2o1l7R1O3P5n7j88L1O6K4
$$ 52 129 -19 -45 -69 -5 45 41 -12 -77 -78 -23 64 79 -20 -105 -50 -29 73 50 -2 -63 -100 -9 54 129 72 -116 -85 -19 5
3635EL7r0k4rJ00JJ18r7p6MJ7K4N2q6j8j8O7N4J0l4j27K6O8L6J7n7n4k6Q7M6K9
$$ 5 42 -48 -72 -81 19 20 138 41 -35 -31 -14 10 62 -24 -42 -60 7 61 71 37 -90 -64 4 40 57 0 -54 -80 7 53 82
3666H2q2m4r7J80RQk3p9NJ1J12K7o6j05kO1P5J3j00n8j9J47M0n7m5p0M5m7J49
$$ 82 0 -44 -141 39 48 56 33 -46 -41 -30 82 109 43 -62 -64 -3 72 85 -15 -73 -92 55 95 38 -7 -77 -32 -79 70
3695G0l0m2r2RR3M9M3o9o5p1J07P4Qp9n0mJ0P1K5r8j1K5J5M8M2n3p1NP1N2L7r9
$$ 70 40 -2 -94 -85 8 57 100 31 -34 -105 2 76 84 5 -45 -49 -39 32 57 -41 -52 -27 -12 36 78 25 -46 -41 30 82 119 20
3727B0n7L5oK7MK1j51RP8L8Q1n8j06j6R2N3Pr2m3j6J05RJ06j26r4J3mJ29K4j05
$$ 20 -37 -2 -8 19 23 44 -107 -98 -20 18 99 41 -65 -81 11 64 71 -21 -64 -80 25 34 140 14 -80 -67 -71 58 82 -23
3757b3Lo4J19K0K7l8q7l6N1J8P2j3r0m2K9J40Lr7m7J3k2R6j1k9n9NK7Q7n4Lo2
$$ -23 -20 -84 35 55 82 44 -43 -79 -28 -10 62 49 -41 -83 -54 86 89 -8 -55 -42 -64 32 21 -8 -67 -62 -35 52 -2 1 -61
3788f1j3L5P0J4j04L9j4n9J64M5j44j1j5L5L1N5m3l8m0P4O9l1o4p7M7MR1Jj02
$$ -61 -74 -39 31 45 -59 -20 -34 -93 71 116 -28 -39 -54 -19 12 67 24 -14 -54 20 89 58 -6 -83 -36 -32 59 60 -42
3817d2KJ8%R7n1m9n6K2Q6pK8j7q6K2J5P8k1m4n1m6J03KN5n4n9l5P5mQ8q5j3m0
$$ -42 -40 -22 -22 75 24 -25 -81 -59 27 20 48 31 -55 -33 -18 60 39 -5 -56 -102 1 3 58 4 -55 -90 -15 -19 69 -16 -29 -69
3849f9J05L4n3Mr7K1M5R3q9j5l1L6J1N1qn2pj2L8Pqn1j1JP0O9Op9q1L2R2qP4j07
$$ -69 36 70 17 21 -76 -55 -10 83 -6 -21 -52 -16 -5 46 38 -14 -21 -33 5 12 4 -47 -58 -57 13 82 88 9 -72 -40 52 44 118 11
3883A1m6M9o2R2J3j6r0k4P7Q0p5j2p0N1N7j3Nrj01M0O5K6%q4J7j6PJ9nn7O5q4
$$ 11 -35 14 -48 44 57 41 -49 -73 4 84 9 -3 -73 -22 35 22 27 18 -83 -43 22 48 48 -36 -19 -35 -28 -9 -14 -71 -6 -90
3915i0J28qk3m6L0l0RK6P5k2r1K1J6L8K5j22P4n9R3j4l4mm8j4K8P5K0j6j31O9
$$ -90 38 30 7 -39 -9 -39 -30 -4 71 49 -42 -21 -5 33 58 -64 10 -49 44 30 -4 -8 -56 -70 -42 33 53 37 -94 -25
3945b5K7J9K2j16J4N5l1J11m4%o3J7RK0j4l1L7m1K2O1l6Ro2qO6NM3j14l0M4N4
$$ -25 2 21 43 -73 -59 -4 -35 76 32 32 -31 -14 -5 15 1 -30 7 -34 -12 49 13 22 -40 -48 18 23 66 -48 -78 -34 20
3976B0L6m7nj9m7Q4nL1n0n8k6Q5M8p2k7K0j6M9L9L9j23pL4L6L4k4m5j6kM4l4O5
$$ 20 56 9 4 -15 -62 22 17 48 -2 -60 -86 -1 47 -25 -52 -32 -48 1 40 79 -44 -51 -17 19 53 29 -16 -32 -34 10 -24 41
4008D1o7J8Ll7L1k1K0J0j6pP5n2k1k4MN6K8l2Kp3QM2N9m9lJ4j4k7M0k1N2n1m3
$$ 41 -26 -8 -5 -42 -11 -32 -12 -2 -18 -25 50 -2 -23 -47 -43 13 41 9 11 -62 -54 -12 47 -2 -5 9 -5 -32 8 -13 39 -12 -55
4041e5N4qK0Oo0l0O0M8j0l3j01Q1N7L1m8k2q7N1LP4pQp9K5%P8k6j3Nl9J3K0J9
$$ -55 -1 -9 11 17 -43 -73 -13 35 25 -8 -109 -28 29 60 12 -10 -97 -46 -43 31 24 32 -47 -22 -22 56 30 17 22 -17 -4 16 35
4074C5k7k8k9M9K0%l1l4m5J43n8L1Ll5j5O2J0k0p8k4oM7kP4Lj34N1Q6m4k4J3k1
$$ 35 8 -20 -49 0 20 20 -11 -45 -90 53 -5 26 29 -6 -21 41 51 31 -47 -71 -77 -30 -32 42 45 -89 -38 48 4 -20 -7 -28
4106b8K4KL8lj8o0J6M1KL2j05N1j3N6n0L6J8q7J7L6RK3J2m3l6k8J26o6J2o3k2
$$ -28 -4 -2 36 33 15 -45 -29 12 14 46 -59 -8 -21 35 -15 21 39 -48 -31 5 14 37 49 6 -30 -58 68 2 14 -49 -71
4137g1M3N3mJ0r4M9L9J0L3j04kk4J13Rk2r2qM2m8Q8J0n0p0M0P8nll9j2mM3l3Q0
$$ -71 -28 25 21 31 -63 -14 25 35 68 -36 -38 -62 51 60 38 -54 -62 -20 -68 20 30 -20 -90 -50 28 23 20 -19 -31 -35 8 -25 55
4170E5or3M0PJ8l2j6l9N1M9k0j3J1m7K6J6Kk2oK2m4M7O5o9n0M5j2L2J4qm0k8R
$$ 55 49 -44 -4 3 21 -11 -27 -66 -15 34 14 1 12 -35 -9 7 9 -13 -19 3 -41 6 71 2 -48 -3 -15 17 31 23 -17 -45 -36
4203c6K2P4k7mm6m1Q8oJ4p3Pj7M9N7l2k2Pp4P2MK0l9Ok3N3M1q1lQo2J13p5L1l3
$$ -36 -14 60 33 29 -17 -58 30 24 38 -35 -28 -45 4 61 29 7 14 -60 12 16 36 -3 3 -20 33 74 -7 -10 -2 -64 49 -26 5 -28
4237b8Qm9R6M1o4J9o0n8J03N4j03K9%jJ9jk3km4M4J2N0pk6q8R0j1j3J2n5J2K1
$$ -28 -20 -69 27 68 4 23 -37 -95 8 62 -41 -12 -12 -13 6 5 -18 -20 -64 -20 -8 42 35 9 -79 11 0 -13 -1 -56 -44 -23
4269b3m0R6m9rK0m6O0KL8k1n7OM5Jk2Oo2K7L5L2k2k3j2NP4l7%k9k6k8L2J02n5
$$ -23 -63 33 -16 -25 -5 -51 9 11 49 28 -29 -23 22 23 1 7 -55 -28 7 39 17 -6 -18 -13 61 24 24 -5 -31 -59 -27 75 20
4302B0p8LM4N3q0L0k6k0O6l3M9J0p0JL8j3L3l9o1N0j7R9o3K2n3K0J6O5k1l0l5
$$ 20 -58 -55 -11 42 -38 -8 -34 -54 12 -21 28 38 -32 -31 7 -6 27 -12 -73 -23 -40 59 -4 18 -35 -15 1 66 45 15 -20
4333b0j3PK6L8l4m8N6KKj3J3K0j23J45p0RLlk1J8K8k3J4m9j7L6j1L9j9L8m6nK0
$$ -20 -33 -26 0 38 4 -44 12 14 16 3 16 36 -87 58 -12 -3 0 -3 -24 -6 22 -1 13 -36 -53 -17 -28 11 -8 30 -16 -21 -1
4366aJ6Pm4k0J5Q9q1pk8K8qL4O3Rq2l5M3K1oJ3m3j6K8M9J2m2l8m4P8L0nL0k4n1
$$ -1 15 22 -22 -42 -27 62 -19 -26 -54 -26 -34 0 63 72 -10 -45 -2 19 13 26 -17 -33 -5 44 56 14 -24 -68 10 40 35 65 41 -10
4400a0j7J7O6p2Pk0k9R0K0n6rl7J1M7P5p2m8l9K9P4j0qm8K6k2N7j6qL7r0N9K5
$$ -10 -27 -10 56 -16 -9 -29 -58 32 52 -4 -13 -50 -39 8 83 11 -37 -76 -47 27 17 9 -39 -13 -35 22 6 -2 35 -55 4 29
4432B9l%n4l3L8K5RM3k2o5QQ4rl2j5l5KN5K3qp6l0NQ6N5j25MJ5k5J03k6%p1J1
$$ 29 26 26 -28 -61 -23 2 11 54 32 -33 -25 59 50 18 3 -32 -30 25 48 40 -36 -66 -61 25 80 -45 -41 -26 -51 52 26 26 -45 -34
4466c4lL7pL3n0k2P1oK8n4nl1K2NP7j4q9M0m9O1Nrjo0M9Q8l1k7%j14N0O4Jk4m2
$$ -34 -37 0 -7 26 -24 -46 25 19 47 -7 -12 -43 -21 -16 61 47 -42 -2 -51 10 15 6 5 -55 -6 82 51 24 24 -90 -40 24 25 1 -41
4501d1J3qM3K5Kr0j5M7M7Jm0Pl9N7j0Oj6l5j1O2O1K6r1L4o9%O9rk8j5m1N7M5o
$$ -41 -28 -36 7 32 34 -56 -71 -24 23 24 -16 -9 -48 9 -1 5 -11 -46 -57 5 66 92 1 35 -34 -34 35 26 -2 -17 -58 -1 44 38
4535C8l6l3JK1L5j8j6j8k2Q4m2M3k2j05M8J2J5OkK4o7mP2RJ6q2j6Q0j1Qj2k9k0
$$ 38 2 -31 -30 -9 26 8 -8 -26 -48 36 -6 37 15 -90 -42 -30 -15 -9 -11 13 -54 -58 14 23 39 -43 -59 21 10 18 6 -23 -43
4568d3JL4L5km4rN6j3nM7m3p2O9%J3Nn7NJJ15j05K5m1k9N0l4P1k8m1N0jLK0l6
$$ -43 -42 -8 27 25 -19 -28 28 15 10 57 14 -58 11 11 24 29 -28 -23 -22 93 -12 13 -28 -57 -7 -41 30 2 -39 11 10 13 33 -3
4602cj8j0L7MQk4k2j9M5%O3j3o7k6kO5J1k2n5JM4K9k8L5q2M6KRM9k3n6qj2KL4
$$ -3 -21 -31 6 10 18 -6 -28 -47 -2 -2 61 48 -19 -45 -47 18 29 7 -48 -47 -3 26 -2 33 -49 -3 -1 8 57 34 -22 -30 -42 -40 -6
4637fJ1Op3J4J6R6p0k4jK1K9j9J4l5kj1P7kk9m7K5L7J5J2n1Kl1K7PL6o0j8NK0
$$ -6 5 11 -62 -48 -32 64 -6 -30 -31 -10 19 0 14 -21 -23 -34 43 41 12 -35 -10 27 42 54 3 5 -26 1 8 44 -16 -34 -29 -9
4671ik4O4%j15J0R8kNj7n7mM4N6m6j7pM0l2M0K0l1m7k7O1L5J5n5l3J5lJ7N5J3
$$ -9 -33 31 31 -84 -74 24 22 27 10 -47 -51 -7 49 3 -14 -21 19 -13 27 47 16 -31 -58 3 38 53 -2 -35 -20 -23 -6 49 62
4704F2o3MJ9kmk8k0j9K5N8k3oJ9o7L5O0j5n6M6j24O0R7l6k0L9p0K8N3l9Kn4L0
$$ 62 -1 3 22 20 16 -12 -32 -51 -26 32 9 3 22 -45 -10 50 35 -21 25 -99 -39 58 22 2 41 -29 -1 52 13 15 -39 -9
4736ioj7J8nj2l3L6R2q5L6n0nK7M0J1k1j9k0M5j8N0m3l9J0k2Q1Kn5l4K9MkJ1k9
$$ -9 -15 -32 -14 -19 -31 -64 -28 64 -21 15 -35 -40 -13 27 38 17 -2 -22 23 5 55 12 -27 -17 -39 42 44 -11 -45 -16 -12 -14 -3 -32
4770c2L4l9j7R7P1j29j5K1l0O4j9K9j5r4k3J62Pp6l1LM6QJ4Nn7J1m3J00j1m6K9
$$ -32 2 -37 -54 43 114 -15 -30 -9 -39 25 6 35 20 -74 -97 65 72 -4 -35 -32 14 22 36 41 -16 -5 -48 52 41 -5 24
4801B4o0M2j4pO9n5j3j5L9K7K5p0m7J01j9j9k7NL6l9L4%l5OK6r1P2mk4lj4J5M4
$$ 24 -36 6 -8 -15 54 -1 -14 -29 10 37 62 -8 -55 46 27 8 -19 -14 22 -17 17 17 -18 -12 14 -77 -5 -9 -33 -36 -50 -35 9
4834IJ9m8Okk1nJ00k6p8L0J6k7L8k8Jl4L8O1M3n1k4k4l4J29p0jk0J8p8R2Pn3o1
$$ 9 28 -20 -14 -16 -37 -42 58 32 -46 -16 0 -27 11 -17 -16 -50 -12 49 92 41 17 -7 -41 88 18 17 -3 15 -63 29 36 -17 -78
4867g8J01l2RLJ9qRm3M0L9m4n9K5N8k4N8p2k7j5M4K3L4q7j4M3O3qk6%l5n3N9k6
$$ -78 23 -9 0 3 22 14 23 -20 20 59 15 -44 -19 39 15 73 1 -26 -41 3 26 60 -27 -41 2 65 57 31 31 -4 -57 2 -24
4900b4M5K8l9m8N4J8m2Kk7j0pP5Jj3j1l4K5kL0Nn3K6JM0o7L5l4L1oK7PJ3m9j5
$$ -24 21 49 10 -38 16 34 -8 -6 -33 -43 -50 25 26 13 2 -32 -7 -9 21 26 -27 -1 0 40 -27 8 -26 5 -1 26 33 46 -3 -18
4934a8l2O5j9K1m6pN6%Kk3m5j2MO7M9m4n1k3N5J2J6m5l1l9P8N2Jm4l5p0J43m0
$$ -18 -50 15 -4 17 -29 -36 20 20 22 -1 -46 -58 -54 13 62 18 -33 -56 -1 11 27 -18 -49 -88 -10 42 43 -1 -36 -106 37 -3
4966cM2l3K1m1j6N8m1j8j8J3L7M1k1N7n6J3m1P2j5j5l9k5J6N2Lorj8qL8Ol8k2
$$ -3 39 6 27 -14 -30 28 -13 -31 -49 -36 1 42 21 78 22 35 -6 66 51 36 -3 -28 -12 40 43 37 28 10 2 40 46 8 -14
4999a4l8L6N7n6j7%K1L5L8k2n8j5l9R6l5P2l8k5m9N7M2J6l7l4l4M5oPL1l4n2P1
$$ -14 -52 -16 41 -15 -32 -32 -11 24 62 40 -18 -33 -72 24 -11 61 23 -2 -51 6 48 64 27 -7 -41 4 -2 5 36 2 -50 21
5031B1J4k6j9o3N7l%L6Rp8K5QN5J4l5m4k2qP9j8RJ8p9k9J12m6K6j56P0q7J65L4
$$ 21 35 9 -10 -73 -16 -19 -19 17 26 -52 -27 -19 36 50 15 -29 -51 -59 20 2 11 29 -50 -79 33 -13 13 -143 -73 -160 5 39
5063C9k2ll7j2M7J2kj8j9qL9L2l5l7k7M1k0%L9Ro9P1k9L0joj18R1j5N0Ko6J1Q
$$ 39 17 14 -23 -35 12 24 22 4 -15 -23 16 48 13 -24 -51 -10 -30 -30 9 18 -51 20 -9 21 20 14 -104 -13 -28 22 24 -42 -31 -23
5097b3%O4k6j0m7N9J6j0k0n2p9N4J09kk9k7L2k2K4N5p3L5q0OP1j7lo1L0J3M0K3
$$ -23 -23 41 15 5 -42 17 33 23 3 -49 -128 -74 35 33 4 -23 9 -13 11 66 -7 28 -52 -46 25 8 5 -56 -26 -13 27 50
5129E0k5o6M7K9K0m3l8M4k6nJ8O3kq8lL9L7l7Mq1L3N4j3L3pl0k8K1kN7p3orL1
$$ 50 25 -41 6 35 55 12 -26 18 -8 -13 5 68 66 -22 -25 14 51 14 18 -63 -30 24 11 44 37 7 -21 0 -2 55 -18 -24 -33 -2
5163bK5l6Lm3K2kL4j2L0m0Pn9R6J3j2op0R4L0k3n9J6kmK4KQp5j7J9M6M8k0n6n5
$$ -2 23 -13 -10 -53 -31 -33 1 -11 19 -21 -14 -73 23 36 24 18 -52 42 72 49 -10 6 4 0 24 26 34 -41 -58 -39 7 55 35 -21 -76
5198g6KJ15Nm6l4j0L6l6N8J1k0j9LL7J5m2l9lO6J4l7J08j73lQ0kJ5j2mn4K1L1
$$ -76 -74 41 46 0 -34 -44 -8 -44 14 25 5 -14 -11 26 41 -1 -40 -43 23 37 0 108 -65 -68 12 10 25 13 9 -45 -24 7
5230GJ6m0J9k9L8M0J8m7n5lRN7k9K9m9L2m7N6J4%p6Mj1M0KK0kl2JL8j3P4j14J2
$$ 7 23 -17 2 -27 11 51 69 22 -33 -36 -27 30 1 30 -19 13 -34 22 36 36 -40 -36 -47 -7 -5 15 13 -19 -18 20 7 81 -33 -21
5264b1L9k1QJ3p3N0LjO3L2p4o0oL0L5l5ljmK4J4k4k3K5k3M8K1j8Lm5PM5k1J9p0
$$ -21 18 -3 5 18 -55 -5 -2 -3 60 92 18 -42 -48 -18 17 -18 -21 -22 -26 -2 12 -12 -35 -10 -33 15 36 18 21 -24 -17 28 7 26 -44
5299d4K9k9J08l9ko2J9k5O3Pn6J6j3LQ3m8k2j0KO3n4P9p7nm3K9O8n0O2n8k7K8
$$ -44 -15 -44 64 25 23 -39 -20 -45 18 25 -31 -15 -28 -25 58 10 -12 -22 -20 43 -11 68 -9 -14 -57 -28 40 -10 52 -6 -33 -5
5331e%LRj4m0K2NO9m8l%j5L3P1q1J2jk7M2J7o1l2K4j0M0Pkl2MJ4QK9l6j1mJ7J3
$$ -5 -5 -2 7 -7 -47 -25 -20 49 1 -2 -2 -17 16 87 6 18 17 -10 32 49 -12 -44 -20 -30 10 17 15 -17 -13 1 9 38 2 -9 -13 4 17
5368A7O5n7m7OJ4jNK6jq8J1O6K8m3K3J0n2K6KM6m3l9J3M9Rr9K0J1k7L7J8j7l9
$$ 17 82 25 -22 -16 -2 -3 2 28 27 -61 -50 16 44 1 24 34 -18 8 10 56 13 -26 -13 36 45 -54 -34 -23 -50 -13 5 -12 -51
5401e1k7R8j0Llk9k4J5J2N1k8km8J2N0J7l1m7oM9L3qn1J1k2L7J7J3Pq2J7K8K2
$$ -51 -78 20 10 13 10 -19 -43 -28 -16 35 7 5 -43 -31 19 36 5 -42 -48 1 34 26 -25 -14 -36 1 18 31 38 -44 -27 1 23
5434B3M7o2l3l4L0M1L1n7k8n8R3j0%L0j9K1m6K8K1o0L4j2L6J4k3ll0Om2N8L0J6
$$ 23 70 8 -25 -59 -29 12 43 -14 -42 -100 -7 -17 -17 13 -6 15 -31 -3 18 -42 -8 -20 16 30 7 4 -26 -20 -62 -4 26 42
5466D2p7L6q8N9M8k0LJ9m8nO0l1j8J1j8M5K2k3j3k0QJ6rJ4j3p3O2O2k5rj3m6O1
$$ 42 -35 1 -87 -28 20 0 3 22 -26 -31 29 -2 -20 -9 -27 18 40 17 4 -16 -8 8 -1 13 0 -73 -11 51 26 17 4 -42 19
5499A9%J2ko8k1O2J6n3Qj0K2k9P1k2J3l2k7rm2N5L8Kqm5Q8Ln9L6m7m5R4L6Pn7
$$ 19 19 31 29 -39 -60 2 18 -35 -27 -37 -15 -44 27 5 18 -14 -41 -50 -92 -37 1 3 -5 -50 38 41 -18 18 -29 -74 20 56 63 6
5533Fj0l3R0q7K5K8j06R4NL1JJl5q0O6L8j4m9L1L3l0k4k2J02q5L0K5m5k7N4n8
$$ 6 -4 -37 53 -34 -9 19 -87 7 12 43 44 45 10 -70 -4 34 20 -29 2 35 5 -19 -41 61 -24 6 31 -14 -41 13 -45
5564d5J5M6l5K4Kk2J2L3m0mJ3j9l1O0k2K5l7L3l6L0K6k7j0J4kO6k5L2o0mk1L7
$$ -45 -30 16 -19 5 7 -15 -3 30 -10 -14 -1 -20 -51 9 -13 12 -25 8 -28 2 28 1 -9 5 3 69 44 76 16 12 -9 28
5596B8j0l1J0k2QJ2M1n1rm4M9O7m3K8pk2j1ojQ3q5J0O4k1n5N4j04J3j3J04j9K7
$$ 28 18 -13 -3 -25 -17 -5 36 -15 -24 -68 -19 48 5 33 26 4 -7 -13 -14 69 -16 -6 58 37 -18 36 -68 -55 -68 36 17 44
5628D4p7%PM0K3m2K1j6lj3L5k6Rj08J01m8Q1K0n6k0oP4k3k3l1j5J7J5P9o2j7J3
$$ 44 -33 -33 -26 14 37 -5 16 0 -3 -16 19 -7 2 -106 -5 -53 28 48 -8 -28 -34 40 17 -6 -37 -52 -35 -20 59 -3 -20 -7
5660gk3L6M5mj17N2m8N4J5J4lk3n4L6N2j4%o8L3L4JNn5NO8k6k7M3l4m2J9J0M6
$$ -7 -30 6 51 47 -70 -18 -66 -12 3 17 14 -9 -63 -27 25 11 11 -57 -24 10 11 16 -39 -34 34 8 -19 24 -10 -52 -33 -23 23
5693B3l2pK6m8J04m7k5L9p0L9M6J6p7n3N2N2n4rQ0j13J05l2K0K1l4n7l4M3K6J8
$$ 23 -9 -16 10 -38 66 19 -6 33 -37 2 48 64 -13 -66 -14 38 -16 -25 55 -58 47 15 35 56 22 -35 -69 -26 0 18
5723A8m2lqk9Q1jk9Ro2O6Mm9P5k3o3M5L0N2j04J7k9L5NK6j1Km8M4k4L6Om8K7P
$$ 18 -24 -27 -35 -64 17 16 -13 -4 -66 0 4 -45 30 7 -56 -11 19 71 -33 -16 -45 -10 -5 21 10 12 -36 8 -16 20 26 -22 5 12
5757A2j1L5l5pj1m4P8K7k3m5j9K2OL0j3l5K5j4l0J12n2Mp7J05l4PJ4qn2j9Q7k0
$$ 12 1 36 1 -6 -17 -61 17 44 21 -24 -43 -21 -15 15 2 -33 -8 -22 -52 60 8 12 -65 40 6 13 27 19 -33 -52 35 15
5789A5K0m7lL1k7MJ2j1o6J0N7J9j6j4k6M2J0j0k8%L0o1N8L4k5m2L9kOoj0L2jn2
$$ 15 35 -12 -15 16 -11 -7 5 -6 -72 -62 -5 14 -2 -16 -42 0 10 0 -28 -28 2 -59 -1 33 8 -34 5 3 9 3 -7 25 24 -28
5823b8N7m0mno8Q9j6rK5l3%J9K6k1M9k6q8J7O3K3J4p8K7Pk8L6L2p0j1M8l4J3J3
$$ -28 29 -11 -15 -20 -88 1 -15 -24 1 -32 -32 -13 13 -8 41 15 -73 -56 7 30 44 -34 -7 0 -28 8 40 -30 -41 7 -27 -14 -1
5856ak9LN1l0lk0L4n1K7K1L8Rm0m3M8j0J3M3n5l7J7L1J3om8oL6k2O5l5l9NL8K0
$$ -1 -30 -27 24 -6 -9 -29 5 -46 -19 2 40 49 9 -34 14 4 17 60 5 -32 -15 16 29 23 -25 -31 5 -17 48 13 -26 -21 17 37
5890C7k0k1Lk5oK8M9k8m4k7Q8j1PKj3m4JK9J8pj7j2J6m6K6j3PL5m5K5km9K9M6
$$ 37 17 -4 -1 -26 -32 -4 45 17 -27 -54 34 23 30 32 19 -25 -24 5 23 16 -1 -13 3 -43 -17 -30 -23 12 -33 -8 -10 -59 -30 16
5924A6q3J23j02Q1p4L9L9q5R3jq7O8oj5l3N8K1n8k4P3l7lJ1Lj9J8K1k9Qj7n7P6
$$ 16 -67 56 -46 35 -39 0 39 -46 47 46 -41 27 21 6 -27 31 52 -6 -30 43 6 3 14 17 -2 16 37 8 16 -1 -58 18
5956A8L7m2on5L7j2N1m5Pj1K3Pk3M7J2m0l6M5J7k8L1k3oKJ8L1o0n5K6O3k0m8L3
$$ 18 55 13 7 -48 -11 -23 28 -17 -10 -21 2 9 -14 33 45 5 -31 14 31 3 34 11 5 7 25 56 -4 -59 -33 30 10 -38 -5
5989el1L8N3q4M3m0lK5jK4k0O7o9k7j2P4k1j8lm9R8o1L1l9Q9o1J3J2j7m4M3j8
$$ -5 -36 2 55 -29 14 -26 -29 -4 -5 19 -1 66 -3 -30 -42 32 11 -7 -10 -59 39 -22 9 -30 59 -2 11 23 6 -38 5 -13
6021a3ON3l1J0k7K8l0K1kj0L6j9K3Pk8op5M7O4o9R0j10M3k1j8k3Q0l7%l3lQ3m3
$$ -13 -7 46 15 25 -2 26 -4 17 15 5 41 22 45 52 24 18 -57 -10 54 -15 75 -35 8 -13 -31 -54 26 -11 -11 -44 -47 36 -7
6054gJ4k3j4j7P2l3Qk7K1k7K6N3m9j3L9k1O5r1K9pk1P0j7rJ0q4J2J08n0l4k4J9
$$ -7 7 -16 -30 -47 25 -8 0 -27 -6 -33 -7 46 -3 -16 23 2 67 -24 5 -2 -23 47 30 21 31 -53 -41 67 17 -17 -41 -22
6086b2K4k6M9M5k0m5k6k3L7j4J4j0l2N2nk6M9pj1pL5k9K3k8n3J9M7M4k9o2L5J0
$$ -22 2 -24 25 70 50 5 -21 -44 -7 -21 -7 -17 -49 3 -2 -28 21 14 3 -4 31 2 25 -3 -56 -37 10 54 25 -37 -2 8
6118HK3j8q7P3m1J5L8Rk2p3M6LP5j2p5P9l0o6J7K8K3n0O1k7Nj0Kk6J6L2Lj5k2
$$ 8 31 13 -74 -1 -42 -27 11 20 -2 -75 -29 -26 49 37 -38 41 11 -55 -38 -10 13 -37 24 -3 2 -8 -6 -32 -16 16 19 4 -18
6151a8K3l2N1j4K2m4M7k2J%mn2L9n2O7k0P1q1m1O5N2j5m5j2J3l3K9QK6l8m1J1
$$ -18 5 -27 24 10 32 -12 35 13 14 14 10 -42 -3 -55 12 -8 63 -18 -59 6 58 43 -2 -14 -1 -34 -5 3 29 -9 -50 -39
6183c9RM6kj1mJ5m0N6j8j1mL7l1L0k7k4j0K2k0M9l6jj8j1P4j8j0o5P7m8lO4jl3
$$ -39 -30 16 14 3 -1 14 -26 30 12 1 -3 34 3 33 6 -18 -28 -6 -26 23 -13 -14 -32 -43 31 13 3 -62 15 -33 -36 28 27 -6
6217fL7m9k3O1j5k7Lj4M8nM2o3j3K2k2O7j0n6L1l6R7ln0n3O2n1j0O1J2j3m1N6
$$ -6 31 -18 -41 20 5 -22 -19 -33 15 10 52 -11 -24 -2 -24 43 33 -23 8 -28 69 66 16 -37 25 -26 -36 25 37 24 -17 39
6249C9r2O4k0j2%M2m8P0j9r2P2Nl4JN5J1m5j4J6J2%l2P8k5k8J9j4pm9J7M9j2l1
$$ 39 -53 11 -9 -21 -21 21 -27 43 24 -68 4 9 -25 -24 31 42 -3 -17 -1 11 11 -21 57 32 4 23 9 2 -47 -30 19 7 -24
6282b4lmN3k3J1K4o3Rj3L6l9O5l3Ll6m0J03L5l3o7K6QoM2l2m2K5M2j9rk1N5k6
$$ -24 -27 -31 22 -1 10 34 -29 -20 -33 3 -36 29 -4 -1 -37 -77 26 61 28 -39 -13 -5 -11 31 -1 -43 -18 24 5 -4 -25 30 4
6315DK9j3m0K7J8o3P7j7n0P0l8QMm7M8j8m3J0M3K2n9L8l7l1P0j3k8O7m8pLL4J0
$$ 4 33 20 -20 7 25 -38 39 22 -28 42 4 12 16 -31 17 -1 -44 -34 9 31 -28 10 -27 -58 12 -1 -29 38 -10 -17 -14 20 30
6348C0m4J2k8NkQ4j9l5m1R0m9N7m4Ol3L7rl9M8qk6M4L8p4PK0kLk2L9n2j8O4Rp
$$ 30 -14 -2 -30 -25 -27 57 38 3 -38 52 3 60 16 22 -11 26 17 -22 26 18 -8 36 74 0 7 27 25 28 6 45 -7 -25 39 48 41
6383D1j6n0o7J00Nk9L7No6Q7m9K2RK6m3m0k7O0L9k2j5no1O3j0Nl3mL6m9lMP5o6
$$ 41 25 -25 -92 8 13 -16 21 26 -40 47 -2 20 29 55 12 -28 -55 5 44 22 7 2 -59 4 -6 -1 -34 -38 -2 -51 -54 -50 25 -41
6417d1NM7J0m0K5J7o2K8M2k1o5Q3l1O0Mj03L6k7N2J3J4n9J7J4RrJ5n0k6N2k7K5
$$ -41 -36 11 21 -19 6 23 -39 -11 31 10 -55 28 -3 57 61 -42 -6 -33 19 32 46 -13 4 18 27 18 33 -17 -43 9 -18 7
6449GK8k3o5J7O0oK6o4RK7l5O1m2L0k8Qo1K8qM2l0J8J1J1k2p1Q1J8l2K1J7l2k5
$$ 7 35 12 -53 -36 24 18 44 -20 -11 16 -19 42 0 30 2 10 -51 -23 -31 11 -19 -1 10 21 -1 -72 9 27 -5 16 33 1 -24
6482b4N1K7n8Qk3PJ4k8j5pL0j0j2K2QMJ2Mn3M6L4n9K3Pj9L1Qj2K8j1n3MN0NNm9
$$ -24 27 54 -4 4 -19 -12 2 -26 -41 -48 -18 -28 -40 -18 -10 -6 6 10 -43 3 37 -22 1 8 -11 20 28 16 44 33 -20 -16 34 39 44 -5
6518eNm1J00r4J5L%j9O4L0n6Jk7oJ01r3M4l0K2l8O7j6Qo0L1k0OM4J0r2P7j0k0
$$ -5 0 -41 59 -35 -20 -17 -17 -36 28 58 2 3 -24 -30 71 -22 22 -8 14 -24 43 27 35 -25 6 -14 -8 36 46 -46 31 21 1
6551Aj4P3m4k0l3N4j5l2K2J0j9J6NJ9k6nPk2j3N0m7lP6j2m2Rp1N4kj7M2k6OK9
$$ 1 -13 60 16 -4 -37 17 2 -30 -8 2 -17 -1 4 23 -3 -8 -1 -23 -36 14 -33 -36 40 28 -14 -5 -76 -22 -24 -41 1 -25 -19 10
6585A0l1J4jL0k0l2M4L9l8n3O3pn0M1om6M5MK8j6k9L5l5m3N4QJ5Km1k3M4rJ3k1
$$ 10 -21 -7 -8 22 2 -30 14 53 15 -38 25 18 -32 9 3 -43 2 6 34 18 -11 24 -11 -54 0 8 23 25 -16 -39 5 -4 9 -12
6619a2kl3K3K6k5K5j8j3J3kpj1J6K8PnN2n3j2j0O4o0M3n4nK4m8R1n6l4J0J1L6
$$ -12 -14 -47 -24 2 -23 2 -16 -29 -16 -18 -25 -36 -20 8 15 10 62 9 -3 -13 51 -9 34 -20 -25 -1 -49 42 -14 -48 -38 -27 9
6652InrJ0M2j1k6m3R0o8J1k1K1K0RJ4o1L9Mk6pN0l4rN3p2M1n3L5k1J4njK6o4P3
$$ 9 4 -5 5 47 36 10 -33 57 -11 0 -21 0 20 29 43 -18 21 25 -1 -8 42 8 -1 52 -20 21 -32 3 -18 -4 -9 -10 16 -48 25
6687B5k4K9j8J7l2J7m1lj2j0P7j9n0O1L0n2j0qQj1N1k9K9n6LMM9l0j8K8m1N6k3
$$ 25 1 30 12 29 -3 14 -27 -30 -42 -52 25 6 -44 17 47 -5 -15 -23 -15 -26 25 -4 25 -31 -28 -24 25 -5 -23 5 -36 20 -3
6720cK8n8Q6m8lJ2m%nK0m0J6j9NRk3MJk3OP9pj0OLm0j2N1n2Orl9j4Q6KKm3j1N4
$$ -3 25 -33 53 5 2 14 10 10 5 25 -15 1 -18 -13 -4 -27 -23 -22 -45 -39 40 33 23 29 32 -8 -20 31 -21 -15 -24 -63 -77 9 11 13 -30 -41 13
6759A3m8N8rJ1m1j5L9j2JK0m9k2O7J0J6k3lm6K7K5j5j9n3L8O4n3M5k0J1l5j6N4
$$ 13 -35 23 14 25 -16 -31 8 -4 -3 17 -32 -54 13 23 39 16 13 -33 -6 19 4 -15 -68 -30 34 -19 26 6 17 -18 -34 20
6791B0l9Rm2K8K1O6n1N8j04Q4m6L6Ml7%J4o2M3j1mJ5mKL4%q1J5O9k9Oj9j9M0o
$$ 20 -19 -10 -52 -24 -3 63 12 70 -34 50 4 40 44 7 7 21 -41 2 -9 -13 2 -2 0 34 34 -47 -32 37 8 14 -5 -24 16 10
6825A0j6JJ9J2m8mj3N7%n5N3l7L1J3n3N9J9q2O7o0K4J8k2J9Nl0jL2j5k2K2k3M6
$$ 10 -6 -5 14 26 -22 -26 -39 18 18 -37 16 -21 10 23 -30 29 48 -34 33 -27 -3 15 -7 12 17 -13 -14 18 3 -19 3 -20 26
6858B6Mj3j0M3p9K0K6l9J8K3j2j3nmMM7ll3Pj5M2p4qL9m0N4J2k4J5j4L0l4l2N
$$ 26 30 17 7 50 -29 -9 17 -22 -4 19 7 -6 -11 -15 -11 36 33 0 7 -8 34 -40 -48 -9 -49 5 17 -7 8 -6 24 -10 -42 -37
6892c7L2J5k7nj1L7K0j4OrRm2M9j7l6j8M1J8NQj8l4K2j4J6K1L2k7k6j1N2j1j6
$$ -37 -5 10 -17 -22 -33 4 24 10 16 7 16 -26 23 6 -30 -48 -7 11 16 24 6 -28 -6 -20 -4 17 49 22 -4 -15 37 26 10
6925A0K0l6j6K2l9J11n8m3l%O5o5l7L9LJ3J6n1m2O7O0o6m1R5j9j4P4l9l6J2km0
$$ 10 30 -6 -22 0 -39 72 14 -29 -32 -32 33 -32 -69 -30 -27 -14 2 -49 -91 -24 36 -30 -71 24 5 -9 65 26 -10 2 0 -40
6957d0L6k7P6J0j0m7Jj4Jk2M3K2p9J6M7j0J8ll2J4mQk1J9L9n6M3j2pPj7L7m6j7
$$ -40 -4 -31 45 55 45 -2 -1 -15 -14 -36 7 29 -50 -34 13 3 21 18 -14 0 -4 4 -17 2 41 -15 28 16 9 16 -1 36 -10 -27
6991b7N6m0l3P8m3Oj0Pj9ML1k3LM1j1jr4R2n1K7j4oR2p8K1L9n3nj4M6K8r3k3N6
$$ -27 29 -11 -44 34 -9 -3 -13 -6 -25 -21 10 -13 -10 31 20 19 -75 17 -34 -7 -21 -27 65 -13 8 47 -6 -11 -25 21 49 -44 -67 -11
7025a1L3j1J8l5k2k2Q5L5r3j8K4M6m8l3P8mm1O4n4J6pJ6m0O3n5j0%N7Qo5J1K2
$$ -11 22 11 29 -6 -28 -50 35 70 -23 -41 -17 29 -19 -52 26 22 -19 45 -9 7 0 16 -24 39 -16 -26 -26 31 39 -26 -15 7
7057Gj4J9%J4m5P1n9k1K6Nl6M3m4M6J1j6N7m8K8oo0MJ6J5m5j9M1L5qKk1j4J3k4
$$ 7 -7 12 12 26 -19 52 -7 -28 -2 3 -33 10 -34 12 23 7 64 16 44 38 -22 -18 -2 13 -32 -51 -10 25 17 19 -2 -16 -3 -27
7091b7L9k5l2N0j8L6k7L7l4J6k0%ok2R2q3R6q4l3M5K8j7j9Qm1N0j7Pl7O5k5j6
$$ -27 12 -13 -45 5 -13 23 -4 33 -1 15 -5 -5 -11 -33 59 -24 72 -12 -45 0 28 11 -8 0 -41 9 -8 -1 -38 27 2 -14
7123a4N1j05J1N3Qk2q%j2j7M6k4J9O2n1l3K3J0o4N3n9O0j0l4P1o8L3J3JkmPJ7
$$ -14 37 -68 -57 -4 4 -18 -26 -26 -38 -55 -9 -33 -14 48 -3 -36 -13 -3 -67 -14 -73 -13 -23 -57 14 -54 -21 -8 -7 -9 -13 -6 11
7156A1k8M8n3O5q6K3L7j0j0qll6O4l0L5k7L3j0Mm7L6j0K5m2O9jr2K5K7K7o0qk
$$ 11 -17 31 -22 43 -43 -20 17 7 -3 -11 -14 -50 14 -16 19 -8 25 15 19 -28 8 -2 23 -19 50 49 -43 -18 9 36 -24 -32 -34
7189c4N2j3o2O7qK5k7k8L9qJj5k7L4JrN3o6M5k9K7k3M7n3Lko7Q3K7j03L2K9K9
$$ -34 18 5 -57 10 2 27 0 -28 11 3 4 -11 -38 -4 -3 -12 41 -25 20 -9 18 -5 42 -11 -8 -10 -77 6 33 -70 -38 -9 20
7222B0l4Ql6nP7k6J9j4l0J00p1l7K6N2q2M4k7mQjJ0qK2j7l9ON1k6L4n3PL3J2j8
$$ 20 -14 -6 -42 -47 30 4 23 9 -21 79 8 -29 -3 49 -33 11 -16 -20 -12 -13 -3 -11 11 -6 -45 -39 12 -14 20 -33 -26 7 19 1
7256ApJ6Jk4K2l6N1K3l8j6mjO5m1l8K1k0jP4l5n1M4nn0O2J4m0J0J7mm2M9l1M8
$$ 1 -6 10 11 -13 9 -27 24 47 9 -7 -11 -12 53 12 -26 -5 -25 -26 48 13 -38 6 1 -49 13 27 -13 -3 14 10 -32 17 -14 34
7290C4l2Jk0M1o0mJ0L7j0j9qN7r1M5l4P2j9K4rjJ9m1JJ4m8P9K5j08O0o9R1Jj7
$$ 34 2 3 -17 24 -36 -40 -30 7 -3 -22 -30 27 -64 -19 -53 19 0 24 15 14 33 -8 -7 7 -41 38 63 -45 15 -54 37 38 21
7323B1j4k9N3l1jj9P6k4kJ6l5J9r4Q4j6k7L6J4j8njm3J1KRM4n2N6l2O4j02N5o3
$$ 21 7 -22 31 0 -1 -20 56 32 30 46 11 30 -64 20 4 -23 13 27 9 4 3 -40 -29 -27 -18 26 -26 30 -2 62 -40 15 -48
7356d8M9K8k5j3O3Lo1j3J9qj3M8k1%J7Qm0O6n1oj5m4N1qJ4k5Q8o8K3J0j2n1O4
$$ -48 1 29 4 -9 54 57 -4 -17 2 -6 -19 29 8 8 25 33 -7 59 8 2 -13 -57 -6 -14 0 -25 63 -5 18 28 16 -35 29
7389B9m6MO3p4L2rKo8K2N1Om7M6kj2K5l0k5P2m0KJ3o6Q0l1NL4p3M1Mj6NK3l2M1
$$ 29 -17 -13 50 -24 8 -1 1 -67 -45 6 12 -35 11 9 -3 22 -8 -33 39 -1 1 14 -52 28 -3 2 36 -37 4 8 -8 -3 20 -12 29
7424B9o3KP5m2L8Mm6K1m6K8rl4M2ok8PJ3L5j6J6j2l1N4m6l0M2L4oj2l5K2j5kP
$$ 29 -34 -32 43 1 39 43 -3 18 -28 0 -9 -43 -1 -7 -35 -28 -15 20 4 20 8 -23 31 -15 -45 -3 31 25 13 -22 0 -15 -17 -10
7458a0J6n5P6pQml8lJ9k2J9QK6m4O0j4p2K5O1q3MO2m0P0l0n7L3M9p9%PJ4L5j1
$$ -10 6 -49 27 20 28 24 -14 -17 2 -20 -1 7 33 -11 49 35 -37 -12 49 -34 -30 32 -8 62 32 -25 8 57 -22 -22 -15 -1 34 23
7492B3k1Qm6J14r3O9k7p7P3L7n4k7K1j2M0r5P1j6k5L2m4M8J6mj1pJ7k9L1m3J0
$$ 23 2 10 -36 78 -15 54 27 -50 23 60 6 -21 0 -12 28 -67 4 -12 -37 -5 -49 -1 15 11 0 -7 10 -19 12 -31 -21
7523b1k1J7J5N4pko0J8M4r1M8ML8q0L0k7O1j7J2poK3m8J6L1M4q9N1n0qM3j7j2
$$ -21 -42 -25 -10 44 37 35 -25 -7 37 -54 -6 -2 36 -44 -14 -41 20 3 15 8 2 25 -23 -7 24 68 -21 30 -20 -28 15 -2 -14
7556a4K1mK8J5qj8k2ol7M8MJ9k7k0M9p0O6j1rn0P8j6m2J7PK5o2L6nMl8L9j7P7
$$ -14 7 3 31 46 38 20 -2 -8 -45 3 7 26 -1 -21 28 -42 24 13 4 -46 32 16 -26 -9 -2 23 -39 -3 -8 -4 -42 -3 -20 57
7590E7o0k1K4n3N2k2k9L1nLO3lm1k6L1N8k5j3mJ4k3J5l3O4m8M4p0k7M0K5Jj6K3
$$ 57 -3 -24 0 -53 -1 -23 -52 -21 -26 -23 40 37 -4 -30 1 59 34 21 17 31 8 23 -10 54 6 50 -20 -47 -7 18 19 3 26
7623B6n2K3pN0n1Nj9K8J2j1j2j7L0k9%j1K3lM0l4O0l4k5RJ4m4L9k4Rj4j0PJ7P
$$ 26 -26 -3 -10 40 -11 -6 -25 3 15 4 -8 -25 5 -24 -24 -35 -12 -15 25 -9 51 17 -8 1 15 -29 10 -14 -5 -19 -29 -22 -5 2
7657BKNk2J4NJ8n7K3L2j0k3L6om3N4k5qL6l4nP3o8K0L3l9qJ8l4K6l0M3j0J2o5
$$ 2 4 9 -13 1 6 24 -33 -10 22 12 -11 25 19 -24 30 5 -3 33 -1 -6 67 -1 19 52 13 5 23 -11 15 -15 28 18 30 -35
7691c5N1kj4j6k4L8kj7K1J8m2M6nJ2m3J6Rl5QLMn9P4qk6M9n2M0ml4K6k6O8n7K9
$$ -35 16 14 0 -16 -40 -2 -4 -21 0 18 -24 22 17 29 -14 2 11 -24 -16 -13 -9 -68 6 -2 -28 21 -31 9 5 -29 -3 -29 39 -18 11
7726A1J1j5k4L2kl2L0Mk9l9O2k3j4L7m7O3J0n5M1o8J19o9nJ6ok6lK3l3PN7l7j3
$$ 11 22 7 -17 15 13 -19 11 15 -14 -53 9 -14 -28 9 -38 25 35 -20 21 -47 72 3 -2 14 8 -18 -21 2 -31 -24 33 -4 -17
7759a7M4n1J5L2RL1j4m4J0J2r4R8l4M4K0r1N9m4K0Pl6J3rL9o5QJ3M5m0RL8L8j9
$$ -17 27 -24 -9 23 32 63 49 5 15 27 -67 31 -3 41 61 -30 29 -15 5 12 -24 -11 -20 19 -46 -38 -25 20 -20 -11 27 65 46
7792D6j3m2J9m0OJ1l3L0RK0j3mL9l9NkRj0olj6MJJ4L2l1j0J8j5L7n4L0J4j0RJ3
$$ 46 33 -9 10 -30 -24 -13 -46 -16 -7 13 0 -4 35 -4 1 -1 8 -2 -8 -11 -27 -23 -22 -8 24 -7 -17 1 -14 23 -31 -1 13 3 12 25
7828B5kl8J5J4o0N7n4P2p0j5Q4l8L2j5j5J2M6p3L3j0N1m2o3J07q1O0o7J9K3M1
$$ 25 23 -15 0 14 -46 11 -43 29 -41 -56 28 -10 22 7 -8 4 50 -23 10 0 51 9 -54 53 -28 32 -35 -16 7 48
7858D8o0M6oj7k2l3N3l5N6n4M0k3J1rk6M8o0J5N8l6J7ml4J1jJNQm6OR0j20P1J3
$$ 48 -12 34 28 11 -11 -44 9 -26 30 -24 16 -7 4 -5 -31 17 -43 -28 30 -6 11 7 -27 -16 -17 -16 -11 -3 -49 -43 47 -73 -2 11
7892A1j7K2lql5L3j2NJ6K2k1RrJ0k7J1K5j3n0K6N3j7J4p3R2j19K0K0LL0j8N1l7
$$ 11 -6 16 13 5 -30 3 -9 -4 12 34 13 22 13 23 -4 7 32 19 -31 -5 48 31 45 -28 64 -55 -35 -15 -12 18 0 51 14
7925A4M9On9j0k3M1M0l1n3L3j8Qk9N0Jm9K8j3L1K7n2K6j0l7M9o1M5J8qj3m4N4
$$ 14 63 69 10 0 -23 18 58 27 -26 7 -11 -3 -32 18 19 -30 -2 -15 16 43 -9 17 7 -30 19 -42 3 21 13 0 -44 10
7957A0l1J5O5n6m0K2J1L2l2J8j6MM4o2pM0m0Pj0K1NjJJ2jm6J09o0Pk1l3N1jl8
$$ 10 -21 -6 59 3 -37 -15 -4 28 -4 14 -2 2 46 -16 -23 17 -23 -16 -26 -5 0 -1 0 12 11 -35 74 14 21 0 -33 18 17 -21
7991b1J9QJ0k4O2k3o0M6o0KP8ook1O4o1Rj6M0j1Kom3J1j4OK4J8J0q0N0PK0j4m7
$$ -21 -2 6 16 -8 54 31 -29 17 -43 -41 37 31 25 4 68 7 16 0 40 29 31 25 -18 -7 -21 -15 9 27 37 -43 7 14 34 20 -27
8026b7N3j3kk9K3%L1p9K8M3Ll1N4qo5jL7n0nJ2K0M4j9lk5JrK3m9K6PN0q3M9M1
$$ -27 26 13 11 -18 5 5 36 -43 -15 28 31 0 54 46 -19 -20 17 -33 -38 -26 -6 38 19 16 -9 -8 -17 6 -43 -17 -10 40 -43 6 47
8061D7n0j5M0MJm7K1m4J1N9l7Nl5J19j16N6o0M9K1l2K6Lm5J3K8J0l1Nl7Q6l0q8
$$ 47 -3 -18 22 26 27 -20 1 -43 -32 27 -10 -5 -40 79 -37 19 -41 8 29 -3 23 26 -19 -6 22 32 1 6 -31 55 25 -63
8093f3M1J9QJ3k6MM2pk3J3k7JK9J7k8rm8K8M7LjrnK3j7j1L1o6k5K2J2K4M2n6L0
$$ -63 -22 -3 5 18 -8 -4 38 31 8 21 -6 -5 24 41 13 4 -44 -16 31 34 33 24 19 42 25 14 45 -21 -46 -24 -12 12 54 -2 28
8128B8n1L8J6k0k8J1J8l4L5J4k2j0k7O3m8m3N0rL0K1K0n1qL0p6M0M9n5M6pk1L1
$$ 28 -23 15 31 11 -17 -6 12 -22 13 27 5 -5 -32 31 -17 -60 -10 -19 11 32 52 1 -7 23 -53 -13 36 -19 27 20 -1 30
8160C0m2N0Kl3PK2l4mn5M2K5nk0N2m6K4j2k4O9p3j3O8np6Q5p3L8L4n7M3j9
$$ 30 -12 38 40 7 14 36 2 -2 -57 -15 10 5 -15 37 -9 15 3 -21 48 -25 -38 30 25 -51 34 -39 -1 33 -24 19 0
8191@
$$ Imaginary data points
##PAGE= N=2
##DATA TABLE= (X++(I..I)), XYDATA
0@%%%%%%%%%%%%%%%%%qJ6j6J6j6J6k4L2l2M0m8N0n8O8p6Q8j04J14j24J40j57J79
$$ 0 0 0 0 0 0 0 0 0 0 0 0 0 0 0 0 0 0 -8 8 -8 8 -8 8 -16 16 -16 24 -24 26 -32 36 -40 48 -56 58 -66 74 -83 96
39I6k01K20k44K74l02L30l67M06m47M94n43N97o56P24p99Q82r78J084j207J352
$$ 96 -105 115 -129 145 -157 173 -194 212 -235 259 -284 313 -343 381 -418 464 -514 570 -637 715
59G15j521J724j972K284k690L237m022N241p401J2323m2170j6181O7305j3182
$$ 715 -806 918 -1054 1230 -1460 1777 -2245 2996 -4405 7918 -34252 -50433 16872 3690
73C690M6052m3715l9426J1501j564N5676O422l9939j6487j6582K9170J9170J9537
$$ 3690 49742 6027 -33399 -21898 -23462 32214 38636 -1303 -17790 -34372 -5202 13968 33505
86C3505j3492m8326l753J7426L9546R419k6513k0962l1917L5784L7037J066j0539
$$ 33505 20013 -28313 -32066 -14640 24906 34325 7812 -13150 -45067 -9283 27754 28820 18281
99A8281n3442O177K6749J4871K7011l7524k1958o977J0175M7075j0079q707k5457
$$ 18281 -35161 -28984 -2235 12636 39647 2123 -19835 -26812 -16637 30438 20359 11652 -13805
112a3805k4700L7200J0739K3887j4056n1525J0702N497L6477J7375l9084q867
$$ -13805 -38505 -1305 9434 33321 19265 -32260 -21558 -16061 20416 37791 -1293 -10160
124a0160k4632K1158M5209j1058r315l1647q823K7238J3744J7393j8516k9453
$$ -10160 -34792 -13634 31575 20517 11202 -20445 -29268 -2030 11714 29107 10591 -18862
136a8862p997J6322L1739n4q291k6788j8865K5640K1508J7773k2717l3643M582
$$ -18862 -26859 -10537 21202 21148 12857 -13931 -32796 -7156 14352 32125 9408 -24235 -19653
149a9653N746L3146R599k4656j5986k1509K9216K5783o296K20l4830n603J9735
$$ -19653 -13907 19239 28838 4182 -11804 -33313 -4097 21686 15390 15610 -19220 -24823 -5088
162e088J3838K3729k6819k3907j82L244L4171N338j5890k0504j9021K5897K2495
$$ -5088 8750 32479 5660 -18247 -18429 -15185 18986 24324 8434 -12070 -31091 -5194 17301
175A7301M919j1838k8500l783J2718K4604J0156j9709j9974j0128J7800K0889
$$ 17301 22220 10382 -18118 -21901 -9183 15421 25577 5868 -14106 -24234 -6434 14455
187A4455N901q154k8816n772J4083K0646J4500k1574j8198q330Q678L0454L131
$$ 14455 20356 12202 -16614 -22386 -8303 12343 26843 5269 -12929 -21259 -12581 17873 21004
200B1004j1766k2208j3571K2631J6103Q991j0141k7620k808R623K2640J1560j9214
$$ 21004 9238 -12970 -26541 -3910 12193 21184 11043 -16577 -19385 -9762 12878 24438 5224
213E224j6164j0510J1491K4215N576r023k3921r827J5876J8520J0385j2898k1609
$$ 5224 -10940 -21450 -9959 14256 19832 10809 -13112 -22939 -7063 11457 21842 8944 -12665
226a2665q201J1068K3098P494j2108k0933r022J3865J8035J0519j1730k2615o069
$$ -12665 -20866 -9798 13300 20794 8686 -12247 -21269 -7404 10631 21150 9420 -13195 -19264
239a9264R703K1238R358j3460j7906j0637J2085K0970P275r616k1978p801J2182
$$ -19264 -9561 11677 21035 7575 -10331 -20968 -8883 12087 19362 9746 -12232 -20033 -7851
252g851J7989J0961j2879k0141o708R244K0728Q747j2136j8787q794J1216J9444
$$ -7851 10138 21099 8220 -11921 -18629 -9385 11343 20090 7954 -10833 -19627 -8411 11033
265A1033Q313j1052j9222p944R989J9894Q714j2135j8329p920J0114J9367Q058
$$ 11033 19346 8294 -10928 -18872 -8883 11011 19725 7590 -10739 -18659 -8545 10822 18880
278A8880j0705j8629q832J1257J9235O894j0259j7805q892J0598J8828P978j0524
$$ 18880 8175 -10454 -19286 -8029 11206 18100 7841 -9964 -18856 -8258 10570 18548 8024
291H024j8586p810J0838J7696P371q954j8353r432J1706J8138O623r201j7836
$$ 8024 -10562 -18372 -7534 10162 17533 8579 -9774 -19206 -7500 10638 17261 8060 -9776
304i776q072R993J7281Q559r438j8843p999J1633J6104O678o731j8861r107J1511
$$ -9776 -17848 -7855 9426 17985 8547 -10296 -18295 -6662 9442 16120 9389 -9472 -18579 -7068
318g068J6227Q377r532j8167n973Q143J6156R615r244j8346p669J0675J5712P009
$$ -7068 9159 17536 8004 -10163 -16136 -7993 8163 17778 8534 -9812 -17481 -6806 8906 15915
332A5915p365j7134q501Q771J7422Q105r983j6118p229Q439J5813P999o971j8266
$$ 15915 8550 -8584 -17085 -8314 9108 17213 7230 -8888 -16117 -7678 8135 16134 9163 -9103
346i103q367J0962J5068O968p700j5762q081P542J7110P908r156j6053p041Q894
$$ -9103 -17470 -6508 8560 15528 7828 -7934 -16015 -8473 8637 16545 7389 -8664 -15705 -6811
360f811J4042Q198o367j7688p754R089J5748P255r028j3923p752O173J7272P602
$$ -6811 7231 15429 9062 -8626 -16380 -7291 8457 15712 6684 -7239 -14991 -8818 8454 16056
374A6056r008j5026p780R194J4408N789m981j5789r472R762J4812O677p136j5287
$$ 16056 7048 -7978 -15758 -6564 7844 13633 8652 -7137 -16609 -6847 7965 14642 7506 -7781
388g781o270O198J4163J0000q664j6039o329P766J4595O262o343j3888r313Q149
$$ -7781 -14051 -7853 6310 16310 7646 -8393 -14722 -6956 7639 13901 7558 -6330 -15643 -7494
402g494J5690N952p342j3992o422O567J2632R000o070j6442o348P417J3154P911
$$ -7494 8196 14148 6806 -7186 -13608 -7041 5591 14591 8521 -7921 -14269 -6852 6302 14213
416A4213p108j3039q163M769J7562O317q490j2113q558Q300J2654O060k962j7323
$$ 14213 7105 -5934 -14097 -9328 8234 14551 6061 -6052 -14610 -6310 6344 12404 9442 -7881
430g881o531R188J0208Q837o935j3037n681K334J5837Q484q470j1940q240O622
$$ -7881 -14412 -5224 4984 13821 6886 -6151 -11832 -9498 6339 14823 6353 -5587 -13827 -7205
444g205J3311O642m082j5121q186Q120J3285O012o240j2339o768N468J2083Q524
$$ -7205 6106 12748 8666 -6455 -14641 -6521 6764 12776 6536 -5803 -12571 -7103 4980 13504
458A3504o136j4499m282M223J1777Q650o690j0266j0047M761J7164L121l674j2424
$$ 13504 7368 -7131 -11413 -7190 4587 13237 6547 -3719 -13766 -9005 8159 11280 7606 -4818
472d818r751R423R061R403m333j8029j455M119J0613R459q968q222q160K451J6609
$$ -4818 -14569 -5146 3915 13318 8985 -9044 -10499 -6380 4233 13692 4724 -3498 -11658 -9207 7402
487G402L814m832r950r246O031J1063P910l456j4528p479P068J1793N888l922
$$ 7402 11216 6384 -3566 -12812 -6781 4282 12192 8736 -5792 -13271 -6203 5590 11478 7556
501G556j3086o612N688J0927R123q218j1385l079P35J3693O028n580p783j2057
$$ 7556 -5530 -12142 -6454 4473 13596 5378 -6007 -9086 -8351 5342 11370 5790 -1993 -14050
515a4050P868J2138K855R87j5289o721O638P619J2643q160j3529j927N49J4040
$$ -14050 -6182 5956 8811 9798 -5491 -12212 -5574 2045 14688 6528 -7001 -8928 -8379 5661
529E661O328o997p881r521O021J2222L689k572j0907o771M137R912Q064l824j2067
$$ 5661 11989 4992 -2889 -12410 -6389 5833 9522 6950 -3957 -10728 -6591 3321 11385 7561 -4506
544d506p015N271R656P981l430j3524m682K811J1570Q947r046p465o488J694J4481
$$ -4506 -11521 -6250 3406 11387 7957 -5567 -10249 -7438 4132 13079 4033 -3432 -9920 -8226 6255
559F255K669k169r578r671Q291O604P230q71j4274l320J057J0401J0440q204p701
$$ 6255 8924 6755 -2823 -12494 -4203 2401 9631 8760 -5514 -8834 -7777 2624 13064 4860 -2841
574b841p316J617J4239M011l040r807q752O544R337N275k338j0669o318L990R118
$$ -2841 -10157 -8540 5699 9710 6670 -3137 -11889 -5345 3992 9267 6929 -3740 -10058 -6068 3050
589C050O526k380j1001n813L380Q071R331m478j0508n131N11J2978N900n240o835
$$ 3050 9576 7196 -3805 -9618 -6238 1833 11164 6686 -3822 -8953 -8442 4536 10436 5196 -1639
604a639r995N444J0932L180M7j2201n984N736N898Q932l895j0470l992L48J0875
$$ -1639 -11634 -6190 4742 7922 7969 -4232 -10216 -4480 1418 10350 6455 -4015 -8007 -7659 3216
619C216O725m206p640q320L457J0355N477j956j0489o612M130Q829O516l021r949
$$ 3216 9941 5735 -1905 -10225 -6768 3587 9064 7108 -3381 -9993 -5863 2966 9482 6461 -3488
634c488n826L526Q319O856l005r781m979J682R304P113m310p370p182J955J0955
$$ -3488 -9314 -5788 2531 9387 6382 -3399 -8378 -6696 2608 9721 5411 -1959 -9141 -7186 3769
649C769M554j550r266p782N260P164O515j246j1363m505K563P868P751m209q289
$$ 3769 8323 6773 -2493 -10275 -5015 2149 8664 7418 -3945 -8450 -5887 1981 9732 5523 -2766
664b766n118R41R588O324l051q067o728K703Q806N526j576q725p019L068Q625
$$ -2766 -7884 -6943 2645 8969 5918 -2149 -8877 -6174 2632 8158 6582 -2143 -9162 -6094 2531
679B531O005k210r067n519K286P812O987k615q852n714K459Q304N601j799q149
$$ 2531 8536 6326 -2741 -8260 -5974 1838 8825 6210 -2642 -8356 -5897 2407 8008 6209 -1940
694a940o620K520Q257O126k241q643n420K075P638O666k148q772n730K470P993
$$ -1940 -8560 -6040 2217 8343 6102 -2541 -7961 -5886 1752 8418 6270 -2502 -8232 -5762 2231
709B231N915k428p627o007J553Q805N689k457p696o134K756P277N678j061q855
$$ 2231 8146 5718 -1909 -7916 -6363 2442 8131 5674 -2022 -8156 -5400 1877 7555 6494 -2361
724b361n681K300P745O253l081o902n645R24Q753N500k079p690o121K931O978
$$ -2361 -8042 -5742 2003 8256 5175 -1727 -7372 -6448 2305 7805 5726 -1964 -8085 -5154 1824
739A824N369j071p884o135J884Q488N075k284o696o141J912P160N947j001q957
$$ 1824 7193 6122 -1762 -7897 -6013 2475 7550 5266 -1430 -7571 -5659 1501 7448 6447 -2510
754b510n000K449O401N943j717o742o442J447Q615M590j624o915n660J879O035
$$ -2510 -7510 -5061 1340 7283 5566 -1176 -7618 -6171 2444 7034 5410 -1505 -7165 -5286 749
769G49O836j387q521m643J467P098N259j462o168o793J850P415N356j266p827
$$ 749 7585 6198 -2323 -6966 -5499 1599 6858 5396 -772 -7565 -5715 1700 7056 5790 -2037
784b037m399J024O060O925k033p062n339J072P682M637j088o514n834J413O472
$$ -2037 -6436 -5412 648 7573 5540 -1522 -6861 -5789 1893 6530 5442 -1072 -6906 -5493 979
799I79O498k086p305m173L10P088N518j609n963o527J845P200M627r61o915m784
$$ 979 7477 5391 -1914 -6087 -5777 1311 6829 5220 -743 -7270 -5425 1775 6402 5441 -1474 -6258
815f258P11O328O635k429o419m999R53P162M267n01o104o504J979O607N195j568
$$ -6258 -5547 781 7416 4987 -1432 -6431 -5478 1684 5951 5450 -654 -7158 -5179 1428 6623 5055
831E055o527m346K49O527N744j437o495n442J888N959M734m49o508n207O92O861
$$ 5055 -1472 -5818 -5569 958 6702 5265 -1230 -6672 -4784 1175 5909 5460 -1048 -6255 -5563 1298
847A298N464k262n289n227N03O768M503j08o698n757K320N247N136n63o401m648
$$ 1298 6762 4500 -789 -6016 -5513 1255 5758 5650 -1048 -6805 -4485 762 5898 5335 -1066 -5714
863e714J09O633N513j980n240n256P35O244M553j89o101n737J653N787M610m53
$$ -5714 -5605 1028 6541 4561 -679 -5935 -5200 1044 5597 5408 -693 -6430 -4777 1010 5620 5167
879E167n888n085O89N715N463q51o432m254N88N355N469j136n270n240K29O811
$$ 5167 -721 -5806 -5117 598 6061 5210 -1222 -5476 -4888 467 5936 4800 -470 -5710 -5481 1330
895A330M181q92m813n830J172N492M829J13o796m353J085M549N814j030n591m361
$$ 1330 5511 4619 -194 -6024 -4852 640 5469 5582 -1214 -5567 -4482 67 5881 4851 -740 -5101
911e101m63O576M811j672m302n333L62O168M019P5n666n449J756M645M660K31
$$ -5101 -5564 1012 5823 4151 -151 -5484 -5122 1046 5065 5140 -526 -5975 -4219 426 5086 5317
927E317o259m204L96M839N920j653n123l931o25O048M701j075m384n626Q82N773
$$ 5317 -942 -5146 -4750 89 6009 4356 -767 -4698 -5323 725 5426 4351 -33 -5659 -4777 996
943I96L568M10n315n231J358M328N114j29o218l552J60M408N791j395m681m297
$$ 996 4564 4974 -341 -5572 -4214 114 5228 5099 -1119 -4671 -4511 -103 5688 4293 -388 -4685
959d685o32O317L984q23l845n884J056N240L604R71o113m350J291L470N714o99
$$ -4685 -5317 1000 4984 4161 316 -5568 -4512 728 4332 5303 -810 -5160 -3869 -399 5315 4616
975D616n564l209q45N261N016j526l478n067k40N919L417L22m423n635J228M504
$$ 4616 -948 -4157 -5002 259 5275 3749 271 -4796 -5036 883 4300 4622 199 -5436 -4208 296
991B96M082P07n788m215R62L724N272n44n308l236p03M941M877j508l196m873
$$ 296 4378 5085 -703 -4918 -3956 -232 5040 4496 -812 -4048 -4751 190 5067 3559 363 -4510
1007d510l70N693L055P13m237n702J641L501M457R86o119l385P6L820N653j525
$$ -4510 -4880 813 3868 4581 344 -5358 -3717 -216 4241 5227 -892 -4277 -4201 -381 5272 3747
1023C747m104l515r40N419L731n08l429n025N39M447L344R44m519m815P48L573
$$ 3747 -357 -3872 -4812 607 4338 3830 401 -4624 -4085 362 3706 4650 131 -4684 -3936 -363
1039c63M696L70n312l329k80L824N475j237m167l527r41N569L345o85k763n277
$$ -363 4333 4703 -609 -3938 -4218 -394 5081 3844 -323 -3850 -4791 778 4123 3438 675 -4602
1055d602N62M493K980J276m816m148P58K695N179J39m989l205q91M518M677j066
$$ -4602 -4040 453 3433 4709 -107 -4255 -3497 -802 4377 4516 -473 -3678 -4569 -51 4626 3560
1071C560l288m229n45N026L454j45l623m451O14L646L476Q80m372m044L53L256
$$ 3560 272 -3957 -4502 524 3978 3833 210 -4241 -3627 19 3495 4375 3 -4041 -3688 -432
1087d32M564r6m095l309j082M224M661q46l223m332k17M560L049N93l598m761
$$ -432 4132 4036 -59 -3368 -4450 -226 4435 3589 366 -3966 -4183 377 3426 4019 421 -4340
1103d340Q47L404L669M79m220l226m21L170M635j79l679l577p66M181L737j09
$$ -4340 -3493 -89 3580 4059 -161 -3387 -3808 -638 3997 3818 139 -3438 -4204 -23 3714 3605
1119C605k922m588k68M387L295L20l601m053K90L135L942N46m148l338l28L362
$$ 3605 683 -3905 -4173 214 3509 3829 228 -3825 -3535 -400 3542 4088 -60 -3398 -3726 -364
1135c64M054k40k899l852r14M198L583M1l084m169l0L373L696N64l721l833j7
$$ -364 3690 3450 551 -3301 -4215 -17 3566 3607 523 -3646 -3676 -303 3393 3957 236 -3597 -3614
1152c614L432L668P0l335l383o82L387M135j71l289l372p02L627L442L04k781
$$ -3614 -182 3486 3556 221 -3162 -3844 -457 3678 3507 218 -3154 -3856 -229 3213 3517 736
1168G36m318r6L517L369N37l488l375m81K938M216k9l377l189o62L478L395L22
$$ 736 -3582 -3678 -161 3208 3745 257 -3118 -3599 -661 3555 3526 149 -3040 -3702 -224 3171 3493
1185C493k793m042k62L313L474L16l165l280o95L072L828K86l125l690j74L073
$$ 3493 700 -3342 -3604 -291 3183 3499 334 -2946 -3641 -569 3259 3545 420 -3270 -3444 -371
1201c71L313O60l176l428n50K999L931j53k769l242q48L242L265O81l002l844
$$ -371 2942 3602 426 -3002 -3552 -553 3378 3225 456 -2786 -3634 -392 2873 3554 552 -3292
1217c292mK790L441N64l148l094r28L155L713N3k663l598l01K837L174J017l295
$$ -3292 -3296 -506 2935 3499 351 -2743 -3671 -516 3197 3250 587 -3011 -3312 -475 2699 3716 421
1234D21l340m28K707L750O7k649l197q79L180L218N73k904l525j42K518L432O15
$$ 421 -2919 -3347 -640 3110 3177 528 -2669 -3548 -368 2850 3423 519 -3006 -3148 -630 2802 3417
1251C417l005l136p33L027L366N8k287l620l56K758L148Q33l176l058l63K367
$$ 3417 412 -2724 -3457 -430 2936 2994 707 -2913 -3269 -511 2637 3470 294 -2764 -3127 -760
1267g60L667J94k523l179r11L193K948N31k486l539j41K382L338O10k885k983
$$ -760 2907 3101 578 -2601 -3512 -319 2629 3160 674 -2865 -3006 -624 2714 3324 439 -2544
1283b544o92K735L199L64k330l478m60K696L031P07k825k900o02K327L537J85
$$ -2544 -3236 -501 2698 3062 732 -2746 -3206 -510 2521 3228 403 -2497 -3099 -772 2765 2950
1299B950k267l165q26L000K609Q70k395l475k05K081L311Q13k948k655q40K451
$$ 2950 683 -2482 -3308 -308 2301 3171 776 -2699 -2904 -823 2488 3301 353 -2302 -3142 -691
1315f91L267L69k165l342n80K740K692Q42k490l152m06K150L213N49k406k944
$$ -691 2576 2945 780 -2562 -3142 -402 2290 3132 642 -2510 -2916 -766 2447 2996 590 -2354
1331b354p12K396L006P39k422l030n62K128L335M63k376k827j006K730K810N09
$$ -2354 -3066 -670 2336 3075 653 -2377 -2939 -811 2524 2987 611 -2216 -3222 -492 2318 2827
1347B827k004l408k01K200K593J206k756k670n51J749L511M00k298k550j284K589
$$ 2827 823 -2585 -2786 -586 2007 3213 457 -2213 -2764 -1015 2496 2896 598 -1952 -3236 -647
1363f47K998L41j780l276p12K608K662P31k261l047m20K249K716O66k303k692
$$ -647 2351 2692 912 -2364 -3076 -468 2194 2925 664 -2383 -2803 -554 2162 2828 525 -2167
1379b167n32J853L036N53k103k476j269K372L009M05j641l262q91K757K303J064
$$ -2167 -2699 -846 2190 2743 640 -1836 -3105 -733 2276 2681 1040 -2222 -3113 -356 1947 3011
1395C011k204l272j7J713K937P76k654k053r64J835L204Q9j533k560j333K454
$$ 3011 807 -2465 -2482 -769 2168 2944 290 -1763 -2727 -892 2312 2401 868 -1692 -3025 -571
1411e71K487O94j410l365p03K238K491J202k420k929k06J621L020O66k504k071
$$ -571 1916 2610 1200 -2165 -2868 -630 1861 3063 643 -2286 -2492 -871 2149 2815 311 -1760
1427a760q98J878K973j0j334k436j358K378K266P82j243l268n55J746K467J545
$$ -1760 -2658 -780 2193 2183 849 -1587 -2945 -567 1699 2481 1238 -2030 -2585 -839 1628 3173
1443C173k528k688m73J481L272N08k345j949j265K143K802o7j149k615r65K182
$$ 3173 645 -2043 -2516 -1035 2237 2745 400 -1549 -2814 -671 2131 2064 915 -1700 -2665 -483
1459d83J913J109j346l153m53J420K556J475k460k391o89J375L355L94k164k037
$$ -483 1430 2539 1193 -1960 -2413 -993 1563 3038 578 -1813 -2502 -1127 2228 2622 458 -1579
1475a579j219K283K544N3j165k748o70K133J739J170j567k810l14J119K586J282
$$ -1579 -2798 -515 2029 2082 917 -1831 -2501 -368 1371 2541 974 -1836 -2150 -1031 1555 2837
1491B837k215k156j004J409L260K51j654k283j293K377K294L73j327k751l70J836
$$ 2837 622 -1534 -2538 -1129 2131 2382 728 -1555 -2848 -471 1823 2196 869 -1882 -2252 -416
1507d16J690J230j766k423k85Q79K530J116j906j893j365J448L154K95j352k431
$$ -416 1274 2504 738 -1685 -1970 -1091 1439 2555 649 -1244 -2609 -1161 1993 2288 936 -1495
1523a495j209K181K117O84j290k925k69J674J821J156j782k128n30Q31K697Q60
$$ -1495 -2704 -523 1594 2278 988 -1937 -2206 -532 1289 2445 663 -1465 -1995 -1164 1533 2393
1539B393j679j856j354J524K631N32j049k687j091K021K020R68j467k691l43J418
$$ 2393 714 -1142 -2496 -972 1659 2191 1142 -1545 -2636 -615 1405 2373 906 -1785 -2128 -710
1555g10K099J051j810k078n71J049K452O95j447j797j330J464K370O14r11k595
$$ -710 1389 2440 630 -1448 -2019 -970 1482 2177 730 -1067 -2397 -933 1437 2051 1140 -1455
1571a455r54J791J791J301j588k608k74J144K229R79j822j758q70J146K498M56
$$ -1455 -2409 -618 1173 2474 886 -1722 -1996 -852 1377 2356 534 -1224 -2094 -948 1550 2006
1587B006j251j921j016J398K036Q66j095k424q05J376K023J026j344k377o14J218
$$ 2006 755 -1166 -2182 -784 1252 2118 1023 -1401 -2206 -830 1193 2219 875 -1502 -2116 -898
1603h98K263R30j667j906p69J112K368N88j189j881j199J502K019O98q83k446
$$ -898 1365 2295 628 -1278 -2047 -935 1433 2021 832 -1049 -2248 -746 1273 1971 1088 -1358
1619a358p23J197J935J251j512j998p71R49K395P24j284j897j102J458J992O57
$$ -1358 -2081 -884 1051 2302 790 -1208 -1979 -1030 1365 2089 805 -1092 -2194 -736 1256 1913
1635A913r56k227p62J211J952R36j142k027r04J147J980R21j112k170p47J093
$$ 1913 957 -1270 -2032 -821 1131 2067 925 -1102 -2006 -859 1121 2042 930 -1240 -1987 -894
1651h94J993J049j340j857r66J067K219O27r65k028j001J354J740R35r72k191
$$ -894 1099 2148 808 -1049 -2015 -948 1271 1898 933 -1095 -2096 -742 998 1933 961 -1230
1667a230o31Q85K094R29j275j715j108J173K019P36r16k034r11J159J761J049
$$ -1230 -1861 -976 1118 2047 772 -943 -2051 -878 1141 1877 961 -1073 -1984 -825 936 1985
1683A985j117j859q81R52K045P59j033j881r86J205J752R83r91k016p38Q42K023
$$ 1985 868 -991 -1872 -920 1125 1884 851 -1030 -2016 -811 941 1924 933 -1083 -1821 -979 1044
1700A044Q73j093j733j027J078J947O78p67k017q28J000J717J122j154j803q03
$$ 1044 1917 824 -909 -1936 -858 1089 1767 1000 -1017 -1845 -845 872 1994 840 -963 -1766
1716a766P45K146O84r26j696j106J148J677R81r24j938p47P83J857R29j058j573
$$ -1766 -1021 1125 1809 883 -813 -1919 -771 906 1887 963 -975 -1722 -939 918 1847 789 -784
1733g84j087R87J729Q66p91j853p85Q61J663J075j054j636r15O73K051O59p53
$$ -784 -1871 -884 845 1711 920 -933 -1718 -857 806 1881 827 -809 -1724 -1051 1000 1659 906
1750I06j695j075J112J561R72q01j984o39P06J787R27r67j559j029Q72J878O76
$$ 906 -789 -1864 -752 809 1781 980 -1004 -1643 -937 850 1777 810 -749 -1778 -906 972 1648
1767A648o83j810q60R12J568R82q85j629r28P33J811P79p13j674r31Q27J556R60
$$ 1648 965 -845 -1705 -793 775 1757 872 -757 -1685 -952 859 1638 925 -749 -1680 -853 703 1663
1785A663p37j729q54P12J742Q56p50j603j063R03J720P28o43j778p93Q57J398
$$ 1663 926 -803 -1657 -945 797 1653 903 -700 -1763 -860 860 1588 945 -833 -1626 -769 629
1802F29J104r24j631o82N28J832P78p94j441j131Q60J585Q55n32j813q55P98J514
$$ 629 1733 809 -822 -1504 -976 856 1634 840 -601 -1732 -872 713 1568 1036 -777 -1632 -834 680
1820F80R04o85j634q74P70J590Q41p28j587p68N53J640Q90q21j348j002O65J730
$$ 680 1584 899 -735 -1609 -839 751 1592 864 -723 -1491 -938 702 1592 771 -577 -1579 -914 816
1838H16N92l89j637j027Q85J371J030o63j805o11M64J697J012j065j232q79N40
$$ 816 1408 1019 -618 -1645 -760 611 1641 978 -827 -1438 -974 723 1735 670 -562 -1441 -901
1855i01J712N92n98j369j019P56J469P35l95j660q20O65J294J184o96j677p02
$$ -901 811 1403 805 -564 -1583 -827 642 1377 982 -678 -1498 -833 461 1645 949 -728 -1430
1872a430M47J617J010r56j277q24N00J798M75n68j265j000P64J253P67k28j741
$$ -1430 -983 634 1644 688 -589 -1413 -913 885 1360 792 -473 -1473 -709 544 1311 1083 -658
1889f58p41N57J186J271o90j491q07K34J846Q47q49j178j071O98J650M65m28j395
$$ -658 -1399 -842 344 1615 925 -566 -1373 -1139 707 1554 705 -473 -1544 -846 804 1269 841 -554
1907e54r13Q30J100Q60l70j568n92L00J217J218p02j334q26K31J744Q48o92j179
$$ -554 -1467 -637 463 1323 953 -615 -1207 -907 310 1528 826 -508 -1334 -1103 641 1489 797 -382
1925c82j224P99J516N63l03j600q29R13Q96R98m46j527m66K64J093J172o42j117
$$ -382 -1606 -807 709 1272 969 -631 -1460 -547 349 1347 901 -626 -1092 -828 265 1437 795 -322
1943c22r40J41J755P06m52j261j215P37J474O51k53j633q12Q04R63J005m66j514
$$ -322 -1262 -1121 634 1340 888 -373 -1588 -851 623 1274 1021 -612 -1424 -620 343 1348 882 -632
1961f32m50K07J235J022p27r28r35J46J589O81k29j259j213P10J263P22j93j633
$$ -632 -1082 -875 360 1382 655 -273 -1208 -1062 527 1208 979 -280 -1493 -783 480 1202 1009 -624
1979f24p29O65J070J023o56j271n33J79J293P84n60q68r78K93J439N62j01j300
$$ -624 -1353 -688 382 1405 749 -522 -1055 -876 417 1201 641 -227 -1205 -912 527 1089 988 -312
1997c12j096O45J080R30k58j615n37L87J051J098o48j216n62J20J411P27n59q35
$$ -312 -1408 -763 317 1247 989 -626 -1163 -776 275 1373 725 -491 -1053 -933 478 1205 646 -189
2015a89j006L47J275O18p4j259r88N82R43J019l04j471n67K77J149R70o01j090
$$ -189 -1195 -848 427 1045 971 -288 -1276 -694 249 1268 964 -507 -1074 -797 352 1322 721 -369
2033c69p11J88J440N64l83r39r94M87J082O84j19j260q74N22R24J017l90j233
$$ -369 -1080 -892 548 1112 729 -210 -1204 -717 365 1049 930 -330 -1204 -682 242 1259 869 -364
2051c64p27K56J174R02n37j049p50K12J348O02l22r56j028M81J113O05m7j255
$$ -364 -1091 -835 339 1241 704 -345 -1095 -883 465 1067 745 -211 -1239 -758 355 960 913 -342
2069c42p12K98R41J008l57j181o02L6J221P94l46r86r21L80J102O58j78j062q59
$$ -342 -1054 -756 185 1193 836 -345 -947 -911 310 1104 758 -228 -1149 -769 333 991 813 -249 -1108
2088a108L31J055P80k08j147p35K35R80Q80k40j099p01J89J074Q09l55r68q20
$$ -1108 -777 278 1058 850 -297 -1032 -797 183 1063 823 -276 -977 -788 286 1095 740 -228 -1048
2106a048K05J162O68j31j091q65L77R41Q10j83j141o54J62J050Q21l64q92q37
$$ -1048 -843 319 987 856 -235 -1100 -723 218 1028 845 -296 -950 -788 262 1083 719 -173 -1010
2124a010J81J131O24j14r89q24K63R74P92k43r75q22J98J065P48k11r52q13K32
$$ -1010 -829 302 926 812 -177 -1001 -738 236 1028 785 -190 -1012 -814 251 999 788 -164 -977 -745
2143g45R15Q34j93j019p70J55J061P71k97q41r04L11R30P34j28j032p75K56Q43
$$ -745 170 1004 811 -208 -978 -823 238 1009 712 -129 -1033 -722 208 942 814 -218 -993 -737 106
2162A06Q61k28r28o89R0R42Q32k79q13q29J69Q94P66j50r50p14J32R04Q25j87
$$ 106 967 739 -189 -878 -788 154 986 707 -106 -935 -766 128 894 744 -206 -920 -788 116 941 754
2182G54r26p55J73Q97P26o3r77p06J72P83Q53j85q88p41J06R48P04j42q28p70
$$ 754 -172 -927 -754 143 869 806 -171 -877 -705 78 931 746 -142 -883 -777 171 875 733 -95 -865
2202h65J42Q39P59o9r91o81P5R36Q02k55p87p45Q8Q63P74j09q78p39J65Q28P15
$$ -865 -723 116 875 806 -185 -866 -791 145 947 692 -95 -840 -752 111 885 776 -102 -841 -676 152 867
2223H67j46q61o86P8Q54P45j28q15p35R4Q82P34j68q98n42j5Q61O86r0p89p96
$$ 867 721 -140 -826 -748 106 851 723 -92 -827 -733 149 883 715 -183 -725 -740 121 807 717 -72 -868
2244h68J63P92P14m1q93o92J61P14Q19j58q05o61PQ70O78j13p16q13J27P94O96
$$ -868 -705 87 801 760 -133 -825 -664 50 869 711 -94 -755 -748 122 800 687 -29 -842 -715 79 775
2265G75lq65o79Q1O83P45J7q08p12L8P33Q15j10p34o83j7Q02P01r2p17p34M2Q42
$$ 775 772 -93 -772 -691 -8 737 754 -54 -766 -728 5 820 710 -24 -707 -724 78 779 687 -30 -764 -722 120
2288A20N76J4p08q04J56O28P12O8q10o18j4O47Q43j76p04o67m2Q99N68Qp00q38
$$ 120 696 710 2 -802 -646 -18 694 762 -48 -666 -680 -33 810 634 -70 -737 -779 120 688 696 -4 -842
2310h42J67P65N41J44p81p46J06O29P64oq52n15n2O70P73j75n57p11o3Q09O07
$$ -842 -675 90 631 775 -6 -752 -646 -17 747 741 -111 -626 -678 -8 765 590 33 -678 -741 68 675
2331F75m2n81q44J46P23N29R4p60o45J56M71Q07l3p29n68j45P73O68j78m56p42
$$ 675 633 52 -792 -646 77 606 700 -60 -705 -549 -78 729 696 -33 -601 -746 27 695 517 61 -681
2352f81j7P65N80M5o96p08J71N16O29J16p88n31j9N19Q07q6o08n68j38P28O47
$$ -681 -698 67 647 692 -4 -712 -541 -25 604 720 -68 -599 -618 -99 708 622 14 -554 -692 36 683
2373F83j31m80p43j0P60M65J92o86p77J63M80P09P6p80n24pN24P90j12o02n31
$$ 683 552 72 -671 -681 79 544 736 50 -727 -564 -84 625 701 -79 -603 -610 -86 704 592 -10 -541
2394e41k06Q10N17K4m85p95L5O87M34K38p24o61J24M36P00N7o99m12j50N28P38
$$ -541 -747 63 580 604 119 -676 -641 46 480 718 -6 -667 -543 -107 593 650 -49 -461 -611 -83 655
2415F55j52m02o81j88P97N04N5m70p76J01N63M93K08o79n92L3L46P69R9p14l94
$$ 655 503 101 -580 -768 29 533 588 118 -658 -557 6 499 707 28 -564 -531 -185 584 683 -31 -425
2436d25k40N76P38j40l82o99j10O96M59J51m96p80K11L62N25K43o99m83p2M20
$$ -425 -665 -89 649 509 127 -572 -682 14 473 624 128 -652 -441 -79 446 689 -10 -493 -565 -145
2456a45P32j1n85m43k36O41O35q5l51p21l7O08M05K50n72p63J68L58O46J89p23
$$ -145 587 576 -9 -452 -688 -47 588 503 152 -569 -606 2 407 657 85 -678 -510 -152 494 683 -40
2477d0m47j26M81P46n9m47n49k14O48N25%l44p37K3N22M55J85n81n74M3L29O14
$$ -40 -487 -613 -132 614 555 108 -441 -655 -7 518 518 174 -563 -540 -18 437 622 41 -533 -490 -161 453
2499D53J69n65m91j68M62O84p5l77n49j72N53N13J00m30o33J6M11N25K64o88n11
$$ 453 622 57 -434 -602 -140 544 469 92 -457 -629 -76 437 537 107 -526 -510 -99 426 690 2 -509
2520e09jL86O35J03n55m64j79M90N68M3l85n73j47N79M04J79m38n88l7L84M70
$$ -509 -510 -124 511 614 59 -405 -584 -94 474 517 132 -441 -588 -9 395 574 136 -452 -489 -105 365
2541C65J92n22m59j01M34N28J31n37l77k16M62N37N3l74n33j08M39M88J45m29
$$ 365 557 35 -424 -525 -91 437 568 31 -346 -562 -100 437 490 116 -417 -525 -86 402 547 118
2561A18n94K9L13N43J86n66m42q5M19M89Q7l58n48j62M93N21P1l57n50q9L67N16
$$ 118 -476 -447 -134 409 595 29 -413 -498 -79 410 497 139 -409 -571 -78 443 514 157 -393 -482 -115 401
2583D01J28m08n38m2L13M95J98m53m39k42M88M83J27l22n96j08M65M11P8k57o02
$$ 401 529 121 -417 -459 -146 349 547 94 -345 -587 -99 384 511 189 -407 -515 -50 361 439 182 -420
2604d20q4L90N19R0l76n11o4L44M80J47l55n06j58L90M75J41l16n30j57L56M72
$$ -420 -504 -114 405 495 119 -392 -456 -112 368 515 160 -346 -504 -114 361 502 186 -344 -501 -145 327
2625C27J41l42m79j00K55N66R4l37n14j24L59M73J80l45m66j61K69N99J02l21
$$ 327 468 126 -353 -453 -198 368 462 125 -389 -513 -154 319 499 154 -312 -473 -204 395 497 176
2645A76n16j09K95N02J59l89n15r2L51M95J45l92m32j66L64M84P7l33m47o2L25
$$ 176 -340 -449 -154 348 507 118 -397 -489 -138 357 502 110 -322 -488 -124 360 437 104 -343 -405 -80
2666h0L50K36l12n37j40L63M38J00k58m36j98L28M70J43l92l63j69L10M59J46
$$ -80 270 506 194 -343 -483 -120 318 418 160 -276 -474 -146 324 467 75 -288 -457 -147 312 458
2686D58l01m40j43L49M21J40k97m72j33L16L94J71l22m55j04K66M85J27l51m09
$$ 458 157 -283 -426 -77 344 484 187 -285 -418 -102 292 463 141 -314 -418 -152 333 460 109 -300
2706c00j57L18M89R6l30l75k09L24M01K04k90n46qK63M05J99l49l85j67K94M22
$$ -300 -457 -139 350 446 116 -259 -468 -144 257 461 171 -375 -383 -120 285 484 135 -250 -417 -123 299
2727B99J36k10n06j41K87M03J50k72m15j31K54M17J91l22m46j15K45M84R1k63
$$ 299 435 225 -281 -422 -135 268 418 146 -269 -400 -146 271 462 140 -306 -421 -176 308 399 136
2747A36l62k08K46M51J39k49l78k25L29L52J46k08m71j77L42L67K33k62m63j09
$$ 136 -226 -434 -188 263 402 153 -225 -450 -121 231 377 169 -302 -479 -137 230 463 201 -262 -371
2767c71J63M60J64k71l58j93K43M08J36j96m09k22L23L38J42j74m52r8J85L33
$$ -371 -208 252 416 145 -213 -406 -163 245 381 185 -224 -446 -123 215 357 183 -269 -367 -182 151
2787A51K51k28m22j15J43N44J09l21l13j72K91L75Rj71l39k07L10L12Q8j39m20
$$ 151 402 174 -248 -363 -220 324 433 112 -201 -373 -82 293 302 131 -208 -415 -105 207 295 156 -264
2808b64q3K04L09L06l68l30p8R7M68R8k69k41k54K38M25Oj02m03j18K11K73K10
$$ -264 -347 -143 166 472 104 -226 -304 -207 261 359 90 -151 -405 -167 258 264 162 -241 -359 -148 125 335
2830C35k06l74m5J28L77J92k58l14j93J34M84J00k23k57k87K81L54P9j19m35j36
$$ 335 129 -245 -290 -162 215 407 149 -165 -358 -224 260 360 137 -120 -407 -126 228 307 188 -247 -383
2851c83K52K78J65j76l41l3L6L46K11k75k31j34O2M66J09j83l38k12K45L30J63
$$ -383 -131 147 312 136 -205 -238 -202 144 355 80 -151 -285 -223 243 352 169 -169 -381 -136 194 357
2872C57j46m24j77K49K97J89k37l10m4N8L43J36j87k10j85J05L58N9nl55j97K22
$$ 357 211 -213 -390 -141 156 345 108 -202 -246 -188 155 291 104 -106 -291 -186 172 231 226 -129 -326 -104
2894a04K57J96j12m50p8K07J96K59k56l16o0N4M04O7j51j84k34J99K80J23p4l68
$$ -104 153 349 237 -213 -291 -84 112 371 115 -201 -261 -207 197 264 113 -71 -305 -106 174 297 223 -145
2916a45j96K08K49K94k20m40m6J55K61K70k68k59j47R7M10O3j20k26k89K30K99
$$ -145 -341 -133 116 410 190 -250 -296 -141 120 390 122 -137 -284 -187 223 286 166 -60 -349 -119 180
2937A80K8L4m34j22J69K62K34j32m59n7P2L38J99j58k66j62R4L55Q7j33k85j30
$$ 180 208 242 -192 -314 -145 117 351 219 -240 -297 -225 113 312 154 -112 -274 -180 175 262 129 -156 -286
2959b86J67K22J17K5l85j05J01J98K14q7l14q4L5L48J65k04k45j57J24L43P6j05
$$ -286 -119 103 220 245 -140 -245 -144 54 268 181 -133 -217 -182 166 331 127 -118 -275 -151 192 268 163
2981A63l07j65K13J95J74j35k57j22J08K34K12j98k42q4QL37J67j76k10k55J94
$$ 163 -144 -309 -96 99 273 138 -119 -241 -133 101 313 115 -127 -211 -203 134 301 125 -85 -340 -146
3002a46K58J82j47k88j89K35K00J74j15l19k0k5K83J87j53j85k00J19L11J28j25
$$ -146 112 294 147 -141 -330 -95 105 279 164 -155 -175 -200 83 270 117 -68 -268 -149 162 290 165
3023A65k10k30R5L20J52j82k54j55J85K62R3j19k24j31N4L06J34j49j92j63M8
$$ 165 -45 -275 -180 140 292 110 -144 -299 -114 148 241 122 -102 -233 -179 127 261 112 -80 -243 -195
3044a95L32J18j06j96k45J24K81J70j24k52j36Q8K38J81j17k36j74J06K59J49
$$ -195 137 255 149 -47 -292 -168 113 283 159 -93 -229 -141 97 278 161 -75 -249 -143 116 265
3064B65o3l21j06P9K34J43r1k18j64R3K43K04q7l03j42J54J44J79j38j77j93J32
$$ 265 202 -119 -225 -146 88 231 140 -78 -242 -149 94 298 211 -92 -234 -80 64 243 105 -72 -265 -133
3086a33K25J67j32j86j47K2L20J41j05k96n8Q2K42Q3n5k19j17J3K24J94j66k04
$$ -133 92 259 127 -59 -206 -184 136 277 172 -124 -182 -100 142 225 170 -49 -166 -153 71 265 99 -105
3108a05j43J41K04J69j16k78j08R1J86J45l4k26j83R1K55J49o1k80p6M6K45J12
$$ -105 -248 -107 97 266 150 -128 -236 -145 41 186 152 -74 -257 -166 89 238 177 -103 -179 -133 112 224
3130B24p9k21j18M8K39R9k3j99j99J13K43J10q8j76j72N0K39Q9l1k09j55Q0K16
$$ 224 145 -76 -194 -146 93 192 169 -30 -229 -116 127 237 149 -27 -199 -149 90 179 148 -61 -216 -136 80
3153H0J44r4j54j81P5K62Krk25r8O3K22J28q2k35r3O8J56J71o0k01j40P1K20R8
$$ 80 224 130 -24 -205 -130 132 134 125 -100 -198 -135 87 215 133 -102 -195 -127 29 200 140 -61 -201 -130 90 188
3178A88o7j77j03J13J50J41j10j94j50P7J61J68q3k12j32R9J75J56o2j99j01Q1
$$ 188 121 -56 -159 -46 104 245 135 -59 -209 -132 29 197 114 -98 -230 -131 44 200 138 -61 -162 -81
3200h1J30J47n3j90j30M7K06R6k6k55m4K9J94J42n3k70o9M0K15R2n1j82j26O9
$$ -81 49 196 143 -47 -177 -130 76 172 146 -109 -153 -124 70 212 159 -111 -180 -140 75 167 116 -66 -192 -123
3224a23J74J01mk04j39R3J80O9L2k43j32Q3J71R8k2k15n9J6J76J31q8j50j14L9
$$ -123 51 152 148 -56 -195 -102 78 147 179 -64 -196 -113 58 156 134 -81 -140 -124 52 183 95 -55 -169 -130
3248a30J73J27l1j91j35J32J01J26l3j98q1OJ70J57p9k24l1nK43P0q6q9k31J79
$$ -130 43 170 139 -52 -187 -55 46 172 139 -59 -140 -134 36 193 114 -110 -141 -146 97 167 81 -8 -239 -60
3272f0J11J09j8j86j57J50J06P4l0j87q2R2J25J64o2j49j05m2K10O3J5j79j86
$$ -60 51 160 142 -44 -201 -51 55 129 99 -88 -170 -78 47 211 149 0 -105 -147 63 126 141 -38 -224
3295b24J30J51R8J0k57m2M7J34J81j13j45p2oJ54J62j25p7j33qK13L2L1j93r1
$$ -224 -94 57 155 165 -92 -134 -87 47 228 115 -30 -102 -108 46 208 83 6 -127 -135 78 110 141 -52 -143
3319a43M7J17J64m0j95j07M1J50J56k0k19j0n0J55R5j16j3j36K5J64j1L8j78j20
$$ -143 -96 21 185 145 -50 -157 -116 34 190 170 -49 -59 -109 46 141 25 12 -124 -99 65 54 92 -86 -206
3343b06J31J25J07n5k14l3L5J08J44k9j76q8K7J91P8j29l3j38N5K09L2l5j55j13
$$ -206 -75 50 157 102 -112 -145 -110 -2 142 113 -63 -151 -124 67 145 16 -17 -155 -100 109 141 106 -49 -162
3367a62Q2J01J43q8j08q9N9J04J36j30j47n3L1K08NJ8j49q7P6L4J10J6j66l0N1
$$ -162 -80 21 164 76 -32 -121 -62 42 178 48 -99 -152 -121 87 92 110 -39 -126 -50 -16 94 110 -56 -86 -35
3392c5qJ47o1n6o5l7J39J91j38r7j43K3K31M1j3j77j08J01J42N8l6j30p4N0M4
$$ -35 -43 104 43 -13 -78 -115 24 215 77 -20 -163 -140 91 132 119 -58 -166 -65 77 135 99 -31 -105 -55 -11
3417a1J71p1j85J8l0J29J47j06q4j32N9J07J12n9r2j34Q8J51j6K6j07n3J4J45
$$ -11 160 89 -96 -78 -108 21 168 62 -22 -154 -95 12 124 65 -27 -161 -73 78 62 88 -19 -72 -58 87
3441H7Q7j35o4n5nJ74N1r5n1j69J21J45Rk3j03j22O7J14M1K3j55k7pJ04R7qj34
$$ 87 174 39 -25 -80 -85 89 140 45 -6 -175 -54 91 100 77 -26 -148 -81 33 74 97 -58 -85 -92 12 109 101 -33
3468c3p2J7J35M3J7j27j12R9Q5L0J0j50p1Q6Q9O3m9p9n8N0R0J26j10j33r1J3J42
$$ -33 -105 -88 47 90 107 -20 -132 -33 52 82 92 -58 -129 -43 46 109 60 -19 -77 -27 63 189 79 -54 -145 -132 10
3495A0M2M8j27p8J5J30M1L2j63l7K7Q9R5m2j26l5K3P2R6l2n4j37K7P6J00lj24
$$ 10 52 100 -27 -105 -90 40 81 113 -50 -87 -60 29 124 82 -44 -79 -56 16 112 80 26 -111 -84 -8 92 89 -35
3522c5p0L2J39J0M3j57l5m8J68N8o2m8j07N3J06N5l7j20l9L2J13Nl4o4p8k3K18
$$ -35 -105 -73 66 76 119 -38 -73 -121 47 105 43 -5 -112 -59 47 102 65 -55 -94 -62 51 56 22 -42 -120 -143 75
3549G5L4o3n6q2L7O5O5n7n5n3k0J20R5K2j60q6M3Q8L4M5j69k2P7O7P2o4l0j15
$$ 75 109 46 -10 -92 -55 10 75 18 -37 -90 -110 10 105 127 -33 -119 -76 12 46 91 -78 -100 -23 44 116 52 22 -93
3577i3qJ83j8L4j17k0k7J01N5k1k3j13L1K9J23p3j02p2M4N7J07kj19p4O4P7M6
$$ -93 -101 82 64 98 -19 -39 -66 35 90 69 46 -67 -36 -7 116 43 -59 -131 -87 -30 77 75 -44 -118 -54 23 69
3604F9k2o1q9qJ06J08k6j29o1O4P1L0J8r3q9Q0O3Q3r4m8m7K5J08L7m9o6m8M3P0
$$ 69 47 -14 -103 -111 -5 103 77 -52 -113 -49 22 52 70 -23 -112 -32 31 114 20 -28 -75 -50 58 95 46 -20 -68 -25 45
3633D5k6Q1j23o3J7O5O3Mj13K6o6J46K4Qq4j09P8L6J09o6j1j14l1J05O9J4p8r0
$$ 45 19 100 -23 -86 -69 -4 59 63 -50 -24 -90 56 80 88 4 -105 -27 9 118 52 41 -73 -104 1 70 84 6 -84
3661h4M2P1R2l9j17k5j8J55O0p4p7n9QP0Q0J3j08q1RR0J32j05m5o2QN3Q3K2p2
$$ -84 -42 29 121 82 -35 -60 -78 77 137 63 -14 -73 -65 5 85 98 -10 -91 -82 8 140 35 -10 -72 -64 -11 72 94 22
3690B2o7K7N9M6k7q2n2M2R6J0J0j16j8M4Q7Jk6j7j00K0J13j8jo3l0j9Q6N6L4r5
$$ 22 -45 -18 41 87 60 -22 -74 -32 64 74 84 -32 -50 -6 81 82 56 39 -61 -41 72 54 53 -10 -40 -59 27 83 117 22
3720B2j63O9O9P4j0j11k9P6N8p1J6p0%K7P6Jk3J1n1k9P5J0l2K6n5k2Q3L0p0l6
$$ 22 -141 -72 -3 71 61 -50 -79 -3 55 -16 0 -70 -70 -43 33 34 11 22 -29 -58 17 27 -5 21 -34 -56 27 57 -13 -49
3750d9m5Q4M8N3j8j22PL4O4Jo0J3m5KP0oJ8m2j04N4J26m0P4j34Nn2Q7N1j2o4o6
$$ -49 -94 -10 38 91 73 -49 -42 -8 56 57 -3 10 -35 -33 37 31 49 7 -97 -43 83 43 117 -17 -12 -64 23 74 62 -2 -68
3781f8L5P3O9q3j1k4l8J02lj3j7j02Q0m5J27lj33k1Q3pQ0n3j3p7J9M2N5l8Lj04
$$ -68 -33 40 109 26 15 -9 -47 55 52 39 22 -80 0 -45 82 79 -54 -75 8 1 81 28 15 -62 -43 -1 54 16 19 -85
3811h5J3Q8R2m2o8k2K0K7O4l6l8n5l2R9mm5J0n1P6L9j8L0q7m7J8J00M0j3l4j05
$$ -85 -72 16 108 66 -2 -24 -4 23 87 51 13 -42 -74 25 21 -24 -14 -65 11 50 32 62 -25 -72 -54 46 86 73 39 -66
3841f6P6N7q8L8j1m7K2M8L4p8K3p3pQ6M6l4k0j03O9M5%R1j97N1K4k2P7pr8K3K8
$$ -66 10 67 -21 17 6 -41 -19 29 63 -15 8 -65 -72 14 60 26 6 -97 -28 17 17 108 -89 -38 -14 -36 41 34 -64 -41 -13
$$ [...]
8191g
##END NTUPLES=NMR FID
##END=
