##TITLE=1H_SR18_K1
 D2O, 8 sc, 
 26.8.2020
##JCAMPDX= 6.0         $$ Bruker NMR JCAMP-DX V2.0
##DATA TYPE= NMR FID
##DATA CLASS= NTUPLES
##ORIGIN= UXNMR, Bruker Analytische Messtechnik GmbH
##OWNER= root
$$ XWIN-NMR		Version 3.5
$$ Wed Aug 26 09:43:23 2020 Russian Standard Time (UT+4h)  she@DPX200
##.OBSERVE FREQUENCY= 200.1315066352
##.OBSERVE NUCLEUS= ^1H
##.DELAY= (6, 6)
##.ACQUISITION MODE= SIMULTANEOUS
##.ACQUISITION SCHEME= undefined
##.AVERAGES= 8
##.DIGITISER RES= 18
##SPECTROMETER/DATA SYSTEM= spect
##.PULSE SEQUENCE= zg30
##.SOLVENT NAME= D2O
##.SHIFT REFERENCE= (INTERNAL, D2O, 0, 15.7039)
##AUDIT TRAIL= $$ (NUMBER, WHEN, WHO, WHERE, WHAT)
$$ ##TITLE= Audit trail, XWIN-NMR		Version 3.5
$$ ##JCAMPDX= 5.01
$$ ##ORIGIN= Bruker BioSpin GmbH
$$ ##OWNER= she
$$ F:/spectra/data/she/nmr/H-F/1/audita.txt
$$ ##AUDIT TRAIL=  $$ (NUMBER, WHEN, WHO, WHERE, WHAT)
(   1,<2020-08-26 09:42:12.28 +0400>,<she>,<DPX200>,
      <created by zg, POWCHK disabled, PULCHK disabled
       configuration hash MD5:
       00 E9 B6 7A A2 85 ED C7 34 08 36 98 17 FE 4E 26
       data hash MD5: 16K
       7F 16 0D 76 3B 4C 64 0E 13 53 73 0F F5 28 21 B0>)
$$ ##END=
$$ 
$$ hash MD5
$$ 88 5A 46 7B 07 9D 56 D4 EC 12 EC 7D 2C BF E1 6B
##$RELAX= 
##$RELAX= 
##$RELAX= 
##$RELAX= 
##$RELAX= 
##$RELAX= 
$$ Bruker specific parameters
$$ --------------------------
##$DU= <F:/spectra>
##$EXPNO= 1
##$NAME= <H-F>
##$PROCNO= 1
##$TYPE= <nmr>
##$USER= <she>
##$AMP= (0..31)
100 100 100 100 100 100 100 100 100 100 100 100 100 100 100 100 100 100 
100 100 100 100 100 100 100 100 100 100 100 100 100 100 
##$AQSEQ= 0
##$AQ_mod= 1
##$AUNM= <au_zg>
##$AUTOPOS= <>
##$BF1= 200.13
##$BF2= 200.13
##$BF3= 200.13
##$BF4= 200.13
##$BF5= 200.13
##$BF6= 200.13
##$BF7= 200.13
##$BF8= 200.13
##$BYTORDA= 1
##$CFDGTYP= 0
##$CFRGTYP= 5
##$CHEMSTR= <none>
##$CNST= (0..31)
1 1 145 1 1 1 1 1 1 1 1 1 1 1 1 1 1 1 1 1 1 1 1 1 1 1 1 1 1 1 1 1 
##$CPDPRG= <>
##$CPDPRG1= <>
##$CPDPRG2= <>
##$CPDPRG3= <>
##$CPDPRG4= <mlev>
##$CPDPRG5= <mlev>
##$CPDPRG6= <mlev>
##$CPDPRG7= <mlev>
##$CPDPRG8= <mlev>
##$CPDPRGB= <>
##$CPDPRGT= <>
##$D= (0..31)
0 1.2 0 0 0 0 0 0 0 0.06 0 0.03 0 0 0 0 0.0002 0 0 0 0 0 0 0 0 0 0 0 0 
0 0 0 
##$DATE= 1598420531
##$DBL= (0..7)
120 120 120 120 120 120 120 120 
##$DBP= (0..7)
150 150 150 150 150 150 150 150 
##$DBP07= 0
##$DBPNAM0= <>
##$DBPNAM1= <>
##$DBPNAM2= <>
##$DBPNAM3= <>
##$DBPNAM4= <>
##$DBPNAM5= <>
##$DBPNAM6= <>
##$DBPNAM7= <>
##$DBPOAL= (0..7)
0.5 0.5 0.5 0.5 0.5 0.5 0.5 0.5 
##$DBPOFFS= (0..7)
0 0 0 0 0 0 0 0 
##$DE= 6
##$DECBNUC= <off>
##$DECIM= 32
##$DECNUC= <off>
##$DECSTAT= 4
##$DIGMOD= 1
##$DIGTYP= 9
##$DL= (0..7)
0 120 120 120 120 120 120 120 
##$DP= (0..7)
150 150 150 150 150 150 150 150 
##$DP07= 0
##$DPNAME0= <>
##$DPNAME1= <>
##$DPNAME2= <>
##$DPNAME3= <>
##$DPNAME4= <>
##$DPNAME5= <>
##$DPNAME6= <>
##$DPNAME7= <>
##$DPOAL= (0..7)
0.5 0.5 0.5 0.5 0.5 0.5 0.5 0.5 
##$DPOFFS= (0..7)
0 0 0 0 0 0 0 0 
##$DQDMODE= 0
##$DR= 18
##$DS= 0
##$DSLIST= <SSSSSSSSSSSSSSS>
$$ [...]
##$SUBNAM2= <"">
##$SUBNAM3= <"">
##$SUBNAM4= <"">
##$SUBNAM5= <"">
##$SUBNAM6= <"">
##$SUBNAM7= <"">
##$SUBNAM8= <"">
##$SUBNAM9= <"">
##$SW= 16.880792210976
##$SWIBOX= (0..15)
0 0 2 0 0 0 0 0 0 0 0 0 0 0 0 0 
##$SW_h= 3378.37837837838
##$TD= 16384
##$TD0= 1
##$TE= 0
##$TE2= 300
##$TE3= 300
##$TEG= 300
##$TL= (0..7)
0 120 120 120 120 120 120 120 
##$TP= (0..7)
150 150 150 150 150 150 150 150 
##$TP07= 0
##$TPNAME0= <>
##$TPNAME1= <>
##$TPNAME2= <>
##$TPNAME3= <>
##$TPNAME4= <>
##$TPNAME5= <>
##$TPNAME6= <>
##$TPNAME7= <>
##$TPOAL= (0..7)
0.5 0.5 0.5 0.5 0.5 0.5 0.5 0.5 
##$TPOFFS= (0..7)
0 0 0 0 0 0 0 0 
##$TUNHIN= 0
##$TUNHOUT= 0
##$TUNXOUT= 0
##$USERA1= <user>
##$USERA2= <user>
##$USERA3= <user>
##$USERA4= <user>
##$USERA5= <user>
##$V9= 5
##$VALIST= <valist>
##$VCLIST= <CCCCCCCCCCCCCCC>
##$VD= 0
##$VDLIST= <DDDDDDDDDDDDDDD>
##$VPLIST= <PPPPPPPPPPPPPPP>
##$VTLIST= <TTTTTTTTTTTTTTT>
##$WBST= 1024
##$WBSW= 4
##$XGAIN= (0..3)
0 0 0 0 
##$XL= 0
##$YL= 0
##$YMAX_a= 87776
##$YMIN_a= -95203
##$ZGOPTNS= <>
##$ZL1= 120
##$ZL2= 120
##$ZL3= 120
##$ZL4= 120
##$ABSF1= 10
##$ABSF2= 0
##$ABSG= 5
##$ABSL= 3
##$ALPHA= 0
##$AQORDER= 0
##$ASSFAC= 0
##$ASSFACI= 0
##$ASSFACX= 0
##$ASSWID= 0
##$AUNMP= <proc_1d>
##$AZFE= 0.1
##$AZFW= 0.1
##$BCFW= 1
##$BC_mod= 2
##$BYTORDP= 1
##$COROFFS= 0
##$CY= 11.3945322036743
##$DATMOD= 1
##$DC= 2
##$DFILT= <>
##$DTYPP= 0
##$F1P= 16.9975609425685
##$F2P= -3.02152046262296
##$FCOR= 0.5
##$FTSIZE= 0
##$FT_mod= 4
##$GAMMA= 1
##$GB= 0.15
##$INTBC= 1
##$INTSCL= 1
##$ISEN= 128
##$LB= 0.24
##$LEV0= 0
##$LPBIN= 0
##$MAXI= 10000
##$MC2= 0
##$MEAN= 0
##$ME_mod= 0
##$MI= 1.114404
##$NCOEF= 0
##$NC_proc= 0
##$NLEV= 6
##$NOISF1= 3.799351
##$NOISF2= 2.8
##$NSP= 1
##$NTH_PI= 0
##$NZP= 0
##$OFFSET= 15.70392
##$PC= 1
##$PHC0= -9974.291
##$PHC1= 10.20092
##$PH_mod= 1
##$PKNL= yes
##$PPARMOD= 0
##$PSCAL= 0
##$PSIGN= 0
##$REVERSE= no
##$SF= 200.130013532006
##$SI= 16384
##$SIGF1= 3
##$SIGF2= 2
##$SINO= 400
##$SIOLD= 16384
##$SREGLST= <1H.CDCl3>
##$SSB= 0
##$STSI= 0
##$STSR= 0
##$SW_p= 3612.71676300578
##$SYMM= 0
##$S_DEV= 0
##$TDeff= 0
##$TDoff= 0
##$TI= <>
##$TILT= no
##$TM1= 0
##$TM2= 0
##$TOPLEV= 0
##$USERP1= <user>
##$USERP2= <user>
##$USERP3= <user>
##$USERP4= <user>
##$USERP5= <user>
##$WDW= 1
##$XDIM= 8192
##$YMAX_p= 0
##$YMIN_p= 0
$$ End of Bruker specific parameters
$$ ---------------------------------
##NTUPLES= NMR FID
##VAR_NAME=  TIME,          FID/REAL,        FID/IMAG
##SYMBOL=    X,             R,               I
##VAR_TYPE=  INDEPENDENT,   DEPENDENT,       DEPENDENT
##VAR_FORM=  AFFN,          ASDF,            ASDF
##VAR_DIM=   8192,          8192,            8192
##UNITS=     SECONDS,       ARBITRARY UNITS, ARBITRARY UNITS
##FACTOR=    0.000296,      1,               1
##FIRST=     0,             0,               0
##LAST=      2.424536,      0,               0
##MIN=       0,             -95203,          0
##MAX=       2.424536,      87776,           0
$$ Real data points
##PAGE= N=1
##DATA TABLE= (X++(R..R)), XYDATA
0@%%%%%%%%%%%%%%%%%%Qj6J6j6J6j8K6l2L4m2N0n6O4p5Q6r6J09j24J40j61J82
$$ 0 0 0 0 0 0 0 0 0 0 0 0 0 0 0 0 0 0 0 8 -8 8 -8 8 -10 16 -16 18 -24 26 -30 34 -41 45 -51 58 -66 74 -87 95
39I5k00K24k50K76l07L44l83M24m67N15n69O26o89P58q34R20j015J118j236J371
$$ 95 -105 119 -131 145 -162 182 -201 223 -244 271 -298 328 -361 397 -437 483 -532 586 -650 721
59G21j524J702j909K153k450K818l285L898m726N873j2923R7428n2279r619m6521
$$ 721 -803 899 -1010 1143 -1307 1511 -1774 2124 -2602 3271 -9652 87776 35497 25878 -20643
74b0643p4560J01524Q707M8656k3636j01152J4256K4554N1934K3513l0794l6541
$$ -20643 -95203 6321 15028 63684 40048 -61104 -46848 -22294 29640 53153 22359 -14182
86a4182o0185M8595N9746K4013k3995p5099o931Q576P1328M8445o9333l6502m3646
$$ -14182 -74367 -25772 33974 57987 33992 -41107 -48038 -39462 31866 80311 10978 -25524 -69170
99f9170M7196P6630j8148m64p2553k4760N6813K2138N0128n3505m8389J869j1387
$$ -69170 -21974 54656 36508 36044 -36509 -61269 -4456 17682 67810 14305 -34084 -32215 -43602
112d3602Q6728P318l0752k7977p0093O6873M5000R674J506r4311L178K6544L9919
$$ -43602 43126 50444 19692 -8285 -78378 -11505 33495 43169 44675 -49636 -46458 -19914 20005
125B0005N6040p1560l7460r170J2676P1514k000j9605m3034l4297M1169M1193
$$ 20005 76045 4485 -32975 -42145 -29469 42045 40045 20440 -22594 -56891 -15722 25471
137B5471K4648l2892m1214j9431P591P1006J3857k6986m5669l8834N4019L1617
$$ 25471 50119 17227 -23987 -43418 -35827 35179 49036 22050 -23619 -62453 -8434 23183
149B3183K2451j2239p5249L32J9392M9608L0859n7391j5951k8348J2997O9459
$$ 23183 45634 33395 -41854 -41522 -22130 27478 58337 946 -15005 -43353 -30356 39103
161C9103m175q324n0530l0908M9030J9629L3057j7896o2161p475J3151N6895K1251
$$ 39103 34928 26604 -23926 -54834 -5804 13825 46882 28986 -33175 -40650 -27499 29396 50647
174E0647l9449l0642k8820K7995M7568J5826k0987n3426j0159K3987L9455K2401
$$ 50647 11198 -19444 -48264 -20269 27299 43125 22138 -31288 -41447 -17460 21995 44396
186D4396k9574l3235k8024K4834N0102P753j2223m9151j9597K9792K9984L4332
$$ 44396 14822 -18413 -46437 -21603 28499 36252 24029 -25122 -44719 -14927 15057 49389
198D9389l0207m8255p141J1485N2642J4019k8228k9214l2256L1466M2425J0000
$$ 49389 19182 -29073 -36214 -24729 27913 41932 13704 -15510 -47766 -16300 26125 36125
210C6125j3335m9020j2396K3034L2855K8097k8122l9319j6585J7933M6065J3040
$$ 36125 22790 -26230 -38626 -15592 17263 45360 17238 -22081 -38666 -20733 25332 38372
222C8372j9873l8148k2561K5410L8372J9596k3625m0463j4673J9050M1156J5279
$$ 38372 18499 -19649 -42210 -16800 21572 41168 17543 -22920 -37593 -18543 22613 37892
234C7892k0045l7599k2177K7131L5018J6562j6529m3745j3358J9189L6246K2359
$$ 37892 17847 -19752 -41929 -14798 20220 36782 20253 -23492 -36850 -17661 18585 40944
246D0944k5206l6312j6151J7985M0622J4783j8579l8405j8335K3232L4286J9135
$$ 40944 15738 -20574 -36725 -18740 21882 36665 18086 -20319 -38654 -15422 18864 37999
258C7999j9848l9828j4175J8592L6920J8079k1537l5409j7199J8993L7423J6909
$$ 37999 18151 -21677 -35852 -17260 19660 37739 16202 -19207 -36406 -17413 20010 36919
270C6919k0306l6572j5298J8461L5608J8010k0263l6018j6563J9584L6414J5202
$$ 36919 16613 -19959 -35257 -16796 18812 36822 16559 -19459 -36022 -16438 19976 35178
282C5178j9402l3468j8185J8377L8006J4640j9855l3816j6586J9808L3575J5800
$$ 35178 15776 -17692 -35877 -17500 20506 35146 15291 -18525 -35111 -15303 18272 34072
294C4072j6539l6636j7211K1642L4011J3472j6850l3088j8308J9564L5082J4774
$$ 34072 17533 -19103 -36314 -14672 19339 32811 15961 -17127 -35435 -15871 19211 33985
306C3985j7768l5977j4182J9790L0931J6853j6634l5359j6980K0367L4574J2079
$$ 33985 16217 -19760 -33942 -14152 16779 33632 16998 -18361 -35341 -14974 19600 31679
318C1679j6450l1561j8300J9570L2261J6190j6456l7646j1882J9439K8882J6518
$$ 31679 15229 -16332 -34632 -15062 17199 33389 16933 -20713 -32595 -13156 15726 32244
330C2244j5680l4082j6820J9705L3436J2849j6778l1823j4541J5973L1425J8279
$$ 32244 16564 -17518 -34338 -14633 18803 31652 14874 -16949 -31490 -15517 15908 34187
342C4187j9321l3694j2841J7949L1023J2848j4137l1598j8853K0125L2874J2422
$$ 34187 14866 -18828 -31669 -13720 17303 30151 16014 -15584 -34437 -14312 18562 30984
354C0984j7213l0285j3685J4586L1548J6961j7810l2441j5009J9888K9672J0830
$$ 30984 13771 -16514 -30199 -15613 15935 32896 15086 -17355 -32364 -12476 17196 28026
366B8026j1570l1806j8408K0018L0971J4047j7796l1022j0918J3876K8978J7497
$$ 28026 16456 -15350 -33758 -13740 17231 31278 13482 -17540 -28458 -14582 14396 31893
378C1893j7322l2869j1983J7225K9730J1454j4431k7092j8524J6707L3347J1380
$$ 31893 14571 -18298 -30281 -13056 16674 28128 13697 -13395 -31919 -15212 18135 29515
390B9515j5848k9928j3024J6757K5985J7266j4304l4873j1512J8047K8020J2726
$$ 29515 13667 -16261 -29285 -12528 13457 30723 16419 -18454 -29966 -11919 16101 28827
402B8827j6232k6831j4941J4118L2281J2887j8727k6774j2335J4908K6618J3486
$$ 28827 12595 -14236 -29177 -15059 17222 30109 11382 -15392 -27727 -12819 13799 27285
414B7285j0765l2938j5047K0884K5037J3295j3552l0700j0243J0830L0683J7871
$$ 27285 16520 -16418 -31465 -10581 14456 27751 14199 -16501 -26744 -15914 14769 32640
426C2640k3693k4553j0658J1858L0809Q871j1231k7255j9225K2632K4842R751
$$ 32640 8947 -15606 -26264 -14406 16403 25274 14043 -13212 -32437 -9805 15037 24788
438B4788j0103l0052j0565J1427K6741J9459j9637k8456r444J3285K6515J3157
$$ 24788 14685 -15367 -25932 -14505 12236 31695 12058 -16398 -25842 -12557 13958 27115
450B7115j2813k8649j4659J6692K9551Q748j5540k1969j4677J3233K7022J2394
$$ 27115 14302 -14347 -29006 -12314 17237 25985 10445 -11524 -26201 -12968 14054 26448
462B6448j0994l2063r372J7441J8074J8813j4513k8087j0363P417L5132R989k0462
$$ 26448 15454 -16609 -25981 -8540 9534 28347 13834 -14253 -24616 -17199 17933 27922 7460
475G460j6238j9848J5475K9916O108o310l3400j1213K2305J4957J6453j1945k8404
$$ 7460 -8778 -28626 -13151 16765 22873 16563 -16837 -28050 -5745 9212 25665 13720 -14684
488a4684q595Q661K9039J2818j7410k1585j2707J0525K6473J4595j4314k6587
$$ -14684 -23279 -14618 14421 27239 9829 -11756 -24463 -13938 12535 27130 12816 -13771
500a3771j2762J4613K8154O693j0274k3578j8091K0209K2055J0544r619l1754
$$ -13771 -26533 -11920 16234 22927 12653 -10925 -29016 -8807 13248 23792 14173 -17581
512a7581k485Q897J8974K2342k1369k0377j0978O194L4515L198j0078j8703k2855
$$ -17581 -20066 -11169 7805 30147 8778 -11599 -22577 -16383 18132 21330 11252 -7451 -30306
525c0306K0279K2977J0553r047l2049m370J1711J9470J7913j7207k3443r854J0902
$$ -30306 -10027 12950 23503 14456 -17593 -21963 -10252 9218 27131 9924 -13519 -23373 -12471
538a2471K6476Q459j2680k0296j2476Q302K7197J2244j5310j9563j5115J2999
$$ -12471 14005 22464 9784 -10512 -22988 -14686 12511 24755 9445 -10118 -25233 -12234
550a2234K6581O005n612k7635j4375K0160J6677J5282j3781k6263l311L710K7724
$$ -12234 14347 20352 14740 -12895 -27270 -7110 9567 24849 11068 -15195 -18506 -14796 12928
563A2928J2848j9677j4017j6817J3372K6177K722j944k7065j4608J8383J6173
$$ 12928 25776 6099 -7918 -24735 -11363 14814 17536 15592 -11473 -26081 -7698 8475
575H475J6148j2543k6513n955P460K4525J3254j5604k0904j0450J1173K3000R832
$$ 8475 24623 12080 -14433 -20388 -12928 11597 24851 9247 -11657 -22107 -10934 12066 21898
588B1898j2264k0617j1254J0085K5031P791j0042j9772j5249J5632J8505J0976
$$ 21898 9634 -10983 -22237 -12152 12879 20670 10628 -9144 -24393 -8761 9744 20720
600B0720n911k9766n666J0602J7745J8722j8106j9833p747M817K9102O125j2070
$$ 20720 14809 -14957 -20623 -10021 7724 26446 8340 -11493 -19240 -14423 14679 20804 8734
613H734j6732j6433J5670J9853Q493o231k6011q019J1155J8521J4062j3011k0556
$$ 8734 -7998 -24431 -8761 11092 19585 13354 -12657 -20676 -9521 9000 23062 10051 -10505
626a0505j0015Q473K3324J0371j1495k0426j1268J0654K1959J0306j1709j9555
$$ -10505 -20520 -12047 11277 21648 10153 -10273 -21541 -10887 11072 21378 9669 -9886
638i886j1334J1081K1321Q267q140k2422j0038J2666J6681J3674j1081k2670o543
$$ -9886 -21220 -10139 11182 19449 11309 -11113 -21151 -8485 8196 21870 10789 -11881 -18424
651a8424N918K3543J1351j4962j5388j2937R193K4338O447q162k0823j2230J4023
$$ -18424 -12506 11037 22388 7426 -7962 -20899 -11706 12632 19079 10917 -9906 -22136 -8113
664h113J7811R922q377k2334q716R861J9440J1414j1631j9767q554P928K0667
$$ -8113 9698 19620 11243 -11091 -19807 -9946 9494 20908 9277 -10490 -19044 -11116 9551
677I551J1529j1404j9972r871J0034K0548R045r879j8758j1374J0056K1154R244
$$ 9551 21080 9676 -10296 -20167 -10133 10415 19460 9581 -9177 -20551 -10495 10659 19903
690A9903j0453j9744q637Q831J9187J1049j0370k0225q991R841J9654R249r865
$$ 19903 9450 -10294 -18931 -10100 9087 20136 9766 -10459 -19450 -9609 10045 19294 9429
703I429j8223j1000R197K0746R408j0174j9492r008J0339J7427J0718q879k0815
$$ 9429 -8794 -19794 -10597 10149 19557 9383 -10109 -19117 -8778 8649 19367 10488 -10327
716a0327q635R500J9224R506j0653j7375r988Q092K0504R203r480j9944q582J0782
$$ -10327 -18962 -9462 9762 19268 8615 -8760 -18748 -10656 9848 19051 9571 -10373 -18955 -8173
730h173J6317J0644q403k0143q849Q788K0014Q533j0764j6256r725P909J8896
$$ -8173 8144 18788 10385 -9758 -18607 -9819 10195 18728 7964 -8292 -18017 -10108 8788
743H788J0715j0319j9607p029Q616J7184J0117r307j7230j1292R485K0695O479
$$ 8788 19503 9184 -10423 -17452 -8836 8348 18465 9158 -8072 -19364 -9879 10816 17295
756A7295q863j6430r994Q540J7533J1397j0283j9640o332P954J7863Q174q131
$$ 17295 8432 -7998 -17992 -9452 8081 19478 9195 -10445 -16777 -8823 9040 17214 9083
769I083j6637j2178J1083J8978O651q165j7689q264P811J7572J0574j0387j7612
$$ 9083 -7554 -19732 -8649 10329 16980 8815 -8874 -17138 -9327 8245 18819 8432 -9180
782i180q444R208J7754O711o161j7698j1258J1098J6643Q713q794j7833p286P119
$$ -9180 -17624 -8416 9338 16049 9888 -7810 -19068 -7970 8673 17386 8592 -9241 -16527 -9408
796i408J7863R023q683j7114j0239J1183J6132P326o143j8862q194Q431J6573
$$ -9408 8455 17478 8795 -8319 -18558 -7375 8757 16083 9940 -8922 -17116 -8685 7888
809G888J0444j0768j6141p675P042J7814P974p129j7799r834J0986J5275Q390
$$ 7888 18332 7564 -8577 -16252 -9210 8604 16578 9449 -8350 -18184 -7198 8077 16467
822A6467p819j7013p869O716J8105R221j0560j5372q292Q229J5941Q168o532j8029
$$ 16467 8648 -8365 -16234 -9518 8587 17808 7248 -8124 -16416 -8187 7754 15922 9390 -8639
836h639q536R287J6232P937q564j4994q988P051J7984P690q179j6968p569R184
$$ -8639 -17175 -7888 8344 16281 7717 -7277 -16265 -9214 8770 16460 8281 -8687 -16256 -7072
850g072J3730R815p584j7906o636O805J7760P419r567j3211r904P416J7371P689
$$ -7072 6658 16473 8889 -9017 -15653 -8848 8912 16331 6764 -6447 -16351 -8935 8436 16125
864A6125p631j7363p347R070J3927R047p155j6961p446P627J6313P682q545j4726
$$ 16125 8494 -8869 -16216 -7146 6781 15828 8673 -8288 -15734 -8107 8206 15888 7343 -7383
878g383q055O835J6399Q283q476j5528p572P918J5670O588o062j5887r356R405
$$ -7383 -15438 -8603 7796 16079 7603 -7925 -15497 -7579 8091 14679 8617 -7270 -16626 -7221
892g221J4686P545o442j6879o311O864J3820J0357q926j5434o705O377J6077O799
$$ -7221 7465 15010 8568 -8311 -14622 -7758 6062 16419 7493 -7941 -14646 -8269 7808 14607
906A4607o811j4252j0111Q908J5500O830o362j6172p194Q010J2889R987p562j6798
$$ 14607 7796 -6456 -16567 -7659 7841 14671 8309 -7863 -15057 -7047 5842 15829 8267 -8531
920h531n430O439J4387Q377q715j2836q151N535J7217O353p519j3429r126Q726
$$ -8531 -13961 -7522 6865 15242 6527 -6309 -14460 -8925 8292 14645 7126 -6303 -15429 -6703
934f703J3588P053m715j7200p041Q236J2837R155p604j5427n587M947J5754Q088
$$ -6703 6885 13938 9223 -7977 -15018 -6782 6055 15210 7606 -7821 -13408 -8461 7293 15381
948A5381r062j2837p501O006J5854N704n968j3880r350R364J3312O497m790j6417
$$ 15381 6319 -6518 -14019 -8013 7841 13545 7577 -6303 -15653 -6289 7023 13520 8730 -7687
962g687o504P313J2067J0662q949j4283n617M088J6470O853q291j1457r572P550
$$ -7687 -14191 -6878 5189 15851 6902 -7381 -12998 -8910 7560 14413 6122 -5335 -14907 -7357
976g357J5595M386m823j4402p925Q561J1831Q010n799j5486n744N432J3383R343
$$ -7357 8238 12624 7801 -6601 -14526 -5965 5866 13876 8077 -7409 -13153 -7721 5662 15005
990A5005q338j2955o964M778J5802O560p510j1745r399P626J4845M573m310j4435
$$ 15005 6667 -6288 -13252 -8474 7328 13888 6378 -5367 -14766 -7140 7705 12278 7968 -6467
1004f467q049R151J1104P509n191j5766m419M798J2552R421q697j1349p421M350
$$ -6467 -14516 -5365 5739 13248 8057 -7709 -12128 -7330 5222 14643 5946 -5403 -12824 -8474
1018h474J6264N151n772j2334r618Q536J2794N943m614j5252o127P768J0994Q115
$$ -8474 7790 12941 7169 -5165 -14783 -6247 6547 12490 7876 -7376 -13503 -5735 5259 13374
1032A3374o500j3962m971M719J3479P421p553j1281p377M351J4824O257n860j2258
$$ 13374 6874 -7088 -12059 -7340 6139 13560 6007 -5274 -12651 -8300 6524 12781 6921 -5337
1046e337q926P790J2692N926l737j5519o164P578J1002Q511p526j3193m101L203
$$ -5337 -14263 -6473 6219 12145 8408 -7111 -13275 -5697 5305 13816 6290 -6903 -11004 -7801
1060g801J3908P273p909j0313p955N338J3999N068m048j2754r031Q203J1817O734
$$ -7801 6107 13380 5471 -4842 -12797 -7459 6540 11608 7560 -5194 -14225 -6022 5795 12529
1074A2529n086j4300n208N604J1517Q682p332j3016m945M795J2961O071o451j0582
$$ 12529 7443 -6857 -12065 -6461 5056 13738 6406 -6610 -11555 -6760 6201 12272 5821 -4761
1088d761p657N358J3572M950m566j2170p413O286J1194P727n033j4000n505N595
$$ -4761 -12418 -7060 6512 11462 6896 -5274 -12687 -6401 4793 12520 7487 -6513 -12018 -6423
1102f423J1986P311o847j1274o741M522J4158N609o669j0657p017N884J1711N564
$$ -6423 5563 12874 6027 -5247 -11988 -7466 6692 12301 5632 -5025 -12042 -6158 5553 11117
1116A1117m035j2924o670O959J0321P374n203j3055n298M298J2610P501p499j0960
$$ 11117 7082 -5842 -12512 -5553 4768 12142 6939 -6116 -11414 -7116 5494 12995 5496 -5464
1130e464o068M763J2519N923n265j1705p044O431J1532N827n084j1469o339M994
$$ -5464 -11532 -6769 5750 11673 6408 -5297 -12341 -5910 5622 11449 6365 -5104 -11443 -6449
1144f449J1391P303o337j1563n486M668J1464O747n551j1329o342N173J2087N823
$$ -6449 4942 12245 5908 -5655 -11141 -6473 4991 11738 6187 -5142 -11484 -6311 5776 11599
1158A1599n940j0618o819N554J1757N944m933j2829m633N293R910P595n704j1482
$$ 11599 5659 -4959 -11778 -6224 5533 11477 6544 -6285 -10918 -5625 4285 11880 6176 -5306
1172e306n607M382J2302N842o026r922p135M930J1696O299m964j2558m888N309
$$ -5306 -10913 -6531 5771 11613 5587 -4335 -11470 -6540 5156 11455 6491 -6067 -10955 -5646
1186e646J0667O235n278j0902o273M890J1704N581m950j1063n567M531J0615P291
$$ -5646 5021 11256 5978 -4924 -11197 -6307 5397 10978 6028 -5035 -10602 -6071 4544 11835
1200A1835n946j1155n476M686J1557N002m454j0545o884N798J0443O038m855j1694
$$ 11835 5889 -5266 -10742 -6056 5501 10503 6049 -4496 -11380 -5582 4861 10899 6044 -5650
1214e650m468M190J0158P044n658j0444n866M710J1420M789l998j0914o336N459
$$ -5650 -10118 -5928 4230 11274 5616 -4828 -10694 -5984 5436 10225 6227 -4687 -11023 -5564
1228e564J0094O995o025j0639m923L867J1165N744n105j0100o844N790J0672N071
$$ -5564 4530 11525 5500 -5139 -10062 -6195 4970 10714 5609 -4491 -11335 -5545 5127 10198
1242A0198m170j1089n185M386J0425O482n653r680o367M610J0953N273l872j1184
$$ 10198 6028 -5061 -10246 -5860 4565 11047 5394 -4286 -10653 -6043 4910 10183 6311 -4873
1256d873n887N356R844O321n314j0555m697L506J1369N369m945r900o564N631
$$ -4873 -10760 -5404 4440 10761 5447 -5108 -9805 -6299 5070 10439 5494 -4406 -10970 -5339
1270e339R898N208l513j1348m846M488R978O181n527r582n719M298J0615N225
$$ -5339 4559 9767 6254 -5094 -9940 -5452 4526 10707 5180 -4402 -10121 -5823 4792 10017
1284A0017m215j0472n839N310R194O316m942r890n296L652J0878N225m243r749
$$ 10017 5802 -4670 -10509 -5199 3995 10311 5369 -4521 -9817 -6165 4713 9938 5695 -4054
1298d054o498N722R121N771m050j1250m460M199R415O609n407r048n880L893J1102
$$ -4054 -10552 -4830 4291 10062 6012 -5238 -9698 -5499 3916 10525 5118 -3930 -9810 -5917 5185
1313E185M419l993r598o051N033R035N905m069j0693m700L805J0091N755m824
$$ 5185 9604 5611 -3987 -10038 -5005 4030 9935 5866 -4827 -9527 -5722 4369 10124 5300
1327E300r584n561M573R799N240m526r795m598L723R793N125m362r028o075M652
$$ 5300 -4284 -9845 -5272 4527 9767 5241 -4554 -9152 -5429 4364 9489 5127 -3901 -9976 -5324
1342e324R870M640l229j0236n719N019Q794O166m929r807m213L158J0459N095
$$ -5324 4546 9186 5957 -4279 -9998 -4979 3815 9981 5052 -4755 -8968 -5810 4649 9744
1356I744n138q233o191M613R640M440l058r962n241M465Q768N531l881r529n165
$$ 9744 4606 -3627 -9818 -5205 4435 8875 5817 -4145 -9386 -4921 3847 9378 5497 -4032 -9197
1371i197L650R573N519m068j0119m779L883R922N230m732q845n210L839R941L907
$$ -9197 -5547 4026 9545 5477 -4642 -9421 -5538 4384 9614 4882 -3963 -9173 -5334 4607 8514
1386H514l204r040o006N029Q309N073k914j0037m847L879Q551O808n310q817n172
$$ 8514 5310 -3730 -9736 -4707 3602 8675 5761 -4276 -9123 -5244 3307 10115 4805 -4012 -9184
1401i184L282J0612M438m497q315n883M901R049M052l661q885m892M243Q137N573
$$ -9184 -5902 4710 9148 4651 -3664 -9547 -4646 4403 8455 4794 -4091 -8983 -4740 3397 8970
1416H970l526r443m709L063R304N704m547q248n281K677J0480M924m642q149o240
$$ 8970 5444 -3999 -8708 -5645 3659 9363 4816 -3432 -8713 -6036 4444 9368 4726 -3423 -9663
1431i663M758R387L824l080r570m761N091P264N477l792q871l839K165R120N819
$$ -9663 -4905 4482 8306 5226 -4344 -9105 -4014 3250 8727 4935 -3936 -7775 -5610 3510 9329
1446I329m785p640n597K701J0268M300l320q682o220N253Q631M123k879r911m066
$$ 9329 4544 -3096 -8693 -5992 4276 8576 5256 -3426 -9646 -4393 4238 8361 5482 -4429 -8495
1461h495M012P696N689m607q258l587K239Q974N181m675o895n890K870J0138L714
$$ -8495 -4483 3213 8902 4295 -3963 -7550 -5311 3663 8844 4169 -2726 -8616 -5746 4392 8106
1476H106k554q633o416N073Q133M817l098j0110l615L956P594N696m624p963m050
$$ 8106 5552 -3081 -9497 -4424 3709 8526 5428 -4682 -8297 -4341 3253 8949 4325 -3638 -7688
1491g688K389Q973M570m035o562o258L546Q676L972k011q965n710M589P595N401
$$ -7688 -5299 3674 8244 4209 -2353 -8611 -5065 3611 7583 5572 -3393 -9103 -4514 3081 8482
1506H482l378r386l886L515Q279N410n365p359l915K434R075M081l809p067n641
$$ 8482 5104 -4282 -8168 -4653 3626 9036 3671 -3688 -7603 -5169 3906 7987 4178 -2889 -8530
1521h530L991Q188L384j345r227n150M303P266N577l183r422l367K508Q189N658
$$ -8530 -4539 3649 7033 5688 -3539 -8689 -4386 2880 8457 5274 -4148 -7515 -5007 3182 8840
1536H840m828p445m422L106R136L075l107p134n341L778P479M285k323q744m431
$$ 8840 4012 -3433 -7855 -4749 4387 7462 4355 -2779 -8120 -4342 3137 7422 5099 -3645 -8076
1551h076L323P615N343l357q673m168L194Q215N091m488p393m747L388Q643L458
$$ -8076 -4753 2862 8205 4848 -3825 -7993 -4799 3416 8507 4019 -3374 -8121 -4733 3910 7368
1566G368l144p249n234M017P506L828j950q575m316L280P265N338l621p393m475
$$ 7368 4224 -3025 -8259 -4242 3264 7092 5142 -3433 -7749 -4469 2796 8134 4513 -2880 -7355
1581g355K158Q508M822l790p245n273L494Q310L850k947p650m798L759P274M139
$$ -7355 -5197 3311 8133 4343 -2902 -8175 -4681 3629 7479 4532 -3118 -7916 -4157 3117 7256
1596G256k534p954m340L296O954N246l331p648m377K695Q016M539l502p067n184
$$ 7256 4722 -3232 -7572 -4276 2678 7924 4593 -3055 -7432 -4737 3279 7818 4316 -2751 -7935
1611g935L187Q646L418k766p751m774M049O559M674l037p733l577K554P491M525
$$ -7935 -4748 3898 7316 4550 -3201 -7975 -3926 2633 7307 4270 -3463 -7040 -4486 3005 7530
1626G530l565o952m463K663P948M114k911p205m797L249P447M454l354p262m447
$$ 7530 3965 -2987 -7450 -4787 3161 7275 4364 -2841 -7638 -4389 3058 7512 4158 -3104 -7551
1641g551L231P385M237k918p241m490L132P074M537l302o993m046K322P658M369
$$ -7551 -4320 3065 7302 4384 -2857 -7347 -4215 2859 7396 4094 -2899 -6945 -4623 3035 7404
1656G404l430o625m939L491P145M037k339q151l824K904P083M731l440p106l756
$$ 7404 3974 -2651 -7590 -4099 3046 7083 4744 -3407 -7231 -4327 2756 7487 4047 -3059 -6815
1671f815K348P485M083l035o485m855L139O873M284k621p418l972K577P160M341
$$ -6815 -4467 3018 7101 4066 -2419 -7274 -4135 2738 7022 4401 -3017 -6989 -4412 2748 7089
1686G089k929o887m269K777P298M017k603p367m124K858O431M941l124p121l942
$$ 7089 4160 -2727 -6996 -4219 3079 7096 4493 -2874 -6998 -4140 2291 7232 4108 -3013 -6955
1701f955K500P458L738k629o708m543L314O441M110k055p427l952K384P100M276
$$ -6955 -4455 3003 6741 4112 -2596 -7139 -3825 2616 6726 4671 -2756 -6708 -4324 2776 7052
1716G052k998o583m415K846P071L522k050p163m278K947O647M333k768o841l949
$$ 7052 4054 -2529 -6944 -4098 2973 6495 4445 -2718 -6996 -4049 2598 6931 4163 -2678 -6627
1731f627K267O986M090k550o422m553K781O716M142k700o791l977K439P095L978
$$ -6627 -4360 2626 6716 4166 -2256 -6809 -4028 2688 6830 4130 -2661 -6638 -4199 2896 6874
1746F874k878o416m508K833O970L701k172p132l964K809O127M481k663o708l550
$$ 6874 3996 -2420 -6928 -4095 2875 6576 4404 -2728 -6692 -3883 2244 6725 4062 -2646 -6196
1761f196J995O897M062k657o338m552L023O468L775k324o823l904K436O582M159
$$ -6196 -4201 2696 6758 4101 -2237 -6789 -3766 2702 6477 4153 -2670 -6574 -4138 2444 6603
1776F603k608o443m147K268O905L831k302o776l772K688O061M451l055o176l887
$$ 6603 3995 -2448 -6595 -4327 2578 6409 4107 -2669 -6441 -3753 2308 6759 3704 -2472 -6359
1791f359K081O928L515k072o573m309L101O015M012j965p081l693K361O242M742
$$ -6359 -4278 2650 6165 4093 -2480 -6789 -3688 2327 6339 4374 -2707 -6400 -4039 2203 6945
1806F945l265n957m100K247O814L489k381o230l993K564N971M151k193o556l668
$$ 6945 3680 -2277 -6377 -4130 2684 6173 3792 -2438 -6431 -3867 2104 6255 4062 -2494 -6162
1821f162K455N773M240k015o745l741K266O275M391l026o397l430K055O736L530
$$ -6162 -3707 2066 6306 4291 -2454 -6195 -3929 2346 6737 3711 -2686 -6116 -4061 2675 6205
1836F205k445n835m422K867O408L188k012o575l682K892N177M539k419o347k922
$$ 6205 3760 -2075 -6497 -3630 2778 5966 3954 -2621 -6303 -3411 1766 6305 3886 -2461 -5383
1851e383J304O294M046k775n511m236K162O671L229j888o274m152K816N956L634
$$ -5383 -4079 2215 6261 3486 -2025 -6261 -4099 2572 5801 3913 -2361 -6513 -3697 2259 5893
1866E893j827o770l394K754N294M569k930n886l121J550O035L960k836n149m400
$$ 5893 4066 -2704 -6098 -3344 1950 6519 3589 -2297 -5418 -3868 2167 6127 3291 -1858 -6258
1881f258J941O842L201j675o370m341L336N763L584j908o946k735K119N190M314
$$ -6258 -4317 2525 5726 4051 -2319 -6660 -3324 2439 6023 4115 -2831 -5566 -3447 1743 6057
1896F057k703n845k868J235O574L242j896n497m465K131O337L130j152o285m494
$$ 6057 3354 -2491 -5359 -4124 2450 5692 3796 -1701 -6166 -4035 2302 5432 4280 -2005 -6499
1911f499K789N871M067k501o654k616J938N671L967k809n253l289J296O183L407
$$ -6499 -3710 2161 6228 3727 -2927 -5543 -3605 2066 6033 3224 -2029 -5318 -4022 2161 5568
1926E568k278m959m412K625N589L195j156o128l982K495N096M543k245o552k969
$$ 5568 3290 -1669 -6081 -3456 2133 5328 4172 -1956 -5938 -3443 1653 6196 3951 -2601 -5570
1941e570J878N652M353l215m834l756J677O236K755j790m892m639K855N377L238
$$ -5570 -3692 1960 6313 3098 -1736 -5492 -3815 2421 5176 3386 -1506 -6145 -3290 2087 5325
1956E325q72o719l415K140M910M894k432o270k982J820N824M115l150n174l649
$$ 5325 4453 -2266 -5681 -3541 1369 6263 3831 -2439 -5421 -3601 2223 6338 3188 -1986 -5635
1971e635J925O377K302j317n413l976K708M646L246q64o059l476K306M857M585
$$ -5635 -3710 2667 4969 3652 -1761 -5737 -3029 1617 4863 3999 -2060 -5536 -3230 1627 6212
1986F212k593n742k909J162O025L607k725m770m083K332O027K433j180n514m053
$$ 6212 3619 -2123 -5032 -3870 2155 5762 3037 -1733 -5816 -3484 2543 4976 3796 -1718 -5771
2001e771K844M307L910j663n730l080J813N018M161k240n328l427J205O346L058
$$ -5771 -2927 1380 5290 3627 -2103 -5183 -3370 1648 5809 3569 -1759 -5186 -3981 2365 5423
2016E423k255m936l736K140N423K732j200n745l297K691M121L824j578n897k544
$$ 5423 3168 -1768 -5504 -3364 2059 4791 3591 -2154 -5451 -2760 1361 5185 3607 -2290 -4834
2031d834J209N038M345k610m874l720J539N998L190j747n120m008K483M917L190
$$ -4834 -3625 1413 5758 3148 -1726 -5446 -3907 2091 5281 3534 -1586 -5594 -3111 1806 4996
2046D996j534n631l075K076M987L385j939n044l070J258N535L602k618m733l496
$$ 4996 3462 -2169 -5244 -3168 1819 5204 3265 -1779 -4849 -3591 1944 5546 2928 -1805 -5301
2061e301J418N836K912j534m974l965K448M930L155j316n551l028J634M859M089
$$ -5301 -3883 1953 4865 3331 -1643 -5608 -3160 1770 4925 3609 -1942 -4970 -3336 1523 5612
2076E612k430m914l202J318N653L179k246m584l594J871N006L382j520n262l423
$$ 5612 3182 -1732 -4934 -3616 2037 5216 2970 -1614 -5208 -3337 1669 5051 3531 -1731 -5154
2091e154K011M871L368j691n331k968J828M685L534j859m706l235J199N290L309
$$ -5154 -3143 1728 5096 3405 -1926 -4894 -3066 1619 5153 3294 -1412 -4647 -3448 1842 5151
2106E151j864m830l589J849N195L057j480n127l388J930M562L825k152m974k876
$$ 5151 3287 -1543 -5132 -3283 1912 4969 3489 -1638 -5026 -3096 1466 5291 3139 -1835 -4711
2121d711J383M997L372j718n136l127J471N400K973j694m981l070J429N006L323
$$ -4711 -3328 1669 5041 3323 -1813 -4940 -3469 1931 4904 3210 -1771 -4841 -3412 1594 4917
2136D917j826m725l173J691M668K956j165n096l103J698M837L024j553m743l259
$$ 4917 3091 -1634 -4807 -3116 1552 4508 3343 -1753 -4856 -3158 1679 4703 3150 -1593 -4852
2151d852J755M898L167k008m312l402J731M502L235j331m946l096J528M594L406
$$ -4852 -3097 1801 4968 2960 -1352 -4754 -3023 1479 4714 3383 -1563 -4659 -3131 1463 4869
2166D869j717m909l034J346N293K759j541m704l258J746M559L173j212n035l056
$$ 4869 3152 -1757 -4791 -3445 1848 4607 3066 -1638 -4896 -3150 1409 4582 3370 -1665 -4721
2181d721J755M470L119j437m753l283J637M858L014j451m865l170J596N000L118
$$ -4721 -2966 1504 4623 3186 -1567 -4850 -3213 1645 4659 3208 -1657 -4827 -3231 1769 4887
2196D887j909m412l198J275M926K951j373m661l242J809M364L320j514m887k828
$$ 4887 2978 -1434 -4632 -3357 1569 4520 3147 -1514 -4756 -2947 1417 4737 3223 -1664 -4492
2211d492J270M668L290j871m350l190J812M480K772j323m565l095J677M320L340
$$ -4492 -3222 1446 4736 2865 -1485 -4675 -2863 1617 4389 3066 -1499 -4594 -2917 1403 4743
2226D743j602m809k910J482M657L051j393m796k930J261M677L202j892m248k925
$$ 4743 3141 -1668 -4578 -3096 1561 4612 3219 -1577 -4507 -3246 1431 4633 2741 -1507 -4432
2241d432J195M737K922j392m305l265J802L937L184j182m671k820J130M646L281
$$ -4432 -3237 1500 4422 3030 -1275 -4540 -2738 1199 4383 3201 -1470 -4290 -3160 1486 4767
2256D767j669m604k933J324M646K864j531m201l248J843M170L131j730m416l040
$$ 4767 3098 -1506 -4439 -3115 1531 4395 2864 -1337 -4585 -2742 1428 4559 2829 -1587 -4627
2271d627J828M126L358j506m590k833J394M303K945j347m632k742J059M648L048
$$ -4627 -2799 1327 4685 3179 -1411 -4244 -2850 1453 4398 3051 -1581 -4323 -3264 1384 4432
2286D432j800l984l073J727M285K316p58m501l037J477M298K858j097m633k820
$$ 4432 2632 -1352 -4425 -2698 1587 3903 3145 -1356 -4393 -2916 1382 4240 3143 -1490 -4310
2301d310J521L989L097j457m069l188J230M835K734j667l899l116J368M217L013
$$ -4310 -2789 1200 4297 2840 -1229 -4417 -3187 1648 4382 2715 -1184 -4300 -2932 1285 4298
2316D298j119m552l267J783M197K826j117m539k446J114M025L277j692m261k703
$$ 4298 3179 -1373 -4640 -2857 1340 4166 3049 -1490 -3936 -2822 1203 4480 2788 -1473 -4176
2331d176J065M526K678j410l717l421J549M111K991j166m717k696J738L893K974
$$ -4176 -3111 1415 4093 2683 -1034 -4455 -2906 1205 4196 3030 -1687 -4383 -2645 1248 4222
2346D222j336m656k118R30M282L376k075l727l154J379M674K237j206m065l252
$$ 4222 2886 -1770 -3888 -2958 1324 4700 2625 -1102 -4256 -2877 1797 4034 2828 -1237 -4489
2361d489J746L957K614r95m567k379J616L232L309j163m377k288M47M657K912
$$ -4489 -2743 1214 3828 2833 -1734 -4113 -2497 735 4044 2881 -1496 -3784 -3337 1320 4232
2376D232j975l452k953J207M467K581j104m121l305K088L434K592p53m530k162
$$ 4232 2257 -1195 -4148 -2941 1526 4107 3003 -1118 -4423 -2335 1099 3691 2938 -1592 -3754
2391c754J233L741K990j628l819k567P75M491K448j426l396l416J484M018K305
$$ -3754 -2521 1220 4210 2582 -1237 -3804 -3029 1462 3910 2484 -912 -4328 -2844 1174 3479
2406C479m27m174l253J882L401L286j256m361k292J015L733L358k020l557k472
$$ 3479 3052 -1122 -4375 -2493 908 4194 2938 -1423 -3715 -2700 1033 4391 2371 -1186 -3658
2421c658N63M617K157j142l460l361J766L918K251o05m448k540J339L739K804
$$ -3658 -3095 1522 3679 2537 -923 -4284 -2518 1400 3651 3046 -1402 -3942 -2603 1136 3940
2436C940j056m622j801P14M056L127j731l486k846P58M443K074p77l764l183J692
$$ 3940 2884 -1738 -3539 -2825 1231 4358 2627 -859 -3705 -2947 1496 3570 2793 -971 -4154 -2462
2452b462L666K491q37m099k712J634L327K953j285m223k049N80M146L188j860
$$ -2462 1204 3695 2858 -1241 -3953 -2319 1008 3961 2676 -1547 -3596 -3016 1130 4318 2458
2467B458l460k695J041M002K148r04l481l091J711L058K566l17m305k573J194
$$ 2458 -1002 -3697 -2656 1346 3494 2590 -891 -3982 -2271 787 3353 3036 -1269 -3842 -2648
2482b648L508L309j666l770k334P81M071K608j452l385l023J044M164K413r66
$$ -2648 860 4169 2503 -1267 -3601 -2820 1251 3859 2407 -978 -4001 -2957 1207 3620 2654
2497B654l573l284J745L391K572q87l923k122Q14L384L160j412l569k271N80M058
$$ 2654 -919 -4203 -2458 933 3505 2618 -1305 -3427 -2613 771 3931 2519 -1050 -3321 -2741 1317
2513A317K649j490l460l041J345L824K397q11l913k585J378L133L101j149l770
$$ 1317 3966 2476 -984 -4025 -2680 1144 3541 2730 -1183 -3768 -2390 743 3844 2695 -1075
2528a075k144O52L352L311j418l561k637O77M002K342r49l565k759J403L557K371
$$ -1075 -3219 -2567 785 4096 2678 -883 -3520 -2843 1159 3501 2552 -1013 -3772 -2369 1188 3559
2544C559q59l826k525J173L367K639j147l410k396O23L851K615j302l329k451
$$ 3559 2700 -1126 -3651 -2478 889 3528 2381 -1029 -3425 -2802 1049 3664 2362 -967 -3418
2559c418N93L833K321o88l553k799J248L254K562l76l913k591J135L394K736j450
$$ -3418 -2825 1008 3329 2641 -912 -3711 -2463 791 3353 2977 -936 -3527 -2392 1002 3738 2288
2575B288l530k094P07L472K565j007l326k774J237L552K369r80l503k600J024
$$ 2288 -1242 -3336 -2629 843 3408 2401 -925 -3699 -2462 1090 3459 2479 -1024 -3624 -2600
2590b600L527K465p75l607k357Q88L435K537j063l600k131P42L323K572r56l334
$$ -2600 927 3392 2617 -990 -3347 -2459 976 3513 2450 -1150 -3281 -2539 784 3356 2400 -934
2606i34k441Q68L369K396n32l557k729J051L331K554o90l548k521R73L481K271
$$ -934 -3375 -2507 862 3258 2726 -831 -3560 -2509 822 3376 2686 -862 -3383 -2410 1071 3342
2622C342r12l082k799R96L409K480j044l289k622J117L637K167j023l351k376
$$ 3342 2430 -652 -3451 -2455 954 3434 2390 -899 -3521 -2404 1233 3400 2377 -974 -3350
2637c350O56L689K122o39l268k508P76L613K380r90l340k464R10L334K347p97
$$ -3350 -2694 995 3117 2478 -790 -3298 -2522 1091 3471 2481 -859 -3323 -2413 921 3268 2471
2653B471l207k550Q33L407K349q97l025k675O81L632K603j097l402k339O75L425
$$ 2471 -736 -3286 -2453 954 3303 2406 -619 -3294 -2613 1019 3622 2525 -877 -3216 -2541 884
2669H84K019p36l091k311Q37L285K421r37l241k555J023L353K382p73l397k402
$$ 884 2903 2167 -924 -3235 -2398 887 3308 2371 -870 -3425 -2402 951 3333 2560 -837 -3239
2685c239J013L108K538j233l220k216J018L111K303p10l076k538N95L450K105
$$ -3239 -2226 882 3420 2187 -1033 -3249 -2231 880 3183 2473 -603 -3141 -2546 904 3009
2700C009o28l239k234P11L157K453p80l162k505P09L325K589j109l120k136O40
$$ 3009 2381 -858 -3092 -2381 776 3229 2449 -713 -3218 -2509 816 3405 2296 -824 -2960 -2320
2716b320L259J940n11l065k840J188L454K091o87l422k119O90K979K676r73l223
$$ -2320 939 2879 2368 -697 -3537 -2349 1105 3196 2509 -913 -3032 -2342 637 3313 2340 -883
2732h83k114O24L069K555r43k885k437O46K967K173m79k863k639R45L045K091
$$ -883 -2997 -2373 696 3251 2308 -577 -3014 -2368 599 2772 2293 -570 -3209 -2264 781 2872
2748B872n11l167k077Q61K820K461q90l071k319P27L172K277j052k762k447P36
$$ 2872 2361 -806 -2883 -2022 798 3259 2369 -702 -3021 -2294 878 3155 2103 -659 -3106 -2370
2764b370L270K097n77l149k502J069K767K344o85k816k486J072K474K423m01l184
$$ -2370 900 2997 2420 -729 -3231 -2162 605 2949 2264 -552 -3038 -1966 508 2931 2530 -654
2780f54k363L63L158K502q69k773k541Q77L139K239q25k953k275R44K830J886
$$ -654 -3017 -2654 504 3006 2137 -636 -3177 -2300 839 3078 2253 -700 -2975 -2031 799 2685
2796B685n55k759k312P14K924K421q12k943k206K53L335K364j058k586k372O18
$$ 2685 2130 -629 -2941 -2227 697 3118 2306 -637 -2843 -2590 745 3109 2051 -535 -2907 -2289
2812b289L192K049n98l066k167R45K500K468n62l349j807L48K875K380r41k611
$$ -2289 903 2952 2354 -712 -2879 -1934 566 3034 2472 -877 -2684 -2336 539 2919 1978 -633
2828f33k331N51L485J679p59k499k686J111K988J891m71l144k131R01K674K106
$$ -633 -2964 -2413 1072 2751 1992 -507 -3193 -2082 906 2797 2326 -818 -2949 -2048 626 2732
2844B732o51k847j744L97K708K306r98k544k133K38L358J988n62k479k770Q27
$$ 2732 2081 -766 -2510 -2113 595 2901 1903 -641 -2774 -2536 822 2810 2248 -231 -3001 -2174
2860b174K894J968j64l362j961O90K685K621j050k969j817J91L203K212j062k467
$$ -2174 720 2688 2524 -838 -2799 -2109 576 3197 2147 -822 -2639 -2448 755 2967 1905 -562
2876e62k217N68L046J527j78k770k065N88K739J926l74l111j780L64K671K795
$$ -562 -2779 -2211 835 2362 2184 -586 -2651 -2063 676 2602 2228 -883 -2663 -2299 372 3167
2892C167j212k790j801M93K866J952j002k165k273P80K623J714j40k825k157R83
$$ 3167 1955 -835 -2636 -2143 723 2675 1673 -492 -2765 -1985 638 2352 2212 -613 -2770 -1787
2908a787K390K058m37l312j565L18K889K432r08k711k216O98L170J524p56k314
$$ -1787 603 2661 2224 -1088 -2653 -2335 554 2986 2078 -633 -2849 -2151 1019 2543 1787 -527
2924e27k196Q81K579J890m51l066j840R60K049K560m15l014j954L66K931K073
$$ -527 -2723 -1842 737 2627 2176 -890 -2730 -1770 279 2839 2424 -590 -2544 -2178 753 2826
2940B826q04k489k124K52L280J739q71k222k317R19K535J868l86k913k038J055
$$ 2826 2022 -467 -2591 -2339 941 2680 1809 -413 -2730 -1811 724 2592 2206 -707 -2745 -1690
2956a690K259K241p92k805j610J8K908K198o88k503k291N65K815J616k23k627
$$ -1690 569 2810 2018 -787 -2397 -2379 529 2727 2039 -464 -2755 -2190 625 2241 2018 -609
2972f09k143R29K454J962n63k777j768P22K393K178q01k681j726J91K887K090
$$ -609 -2752 -1823 631 2593 2030 -747 -2515 -1793 600 2778 1977 -704 -2430 -2239 648 2738
2988B738q35k358k244N62K857J844n04k609k167P43K619J785m14k796j539N86
$$ 2738 1903 -455 -2699 -2137 720 2564 2060 -549 -2716 -1973 646 2431 2017 -779 -2318 -1732
3004a732K074K394p28k546j806R3K981J912o83k249k372P32K766J585n17k423
$$ -1732 342 2736 2008 -538 -2344 -2251 730 2642 1959 -290 -2662 -1930 836 2421 1904 -519
3020e19k138R78K242K181p92k766j575K75K496K443q28k239k187N86K453K077
$$ -519 -2657 -1679 563 2744 1952 -814 -2389 -2114 382 2825 1997 -242 -2429 -1843 610 2687
3036B687p70k232k298N47K624J870l27k389k153O47K369J928p18k542j719N55
$$ 2687 1917 -315 -2613 -2066 558 2428 2101 -288 -2441 -1794 575 2503 1785 -757 -2476 -1921
3052a921K430K059q47k242j917P18K434J739o43k430j898P64K382J640j70k649
$$ -1921 509 2568 1721 -521 -2438 -1720 714 2453 1810 -620 -2518 -1754 628 2268 2098 -551
3068e51j746N46K279J727m93k316k137Q01K583J692n07k324k127M35K512K172
$$ -551 -2297 -1751 528 2255 1762 -554 -2691 -1890 693 2385 1878 -446 -2573 -2138 374 2546
3084B546n88k512j872K90K294K504l86k839k023J021J940K002n65k281k094P18
$$ 2546 1958 -554 -2426 -2136 158 2662 2276 -563 -2586 -1565 375 2377 1812 -469 -2563 -1845
3100a845K480J870n61k596j701M70K458J688m2k873j579M64K306J986q96k099
$$ -1845 635 2505 1944 -652 -2353 -1883 575 2263 2221 -652 -2231 -1767 539 2525 1629 -470
3116d70j899L83K264K242o60k198k048M12K213K040n20k123j878L06K429J797
$$ -470 -2369 -1986 278 2520 1860 -338 -2386 -1974 239 2279 1759 -364 -2242 -1936 493 2290
3132B290l37k340k131O83K129K104m74k453j745K97K479J903m50k380k001N22
$$ 2290 1953 -387 -2518 -1835 294 2398 1924 -529 -2274 -1977 502 2405 1955 -425 -2426 -1904
3148a904K500J842q49k087j944O07K229J764l70k202j938M70K218J918l40k450
$$ -1904 596 2438 1589 -498 -2442 -1835 394 2158 1788 -414 -2352 -1882 336 2254 1914 -536
3164e36j656N68K129J840n53k082j987L05K169K181n91k307j815M69K508J521
$$ -536 -2192 -1624 505 2345 1792 -290 -2277 -1972 197 2378 1787 -520 -2335 -1866 642 2163
3180B163l30k525j653O96J961J943o02k228j628K70K418J822m28k190j739L44
$$ 2163 1833 -692 -2345 -1649 312 2255 1653 -575 -2203 -1933 485 2307 1879 -311 -2050 -1706
3196a706K204J815n29k488j507L41K387J621o20k133j577M71J907K056m38k153
$$ -1706 498 2313 1784 -704 -2211 -1870 517 2138 1518 -615 -2192 -1721 186 2242 1804 -349
3212c49j728L71K148J877o23k405j481N98K038J648m04k154j823M41K007K097
$$ -349 -2077 -1706 442 2319 1696 -709 -2190 -1592 446 2094 1690 -464 -2287 -1846 161 2258
3228B258n50k057j939M22K089J922m70k074j840L18K473J771l89k179k134N32
$$ 2258 1708 -349 -2288 -1866 223 2145 1675 -399 -2239 -1921 552 2323 1934 -245 -2379 -1847
3244a847K257J717l94k308j537N81K045J582m35k274j758O16J872K024o88j809
$$ -1847 410 2127 1733 -575 -2112 -1531 514 2096 1661 -613 -2371 -1755 117 2141 1453 -356
3260c56j632K30K198J663j53k388j845M95J952J914l91k341j495N04J808K259
$$ -356 -1988 -1758 440 2103 1950 -438 -2283 -1788 164 2078 1687 -654 -2149 -1645 163 2422
3276B422j008j873j511J81K259J626m93j878j957N26K073J785m47k075j900Q69
$$ 2422 1414 -459 -1970 -1789 470 2096 1603 -275 -2232 -1706 367 2152 1705 -370 -2270 -1401
3292a401J734J836q4k568j437O9K242J880p05k093j463L35K154J504n31j677j897
$$ -1401 333 2169 2085 -483 -1920 -1851 391 2271 1566 -527 -1990 -1655 499 2003 1472 -205 -2102
3309b102M19K067J810r5k414j935O43J800J911n67j944j902P84J942J651j78k385
$$ -2102 -1683 384 2194 2099 -315 -2250 -1607 193 2104 1537 -407 -2309 -1525 417 2068 1890 -495
3326d95j531L4K363J634o53j824j579N59J855J519j44j917j874M34J808J906k65
$$ -495 -2026 -1992 371 2005 1352 -472 -2051 -1492 363 1882 1738 -179 -2053 -1619 189 2095 1830
3343A830k463j316J79K387J516o83j708j889M95K199J499m65j797j901M19K013
$$ 1830 -633 -1949 -1770 617 2133 1450 -258 -2147 -1652 547 2046 1581 -216 -2117 -1698 315
3359C15J688j02k319j298K97J649J923l79k227j600L73K040J560m01j811j660
$$ 315 2003 1901 -418 -1716 -1419 230 2153 1774 -453 -2053 -1680 360 1920 1519 -292 -1952
3375a952K99J949J573l47j964j643O68J723J563j24j902j496n4J862J900m99j865
$$ -1952 -1653 296 1869 1522 -442 -2085 -1417 306 1869 1745 -157 -1653 -1707 155 2055 1556 -309
3392c09j636L21K066J380m85j348j969K24K242J365j06k233j406L12J799J660
$$ -309 -1945 -1624 442 1822 1337 -11 -1980 -1756 486 1851 1745 -488 -1894 -1582 217 1877
3408A877n34j570j727L68J544K053n97j699j516%K192J482k97j824j884P16J753
$$ 1877 1343 -227 -1954 -1586 -42 2011 1414 -285 -1801 -1801 391 1873 1576 -248 -2132 -1416 337
3425C37J405K47k400j576L15J993J567l25k014j314L90J567J895o50j713j419
$$ 337 1742 1989 -411 -1987 -1672 321 1888 1563 -451 -1765 -1375 192 2087 1437 -276 -1695
3441a695k33K438J117r2j657j906P65J493J652r8k153j394L40J796J663o40j745
$$ -1695 -1928 510 1627 1535 -122 -2028 -1263 230 1882 1784 -369 -1763 -1423 373 2036 1396 -349
3458c49j393J45J874J349l08j562j444M5J978J519j41j941j532K77J801J722n24
$$ -349 -1742 -1597 277 1626 1318 -244 -1688 -1643 335 1854 1713 -228 -1760 -1483 318 2040 1516
3475A516j772j571M67J647J519m78j499j628K25J864J634m76j750j357J5J922
$$ 1516 -256 -1827 -1360 287 1806 1328 -171 -1799 -1574 290 1924 1448 -302 -1659 -1644 278
3491B78J300m3j870j605N07J873J454l07j763j618K69J826J626l45j978j361J79
$$ 278 1578 1535 -335 -1940 -1433 440 1894 1587 -176 -1794 -1525 301 1927 1582 -396 -1757 -1578
3508a578J970J629o57j511j606J17K062J384k30j664j570J88J746J583k69j912
$$ -1578 392 2021 1364 -147 -1753 -1636 426 1810 1580 -84 -1654 -1466 280 1863 1594 -318
3524c18j473M68J619J439l69j555j562M21J585J336p2j663j586M44J605J362j43
$$ -318 -1791 -1323 296 1735 1366 -189 -1751 -1330 255 1591 1519 -144 -1730 -1286 319 1681 1538
3541A538k006j458O00J593J349k25j732j151K8J698J284L32k235j497M18J913
$$ 1538 -468 -1926 -1326 267 1616 1391 -341 -1492 -1464 234 1518 1850 -385 -1882 -1464 449
3557D49J416k55j951j439K68J718J324j74j606j529M77J654J334l16j456j530
$$ 449 1865 1610 -341 -1780 -1512 206 1530 1356 -250 -1779 -1302 352 1686 1370 -86 -1616
3573a616J17J722J545l01j678j424L07J603J489l86j613j239k9J678J429j31j647
$$ -1616 -1499 223 1768 1467 -211 -1635 -1328 275 1764 1378 -235 -1474 -1503 175 1604 1473 -174
3590a74j548K07J896J361j67j853j149p3J877J134Q2j906j570M03J745J323j26
$$ -174 -1722 -1515 381 1742 1575 -278 -1427 -1500 377 1511 1593 -313 -1883 -1480 265 1588 1462
3607A462j653j572L44J496J625m83j348j461K48J492J586k43j848j366K59J681
$$ 1462 -191 -1763 -1419 77 1702 1219 -129 -1590 -1342 150 1736 1493 -355 -1721 -1462 219
3623B19J289j65j247j649J57J547J586l24j595j454M37J504J130K7j716j350L34
$$ 219 1508 1343 96 -1553 -1396 151 1737 1413 -182 -1636 -1199 305 1435 1462 -254 -1604 -1270
3640a270J617J277l78j655j194L77J510J221q8j602j385K19J693J330l20j760
$$ -1270 347 1624 1246 -409 -1603 -1226 284 1505 1417 -185 -1570 -1351 342 1672 1352 -408
3656d08j369M82J778J138k28j786j233K52J553J547m84j526j349J61J894J296
$$ -408 -1777 -1295 483 1621 1393 -393 -1626 -1374 179 1726 1242 -284 -1633 -1472 422 1718
3672A718k67j644j498M77J362J568l26j742j256L22J388J617n55j506j078o1J780
$$ 1718 1451 -193 -1691 -1214 148 1716 1390 -352 -1608 -1286 102 1719 1164 -342 -1420 -1481 299
3689B99J390k60j690j471K89J444J508j22j864r35j14J727J195N6j545j574J84
$$ 299 1689 1429 -261 -1732 -1443 1 1509 1387 -477 -1412 -1526 201 1396 1452 -93 -1667 -1483
3706a483J705J397m50j299j188J3J457J433k72j652j288L55J540J321k14j631
$$ -1483 222 1619 1169 -130 -1318 -1305 152 1585 1313 -339 -1627 -1272 268 1589 1375 -256
3722b56j403L46J597J263l98j354j439K84J806J027k15j455j397M45J191J448
$$ -256 -1659 -1313 284 1547 1149 -205 -1644 -1360 446 1473 1258 -197 -1594 -1149 42 1490
3738A490j87j460j373L70J454J073k67j282j336L69J165J440qj890j285M91J465
$$ 1490 1303 -157 -1530 -1160 294 1367 1100 -182 -1518 -1149 16 1456 1448 -442 -1727 -1236 229
3755B29J163l7j590j003j39J645J257l16j185j267N1J437R67K36j863j026O8J593
$$ 229 1392 1355 -235 -1238 -1377 268 1525 1209 24 -1243 -1192 245 1212 1448 -415 -1441 -1373 220
3773B20J292m71j280j133j87J789J495m18j678j240J9J853J256j1j813j131M09
$$ 220 1512 1041 -239 -1372 -1559 230 1725 1307 -371 -1611 -1592 261 1517 1506 -307 -1438 -1029
3790a029J207J314k42j434j237K31J346J274nj526j160M1J340J486l40j584j209
$$ -1029 178 1492 1250 -184 -1421 -1190 156 1430 1425 -101 -1261 -1220 120 1606 1266 -318 -1527
3807a527J21J757J066k96j299j411L76J497J169n1j830r91Q1J391J364k58j533
$$ -1527 -1406 351 1417 1121 -178 -1589 -1213 284 1453 1402 -428 -1419 -1338 53 1417 1159 -374
3824c74j104P5J768J112k43j231j635N32J390J055J98j782j074J13J414J159k84
$$ -374 -1478 -1403 365 1477 1234 3 -1632 -1100 290 1345 1543 -239 -1313 -1200 214 1373 1089
3841A089j159j415J97J585J265m91j260j157K40J208J236j99j484j174M08J558
$$ 1089 -70 -1485 -1288 297 1562 1071 -189 -1346 -1106 102 1338 1139 -345 -1519 -1111 447
3857D47Q44M8j805r35O8J399J317l16j410r03L9J436J211l86j237j198J94J516
$$ 447 1291 1339 -466 -1401 -1333 66 1383 1067 -343 -1246 -1207 229 1440 1054 -183 -1381 -1187 329
3875C29J033Nj586j071O5J372J191m5j384j268K25J207J256j54j401j090J21J637
$$ 329 1362 1367 -219 -1290 -1225 147 1338 1293 -91 -1359 -1134 73 1329 1175 -226 -1316 -1195 442
3893D42R60l70j120j258J75J592R58k13j318j243L38J274J141j79j472j059N4
$$ 442 1402 1032 -88 -1346 -1171 421 1379 1166 -152 -1395 -1057 217 1358 1179 -293 -1352 -1298
3910a298J306J150r3j178j203MJ624Q11j02j299j226O68J070J172k43j369j131
$$ -1298 8 1158 1065 -113 -1316 -1312 312 1123 1021 -278 -1504 -836 234 1406 1163 -206 -1337
3927a337L75R83J289j8j791o11Q3J335J042l01j435j055K28J616P55j64j277j007
$$ -1337 -962 21 1310 1292 -499 -1110 -1027 308 1350 1049 -386 -1441 -1213 403 1158 994 -283 -1290
3945a290J68J452R82l91j051j262N09Q64J430k13j416j006o8J474J376l61j354
$$ -1290 -1122 330 1312 921 -130 -1392 -883 -19 1411 1198 -218 -1224 -1292 182 1558 1197 -157
3962a57j364K34J595J076m76r90j290L08J263R71L05j760p92o0J127J294p3j359
$$ -157 -1521 -1287 308 1384 908 -82 -1372 -1064 199 1170 1475 -285 -1077 -1137 -10 1284 1211 -148
3980a48j056n2J480J166m89j010j270L53J238J080j23j319j390L67J109J218o0
$$ -148 -1204 -1256 224 1390 901 -109 -1379 -1026 212 1292 1169 -150 -1540 -1173 -64 1154 1094
3997A094j124j320M07J176Q73l6j230j013K47J326P90r6j029j280j23J405J073
$$ 1094 -30 -1350 -943 233 1106 1070 -160 -1173 -926 400 1190 1094 65 -1215 -1338 67 1140
4014A140p3j287j157L16J347J151m96j340q05K02J153J003j69j127r19P1J201
$$ 1140 1067 -220 -1377 -1061 286 1437 941 -399 -1204 -1002 151 1154 985 -142 -1061 -990 211
4031B11J183l25j158r39n1J146J410l45j246j135K48J348P21J6j318j167N35J122
$$ 211 1394 1069 -89 -1028 -1079 67 1477 1132 -114 -1249 -1001 347 1068 1084 -234 -1401 -866 256
4049B56Q66l13j011r41L02R27J156J09j491r52p4J358J127p8j645q97j22J478
$$ 256 1122 809 -202 -1143 -841 86 1242 1351 -140 -1092 -1166 192 1319 1241 -404 -1301 -1423 55
4067E5J385m35j185j205K59J291R76j93j254p19j50J388J064l39r41j178J52J050
$$ 55 1440 1005 -180 -1385 -1126 165 1141 948 -306 -1025 -1175 213 1277 938 -3 -1181 -1029 21
4085B1J156j81j051j118K96J125Q58j72j028r90J68J213P74r2j281p14r1J248
$$ 21 1177 996 -55 -1173 -877 248 1106 934 -94 -1084 -916 297 1071 979 -302 -1016 -1107 141
4103A41R21m8j141r39J13R88J245k69j108q60m9J141J402l97j186j174M49J000
$$ 141 1062 1014 -127 -1066 -953 35 1280 1011 -97 -957 -1006 135 1537 1140 -46 -1220 -771 229
4121B29J022k3j434q00L3J151R42M3j347q99J53J113Q43K0j044j044R7J038J309
$$ 229 1251 1228 -206 -1006 -973 178 1120 1163 -184 -1083 -930 183 1026 1046 2 -1042 -945 93 1402
4140A402m31j227j050M21J212P39k85r26j076L29R69R36k6j055j225K67R27Q50
$$ 1402 971 -256 -1306 -885 327 1066 781 -145 -1221 -892 77 1013 987 -68 -1293 -1026 -99 751
4158G51J53r82j073K36J147J043l71j058q42j88J105J110q9j069j081K39J160
$$ 751 904 -78 -1151 -915 232 1275 904 -154 -996 -1184 -79 1031 942 -127 -1208 -969 191
4175A91R49O5j514o93J36R55J044q7j278r56L57R66J274n73j012q08j0J204J045
$$ 191 1140 1205 -309 -1002 -866 89 1133 1046 -232 -1188 -831 135 1409 836 -176 -984 -994 210 1255
4194A255l08j380o02K68J084O20j64o92j021R3Q59R95m6j131q75K62R93Q15j08
$$ 1255 947 -433 -1035 -767 317 937 773 81 -940 -847 12 1007 961 -170 -1045 -783 210 1025 917
4213I17r70j122M33R66P98L5j305r33J37J107Q79K83j471o59l7J280J114n34j257
$$ 917 -53 -1175 -742 224 1022 1057 -248 -1181 -1044 63 942 1225 -246 -905 -942 338 1452 918 -339
4232c39q00L20J000Q73j42r75q98j01J068J185l49j052r49N05O46J096j69j145
$$ -339 -1139 -819 181 1054 912 -63 -961 -1062 6 1191 842 -210 -1159 -654 -8 1088 919 -226
4250b26p64J17R57J100l91r34p70J70J109M90q9o24j108K41Q72Q36j2j141q18
$$ -226 -990 -873 84 1184 793 -141 -911 -741 368 858 769 145 -963 -722 150 986 974 -167 -985
4269i85J15J046R83l68j070q82L14Q65J006r7j041j031K18J317Q42k59j246p04
$$ -985 -870 176 1159 791 -279 -1161 -847 18 1024 927 -114 -1145 -927 390 1232 973 -273 -977
4287i77L40N91J200l01j023p51P0R42J266l85j111q34J14J150O97j44j073q61
$$ -977 -637 -46 1154 853 -170 -921 -851 91 1357 972 -139 -973 -859 291 988 844 -229 -1090
4305a090L88R53M98O8j027q82L33Q72R62p3j069r14k5Q43J149j93j037o75j70
$$ -1090 -702 251 749 817 -210 -1092 -759 113 1075 1002 -67 -981 -1006 -163 986 793 -244 -919 -1089
4324a089J462P22j84j036j007L13J360L36M0j260p62J39J126Q50J84j438o91K74
$$ -1089 373 1095 911 -125 -1132 -819 541 877 917 -343 -1105 -966 160 1010 1194 -244 -935 -661
4342f61O20J000l23o33q57J8R04R21m92m40j158M86P47R09l6j121q93J52R34J147
$$ -661 -41 959 636 3 -854 -836 68 989 497 57 -1101 -615 132 1041 1005 -116 -1009 -857 77 1224
4362A224l71r61r45o0J294J036m08j152p00J21J043Q37p4q64j293O59J083N33
$$ 1224 853 -108 -1053 -1113 181 1217 809 -343 -1043 -922 121 958 884 20 -1273 -614 469 1002
4380A002P3j322o03J2P39J271l98q24p94j55J231P69l24r24p79K25P24P73M09
$$ 1002 1075 -247 -850 -838 -99 1172 774 -50 -844 -999 232 1001 677 -247 -1026 -801 -77 696 1105
4399A105j077j051N9R46R60Rj210o61P8Q93J088l18q91p23k66J341Q07j99r35
$$ 1105 28 -1023 -964 -18 942 951 -259 -920 -842 51 1139 821 -70 -793 -1059 282 1089 890 -45
4418d5p99J31R93P45j99r24o57Q5P27R77j20r94q92L32Q86N54j01q81o37L5J093
$$ -45 -844 -713 280 1025 826 -98 -755 -670 57 1034 914 -80 -972 -640 246 800 699 -182 -819 -784 309
4439C09P87m88q64r58N08O61J012k6j127q20N27O82Q61j71j170n00J36N46J045
$$ 309 1096 608 -256 -1214 -706 -45 967 941 -186 -1006 -479 203 1064 893 -277 -777 -641 -95 950
4458I50j50r58q78J83J038N40j00p73q15L69P30N78P3r72p62K82P75O86J14r28
$$ 950 800 -158 -1036 -853 185 725 625 -148 -963 -594 136 714 787 -185 -947 -665 110 796 910 -18
4478a8q40P1R82O89j38j048m76rR74P22k37j102n81K16J260M16q3r50p06J20O54
$$ -18 -858 -787 195 884 746 -302 -778 -787 187 909 672 -430 -1011 -795 465 881 798 -152 -858 -738 -84
4499h4R93k39r87n12k8J085N93Rj199m71J65P36J081l03r94n91p2R71R38k22r61
$$ -84 909 670 -317 -829 -857 228 821 830 -369 -840 -675 61 1142 839 -155 -746 -818 153 1091 869 -92
4520i2p94J39R57O78j53p56q80N1Q44R71j52j092l54m9R20P00j69r51q75L91J054
$$ -92 -886 -747 210 888 735 -21 -901 -850 -6 965 813 -279 -633 -682 238 938 769 -182 -1057 -666 388
4541C88M96j06j085o80L90Q03P11M5j376m52J01R13N72j0q55n80o4J006P23j38
$$ 388 884 778 -307 -987 -597 206 917 962 -414 -866 -765 148 720 710 -145 -725 -789 217 940 802
4561H02p41j010J33R40N29j4q04j032O44P43P01k03p27q42K49Q12M88J13r80n70
$$ 802 61 -949 -816 124 653 639 -165 -1197 -553 190 891 688 -39 -881 -632 180 668 781 -199 -769
4581g69J57N34J064j65r39m54k03R08O99l86q07l50k36J194O85j69j042p07J32
$$ -769 -612 -78 986 821 -118 -572 -775 133 832 446 -361 -711 -947 247 932 763 -279 -986 -854
4600h54R80P60l65p30n85J61Q41P07j95o71r51j2Q08Q39q0o98n94k46R55N76l0
$$ -854 126 886 521 -209 -794 -633 208 915 720 49 -902 -914 -106 733 653 -45 -639 -885 70 646 616
4621F16o32p34j40J003R35n35o32p88L97N79O34l0p25p03rQ53R01m99l14q92J64
$$ 616 -16 -750 -890 113 1048 513 -119 -907 -510 69 703 673 -52 -755 -764 89 990 491 177 -715 -551
4642e51P96O35L9q81p52N0R46M43p0n48q67J62P51O78O7j178m04k01O75Q15J26
$$ -551 245 880 919 38 -714 -664 282 725 655 107 -760 -598 153 831 898 -280 -684 -885 -210 605 731
4663G31q06o72J15M62Q23K22j030n30K73O57N80k1r84o38M91M03O95k83n60o44
$$ 731 -75 -747 -632 -170 653 875 -155 -685 -412 245 825 804 -180 -818 -327 76 771 488 -72 -716
4683g16RP87N89P9q27n21r9R77M21k82m88o86K1Q65Q11k05j140l44N8R14O41k13
$$ -716 -707 80 669 748 -79 -600 -699 278 699 417 -71 -757 -736 129 940 735 -405 -749 -691 223 864 651
4705F51q93m55JR24O20k68p67p93L09Q59M42N4p57r22N79L81P33j28o94m80MO44
$$ 651 -242 -697 -696 228 848 580 -187 -980 -671 188 630 684 -73 -995 -416 -35 698 570 -124 -604 -600 44
4727D4O35j59m53p21j5R34N00k78m65o14p1Q70P41l60p15m45K03O01P20q9j015
$$ 44 679 520 67 -654 -669 265 765 487 22 -592 -663 207 948 588 -127 -572 -369 232 952 863 -152
4748a52l41j70O51R67o00o10l69j28O74P82j54q45o26L15O62J078m69p77p19L78
$$ -152 -493 -663 -12 955 355 -255 -624 -752 -78 704 550 -295 -921 -606 56 1134 665 -112 -831 -453
4768d53K09J115l57p28n26N4Q88P28l89m13r63L01O75N05K12j145l24J00O22O96
$$ -453 -244 871 514 -214 -740 -686 202 930 541 128 -835 -534 141 646 858 -287 -611 -511 111 807
4788H07k67o47q50M09J056L05l28p69k57k22P41P49j58p18o09L54O35L25j49o54
$$ 807 540 -107 -957 -548 508 813 485 -284 -541 -763 -22 727 569 -149 -758 -404 231 556 407 -247
4808b47n17K63N75N08L80j183o10M3P01Q71k03p48j95k75O43Q53j85p64p74K39
$$ -247 -764 -501 74 582 962 -221 -831 -788 -87 784 581 -167 -362 -637 6 859 674 -90 -864 -625
4828f25R67K58k5o31q52L67N48P65k93p59m67OO33R27k15n65q61j1J010Q76m30
$$ -625 342 600 575 -56 -908 -541 7 772 479 -280 -747 -741 -108 819 604 39 -822 -833 177 1053 623
4849F23o22o77J54O19O31r4q82k52j45P92P06n45m32p42J60R63M96l90o72j95
$$ 623 1 -676 -522 97 728 634 -248 -500 -645 147 853 308 -124 -866 -706 257 753 363 -309 -504
4869e04J51L12O88M2q33m41k2Q30N62m8p32o85j24Q68Q13n81m26o13J44Q80M01
$$ -504 -353 -41 647 689 -144 -585 -607 223 785 737 5 -680 -804 64 877 296 -130 -743 -599 281 682
4890F82m09k29o84j70Q99O80k18p20m60m7Q61N33p2r33j29q9O86M37q6q69k17
$$ 682 273 44 -640 -810 89 769 551 -169 -629 -676 185 718 646 -287 -416 -505 181 618 532 -337 -554
4911e54K00K48N44J22o59n47L5N44O55j11p68n76J96O03Q30l34p70k77O9M28P52
$$ -554 -354 -106 438 560 -99 -646 -611 -67 588 477 -291 -867 -671 -68 762 428 -342 -619 -550 -122 630
4932F30j38o33m67O1O70M21P7q64l27q5O93N20N7q60m36R7P71N82k44n60p95L12
$$ 630 492 -141 -608 -547 123 544 621 -243 -570 -655 38 558 615 -245 -681 -584 187 769 525 -35 -830 -518
4954e18M59R87l24r57l56J83O08O09j54o27p89L10O24M55k55k12p42K65M40N44
$$ -518 -59 928 604 -353 -709 -526 82 691 537 -90 -879 -569 55 510 255 43 -699 -434 6 550
4974E50q8o04o65M01N73K57J54n65o07J29O28O68o6j188j12N6M08O62O5p67q03
$$ 550 462 -142 -807 -406 167 424 578 13 -594 -465 163 831 765 -423 -535 -479 -71 591 656 -111 -914
4995i14L77L09P37j6m48o95J66O75L90j7q37k29M7O49K41l3m33n29k5P28L01j89
$$ -914 -537 -228 509 493 45 -650 -484 191 581 564 -273 -502 -455 194 435 402 -31 -560 -585 143 444 255
5017B55l29o12L38N16M42j83o36k89P9M02N64j6p11p12N31J51Q29k3q59l91J04
$$ 255 -74 -686 -348 168 610 427 -209 -498 -419 -17 547 531 -180 -892 -361 -210 619 596 -263 -654 -550
5038e50O47L08ol36q00M2P41O95l53n82n26L31N73M58J09j052m18M59N77L23j58
$$ -550 97 405 399 63 -737 -695 46 741 388 -194 -720 -389 184 642 751 -301 -719 -260 317 640 482
5059D82m14p08K45N70J96J36o02l92P4O25L61k7m93p52J41O84N92Q2j188j50K81
$$ 482 68 -640 -395 175 371 507 -95 -487 -413 212 573 546 53 -699 -558 126 718 800 -388 -538 -257
5080b57L88M12P0q71j89J59N10M27k72n65k42l32Q56N43j70n45l85P8L24N98j09
$$ -257 131 543 613 -258 -447 -288 222 649 377 -188 -430 -762 94 637 467 -78 -463 -385 -61 537 428
5101D28n14o20J46N82L20L36q75o34L42M98N87j55o04n41L02N79O51m64m97m50
$$ 428 -86 -706 -560 22 342 678 -197 -831 -489 9 596 441 -163 -704 -402 177 828 364 -133 -583
5121e83J33O19K14Q6o33o76L47N71L87j44m91k58o3L63P10k36n09n16M91K99M61
$$ -583 -450 169 383 469 -164 -840 -493 78 465 321 -170 -428 -491 -128 582 346 -163 -679 -188 111 572
5142E72j98m95n47J73N17O55k05o76m18K71M65M66j99m94n17N8Q48L40k29m26
$$ 572 374 -121 -668 -495 22 677 472 -204 -622 -351 114 580 381 -113 -630 -572 276 616 387 -39
5162c9m89M4N09O29k5q57l49L0N87M78j5o56l60RM79N76j30p42j24J18L81O09
$$ -39 -528 -484 25 654 629 -228 -577 -547 40 518 503 -153 -513 -504 -25 551 421 -321 -445 -327 54 663
5184F63j66m11o59K13N04L50o8o37j13N4M69M75j76p99j92J64M98M53q7o82l60
$$ 663 497 86 -573 -360 144 494 426 -211 -324 -270 199 674 498 -301 -493 -329 169 622 535 -147 -507
5205e07J12N47K77J44n55m27j25P68M47k51n24n48R4O21L95r6k40l18r0L48L45
$$ -507 -395 152 429 573 18 -409 -534 234 681 430 -94 -642 -548 73 468 372 132 -186 -276 72 417
5226D17k63l08k58J00M65M23k7p23k46n0N52M36n3n09o06L63N49J88j54m29l79
$$ 417 154 -154 -412 -312 153 576 549 -174 -420 -470 82 518 465 -44 -650 -287 262 450 296 -133 -512
5247e12O6O94r4N26q60p40P48L40K79j97l34m12K22L41N02k17l94n20PN54O84
$$ -512 -446 248 154 680 -180 -920 -172 168 447 250 -84 -496 -274 67 569 352 -42 -562 -555 -1 683
5268F83k04p00l75K80L48L50mn38j73o5O28rn3k72m95J52L50M15K14r08P5j12
$$ 683 479 -221 -596 -316 32 382 378 -160 -333 -398 230 221 168 -104 -599 -447 -97 318 532 -376 -301 -413
5290d13K68R36m93n97k68K54M04O01j91o35l25L52N61M0J01m29l70k89N74L25
$$ -413 -145 791 298 -299 -567 -313 91 692 501 -134 -459 -107 454 494 595 166 -204 -493 81 406
5310D06J35p89j12n9M59M48k23l7q60K55N07L63k03k23l82j52O82J24K12m72p07
$$ 406 541 -248 -360 -419 40 488 265 228 -632 -377 130 493 290 67 -315 -467 215 339 551 79 -628
5331f28J84N13N30j57o06l65J99M08M18j55n50k76r4O47N01k24l71n51J12N21
$$ -628 -444 69 599 442 -164 -529 -330 78 496 341 -209 -485 -579 68 569 345 -26 -577 -465 56
5351E6N46K9o96o27O21K60M86j78n84k67k59O12L80J71p68k38J34K53N96l80k35
$$ 56 602 631 -65 -692 -71 189 675 497 -87 -354 -613 -1 379 550 -218 -456 -322 -69 527 147 -88
5372h8l14K1O65J60Q7n41m31J80L40L34j55l52j70QK82N04j97l62n24L24N42J99
$$ -88 -402 -381 284 444 531 -10 -441 -261 79 413 258 -94 -264 -256 26 530 333 -29 -553 -229 313 512
5394E12J69r10l41K55M13M20j71l81k93p4N47M91k06q52j24p5O53L29k80k81j89
$$ 512 681 -229 -570 -315 98 518 347 -34 -327 -401 146 637 431 -421 -545 -620 33 362 82 -199 -388
5415c88j02O65L39n5k82o68M32M25R1k32m21l48R7P10k6K94q26k56K97K93K65
$$ -388 -490 175 514 459 177 -491 -59 366 457 225 -196 -544 -447 263 237 531 -295 -551 -254 39 304
5436C04m8j04n37k58P45N32k08m67n30M14R5O70l26l95j16j96O67L00j40m49n21
$$ 304 256 152 -385 -643 102 634 426 -41 -571 -157 -62 608 282 -113 -229 -425 242 542 402 -47 -568
5457e68L69N29J00j8m66n15M03K93M17j15o96j63J44L42K68K01o94k55K8O21K43
$$ -568 -199 330 430 412 -54 -569 -166 127 544 429 -267 -430 -286 56 324 525 -169 -424 -396 225 468
5478D68k20l48m74J98M56L23k19k66l88k0O28K50k8n49j60L0K84L61J71o34l91
$$ 468 248 -100 -574 -376 80 403 184 -82 -470 -490 138 388 360 -189 -349 -319 -35 326 497 -137 -528
5499e28N1N98J76K1m93j26l9L95N77m57l96l49K18K87L69J37n37k34J1M33K21
$$ -528 -477 121 297 318 -175 -301 -340 55 632 175 -221 -570 -352 -65 304 441 -96 -330 -319 114 335
5520C35l9j31n75K42L04L02p6n14o50L81M75N59l11n80k65L22J54M60q8m97k26
$$ 335 296 165 -410 -168 136 438 362 -152 -802 -421 54 613 302 -278 -543 -221 -67 393 305 -192 -418
5541d18K11O21J16k93l85j85O3K28N88l57j62k28o7M87O1M7l57k86p8L24N65q8
$$ -418 -207 414 530 237 -148 -333 -270 -42 546 189 27 -201 -268 219 280 327 -30 -316 -394 -70 495 407
5563D07p51j40L21J96N05j32n55j7j26M48J90r0k58j70j07K76M60j19m28m70K15
$$ 407 -344 -484 -163 33 538 406 -149 -166 -292 156 346 256 -2 -172 -279 -3 457 338 -90 -560 -345
5584c45M30K00K9l99m26K10K22N75j25o24j69K73JP54k39k43p04L12K80M13k24
$$ -345 85 285 314 -85 -511 -301 -79 496 371 -253 -422 -149 -148 606 367 124 -580 -268 12 425 201
5605B01k72k66J77M41J32r3m59k46J28L24K52J84o78l31K36N11K87k4q15j13P7
$$ 201 -71 -337 -160 281 413 320 -139 -385 -257 67 319 503 -175 -506 -270 241 528 504 -311 -424 -347
5626c47L82L33k82k01l78K15J72N61m5p29k95Q9O72L01J20n33m37k9N20L98n2
$$ -347 35 368 86 -115 -493 -278 -106 455 410 -319 -614 -525 147 448 568 35 -402 -431 89 487 435
5647D35j90o50L6N45K39j77k95m73J14L98N57k67n66P6J27J41L70j10n25L3L6
$$ 435 245 -405 -369 176 415 238 -57 -530 -416 -18 539 272 -294 -218 -91 50 420 310 -215 -182 -146
5668a46K73L59j60m09k36j44O42J23m0n80n9l1N82K34p1o15r2j62O79J12k0o6
$$ -146 127 486 326 -83 -319 -463 179 302 262 -318 -377 -408 174 408 337 -278 -370 -532 147 259 239 173
5690A73n76L87j42L12L08n41l51J29L20M62J70o17l43k2M07L59j41m08o5j43N07
$$ 173 -403 -16 -158 154 462 -79 -430 -301 19 481 651 34 -309 -331 76 435 294 -114 -179 -322 185
5711A85L51k20k71m05L52J39L1O2m07r6l9N18L38k78n14r2K49J69K93Pn46k33
$$ 185 536 316 45 -360 -8 131 162 224 -183 -279 -318 200 538 260 -254 -346 -97 72 365 372 -174 -407
5733d07J79K58K22q4m98J2R4L56Q5m4k86k17J0M66L15m20r2l78k23Q60M3j1m00
$$ -407 -228 30 252 168 -330 -318 -224 132 217 173 -113 -330 -320 146 461 41 -51 -429 -652 208 251 240 -160
5756a60p5j52N96K09j03n18l28J76K72O20j50n80M6q7L45J35q0l56kJ06K58N18
$$ -160 -235 -387 209 418 315 -203 -531 -355 -83 537 387 -193 -147 -234 111 246 166 -190 -192 -86 172 690
5778F90n96k6l61j04M47K41L12o88k70J35L68L10j25k11m88M19Q6L20L7m64o46
$$ 690 94 68 -293 -397 50 291 603 -85 -355 -220 148 458 333 122 -366 53 139 459 496 32 -614
5799f14L95M64J82l28j98k93L03K6M74j96m16j75n1P02r5J33l39k74k4L52M80
$$ -614 -219 245 427 99 -99 -392 -89 -63 411 215 -201 -376 -427 275 180 313 -26 -300 -324 28 508
5820E08l07k24l88L41K84M5J03m61m34K95K70J41rn35k3K72K16L98k86j86m42
$$ 508 201 -23 -411 -70 214 259 362 -99 -533 -238 32 173 164 -371 -394 -122 94 492 206 20 -422
5841d22L7O21R8J20l82n86J46L24M98l1n52j96LO57Q0j77m20j59l9M37n7J14j59
$$ -422 -385 236 334 454 72 -514 -368 -44 454 423 -129 -325 -322 335 415 238 -182 -341 -380 57 0 114 -45
5864d5k05o3N21L1K82p41l7J47J86J31K16m13l18J12K53K62m7m62j76J43K55N11
$$ -45 -250 -313 208 239 521 -220 -257 -110 76 207 423 10 -308 -196 57 319 272 -190 -366 -223 32 543
5886E43l88j24k61j4L23K25k1k48j99J5L51J54j33k67m33K04M88K75k74m00j42
$$ 543 155 31 -230 -244 79 304 283 35 -164 -149 202 356 223 -44 -477 -273 215 490 216 -184 -326
5907c26mM35K77l6m10k40P7K82K30rj69p11K40L76K56K0j98l28n2K08L93K6m18
$$ -326 -330 105 382 346 -64 -304 -227 55 285 276 107 -604 -364 12 268 288 90 -238 -290 -82 311 337 -81
5930h1k81j30P54oJ08l68k65K4J87N26k41m15l19N25R9K00k43k98k43J30N54K34
$$ -81 -362 -492 262 256 364 -4 -269 -245 -58 468 227 -188 -507 18 117 317 74 -224 -467 -337 217 451
5952D51k09k40k50p9L74P3l2j16m48J73L85K31O4k95m53J34L07K46k2k47m94K49
$$ 451 242 2 -248 -327 47 120 88 -28 -476 -303 82 313 377 82 -371 -237 70 316 294 47 -447 -198
5974a98N13N7m13k9m16M2N54M09k86l95O2J75J39J44J05o76j84K37L58K54k0o34
$$ -198 315 372 -41 -70 -486 -444 110 519 233 -162 -100 75 214 358 463 -213 -397 -160 198 452 432 -202
5996b02k83L00K69L51k32l80lK25K01K28k50n23N2L2K26J30p9l55j74J47N48N1
$$ -202 -485 -185 84 435 203 -177 -180 45 246 474 224 -299 -247 -215 11 141 62 -293 -467 -320 228 279
6018B79o4j54m63Q8L64N01k62m29m45K15N75J44k11j55l33J06K78K12R2k54o35
$$ 279 215 61 -402 -314 50 551 289 -140 -585 -370 205 349 138 -17 -350 -244 34 246 338 84 -551
6039e51L64J80J92J02k27n90K56K33M72m06j34l72J10M31L4L2j32m45K55L69L25
$$ -551 -187 -7 185 287 60 -530 -274 -41 431 25 -109 -481 -371 60 94 126 -6 -451 -196 173 498
6060D98l71j13l89P9K19L36lj86m34kL97L51j69k14l11K8O85j45J57k57m60k82
$$ 498 127 14 -375 -296 -77 259 256 70 -364 -366 31 382 213 -1 -312 -284 401 256 413 156 -304 -586
6082e86P30K63no32m8K16K49J77j69o68J23J88L90j3P3l79j08Q5m8N24l75l6j0
$$ -586 144 407 402 -230 -278 -62 187 364 195 -473 -350 -162 228 215 288 -91 -199 -114 -162 362 -13 -49 -59
6105e9m8K26J61k45j17p2J88J01R3J7l10k27J60RN83k47k75l20J12L08M54k28
$$ -59 -107 119 280 35 -82 -154 34 135 228 245 -65 -292 -132 -123 460 213 -62 -382 -270 38 492 264
6127B64m44k8K56OJ62k2k05k29J11J61L26m05o3q0lK87J85o1k36k94L50J36q6
$$ 264 -180 -208 48 54 216 194 -11 -240 -129 32 358 -47 -110 -190 -193 94 279 218 -18 -312 38 174 88
6150H8J04k16m15L78L5K57J88k46l05KL62J01p4j44m86J57N12m1R3m60r9k01M34
$$ 88 192 -24 -439 -61 -26 231 419 173 -132 -130 232 333 259 115 -371 -214 298 257 350 -110 -209 -410 24
6173B4L08r4Mm74rL61J07Kj50m29J22L55L21k03m5o41L20K46q1r5J68l54j8L34
$$ 24 332 238 242 -232 -241 120 227 229 79 -350 -228 127 448 245 200 -441 -121 125 44 -51 117 -237 -255 79
6197G9M33k54m15P0k66M19J89k01j89k88K56k5O13l02l20P0j1L51J4l7k74MpK16
$$ 79 512 258 -157 -87 -353 66 255 54 -135 -423 -167 -192 421 119 -201 -131 -142 209 223 186 -88 -84 -91 125
6221A25L18l24k08q3r8J86K75R8l46m68M14M02k23Q6k99Qk51L36J84J62n01l6
$$ 125 443 119 -89 -172 -270 -84 191 289 -57 -525 -111 291 68 154 -145 -137 -388 -52 132 294 -207 -243
6243b43J59L89L7k38k38p3j19M40J81k51j27m28L00K37K10J83l42l56K57P8M09
$$ -243 -84 305 342 104 -134 -207 -326 114 295 44 -83 -511 -211 26 236 419 77 -279 -22 56 465
6264D65k82j11j62R7K15n6j53K9l34J55K90J38k69k17J11j11M29J48k59l64q0
$$ 465 183 72 -90 7 222 166 13 42 -292 -137 153 291 22 -195 -84 -195 234 382 123 -241 -321
6285c21J80J33K75l22J0k20J50K34J8N4k26l5j2L57m6m1k61l80L65L88Oj99j44
$$ -321 -141 -8 267 -55 -45 -265 -115 119 137 191 -35 -70 -82 275 229 188 -73 -453 -88 300 306 107 -37
6308c7Pj30M83o6l8k41j76l58N70J52p5k69Q6l55N37K53k14l17k16M9N36K55k62
$$ -37 -30 -160 323 257 219 -22 -198 -556 14 166 91 -178 -92 -447 90 343 129 -188 -404 -355 181 436 174
6331A74j83j67K20J29J17j39k11j3p7J91J09k7J1n09J94J60K47k51n9k58J59L35
$$ 174 -9 -176 44 173 290 151 -60 -73 -150 41 150 123 134 -375 -181 -21 226 -25 -84 -342 -183 152
6353A52K17k98j43l87K62J79O20l57k52l4k40M54J01m2j76j86k9J31K27O3k16
$$ 152 369 71 -72 -459 -197 -18 602 245 -7 -41 -281 173 274 232 56 -130 -159 -28 199 262 46
6374D6l38J05J0N71l36j60m20N39q0J60L2r2m14K4N73L5n6k26l80L33R0K14n0
$$ 46 -292 -187 -177 394 58 -102 -522 17 -63 97 129 37 -377 -353 220 255 199 -27 -407 -74 16 230 180
6397A80l30lJ7K41J20j45j52j10k50N55N2j18N0m24K85L34k18M75o63j28J46M25
$$ 180 -150 -153 -136 105 225 80 -72 -182 -432 123 175 57 107 -317 -32 302 84 559 -104 -232 -86 339
6419C39Kj16m17j23K65J45J69o5l22j37m2L80P2K47k62n99J54K96L44ok77j19
$$ 339 341 225 -192 -315 -50 95 264 199 -123 -260 -302 78 150 397 135 -464 -310 -14 330 324 47 -72
6441g2J35K17j6n3k07k16j73K82K66J20k41l94K30M8K75R2n14J60j7K27On8l55
$$ -72 63 280 264 211 4 -212 -385 -103 163 283 42 -352 -122 -74 201 293 -221 -61 -78 149 155 97 -258
6464b58R3k02M58M1l8j28k08M7M3N88l31j54R1j62L31Q2n4l71j54L14lM39j71
$$ -258 -165 -367 91 132 94 -34 -242 -195 -152 436 105 -49 42 -120 211 293 239 -132 -286 28 25 464 293
6487B93l25l40L27P5L32j79j42l75K99O7K80k89j91n6j93O64j16J47k79nn7K63
$$ 293 -32 -372 -45 30 362 183 41 -334 -35 32 312 23 -168 -224 -417 247 131 278 -1 -6 -63 200
6509B00n3R6k98K0j21K05K34q4k63j42NK25J91K9l41j81N9L17j7K3m43J02P8Q9
$$ 200 147 243 -55 -35 -156 49 283 199 -64 -206 -201 24 215 244 -97 -278 -219 98 81 104 -339 -237 -159 -70
6533g0K80j40r7k74L11P7PJ58l64OM4J03J28J03j47k07l76M89L99l29l79j29K51
$$ -70 210 70 -27 -301 10 87 94 252 -112 -106 -62 41 169 272 125 -82 -458 31 430 101 -278 -407 -156
6556a56L00L4P4m10mJ09O2K75l19l2k00J84q6L35j48j67j44N9L43j6J32k47k30
$$ -156 144 178 252 -158 -162 -53 9 284 -35 -67 -267 -83 -169 166 18 -149 -293 -234 109 93 225 -22 -252
6579b52O4J86J63j90P9j67M7J31J21K2l89K9J80O3K48l05k9j46o0K91o5J07j73
$$ -252 -188 -2 161 -29 50 -117 -70 61 182 204 -185 -156 24 87 335 30 1 -145 -205 86 21 128 -45
6602d5O8k65J72L75k21j86k98L12J44L5j7r5m03M4N20J56j43l38j5j64M90o3K68
$$ -45 23 -242 -70 305 84 -102 -400 -88 56 91 74 -21 -424 -380 140 296 153 -185 -200 -364 126 63 331
6625C31m23j47n7L72J72l2j81j76l6L11J65k35Qj95q8M78P1k02k77q1K38J25M44
$$ 331 -92 -239 -296 76 248 216 35 -141 -177 134 299 64 72 -123 -211 267 338 136 -141 -222 16 141 585
6648E85n18j52k02K92J3M3R8k03l59J97L25R4j21q2l32P8K88q0L8k58K1J96Q6
$$ 585 67 -85 -287 5 18 61 159 -44 -403 -206 119 213 92 10 -322 -244 44 -36 2 -256 -235 -39 47
6671D7J81m7k85j8p2M00J1j19M5l21J65l1K68j79j93j43K64J67L4j09j5p3j04
$$ 47 228 181 -104 -122 -194 206 217 98 143 -178 -13 -44 224 45 -148 -291 -27 140 174 65 50 -23 -127
6694a27K14J07m3j27l11N6M91l01m4rj26n9M50J34q5m01j51Q3J66K32P0l74m6
$$ -127 87 194 151 24 -287 -231 260 -41 -85 -94 -220 -279 171 305 220 -181 -332 -249 -83 149 219 -155 -201
6717b01M3oM03l5l16j22K35M6P4j05j71j26K76k6L58k81k56j49J96J31P6Pk90
$$ -201 -158 -164 239 204 -112 -234 1 47 121 16 -155 -281 -5 -31 327 46 -210 -359 -163 -32 44 51 -239
6740b39M7J13K41j98l3L3j25l0M64q2J06k00l02O9J03K80l37K46l40J05K24M4
$$ -239 -192 -79 162 -36 -69 -36 -161 -191 273 191 297 97 -205 -136 -33 247 -90 156 -184 -79 145 189
6762A89N0l28j33J00L04j68J99k28k85L1K80J26J06k82j37n8L03L36k15j32l61
$$ 189 239 -89 -222 -122 182 14 213 -15 -300 -269 11 137 243 -39 -176 -234 69 405 190 58 -303
6783c03N3M50k33J51j82r1j74L61K60l2m85N3p3Q7L12q4N1n28L48J67K35j75j20
$$ -303 -250 200 -33 118 -64 -155 -329 32 292 260 -225 -172 -245 -158 154 70 121 -407 -59 108 343 168 48
6806D8k46JL33LJ6k21j36J83J4K13m0l82J08L9P4K76j48k41k69J99J85J19n4l42
$$ 48 -198 -197 136 139 155 -66 -202 -19 -5 208 168 -214 -106 -67 7 283 135 -106 -375 -176 9 128 74 -268
6830b68J84M8K9L05j80k54J9K68j79J71j26p0J39j77L08j83J62k04j27Q7K37j21
$$ -268 -84 -36 -7 298 118 -136 -117 151 -28 143 17 -53 86 -91 217 34 196 -8 -135 -48 189 68
6852F8Q1j46k96K02L13K6j97m3l14N8L13K54Q7n66R0j02K55N6R9n39K71N6mL44
$$ 68 149 3 -293 -91 222 248 51 8 -306 -248 65 319 406 -160 -70 -172 83 139 238 -301 -30 26 22 366
6876C66k57p9k27J28J7K62j1j60k04J47q6K70ok7l10J69J39l8k18L31k95L9j9
$$ 366 109 30 -197 -69 -52 210 199 39 -165 -18 -104 166 160 133 -177 -8 131 93 -125 206 -89 -50 -69
6899f9Q7o3p7j9j9J57L26j86r5k18Q7L1J49J4j93j4J9K02k8qM5k89K94j73J72
$$ -69 18 -45 -122 -141 -160 -3 323 137 42 -176 -89 -58 91 105 -88 -102 -83 119 91 83 128 -161 133 -40 132
6924A32n7k83o9J46L30J4oj52k23pJ32L60j97O5l59J4J54O1j13l5l13L77J19L
$$ 132 75 -208 -277 -131 199 213 207 55 -168 -175 -43 317 120 185 -174 -160 -6 55 -58 -93 -406 -29 90 93
6948I3j62Q8j85J19K73m9O4l59K4j31J21J05K08k56k98M0K64K4K17l39j40K15
$$ 93 -69 19 -166 -47 226 177 241 -118 -94 -225 -104 1 209 -47 -345 -305 -41 -17 200 -139 -279 -64
6970f4J26K50l62p1pJ34J99Rj60q2m10K41J89P1j16lj23O0Q4J90J38m41j15O7
$$ -64 62 312 -50 -121 -128 6 205 214 54 -28 -438 -197 -8 63 -53 -56 -179 -119 -35 155 293 -148 -263 -196
6994a96J23L01k43j74K28j14M8L2l5j43l8m3L29l0L03o22K2L18M8k6J37n67J88
$$ -196 -73 228 -15 -189 39 -75 -27 5 -30 -173 -211 -254 75 45 348 -274 -252 66 114 88 225 -342 -154
7017a54Q1n8K51J89l03l74O2J52K98J34k34l13J22J22J79n9j08j41J42J60K7j84
$$ -154 -73 -131 120 309 6 -368 -306 -154 144 278 44 -269 -147 -25 154 95 -13 -154 -12 148 175 -9
7039iQ0l73J26J61K10j36M3k32p4L00N9k7k58kJ62R8J5k97J60j40J18k24O06k73
$$ -9 71 -302 -176 -15 195 59 102 -130 -204 96 155 128 -130 -132 30 128 143 -154 6 -134 -16 -240 366 93
7063I3k65l0O2K78j4j96J67j35jK48nl47J95q1k5j78J62M47m36k64K23N7L18j44
$$ 93 -172 -202 -140 138 124 -72 95 -40 -41 207 202 -145 50 -31 -56 -234 -72 375 -61 -325 -102 -45 273 129
7087A29k05J23pj11R6K39l64J59m2m4j4K53m55J93j2J03J99l7k05k94N0Q2K67
$$ 129 -76 47 40 -71 25 264 -100 59 17 -27 -41 212 -243 -50 -62 41 240 203 -2 -296 -246 -164 103
7110A03j8l15J87j26J91J85k87l7R2o2J74K21k47k21j92M80q0Q1j17r6k7K93J40
$$ 103 85 -230 -43 -169 22 207 -80 -117 -25 -87 87 308 61 -160 -352 128 48 129 12 -84 -111 182 322
7133C22k02M0k20r1N2K4J95J46k16k51o9L60oJ24qm04jJ42o9K59k53k05J40J00
$$ 322 120 160 -60 -151 -99 -75 120 266 50 -201 -270 90 84 208 200 -204 -205 -63 -132 127 -126 -331 -191 -91
7157i1j45J81K1k50K59K96q7M6k76K7q1K88r2K26m58M6o7J79R9j8r3j79K0K21
$$ -91 -236 -55 -34 -284 -25 271 184 230 -46 -19 -100 188 96 322 -136 -90 -157 22 121 103 10 -169 -149 72
7181G2Q6k26j34J25o6K23N9M2k67OR1l4p3J31l33O5R9J84J51p8l20N9L69l09L50
$$ 72 158 -68 -202 -77 -143 80 139 181 -86 -80 11 -23 -96 35 -298 -233 -134 50 201 123 -197 -138 231 -78 272
7206B72k04j49j2j00J29J36J9J29j76l11K71J50M5k0m03K12o3J00P2k16J60l16
$$ 272 68 -81 -93 -193 -64 72 91 220 44 -267 4 154 199 179 -224 -12 -75 25 97 -119 41 -275
7228b75L17j52lK99k92j23K78p3Q7o1O7l0K46q4j08j12j42O6QL37j13j47m35K6
$$ -275 42 -110 -113 186 -106 -229 49 -24 63 2 69 39 285 201 93 -19 -161 -95 -87 250 137 -10 -445 -419
7252d19K22J99N1J64l15J34j50L70p8m18J77p1J5J88LR8k15l4K12%R4j46k32J13
$$ -419 -197 2 53 217 -98 36 -114 256 178 -240 -63 -134 -119 69 72 170 -45 -79 133 133 227 81 -151 -38
7276c8L06j35j33j73K48j94L5K17k46K05l39J71J74O5Mk25q9J68m5J05l9J17l82
$$ -38 268 133 0 -173 75 -119 -84 133 -113 92 -247 -76 98 163 167 -58 -147 21 -24 81 42 159 -223
7299b23QJ31K56j24n4q2j14L07R3k81R7l79K84m8O3K80p5l31K28J03j66M8J53
$$ -223 -215 -84 172 48 -6 -88 -202 105 198 -83 14 -365 -81 -129 -66 214 139 -192 36 139 -27 21 174
7322A74j99j70J91J80l23o7j44K10J25K78r6J4j98J53j1p6k6J00k19j02K68j3
$$ 174 -25 -195 -4 176 -147 -214 -358 -148 -23 255 159 173 -25 128 117 41 15 115 -104 -206 62 49
7344D9Q1j08k97J40K30L7J51l55p6j00j9L49R7j53m35K59K24L1m52N38k81j32
$$ 49 130 22 -275 -135 95 132 283 -72 -148 -248 -267 82 179 26 -409 -150 74 105 -347 191 -90 -222
7366b22J12J04q4l1o6jL13J17K3n27J04k4L53p0R0k37k92L14R6q4q0J85m14K8
$$ -222 -110 -6 -90 -121 -187 -188 125 242 265 -262 -158 -182 171 101 191 -46 -338 -24 72 -12 -92 93 -321 -293
7390b93M43l16L97l25p0J85M4J08k10m1m3j38M02k4O2j98q3l02L52J91l27O3Q3
$$ -293 150 -166 231 -94 -164 21 65 173 -37 -78 -121 -259 143 119 181 -17 -100 -402 -50 141 -186 -123 -40
7413d0J62j90K68j20k88J01Mq3M63k18N8j99J02o9L80l21qn3q8L57k23K24j22
$$ -40 122 -68 200 80 -208 -107 -103 -186 277 59 117 -82 20 -49 331 10 2 -51 -139 218 -5 219 97
7436I7l81L01J80m9N9j06N3j81O7nj9k79KL2J50P6K9j00l05L26RK1J80l04K05
$$ 97 -284 17 197 148 207 101 154 -27 40 35 16 -263 -261 -229 -79 -3 26 -74 -379 -53 -44 -23 157 -147 58
7461E8m04M27J21k50J6p4j47K51L31k23j13L9j14K4K32j78j93rK36p1M20k16l9
$$ 58 -346 81 202 -48 -32 -106 -253 -2 329 106 -7 32 -82 -58 174 -4 -197 -206 30 -41 379 163 124
7484A24m05M80k61P2J31rm74K54L2K55j99J71k73l0n4K80jJ37j81j92Q6K28o3
$$ 124 -281 199 -62 10 141 132 -342 -88 -56 199 0 171 -102 -132 -186 94 93 230 49 -143 -57 171 108
7507A08j60m8j7N4K13j73N9m2j67L04np9j09q9kJ50n2R3O8k98o6q4M37J06k78
$$ 108 -52 -100 -117 -63 150 -23 36 -6 -173 131 126 47 -62 -151 -153 -3 -55 38 106 -192 -258 -342 95 201 -77
7532g7N6j58J49R9K2J0m55J38K73K49j92k03O2p1J73j27M9j59O2k02L91L8k17
$$ -77 -21 -179 -30 69 91 101 -354 -216 57 306 114 -89 -27 -98 75 -52 -3 -162 -100 -302 89 127 -90
7555i0j0L6M6m0J66K27m47L65l14j32M64j28r6k4j59J0J55J86j66O7j69J11j7
$$ -90 -100 -64 -18 -58 108 335 -112 253 -61 -193 271 143 47 23 -136 -126 29 215 49 116 -53 58 41
7578D1r5Nj92K41p0K52j42N6l05K19J33q0J61k97OK9J02k2Q5j07J7k55K61J63
$$ 41 -54 -49 -241 0 -70 182 40 96 -209 10 143 63 224 -73 -67 -38 64 42 127 20 37 -218 43 206
7602B06j4p6j94j44K32J21o0j49k12K14K90n5R4k33Q4o0n0K24o3q5l6jj98N99
$$ 206 192 116 -78 -222 10 131 71 -78 -290 -76 214 159 253 20 104 44 -6 218 155 70 34 33 -165 434
7626D34m70l2N3k08K59j48J0r9Q6m8J92K23k14j86j52K38j03L00Rk30%J43L90
$$ 434 -36 -68 -15 -223 36 -112 -102 -201 -115 -163 29 252 38 -148 -300 -62 -165 135 144 -86 -86 57 447
7649D47l30N0j66j31J3L73j66o9J15l14j31J53K08Mo3l68K48J06k5P5p0j32q3
$$ 447 117 167 1 -130 -117 256 90 21 136 -178 -309 -156 52 56 -7 -375 -127 -21 -46 29 -41 -173 -256
7672b56K38q9j3J58j76q6K01P3l12j6J65k60L68K82j72k33K38p7k00J14J64l39
$$ -256 -18 -107 -120 38 -138 -224 -23 50 -262 -278 -113 -373 -5 277 105 -128 110 33 -167 -53 111 -228
7694b28J90R0J73J66m70K92j12k11J23P7J36l75oO0K48j28n0nj61l8K62k8l6L54
$$ -228 -38 52 225 391 -79 213 101 -110 13 90 226 -149 -155 -95 153 25 -25 -30 -191 -229 33 5 -31 323
7718C23n20J28j36n0L22j04j53j36K49Q9J3n9r2k9M15k40J04l61j8L52q9K07r
$$ 323 -197 -69 -205 -255 67 -37 -190 -326 -77 12 25 -34 -126 -155 260 20 124 -237 -255 97 8 215 206
7741B06k07j68K43j64J92J5l72J19J20J15l03L47k07o5J34R3k35K80l93J28n4
$$ 206 -1 -169 74 -90 102 117 -255 -136 -16 99 -204 143 -64 -129 5 98 -137 143 -250 -122 -176
7762a76M7K52Lk56K4P1J08L66n55J36J10P6K4j48K39m37j46K82o7J22J01n7j54
$$ -176 -129 123 126 -130 -106 -35 73 439 -116 20 130 206 230 82 321 -116 -262 20 -47 75 176 119 -35
7785c5%n8K95j04p8k02J21p3qK44J43j7l60J85R8j28k89K9L47j73L54j69n3j77
$$ -35 -35 -93 202 98 20 -182 -61 -134 -142 102 245 228 -132 53 151 23 -266 -237 110 -63 291 122 69 -108
7809a08l00N22K13q4Jm30L0K61Q5j52j88RK4J98r8K95k46L9j9J07n6m4L7j65n
$$ -108 -408 114 327 243 244 -186 -156 105 190 38 -150 -141 -117 81 -17 278 32 71 52 159 103 59 96 -69 -74
7834g4J66k8Q3k33l8p7L98j70k1j50j29J18J95K9R8J1m15J73m6K23K6k47k32J77
$$ -74 92 64 147 -86 -124 -201 197 27 6 -144 -273 -155 40 69 167 178 -237 -64 -110 113 139 -108 -340 -163
7858a63K09j16J73J33l48r6J48J5J22Q2m28L01k1L7M66m33P6k44Q2M8J12j80j77
$$ -163 46 -70 103 236 -112 -208 -60 -45 77 159 -269 32 11 48 514 81 157 -87 -5 43 155 -25 -202
7881b02J47J38l8J59l16m5J89J00j41O9r4oL7J27j05k3O6k85K54J62k05P1j76
$$ -202 -55 83 45 204 -112 -157 32 132 -9 60 -34 -40 -3 124 19 -4 62 -223 31 193 -12 59 -117
7904a17K46k2j28p7K81j17j03lK5R9J66k23k31K19l9J3P2k5k51J73j5O7R3ql82
$$ -117 129 107 -21 -98 183 66 -37 -40 -15 84 250 27 -204 15 -24 -11 61 36 -215 -42 -57 10 103 95 -287
7929b87M33j73K75j35m3r5K05k49K09Mm52q5K54J20l7L60k77m0l6J58j11R8Ml67
$$ -287 146 -27 248 113 70 -25 180 -69 140 144 -308 -393 -139 -19 -56 304 27 -13 -49 109 -2 96 100 -267
7953b67Q3L29j33J50l12Q7l55O09p0J80l30J70m27L81j66N6J20k59J87r5K08J8
$$ -267 -184 145 12 162 -150 -63 -418 191 121 301 -29 141 -286 95 -71 -15 105 -154 33 -62 146 164
7975A64l96O1N8L14j82N3R3l44K72j28Q9%J28k50j01KM99l40Q0o8J30j00K45m8
$$ 164 -232 -171 -113 201 19 72 165 -179 93 -35 54 54 182 -68 -169 -167 332 -8 72 4 134 34 279 231
7999B31l58O9o8K82l4k26J62k4j21K9K97o3l5l87R3L22K5q1k8r6r8K65k02J87
$$ 231 -127 -58 -126 156 122 -104 58 34 -87 -58 239 176 141 -246 -153 169 194 113 85 -11 -109 156 -46 141
8023A41k7k88J21J07O5j19j25J72r3j06K6L47N6m25J82k12N30n38O9J32j14K4
$$ 141 114 -174 -53 54 119 0 -125 47 -46 -152 -126 221 277 -148 34 -178 352 -186 -117 15 -99 -75
8045g5K21P6j39k01P4k7R6o9J06j15R3j8j1L59n07M2j0o2J31L12k86k47K4L27
$$ -75 146 222 83 -118 -44 -71 25 -44 62 -53 40 22 11 370 -137 -95 -105 -167 -36 276 -10 -257 -233 94
8069I4M3J2k23Q8j80J81K9O0N4k87J40m7K42pk45j73K6K7K83j56M7q9qR7j1R4
$$ 94 137 149 -74 14 -166 15 44 104 158 -129 11 -36 206 199 -46 -219 -193 -166 117 -39 8 -81 -89 8 -3 91
8095I1o1r1p1K2J77rJ04k80o5J22N2j90L48P6m59M62k38L7J7q6j64J69rK83l60
$$ 91 30 -61 -132 -110 67 58 162 -118 -183 -61 -9 -199 149 225 -234 228 -10 27 44 -42 -206 -37 -46 237 -123
8120a23k7l1J1K66J21j24j67J9Q9J68Ok14M6k62K37j01L40j72m09M04O6j72J49
$$ -123 -150 -181 -170 96 217 93 -74 -55 34 202 208 -6 40 -222 15 -86 254 82 -327 77 143 -29 120
8143A20K42n64L03r1K30k01P9k56j19L36p1J69r8m7j06K7M2J57j54M2j49P7L2
$$ 120 362 -202 101 10 240 39 118 -138 -257 79 8 177 79 32 -74 -47 -5 152 -2 40 -109 -32 0
8166@J74j36m40M44J1L6j6k0j59n6K29m2j09J49l4k3P0p5K40m89K66r7r7J86q3
$$ 0 174 38 -402 42 53 89 73 53 -106 -162 67 25 -84 65 31 8 78 3 243 -246 20 -77 -174 12 -71
8191g1
$$ Imaginary data points
##PAGE= N=2
##DATA TABLE= (X++(I..I)), XYDATA
0@%%%%%%%%%%%%%Qj6J6j6J6k4L2l3M1m9N7p1Q2r2J06j24J44j66J89k15K44k76
$$ 0 0 0 0 0 0 0 0 0 0 0 0 0 0 8 -8 8 -8 8 -16 16 -17 24 -25 32 -39 43 -49 57 -67 77 -89 100 -115 129 -147
35a47L10l47L89m33M87n44O02o69P41q19R05j000J102j214J337j473J625j790
$$ -147 163 -184 205 -228 259 -285 317 -352 389 -430 475 -525 577 -637 700 -773 852 -938
53i38J972k177K411k672K970l320L728m214M805n539O484p752R542j2282J7038
$$ -938 1034 -1143 1268 -1404 1566 -1754 1974 -2240 2565 -2974 3510 -4242 5300 -6982 10056
68A0056k7578R4055j1312j12611L4190p1833J12848L3859k9070j2000r4964K6636
$$ 10056 -17522 76533 65221 -47390 -13200 -85033 27815 61674 32604 20604 -74360 -47724
80d7724P1801J6368J1687o1802k6082k1241N1160P0606k0196m0809o2731J0618
$$ -47724 24077 40445 52132 -9670 -35752 -56993 -5833 64773 44577 3768 -58963 -48345
92d8345N2926L6669L1980q8739m3926J6012L9680P9792m4738m1383k8425k3707
$$ -48345 4581 41250 73230 -15509 -59435 -43423 -3743 76049 31311 -10072 -38497 -62204
104f2204Q6357J8238k04l9521o7231M2984J3647N1640J5642p8959q246l0112N5660
$$ -62204 24153 42391 42187 2666 -64565 -21581 -7934 43706 59348 -19611 -27857 -57969 -2309
117b309P1853m3626j3986o6504N64P7057J0006K6165o7593n5748M1199K0351N4253
$$ -2309 69544 25918 11932 -54572 -54008 23049 33055 59220 -8373 -64121 -22922 -2571 51682
130E1682j1072n5256j9050j4319N4078M0608r773l9775m3572J3140K4916N3568
$$ 51682 40610 -14646 -33696 -48015 6063 46671 36898 -2877 -46449 -33309 -8393 45175
142D5175M459o1376k7189j2339N9094M3095k4017j7915o2115R366N6979K1332
$$ 45175 49634 -11742 -38931 -51270 7824 50919 26902 8987 -53128 -43762 13217 34549
154C4549J5272o6657k7167K0425J0611O4595j5492m4936k1533k0646O3965K6656
$$ 34549 49821 -16836 -44003 -23578 -12967 51628 36136 -8800 -30333 -50979 12986 39642
166C9642j0368j7371o1175J1816M1294L4694Q993n9534k6580M262L3219M6917
$$ 39642 29274 11903 -49272 -37456 3838 38532 47525 -12009 -38589 -34327 -1108 45809
178D5809j1033l5902m1342N413M6425K5832K806m2762l1857K535L0838M8573j2923
$$ 45809 34776 -1126 -42468 -37055 9370 35202 38008 -4754 -36611 -34076 -3238 45335 32412
191C2412l5368l0986p908M9511K5710L206l2824n1065J7008L1735L4758L803n0249
$$ 32412 -2956 -33942 -41850 7661 33371 36577 3753 -47312 -30304 1431 36189 39992 -10257
204a0257k1774m001L4929M5313j5850k8833l5924k98M4255K3378M965l5898l9395
$$ -10257 -32031 -36032 -1103 44210 28360 -473 -36397 -36695 7560 30938 35903 5 -39390
217c9390Q735L0271L8073l343l8524k8369l026L7767L4796l759l4492l5974N974
$$ -39390 -30655 -384 37689 34346 -4178 -32547 -35573 2194 36990 33231 -1261 -37235 -31261
230c1261L3412L2812j226l6936k9362k195L7660L3615p392k8286l5836J803L7330
$$ -31261 2151 34963 33737 -3199 -32561 -34756 2904 36519 29127 841 -34995 -33192 4138
243D138K6882L093l6046l3745N728K9956L4279k010l4759l0125m69L5780L0401
$$ 4138 31020 34113 -1933 -35678 -29950 6 34285 32275 -2484 -32609 -33078 2702 33103
256C3103k733l0635l4351L634L3496K8782N73l3873l1016K537L1544L1410j118
$$ 33103 30370 -265 -34616 -30982 2514 31296 31869 -2004 -33020 -30483 1061 32471 31353
269C1353l3371l0661K676L1711K9454P0l2570l1342K370L1748L0727k160l2424
$$ 31353 -2018 -32679 -30003 1708 31162 31232 -1338 -32680 -30310 1438 32165 30005 -2419
282b419k8171Q11K9832L2486k331l3035k8076J474L1006K9630k804k8908l0213
$$ -2419 -30590 -29779 53 32539 30208 -2827 -30903 -29429 1577 31207 28403 -505 -30718
295c0718l14L3569K9603m230l0008k7204j08L0093L0750k759k9918k9635J579
$$ -30718 -31032 2537 32140 27910 -2098 -29302 -29410 683 31433 28674 -1244 -30879 -29300
308b9300L2631K5548j219k7512l0000Q7L1614K9966m810k9542k5167j454L0092
$$ -29300 3331 28879 27660 148 -29852 -29765 1849 31815 27005 -2537 -27704 -29158 934
321I34K9308k590k7584l1174K103L3262K3317r63k6123k9710k28L1278K8558l771
$$ 934 30242 27652 68 -31106 -29003 4259 27576 26613 490 -29220 -29448 1830 30388 26617
335B6617k8864k6138J077K8501K6166J111k9156l0063L900K9276K5796k418k6945
$$ 26617 -2247 -28385 -27308 1193 27359 28470 -686 -30749 -26849 2427 28223 25805 -1140
348a140k5364k427K9548L0052m645k8163k5425K103K6376K5583J361k8472k7780
$$ -1140 -26504 -28931 617 30669 26024 -2139 -27564 -25461 915 26498 27859 -613 -28393
361b8393J244K9824K6011m950k3878k5053l568L0292K7698l374k7620k6310L561
$$ -28393 -27149 2675 28686 23736 -142 -25195 -28763 1529 29227 25853 -1767 -28077 -24516
374b4516K6315K3196K030k7507k8612L319K8216K4763l244k6105k2003k004K4898
$$ -24516 1799 24995 27025 -482 -29094 -25775 2441 27204 23960 -2145 -24148 -26152 -1254
387a254K9896l455k7400k4100R96K7405K2629k64k2961l0104J834L0317K2505
$$ -1254 28642 25187 -2213 -26313 -25317 2088 24717 24453 1492 -28612 -26778 3539 26044
400B6044k511k5576k3066J185K3619K6940j82k9801k2643L303K3879K3601j247
$$ 26044 23533 -2043 -25109 -23924 -305 26635 26453 -3348 -25991 -22688 1191 24792 23545
413B3545k2076k6263k790L1190K2897m196k1716k6572K618K4562K2585M702l1763
$$ 23545 1469 -24794 -27584 3606 26503 22307 591 -25981 -23363 1199 23784 28486 -3277
426c277k4678Q256J9644K5163j966k5146j9328n735K9084K5659q293j8845k4335
$$ -3277 -27955 -19699 -55 25108 23142 -2004 -21332 -27067 2017 27676 19383 538 -23797
439b3797R4K4936K0491M941k6534k7813N831K3516K1799l17k3600k3331j098K5786
$$ -23797 -23703 1233 21724 26665 131 -27682 -21851 1665 23464 23147 -453 -23784 -24882 904
453I04K5286l549k6180j8393Q02K0152K5016j677k1783k5036j45K9888J5114J213
$$ 904 26190 22641 -3539 -21932 -21130 -978 24038 22361 578 -24458 -24603 5285 20399 21612
467B1612j8197k9175M703J9424K5465L656l4296j3522k78J7399L0805p828j9459
$$ 21612 3415 -25760 -21057 -1633 23832 27488 -6808 -20330 -20608 -3209 27596 19768 309
480C09k2433m486L3582J3940k533j5316k7803L784K0960K0853L664k7621j9363
$$ 309 -22124 -26610 6972 20912 18379 3063 -24740 -20956 4 20857 24521 -3100 -22463
493b2463K179J8518K3131J749k3409k3464J180K2634K4145l872k3284j6240n488
$$ -22463 -20284 -1766 21365 23114 -295 -23759 -22579 55 24200 20328 -2956 -19196 -24684
506b4684K5715K3672p009j6223k5957L894K4914J0305R946k4163k5420Q113J2760
$$ -24684 1031 24703 17694 1471 -24486 -20592 4322 14627 24573 410 -25010 -16897 -4137
519d137K7867j523k7049j0683r132K3671K6463p696j5436k6367K356K6291J2504
$$ -4137 23730 22207 -4842 -15525 -24657 -986 25477 17781 2345 -24022 -21666 4625 17129
532A7129N441k2545k3606N165J8124K1675j266k2564j6668r0J7112K2579K279
$$ 17129 22570 25 -23581 -18416 -292 21383 20117 -2447 -19115 -19205 -2093 20486 22765
545B2765k4952j8282Q52J7555K5450n223j8130j8576o587K9135J6812l010j5790
$$ 22765 -2187 -20469 -19617 -2062 23388 18165 35 -18541 -25128 4007 20819 17809 2019
558B019k6464P847J7127J6717P313k9432j3920J340J4038K7344p841j5738j6615
$$ 2019 -24445 -16598 529 17246 24559 -4873 -18793 -17453 -3415 23929 16088 350 -16265
571a6265q656K8305J6135j256j5015k6621N192J9157J7414M009k4035j9025K400
$$ -16265 -24921 3384 19519 18263 3248 -23373 -18181 976 18390 22399 -1636 -20661 -18261
584a8261J8586J9690q27k0231j7826O03J7646K0726j041k0872j4721l987K0471
$$ -18261 325 20015 19188 -1043 -18869 -18266 -620 20106 19065 -1807 -16528 -20515 -44
597d4K0881m472j2759k4242m30K4832J1541O135k1124k3138P766J2523K2294J075
$$ -44 20837 16365 3606 -20636 -21066 3766 15307 21442 318 -22820 -15054 -2531 19763 20838
611B0838k5219j1536l720J8955K1913n772j3505k0786r31K1861J4298K961j8849
$$ 20838 -4381 -15917 -19637 -682 21231 15459 1954 -18832 -19763 2098 16396 19357 508
624E08k0276K554J6215J9647P05k0150j7535k98J8514J9018n28j9291j7095P6
$$ 508 -19768 -17214 -999 18648 19353 -797 -18332 -18630 -116 18902 18374 -917 -18012 -17936
638a7936J7632J9386k192j7103j7305j704K0976J5281K08j5085k1990L125J6259
$$ -17936 -304 19082 16890 -213 -17518 -19222 1754 17035 17243 2158 -19832 -16707 -448
651d48J6605M525k2943j5296J488J3547K2350k369j8657j5257l071K0717J7021
$$ -448 16157 20682 -2261 -17557 -16069 -2522 19828 17459 -1198 -16455 -19526 1191 18212
664A8212k492j4345j9501J70J8429J6312J500j8538j7909J964J5796J6821J932
$$ 18212 15720 1375 -18126 -17956 473 16785 18285 -253 -18162 -16198 -402 16419 18351
677A8351j8416j7878Q87J7247J7430k96j7652j5979j099J6766J8424m78j7764
$$ 18351 -65 -17943 -17056 191 17621 17325 -327 -16306 -17405 -639 17785 17307 -457
690d57j7008J050J6701J5967J178j6995j7940O07J6900J7073j98j7553j5178r95
$$ -457 -17465 -16415 286 16253 17431 436 -17504 -16897 3 17076 16878 -675 -15853 -16848
704a6848J6280J8040j98j7450j6677J54J7217J5578K81j5524j8110L27J7580J5653
$$ -16848 -568 17472 17274 -176 -16853 -16699 518 16096 16377 853 -17257 -16930 650 16303
718A6303P06j7561j5709P19J4228J8142J15j6915j6505p1J7681J4489J06j4278
$$ 16303 17009 -552 -16261 -15542 -1314 16828 16943 28 -16477 -16548 1133 15622 15728 1450
732A450j8258J34J6631J6407M59j7769j4684N31J3981J6716J298j6473j7763J588
$$ 1450 -16808 -16674 -43 16364 16823 -946 -15630 -15099 -1118 15598 16896 423 -17340 -15752
746a5752J6525J4057J053j5690j5738n38J4853J8587j669j7144j3172j125J5389
$$ -15752 773 14830 15883 193 -15545 -16083 -1230 17357 15688 -1456 -14628 -15753 -364
759c64J5650J035j5732j7894K218J5518J4750L58j6052j3869k115J5453J8281
$$ -364 15286 16321 589 -17305 -15087 431 15181 15539 -513 -14382 -16497 -1044 17237
772A7237k470j5410j3901p44J5229J4477J755j5980j6256J305J4799J6116k080
$$ 17237 14767 -643 -14544 -15288 -59 14418 16173 193 -16063 -14758 41 16157 14077
785A4077j3826j3957l240J7322J5711j630j3932j6196J342J4425J4357J303j5919
$$ 14077 251 -13706 -16946 376 16087 14457 525 -15671 -14329 96 14453 15756 -163
798a63j4993p07J6159J5245k217j2459j5569j090J6304J3530J594j5645j5727
$$ -163 -15156 -15863 296 15541 13324 865 -14704 -15794 510 14040 15634 -11 -15738
811a5738J936J3227J5125K26j4472j4647j697J6617J4746j687j2849j5700P98
$$ -15738 -13802 -575 14550 14776 304 -14343 -16040 577 15323 13636 787 -14913 -14115
824a4115J3337J4882J865j6704j3854N30J4123J4206l34j2856j5254j121J5803
$$ -14115 -778 14104 15969 -735 -14589 -14059 64 14270 13936 1080 -14174 -15295 508
837E08J3887j45j4827j3002k24J2485J5808K38j4764j4221j93J5654J1906N65
$$ 508 14395 14250 -577 -13579 -13803 -1318 14490 14728 -36 -14257 -14450 1204 13110 13675
851A3675j2323j6150N62J4220J3821Q27j6094j1754k79J2072J6216j021j3827
$$ 13675 1352 -14798 -14236 -16 13805 14632 -1462 -13216 -13495 -1423 14793 13772 -55
864e5j3850o30J5391J2301r0j1872j5076p0J4095J3434L70j4345j2953J37J2414
$$ -55 -13905 -14535 856 13157 13067 1195 -13881 -13951 144 13578 13948 -397 -13350 -13213 -799
879g99J4003R40j4106j3892M32J3251J3880o40j2674j3134j892J4669J3885j123
$$ -799 13204 14144 38 -13854 -13422 -171 13709 13069 395 -12739 -14631 38 13923 12800
893A2800j2017j4479J54J4020J1356K313j3589j4756J501J2225J3653Q5j3545
$$ 12800 783 -13696 -13542 478 11834 14147 558 -14198 -12697 -472 13181 13266 -279
906b79j1665j963J2973J4966j352j2242j3308q84J4436J1363J029j1564j5579
$$ -279 -11944 -13907 -934 14032 12680 438 -12870 -13754 682 12045 13074 1510 -14069
919a4069J477J2934J1708J726j3925j2579M54J0597J5230m04j4033j0649j689
$$ -14069 -12592 342 12050 13776 -149 -12728 -12274 -1677 13553 13149 -884 -11533 -13222
932a3222J2767J3631j323j0432j3998j319J4891J0998N58j1366j4633J299J2050
$$ -13222 -455 13176 11853 1421 -12577 -13896 995 11993 12551 1185 -13448 -12149 -99
945i9J1849K168j4334j2360J355J0227J4154o56j2578j0594k479J3185J3214j816
$$ -99 11750 13918 -416 -12776 -11421 -1194 12960 12304 -274 -10868 -13347 -162 13052 11236
959A1236r933j3503j288J4280R862K507j1940j4900K441J0008J2945K366j5525
$$ 11236 1303 -12200 -13488 792 10654 13161 1221 -13679 -11238 -1230 11715 14081 -1444
972a444j0009n94J0812J4975k428j1291j0902k535J3703J1490l08j0144j3751
$$ -1444 -11453 -12047 -1235 13740 11312 21 -10881 -13416 287 11777 11469 1325 -12426
985a2426N50J1893J0522K618j2626j2854J011R920J3198J418j3932j0513j090
$$ -12426 -11876 17 10539 13157 531 -12323 -11312 -1392 11806 13224 -708 -11221 -12311
998a2311J1226J4570k342j1563j0072k644J3721J1326j421q799j4032N72J2233
$$ -12311 -1085 13485 11143 -420 -10492 -13136 585 11911 10490 1691 -12341 -11769 464
1011D64R296L558j3164j2044J072Q588J4080M45j2860r350l132J2280J3380j626
$$ 464 9760 13318 154 -11890 -10818 -2230 11850 12295 -565 -9915 -13047 -767 12613 10987
1025A0987r861j2632r19J3612R255J092j0717j3003J291J0709J0271K291j2347
$$ 10987 1126 -11506 -12425 1187 10442 11534 817 -12186 -10895 -186 10085 12376 29
1038B9j0992K94Q817J3376P44j2048j0426k206J1929J2596j762q879j2468j705
$$ 29 -10963 -10669 -1852 11524 12268 220 -10206 -12412 -483 12113 10351 1472 -10996 -12701
1052a2701J3772R436P79j0454j3199K393R182J0578K797j3266r730j47Q876J3371
$$ -12701 1071 10507 11286 832 -12367 -9974 -792 9786 12583 -683 -10413 -10560 -1684 11687
1066A1687r69j0334r800l408J2231J2035q52r476j2419j22J1871R668J420j0850
$$ 11687 10718 384 -9416 -12824 -593 11442 10590 1114 -11305 -11427 444 10112 11532 682
1080F82j2310J105J0304J0487R28j1353r696m78Q825J2631m20j0435r867j927
$$ 682 -11628 -10523 -219 10268 11196 -157 -9853 -10331 -1506 11125 10705 270 -9597 -11524
1094a1524J0969J0576O26r030j2788k70J1358J0032J352j0952j1028O69Q783J1895
$$ -11524 -555 10021 10647 1617 -11171 -11441 -83 9949 11301 349 -10679 -10010 -1227 10668
1108A0668P91j2027r131p85R603J1146m38q834j0712j686J1604R478O50r109j1575
$$ 10668 11459 -568 -9699 -10484 -881 10265 9827 993 -9719 -11405 199 9677 10327 1218 -10357
1123a0357j46J0049J0058K162j1753j0450R37Q754J0871O14j0431r817j416J0478
$$ -10357 -10503 -454 9604 11766 13 -10437 -9500 -746 10125 10739 308 -9509 -10925 -447
1137d47J0726l30r474j0005o85R645J0100J388j0252j1000M87R367R912J220r827
$$ -447 10279 9949 475 -9530 -10215 -570 9530 10918 666 -10334 -9847 -480 9432 10652 825
1152H25j0722l51R736J0735K22j0480r269o11Q997J1046J38r517j0844k17J0539
$$ 825 -9897 -10248 -512 10223 10445 -35 -9304 -9915 -918 10128 10266 749 -10095 -10312 227
1167B27Q623J309r215j0989M07Q588J0477J349j1096q751q80Q678J1047K92r289
$$ 227 8850 10159 944 -10045 -9638 -1050 9427 10776 -320 -9071 -9951 -1273 9774 10066 777
1182G77j0340n32J0234Q696J118r168r835p35Q719J0688L33r718r387o27R410
$$ 777 -9563 -10095 139 8835 9953 785 -9050 -9785 -1066 9622 9955 237 -9150 -9777 -367
1197c67R095J519r472j0713N34Q696J0153L12r694q742j480R506J0107J19q838
$$ -367 8728 10247 775 -9938 -9404 -708 9445 9757 63 -8679 -10159 -653 9454 9573 735
1212G35j0629L57R373Q395K055r400j0421K21Q457J0343k46q771q889j530R629
$$ 735 -9894 -9537 -164 8231 10286 886 -9535 -9314 -857 9486 9240 469 -8420 -9950 -321
1227c21R214R81r234j0326P10Q142R524J250r626q885j184R429R595m35p923r825
$$ -321 8893 9874 640 -9686 -8976 -834 8690 9940 314 -8571 -9755 -326 9269 8834 911 -8914
1243h914o54R128Q699J537r633r254J40Q048J0107j7q397r278j501R943Q607O20
$$ -8914 -9568 -440 8259 9796 163 -9091 -8951 -903 9204 9187 790 -8488 -9989 -46 8561 9181
1259I181q355j0003O32P624R512J008r687q150j238Q658R680j51p360j0121q00
$$ 9181 826 -9177 -8545 -921 8591 9599 -88 -8238 -9476 -818 8862 8711 1351 -8770 -9570
1274i570R528Q377J050r143q652k82P555J0026J33q493q750j436R721Q024J159
$$ -9570 -42 8335 9385 242 -8410 -8692 -1137 8889 9022 529 -8221 -9657 64 8088 9247
1289I247q094j0031j36P921R390J053r229q024j518Q937R142q4p342j0111o3Q963
$$ 9247 1153 -8878 -9014 -1093 8297 9350 121 -7903 -9421 -484 8658 8574 1232 -8879 -8942 21
1305B1P707J536q662r194J50P149J0114j11q271q184j386Q574Q615P29p805r807
$$ 21 7728 9264 602 -8592 -8442 -1293 8821 8710 439 -7745 -9131 -557 8058 8787 982 -8825
1321h825J41Q301Q380Q64q429q510m87Q122Q710M37p962q999j4P731Q133J502
$$ -8825 -8684 -383 7997 8861 432 -8078 -8565 -443 8267 8704 742 -8257 -8271 -540 7593 9095
1337I095q802q034q16P567R423j27p578q568j406R138P906P42p604r620O63P247
$$ 9095 293 -7741 -8557 -990 8433 8306 728 -7840 -9246 -108 7798 8540 936 -8684 -8021 -774
1353g74Q371J274r067p288p50P129R648n78p406p798j513Q239Q397M54p472q637
$$ -774 7597 8871 -196 -7484 -8234 -1105 8543 7965 559 -7239 -8752 -513 7884 8338 866 -7771
1369g771j005Q224Q580M31p839q631o64Q205Q478N69q339q120n8P326Q582J69
$$ -7771 -8776 -552 8028 8459 620 -8011 -8675 -470 8008 8577 238 -7882 -7940 -614 7968 8137
1385H137q048p147j608Q329Q026p5o440q804r68Q210P187K072q091r028K46O821
$$ 8137 89 -7058 -8666 -337 7689 7614 1174 -7630 -8598 -388 6799 8871 780 -8248 -8002 -1181
1401a181R042P59q738p292p11P248R201p70p086p612j047P889P519M41o521q587
$$ -1181 7861 8620 -118 -7410 -8121 -873 8328 7558 472 -7140 -8187 -298 7221 7662 1141 -7446
1417g446n68P264P432K018p914q174m70O188R427R31q727o985j366P754R140j061
$$ -7446 -8014 -750 6682 8700 786 -7388 -7858 -1670 7757 8688 -39 -7024 -8390 -636 8504 7443
1433G443o708p896j115Q558O606N71o281q871N84O305O914K538q392p346m55N799
$$ 7443 735 -7161 -8276 282 6888 7459 1178 -7693 -7109 -804 6110 8648 256 -7090 -7545 -1746
1449a746R427P31q152p212j685Q025Q310m74o628p890o50P946O749R28o903q466
$$ -1746 7681 8412 260 -6952 -8637 -612 7698 7224 596 -7294 -7944 2 6751 7679 776 -7690
1465g690P19O197P320J608p803p110l56N187R560O2p317o813k331Q261Q129j85
$$ -7690 -6971 -774 6546 8154 351 -6759 -7115 -1928 7632 7694 377 -6436 -8767 -506 7623 7438
1481G438o226q891m06Q431O454J150p150q213N68N880P240J648p825o279j216
$$ 7438 1212 -7679 -8085 346 6800 7950 800 -7413 -6845 -965 6275 7923 98 -6181 -7397
1496g397O076Q488R1o366p079k434Q123P525J26n811q990k3P739O549J291p832
$$ -7397 -1321 7167 7258 892 -6187 -8621 -498 7027 7153 1342 -7648 -7671 68 6617 7908 76
1512G6p484Q88N777P208J264p786o322j108O247Q553m72n597p357k254P871P021
$$ 76 -7408 -6520 -743 6465 7729 -57 -6379 -7487 -1240 7313 6841 1244 -6113 -8367 -496 6525
1528F525R22o069r031N51O909O437J805p800p336O3O042Q134r3o903o084j362
$$ 6525 7447 1378 -7653 -7102 -193 6244 8049 249 -7087 -7024 -982 7152 7059 156 -5928 -7290
1544g290O437P634l15n253p777j092P413O217J316o162q106j31O463P186J274
$$ -7290 -853 6781 6466 1213 -6564 -7656 -243 5974 7290 1128 -6978 -7109 -646 6540 7814
1559G814p279p303k10N892Q131lo691o456j041O456P324k29n410p192j323P068
$$ 7814 535 -6768 -6978 -1086 7045 7042 351 -6105 -7146 -690 6634 6405 995 -6197 -7520 -452
1575d52O252J570o352p627k96N847P307J376p176o911q98O496P764j89o259o411
$$ -452 5800 7370 1018 -6609 -6905 -1058 6249 7625 449 -6462 -7360 -864 6900 6711 452 -5959
$$ [...]
8191A91
##END NTUPLES=NMR FID
##END=
